FailedConsole Output

Skipping 3,070 KB.. Full Log
'main2.cpp', line = 21, exact_match = 0, locations = 1 Options: disabled 
  1.1: where = test_run_to_address_dwarf`b(int) + 22 at main2.cpp:21:17, address = 0x000000010087ce66, unresolved, hit count = 1 

Hide Details

Hide Details

Hide Details

runCmd: thread backtrace output: * thread #1, queue = 'com.apple.main-thread', stop reason = step over * frame #0: 0x000000010087ce9d test_run_to_address_dwarf`b(val=1) at main2.cpp:26:12 frame #1: 0x000000010087ce0d test_run_to_address_dwarf`a(val=1) at main2.cpp:11:16 frame #2: 0x000000010087cee0 test_run_to_address_dwarf`main(argc=1, argv=0x00007ffeef383470) at main2.cpp:36:14 frame #3: 0x00007fff7fa10085 libdyld.dylib`start + 1

Hide Details

Hide Details

runCmd: process status output: Process 70982 stopped * thread #1, queue = 'com.apple.main-thread', stop reason = run to address: 0x000000010087ce66 frame #0: 0x000000010087ce66 test_run_to_address_dwarf`b(val=2) at main2.cpp:21:17 18 int b(int val) 19 { 20 int rc = c(val); -> 21 void *ptr = malloc(1024); // thread step-out of malloc into function b. ^ 22 if (!ptr) 23 return -1; 24 else

Hide Details

Hide Details

<bound method SBProcess.Kill of <lldb.SBProcess; proxy of <Swig Object of type 'lldb::SBProcess *' at 0x10a702960> >>: success

Hide Details

PASS: LLDB (/Users/buildslave/jenkins/workspace/lldb-cmake-sanitized/lldb-build/bin/clang-11-x86_64) :: test_run_to_address_dwarf (TestThreadAPI.ThreadAPITestCase) UNSUPPORTED: LLDB (/Users/buildslave/jenkins/workspace/lldb-cmake-sanitized/lldb-build/bin/clang-11-x86_64) :: test_run_to_address_dwo (TestThreadAPI.ThreadAPITestCase) (test case does not fall in any category of interest for this run) runCmd: settings clear -all output:

Hide Details

runCmd: settings set symbols.enable-external-lookup false output:

Hide Details

runCmd: settings set target.auto-apply-fixits false output:

Hide Details

runCmd: settings set plugin.process.gdb-remote.packet-timeout 60 output:

Hide Details

runCmd: settings set symbols.clang-modules-cache-path "/Users/buildslave/jenkins/workspace/lldb-cmake-sanitized/lldb-build/lldb-test-build.noindex/module-cache-lldb/lldb-api" output:

Hide Details

runCmd: settings set use-color false output:

Hide Details

runCmd: setting set target.prefer-dynamic-value no-dynamic-values output:

Hide Details

runCmd: settings set target.env-vars ASAN_OPTIONS=detect_stack_use_after_return=1 DYLD_INSERT_LIBRARIES=/Users/buildslave/jenkins/workspace/lldb-cmake-sanitized/host-compiler/lib/clang/11.0.0/lib/darwin/libclang_rt.asan_osx_dynamic.dylib output:

Hide Details

runCmd: breakpoint list output: Current breakpoints: 1: file = 'main2.cpp', line = 21, exact_match = 0, locations = 1 1.1: where = test_run_to_address_gmodules`b(int) + 22 at main2.cpp:21:17, address = test_run_to_address_gmodules[0x0000000100000e66], unresolved, hit count = 0

Hide Details

Hide Details

Hide Details

runCmd: thread backtrace output: * thread #1, queue = 'com.apple.main-thread', stop reason = breakpoint 1.1 * frame #0: 0x0000000107132e66 test_run_to_address_gmodules`b(val=1) at main2.cpp:21:17 frame #1: 0x0000000107132e0d test_run_to_address_gmodules`a(val=1) at main2.cpp:11:16 frame #2: 0x0000000107132ee0 test_run_to_address_gmodules`main(argc=1, argv=0x00007ffee8acd460) at main2.cpp:36:14 frame #3: 0x00007fff7fa10085 libdyld.dylib`start + 1

Hide Details

Hide Details

runCmd: breakpoint list output: Current breakpoints: 1: file = 'main2.cpp', line = 21, exact_match = 0, locations = 1 Options: disabled 1.1: where = test_run_to_address_gmodules`b(int) + 22 at main2.cpp:21:17, address = 0x0000000107132e66, unresolved, hit count = 1

Hide Details

Hide Details

Hide Details

runCmd: thread backtrace output: * thread #1, queue = 'com.apple.main-thread', stop reason = step over * frame #0: 0x0000000107132e9d test_run_to_address_gmodules`b(val=1) at main2.cpp:26:12 frame #1: 0x0000000107132e0d test_run_to_address_gmodules`a(val=1) at main2.cpp:11:16 frame #2: 0x0000000107132ee0 test_run_to_address_gmodules`main(argc=1, argv=0x00007ffee8acd460) at main2.cpp:36:14 frame #3: 0x00007fff7fa10085 libdyld.dylib`start + 1

Hide Details

Hide Details

runCmd: process status output: Process 71179 stopped * thread #1, queue = 'com.apple.main-thread', stop reason = run to address: 0x0000000107132e66 frame #0: 0x0000000107132e66 test_run_to_address_gmodules`b(val=2) at main2.cpp:21:17 18 int b(int val) 19 { 20 int rc = c(val); -> 21 void *ptr = malloc(1024); // thread step-out of malloc into function b. ^ 22 if (!ptr) 23 return -1; 24 else

Hide Details

Hide Details

<bound method SBProcess.Kill of <lldb.SBProcess; proxy of <Swig Object of type 'lldb::SBProcess *' at 0x1213fc2d0> >>: success

Hide Details

PASS: LLDB (/Users/buildslave/jenkins/workspace/lldb-cmake-sanitized/lldb-build/bin/clang-11-x86_64) :: test_run_to_address_gmodules (TestThreadAPI.ThreadAPITestCase) runCmd: settings clear -all output:

Hide Details

runCmd: settings set symbols.enable-external-lookup false output:

Hide Details

runCmd: settings set target.auto-apply-fixits false output:

Hide Details

runCmd: settings set plugin.process.gdb-remote.packet-timeout 60 output:

Hide Details

runCmd: settings set symbols.clang-modules-cache-path "/Users/buildslave/jenkins/workspace/lldb-cmake-sanitized/lldb-build/lldb-test-build.noindex/module-cache-lldb/lldb-api" output:

Hide Details

runCmd: settings set use-color false output:

Hide Details

runCmd: setting set target.prefer-dynamic-value no-dynamic-values output:

Hide Details

runCmd: settings set target.env-vars ASAN_OPTIONS=detect_stack_use_after_return=1 DYLD_INSERT_LIBRARIES=/Users/buildslave/jenkins/workspace/lldb-cmake-sanitized/host-compiler/lib/clang/11.0.0/lib/darwin/libclang_rt.asan_osx_dynamic.dylib output:

Hide Details

FAIL: LLDB (/Users/buildslave/jenkins/workspace/lldb-cmake-sanitized/lldb-build/bin/clang-11-x86_64) :: test_step_out_of_malloc_into_function_b_dsym (TestThreadAPI.ThreadAPITestCase) <bound method SBProcess.Kill of <lldb.SBProcess; proxy of <Swig Object of type 'lldb::SBProcess *' at 0x10a702990> >>: success

Hide Details

runCmd: settings clear -all output:

Hide Details

runCmd: settings set symbols.enable-external-lookup false output:

Hide Details

runCmd: settings set target.auto-apply-fixits false output:

Hide Details

runCmd: settings set plugin.process.gdb-remote.packet-timeout 60 output:

Hide Details

runCmd: settings set symbols.clang-modules-cache-path "/Users/buildslave/jenkins/workspace/lldb-cmake-sanitized/lldb-build/lldb-test-build.noindex/module-cache-lldb/lldb-api" output:

Hide Details

runCmd: settings set use-color false output:

Hide Details

runCmd: setting set target.prefer-dynamic-value no-dynamic-values output:

Hide Details

runCmd: settings set target.env-vars ASAN_OPTIONS=detect_stack_use_after_return=1 DYLD_INSERT_LIBRARIES=/Users/buildslave/jenkins/workspace/lldb-cmake-sanitized/host-compiler/lib/clang/11.0.0/lib/darwin/libclang_rt.asan_osx_dynamic.dylib output:

Hide Details

FAIL: LLDB (/Users/buildslave/jenkins/workspace/lldb-cmake-sanitized/lldb-build/bin/clang-11-x86_64) :: test_step_out_of_malloc_into_function_b_dwarf (TestThreadAPI.ThreadAPITestCase) <bound method SBProcess.Kill of <lldb.SBProcess; proxy of <Swig Object of type 'lldb::SBProcess *' at 0x1211fcde0> >>: success

Hide Details

UNSUPPORTED: LLDB (/Users/buildslave/jenkins/workspace/lldb-cmake-sanitized/lldb-build/bin/clang-11-x86_64) :: test_step_out_of_malloc_into_function_b_dwo (TestThreadAPI.ThreadAPITestCase) (test case does not fall in any category of interest for this run) runCmd: settings clear -all output:

Hide Details

runCmd: settings set symbols.enable-external-lookup false output:

Hide Details

runCmd: settings set target.auto-apply-fixits false output:

Hide Details

runCmd: settings set plugin.process.gdb-remote.packet-timeout 60 output:

Hide Details

runCmd: settings set symbols.clang-modules-cache-path "/Users/buildslave/jenkins/workspace/lldb-cmake-sanitized/lldb-build/lldb-test-build.noindex/module-cache-lldb/lldb-api" output:

Hide Details

runCmd: settings set use-color false output:

Hide Details

runCmd: setting set target.prefer-dynamic-value no-dynamic-values output:

Hide Details

runCmd: settings set target.env-vars ASAN_OPTIONS=detect_stack_use_after_return=1 DYLD_INSERT_LIBRARIES=/Users/buildslave/jenkins/workspace/lldb-cmake-sanitized/host-compiler/lib/clang/11.0.0/lib/darwin/libclang_rt.asan_osx_dynamic.dylib output:

Hide Details

FAIL: LLDB (/Users/buildslave/jenkins/workspace/lldb-cmake-sanitized/lldb-build/bin/clang-11-x86_64) :: test_step_out_of_malloc_into_function_b_gmodules (TestThreadAPI.ThreadAPITestCase) <bound method SBProcess.Kill of <lldb.SBProcess; proxy of <Swig Object of type 'lldb::SBProcess *' at 0x10a702990> >>: success

Hide Details

runCmd: settings clear -all output:

Hide Details

runCmd: settings set symbols.enable-external-lookup false output:

Hide Details

runCmd: settings set target.auto-apply-fixits false output:

Hide Details

runCmd: settings set plugin.process.gdb-remote.packet-timeout 60 output:

Hide Details

runCmd: settings set symbols.clang-modules-cache-path "/Users/buildslave/jenkins/workspace/lldb-cmake-sanitized/lldb-build/lldb-test-build.noindex/module-cache-lldb/lldb-api" output:

Hide Details

runCmd: settings set use-color false output:

Hide Details

runCmd: setting set target.prefer-dynamic-value no-dynamic-values output:

Hide Details

runCmd: settings set target.env-vars ASAN_OPTIONS=detect_stack_use_after_return=1 DYLD_INSERT_LIBRARIES=/Users/buildslave/jenkins/workspace/lldb-cmake-sanitized/host-compiler/lib/clang/11.0.0/lib/darwin/libclang_rt.asan_osx_dynamic.dylib output:

Hide Details

runCmd: breakpoint list output: Current breakpoints: 1: file = 'main2.cpp', line = 21, exact_match = 0, locations = 1 1.1: where = test_step_over_3_times_dsym`b(int) + 22 at main2.cpp:21:17, address = test_step_over_3_times_dsym[0x0000000100000e66], unresolved, hit count = 0

Hide Details

Hide Details

Hide Details

runCmd: thread backtrace output: * thread #1, queue = 'com.apple.main-thread', stop reason = breakpoint 1.1 * frame #0: 0x000000010a206e66 test_step_over_3_times_dsym`b(val=1) at main2.cpp:21:17 frame #1: 0x000000010a206e0d test_step_over_3_times_dsym`a(val=1) at main2.cpp:11:16 frame #2: 0x000000010a206ee0 test_step_over_3_times_dsym`main(argc=1, argv=0x00007ffee59f9468) at main2.cpp:36:14 frame #3: 0x00007fff7fa10085 libdyld.dylib`start + 1 frame #4: 0x00007fff7fa10085 libdyld.dylib`start + 1

Hide Details

Hide Details

runCmd: thread backtrace output: * thread #1, queue = 'com.apple.main-thread', stop reason = step over * frame #0: 0x000000010a206e9d test_step_over_3_times_dsym`b(val=1) at main2.cpp:26:12 frame #1: 0x000000010a206e0d test_step_over_3_times_dsym`a(val=1) at main2.cpp:11:16 frame #2: 0x000000010a206ee0 test_step_over_3_times_dsym`main(argc=1, argv=0x00007ffee59f9468) at main2.cpp:36:14 frame #3: 0x00007fff7fa10085 libdyld.dylib`start + 1 frame #4: 0x00007fff7fa10085 libdyld.dylib`start + 1

Hide Details

Hide Details

<bound method SBProcess.Kill of <lldb.SBProcess; proxy of <Swig Object of type 'lldb::SBProcess *' at 0x1211fcde0> >>: success

Hide Details

PASS: LLDB (/Users/buildslave/jenkins/workspace/lldb-cmake-sanitized/lldb-build/bin/clang-11-x86_64) :: test_step_over_3_times_dsym (TestThreadAPI.ThreadAPITestCase) runCmd: settings clear -all output:

Hide Details

runCmd: settings set symbols.enable-external-lookup false output:

Hide Details

runCmd: settings set target.auto-apply-fixits false output:

Hide Details

runCmd: settings set plugin.process.gdb-remote.packet-timeout 60 output:

Hide Details

runCmd: settings set symbols.clang-modules-cache-path "/Users/buildslave/jenkins/workspace/lldb-cmake-sanitized/lldb-build/lldb-test-build.noindex/module-cache-lldb/lldb-api" output:

Hide Details

runCmd: settings set use-color false output:

Hide Details

runCmd: setting set target.prefer-dynamic-value no-dynamic-values output:

Hide Details

runCmd: settings set target.env-vars ASAN_OPTIONS=detect_stack_use_after_return=1 DYLD_INSERT_LIBRARIES=/Users/buildslave/jenkins/workspace/lldb-cmake-sanitized/host-compiler/lib/clang/11.0.0/lib/darwin/libclang_rt.asan_osx_dynamic.dylib output:

Hide Details

runCmd: breakpoint list output: Current breakpoints: 1: file = 'main2.cpp', line = 21, exact_match = 0, locations = 1 1.1: where = test_step_over_3_times_dwarf`b(int) + 22 at main2.cpp:21:17, address = test_step_over_3_times_dwarf[0x0000000100000e66], unresolved, hit count = 0

Hide Details

Hide Details

Hide Details

runCmd: thread backtrace output: * thread #1, queue = 'com.apple.main-thread', stop reason = breakpoint 1.1 * frame #0: 0x0000000100a71e66 test_step_over_3_times_dwarf`b(val=1) at main2.cpp:21:17 frame #1: 0x0000000100a71e0d test_step_over_3_times_dwarf`a(val=1) at main2.cpp:11:16 frame #2: 0x0000000100a71ee0 test_step_over_3_times_dwarf`main(argc=1, argv=0x00007ffeef18e460) at main2.cpp:36:14 frame #3: 0x00007fff7fa10085 libdyld.dylib`start + 1

Hide Details

Hide Details

runCmd: thread backtrace output: * thread #1, queue = 'com.apple.main-thread', stop reason = step over * frame #0: 0x0000000100a71e9d test_step_over_3_times_dwarf`b(val=1) at main2.cpp:26:12 frame #1: 0x0000000100a71e0d test_step_over_3_times_dwarf`a(val=1) at main2.cpp:11:16 frame #2: 0x0000000100a71ee0 test_step_over_3_times_dwarf`main(argc=1, argv=0x00007ffeef18e460) at main2.cpp:36:14 frame #3: 0x00007fff7fa10085 libdyld.dylib`start + 1

Hide Details

Hide Details

<bound method SBProcess.Kill of <lldb.SBProcess; proxy of <Swig Object of type 'lldb::SBProcess *' at 0x10a702990> >>: success

Hide Details

PASS: LLDB (/Users/buildslave/jenkins/workspace/lldb-cmake-sanitized/lldb-build/bin/clang-11-x86_64) :: test_step_over_3_times_dwarf (TestThreadAPI.ThreadAPITestCase) UNSUPPORTED: LLDB (/Users/buildslave/jenkins/workspace/lldb-cmake-sanitized/lldb-build/bin/clang-11-x86_64) :: test_step_over_3_times_dwo (TestThreadAPI.ThreadAPITestCase) (test case does not fall in any category of interest for this run) runCmd: settings clear -all output:

Hide Details

runCmd: settings set symbols.enable-external-lookup false output:

Hide Details

runCmd: settings set target.auto-apply-fixits false output:

Hide Details

runCmd: settings set plugin.process.gdb-remote.packet-timeout 60 output:

Hide Details

runCmd: settings set symbols.clang-modules-cache-path "/Users/buildslave/jenkins/workspace/lldb-cmake-sanitized/lldb-build/lldb-test-build.noindex/module-cache-lldb/lldb-api" output:

Hide Details

runCmd: settings set use-color false output:

Hide Details

runCmd: setting set target.prefer-dynamic-value no-dynamic-values output:

Hide Details

runCmd: settings set target.env-vars ASAN_OPTIONS=detect_stack_use_after_return=1 DYLD_INSERT_LIBRARIES=/Users/buildslave/jenkins/workspace/lldb-cmake-sanitized/host-compiler/lib/clang/11.0.0/lib/darwin/libclang_rt.asan_osx_dynamic.dylib output:

Hide Details

runCmd: breakpoint list output: Current breakpoints: 1: file = 'main2.cpp', line = 21, exact_match = 0, locations = 1 1.1: where = test_step_over_3_times_gmodules`b(int) + 22 at main2.cpp:21:17, address = test_step_over_3_times_gmodules[0x0000000100000e66], unresolved, hit count = 0

Hide Details

Hide Details

Hide Details

runCmd: thread backtrace output: * thread #1, queue = 'com.apple.main-thread', stop reason = breakpoint 1.1 * frame #0: 0x000000010baa4e66 test_step_over_3_times_gmodules`b(val=1) at main2.cpp:21:17 frame #1: 0x000000010baa4e0d test_step_over_3_times_gmodules`a(val=1) at main2.cpp:11:16 frame #2: 0x000000010baa4ee0 test_step_over_3_times_gmodules`main(argc=1, argv=0x00007ffee415b458) at main2.cpp:36:14 frame #3: 0x00007fff7fa10085 libdyld.dylib`start + 1 frame #4: 0x00007fff7fa10085 libdyld.dylib`start + 1

Hide Details

Hide Details

runCmd: thread backtrace output: * thread #1, queue = 'com.apple.main-thread', stop reason = step over * frame #0: 0x000000010baa4e9d test_step_over_3_times_gmodules`b(val=1) at main2.cpp:26:12 frame #1: 0x000000010baa4e0d test_step_over_3_times_gmodules`a(val=1) at main2.cpp:11:16 frame #2: 0x000000010baa4ee0 test_step_over_3_times_gmodules`main(argc=1, argv=0x00007ffee415b458) at main2.cpp:36:14 frame #3: 0x00007fff7fa10085 libdyld.dylib`start + 1 frame #4: 0x00007fff7fa10085 libdyld.dylib`start + 1

Hide Details

Hide Details

<bound method SBProcess.Kill of <lldb.SBProcess; proxy of <Swig Object of type 'lldb::SBProcess *' at 0x1213fc2d0> >>: success

Hide Details

PASS: LLDB (/Users/buildslave/jenkins/workspace/lldb-cmake-sanitized/lldb-build/bin/clang-11-x86_64) :: test_step_over_3_times_gmodules (TestThreadAPI.ThreadAPITestCase) Restore dir to: /Users/buildslave/jenkins/workspace/lldb-cmake-sanitized/lldb-build/tools/lldb/test ====================================================================== ERROR: test_step_out_of_malloc_into_function_b_dsym (TestThreadAPI.ThreadAPITestCase) Test Python SBThread.StepOut() API to step out of a malloc call where the call site is at function b(). ---------------------------------------------------------------------- Traceback (most recent call last): File "/Users/buildslave/jenkins/workspace/lldb-cmake-sanitized/llvm-project/lldb/packages/Python/lldbsuite/test/lldbtest.py", line 1751, in test_method return attrvalue(self) File "/Users/buildslave/jenkins/workspace/lldb-cmake-sanitized/llvm-project/lldb/packages/Python/lldbsuite/test/decorators.py", line 110, in wrapper func(*args, **kwargs) File "/Users/buildslave/jenkins/workspace/lldb-cmake-sanitized/llvm-project/lldb/packages/Python/lldbsuite/test/decorators.py", line 110, in wrapper func(*args, **kwargs) File "/Users/buildslave/jenkins/workspace/lldb-cmake-sanitized/llvm-project/lldb/packages/Python/lldbsuite/test/decorators.py", line 110, in wrapper func(*args, **kwargs) File "/Users/buildslave/jenkins/workspace/lldb-cmake-sanitized/llvm-project/lldb/test/API/python_api/thread/TestThreadAPI.py", line 50, in test_step_out_of_malloc_into_function_b self.step_out_of_malloc_into_function_b(self.exe_name) File "/Users/buildslave/jenkins/workspace/lldb-cmake-sanitized/llvm-project/lldb/test/API/python_api/thread/TestThreadAPI.py", line 157, in step_out_of_malloc_into_function_b thread.IsValid(), AttributeError: 'NoneType' object has no attribute 'IsValid' Config=x86_64-/Users/buildslave/jenkins/workspace/lldb-cmake-sanitized/lldb-build/bin/clang-11 ====================================================================== ERROR: test_step_out_of_malloc_into_function_b_dwarf (TestThreadAPI.ThreadAPITestCase) Test Python SBThread.StepOut() API to step out of a malloc call where the call site is at function b(). ---------------------------------------------------------------------- Traceback (most recent call last): File "/Users/buildslave/jenkins/workspace/lldb-cmake-sanitized/llvm-project/lldb/packages/Python/lldbsuite/test/lldbtest.py", line 1751, in test_method return attrvalue(self) File "/Users/buildslave/jenkins/workspace/lldb-cmake-sanitized/llvm-project/lldb/packages/Python/lldbsuite/test/decorators.py", line 110, in wrapper func(*args, **kwargs) File "/Users/buildslave/jenkins/workspace/lldb-cmake-sanitized/llvm-project/lldb/packages/Python/lldbsuite/test/decorators.py", line 110, in wrapper func(*args, **kwargs) File "/Users/buildslave/jenkins/workspace/lldb-cmake-sanitized/llvm-project/lldb/packages/Python/lldbsuite/test/decorators.py", line 110, in wrapper func(*args, **kwargs) File "/Users/buildslave/jenkins/workspace/lldb-cmake-sanitized/llvm-project/lldb/test/API/python_api/thread/TestThreadAPI.py", line 50, in test_step_out_of_malloc_into_function_b self.step_out_of_malloc_into_function_b(self.exe_name) File "/Users/buildslave/jenkins/workspace/lldb-cmake-sanitized/llvm-project/lldb/test/API/python_api/thread/TestThreadAPI.py", line 157, in step_out_of_malloc_into_function_b thread.IsValid(), AttributeError: 'NoneType' object has no attribute 'IsValid' Config=x86_64-/Users/buildslave/jenkins/workspace/lldb-cmake-sanitized/lldb-build/bin/clang-11 ====================================================================== ERROR: test_step_out_of_malloc_into_function_b_gmodules (TestThreadAPI.ThreadAPITestCase) Test Python SBThread.StepOut() API to step out of a malloc call where the call site is at function b(). ---------------------------------------------------------------------- Traceback (most recent call last): File "/Users/buildslave/jenkins/workspace/lldb-cmake-sanitized/llvm-project/lldb/packages/Python/lldbsuite/test/lldbtest.py", line 1751, in test_method return attrvalue(self) File "/Users/buildslave/jenkins/workspace/lldb-cmake-sanitized/llvm-project/lldb/packages/Python/lldbsuite/test/decorators.py", line 110, in wrapper func(*args, **kwargs) File "/Users/buildslave/jenkins/workspace/lldb-cmake-sanitized/llvm-project/lldb/packages/Python/lldbsuite/test/decorators.py", line 110, in wrapper func(*args, **kwargs) File "/Users/buildslave/jenkins/workspace/lldb-cmake-sanitized/llvm-project/lldb/packages/Python/lldbsuite/test/decorators.py", line 110, in wrapper func(*args, **kwargs) File "/Users/buildslave/jenkins/workspace/lldb-cmake-sanitized/llvm-project/lldb/test/API/python_api/thread/TestThreadAPI.py", line 50, in test_step_out_of_malloc_into_function_b self.step_out_of_malloc_into_function_b(self.exe_name) File "/Users/buildslave/jenkins/workspace/lldb-cmake-sanitized/llvm-project/lldb/test/API/python_api/thread/TestThreadAPI.py", line 157, in step_out_of_malloc_into_function_b thread.IsValid(), AttributeError: 'NoneType' object has no attribute 'IsValid' Config=x86_64-/Users/buildslave/jenkins/workspace/lldb-cmake-sanitized/lldb-build/bin/clang-11 ---------------------------------------------------------------------- Ran 20 tests in 41.045s

Hide Details

RESULT: FAILED (12 passes, 0 failures, 3 errors, 5 skipped, 0 expected failures, 0 unexpected successes)

Hide Details

--

Hide Details

******************** PASS: lldb-shell :: Breakpoint/dummy-target.test (772 of 1968) PASS: lldb-api :: commands/expression/fixits/TestFixIts.py (773 of 1968) UNSUPPORTED: lldb-api :: benchmarks/expression/TestExpressionCmd.py (774 of 1968) PASS: lldb-unit :: Expression/./ExpressionTests/CppModuleConfigurationTest.AmbiguousCLib (775 of 1968) PASS: lldb-shell :: SymbolFile/DWARF/array-sizes.s (776 of 1968) PASS: lldb-api :: macosx/indirect_symbol/TestIndirectSymbols.py (777 of 1968) PASS: lldb-unit :: Utility/./UtilityTests/FileSpecTest.RemoveLastPathComponent (778 of 1968) PASS: lldb-shell :: ObjectFile/Breakpad/sections-trailing-func.test (779 of 1968) PASS: lldb-shell :: ObjectFile/ELF/PT_LOAD-overlap-PT_TLS.yaml (780 of 1968) PASS: lldb-shell :: SymbolFile/NativePDB/s_constant.cpp (781 of 1968) PASS: lldb-api :: lang/cpp/namespace/TestNamespaceLookup.py (782 of 1968) PASS: lldb-unit :: Utility/./UtilityTests/LogChannelEnabledTest.LogVerboseThread (783 of 1968) PASS: lldb-unit :: Utility/./UtilityTests/ConstStringTest.CompareConstString (784 of 1968) PASS: lldb-api :: functionalities/data-formatter/data-formatter-ptr-to-array/TestPtrToArrayFormatting.py (785 of 1968) PASS: lldb-api :: commands/target/stop-hooks/TestStopHooks.py (786 of 1968) PASS: lldb-api :: lang/c/array_types/TestArrayTypes.py (787 of 1968) PASS: lldb-api :: functionalities/data-formatter/data-formatter-stl/libcxx/vbool/TestDataFormatterLibcxxVBool.py (788 of 1968) PASS: lldb-shell :: Commands/command-disassemble-process.yaml (789 of 1968) PASS: lldb-unit :: Utility/./UtilityTests/EnvironmentTest.EnvpConversion (790 of 1968) PASS: lldb-shell :: SymbolFile/DWARF/inline-function-address-shared.test (791 of 1968) PASS: lldb-unit :: Language/Highlighting/./HighlighterTests/HighlighterTest.ClangPPDirectives (792 of 1968) PASS: lldb-shell :: Settings/TestDisassemblyFormat.test (793 of 1968) PASS: lldb-unit :: Utility/./UtilityTests/NameMatchesTest.Ignore (794 of 1968) PASS: lldb-api :: functionalities/abbreviation/TestCommonShortSpellings.py (795 of 1968) UNSUPPORTED: lldb-api :: tools/lldb-server/signal-filtering/TestGdbRemote_QPassSignals.py (796 of 1968) PASS: lldb-unit :: UnwindAssembly/x86/./UnwindAssemblyx86Tests/Testx86AssemblyInspectionEngine.TestPushEDX (797 of 1968) PASS: lldb-unit :: Utility/./UtilityTests/BinaryStreamTest.PutSLEB128FourBytes (798 of 1968) PASS: lldb-unit :: Process/gdb-remote/./ProcessGdbRemoteTests/GDBRemoteCommunicationServerTest.SendErrorResponse_Status (799 of 1968) PASS: lldb-unit :: Host/./HostTests/File.GetWaitableHandleFileno (800 of 1968) PASS: lldb-api :: functionalities/inferior-crashing/TestInferiorCrashing.py (801 of 1968) PASS: lldb-unit :: Utility/./UtilityTests/StreamTest.AddressEmptyPrefix (802 of 1968) UNSUPPORTED: lldb-shell :: Register/x86-64-zmm-write.test (803 of 1968) PASS: lldb-api :: lang/cpp/class_types/TestClassTypes.py (804 of 1968) PASS: lldb-unit :: Utility/./UtilityTests/StreamTeeTest.Constructor2Streams (805 of 1968) PASS: lldb-unit :: Symbol/./SymbolTests/TestClangASTImporter.CopyTypeTagDecl (806 of 1968) PASS: lldb-unit :: Utility/./UtilityTests/ConstStringTest.CompareStringRef (807 of 1968) PASS: lldb-shell :: Breakpoint/split-dwarf5-debug-stroffsets.test (808 of 1968) PASS: lldb-shell :: ObjectFile/ELF/PT_LOAD-empty.yaml (809 of 1968) PASS: lldb-api :: functionalities/thread/num_threads/TestNumThreads.py (810 of 1968) PASS: lldb-shell :: Commands/CommandScriptImmediateOutput/CommandScriptImmediateOutputFile.test (811 of 1968) PASS: lldb-unit :: Language/Highlighting/./HighlighterTests/HighlighterTest.ClangCursorPosAfterOtherToken (812 of 1968) PASS: lldb-api :: functionalities/source-map/TestTargetSourceMap.py (813 of 1968) PASS: lldb-unit :: Utility/./UtilityTests/StatusTest.Formatv (814 of 1968) PASS: lldb-shell :: ObjectFile/Breakpad/breakpad-identification.test (815 of 1968) PASS: lldb-unit :: Utility/./UtilityTests/RangeTest.SlideZero (816 of 1968) PASS: lldb-unit :: Process/gdb-remote/./ProcessGdbRemoteTests/GDBRemoteCommunicationTest.ReadPacket_checksum (817 of 1968) PASS: lldb-api :: commands/expression/ignore-artificial-constructors/TestIgnoreArtificialConstructors.py (818 of 1968) PASS: lldb-unit :: Language/Highlighting/./HighlighterTests/HighlighterTest.ClangSquareBrackets (819 of 1968) UNSUPPORTED: lldb-api :: functionalities/darwin_log/filter/exact_match/activity/TestDarwinLogFilterMatchActivity.py (820 of 1968) PASS: lldb-api :: lang/cpp/call-function/TestCallCPPFunction.py (821 of 1968) PASS: lldb-api :: commands/command/history/TestCommandHistory.py (822 of 1968) PASS: lldb-unit :: Utility/./UtilityTests/StreamTest.PutULEB128 (823 of 1968) PASS: lldb-shell :: ObjectFile/ELF/section-types.yaml (824 of 1968) PASS: lldb-unit :: Utility/./UtilityTests/SerializationRountripTest.SerializeDeserializeCStringArrayNullptrElem (825 of 1968) PASS: lldb-unit :: Utility/./UtilityTests/StringExtractorTest.GetHexBytes_FullString (826 of 1968) PASS: lldb-unit :: UnwindAssembly/x86/./UnwindAssemblyx86Tests/Testx86AssemblyInspectionEngine.TestPushRBX (827 of 1968) PASS: lldb-unit :: Symbol/./SymbolTests/TestTypeSystemClang.TestGetTypeClassNested (828 of 1968) PASS: lldb-unit :: Target/./TargetTests/ModuleCacheTest.GetAndPut (829 of 1968) PASS: lldb-api :: python_api/value_var_update/TestValueVarUpdate.py (830 of 1968) PASS: lldb-unit :: debugserver/./debugserverTests/RNBSocket.LoopBackConnectIPv4 (831 of 1968) PASS: lldb-api :: functionalities/breakpoint/address_breakpoints/TestBadAddressBreakpoints.py (832 of 1968) PASS: lldb-unit :: UnwindAssembly/x86/./UnwindAssemblyx86Tests/Testx86AssemblyInspectionEngine.TestCALLNextInsn (833 of 1968) UNSUPPORTED: lldb-shell :: ScriptInterpreter/Lua/nested_sessions.test (834 of 1968) UNSUPPORTED: lldb-shell :: ScriptInterpreter/Lua/bindings.test (835 of 1968) PASS: lldb-unit :: Utility/./UtilityTests/VMRange.Reset (836 of 1968) PASS: lldb-api :: functionalities/data-formatter/data-formatter-stl/libstdcpp/unique_ptr/invalid/TestDataFormatterInvalidStdUniquePtr.py (837 of 1968) PASS: lldb-shell :: Reproducer/TestVersionCheck.test (838 of 1968) PASS: lldb-unit :: ScriptInterpreter/Python/./ScriptInterpreterPythonTests/PythonDataObjectsTest.TestPythonTupleValues (839 of 1968) PASS: lldb-api :: functionalities/data-formatter/data-formatter-stl/libcxx/multiset/TestDataFormatterLibcxxMultiSet.py (840 of 1968) PASS: lldb-api :: lang/cpp/static_methods/TestCPPStaticMethods.py (841 of 1968) PASS: lldb-shell :: Minidump/memory-region.yaml (842 of 1968) PASS: lldb-unit :: Symbol/./SymbolTests/TestTypeSystemClang.TestFunctionTemplateInRecordConstruction (843 of 1968) PASS: lldb-unit :: Utility/./UtilityTests/UriParserTest.MinimalPath (844 of 1968) PASS: lldb-api :: lang/cpp/unique-types/TestUniqueTypes.py (845 of 1968) PASS: lldb-shell :: Settings/TestFrameFormatMangling.test (846 of 1968) PASS: lldb-api :: functionalities/thread/concurrent_events/TestConcurrentBreakpointOneDelayBreakpointThreads.py (847 of 1968) UNSUPPORTED: lldb-api :: commands/expression/multiline-completion/TestMultilineCompletion.py (848 of 1968) PASS: lldb-unit :: Utility/./UtilityTests/TimerTest.CategoryTimesNested (849 of 1968) PASS: lldb-api :: python_api/target/TestTargetAPI.py (850 of 1968) PASS: lldb-unit :: Host/./HostTests/SocketTest.DecodeHostAndPort (851 of 1968) PASS: lldb-api :: functionalities/breakpoint/breakpoint_command/TestBreakpointCommandsFromPython.py (852 of 1968) PASS: lldb-api :: commands/command/script/TestCommandScript.py (853 of 1968) PASS: lldb-api :: lang/objc/objc-baseclass-sbtype/TestObjCBaseClassSBType.py (854 of 1968) UNSUPPORTED: lldb-shell :: SymbolFile/dissassemble-entry-point.s (855 of 1968) UNSUPPORTED: lldb-shell :: Register/x86-64-ymm16-read.test (856 of 1968) PASS: lldb-api :: functionalities/memory-region/TestMemoryRegion.py (857 of 1968) PASS: lldb-api :: commands/expression/anonymous-struct/TestCallUserAnonTypedef.py (858 of 1968) PASS: lldb-api :: lang/c/anonymous/TestAnonymous.py (859 of 1968) PASS: lldb-unit :: UnwindAssembly/x86/./UnwindAssemblyx86Tests/Testx86AssemblyInspectionEngine.TestPushImm (860 of 1968) PASS: lldb-shell :: Reproducer/TestSynchronous.test (861 of 1968) PASS: lldb-unit :: Target/./TargetTests/ExecutionContextTest.GetByteOrder (862 of 1968) UNSUPPORTED: lldb-shell :: SymbolFile/PDB/enums-layout.test (863 of 1968) UNSUPPORTED: lldb-api :: functionalities/tsan/global_location/TestTsanGlobalLocation.py (864 of 1968) PASS: lldb-unit :: Utility/./UtilityTests/UriParserTest.BracketedHostnameWithColon (865 of 1968) PASS: lldb-shell :: SymbolFile/DWARF/find-basic-function.cpp (866 of 1968) PASS: lldb-api :: functionalities/memory/find/TestMemoryFind.py (867 of 1968) PASS: lldb-unit :: Utility/./UtilityTests/ArchSpecTest.TestSetTriple (868 of 1968) PASS: lldb-unit :: Language/Highlighting/./HighlighterTests/HighlighterTest.ClangCursorPos (869 of 1968) PASS: lldb-api :: commands/expression/static-initializers/TestStaticInitializers.py (870 of 1968) PASS: lldb-unit :: Utility/./UtilityTests/FileSpecTest.IsRelative (871 of 1968) PASS: lldb-unit :: Utility/./UtilityTests/StringExtractorTest.GetHexBytesAvail_FullString (872 of 1968) PASS: lldb-unit :: Target/./TargetTests/ModuleCacheTest.GetAndPutUuidExists (873 of 1968) PASS: lldb-api :: functionalities/data-formatter/data-formatter-named-summaries/TestDataFormatterNamedSummaries.py (874 of 1968) PASS: lldb-unit :: Expression/./ExpressionTests/DiagnosticManagerTest.AppendMessageNoDiag (875 of 1968) PASS: lldb-api :: commands/expression/import-std-module/vector-dbg-info-content/TestDbgInfoContentVectorFromStdModule.py (876 of 1968) PASS: lldb-unit :: Utility/./UtilityTests/VASprintfTest.EncodingError (877 of 1968) PASS: lldb-api :: macosx/version_zero/TestGetVersionZeroVersion.py (878 of 1968) PASS: lldb-unit :: Utility/./UtilityTests/VMRange.IsValid (879 of 1968) PASS: lldb-api :: lang/objc/radar-9691614/TestObjCMethodReturningBOOL.py (880 of 1968) PASS: lldb-api :: functionalities/tail_call_frames/cross_object/TestCrossObjectTailCalls.py (881 of 1968) PASS: lldb-api :: functionalities/thread/step_out/TestThreadStepOut.py (882 of 1968) PASS: lldb-api :: commands/expression/import-std-module/shared_ptr-dbg-info-content/TestSharedPtrDbgInfoContentFromStdModule.py (883 of 1968) PASS: lldb-unit :: Language/Highlighting/./HighlighterTests/HighlighterTest.ClangCursorPosBeforeOtherToken (884 of 1968) PASS: lldb-unit :: Process/gdb-remote/./ProcessGdbRemoteTests/GDBRemoteCommunicationClientTest.SendGetMetaDataPacket (885 of 1968) PASS: lldb-api :: functionalities/unwind/noreturn/module-end/TestNoReturnModuleEnd.py (886 of 1968) PASS: lldb-unit :: Language/Highlighting/./HighlighterTests/HighlighterTest.HighlighterSelectionPath (887 of 1968) PASS: lldb-api :: commands/expression/call-function/TestCallStopAndContinue.py (888 of 1968) PASS: lldb-api :: functionalities/data-formatter/ostypeformatting/TestFormattersOsType.py (889 of 1968) PASS: lldb-unit :: Utility/./UtilityTests/AnsiTerminal.AtStart (890 of 1968) PASS: lldb-unit :: Symbol/./SymbolTests/TestTypeSystemClang.TestBuiltinTypeForEncodingAndBitSize (891 of 1968) PASS: lldb-api :: commands/expression/completion-in-lambda-and-unnamed-class/TestCompletionInLambdaAndUnnamedClass.py (892 of 1968) PASS: lldb-unit :: Utility/./UtilityTests/UUIDTest.SetFromStringRef (893 of 1968) UNSUPPORTED: lldb-shell :: ScriptInterpreter/Lua/convenience_variables.test (894 of 1968) PASS: lldb-unit :: Utility/./UtilityTests/VASprintfTest.NoBufferResize (895 of 1968) PASS: lldb-unit :: Process/gdb-remote/./ProcessGdbRemoteTests/GDBRemoteCommunicationClientTest.TestPacketSpeedJSON (896 of 1968) PASS: lldb-unit :: Utility/./UtilityTests/ArgsTest.ReplaceArgumentAtIndexLonger (897 of 1968) PASS: lldb-api :: commands/expression/regression-access-function-template-in-record/TestRegressionAccessFunctionTemplateInRecord.py (898 of 1968) PASS: lldb-unit :: Utility/./UtilityTests/ConstStringTest.format_provider (899 of 1968) PASS: lldb-api :: commands/platform/basic/TestPlatformPython.py (900 of 1968) PASS: lldb-unit :: Process/gdb-remote/./ProcessGdbRemoteTests/GDBRemoteCommunicationClientTest.GetModulesInfo_UUID20 (901 of 1968) PASS: lldb-api :: functionalities/inferior-changed/TestInferiorChanged.py (902 of 1968) PASS: lldb-api :: functionalities/data-formatter/setvaluefromcstring/TestSetValueFromCString.py (903 of 1968) PASS: lldb-unit :: Utility/./UtilityTests/TimeoutTest.Construction (904 of 1968) PASS: lldb-api :: macosx/profile_vrs_detach/TestDetachVrsProfile.py (905 of 1968) PASS: lldb-shell :: SymbolFile/NativePDB/bitfields.cpp (906 of 1968) PASS: lldb-unit :: Language/Highlighting/./HighlighterTests/HighlighterTest.HighlighterSelectionType (907 of 1968) PASS: lldb-api :: lang/cpp/llvm-style/TestLLVMStyle.py (908 of 1968) PASS: lldb-api :: functionalities/thread/concurrent_events/TestConcurrentDelaySignalWatch.py (909 of 1968) PASS: lldb-shell :: SymbolFile/Breakpad/symtab.test (910 of 1968) PASS: lldb-shell :: Unwind/eh-frame-dwarf-unwind.test (911 of 1968) PASS: lldb-shell :: ObjectFile/ELF/gnu-debuglink.yaml (912 of 1968) PASS: lldb-unit :: Utility/./UtilityTests/LogChannelTest.Enable (913 of 1968) PASS: lldb-shell :: SymbolFile/NativePDB/source-list.cpp (914 of 1968) PASS: lldb-api :: functionalities/data-formatter/data-formatter-stl/libcxx/atomic/TestLibCxxAtomic.py (915 of 1968) PASS: lldb-shell :: SymbolFile/DWARF/debug_loc.s (916 of 1968) PASS: lldb-unit :: ScriptInterpreter/Python/./ScriptInterpreterPythonTests/PythonDataObjectsTest.TestCallable (917 of 1968) PASS: lldb-unit :: Utility/./UtilityTests/GeneratorTest.GetOrCreate (918 of 1968) PASS: lldb-api :: lang/cpp/auto/TestCPPAuto.py (919 of 1968) PASS: lldb-api :: lang/objc/blocks/TestObjCIvarsInBlocks.py (920 of 1968) PASS: lldb-shell :: BuildScript/script-args.test (921 of 1968) PASS: lldb-api :: functionalities/postmortem/minidump-new/TestMiniDumpNew.py (922 of 1968) PASS: lldb-unit :: UnwindAssembly/x86/./UnwindAssemblyx86Tests/Testx86AssemblyInspectionEngine.TestAddESP (923 of 1968) PASS: lldb-api :: tools/lldb-server/TestGdbRemoteAttach.py (924 of 1968) PASS: lldb-unit :: Core/./LLDBCoreTests/UniqueCStringMap.NoDefaultConstructor (925 of 1968) PASS: lldb-unit :: Utility/./UtilityTests/RangeTest.ContainsRange (926 of 1968) UNSUPPORTED: lldb-api :: tools/lldb-server/platform-process-connect/TestPlatformProcessConnect.py (927 of 1968) PASS: lldb-unit :: Process/minidump/./LLDBMinidumpTests/MinidumpParserTest.GetThreadsAndGetThreadContext (928 of 1968) PASS: lldb-unit :: SymbolFile/NativePDB/./SymbolFileNativePDBTests/PDBFPOProgramToDWARFExpressionTests.UnresolvedRegisterAssignmentReference (929 of 1968) UNSUPPORTED: lldb-shell :: Register/x86-64-xmm16-read.test (930 of 1968) PASS: lldb-api :: commands/expression/call-function/TestCallUserDefinedFunction.py (931 of 1968) PASS: lldb-api :: macosx/find-dsym/bundle-with-dot-in-filename/TestBundleWithDotInFilename.py (932 of 1968) PASS: lldb-api :: commands/expression/result_numbering/TestResultNumbering.py (933 of 1968) PASS: lldb-shell :: SymbolFile/DWARF/dir-separator-posix.s (934 of 1968) UNSUPPORTED: lldb-shell :: SymbolFile/PDB/type-quals.test (935 of 1968) PASS: lldb-api :: functionalities/gdb_remote_client/TestRestartBug.py (936 of 1968) PASS: lldb-unit :: Utility/./UtilityTests/StreamTest.PutHex8 (937 of 1968) PASS: lldb-unit :: Host/./HostTests/ProcessLaunchInfoTest.Constructor (938 of 1968) PASS: lldb-unit :: Utility/./UtilityTests/StreamTest.PutPtr (939 of 1968) PASS: lldb-api :: python_api/findvalue_duplist/TestSBFrameFindValue.py (940 of 1968) PASS: lldb-shell :: ObjectFile/PECOFF/sections-names.yaml (941 of 1968) PASS: lldb-unit :: Utility/./UtilityTests/StreamTest.AddressRangeInvalidRange (942 of 1968) PASS: lldb-unit :: Utility/./UtilityTests/SerializationRountripTest.SerializeDeserializeObjectPointer (943 of 1968) PASS: lldb-api :: commands/command/nested_alias/TestNestedAlias.py (944 of 1968) PASS: lldb-api :: functionalities/data-formatter/refpointer-recursion/TestDataFormatterRefPtrRecursion.py (945 of 1968) PASS: lldb-unit :: Utility/./UtilityTests/StreamTest.PutMaxHex64ByteOrderLittle (946 of 1968) PASS: lldb-api :: lang/cpp/constructors/TestCppConstructors.py (947 of 1968) PASS: lldb-unit :: Utility/./UtilityTests/DataExtractorTest.GetMaxU64_unchecked (948 of 1968) PASS: lldb-api :: python_api/value/TestValueAPI.py (949 of 1968) PASS: lldb-api :: functionalities/postmortem/elf-core/TestLinuxCore.py (950 of 1968) PASS: lldb-api :: commands/disassemble/basic/TestDisassembleBreakpoint.py (951 of 1968) PASS: lldb-api :: commands/frame/diagnose/dereference-this/TestDiagnoseDereferenceThis.py (952 of 1968) PASS: lldb-unit :: Symbol/./SymbolTests/Type.CompilerContextPattern (953 of 1968) PASS: lldb-unit :: SymbolFile/NativePDB/./SymbolFileNativePDBTests/PDBFPOProgramToDWARFExpressionTests.SingleAssignmentRegisterRef (954 of 1968) PASS: lldb-api :: commands/settings/TestSettings.py (955 of 1968) PASS: lldb-unit :: Utility/./UtilityTests/StringExtractorTest.GetHexU8_Extra_NoEof (956 of 1968) PASS: lldb-unit :: Core/./LLDBCoreTests/MangledTest.ResultForBlockInvocation (957 of 1968) PASS: lldb-unit :: Utility/./UtilityTests/Flags.GetBitSize (958 of 1968) PASS: lldb-shell :: SymbolFile/DWARF/dwarf5_locations.s (959 of 1968) PASS: lldb-api :: functionalities/data-formatter/data-formatter-objc/TestDataFormatterObjNSException.py (960 of 1968) PASS: lldb-unit :: UnwindAssembly/x86/./UnwindAssemblyx86Tests/Testx86AssemblyInspectionEngine.TestPushR13 (961 of 1968) PASS: lldb-shell :: ObjectFile/PECOFF/export-dllfunc.yaml (962 of 1968) PASS: lldb-shell :: SymbolFile/DWARF/find-basic-variable.cpp (963 of 1968) PASS: lldb-api :: commands/watchpoints/watchpoint_commands/TestWatchpointCommands.py (964 of 1968) PASS: lldb-unit :: ScriptInterpreter/Python/./ScriptInterpreterPythonTests/PythonDataObjectsTest.TestModuleNameResolutionNoDot (965 of 1968) PASS: lldb-api :: commands/expression/call-throws/TestCallThatThrows.py (966 of 1968) PASS: lldb-api :: commands/watchpoints/multiple_threads/TestWatchpointMultipleThreads.py (967 of 1968) PASS: lldb-shell :: Quit/TestQuitExitCode30.test (968 of 1968) PASS: lldb-unit :: Process/gdb-remote/./ProcessGdbRemoteTests/GDBRemoteClientBaseTest.SendContinueAndInterrupt2PacketBug (969 of 1968) PASS: lldb-unit :: Process/gdb-remote/./ProcessGdbRemoteTests/GDBRemoteCommunicationClientTest.GetQOffsets (970 of 1968) PASS: lldb-api :: functionalities/breakpoint/comp_dir_symlink/TestCompDirSymLink.py (971 of 1968) PASS: lldb-api :: types/TestShortType.py (972 of 1968) PASS: lldb-unit :: Process/gdb-remote/./ProcessGdbRemoteTests/GDBRemoteClientBaseTest.SendContinueAndLateInterrupt (973 of 1968) PASS: lldb-api :: python_api/sbstructureddata/TestStructuredDataAPI.py (974 of 1968) PASS: lldb-api :: commands/expression/top-level/TestTopLevelExprs.py (975 of 1968) PASS: lldb-shell :: SymbolFile/DWARF/clang-ast-from-dwarf-objc-property.m (976 of 1968) PASS: lldb-shell :: ObjectFile/MachO/lc_build_version_notools.yaml (977 of 1968) PASS: lldb-unit :: Utility/./UtilityTests/DataExtractorTest.GetCStrEmpty (978 of 1968) PASS: lldb-api :: functionalities/breakpoint/breakpoint_language/TestBreakpointLanguage.py (979 of 1968) PASS: lldb-unit :: Utility/./UtilityTests/BinaryStreamTest.PutULEB128SevenBytes (980 of 1968) UNSUPPORTED: lldb-api :: arm/breakpoint-thumb-codesection/TestBreakpointThumbCodesection.py (981 of 1968) PASS: lldb-api :: tools/lldb-server/TestGdbRemoteRegisterState.py (982 of 1968) PASS: lldb-api :: python_api/file_handle/TestFileHandle.py (983 of 1968) PASS: lldb-shell :: Expr/TestMultilineExpr.test (984 of 1968) PASS: lldb-api :: python_api/lldbutil/frame/TestFrameUtils.py (985 of 1968) PASS: lldb-api :: commands/source/info/TestSourceInfo.py (986 of 1968) PASS: lldb-unit :: Expression/./ExpressionTests/CppModuleConfigurationTest.IgnoreLibStdCpp (987 of 1968) PASS: lldb-api :: lang/cpp/limit-debug-info/TestWithLimitDebugInfo.py (988 of 1968) PASS: lldb-api :: functionalities/archives/TestBSDArchives.py (989 of 1968) PASS: lldb-api :: functionalities/plugins/command_plugin/TestPluginCommands.py (990 of 1968) UNSUPPORTED: lldb-api :: benchmarks/expression/TestRepeatedExprs.py (991 of 1968) PASS: lldb-api :: commands/expression/test/TestExprs2.py (992 of 1968) PASS: lldb-shell :: Commands/command-breakpoint-col.test (993 of 1968) PASS: lldb-unit :: Utility/./UtilityTests/StringListTest.JoinNonSpace (994 of 1968) PASS: lldb-unit :: Language/Highlighting/./HighlighterTests/HighlighterTest.ClangTrailingBackslashMissingNewLine (995 of 1968) PASS: lldb-api :: types/TestLongTypesExpr.py (996 of 1968) PASS: lldb-shell :: ScriptInterpreter/None/import_module.test (997 of 1968) UNSUPPORTED: lldb-shell :: Register/x86-zmm-read.test (998 of 1968) UNSUPPORTED: lldb-api :: functionalities/darwin_log/filter/regex/activity-chain/TestDarwinLogFilterRegexActivityChain.py (999 of 1968) PASS: lldb-api :: commands/log/invalid-args/TestInvalidArgsLog.py (1000 of 1968) PASS: lldb-api :: commands/expression/timeout/TestCallWithTimeout.py (1001 of 1968) PASS: lldb-api :: commands/expression/import-std-module/no-std-module/TestMissingStdModule.py (1002 of 1968) PASS: lldb-unit :: Utility/./UtilityTests/StreamTeeTest.GetStreamAtIndexOutOfBounds (1003 of 1968) PASS: lldb-unit :: SymbolFile/NativePDB/./SymbolFileNativePDBTests/PDBFPOProgramToDWARFExpressionTests.UnresolvedDependentCyclicRegisterAssignmentReference (1004 of 1968) PASS: lldb-unit :: Utility/./UtilityTests/StringListTest.Join (1005 of 1968) PASS: lldb-unit :: Interpreter/./InterpreterTests/CompletionTest.DirCompletionUsername (1006 of 1968) PASS: lldb-api :: lang/objc/objc-property/TestObjCProperty.py (1007 of 1968) PASS: lldb-unit :: Utility/./UtilityTests/StringListTest.JoinSingle (1008 of 1968) PASS: lldb-shell :: Settings/TestSettingsWrite.test (1009 of 1968) PASS: lldb-api :: functionalities/data-formatter/nsarraysynth/TestNSArraySynthetic.py (1010 of 1968) PASS: lldb-unit :: UnwindAssembly/x86/./UnwindAssemblyx86Tests/Testx86AssemblyInspectionEngine.TestPushR14 (1011 of 1968) PASS: lldb-unit :: Host/./HostTests/FileSystemTest.Resolve (1012 of 1968) PASS: lldb-unit :: UnwindAssembly/x86/./UnwindAssemblyx86Tests/Testx86AssemblyInspectionEngine.TestPushESI (1013 of 1968) UNSUPPORTED: lldb-shell :: SymbolFile/PDB/class-layout.test (1014 of 1968) PASS: lldb-unit :: Host/./HostTests/File.GetStreamFromDescriptor (1015 of 1968) UNSUPPORTED: lldb-api :: tools/lldb-server/thread-name/TestGdbRemoteThreadName.py (1016 of 1968) PASS: lldb-unit :: ObjectFile/Breakpad/./ObjectFileBreakpadTests/StackCFIRecord.parse (1017 of 1968) PASS: lldb-api :: lang/objc/foundation/TestConstStrings.py (1018 of 1968) PASS: lldb-api :: macosx/universal/TestUniversal.py (1019 of 1968) PASS: lldb-unit :: Utility/./UtilityTests/RecordReplayTest.InstrumentedFooSameThis (1020 of 1968) PASS: lldb-unit :: Utility/./UtilityTests/BinaryStreamTest.PutSLEB128EightBytes (1021 of 1968) PASS: lldb-shell :: ObjectFile/MachO/lc_version_min.yaml (1022 of 1968) PASS: lldb-api :: tools/lldb-server/inferior-crash/TestGdbRemoteSegFault.py (1023 of 1968) PASS: lldb-unit :: UnwindAssembly/x86/./UnwindAssemblyx86Tests/Testx86AssemblyInspectionEngine.TestPushECX (1024 of 1968) UNSUPPORTED: lldb-shell :: Register/x86-64-gp-write.test (1025 of 1968) PASS: lldb-api :: functionalities/tail_call_frames/cross_dso/TestCrossDSOTailCalls.py (1026 of 1968) UNSUPPORTED: lldb-api :: lang/cpp/printf/TestPrintf.py (1027 of 1968) PASS: lldb-shell :: Driver/TestTarget.test (1028 of 1968) PASS: lldb-unit :: UnwindAssembly/x86/./UnwindAssemblyx86Tests/Testx86AssemblyInspectionEngine.TestMovRSPtoRBP (1029 of 1968) PASS: lldb-api :: commands/frame/var-scope/TestFrameVariableScope.py (1030 of 1968) PASS: lldb-api :: functionalities/signal/handle-abrt/TestHandleAbort.py (1031 of 1968) PASS: lldb-api :: python_api/sbdata/TestSBData.py (1032 of 1968) PASS: lldb-api :: tools/lldb-vscode/stackTrace/TestVSCode_stackTrace.py (1033 of 1968) UNSUPPORTED: lldb-api :: functionalities/data-formatter/data-formatter-stl/libstdcpp/list/TestDataFormatterStdList.py (1034 of 1968) PASS: lldb-unit :: ScriptInterpreter/Python/./ScriptInterpreterPythonTests/PythonDataObjectsTest.TestDictionaryResolutionWithDot (1035 of 1968) PASS: lldb-api :: commands/frame/diagnose/inheritance/TestDiagnoseInheritance.py (1036 of 1968) PASS: lldb-shell :: Quit/TestQuitExitCodeHexA.test (1037 of 1968) PASS: lldb-unit :: UnwindAssembly/x86/./UnwindAssemblyx86Tests/Testx86AssemblyInspectionEngine.TestPopEDI (1038 of 1968) PASS: lldb-unit :: Utility/./UtilityTests/ProcessInstanceInfoMatch.Name (1039 of 1968) PASS: lldb-unit :: Utility/./UtilityTests/BinaryStreamTest.PutULEB128NineBytes (1040 of 1968) PASS: lldb-unit :: Platform/./LLDBPlatformTests/PlatformDarwinTest.GetSDKNameForType (1041 of 1968) PASS: lldb-unit :: Symbol/./SymbolTests/TestClangASTImporter.MetadataPropagation (1042 of 1968) PASS: lldb-unit :: SymbolFile/DWARF/./SymbolFileDWARFTests/SymbolFileDWARFTests.TestAbbrevInvalidNULLTag (1043 of 1968) UNSUPPORTED: lldb-shell :: SymbolFile/PDB/variables-locations.test (1044 of 1968) PASS: lldb-api :: lang/cpp/std-function-step-into-callable/TestStdFunctionStepIntoCallable.py (1045 of 1968) PASS: lldb-unit :: SymbolFile/NativePDB/./SymbolFileNativePDBTests/PDBFPOProgramToDWARFExpressionTests.MissingTargetRegister (1046 of 1968) PASS: lldb-unit :: Utility/./UtilityTests/BinaryStreamTest.PutSLEB128SevenBytes (1047 of 1968) UNSUPPORTED: lldb-api :: lang/objc/bitfield_ivars/TestBitfieldIvars.py (1048 of 1968) PASS: lldb-unit :: Expression/./ExpressionTests/DWARFExpression.DW_OP_piece (1049 of 1968) PASS: lldb-shell :: ObjectFile/PECOFF/basic-info.yaml (1050 of 1968) UNSUPPORTED: lldb-shell :: SymbolFile/target-symbols-add-unwind.test (1051 of 1968) PASS: lldb-shell :: ObjectFile/PECOFF/dep-modules.yaml (1052 of 1968) PASS: lldb-unit :: Expression/./ExpressionTests/DiagnosticManagerTest.PutStringMultiple (1053 of 1968) PASS: lldb-unit :: Utility/./UtilityTests/RecordReplayTest.InstrumentedFoo (1054 of 1968) PASS: lldb-api :: tools/lldb-server/register-reading/TestGdbRemoteGPacket.py (1055 of 1968) PASS: lldb-shell :: ObjectFile/PECOFF/uuid.yaml (1056 of 1968) UNSUPPORTED: lldb-api :: lang/c/typedef/Testtypedef.py (1057 of 1968) PASS: lldb-unit :: Utility/./UtilityTests/CompletionRequest.DuplicateFiltering (1058 of 1968) PASS: lldb-unit :: Host/./HostTests/ConnectionFileDescriptorTest.TCPGetURIv4 (1059 of 1968) PASS: lldb-api :: lang/cpp/bitfields/TestCppBitfields.py (1060 of 1968) PASS: lldb-api :: functionalities/tail_call_frames/thread_step_out_or_return/TestSteppingOutWithArtificialFrames.py (1061 of 1968) PASS: lldb-unit :: Utility/./UtilityTests/ConstStringTest.FromMidOfBufferStringRef (1062 of 1968) PASS: lldb-unit :: SymbolFile/NativePDB/./SymbolFileNativePDBTests/PDBFPOProgramToDWARFExpressionTests.MultipleIndependentAssignments (1063 of 1968) PASS: lldb-api :: functionalities/data-formatter/data-formatter-stl/libcxx/tuple/TestDataFormatterLibcxxTuple.py (1064 of 1968) PASS: lldb-unit :: Language/CPlusPlus/./LanguageCPlusPlusTests/CPlusPlusLanguage.MethodNameParsing (1065 of 1968) PASS: lldb-api :: functionalities/gdb_remote_client/TestTargetXMLArch.py (1066 of 1968) PASS: lldb-unit :: Language/Highlighting/./HighlighterTests/HighlighterTest.ClangCursorPosEndOfLine (1067 of 1968) PASS: lldb-api :: commands/expression/function_template_specialization_temp_args/TestFunctionTemplateSpecializationTempArgs.py (1068 of 1968) PASS: lldb-api :: lang/c/stepping/TestThreadStepping.py (1069 of 1968) PASS: lldb-api :: lang/cpp/covariant-return-types/TestCovariantReturnTypes.py (1070 of 1968) PASS: lldb-unit :: debugserver/./debugserverTests/RNBSocket.LoopBackConnectIPv6 (1071 of 1968) PASS: lldb-unit :: Utility/./UtilityTests/RangeTest.DefaultConstructor (1072 of 1968) PASS: lldb-api :: functionalities/multiword-commands/TestMultiWordCommands.py (1073 of 1968) PASS: lldb-unit :: ObjectFile/ELF/./ObjectFileELFTests/ObjectFileELFTest.GetModuleSpecifications_EarlySectionHeaders (1074 of 1968) PASS: lldb-unit :: Utility/./UtilityTests/UriParserTest.SchemeHostSeparator4 (1075 of 1968) PASS: lldb-unit :: Utility/./UtilityTests/StringListTest.GetMaxStringLengthDecreasingSize (1076 of 1968) PASS: lldb-unit :: Utility/./UtilityTests/TimerTest.CategoryTimesStats (1077 of 1968) PASS: lldb-api :: functionalities/data-formatter/data-formatter-proper-plurals/TestFormattersOneIsSingular.py (1078 of 1968) PASS: lldb-shell :: ObjectFile/ELF/many-sections.s (1079 of 1968) PASS: lldb-unit :: UnwindAssembly/x86/./UnwindAssemblyx86Tests/Testx86AssemblyInspectionEngine.TestPushExtended (1080 of 1968) PASS: lldb-unit :: Utility/./UtilityTests/BinaryStreamTest.PutSLEB128FiveBytes (1081 of 1968) UNSUPPORTED: lldb-shell :: ScriptInterpreter/Lua/independent_state.test (1082 of 1968) PASS: lldb-unit :: Utility/./UtilityTests/StreamTest.PutStringAsRawHex8 (1083 of 1968) PASS: lldb-unit :: Utility/./UtilityTests/StreamTest.PutSLEB128 (1084 of 1968) PASS: lldb-unit :: Process/gdb-remote/./ProcessGdbRemoteTests/GDBRemoteClientBaseTest.InterruptNoResponse (1085 of 1968) PASS: lldb-unit :: Utility/./UtilityTests/StringListTest.ForRangeEmpty (1086 of 1968) PASS: lldb-api :: types/TestIntegerTypeExpr.py (1087 of 1968) PASS: lldb-unit :: Expression/./ExpressionTests/CppModuleConfigurationTest.UnrelatedLibrary (1088 of 1968) PASS: lldb-api :: commands/frame/recognizer/TestFrameRecognizer.py (1089 of 1968) PASS: lldb-shell :: Breakpoint/debug_rnglist_offset_pair.test (1090 of 1968) UNSUPPORTED: lldb-api :: functionalities/unwind/ehframe/TestEhFrameUnwind.py (1091 of 1968) UNSUPPORTED: lldb-api :: functionalities/asan/TestMemoryHistory.py (1092 of 1968) PASS: lldb-shell :: Commands/command-regex-unalias.test (1093 of 1968) PASS: lldb-api :: functionalities/data-formatter/pyobjsynthprovider/TestPyObjSynthProvider.py (1094 of 1968) PASS: lldb-unit :: Utility/./UtilityTests/OptionsWithRawTest.LeadingSpaceArgs (1095 of 1968) PASS: lldb-api :: functionalities/thread/concurrent_events/TestConcurrentNWatchNBreak.py (1096 of 1968) PASS: lldb-api :: functionalities/data-formatter/data-formatter-smart-array/TestDataFormatterSmartArray.py (1097 of 1968) PASS: lldb-api :: functionalities/show_location/TestShowLocationDwarf5.py (1098 of 1968) PASS: lldb-unit :: Utility/./UtilityTests/ProcessInstanceInfo.Yaml (1099 of 1968) PASS: lldb-shell :: Driver/TestNoUseColor.test (1100 of 1968) PASS: lldb-api :: functionalities/data-formatter/vector-types/TestVectorTypesFormatting.py (1101 of 1968) PASS: lldb-shell :: SymbolFile/Breakpad/line-table.test (1102 of 1968) PASS: lldb-unit :: Language/Highlighting/./HighlighterTests/HighlighterTest.ClangIdentifiers (1103 of 1968) UNSUPPORTED: lldb-shell :: SymbolFile/PDB/pointers.test (1104 of 1968) PASS: lldb-unit :: Utility/./UtilityTests/StringExtractorTest.GetHexU8_Underflow2 (1105 of 1968) PASS: lldb-unit :: Utility/./UtilityTests/StreamTeeTest.Flush (1106 of 1968) PASS: lldb-unit :: Utility/./UtilityTests/UriParserTest.LongPath (1107 of 1968) PASS: lldb-unit :: Utility/./UtilityTests/ArgsTest.ReplaceArgumentAtIndexShort (1108 of 1968) PASS: lldb-unit :: Language/Highlighting/./HighlighterTests/HighlighterTest.DefaultHighlighterWithCursor (1109 of 1968) PASS: lldb-shell :: SymbolFile/DWARF/debug-types-line-tables.s (1110 of 1968) PASS: lldb-unit :: Utility/./UtilityTests/ConstStringTest.UpdateMangledCounterpart (1111 of 1968) PASS: lldb-api :: functionalities/breakpoint/consecutive_breakpoints/TestConsecutiveBreakpoints.py (1112 of 1968) PASS: lldb-api :: lang/objc/objc-runtime-ivars/TestRuntimeIvars.py (1113 of 1968) PASS: lldb-unit :: Target/./TargetTests/PathMappingListTest.AbsoluteTests (1114 of 1968) PASS: lldb-unit :: Utility/./UtilityTests/ArgsTest.TestSingleArgWithQuotedSpace (1115 of 1968) PASS: lldb-shell :: ObjectFile/Breakpad/discontiguous-sections.test (1116 of 1968) PASS: lldb-unit :: Language/Highlighting/./HighlighterTests/HighlighterTest.ClangEmptyInput (1117 of 1968) PASS: lldb-api :: functionalities/breakpoint/move_nearest/TestMoveNearest.py (1118 of 1968) PASS: lldb-unit :: Process/minidump/./LLDBMinidumpTests/MinidumpParserTest.InvalidMinidump (1119 of 1968) PASS: lldb-api :: commands/frame/language/TestGuessLanguage.py (1120 of 1968) PASS: lldb-unit :: Language/Highlighting/./HighlighterTests/HighlighterTest.Colons (1121 of 1968) PASS: lldb-api :: lang/cpp/thread_local/TestThreadLocal.py (1122 of 1968) PASS: lldb-api :: functionalities/type_completion/TestTypeCompletion.py (1123 of 1968) PASS: lldb-shell :: ObjectFile/ELF/PT_LOAD-overlap-PT_INTERP.yaml (1124 of 1968) PASS: lldb-api :: commands/expression/rdar42038760/TestScalarURem.py (1125 of 1968) PASS: lldb-unit :: Symbol/./SymbolTests/DWARFCallFrameInfoTest.Basic_eh (1126 of 1968) PASS: lldb-unit :: Utility/./UtilityTests/StringListTest.GetMaxStringLengthIncreasingSize (1127 of 1968) PASS: lldb-api :: commands/expression/inline-namespace/TestInlineNamespace.py (1128 of 1968) UNSUPPORTED: lldb-api :: functionalities/darwin_log/filter/exact_match/category/TestDarwinLogFilterMatchCategory.py (1129 of 1968) PASS: lldb-api :: python_api/sblaunchinfo/TestSBLaunchInfo.py (1130 of 1968) PASS: lldb-api :: functionalities/memory/read/TestMemoryRead.py (1131 of 1968) PASS: lldb-unit :: Expression/./ExpressionTests/DiagnosticManagerTest.FixedExpression (1132 of 1968) PASS: lldb-unit :: UnwindAssembly/x86/./UnwindAssemblyx86Tests/Testx86AssemblyInspectionEngine.TestSpillRegToStackViaMOVx86_64 (1133 of 1968) PASS: lldb-api :: lang/objcxx/hide-runtime-values/TestObjCXXHideRuntimeValues.py (1134 of 1968) PASS: lldb-unit :: Process/gdb-remote/./ProcessGdbRemoteTests/GDBRemoteCommunicationClientTest.WriteRegister (1135 of 1968) PASS: lldb-api :: commands/expression/import-std-module/stack/TestStackFromStdModule.py (1136 of 1968) PASS: lldb-unit :: Utility/./UtilityTests/VMRange.CollectionContains (1137 of 1968) PASS: lldb-unit :: Utility/./UtilityTests/StringListTest.SplitIntoLines (1138 of 1968) PASS: lldb-unit :: Utility/./UtilityTests/StructuredDataTest.StringDump (1139 of 1968) PASS: lldb-api :: commands/watchpoints/multiple_hits/TestMultipleHits.py (1140 of 1968) PASS: lldb-api :: tools/lldb-server/TestGdbRemoteSingleStep.py (1141 of 1968) PASS: lldb-unit :: Interpreter/./InterpreterTests/OptionArgParserTest.toBoolean (1142 of 1968) PASS: lldb-shell :: SymbolFile/DWARF/dwp.s (1143 of 1968) PASS: lldb-unit :: Utility/./UtilityTests/LogChannelTest.List (1144 of 1968) PASS: lldb-unit :: Utility/./UtilityTests/ProcessInstanceInfo.Dump (1145 of 1968) PASS: lldb-unit :: Utility/./UtilityTests/StreamTeeTest.SetStreamAtIndexOverwrite (1146 of 1968) PASS: lldb-api :: commands/watchpoints/step_over_watchpoint/TestStepOverWatchpoint.py (1147 of 1968) PASS: lldb-unit :: Utility/./UtilityTests/EventTest.DumpEventDataBytes (1148 of 1968) PASS: lldb-unit :: UnwindAssembly/x86/./UnwindAssemblyx86Tests/Testx86AssemblyInspectionEngine.TestPush0 (1149 of 1968) PASS: lldb-unit :: Utility/./UtilityTests/StreamTest.PutHex16ByteOrderBig (1150 of 1968) PASS: lldb-unit :: SymbolFile/DWARF/./SymbolFileDWARFTests/SymbolFileDWARFTests.ParseArangesNonzeroSegmentSize (1151 of 1968) PASS: lldb-unit :: ScriptInterpreter/Python/./ScriptInterpreterPythonTests/PythonDataObjectsTest.TestPythonDictionaryManipulation (1152 of 1968) PASS: lldb-unit :: Utility/./UtilityTests/FileSpecTest.EqualDotsWindows (1153 of 1968) PASS: lldb-unit :: Utility/./UtilityTests/FileSpecTest.EqualDotsPosix (1154 of 1968) PASS: lldb-unit :: Utility/./UtilityTests/ScalarTest.ComparisonFloat (1155 of 1968) PASS: lldb-unit :: Utility/./UtilityTests/StringListTest.ShiftMove (1156 of 1968) PASS: lldb-unit :: Expression/./ExpressionTests/ClangExpressionDeclMapTest.TestUnknownIdentifierLookup (1157 of 1968) PASS: lldb-unit :: Utility/./UtilityTests/DataExtractorTest.UncommonAddressSize (1158 of 1968) PASS: lldb-api :: python_api/watchpoint/watchlocation/TestTargetWatchAddress.py (1159 of 1968) PASS: lldb-unit :: UnwindAssembly/x86/./UnwindAssemblyx86Tests/Testx86AssemblyInspectionEngine.TestPopEBX (1160 of 1968) PASS: lldb-api :: driver/batch_mode/TestBatchMode.py (1161 of 1968) PASS: lldb-unit :: Utility/./UtilityTests/SubsystemRAIITest.NormalSubsystem (1162 of 1968) PASS: lldb-unit :: SymbolFile/NativePDB/./SymbolFileNativePDBTests/PDBFPOProgramToDWARFExpressionTests.InvalidOpBinary (1163 of 1968) PASS: lldb-api :: commands/process/launch-with-shellexpand/TestLaunchWithShellExpand.py (1164 of 1968) PASS: lldb-unit :: Utility/./UtilityTests/StringExtractorTest.GetNameColonValueSuccess (1165 of 1968) PASS: lldb-api :: functionalities/data-formatter/data-formatter-synthval/TestDataFormatterSynthVal.py (1166 of 1968) PASS: lldb-unit :: Host/./HostTests/FileSystemTest.GetByteSize (1167 of 1968) PASS: lldb-unit :: Utility/./UtilityTests/StreamTest.PutBytesAsRawHex8ToLittleEndian (1168 of 1968) PASS: lldb-unit :: Host/./HostTests/SocketAddressTest.Set (1169 of 1968) PASS: lldb-unit :: Symbol/./SymbolTests/PostfixExpression.ParseFPOProgram (1170 of 1968) PASS: lldb-api :: lang/cpp/member-and-local-vars-with-same-name/TestMembersAndLocalsWithSameName.py (1171 of 1968) PASS: lldb-unit :: Utility/./UtilityTests/VMRange.Clear (1172 of 1968) PASS: lldb-unit :: Utility/./UtilityTests/RangeTest.ContainsRangeStartingFromZero (1173 of 1968) PASS: lldb-unit :: Utility/./UtilityTests/StringExtractorTest.GetHexBytes_OddPair (1174 of 1968) PASS: lldb-api :: commands/expression/expr-in-syscall/TestExpressionInSyscall.py (1175 of 1968) PASS: lldb-unit :: Utility/./UtilityTests/RangeTest.SetRangeBase (1176 of 1968) UNSUPPORTED: lldb-shell :: Unwind/unwind-plan-dwarf-dump.test (1177 of 1968) UNSUPPORTED: lldb-api :: functionalities/asan/TestReportData.py (1178 of 1968) PASS: lldb-api :: functionalities/signal/raise/TestRaise.py (1179 of 1968) PASS: lldb-api :: macosx/find-app-in-bundle/TestFindAppInBundle.py (1180 of 1968) PASS: lldb-api :: commands/command/source/TestCommandSource.py (1181 of 1968) PASS: lldb-unit :: Utility/./UtilityTests/AnsiTerminal.Empty (1182 of 1968) PASS: lldb-api :: lang/objc/print-obj/TestPrintObj.py (1183 of 1968) PASS: lldb-api :: functionalities/data-formatter/data-formatter-objc/nsindexpath/TestDataFormatterNSIndexPath.py (1184 of 1968) PASS: lldb-unit :: Utility/./UtilityTests/RangeDataVector.FindEntryIndexesThatContain (1185 of 1968) PASS: lldb-shell :: SymbolFile/NativePDB/function-types-classes.cpp (1186 of 1968) PASS: lldb-api :: functionalities/data-formatter/language_category_updates/TestDataFormatterLanguageCategoryUpdates.py (1187 of 1968) PASS: lldb-api :: functionalities/thread/concurrent_events/TestConcurrentTwoWatchpointsOneDelayBreakpoint.py (1188 of 1968) PASS: lldb-api :: lang/c/global_variables/TestGlobalVariables.py (1189 of 1968) PASS: lldb-unit :: Utility/./UtilityTests/NameMatchesTest.Contains (1190 of 1968) PASS: lldb-unit :: Utility/./UtilityTests/ListenerTest.GetEventImmediate (1191 of 1968) PASS: lldb-api :: lang/objc/objc-ivar-protocols/TestIvarProtocols.py (1192 of 1968) PASS: lldb-api :: functionalities/process_group/TestChangeProcessGroup.py (1193 of 1968) PASS: lldb-unit :: Utility/./UtilityTests/ArchSpecTest.TripleComponentsWereSpecified (1194 of 1968) PASS: lldb-api :: functionalities/data-formatter/data-formatter-objc/TestDataFormatterObjCNSContainer.py (1195 of 1968) PASS: lldb-unit :: ScriptInterpreter/Python/./ScriptInterpreterPythonTests/PythonDataObjectsTest.TestPythonTupleInitializerList (1196 of 1968) UNSUPPORTED: lldb-shell :: SymbolFile/NativePDB/typedefs.cpp (1197 of 1968) UNSUPPORTED: lldb-shell :: SymbolFile/NativePDB/local-variables.cpp (1198 of 1968) PASS: lldb-unit :: Utility/./UtilityTests/LogChannelTest.Disable (1199 of 1968) PASS: lldb-unit :: Symbol/./SymbolTests/LineEntryTest.GetSameLineContiguousAddressRangeNoInlines (1200 of 1968) UNSUPPORTED: lldb-api :: functionalities/data-formatter/data-formatter-stl/libstdcpp/vbool/TestDataFormatterStdVBool.py (1201 of 1968) PASS: lldb-unit :: Target/./TargetTests/ModuleCacheTest.GetAndPutStrangeHostname (1202 of 1968) PASS: lldb-api :: commands/expression/ir-interpreter-phi-nodes/TestIRInterpreterPHINodes.py (1203 of 1968) PASS: lldb-api :: lang/objc/modules-incomplete/TestIncompleteModules.py (1204 of 1968) PASS: lldb-api :: lang/c/step_over_no_deadlock/TestStepOverDoesntBlock.py (1205 of 1968) PASS: lldb-unit :: Utility/./UtilityTests/SerializationRountripTest.SerializeDeserializePod (1206 of 1968) PASS: lldb-api :: commands/expression/context-object-objc/TestContextObjectObjc.py (1207 of 1968) PASS: lldb-unit :: Utility/./UtilityTests/ArgsTest.TestMultipleArgs (1208 of 1968) PASS: lldb-unit :: Utility/./UtilityTests/StringListTest.InsertStringAtIndexMove (1209 of 1968) PASS: lldb-unit :: ObjectFile/ELF/./ObjectFileELFTests/ObjectFileELFTest.SectionsResolveConsistently (1210 of 1968) PASS: lldb-shell :: SymbolFile/DWARF/DW_AT_loclists_base.s (1211 of 1968) PASS: lldb-api :: commands/frame/select/TestFrameSelect.py (1212 of 1968) PASS: lldb-api :: lang/cpp/exceptions/TestCPPExceptionBreakpoints.py (1213 of 1968) PASS: lldb-api :: functionalities/tail_call_frames/ambiguous_tail_call_seq1/TestAmbiguousTailCallSeq1.py (1214 of 1968) PASS: lldb-api :: lang/cpp/this/TestCPPThis.py (1215 of 1968) PASS: lldb-shell :: ObjectFile/PECOFF/sections.yaml (1216 of 1968) PASS: lldb-shell :: Driver/TestConvenienceVariables.test (1217 of 1968) PASS: lldb-unit :: Utility/./UtilityTests/Flags.AllClear (1218 of 1968) PASS: lldb-unit :: Utility/./UtilityTests/OptionsWithRawTest.WhitespaceSuffix (1219 of 1968) PASS: lldb-unit :: Utility/./UtilityTests/StringExtractorTest.GetHexU8_Exact (1220 of 1968) PASS: lldb-unit :: Language/Highlighting/./HighlighterTests/HighlighterTest.ClangBraces (1221 of 1968) PASS: lldb-api :: lang/c/strings/TestCStrings.py (1222 of 1968) PASS: lldb-api :: functionalities/breakpoint/auto_continue/TestBreakpointAutoContinue.py (1223 of 1968) PASS: lldb-api :: lang/cpp/template-function/TestTemplateFunctions.py (1224 of 1968) PASS: lldb-unit :: Utility/./UtilityTests/FileSpecTest.GetPath (1225 of 1968) PASS: lldb-unit :: Utility/./UtilityTests/SubsystemRAIITest.SubsystemWithErrorFailure (1226 of 1968) PASS: lldb-shell :: Settings/TestSettingsSet.test (1227 of 1968) PASS: lldb-shell :: Reproducer/Modules/TestModuleCXX.test (1228 of 1968) PASS: lldb-shell :: SymbolFile/DWARF/debug-types-dwarf5.s (1229 of 1968) PASS: lldb-api :: lang/c/step-target/TestStepTarget.py (1230 of 1968) UNSUPPORTED: lldb-shell :: Unwind/eh-frame-small-fde.test (1231 of 1968) PASS: lldb-unit :: Expression/./ExpressionTests/DiagnosticManagerTest.AppendMessageSubsequentDiags (1232 of 1968) PASS: lldb-unit :: Signals/./SignalsTests/UnixSignalsTest.VersionChange (1233 of 1968) PASS: lldb-unit :: Utility/./UtilityTests/UriParserTest.MinimalPortPath (1234 of 1968) PASS: lldb-unit :: Utility/./UtilityTests/NameMatchesTest.StartsWith (1235 of 1968) PASS: lldb-unit :: Target/./TargetTests/PathMappingListTest.RemapRoot (1236 of 1968) PASS: lldb-api :: lang/cpp/global_variables/TestCPPGlobalVariables.py (1237 of 1968) PASS: lldb-api :: lang/objc/objc-ivar-stripped/TestObjCIvarStripped.py (1238 of 1968) PASS: lldb-unit :: Utility/./UtilityTests/StreamTest.SetIndentLevel (1239 of 1968) PASS: lldb-unit :: ScriptInterpreter/Python/./ScriptInterpreterPythonTests/PythonDataObjectsTest.TestPythonFile (1240 of 1968) PASS: lldb-api :: functionalities/data-formatter/data-formatter-stl/libcxx/set/TestDataFormatterLibcxxSet.py (1241 of 1968) UNSUPPORTED: lldb-shell :: Register/x86-64-zmm-read.test (1242 of 1968) UNSUPPORTED: lldb-api :: macosx/macabi/TestMacABImacOSFramework.py (1243 of 1968) PASS: lldb-unit :: Utility/./UtilityTests/RangeTest.ContainsAddr (1244 of 1968) PASS: lldb-api :: commands/frame/diagnose/local-variable/TestLocalVariable.py (1245 of 1968) PASS: lldb-api :: functionalities/data-formatter/data-formatter-globals/TestDataFormatterGlobals.py (1246 of 1968) PASS: lldb-unit :: Editline/./EditlineTests/EditlineTestFixture.EditlineReceivesSingleLineText (1247 of 1968) PASS: lldb-shell :: Reproducer/TestRelativePath.test (1248 of 1968) PASS: lldb-unit :: UnwindAssembly/x86/./UnwindAssemblyx86Tests/Testx86AssemblyInspectionEngine.TestSubRSP (1249 of 1968) PASS: lldb-api :: python_api/watchpoint/TestWatchpointIter.py (1250 of 1968) PASS: lldb-unit :: Utility/./UtilityTests/ScalarTest.ExtractBitfield (1251 of 1968) PASS: lldb-unit :: Utility/./UtilityTests/AnsiTerminal.KnownPrefix (1252 of 1968) PASS: lldb-shell :: SymbolFile/NativePDB/ast-types.cpp (1253 of 1968) PASS: lldb-api :: python_api/formatters/TestFormattersSBAPI.py (1254 of 1968) PASS: lldb-api :: functionalities/data-formatter/data-formatter-advanced/TestDataFormatterAdv.py (1255 of 1968) PASS: lldb-shell :: ObjectFile/ELF/base-address.yaml (1256 of 1968) PASS: lldb-shell :: Commands/CommandScriptImmediateOutput/CommandScriptImmediateOutputConsole.test (1257 of 1968) PASS: lldb-unit :: Utility/./UtilityTests/StringExtractorTest.GetNameColonValueNoSemicolon (1258 of 1968) PASS: lldb-unit :: ScriptInterpreter/Python/./ScriptInterpreterPythonTests/PythonDataObjectsTest.TestPythonListManipulation (1259 of 1968) PASS: lldb-api :: functionalities/breakpoint/source_regexp/TestSourceRegexBreakpoints.py (1260 of 1968) PASS: lldb-unit :: Utility/./UtilityTests/ArgsTest.GetQuotedCommandString (1261 of 1968) PASS: lldb-unit :: Process/minidump/./LLDBMinidumpTests/MinidumpParserTest.GetLinuxProcStatus_no_stream (1262 of 1968) PASS: lldb-api :: functionalities/gdb_remote_client/TestqOffsets.py (1263 of 1968) PASS: lldb-shell :: Reproducer/TestFileRepro.test (1264 of 1968) PASS: lldb-api :: commands/expression/weak_symbols/TestWeakSymbols.py (1265 of 1968) PASS: lldb-unit :: Utility/./UtilityTests/NameMatchesTest.EndsWith (1266 of 1968) PASS: lldb-unit :: Utility/./UtilityTests/RangeTest.DoesAdjoinOrIntersect (1267 of 1968) PASS: lldb-unit :: Utility/./UtilityTests/BinaryStreamTest.PutSLEB128One (1268 of 1968) PASS: lldb-unit :: Utility/./UtilityTests/TildeExpressionResolver.ResolveFullPath (1269 of 1968) PASS: lldb-unit :: ScriptInterpreter/Python/./ScriptInterpreterPythonTests/PythonDataObjectsTest.TestPythonTupleSize (1270 of 1968) PASS: lldb-unit :: Host/./HostTests/FileSystemTest.EnumerateDirectory (1271 of 1968) PASS: lldb-shell :: Settings/TestLineMarkerColor.test (1272 of 1968) PASS: lldb-unit :: Utility/./UtilityTests/RangeTest.NotEqualInvalid (1273 of 1968) PASS: lldb-shell :: Driver/TestCommands.test (1274 of 1968) PASS: lldb-unit :: Utility/./UtilityTests/StringExtractorTest.GetHexU8_InvalidHex (1275 of 1968) UNSUPPORTED: lldb-api :: functionalities/darwin_log/filter/exact_match/subsystem/TestDarwinLogFilterMatchSubsystem.py (1276 of 1968) UNSUPPORTED: lldb-api :: functionalities/data-formatter/data-formatter-stl/libstdcpp/vector/TestDataFormatterStdVector.py (1277 of 1968) PASS: lldb-api :: commands/expression/save_jit_objects/TestSaveJITObjects.py (1278 of 1968) PASS: lldb-unit :: Utility/./UtilityTests/OptionsWithRawTest.ArgsButNoLeadingDash (1279 of 1968) PASS: lldb-api :: python_api/interpreter/TestRunCommandInterpreterAPI.py (1280 of 1968) PASS: lldb-unit :: Language/Highlighting/./HighlighterTests/HighlighterTest.ClangStringLiterals (1281 of 1968) PASS: lldb-api :: commands/expression/rdar44436068/Test128BitsInteger.py (1282 of 1968) PASS: lldb-unit :: Host/./HostTests/FileActionTest.Open (1283 of 1968) PASS: lldb-api :: lang/objc/self/TestObjCSelf.py (1284 of 1968) UNSUPPORTED: lldb-shell :: ScriptInterpreter/Lua/lua.test (1285 of 1968) PASS: lldb-api :: functionalities/data-formatter/data-formatter-synthtype/TestDataFormatterSynthType.py (1286 of 1968) PASS: lldb-api :: functionalities/data-formatter/data-formatter-stl/libcxx/function/TestLibCxxFunction.py (1287 of 1968) PASS: lldb-api :: api/multithreaded/TestMultithreaded.py (1288 of 1968) PASS: lldb-unit :: Utility/./UtilityTests/ArgsTest.TestOverwriteArgs (1289 of 1968) PASS: lldb-shell :: SymbolFile/NativePDB/global-classes.cpp (1290 of 1968) PASS: lldb-unit :: Utility/./UtilityTests/RangeTest.Slide (1291 of 1968) PASS: lldb-unit :: Utility/./UtilityTests/ScalarTest.SetValueFromCString (1292 of 1968) PASS: lldb-shell :: ObjectFile/ELF/section-permissions.yaml (1293 of 1968) PASS: lldb-unit :: UnwindAssembly/x86/./UnwindAssemblyx86Tests/Testx86AssemblyInspectionEngine.TestPopR12 (1294 of 1968) PASS: lldb-unit :: Utility/./UtilityTests/RangeTest.EqualInvalid (1295 of 1968) PASS: lldb-api :: commands/expression/namespace_local_var_same_name_obj_c/TestNamespaceLocalVarSameNameObjC.py (1296 of 1968) PASS: lldb-api :: tools/lldb-server/TestGdbRemoteKill.py (1297 of 1968) PASS: lldb-shell :: Breakpoint/case-sensitive.test (1298 of 1968) PASS: lldb-api :: commands/expression/completion-crash-incomplete-record/TestCompletionCrashIncompleteRecord.py (1299 of 1968) PASS: lldb-api :: types/TestFloatTypes.py (1300 of 1968) PASS: lldb-unit :: Symbol/./SymbolTests/LineEntryTest.GetSameLineContiguousAddressRangeNestedInline (1301 of 1968) PASS: lldb-api :: functionalities/plugins/python_os_plugin/TestPythonOSPlugin.py (1302 of 1968) PASS: lldb-unit :: Utility/./UtilityTests/UUIDTest.StringConverion (1303 of 1968) PASS: lldb-api :: commands/expression/persistent_variables/TestPersistentVariables.py (1304 of 1968) PASS: lldb-api :: lang/c/unicode/TestUnicodeSymbols.py (1305 of 1968) PASS: lldb-api :: functionalities/gdb_remote_client/TestJLink6Armv7RegisterDefinition.py (1306 of 1968) UNSUPPORTED: lldb-api :: functionalities/data-formatter/data-formatter-stl/libstdcpp/smart_ptr/TestDataFormatterStdSmartPtr.py (1307 of 1968) PASS: lldb-shell :: Commands/command-disassemble.s (1308 of 1968) PASS: lldb-api :: functionalities/breakpoint/scripted_bkpt/TestScriptedResolver.py (1309 of 1968) PASS: lldb-unit :: UnwindAssembly/x86/./UnwindAssemblyx86Tests/Testx86AssemblyInspectionEngine.Test32bitFramelessBigStackFrame (1310 of 1968) PASS: lldb-shell :: ObjectFile/PECOFF/section-types.yaml (1311 of 1968) PASS: lldb-unit :: Utility/./UtilityTests/RangeTest.SizeTypes (1312 of 1968) PASS: lldb-api :: functionalities/stats_api/TestStatisticsAPI.py (1313 of 1968) PASS: lldb-shell :: Commands/command-script-import.test (1314 of 1968) PASS: lldb-shell :: Quit/TestQuitExitCode-30.test (1315 of 1968) PASS: lldb-unit :: Process/minidump/./LLDBMinidumpTests/MinidumpParserTest.FindMemoryRange (1316 of 1968) PASS: lldb-shell :: BuildScript/compiler-full-path.test (1317 of 1968) PASS: lldb-api :: functionalities/backticks/TestBackticksWithoutATarget.py (1318 of 1968) PASS: lldb-api :: lang/c/forward/TestForwardDeclaration.py (1319 of 1968) UNSUPPORTED: lldb-api :: functionalities/exec/TestExec.py (1320 of 1968) PASS: lldb-shell :: SymbolFile/DWARF/dwp-separate-debug-file.cpp (1321 of 1968) PASS: lldb-unit :: Symbol/./SymbolTests/TestTypeSystemClang.TestFunctionTemplateConstruction (1322 of 1968) PASS: lldb-unit :: Core/./LLDBCoreTests/RichManglingContextTest.FromCxxMethodName (1323 of 1968) PASS: lldb-shell :: Minidump/dump-all.test (1324 of 1968) PASS: lldb-unit :: Utility/./UtilityTests/StreamTest.PutRawBytesToLittleEndian (1325 of 1968) PASS: lldb-unit :: Utility/./UtilityTests/ArchSpecTest.YAML (1326 of 1968) PASS: lldb-unit :: Utility/./UtilityTests/OptionsWithRawTest.ArgsButNoDelimiter (1327 of 1968) PASS: lldb-shell :: Minidump/memory-region-from-module.yaml (1328 of 1968) UNSUPPORTED: lldb-api :: tools/lldb-server/TestGdbRemoteModuleInfo.py (1329 of 1968) PASS: lldb-unit :: Language/Highlighting/./HighlighterTests/HighlighterTest.DefaultHighlighter (1330 of 1968) PASS: lldb-unit :: Utility/./UtilityTests/ProcessInstanceInfo.DumpTable (1331 of 1968) PASS: lldb-api :: functionalities/target_var/TestTargetVar.py (1332 of 1968) PASS: lldb-unit :: Process/gdb-remote/./ProcessGdbRemoteTests/GDBRemoteCommunicationClientTest.WriteRegisterNoSuffix (1333 of 1968) PASS: lldb-unit :: UnwindAssembly/x86/./UnwindAssemblyx86Tests/Testx86AssemblyInspectionEngine.TestDisassemblyMidFunctionEpilogues (1334 of 1968) PASS: lldb-unit :: Host/./HostTests/FileSystemTest.MakeAbsolute (1335 of 1968) PASS: lldb-unit :: Utility/./UtilityTests/RegularExpression.Empty (1336 of 1968) PASS: lldb-api :: macosx/function-starts/TestFunctionStarts.py (1337 of 1968) PASS: lldb-shell :: Unwind/trap_frame_sym_ctx.test (1338 of 1968) PASS: lldb-shell :: SymbolFile/DWARF/find-variable-dwo.cpp (1339 of 1968) PASS: lldb-shell :: SymbolFile/NativePDB/function-types-builtins.cpp (1340 of 1968) PASS: lldb-unit :: Language/CPlusPlus/./LanguageCPlusPlusTests/CPlusPlusLanguage.CPlusPlusNameParser (1341 of 1968) PASS: lldb-unit :: Utility/./UtilityTests/StreamTeeTest.Assignment (1342 of 1968) PASS: lldb-unit :: Process/gdb-remote/./ProcessGdbRemoteTests/GDBRemoteClientBaseTest.SendContinueAndInterrupt (1343 of 1968) PASS: lldb-unit :: Utility/./UtilityTests/StringListTest.InsertStringAtIndexStart (1344 of 1968) PASS: lldb-api :: types/TestRecursiveTypes.py (1345 of 1968) PASS: lldb-unit :: Utility/./UtilityTests/ArgsTest.TestQuotedUnknownEscape (1346 of 1968) PASS: lldb-unit :: Host/./HostTests/SocketTest.TCPGetConnectURI (1347 of 1968) PASS: lldb-unit :: Utility/./UtilityTests/StreamTeeTest.AppendStream (1348 of 1968) PASS: lldb-unit :: Expression/./ExpressionTests/CppModuleConfigurationTest.LibCppV2 (1349 of 1968) PASS: lldb-unit :: Utility/./UtilityTests/RangeTest.Constructor (1350 of 1968) PASS: lldb-api :: lang/objc/foundation/TestObjCMethods.py (1351 of 1968) PASS: lldb-api :: python_api/lldbutil/process/TestPrintStackTraces.py (1352 of 1968) PASS: lldb-api :: commands/expression/no-deadlock/TestExprDoesntBlock.py (1353 of 1968) PASS: lldb-api :: functionalities/lazy-loading/TestLazyLoading.py (1354 of 1968) PASS: lldb-unit :: Utility/./UtilityTests/UriParserTest.BracketedHostname (1355 of 1968) PASS: lldb-unit :: Utility/./UtilityTests/OptionsWithRawTest.EmptySuffixSingleWhitespace (1356 of 1968) PASS: lldb-api :: lang/cpp/type_lookup/TestCppTypeLookup.py (1357 of 1968) PASS: lldb-api :: functionalities/thread/concurrent_events/TestConcurrentDelaySignalBreak.py (1358 of 1968) PASS: lldb-shell :: ObjectFile/Breakpad/uuid-matching-mac.test (1359 of 1968) PASS: lldb-api :: lang/objc/unicode-string/TestUnicodeString.py (1360 of 1968) PASS: lldb-unit :: Host/./HostTests/Host.WaitStatusFormat (1361 of 1968) PASS: lldb-shell :: Reproducer/TestGDBRemoteRepro.test (1362 of 1968) PASS: lldb-unit :: Utility/./UtilityTests/BinaryStreamTest.PutSLEB128MaxValue (1363 of 1968) PASS: lldb-api :: functionalities/data-formatter/type_summary_list_arg/TestTypeSummaryListArg.py (1364 of 1968) PASS: lldb-unit :: SymbolFile/NativePDB/./SymbolFileNativePDBTests/PDBFPOProgramToDWARFExpressionTests.UnresolvedCyclicRegisterAssignmentReference (1365 of 1968) PASS: lldb-api :: functionalities/thread/create_after_attach/TestCreateAfterAttach.py (1366 of 1968) PASS: lldb-api :: lang/objc/foundation/TestObjCMethodsString.py (1367 of 1968) PASS: lldb-api :: commands/expression/context-object/TestContextObject.py (1368 of 1968) PASS: lldb-api :: functionalities/breakpoint/debugbreak/TestDebugBreak.py (1369 of 1968) PASS: lldb-shell :: ObjectFile/ELF/section-types-edgecases.yaml (1370 of 1968) PASS: lldb-shell :: SymbolFile/Breakpad/unwind-via-raSearch.test (1371 of 1968) PASS: lldb-unit :: Utility/./UtilityTests/TimeoutTest.Format (1372 of 1968) PASS: lldb-api :: commands/frame/diagnose/complicated-expression/TestComplicatedExpression.py (1373 of 1968) PASS: lldb-api :: functionalities/gdb_remote_client/TestWriteMemory.py (1374 of 1968) PASS: lldb-shell :: SymbolFile/Breakpad/stack-cfi-parsing.test (1375 of 1968) PASS: lldb-shell :: Driver/TestCore.test (1376 of 1968) PASS: lldb-unit :: Process/minidump/./LLDBMinidumpTests/MinidumpParserTest.GetThreadContext_x86_64 (1377 of 1968) PASS: lldb-unit :: Language/Highlighting/./HighlighterTests/HighlighterTest.ClangTrailingBackslashWithWhitespace (1378 of 1968) UNSUPPORTED: lldb-shell :: Minidump/Windows/arm-fp-unwind.test (1379 of 1968) PASS: lldb-unit :: Core/./LLDBCoreTests/MangledTest.EmptyForInvalidName (1380 of 1968) PASS: lldb-unit :: Symbol/./SymbolTests/TestTypeSystemClang.TestUnifyAccessSpecifiers (1381 of 1968) PASS: lldb-api :: lang/objc/objc_direct-methods/TestObjCDirectMethods.py (1382 of 1968) PASS: lldb-api :: functionalities/target-new-solib-notifications/TestModuleLoadedNotifys.py (1383 of 1968) PASS: lldb-unit :: Utility/./UtilityTests/FileSpecTest.EqualDotsPosixRoot (1384 of 1968) PASS: lldb-api :: commands/command/delete/TestCommandDelete.py (1385 of 1968) PASS: lldb-api :: functionalities/step-avoids-no-debug/TestStepNoDebug.py (1386 of 1968) PASS: lldb-api :: functionalities/dead-strip/TestDeadStrip.py (1387 of 1968) PASS: lldb-unit :: Utility/./UtilityTests/SubsystemRAIITest.SubsystemWithErrorSuccess (1388 of 1968) PASS: lldb-shell :: SymbolFile/DWARF/parallel-indexing-stress.s (1389 of 1968) UNSUPPORTED: lldb-api :: benchmarks/libcxxmap/TestBenchmarkLibcxxMap.py (1390 of 1968) PASS: lldb-api :: functionalities/object-file/TestImageListMultiArchitecture.py (1391 of 1968) PASS: lldb-unit :: Utility/./UtilityTests/StringLexerTest.Peek (1392 of 1968) PASS: lldb-shell :: SymbolFile/DWARF/DW_OP_piece-struct.s (1393 of 1968) PASS: lldb-api :: lang/cpp/nsimport/TestCppNsImport.py (1394 of 1968) PASS: lldb-api :: macosx/safe-to-func-call/TestSafeFuncCalls.py (1395 of 1968) PASS: lldb-api :: commands/statistics/basic/TestStats.py (1396 of 1968) PASS: lldb-unit :: Utility/./UtilityTests/BroadcasterTest.BroadcastEvent (1397 of 1968) PASS: lldb-api :: functionalities/data-formatter/data-formatter-synth/TestDataFormatterSynth.py (1398 of 1968) PASS: lldb-shell :: SymbolFile/DWARF/anon_class_w_and_wo_export_symbols.ll (1399 of 1968) PASS: lldb-api :: functionalities/step_scripted/TestStepScripted.py (1400 of 1968) UNSUPPORTED: lldb-shell :: BuildScript/toolchain-msvc.test (1401 of 1968) UNSUPPORTED: lldb-shell :: Register/arm-gp-read.test (1402 of 1968) PASS: lldb-unit :: Utility/./UtilityTests/ArgsTest.DoubleQuotedItem (1403 of 1968) PASS: lldb-unit :: Utility/./UtilityTests/StringExtractorTest.GetHexBytesAvail_Underflow (1404 of 1968) PASS: lldb-unit :: Utility/./UtilityTests/StreamTest.ChangingByteOrder (1405 of 1968) UNSUPPORTED: lldb-api :: functionalities/tsan/thread_leak/TestTsanThreadLeak.py (1406 of 1968) PASS: lldb-shell :: SymbolFile/Breakpad/unwind-via-stack-win.test (1407 of 1968) PASS: lldb-unit :: ObjectFile/PECOFF/./ObjectFilePECOFFTests/PECallFrameInfoTest.Basic_eh (1408 of 1968) PASS: lldb-unit :: Utility/./UtilityTests/SerializationRountripTest.SerializeDeserializeCStringArray (1409 of 1968) PASS: lldb-unit :: tools/lldb-server/tests/./LLDBServerTests/TestBase.LaunchModePreservesEnvironment (1410 of 1968) UNSUPPORTED: lldb-shell :: Register/x86-gp-write.test (1411 of 1968) PASS: lldb-unit :: Utility/./UtilityTests/SerializationRountripTest.SerializeDeserializeCString (1412 of 1968) PASS: lldb-api :: lang/objc/modules-update/TestClangModulesUpdate.py (1413 of 1968) PASS: lldb-api :: commands/command/script/import/TestImport.py (1414 of 1968) PASS: lldb-api :: functionalities/tail_call_frames/thread_step_out_message/TestArtificialFrameStepOutMessage.py (1415 of 1968) PASS: lldb-api :: functionalities/thread/exit_during_step/TestExitDuringStep.py (1416 of 1968) PASS: lldb-unit :: Utility/./UtilityTests/StringLexerTest.PutBack (1417 of 1968) PASS: lldb-api :: commands/expression/import-std-module/vector-bool/TestVectorBoolFromStdModule.py (1418 of 1968) PASS: lldb-shell :: Settings/TestStopCommandSourceOnError.test (1419 of 1968) PASS: lldb-unit :: Symbol/./SymbolTests/SymbolsTest.LocateExecutableSymbolFileForUnknownExecutableAndMissingSymbolFile (1420 of 1968) PASS: lldb-unit :: Symbol/./SymbolTests/TestClangASTImporter.MetadataPropagationIndirectImport (1421 of 1968) PASS: lldb-unit :: Expression/./ExpressionTests/DiagnosticManagerTest.AddDiagnostic (1422 of 1968) PASS: lldb-unit :: Platform/./LLDBPlatformTests/PlatformDarwinTest.TestParseVersionBuildDir (1423 of 1968) PASS: lldb-unit :: SymbolFile/NativePDB/./SymbolFileNativePDBTests/PDBFPOProgramToDWARFExpressionTests.DependencyChain (1424 of 1968) PASS: lldb-api :: lang/objc/conflicting-definition/TestConflictingDefinition.py (1425 of 1968) PASS: lldb-api :: python_api/symbol-context/two-files/TestSymbolContextTwoFiles.py (1426 of 1968) PASS: lldb-api :: functionalities/data-formatter/parray/TestPrintArray.py (1427 of 1968) PASS: lldb-api :: tools/lldb-vscode/launch/TestVSCode_launch.py (1428 of 1968) UNSUPPORTED: lldb-api :: functionalities/darwin_log/filter/regex/category/TestDarwinLogFilterRegexCategory.py (1429 of 1968) PASS: lldb-unit :: Process/minidump/./LLDBMinidumpTests/MinidumpParserTest.GetArchitecture (1430 of 1968) PASS: lldb-api :: tools/lldb-vscode/breakpoint/TestVSCode_setExceptionBreakpoints.py (1431 of 1968) PASS: lldb-api :: commands/target/create-no-such-arch/TestNoSuchArch.py (1432 of 1968) UNSUPPORTED: lldb-shell :: SymbolFile/PDB/ast-restore.test (1433 of 1968) PASS: lldb-unit :: ScriptInterpreter/Python/./ScriptInterpreterPythonTests/PythonDataObjectsTest.TestRun (1434 of 1968) PASS: lldb-api :: commands/add-dsym/uuid/TestAddDsymCommand.py (1435 of 1968) PASS: lldb-api :: lang/cpp/operators/TestCppOperators.py (1436 of 1968) PASS: lldb-shell :: Quit/TestQuitExitCodeNonInt.test (1437 of 1968) PASS: lldb-unit :: Utility/./UtilityTests/StringListTest.JoinThree (1438 of 1968) PASS: lldb-unit :: UnwindAssembly/x86/./UnwindAssemblyx86Tests/Testx86AssemblyInspectionEngine.TestPopR14 (1439 of 1968) UNSUPPORTED: lldb-api :: functionalities/darwin_log/filter/regex/subsystem/TestDarwinLogFilterRegexSubsystem.py (1440 of 1968) PASS: lldb-unit :: ScriptInterpreter/Python/./ScriptInterpreterPythonTests/PythonDataObjectsTest.TestPythonIntegerToStr (1441 of 1968) PASS: lldb-api :: functionalities/data-formatter/data-formatter-objc/TestDataFormatterObjCNSData.py (1442 of 1968) PASS: lldb-api :: functionalities/breakpoint/breakpoint_conditions/TestBreakpointConditions.py (1443 of 1968) UNSUPPORTED: lldb-api :: linux/sepdebugsymlink/TestTargetSymbolsSepDebugSymlink.py (1444 of 1968) UNSUPPORTED: lldb-api :: functionalities/thread/create_during_step/TestCreateDuringStep.py (1445 of 1968) PASS: lldb-unit :: Utility/./UtilityTests/DeserializerTest.HasData (1446 of 1968) PASS: lldb-unit :: Utility/./UtilityTests/SerializationRountripTest.SerializeDeserializeCStringNull (1447 of 1968) PASS: lldb-api :: lang/cpp/chained-calls/TestCppChainedCalls.py (1448 of 1968) PASS: lldb-unit :: Process/minidump/./LLDBMinidumpTests/MinidumpParserTest.GetPidWindows (1449 of 1968) PASS: lldb-api :: tools/lldb-server/TestGdbRemote_vCont.py (1450 of 1968) PASS: lldb-unit :: Utility/./UtilityTests/StringExtractorTest.GetU64LittleEndian (1451 of 1968) PASS: lldb-api :: lang/objc/global_ptrs/TestGlobalObjects.py (1452 of 1968) PASS: lldb-api :: commands/frame/diagnose/virtual-method-call/TestDiagnoseDereferenceVirtualMethodCall.py (1453 of 1968) PASS: lldb-shell :: Reproducer/TestReuseDirectory.test (1454 of 1968) PASS: lldb-shell :: ScriptInterpreter/Python/crashlog.test (1455 of 1968) PASS: lldb-unit :: Utility/./UtilityTests/ArchSpecTest.MergeFrom (1456 of 1968) PASS: lldb-api :: functionalities/thread/concurrent_events/TestConcurrentCrashWithWatchpoint.py (1457 of 1968) PASS: lldb-api :: lang/cpp/dynamic-value/TestDynamicValue.py (1458 of 1968) PASS: lldb-api :: lang/cpp/wchar_t/TestCxxWCharT.py (1459 of 1968) PASS: lldb-unit :: Utility/./UtilityTests/OptionsWithRawTest.EmptyArgsOnlySuffix (1460 of 1968) UNSUPPORTED: lldb-shell :: Register/x86-zmm-write.test (1461 of 1968) PASS: lldb-unit :: Target/./TargetTests/ExecutionContextTest.GetByteOrderTarget (1462 of 1968) PASS: lldb-unit :: ScriptInterpreter/Python/./ScriptInterpreterPythonTests/PythonDataObjectsTest.TestPythonCallableCheck (1463 of 1968) PASS: lldb-shell :: Reproducer/TestCaptureEnvOverride.test (1464 of 1968) PASS: lldb-api :: commands/expression/import-std-module/list/TestListFromStdModule.py (1465 of 1968) PASS: lldb-api :: lang/objc/objc-struct-return/TestObjCStructReturn.py (1466 of 1968) PASS: lldb-api :: python_api/disassemble-raw-data/TestDisassembleRawData.py (1467 of 1968) PASS: lldb-unit :: Utility/./UtilityTests/VMRange.SetEndAddress (1468 of 1968) PASS: lldb-api :: sample_test/TestSampleInlineTest.py (1469 of 1968) PASS: lldb-shell :: ScriptInterpreter/Python/scripted_breakpoint.test (1470 of 1968) PASS: lldb-api :: functionalities/fat_archives/TestFatArchives.py (1471 of 1968) PASS: lldb-unit :: ScriptInterpreter/Python/./ScriptInterpreterPythonTests/PythonDataObjectsTest.TestPythonCallableInvoke (1472 of 1968) PASS: lldb-api :: functionalities/breakpoint/serialize/TestBreakpointSerialization.py (1473 of 1968) PASS: lldb-api :: functionalities/breakpoint/breakpoint_set_restart/TestBreakpointSetRestart.py (1474 of 1968) PASS: lldb-api :: functionalities/conditional_break/TestConditionalBreak.py (1475 of 1968) PASS: lldb-shell :: Register/x86-64-ymm-read.test (1476 of 1968) UNSUPPORTED: lldb-api :: functionalities/tsan/cpp_global_location/TestTsanCPPGlobalLocation.py (1477 of 1968) PASS: lldb-unit :: SymbolFile/NativePDB/./SymbolFileNativePDBTests/PDBFPOProgramToDWARFExpressionTests.InvalidAssignmentSingle (1478 of 1968) PASS: lldb-unit :: SymbolFile/NativePDB/./SymbolFileNativePDBTests/PDBFPOProgramToDWARFExpressionTests.UnsupportedRASearch (1479 of 1968) UNSUPPORTED: lldb-api :: functionalities/gdb_remote_client/TestWasm.py (1480 of 1968) PASS: lldb-api :: lang/cpp/lambdas/TestLambdas.py (1481 of 1968) PASS: lldb-unit :: Utility/./UtilityTests/UriParserTest.BadPort (1482 of 1968) PASS: lldb-shell :: SymbolFile/NativePDB/nested-types.cpp (1483 of 1968) PASS: lldb-unit :: Core/./LLDBCoreTests/RichManglingContextTest.Basic (1484 of 1968) PASS: lldb-api :: functionalities/breakpoint/hardware_breakpoints/hardware_breakpoint_on_multiple_threads/TestHWBreakMultiThread.py (1485 of 1968) PASS: lldb-api :: commands/expression/import-std-module/empty-module/TestEmptyStdModule.py (1486 of 1968) PASS: lldb-api :: python_api/frame/inlines/TestInlinedFrame.py (1487 of 1968) PASS: lldb-unit :: Process/minidump/./LLDBMinidumpTests/RegisterContextMinidump.CheckRegisterContextMinidump_ARM (1488 of 1968) PASS: lldb-api :: functionalities/history/TestHistoryRecall.py (1489 of 1968) PASS: lldb-unit :: Utility/./UtilityTests/ArgsTest.TestSingleQuotedArgWithSpace (1490 of 1968) PASS: lldb-api :: functionalities/value_md5_crash/TestValueMD5Crash.py (1491 of 1968) PASS: lldb-unit :: Utility/./UtilityTests/StreamTest.PutHex32ByteOrderLittle (1492 of 1968) PASS: lldb-api :: functionalities/tail_call_frames/inlining_and_tail_calls/TestInliningAndTailCalls.py (1493 of 1968) PASS: lldb-unit :: Utility/./UtilityTests/TimerTest.CategoryTimes2 (1494 of 1968) PASS: lldb-unit :: Utility/./UtilityTests/LogChannelEnabledTest.LogThread (1495 of 1968) PASS: lldb-unit :: Utility/./UtilityTests/StringListTest.GetMaxStringLengthEqualSize (1496 of 1968) PASS: lldb-shell :: Quit/TestQuitExitCodeTooManyArgs.test (1497 of 1968) PASS: lldb-api :: functionalities/thread/crash_during_step/TestCrashDuringStep.py (1498 of 1968) PASS: lldb-unit :: Utility/./UtilityTests/ArgsTest.ReplaceArgumentAtIndexFarOutOfRange (1499 of 1968) PASS: lldb-unit :: Symbol/./SymbolTests/TestClangASTImporter.CompleteFwdDeclWithOtherOrigin (1500 of 1968) UNSUPPORTED: lldb-api :: commands/watchpoints/hello_watchlocation/TestWatchLocation.py (1501 of 1968) PASS: lldb-unit :: Host/./HostTests/Host.GetEnvironment (1502 of 1968) UNSUPPORTED: lldb-shell :: ObjectFile/ELF/minidebuginfo-set-and-hit-breakpoint.test (1503 of 1968) PASS: lldb-unit :: ObjectFile/Breakpad/./ObjectFileBreakpadTests/ModuleRecord.parse (1504 of 1968) UNSUPPORTED: lldb-api :: functionalities/darwin_log/filter/regex/message/TestDarwinLogFilterRegexMessage.py (1505 of 1968) PASS: lldb-shell :: Reproducer/TestDiscard.test (1506 of 1968) PASS: lldb-api :: functionalities/unwind/noreturn/TestNoreturnUnwind.py (1507 of 1968) PASS: lldb-shell :: ObjectFile/ELF/PT_LOAD.yaml (1508 of 1968) UNSUPPORTED: lldb-api :: commands/target/auto-install-main-executable/TestAutoInstallMainExecutable.py (1509 of 1968) PASS: lldb-api :: lang/cpp/nested-class-other-compilation-unit/TestNestedClassWithParentInAnotherCU.py (1510 of 1968) PASS: lldb-api :: functionalities/breakpoint/inlined_breakpoints/TestInlinedBreakpoints.py (1511 of 1968) PASS: lldb-unit :: Platform/./LLDBPlatformTests/PlatformDarwinTest.FindXcodeContentsDirectoryInPath (1512 of 1968) PASS: lldb-unit :: Symbol/./SymbolTests/TestClangASTImporter.DeportTypeTagDecl (1513 of 1968) PASS: lldb-unit :: Process/gdb-remote/./ProcessGdbRemoteTests/GDBRemoteCommunicationClientTest.GetMemoryRegionInfo (1514 of 1968) PASS: lldb-api :: commands/log/basic/TestLogging.py (1515 of 1968) PASS: lldb-unit :: Symbol/./SymbolTests/TestTypeSystemClang.TestConvertAccessTypeToAccessSpecifier (1516 of 1968) PASS: lldb-api :: functionalities/thread/concurrent_events/TestConcurrentWatchpointDelayWatchpointOneBreakpoint.py (1517 of 1968) PASS: lldb-api :: commands/expression/invalid-args/TestInvalidArgsExpression.py (1518 of 1968) PASS: lldb-api :: lang/objc/real-definition/TestRealDefinition.py (1519 of 1968) PASS: lldb-unit :: Utility/./UtilityTests/FileSpecTest.Yaml (1520 of 1968) PASS: lldb-api :: python_api/watchpoint/TestWatchpointIgnoreCount.py (1521 of 1968) PASS: lldb-unit :: Utility/./UtilityTests/RegularExpression.CopyAssignment (1522 of 1968) PASS: lldb-api :: lang/cpp/accelerator-table/TestCPPAccelerator.py (1523 of 1968) PASS: lldb-api :: commands/target/dump-symtab-demangle/TestDumpSymtabDemangle.py (1524 of 1968) PASS: lldb-shell :: SymbolFile/DWARF/debug-names-compressed.cpp (1525 of 1968) PASS: lldb-api :: functionalities/thread/concurrent_events/TestConcurrentSignalDelayBreak.py (1526 of 1968) PASS: lldb-shell :: SymbolFile/NativePDB/break-by-line.cpp (1527 of 1968) PASS: lldb-unit :: Utility/./UtilityTests/FileSpecTest.GuessPathStyle (1528 of 1968) PASS: lldb-shell :: SymbolFile/DWARF/dwarf5-index-is-used.cpp (1529 of 1968) PASS: lldb-shell :: Commands/command-source.test (1530 of 1968) PASS: lldb-unit :: Utility/./UtilityTests/BinaryStreamTest.PutULEB128SixBytes (1531 of 1968) PASS: lldb-unit :: Utility/./UtilityTests/StringListTest.SetSize (1532 of 1968) PASS: lldb-shell :: SymbolFile/DWARF/find-method.cpp (1533 of 1968) PASS: lldb-unit :: Utility/./UtilityTests/RangeDataVector.CustomSort (1534 of 1968) PASS: lldb-unit :: Utility/./UtilityTests/VMRange.ContainsRange (1535 of 1968) PASS: lldb-unit :: Utility/./UtilityTests/ArchSpecTest.TestParseMachCPUDashSubtypeTripleExtra (1536 of 1968) PASS: lldb-shell :: Reproducer/TestWorkingDir.test (1537 of 1968) PASS: lldb-unit :: Utility/./UtilityTests/ArgsTest.TestUnknownEscape (1538 of 1968) PASS: lldb-unit :: Utility/./UtilityTests/FileSpecTest.Equal (1539 of 1968) PASS: lldb-api :: functionalities/wrong_commands/TestWrongCommands.py (1540 of 1968) PASS: lldb-unit :: UnwindAssembly/x86/./UnwindAssemblyx86Tests/Testx86AssemblyInspectionEngine.TestPushEBP (1541 of 1968) PASS: lldb-shell :: Breakpoint/split-dwarf-5-addrbase.test (1542 of 1968) PASS: lldb-shell :: BuildScript/modes.test (1543 of 1968) PASS: lldb-api :: functionalities/data-formatter/frameformat_smallstruct/TestFrameFormatSmallStruct.py (1544 of 1968) PASS: lldb-api :: commands/expression/import-std-module/conflicts/TestStdModuleWithConflicts.py (1545 of 1968) PASS: lldb-unit :: Host/./HostTests/TaskPoolTest.TaskMap (1546 of 1968) PASS: lldb-unit :: Utility/./UtilityTests/ScalarTest.CastOperations (1547 of 1968) PASS: lldb-api :: functionalities/recursion/TestValueObjectRecursion.py (1548 of 1968) UNSUPPORTED: lldb-api :: lang/objc/objc-dynamic-value/TestObjCDynamicValue.py (1549 of 1968) PASS: lldb-api :: macosx/DBGSourcePathRemapping/TestDSYMSourcePathRemapping.py (1550 of 1968) PASS: lldb-unit :: UnwindAssembly/x86/./UnwindAssemblyx86Tests/Testx86AssemblyInspectionEngine.TestPopEBP (1551 of 1968) PASS: lldb-unit :: Utility/./UtilityTests/StringListTest.LongestCommonPrefixEmpty (1552 of 1968) PASS: lldb-unit :: Utility/./UtilityTests/RecordReplayTest.InstrumentedBarPtr (1553 of 1968) PASS: lldb-api :: lang/objcxx/class-name-clash/TestNameClash.py (1554 of 1968) PASS: lldb-shell :: SymbolFile/DWARF/debug_loc_and_loclists.s (1555 of 1968) PASS: lldb-unit :: Expression/./ExpressionTests/DWARFExpression.DW_OP_pick (1556 of 1968) PASS: lldb-api :: functionalities/data-formatter/data-formatter-objc/TestDataFormatterObjCExpr.py (1557 of 1968) PASS: lldb-api :: python_api/frame/get-variables/TestGetVariables.py (1558 of 1968) PASS: lldb-unit :: Symbol/./SymbolTests/TestClangASTImporter.CanImportInvalidType (1559 of 1968) PASS: lldb-unit :: Language/Highlighting/./HighlighterTests/HighlighterTest.ClangUnterminatedString (1560 of 1968) UNSUPPORTED: lldb-api :: functionalities/data-formatter/data-formatter-stl/libstdcpp/unique_ptr/TestDataFormatterStdUniquePtr.py (1561 of 1968) PASS: lldb-api :: commands/expression/argument_passing_restrictions/TestArgumentPassingRestrictions.py (1562 of 1968) PASS: lldb-shell :: SymbolFile/DWARF/gnu-style-compression.cpp (1563 of 1968) PASS: lldb-unit :: Process/gdb-remote/./ProcessGdbRemoteTests/GDBRemoteCommunicationClientTest.GetMemoryRegionInfoInvalidResponse (1564 of 1968) PASS: lldb-api :: lang/cpp/namespace_definitions/TestNamespaceDefinitions.py (1565 of 1968) PASS: lldb-unit :: Utility/./UtilityTests/UriParserTest.SchemeHostSeparator3 (1566 of 1968) PASS: lldb-api :: python_api/module_section/TestModuleAndSection.py (1567 of 1968) PASS: lldb-unit :: Utility/./UtilityTests/StringListTest.ForRange (1568 of 1968) PASS: lldb-api :: commands/expression/test/TestExprs.py (1569 of 1968) UNSUPPORTED: lldb-api :: commands/expression/macros/TestMacros.py (1570 of 1968) PASS: lldb-unit :: Utility/./UtilityTests/ListenerTest.GetEventWait (1571 of 1968) PASS: lldb-shell :: Settings/TestModuleCacheSanity.test (1572 of 1968) PASS: lldb-api :: commands/expression/persist_objc_pointeetype/TestPersistObjCPointeeType.py (1573 of 1968) PASS: lldb-unit :: Utility/./UtilityTests/AnsiTerminal.WhiteSpace (1574 of 1968) PASS: lldb-unit :: ScriptInterpreter/Python/./ScriptInterpreterPythonTests/PythonDataObjectsTest.TestPythonBoolean (1575 of 1968) PASS: lldb-api :: commands/watchpoints/hello_watchpoint/TestMyFirstWatchpoint.py (1576 of 1968) PASS: lldb-unit :: SymbolFile/DWARF/./SymbolFileDWARFTests/SymbolFileDWARFTests.TestAbbrevValidAttrNullForm (1577 of 1968) PASS: lldb-shell :: SymbolFile/DWARF/DW_AT_low_pc-addrx.s (1578 of 1968) PASS: lldb-shell :: SymbolFile/NativePDB/ast-methods.cpp (1579 of 1968) PASS: lldb-shell :: SymbolFile/DWARF/find-qualified-variable.cpp (1580 of 1968) PASS: lldb-api :: commands/expression/import-std-module/weak_ptr/TestWeakPtrFromStdModule.py (1581 of 1968) UNSUPPORTED: lldb-api :: lang/objc/foundation/TestFoundationDisassembly.py (1582 of 1968) PASS: lldb-unit :: Utility/./UtilityTests/LogChannelEnabledTest.LogGetLogThread (1583 of 1968) PASS: lldb-unit :: Target/./TargetTests/MCBasedABI.MapRegisterName (1584 of 1968) PASS: lldb-shell :: Driver/TestSingleQuote.test (1585 of 1968) PASS: lldb-api :: lang/c/vla/TestVLA.py (1586 of 1968) PASS: lldb-api :: tools/lldb-server/TestGdbRemoteExpeditedRegisters.py (1587 of 1968) PASS: lldb-api :: functionalities/data-formatter/data-formatter-objc/TestDataFormatterObjCKVO.py (1588 of 1968) PASS: lldb-shell :: SymbolFile/DWARF/dwo-type-in-main-file.s (1589 of 1968) PASS: lldb-unit :: Utility/./UtilityTests/FileSpecTest.CopyByAppendingPathComponent (1590 of 1968) PASS: lldb-unit :: Utility/./UtilityTests/ScalarTest.APIntConstructor (1591 of 1968) PASS: lldb-api :: macosx/duplicate-archive-members/TestDuplicateMembers.py (1592 of 1968) PASS: lldb-api :: functionalities/memory/cache/TestMemoryCache.py (1593 of 1968) PASS: lldb-shell :: ObjectFile/PECOFF/symbol.yaml (1594 of 1968) PASS: lldb-api :: functionalities/thread/concurrent_events/TestConcurrentBreakpointsDelayedBreakpointOneWatchpoint.py (1595 of 1968) PASS: lldb-api :: python_api/process/read-mem-cstring/TestReadMemCString.py (1596 of 1968) PASS: lldb-unit :: Utility/./UtilityTests/StringListTest.SplitIntoLinesEmpty (1597 of 1968) PASS: lldb-unit :: Utility/./UtilityTests/RegularExpression.Match (1598 of 1968) PASS: lldb-unit :: Utility/./UtilityTests/RegularExpression.Invalid (1599 of 1968) PASS: lldb-unit :: Utility/./UtilityTests/StringListTest.CopyListSingle (1600 of 1968) PASS: lldb-api :: commands/expression/call-function/TestCallBuiltinFunction.py (1601 of 1968) PASS: lldb-unit :: Process/gdb-remote/./ProcessGdbRemoteTests/GDBRemoteCommunicationServerTest.SendErrorResponse_ErrorNumber (1602 of 1968) PASS: lldb-unit :: Utility/./UtilityTests/CompletionRequest.ShiftArguments (1603 of 1968) PASS: lldb-unit :: Utility/./UtilityTests/ProcessInfoTest.Constructor (1604 of 1968) PASS: lldb-unit :: Utility/./UtilityTests/UriParserTest.SchemeHostSeparator2 (1605 of 1968) PASS: lldb-unit :: Utility/./UtilityTests/FileSpecTest.OperatorBool (1606 of 1968) PASS: lldb-api :: commands/reproducer/invalid-args/TestInvalidArgsReproducer.py (1607 of 1968) PASS: lldb-unit :: Utility/./UtilityTests/BinaryStreamTest.PutSLEB128OneByte (1608 of 1968) UNSUPPORTED: lldb-api :: functionalities/darwin_log/filter/exact_match/message/TestDarwinLogFilterMatchMessage.py (1609 of 1968) PASS: lldb-api :: functionalities/gdb_remote_client/TestNoGPacketSupported.py (1610 of 1968) PASS: lldb-api :: functionalities/paths/TestPaths.py (1611 of 1968) PASS: lldb-unit :: Process/gdb-remote/./ProcessGdbRemoteTests/GDBRemoteCommunicationClientTest.SaveRestoreRegistersNoSuffix (1612 of 1968) PASS: lldb-unit :: Symbol/./SymbolTests/TestTypeSystemClang.TestGetTypeClassDeclType (1613 of 1968) PASS: lldb-unit :: Expression/./ExpressionTests/CppModuleConfigurationTest.MissingUsrInclude (1614 of 1968) UNSUPPORTED: lldb-api :: arm/breakpoint-it/TestBreakpointIt.py (1615 of 1968) PASS: lldb-api :: functionalities/data-formatter/summary-string-onfail/Test-rdar-9974002.py (1616 of 1968) PASS: lldb-unit :: UnwindAssembly/x86/./UnwindAssemblyx86Tests/Testx86AssemblyInspectionEngine.TestSubESP (1617 of 1968) PASS: lldb-api :: sanity/TestSettingSkipping.py (1618 of 1968) PASS: lldb-shell :: ObjectFile/MachO/lc_build_version.yaml (1619 of 1968) PASS: lldb-api :: functionalities/data-formatter/var-in-aggregate-misuse/TestVarInAggregateMisuse.py (1620 of 1968) PASS: lldb-unit :: Utility/./UtilityTests/StreamTest.AddressRangeSize (1621 of 1968) PASS: lldb-unit :: Host/./HostTests/SocketTest.DomainGetConnectURI (1622 of 1968) PASS: lldb-unit :: Language/Highlighting/./HighlighterTests/HighlighterTest.ClangCommas (1623 of 1968) PASS: lldb-api :: functionalities/signal/TestSendSignal.py (1624 of 1968) PASS: lldb-api :: python_api/function_symbol/TestSymbolAPI.py (1625 of 1968) PASS: lldb-api :: lang/c/shared_lib/TestSharedLib.py (1626 of 1968) PASS: lldb-unit :: Symbol/./SymbolTests/TestTypeSystemClang.TestGetBasicTypeFromName (1627 of 1968) PASS: lldb-unit :: Utility/./UtilityTests/StringExtractorTest.InitMisc (1628 of 1968) PASS: lldb-unit :: Expression/./ExpressionTests/DiagnosticManagerTest.PutStringSeverities (1629 of 1968) PASS: lldb-shell :: Breakpoint/implicit_const_form_support.test (1630 of 1968) PASS: lldb-api :: functionalities/postmortem/minidump/TestMiniDump.py (1631 of 1968) PASS: lldb-api :: lang/c/set_values/TestSetValues.py (1632 of 1968) PASS: lldb-unit :: SymbolFile/DWARF/./SymbolFileDWARFTests/SymbolFileDWARFTests.TestAbbrevOrder1Start5 (1633 of 1968) PASS: lldb-unit :: Utility/./UtilityTests/StreamTest.PutCharNull (1634 of 1968) PASS: lldb-api :: lang/objc/objc-new-syntax/TestObjCNewSyntaxDictionary.py (1635 of 1968) PASS: lldb-api :: lang/c/find_struct_type/TestFindStructTypes.py (1636 of 1968) PASS: lldb-api :: functionalities/thread/concurrent_events/TestConcurrentBreakpointDelayBreakpointOneSignal.py (1637 of 1968) PASS: lldb-api :: types/TestFloatTypesExpr.py (1638 of 1968) PASS: lldb-unit :: Utility/./UtilityTests/OptionsWithRawTest.EmptyInput (1639 of 1968) PASS: lldb-unit :: Utility/./UtilityTests/StringListTest.AppendStringMove (1640 of 1968) PASS: lldb-unit :: Utility/./UtilityTests/GeneratorTest.Get (1641 of 1968) PASS: lldb-api :: python_api/process/io/TestProcessIO.py (1642 of 1968) UNSUPPORTED: lldb-shell :: SymbolFile/PDB/variables.test (1643 of 1968) PASS: lldb-api :: functionalities/breakpoint/objc/TestObjCBreakpoints.py (1644 of 1968) PASS: lldb-unit :: Symbol/./SymbolTests/TestTypeSystemClang.TestDeletingImplicitCopyCstrDueToMoveCStr (1645 of 1968) PASS: lldb-api :: lang/cpp/stl/TestSTL.py (1646 of 1968) UNSUPPORTED: lldb-shell :: Breakpoint/ppc64-localentry.test (1647 of 1968) PASS: lldb-unit :: Language/Highlighting/./HighlighterTests/HighlighterTest.ClangTrailingBackslashBeforeNewline (1648 of 1968) PASS: lldb-unit :: Utility/./UtilityTests/StreamTest.PutBytesAsRawHex8ToBigEndian (1649 of 1968) UNSUPPORTED: lldb-api :: functionalities/thread/state/TestThreadStates.py (1650 of 1968) PASS: lldb-unit :: ObjectFile/Breakpad/./ObjectFileBreakpadTests/PublicRecord.parse (1651 of 1968) PASS: lldb-api :: commands/apropos/with-process/TestAproposWithProcess.py (1652 of 1968) PASS: lldb-shell :: Quit/TestQuitExitCodeHex0.test (1653 of 1968) PASS: lldb-api :: python_api/process/TestProcessAPI.py (1654 of 1968) PASS: lldb-unit :: Symbol/./SymbolTests/TestTypeSystemClang.TestGetEnumIntegerTypeBasicTypes (1655 of 1968) PASS: lldb-unit :: Process/gdb-remote/./ProcessGdbRemoteTests/GDBRemoteCommunicationClientTest.SendStartTracePacket (1656 of 1968) PASS: lldb-api :: commands/watchpoints/watchpoint_commands/condition/TestWatchpointConditionCmd.py (1657 of 1968) PASS: lldb-unit :: Utility/./UtilityTests/CompletionRequest.Constructor (1658 of 1968) PASS: lldb-unit :: Utility/./UtilityTests/StringListTest.DefaultConstructor (1659 of 1968) PASS: lldb-unit :: Process/gdb-remote/./ProcessGdbRemoteTests/GDBRemoteCommunicationClientTest.SendStopTracePacket (1660 of 1968) PASS: lldb-shell :: Commands/command-backtrace.test (1661 of 1968) PASS: lldb-unit :: Host/./HostTests/NativeProcessProtocolTest.SetBreakpointFailRead (1662 of 1968) PASS: lldb-shell :: ObjectFile/ELF/minidebuginfo-corrupt-xz.yaml (1663 of 1968) PASS: lldb-unit :: Process/gdb-remote/./ProcessGdbRemoteTests/GDBRemoteCommunicationServerTest.SendErrorResponse_StringError (1664 of 1968) PASS: lldb-unit :: Utility/./UtilityTests/StreamTeeTest.SetStreamAtIndexOutOfBounds (1665 of 1968) PASS: lldb-unit :: Utility/./UtilityTests/ProcessInstanceInfoList.Yaml (1666 of 1968) PASS: lldb-api :: python_api/value/empty_class/TestValueAPIEmptyClass.py (1667 of 1968) PASS: lldb-api :: lang/cpp/global_operators/TestCppGlobalOperators.py (1668 of 1968) PASS: lldb-unit :: Host/./HostTests/NativeProcessProtocolTest.ReadCStringFromMemory_CrossPageBoundary (1669 of 1968) PASS: lldb-unit :: UnwindAssembly/x86/./UnwindAssemblyx86Tests/Testx86AssemblyInspectionEngine.TestAddRSP (1670 of 1968) PASS: lldb-unit :: Utility/./UtilityTests/RangeDataVector.FindEntryIndexesThatContain_Overlap (1671 of 1968) PASS: lldb-api :: functionalities/postmortem/netbsd-core/TestNetBSDCore.py (1672 of 1968) PASS: lldb-api :: lang/objc/objc-stepping/TestObjCStepping.py (1673 of 1968) PASS: lldb-api :: commands/expression/unicode-in-variable/TestUnicodeInVariable.py (1674 of 1968) PASS: lldb-unit :: Utility/./UtilityTests/ArgsTest.TestTrailingBackslash (1675 of 1968) PASS: lldb-unit :: Utility/./UtilityTests/UriParserTest.SchemeHostSeparator (1676 of 1968) PASS: lldb-shell :: Reproducer/Functionalities/TestExpressionEvaluation.test (1677 of 1968) PASS: lldb-api :: lang/cpp/symbols/TestSymbols.py (1678 of 1968) PASS: lldb-unit :: Utility/./UtilityTests/StringExtractorTest.GetHexBytes (1679 of 1968) PASS: lldb-unit :: Utility/./UtilityTests/StringListTest.ShiftStdString (1680 of 1968) PASS: lldb-api :: functionalities/data-formatter/nssetsynth/TestNSSetSynthetic.py (1681 of 1968) PASS: lldb-api :: commands/expression/completion/TestExprCompletion.py (1682 of 1968) PASS: lldb-unit :: Expression/./ExpressionTests/DiagnosticManagerTest.PutString (1683 of 1968) PASS: lldb-api :: commands/expression/import-std-module/shared_ptr/TestSharedPtrFromStdModule.py (1684 of 1968) PASS: lldb-api :: commands/expression/import-std-module/list-dbg-info-content/TestDbgInfoContentListFromStdModule.py (1685 of 1968) PASS: lldb-unit :: Process/minidump/./LLDBMinidumpTests/RegisterContextMinidump.ConvertMinidumpContext_x86_32 (1686 of 1968) UNSUPPORTED: lldb-shell :: Register/arm-fp-read.test (1687 of 1968) PASS: lldb-shell :: SymbolFile/DWARF/find-basic-type.cpp (1688 of 1968) PASS: lldb-api :: functionalities/return-value/TestReturnValue.py (1689 of 1968) PASS: lldb-unit :: Utility/./UtilityTests/StreamTest.PutRawBytesToBigEndian (1690 of 1968) PASS: lldb-unit :: Utility/./UtilityTests/UriParserTest.Minimal (1691 of 1968) UNSUPPORTED: lldb-shell :: Register/x86-gp-read.test (1692 of 1968) PASS: lldb-shell :: Driver/TestFile.test (1693 of 1968) PASS: lldb-api :: functionalities/tail_call_frames/ambiguous_tail_call_seq2/TestAmbiguousTailCallSeq2.py (1694 of 1968) PASS: lldb-api :: functionalities/data-formatter/data-formatter-skip-summary/TestDataFormatterSkipSummary.py (1695 of 1968) PASS: lldb-unit :: UnwindAssembly/x86/./UnwindAssemblyx86Tests/Testx86AssemblyInspectionEngine.TestPopRBP (1696 of 1968) PASS: lldb-api :: commands/expression/codegen-crash-typedefdecl-not-in_declcontext/TestCodegenCrashTypedefDeclNotInDeclContext.py (1697 of 1968) PASS: lldb-unit :: Utility/./UtilityTests/UUIDTest.RelationalOperators (1698 of 1968) PASS: lldb-unit :: ObjectFile/ELF/./ObjectFileELFTests/ObjectFileELFTest.GetSymtab_NoSymEntryPointArmAddressClass (1699 of 1968) PASS: lldb-api :: commands/expression/radar_9531204/TestPrintfAfterUp.py (1700 of 1968) UNSUPPORTED: lldb-api :: api/multiple-debuggers/TestMultipleDebuggers.py (1701 of 1968) PASS: lldb-unit :: Interpreter/./InterpreterTests/CompletionTest.FileCompletionAbsolute (1702 of 1968) PASS: lldb-unit :: Utility/./UtilityTests/StreamTest.PutHex32ByteOrderBig (1703 of 1968) PASS: lldb-unit :: Symbol/./SymbolTests/PostfixExpression.ParseOneExpression (1704 of 1968) PASS: lldb-api :: lang/c/local_variables/TestLocalVariables.py (1705 of 1968) PASS: lldb-shell :: SymbolFile/DWARF/inline-function-address.ll (1706 of 1968) UNSUPPORTED: lldb-api :: commands/expression/multiline-navigation/TestMultilineNavigation.py (1707 of 1968) PASS: lldb-api :: lang/objc/modules-inline-functions/TestModulesInlineFunctions.py (1708 of 1968) PASS: lldb-api :: commands/command/script/import/rdar-12586188/TestRdar12586188.py (1709 of 1968) PASS: lldb-unit :: Utility/./UtilityTests/RangeTest.ContainsEndInclusiveInvalid (1710 of 1968) PASS: lldb-unit :: UnwindAssembly/x86/./UnwindAssemblyx86Tests/Testx86AssemblyInspectionEngine.TestSimplei386ugmented (1711 of 1968) PASS: lldb-unit :: Expression/./ExpressionTests/ClangHostTest.MacOSX (1712 of 1968) PASS: lldb-api :: commands/expression/call-function/TestCallStdStringFunction.py (1713 of 1968) PASS: lldb-api :: lang/cpp/template/TestTemplateArgs.py (1714 of 1968) PASS: lldb-shell :: SymbolFile/DWARF/compilercontext.ll (1715 of 1968) PASS: lldb-unit :: Utility/./UtilityTests/FileSpecTest.PrependPathComponent (1716 of 1968) PASS: lldb-shell :: ObjectFile/ELF/aarch64-relocations.yaml (1717 of 1968) PASS: lldb-api :: commands/platform/basic/TestPlatformCommand.py (1718 of 1968) PASS: lldb-api :: lang/objc/objc-ivar-offsets/TestObjCIvarOffsets.py (1719 of 1968) PASS: lldb-api :: lang/objc/objc-builtin-types/TestObjCBuiltinTypes.py (1720 of 1968) PASS: lldb-unit :: ScriptInterpreter/Python/./ScriptInterpreterPythonTests/PythonDataObjectsTest.TestOwnedReferences (1721 of 1968) PASS: lldb-api :: functionalities/reproducers/attach/TestReproducerAttach.py (1722 of 1968) PASS: lldb-unit :: Process/gdb-remote/./ProcessGdbRemoteTests/GDBRemoteCommunicationClientTest.GetModulesInfoInvalidResponse (1723 of 1968) PASS: lldb-api :: lang/cpp/dynamic-value/TestCppValueCast.py (1724 of 1968) PASS: lldb-shell :: Reproducer/Functionalities/TestImageList.test (1725 of 1968) PASS: lldb-unit :: UnwindAssembly/x86/./UnwindAssemblyx86Tests/Testx86AssemblyInspectionEngine.TestPopESI (1726 of 1968) PASS: lldb-api :: functionalities/data-formatter/nsdictionarysynth/TestNSDictionarySynthetic.py (1727 of 1968) UNSUPPORTED: lldb-shell :: ScriptInterpreter/Lua/command_script_import.test (1728 of 1968) PASS: lldb-unit :: Utility/./UtilityTests/StringExtractorTest.GetHexU8_InvalidHex_NoEof (1729 of 1968) PASS: lldb-shell :: SymbolFile/DWARF/debug_rnglists-dwo.s (1730 of 1968) PASS: lldb-unit :: Utility/./UtilityTests/LogTest.Register (1731 of 1968) PASS: lldb-api :: commands/expression/deleting-implicit-copy-constructor/TestDeletingImplicitCopyConstructor.py (1732 of 1968) UNSUPPORTED: lldb-api :: functionalities/data-formatter/data-formatter-stl/libstdcpp/iterator/TestDataFormatterStdIterator.py (1733 of 1968) PASS: lldb-shell :: SymbolFile/DWARF/debug-types-basic.test (1734 of 1968) PASS: lldb-api :: functionalities/data-formatter/data-formatter-stl/libcxx/queue/TestDataFormatterLibcxxQueue.py (1735 of 1968) PASS: lldb-unit :: ScriptInterpreter/Python/./ScriptInterpreterPythonTests/PythonDataObjectsTest.TestPythonString (1736 of 1968) PASS: lldb-unit :: UnwindAssembly/x86/./UnwindAssemblyx86Tests/Testx86AssemblyInspectionEngine.TestPushRBPWithREX (1737 of 1968) PASS: lldb-api :: lang/objc/modules-hash-mismatch/TestClangModulesHashMismatch.py (1738 of 1968) UNSUPPORTED: lldb-api :: functionalities/tsan/thread_numbers/TestTsanThreadNumbers.py (1739 of 1968) UNSUPPORTED: lldb-shell :: ObjectFile/PECOFF/disassemble-thumb.yaml (1740 of 1968) PASS: lldb-unit :: Utility/./UtilityTests/StreamTest.ShiftOperatorChars (1741 of 1968) PASS: lldb-unit :: Utility/./UtilityTests/StringLexerTest.HasAtLeast (1742 of 1968) PASS: lldb-api :: functionalities/data-formatter/typedef_array/TestTypedefArray.py (1743 of 1968) PASS: lldb-unit :: Utility/./UtilityTests/StreamTest.Indent (1744 of 1968) PASS: lldb-api :: commands/expression/scoped_enums/TestScopedEnumType.py (1745 of 1968) PASS: lldb-api :: lang/cpp/inlines/TestInlines.py (1746 of 1968) UNSUPPORTED: lldb-shell :: Expr/TestIRMemoryMapWindows.test (1747 of 1968) PASS: lldb-unit :: Utility/./UtilityTests/RecordReplayTest.InstrumentedBar (1748 of 1968) PASS: lldb-unit :: Utility/./UtilityTests/CompletionRequest.TryCompleteCurrentArgGood (1749 of 1968) UNSUPPORTED: lldb-shell :: SymbolFile/DWARF/debug-types-expressions.test (1750 of 1968) PASS: lldb-api :: lang/objc/modules-non-objc-target/TestObjCModulesNonObjCTarget.py (1751 of 1968) UNSUPPORTED: lldb-api :: functionalities/param_entry_vals/basic_entry_values_x86_64/TestBasicEntryValuesX86_64.py (1752 of 1968) UNSUPPORTED: lldb-api :: benchmarks/turnaround/TestCompileRunToBreakpointTurnaround.py (1753 of 1968) PASS: lldb-unit :: Symbol/./SymbolTests/TestTypeSystemClang.TestGetEnumIntegerTypeUnexpectedType (1754 of 1968) PASS: lldb-api :: functionalities/data-formatter/data-formatter-disabling/TestDataFormatterDisabling.py (1755 of 1968) UNSUPPORTED: lldb-api :: commands/expression/call-restarts/TestCallThatRestarts.py (1756 of 1968) PASS: lldb-api :: tools/lldb-server/TestLldbGdbServer.py (1757 of 1968) PASS: lldb-unit :: Symbol/./SymbolTests/TestTypeSystemClang.TestGetBasicTypeFromEnum (1758 of 1968) PASS: lldb-unit :: Utility/./UtilityTests/OptionsWithRawTest.EmptySuffix (1759 of 1968) PASS: lldb-unit :: Utility/./UtilityTests/ScalarTest.GetBytes (1760 of 1968) PASS: lldb-unit :: Utility/./UtilityTests/BinaryStreamTest.PutSLEB128ThreeBytes (1761 of 1968) PASS: lldb-unit :: Utility/./UtilityTests/StreamTest.AddressSuffix (1762 of 1968) PASS: lldb-api :: source-manager/TestSourceManager.py (1763 of 1968) PASS: lldb-shell :: ObjectFile/ELF/netbsd-core-amd64.test (1764 of 1968) PASS: lldb-unit :: Utility/./UtilityTests/StringLexerTest.GetUnlexed (1765 of 1968) PASS: lldb-unit :: UnwindAssembly/x86/./UnwindAssemblyx86Tests/Testx86AssemblyInspectionEngine.TestPushR12 (1766 of 1968) PASS: lldb-shell :: SymbolFile/DWARF/debug-types-address-ranges.s (1767 of 1968) PASS: lldb-unit :: Utility/./UtilityTests/StringExtractorTest.GetHexBytesAvail_Partial (1768 of 1968) PASS: lldb-unit :: Utility/./UtilityTests/NameMatchesTest.RegularExpression (1769 of 1968) PASS: lldb-api :: functionalities/thread/concurrent_events/TestConcurrentTwoBreakpointThreads.py (1770 of 1968) PASS: lldb-api :: python_api/value/linked_list/TestValueAPILinkedList.py (1771 of 1968) PASS: lldb-unit :: Utility/./UtilityTests/ScalarTest.Division (1772 of 1968) PASS: lldb-api :: commands/expression/persistent_types/TestPersistentTypes.py (1773 of 1968) PASS: lldb-api :: lang/objc/foundation/TestObjCMethodsNSArray.py (1774 of 1968) UNSUPPORTED: lldb-api :: benchmarks/libcxxlist/TestBenchmarkLibcxxList.py (1775 of 1968) PASS: lldb-unit :: Utility/./UtilityTests/AnsiTerminal.Incomplete (1776 of 1968) PASS: lldb-shell :: SymbolFile/DWARF/deterministic-build.cpp (1777 of 1968) PASS: lldb-api :: functionalities/inline-stepping/TestInlineStepping.py (1778 of 1968) PASS: lldb-api :: commands/expression/dollar-in-variable/TestDollarInVariable.py (1779 of 1968) PASS: lldb-shell :: Process/TestEnvironment.test (1780 of 1968) PASS: lldb-api :: commands/expression/import_builtin_fileid/TestImportBuiltinFileID.py (1781 of 1968) PASS: lldb-api :: functionalities/breakpoint/require_hw_breakpoints/TestRequireHWBreakpoints.py (1782 of 1968) PASS: lldb-unit :: Utility/./UtilityTests/RangeTest.DoesIntersect (1783 of 1968) PASS: lldb-unit :: Process/minidump/./LLDBMinidumpTests/MinidumpParserTest.GetThreadContext_x86_32_wow64 (1784 of 1968) PASS: lldb-api :: functionalities/breakpoint/breakpoint_by_line_and_column/TestBreakpointByLineAndColumn.py (1785 of 1968) PASS: lldb-api :: functionalities/gdb_remote_client/TestStopPCs.py (1786 of 1968) PASS: lldb-unit :: Utility/./UtilityTests/StatusTest.ErrorConstructor (1787 of 1968) UNSUPPORTED: lldb-api :: tools/lldb-server/TestGdbRemote_vContThreads.py (1788 of 1968) PASS: lldb-api :: functionalities/data-formatter/data-formatter-stl/libcxx/multimap/TestDataFormatterLibccMultiMap.py (1789 of 1968) PASS: lldb-api :: functionalities/data-formatter/data-formatter-objc/TestDataFormatterObjCNSBundle.py (1790 of 1968) PASS: lldb-api :: commands/expression/unwind_expression/TestUnwindExpression.py (1791 of 1968) PASS: lldb-shell :: SymbolFile/DWARF/find-variable-file.cpp (1792 of 1968) PASS: lldb-unit :: tools/lldb-server/tests/./LLDBServerTests/TestBase.DebugserverEnv (1793 of 1968) PASS: lldb-unit :: Utility/./UtilityTests/StreamTest.AddressPrefixAndSuffix (1794 of 1968) PASS: lldb-unit :: Utility/./UtilityTests/OptionsWithRawTest.UnterminatedQuote (1795 of 1968) PASS: lldb-api :: tools/lldb-vscode/attach/TestVSCode_attach.py (1796 of 1968) UNSUPPORTED: lldb-api :: lang/cpp/static_members/TestCPPStaticMembers.py (1797 of 1968) PASS: lldb-shell :: Minidump/Windows/find-module.test (1798 of 1968) PASS: lldb-unit :: Language/Highlighting/./HighlighterTests/HighlighterTest.FallbackHighlighter (1799 of 1968) PASS: lldb-unit :: Core/./LLDBCoreTests/MangledTest.ResultForValidName (1800 of 1968) PASS: lldb-api :: lang/objc/objc-optimized/TestObjcOptimized.py (1801 of 1968) PASS: lldb-api :: tools/lldb-vscode/breakpoint/TestVSCode_setFunctionBreakpoints.py (1802 of 1968) UNSUPPORTED: lldb-shell :: SymbolFile/PDB/compilands.test (1803 of 1968) PASS: lldb-api :: functionalities/postmortem/minidump-new/TestMiniDumpUUID.py (1804 of 1968) PASS: lldb-api :: lang/cpp/frame-var-anon-unions/TestFrameVariableAnonymousUnions.py (1805 of 1968) PASS: lldb-shell :: SymbolFile/DWARF/split-dwarf-multiple-cu.ll (1806 of 1968) PASS: lldb-unit :: Expression/./ExpressionTests/DWARFExpression.DW_OP_convert (1807 of 1968) PASS: lldb-unit :: Symbol/./SymbolTests/TestTypeSystemClang.TemplateArguments (1808 of 1968) PASS: lldb-unit :: Language/Highlighting/./HighlighterTests/HighlighterTest.ClangScalarLiterals (1809 of 1968) PASS: lldb-shell :: Breakpoint/debug_addrx.test (1810 of 1968) PASS: lldb-api :: lang/objc/orderedset/TestOrderedSet.py (1811 of 1968) PASS: lldb-unit :: Host/./HostTests/FileSystemTest.GetPermissions (1812 of 1968) UNSUPPORTED: lldb-api :: benchmarks/stepping/TestSteppingSpeed.py (1813 of 1968) PASS: lldb-api :: functionalities/inferior-crashing/TestInferiorCrashingStep.py (1814 of 1968) PASS: lldb-shell :: Commands/command-thread-select.test (1815 of 1968) PASS: lldb-unit :: Utility/./UtilityTests/StringListTest.JoinEmpty (1816 of 1968) PASS: lldb-api :: functionalities/data-formatter/dump_dynamic/TestDumpDynamic.py (1817 of 1968) PASS: lldb-api :: lang/c/modules/TestCModules.py (1818 of 1968) PASS: lldb-unit :: Utility/./UtilityTests/StreamTest.AddressSize (1819 of 1968) PASS: lldb-shell :: ObjectFile/wasm/embedded-debug-sections.yaml (1820 of 1968) PASS: lldb-shell :: ObjectFile/wasm/basic.yaml (1821 of 1968) PASS: lldb-unit :: UnwindAssembly/x86/./UnwindAssemblyx86Tests/Testx86AssemblyInspectionEngine.TestSpillRegToStackViaMOVi386 (1822 of 1968) PASS: lldb-unit :: Utility/./UtilityTests/Flags.AllSet (1823 of 1968) PASS: lldb-unit :: Process/minidump/./LLDBMinidumpTests/MinidumpParserTest.GetMemoryRegionInfoFromMemory64List (1824 of 1968) PASS: lldb-api :: functionalities/var_path/TestVarPath.py (1825 of 1968) PASS: lldb-api :: python_api/default-constructor/TestDefaultConstructorForAPIObjects.py (1826 of 1968) PASS: lldb-api :: functionalities/breakpoint/breakpoint_command/TestRegexpBreakCommand.py (1827 of 1968) PASS: lldb-unit :: Process/gdb-remote/./ProcessGdbRemoteTests/GDBRemoteCommunicationClientTest.ReadRegister (1828 of 1968) PASS: lldb-unit :: Utility/./UtilityTests/BinaryStreamTest.PutULEB128TwoBytes (1829 of 1968) PASS: lldb-unit :: Process/minidump/./LLDBMinidumpTests/MinidumpParserTest.MinidumpDuplicateModuleMinAddress (1830 of 1968) PASS: lldb-api :: macosx/queues/TestQueues.py (1831 of 1968) PASS: lldb-unit :: Utility/./UtilityTests/BinaryStreamTest.PutULEB128EightBytes (1832 of 1968) XFAIL: lldb-shell :: Register/x86-64-write.test (1833 of 1968) PASS: lldb-unit :: Process/minidump/./LLDBMinidumpTests/MinidumpParserTest.GetFilteredModuleList (1834 of 1968) PASS: lldb-unit :: Process/minidump/./LLDBMinidumpTests/MinidumpParserTest.GetPidWow64 (1835 of 1968) PASS: lldb-shell :: SymbolFile/NativePDB/disassembly.cpp (1836 of 1968) PASS: lldb-unit :: SymbolFile/NativePDB/./SymbolFileNativePDBTests/PDBFPOProgramToDWARFExpressionTests.UnresolvedRegisterReference (1837 of 1968) PASS: lldb-unit :: ScriptInterpreter/Python/./ScriptInterpreterPythonTests/PythonDataObjectsTest.TestExtractingUInt64ThroughStructuredData (1838 of 1968) PASS: lldb-unit :: Utility/./UtilityTests/StringExtractorTest.GetNameColonValueContainsColon (1839 of 1968) PASS: lldb-api :: functionalities/mtc/simple/TestMTCSimple.py (1840 of 1968) UNSUPPORTED: lldb-shell :: ScriptInterpreter/Lua/persistent_state.test (1841 of 1968) PASS: lldb-api :: commands/expression/xvalue/TestXValuePrinting.py (1842 of 1968) PASS: lldb-api :: lang/c/unions/TestUnionMembers.py (1843 of 1968) PASS: lldb-shell :: SymbolFile/Breakpad/line-table-missing-file.test (1844 of 1968) PASS: lldb-unit :: Utility/./UtilityTests/DataExtractorTest.PeekData (1845 of 1968) PASS: lldb-api :: functionalities/tail_call_frames/sbapi_support/TestTailCallFrameSBAPI.py (1846 of 1968) PASS: lldb-api :: commands/gui/invalid-args/TestInvalidArgsGui.py (1847 of 1968) PASS: lldb-unit :: Utility/./UtilityTests/AnsiTerminal.Unknown (1848 of 1968) PASS: lldb-api :: commands/expression/po_verbosity/TestPoVerbosity.py (1849 of 1968) UNSUPPORTED: lldb-api :: functionalities/thread/concurrent_events/TestConcurrentManySignals.py (1850 of 1968) UNSUPPORTED: lldb-api :: commands/register/register/intel_xtended_registers/mpx_bound_violation/TestBoundViolation.py (1851 of 1968) PASS: lldb-unit :: debugserver/./debugserverTests/RNBSocket.LoopBackListenIPv6 (1852 of 1968) PASS: lldb-api :: lang/objc/objc-static-method-stripped/TestObjCStaticMethodStripped.py (1853 of 1968) PASS: lldb-shell :: Quit/TestQuitExitCode0.test (1854 of 1968) PASS: lldb-unit :: ScriptInterpreter/Python/./ScriptInterpreterPythonTests/PythonDataObjectsTest.TestTypeNameResolutionNoDot (1855 of 1968) PASS: lldb-unit :: Utility/./UtilityTests/StringListTest.GetMaxStringLengthEmpty (1856 of 1968) PASS: lldb-api :: functionalities/data-formatter/data-formatter-python-synth/TestDataFormatterPythonSynth.py (1857 of 1968) PASS: lldb-shell :: SymbolFile/Breakpad/symtab-macho.test (1858 of 1968) PASS: lldb-unit :: Symbol/./SymbolTests/TestTypeSystemClang.TestDisplayNameEmpty (1859 of 1968) PASS: lldb-unit :: Utility/./UtilityTests/RangeTest.Union (1860 of 1968) PASS: lldb-unit :: Language/Highlighting/./HighlighterTests/HighlighterTest.ClangPreserveNewLine (1861 of 1968) PASS: lldb-unit :: Utility/./UtilityTests/RangeTest.NotEqual (1862 of 1968) PASS: lldb-api :: functionalities/gdb_remote_client/TestPlatformClient.py (1863 of 1968) PASS: lldb-api :: lang/objc/objc-static-method/TestObjCStaticMethod.py (1864 of 1968) PASS: lldb-api :: functionalities/data-formatter/data-formatter-objc/TestDataFormatterObjCNSDate.py (1865 of 1968) FAIL: lldb-api :: lang/objc/ptr_refs/TestPtrRefsObjC.py (1866 of 1968) ******************** TEST 'lldb-api :: lang/objc/ptr_refs/TestPtrRefsObjC.py' FAILED ******************** Script: -- /usr/local/bin/python /Users/buildslave/jenkins/workspace/lldb-cmake-sanitized/llvm-project/lldb/test/API/dotest.py --arch x86_64 -s /Users/buildslave/jenkins/workspace/lldb-cmake-sanitized/lldb-build/lldb-test-traces -S nm -u CXXFLAGS -u CFLAGS --codesign-identity lldb_codesign --server /Users/buildslave/jenkins/workspace/lldb-cmake-sanitized/lldb-build/./bin/debugserver --arch x86_64 --build-dir /Users/buildslave/jenkins/workspace/lldb-cmake-sanitized/lldb-build/lldb-test-build.noindex -s=/Users/buildslave/jenkins/workspace/lldb-cmake-sanitized/test/logs -t --env TERM=vt100 --env LLVM_LIBS_DIR=/Users/buildslave/jenkins/workspace/lldb-cmake-sanitized/lldb-build/./lib --inferior-env ASAN_OPTIONS=detect_stack_use_after_return=1 --inferior-env DYLD_INSERT_LIBRARIES=/Users/buildslave/jenkins/workspace/lldb-cmake-sanitized/host-compiler/lib/clang/11.0.0/lib/darwin/libclang_rt.asan_osx_dynamic.dylib --build-dir /Users/buildslave/jenkins/workspace/lldb-cmake-sanitized/lldb-build/lldb-test-build.noindex --lldb-module-cache-dir /Users/buildslave/jenkins/workspace/lldb-cmake-sanitized/lldb-build/lldb-test-build.noindex/module-cache-lldb/lldb-api --clang-module-cache-dir /Users/buildslave/jenkins/workspace/lldb-cmake-sanitized/lldb-build/lldb-test-build.noindex/module-cache-clang/lldb-api --executable /Users/buildslave/jenkins/workspace/lldb-cmake-sanitized/lldb-build/./bin/lldb --compiler /Users/buildslave/jenkins/workspace/lldb-cmake-sanitized/lldb-build/./bin/clang --dsymutil /Users/buildslave/jenkins/workspace/lldb-cmake-sanitized/lldb-build/./bin/dsymutil --filecheck /Users/buildslave/jenkins/workspace/lldb-cmake-sanitized/lldb-build/./bin/FileCheck --lldb-libs-dir /Users/buildslave/jenkins/workspace/lldb-cmake-sanitized/lldb-build/./lib /Users/buildslave/jenkins/workspace/lldb-cmake-sanitized/llvm-project/lldb/test/API/lang/objc/ptr_refs -p TestPtrRefsObjC.py -- Exit Code: 1

Hide Details

Command Output (stdout): -- lldb version 11.0.99 clang revision e79b1ab65b8d4d780f824d138a8f597aed9be766 llvm revision e79b1ab65b8d4d780f824d138a8f597aed9be766 "crashlog" and "save_crashlog" command installed, use the "--help" option for detailed help "malloc_info", "ptr_refs", "cstr_refs", "find_variable", and "objc_refs" commands have been installed, use the "--help" options on these commands for detailed help. LLDB library dir: /Users/buildslave/jenkins/workspace/lldb-cmake-sanitized/lldb-build/bin LLDB import library dir: /Users/buildslave/jenkins/workspace/lldb-cmake-sanitized/lldb-build/./lib libstdcxx tests will not be run because: Don't know how to build with libstdcxx on macosx Skipping following debug info categories: ['dwo'] 0x00007ffeea11e468: stack in frame #0 of thread #1: tid 0x46df7 in variable at 0x7ffeea11e468: (MyClass *) self = 0x00006020000000d0 0x00007ffeea11e3e0: stack (red zone)

Hide Details

-- Command Output (stderr): -- error: 'ptr_refs' is not a valid command. error: 'ptr_refs' is not a valid command.

Hide Details

Session logs for test failures/errors/unexpected successes will go into directory '/Users/buildslave/jenkins/workspace/lldb-cmake-sanitized/test/logs' Command invoked: /Users/buildslave/jenkins/workspace/lldb-cmake-sanitized/llvm-project/lldb/test/API/dotest.py --arch x86_64 -s /Users/buildslave/jenkins/workspace/lldb-cmake-sanitized/lldb-build/lldb-test-traces -S nm -u CXXFLAGS -u CFLAGS --codesign-identity lldb_codesign --server /Users/buildslave/jenkins/workspace/lldb-cmake-sanitized/lldb-build/./bin/debugserver --arch x86_64 --build-dir /Users/buildslave/jenkins/workspace/lldb-cmake-sanitized/lldb-build/lldb-test-build.noindex -s=/Users/buildslave/jenkins/workspace/lldb-cmake-sanitized/test/logs -t --env TERM=vt100 --env LLVM_LIBS_DIR=/Users/buildslave/jenkins/workspace/lldb-cmake-sanitized/lldb-build/./lib --inferior-env ASAN_OPTIONS=detect_stack_use_after_return=1 --inferior-env DYLD_INSERT_LIBRARIES=/Users/buildslave/jenkins/workspace/lldb-cmake-sanitized/host-compiler/lib/clang/11.0.0/lib/darwin/libclang_rt.asan_osx_dynamic.dylib --build-dir /Users/buildslave/jenkins/workspace/lldb-cmake-sanitized/lldb-build/lldb-test-build.noindex --lldb-module-cache-dir /Users/buildslave/jenkins/workspace/lldb-cmake-sanitized/lldb-build/lldb-test-build.noindex/module-cache-lldb/lldb-api --clang-module-cache-dir /Users/buildslave/jenkins/workspace/lldb-cmake-sanitized/lldb-build/lldb-test-build.noindex/module-cache-clang/lldb-api --executable /Users/buildslave/jenkins/workspace/lldb-cmake-sanitized/lldb-build/./bin/lldb --compiler /Users/buildslave/jenkins/workspace/lldb-cmake-sanitized/lldb-build/./bin/clang --dsymutil /Users/buildslave/jenkins/workspace/lldb-cmake-sanitized/lldb-build/./bin/dsymutil --filecheck /Users/buildslave/jenkins/workspace/lldb-cmake-sanitized/lldb-build/./bin/FileCheck --lldb-libs-dir /Users/buildslave/jenkins/workspace/lldb-cmake-sanitized/lldb-build/./lib /Users/buildslave/jenkins/workspace/lldb-cmake-sanitized/llvm-project/lldb/test/API/lang/objc/ptr_refs -p TestPtrRefsObjC.py Change dir to: /Users/buildslave/jenkins/workspace/lldb-cmake-sanitized/llvm-project/lldb/test/API/lang/objc/ptr_refs runCmd: settings clear -all output:

Hide Details

runCmd: settings set symbols.enable-external-lookup false output:

Hide Details

runCmd: settings set target.auto-apply-fixits false output:

Hide Details

runCmd: settings set plugin.process.gdb-remote.packet-timeout 60 output:

Hide Details

runCmd: settings set symbols.clang-modules-cache-path "/Users/buildslave/jenkins/workspace/lldb-cmake-sanitized/lldb-build/lldb-test-build.noindex/module-cache-lldb/lldb-api" output:

Hide Details

runCmd: settings set use-color false output:

Hide Details

runCmd: setting set target.prefer-dynamic-value no-dynamic-values output:

Hide Details

runCmd: settings set target.env-vars ASAN_OPTIONS=detect_stack_use_after_return=1 DYLD_INSERT_LIBRARIES=/Users/buildslave/jenkins/workspace/lldb-cmake-sanitized/host-compiler/lib/clang/11.0.0/lib/darwin/libclang_rt.asan_osx_dynamic.dylib output:

Hide Details

runCmd: script import lldb.macosx.heap output: "crashlog" and "save_crashlog" command installed, use the "--help" option for detailed help "malloc_info", "ptr_refs", "cstr_refs", "find_variable", and "objc_refs" commands have been installed, use the "--help" options on these commands for detailed help.

Hide Details

Hide Details

runCmd: ptr_refs self output: 0x00007ffeea11e468: stack in frame #0 of thread #1: tid 0x46df7 in variable at 0x7ffeea11e468: (MyClass *) self = 0x00006020000000d0 0x00007ffeea11e3e0: stack (red zone)

Hide Details

Hide Details

Expecting sub string: malloc Not matched

Hide Details

FAIL: LLDB (/Users/buildslave/jenkins/workspace/lldb-cmake-sanitized/lldb-build/bin/clang-11-x86_64) :: test_ptr_refs_dsym (TestPtrRefsObjC.TestPtrRefsObjC) <bound method SBProcess.Kill of <lldb.SBProcess; proxy of <Swig Object of type 'lldb::SBProcess *' at 0x11082a8a0> >>: success

Hide Details

runCmd: settings clear -all output:

Hide Details

runCmd: settings set symbols.enable-external-lookup false output:

Hide Details

runCmd: settings set target.auto-apply-fixits false output:

Hide Details

runCmd: settings set plugin.process.gdb-remote.packet-timeout 60 output:

Hide Details

runCmd: settings set symbols.clang-modules-cache-path "/Users/buildslave/jenkins/workspace/lldb-cmake-sanitized/lldb-build/lldb-test-build.noindex/module-cache-lldb/lldb-api" output:

Hide Details

runCmd: settings set use-color false output:

Hide Details

runCmd: setting set target.prefer-dynamic-value no-dynamic-values output:

Hide Details

runCmd: settings set target.env-vars ASAN_OPTIONS=detect_stack_use_after_return=1 DYLD_INSERT_LIBRARIES=/Users/buildslave/jenkins/workspace/lldb-cmake-sanitized/host-compiler/lib/clang/11.0.0/lib/darwin/libclang_rt.asan_osx_dynamic.dylib output:

Hide Details

runCmd: script import lldb.macosx.heap output:

Hide Details

runCmd: ptr_refs self runCmd failed! error: 'ptr_refs' is not a valid command.

Hide Details

Hide Details

XFAIL: LLDB (/Users/buildslave/jenkins/workspace/lldb-cmake-sanitized/lldb-build/bin/clang-11-x86_64) :: test_ptr_refs_dwarf (TestPtrRefsObjC.TestPtrRefsObjC) <bound method SBProcess.Kill of <lldb.SBProcess; proxy of <Swig Object of type 'lldb::SBProcess *' at 0x10fbdf990> >>: success

Hide Details

UNSUPPORTED: LLDB (/Users/buildslave/jenkins/workspace/lldb-cmake-sanitized/lldb-build/bin/clang-11-x86_64) :: test_ptr_refs_dwo (TestPtrRefsObjC.TestPtrRefsObjC) (test case does not fall in any category of interest for this run) runCmd: settings clear -all output:

Hide Details

runCmd: settings set symbols.enable-external-lookup false output:

Hide Details

runCmd: settings set target.auto-apply-fixits false output:

Hide Details

runCmd: settings set plugin.process.gdb-remote.packet-timeout 60 output:

Hide Details

runCmd: settings set symbols.clang-modules-cache-path "/Users/buildslave/jenkins/workspace/lldb-cmake-sanitized/lldb-build/lldb-test-build.noindex/module-cache-lldb/lldb-api" output:

Hide Details

runCmd: settings set use-color false output:

Hide Details

runCmd: setting set target.prefer-dynamic-value no-dynamic-values output:

Hide Details

runCmd: settings set target.env-vars ASAN_OPTIONS=detect_stack_use_after_return=1 DYLD_INSERT_LIBRARIES=/Users/buildslave/jenkins/workspace/lldb-cmake-sanitized/host-compiler/lib/clang/11.0.0/lib/darwin/libclang_rt.asan_osx_dynamic.dylib output:

Hide Details

runCmd: script import lldb.macosx.heap output:

Hide Details

runCmd: ptr_refs self runCmd failed! error: 'ptr_refs' is not a valid command.

Hide Details

Hide Details

XFAIL: LLDB (/Users/buildslave/jenkins/workspace/lldb-cmake-sanitized/lldb-build/bin/clang-11-x86_64) :: test_ptr_refs_gmodules (TestPtrRefsObjC.TestPtrRefsObjC) <bound method SBProcess.Kill of <lldb.SBProcess; proxy of <Swig Object of type 'lldb::SBProcess *' at 0x11082a1e0> >>: success

Hide Details

Restore dir to: /Users/buildslave/jenkins/workspace/lldb-cmake-sanitized/lldb-build/tools/lldb/test ====================================================================== FAIL: test_ptr_refs_dsym (TestPtrRefsObjC.TestPtrRefsObjC) Test the ptr_refs tool on Darwin with Objective-C ---------------------------------------------------------------------- Traceback (most recent call last): File "/Users/buildslave/jenkins/workspace/lldb-cmake-sanitized/llvm-project/lldb/packages/Python/lldbsuite/test/lldbtest.py", line 1751, in test_method return attrvalue(self) File "/Users/buildslave/jenkins/workspace/lldb-cmake-sanitized/llvm-project/lldb/packages/Python/lldbsuite/test/decorators.py", line 110, in wrapper func(*args, **kwargs) File "/Users/buildslave/jenkins/workspace/lldb-cmake-sanitized/llvm-project/lldb/test/API/lang/objc/ptr_refs/TestPtrRefsObjC.py", line 47, in test_ptr_refs self.expect("ptr_refs self", substrs=["malloc", "stack"]) File "/Users/buildslave/jenkins/workspace/lldb-cmake-sanitized/llvm-project/lldb/packages/Python/lldbsuite/test/lldbtest.py", line 2391, in expect if msg else EXP_MSG(str, output, exe)) AssertionError: False is not True : 'ptr_refs self' returns expected result, got '0x00007ffeea11e468: stack in frame #0 of thread #1: tid 0x46df7 in variable at 0x7ffeea11e468: (MyClass *) self = 0x00006020000000d0 0x00007ffeea11e3e0: stack (red zone)' Config=x86_64-/Users/buildslave/jenkins/workspace/lldb-cmake-sanitized/lldb-build/bin/clang-11 ---------------------------------------------------------------------- Ran 4 tests in 22.892s

Hide Details

RESULT: FAILED (0 passes, 1 failures, 0 errors, 1 skipped, 2 expected failures, 0 unexpected successes)

Hide Details

--

Hide Details

******************** PASS: lldb-unit :: Utility/./UtilityTests/StringListTest.LongestCommonPrefix (1867 of 1968) PASS: lldb-unit :: Utility/./UtilityTests/StreamTest.PutChar (1868 of 1968) UNSUPPORTED: lldb-api :: python_api/disassemble-raw-data/TestDisassemble_VST1_64.py (1869 of 1968) PASS: lldb-unit :: Utility/./UtilityTests/StringListTest.AppendStringCString (1870 of 1968) PASS: lldb-unit :: Utility/./UtilityTests/Predicate.WaitForValueNotEqualTo (1871 of 1968) PASS: lldb-api :: python_api/lldbutil/iter/TestRegistersIterator.py (1872 of 1968) PASS: lldb-unit :: Process/minidump/./LLDBMinidumpTests/MinidumpParserTest.GetLinuxProcStatus (1873 of 1968) PASS: lldb-unit :: Core/./LLDBCoreTests/MangledTest.NameIndexes_FindFunctionSymbols (1874 of 1968) UNSUPPORTED: lldb-api :: commands/watchpoints/variable_out_of_scope/TestWatchedVarHitWhenInScope.py (1875 of 1968) PASS: lldb-api :: python_api/objc_type/TestObjCType.py (1876 of 1968) PASS: lldb-api :: commands/disassemble/basic/TestFrameDisassemble.py (1877 of 1968) PASS: lldb-api :: python_api/breakpoint/TestBreakpointAPI.py (1878 of 1968) PASS: lldb-api :: functionalities/data-formatter/data-formatter-script/TestDataFormatterScript.py (1879 of 1968) PASS: lldb-api :: lang/objc/objc-dyn-sbtype/TestObjCDynamicSBType.py (1880 of 1968) PASS: lldb-api :: commands/register/register/register_command/TestRegisters.py (1881 of 1968) PASS: lldb-unit :: Utility/./UtilityTests/StreamTest.AddressNoSuffix (1882 of 1968) PASS: lldb-unit :: Utility/./UtilityTests/SerializationRountripTest.SerializeDeserializeCStringArrayNullptr (1883 of 1968) PASS: lldb-unit :: Platform/./LLDBPlatformTests/PlatformDarwinTest.FindComponentInPath (1884 of 1968) PASS: lldb-unit :: Utility/./UtilityTests/ArgsTest.GetArgumentArrayRef (1885 of 1968) PASS: lldb-unit :: Expression/./ExpressionTests/CppModuleConfigurationTest.Linux (1886 of 1968) PASS: lldb-api :: commands/frame/var/TestFrameVar.py (1887 of 1968) PASS: lldb-unit :: Language/Highlighting/./HighlighterTests/HighlighterTest.ClangCursorOutOfBounds (1888 of 1968) PASS: lldb-api :: functionalities/data-formatter/data-formatter-stl/libcxx/string/TestDataFormatterLibcxxString.py (1889 of 1968) UNSUPPORTED: lldb-shell :: SymbolFile/PDB/vbases.test (1890 of 1968) PASS: lldb-unit :: Utility/./UtilityTests/OptionsWithRawTest.SingleWhitespaceInput (1891 of 1968) PASS: lldb-unit :: Utility/./UtilityTests/RangeTest.LessThanInvalid (1892 of 1968) PASS: lldb-unit :: Utility/./UtilityTests/BinaryStreamTest.PutSLEB128Zero (1893 of 1968) PASS: lldb-api :: functionalities/thread/backtrace_limit/TestBacktraceLimit.py (1894 of 1968) PASS: lldb-unit :: ScriptInterpreter/Python/./ScriptInterpreterPythonTests/PythonDataObjectsTest.TestPythonByteArray (1895 of 1968) PASS: lldb-unit :: Host/./HostTests/MainLoopTest.TerminatesImmediately (1896 of 1968) PASS: lldb-unit :: Utility/./UtilityTests/FileSpecTest.EqualSeparator (1897 of 1968) PASS: lldb-unit :: Utility/./UtilityTests/RangeTest.Copy (1898 of 1968) PASS: lldb-unit :: Utility/./UtilityTests/Flags.Test (1899 of 1968) PASS: lldb-shell :: ObjectFile/wasm/unified-debug-sections.yaml (1900 of 1968) UNSUPPORTED: lldb-api :: python_api/event/TestEvents.py (1901 of 1968) PASS: lldb-api :: lang/c/inlines/TestRedefinitionsInInlines.py (1902 of 1968) PASS: lldb-unit :: Utility/./UtilityTests/StringListTest.ShiftCString (1903 of 1968) PASS: lldb-shell :: Reproducer/TestCrash.test (1904 of 1968) PASS: lldb-shell :: ScriptInterpreter/None/none.test (1905 of 1968) PASS: lldb-api :: functionalities/avoids-fd-leak/TestFdLeak.py (1906 of 1968) PASS: lldb-api :: functionalities/data-formatter/data-formatter-stl/libcxx/vector/TestDataFormatterLibcxxVector.py (1907 of 1968) PASS: lldb-api :: lang/cpp/gmodules-templates/TestGModules.py (1908 of 1968) PASS: lldb-unit :: Expression/./ExpressionTests/ClangHostTest.ComputeClangResourceDirectory (1909 of 1968) PASS: lldb-shell :: SymbolFile/DWARF/dir-separator-no-comp-dir-relative-name.s (1910 of 1968) PASS: lldb-api :: commands/process/attach/TestProcessAttach.py (1911 of 1968) PASS: lldb-api :: commands/expression/import-std-module/forward_list/TestForwardListFromStdModule.py (1912 of 1968) PASS: lldb-shell :: SymbolFile/DWARF/debug_line-relative_path.s (1913 of 1968) PASS: lldb-unit :: Utility/./UtilityTests/UriParserTest.MinimalPort (1914 of 1968) PASS: lldb-api :: commands/watchpoints/watchpoint_size/TestWatchpointSizes.py (1915 of 1968) PASS: lldb-api :: tools/lldb-server/TestAppleSimulatorOSType.py (1916 of 1968) PASS: lldb-api :: functionalities/load_using_paths/TestLoadUsingPaths.py (1917 of 1968) PASS: lldb-api :: python_api/sbenvironment/TestSBEnvironment.py (1918 of 1968) PASS: lldb-api :: functionalities/type_lookup/TestTypeLookup.py (1919 of 1968) PASS: lldb-api :: terminal/TestSTTYBeforeAndAfter.py (1920 of 1968) PASS: lldb-shell :: SymbolFile/DWARF/dwarf5-atomic.s (1921 of 1968) PASS: lldb-unit :: Expression/./ExpressionTests/DiagnosticManagerTest.GetStringMultipleDiags (1922 of 1968) PASS: lldb-unit :: Symbol/./SymbolTests/LineEntryTest.GetSameLineContiguousAddressRangeOneInline (1923 of 1968) PASS: lldb-unit :: Utility/./UtilityTests/RegularExpression.Valid (1924 of 1968) PASS: lldb-unit :: ScriptInterpreter/Python/./ScriptInterpreterPythonTests/PythonDataObjectsTest.TestBorrowedReferences (1925 of 1968) PASS: lldb-unit :: Signals/./SignalsTests/UnixSignalsTest.GetInfo (1926 of 1968) PASS: lldb-unit :: Host/./HostTests/NativeProcessProtocolTest.SetBreakpointFailVerify (1927 of 1968) PASS: lldb-api :: functionalities/data-formatter/poarray/TestPrintObjectArray.py (1928 of 1968) PASS: lldb-unit :: Process/minidump/./LLDBMinidumpTests/MinidumpParserTest.GetThreadContext_x86_32 (1929 of 1968) PASS: lldb-shell :: ObjectFile/ELF/compressed-sections.yaml (1930 of 1968) UNSUPPORTED: lldb-api :: iohandler/completion/TestIOHandlerCompletion.py (1931 of 1968) PASS: lldb-shell :: ObjectFile/ELF/netbsd-exec-8.99.30-amd64.yaml (1932 of 1968) PASS: lldb-api :: types/TestShortTypeExpr.py (1933 of 1968) PASS: lldb-unit :: Utility/./UtilityTests/StringExtractorTest.GetHexU8_Underflow_NoEof (1934 of 1968) PASS: lldb-api :: types/TestIntegerType.py (1935 of 1968) PASS: lldb-api :: functionalities/data-formatter/data-formatter-caching/TestDataFormatterCaching.py (1936 of 1968) PASS: lldb-unit :: Utility/./UtilityTests/OptionsWithRawTest.TerminatedQuote (1937 of 1968) PASS: lldb-api :: functionalities/thread/concurrent_events/TestConcurrentSignalWatch.py (1938 of 1968) PASS: lldb-api :: lang/c/conflicting-symbol/TestConflictingSymbol.py (1939 of 1968) PASS: lldb-shell :: SymbolFile/DWARF/debug-types-signature-loop.s (1940 of 1968) PASS: lldb-unit :: Symbol/./SymbolTests/TestTypeSystemClang.TestDisplayName (1941 of 1968) PASS: lldb-api :: commands/expression/options/TestExprOptions.py (1942 of 1968) PASS: lldb-unit :: ScriptInterpreter/Python/./ScriptInterpreterPythonTests/PythonDataObjectsTest.TestScript (1943 of 1968) UNSUPPORTED: lldb-shell :: SymbolFile/PDB/func-symbols.test (1944 of 1968) PASS: lldb-unit :: ObjectFile/ELF/./ObjectFileELFTests/ObjectFileELFTest.GetSymtab_NoSymEntryPointArmThumbAddressClass (1945 of 1968) PASS: lldb-unit :: Utility/./UtilityTests/LogChannelTest.EnableOptions (1946 of 1968) PASS: lldb-unit :: Utility/./UtilityTests/UserIDResolver.GetUserName (1947 of 1968) UNSUPPORTED: lldb-shell :: SymbolFile/PDB/udt-layout.test (1948 of 1968) UNSUPPORTED: lldb-api :: benchmarks/frame_variable/TestFrameVariableResponse.py (1949 of 1968) PASS: lldb-unit :: Utility/./UtilityTests/StringExtractorTest.GetU64BigEndian (1950 of 1968) PASS: lldb-api :: python_api/name_lookup/TestNameLookup.py (1951 of 1968) PASS: lldb-unit :: Utility/./UtilityTests/Predicate.WaitForValueEqualTo (1952 of 1968) PASS: lldb-unit :: SymbolFile/DWARF/./SymbolFileDWARFTests/DWARFASTParserClangTests.EnsureAllDIEsInDeclContextHaveBeenParsedParsesOnlyMatchingEntries (1953 of 1968) UNSUPPORTED: lldb-api :: tools/lldb-server/libraries-svr4/TestGdbRemoteLibrariesSvr4Support.py (1954 of 1968) PASS: lldb-api :: functionalities/data-formatter/data-formatter-cpp/TestDataFormatterCpp.py (1955 of 1968) PASS: lldb-api :: api/log/TestAPILog.py (1956 of 1968) PASS: lldb-unit :: Utility/./UtilityTests/StringListTest.AppendStringStdString (1957 of 1968) PASS: lldb-shell :: SymbolFile/NativePDB/ast-functions.cpp (1958 of 1968) PASS: lldb-unit :: Utility/./UtilityTests/StreamTeeTest.Write (1959 of 1968) PASS: lldb-unit :: ScriptInterpreter/Python/./ScriptInterpreterPythonTests/PythonDataObjectsTest.TestResetting (1960 of 1968) UNSUPPORTED: lldb-api :: functionalities/tty/TestTerminal.py (1961 of 1968) PASS: lldb-api :: tools/lldb-server/inferior-crash/TestGdbRemoteAbort.py (1962 of 1968) UNSUPPORTED: lldb-shell :: SymbolFile/NativePDB/ast-functions-msvc.cpp (1963 of 1968) PASS: lldb-api :: lang/cpp/char1632_t/TestChar1632T.py (1964 of 1968) PASS: lldb-api :: commands/expression/import-std-module/weak_ptr-dbg-info-content/TestDbgInfoContentWeakPtrFromStdModule.py (1965 of 1968) XFAIL: lldb-shell :: Register/x86-mm-xmm-read.test (1966 of 1968) PASS: lldb-api :: lang/cpp/operator-overload/TestOperatorOverload.py (1967 of 1968) PASS: lldb-api :: lang/objc/objc-class-method/TestObjCClassMethod.py (1968 of 1968)

Hide Details

Testing Time: 4349.91s ******************** Failing Tests (3): lldb-api :: functionalities/ptr_refs/TestPtrRefs.py lldb-api :: python_api/thread/TestThreadAPI.py lldb-api :: lang/objc/ptr_refs/TestPtrRefsObjC.py

Hide Details

Hide Details

Slowest Tests: -------------------------------------------------------------------------- 95.23s: lldb-api :: types/TestLongTypes.py 96.34s: lldb-api :: functionalities/thread/backtrace_all/TestBacktraceAll.py 101.53s: lldb-api :: python_api/lldbutil/iter/TestLLDBIterator.py 104.74s: lldb-api :: commands/expression/import-std-module/queue/TestQueueFromStdModule.py 109.05s: lldb-api :: lang/objc/foundation/TestObjCMethodsNSError.py 112.88s: lldb-api :: lang/objc/objc-new-syntax/TestObjCNewSyntaxDictionary.py 113.63s: lldb-api :: lang/objc/foundation/TestObjCMethodsString.py 113.93s: lldb-api :: lang/objc/objc-new-syntax/TestObjCNewSyntaxArray.py 120.35s: lldb-api :: tools/lldb-server/TestGdbRemote_qThreadStopInfo.py 131.92s: lldb-api :: types/TestLongTypesExpr.py 135.15s: lldb-api :: lang/objc/real-definition/TestRealDefinition.py 143.89s: lldb-api :: lang/objc/objc-new-syntax/TestObjCNewSyntaxLiteral.py 165.57s: lldb-api :: lang/cpp/namespace/TestNamespaceLookup.py 184.16s: lldb-api :: lang/objc/exceptions/TestObjCExceptions.py 212.29s: lldb-api :: lang/objc/foundation/TestObjCMethods.py 238.67s: lldb-api :: lang/objc/hidden-ivars/TestHiddenIvars.py 248.70s: lldb-api :: tools/lldb-server/TestGdbRemoteThreadsInStopReply.py 252.42s: lldb-api :: api/multithreaded/TestMultithreaded.py 262.74s: lldb-api :: lang/cpp/enum_types/TestCPP11EnumTypes.py 371.02s: lldb-api :: tools/lldb-server/TestLldbGdbServer.py

Hide Details

Tests Times: -------------------------------------------------------------------------- [ Range ] :: [ Percentage ] :: [ Count ] -------------------------------------------------------------------------- [ 0s, 20s) :: [********************************** ] :: [1716/1968] [ 20s, 40s) :: [** ] :: [ 124/1968] [ 40s, 60s) :: [* ] :: [ 76/1968] [ 60s, 80s) :: [ ] :: [ 25/1968] [ 80s,100s) :: [ ] :: [ 9/1968] [100s,120s) :: [ ] :: [ 6/1968] [120s,140s) :: [ ] :: [ 3/1968] [140s,160s) :: [ ] :: [ 1/1968] [160s,180s) :: [ ] :: [ 1/1968] [180s,200s) :: [ ] :: [ 1/1968] [200s,220s) :: [ ] :: [ 1/1968] [220s,240s) :: [ ] :: [ 0/1968] [240s,260s) :: [ ] :: [ 3/1968] [260s,280s) :: [ ] :: [ 1/1968] [280s,300s) :: [ ] :: [ 0/1968] [300s,320s) :: [ ] :: [ 0/1968] [320s,340s) :: [ ] :: [ 0/1968] [340s,360s) :: [ ] :: [ 0/1968] [360s,380s) :: [ ] :: [ 1/1968] Expected Passes : 1794 Expected Failures : 6 Unsupported Tests : 165 Unexpected Failures: 3 FAILED: tools/lldb/test/CMakeFiles/check-lldb-lit cd /Users/buildslave/jenkins/workspace/lldb-cmake-sanitized/lldb-build/tools/lldb/test && /usr/local/bin/python /Users/buildslave/jenkins/workspace/lldb-cmake-sanitized/lldb-build/./bin/llvm-lit -v --time-tests --shuffle --xunit-xml-output=/Users/buildslave/jenkins/workspace/lldb-cmake-sanitized/test/results.xml -v -j 4 --timeout 1200 /Users/buildslave/jenkins/workspace/lldb-cmake-sanitized/lldb-build/tools/lldb/test ninja: build stopped: subcommand failed. Command failed: Command '['/usr/bin/env', 'TERM=vt100', '/usr/local/bin/ninja', '-v', 'check-lldb']' returned non-zero exit status 1. Command: ['/usr/bin/env', 'TERM=vt100', '/usr/local/bin/ninja', '-v', 'check-lldb'] [Pipeline] } [Pipeline] // timeout [Pipeline] } [Pipeline] // stage [Pipeline] stage [Pipeline] { (Declarative: Post Actions) [Pipeline] scanForIssues [Clang (LLVM based)] Sleeping for 5 seconds due to JENKINS-32191... [Clang (LLVM based)] Parsing console log (workspace: '/Users/buildslave/jenkins/workspace/lldb-cmake-sanitized') [Clang (LLVM based)] Successfully parsed console log [Clang (LLVM based)] -> found 6 issues (skipped 67 duplicates) [Clang (LLVM based)] Post processing issues on 'green-dragon-23' with source code encoding 'UTF-8' [Clang (LLVM based)] Creating SCM blamer to obtain author and commit information for affected files [Clang (LLVM based)] Creating SCM miner to obtain statistics for affected repository files [Clang (LLVM based)] Resolving file names for all issues in source directory '/Users/buildslave/jenkins/workspace/lldb-cmake-sanitized' [Clang (LLVM based)] -> resolved paths in source directory (5 found, 0 not found) [Clang (LLVM based)] Resolving module names from module definitions (build.xml, pom.xml, or Manifest.mf files) [Clang (LLVM based)] -> resolved module names for 6 issues [Clang (LLVM based)] Resolving package names (or namespaces) by parsing the affected files [Clang (LLVM based)] -> resolved package names of 4 affected files [Clang (LLVM based)] No filter has been set, publishing all 5 issues [Clang (LLVM based)] Creating fingerprints for all affected code blocks to track issues over different builds [Clang (LLVM based)] -> created fingerprints for 5 issues (skipped 0 issues) [Clang (LLVM based)] Copying affected files to Jenkins' build folder '/Users/Shared/Jenkins/Home/jobs/lldb-cmake-sanitized/builds/1136/files-with-issues' [Clang (LLVM based)] -> 4 copied, 0 not in workspace, 0 not-found, 0 with I/O error [Pipeline] junit Recording test results [Pipeline] } [Pipeline] // stage [Pipeline] } [Pipeline] // withEnv [Pipeline] } [Pipeline] // node [Pipeline] End of Pipeline ERROR: script returned exit code 1 Finished: FAILURE