FailedConsole Output

Skipping 8,282 KB.. Full Log

Hide Details

Hide Details

Hide Details

runCmd: process status output: Process 13315 stopped * thread #1, queue = 'com.apple.main-thread', stop reason = breakpoint 1.1 frame #0: 0x000000010db64f53 a.out`main(argc=1, argv=0x00007ffee209b498) at main.cpp:17:5 14 15 printf("after the loop: my_char='%c'\n", my_char); // 'my_char' should print out as 'x'. 16 -> 17 return 0; // Set break point at this line and check variable 'my_char'. ^ 18 }

Hide Details

Hide Details

<bound method SBProcess.Kill of <lldb.SBProcess; proxy of <Swig Object of type 'lldb::SBProcess *' at 0x1146e58d0> >>: success

Hide Details

PASS: LLDB (/Users/buildslave/jenkins/workspace/lldb-cmake-sanitized/lldb-build/bin/clang-11-x86_64) :: test_get_process_gmodules (TestThreadAPI.ThreadAPITestCase) runCmd: settings clear -all output:

Hide Details

runCmd: settings set symbols.enable-external-lookup false output:

Hide Details

runCmd: settings set target.auto-apply-fixits false output:

Hide Details

runCmd: settings set plugin.process.gdb-remote.packet-timeout 60 output:

Hide Details

runCmd: settings set symbols.clang-modules-cache-path "/Users/buildslave/jenkins/workspace/lldb-cmake-sanitized/lldb-build/lldb-test-build.noindex/module-cache-lldb/lldb-api" output:

Hide Details

runCmd: settings set use-color false output:

Hide Details

runCmd: setting set target.prefer-dynamic-value no-dynamic-values output:

Hide Details

runCmd: settings set target.env-vars ASAN_OPTIONS=detect_stack_use_after_return=1 DYLD_INSERT_LIBRARIES=/Users/buildslave/jenkins/workspace/lldb-cmake-sanitized/host-compiler/lib/clang/11.0.0/lib/darwin/libclang_rt.asan_osx_dynamic.dylib output:

Hide Details

<bound method SBProcess.Kill of <lldb.SBProcess; proxy of <Swig Object of type 'lldb::SBProcess *' at 0x113a4c960> >>: success

Hide Details

PASS: LLDB (/Users/buildslave/jenkins/workspace/lldb-cmake-sanitized/lldb-build/bin/clang-11-x86_64) :: test_get_stop_description_dsym (TestThreadAPI.ThreadAPITestCase) runCmd: settings clear -all output:

Hide Details

runCmd: settings set symbols.enable-external-lookup false output:

Hide Details

runCmd: settings set target.auto-apply-fixits false output:

Hide Details

runCmd: settings set plugin.process.gdb-remote.packet-timeout 60 output:

Hide Details

runCmd: settings set symbols.clang-modules-cache-path "/Users/buildslave/jenkins/workspace/lldb-cmake-sanitized/lldb-build/lldb-test-build.noindex/module-cache-lldb/lldb-api" output:

Hide Details

runCmd: settings set use-color false output:

Hide Details

runCmd: setting set target.prefer-dynamic-value no-dynamic-values output:

Hide Details

runCmd: settings set target.env-vars ASAN_OPTIONS=detect_stack_use_after_return=1 DYLD_INSERT_LIBRARIES=/Users/buildslave/jenkins/workspace/lldb-cmake-sanitized/host-compiler/lib/clang/11.0.0/lib/darwin/libclang_rt.asan_osx_dynamic.dylib output:

Hide Details

<bound method SBProcess.Kill of <lldb.SBProcess; proxy of <Swig Object of type 'lldb::SBProcess *' at 0x1141302d0> >>: success

Hide Details

PASS: LLDB (/Users/buildslave/jenkins/workspace/lldb-cmake-sanitized/lldb-build/bin/clang-11-x86_64) :: test_get_stop_description_dwarf (TestThreadAPI.ThreadAPITestCase) UNSUPPORTED: LLDB (/Users/buildslave/jenkins/workspace/lldb-cmake-sanitized/lldb-build/bin/clang-11-x86_64) :: test_get_stop_description_dwo (TestThreadAPI.ThreadAPITestCase) (test case does not fall in any category of interest for this run) runCmd: settings clear -all output:

Hide Details

runCmd: settings set symbols.enable-external-lookup false output:

Hide Details

runCmd: settings set target.auto-apply-fixits false output:

Hide Details

runCmd: settings set plugin.process.gdb-remote.packet-timeout 60 output:

Hide Details

runCmd: settings set symbols.clang-modules-cache-path "/Users/buildslave/jenkins/workspace/lldb-cmake-sanitized/lldb-build/lldb-test-build.noindex/module-cache-lldb/lldb-api" output:

Hide Details

runCmd: settings set use-color false output:

Hide Details

runCmd: setting set target.prefer-dynamic-value no-dynamic-values output:

Hide Details

runCmd: settings set target.env-vars ASAN_OPTIONS=detect_stack_use_after_return=1 DYLD_INSERT_LIBRARIES=/Users/buildslave/jenkins/workspace/lldb-cmake-sanitized/host-compiler/lib/clang/11.0.0/lib/darwin/libclang_rt.asan_osx_dynamic.dylib output:

Hide Details

<bound method SBProcess.Kill of <lldb.SBProcess; proxy of <Swig Object of type 'lldb::SBProcess *' at 0x113a4c990> >>: success

Hide Details

PASS: LLDB (/Users/buildslave/jenkins/workspace/lldb-cmake-sanitized/lldb-build/bin/clang-11-x86_64) :: test_get_stop_description_gmodules (TestThreadAPI.ThreadAPITestCase) runCmd: settings clear -all output:

Hide Details

runCmd: settings set symbols.enable-external-lookup false output:

Hide Details

runCmd: settings set target.auto-apply-fixits false output:

Hide Details

runCmd: settings set plugin.process.gdb-remote.packet-timeout 60 output:

Hide Details

runCmd: settings set symbols.clang-modules-cache-path "/Users/buildslave/jenkins/workspace/lldb-cmake-sanitized/lldb-build/lldb-test-build.noindex/module-cache-lldb/lldb-api" output:

Hide Details

runCmd: settings set use-color false output:

Hide Details

runCmd: setting set target.prefer-dynamic-value no-dynamic-values output:

Hide Details

runCmd: settings set target.env-vars ASAN_OPTIONS=detect_stack_use_after_return=1 DYLD_INSERT_LIBRARIES=/Users/buildslave/jenkins/workspace/lldb-cmake-sanitized/host-compiler/lib/clang/11.0.0/lib/darwin/libclang_rt.asan_osx_dynamic.dylib output:

Hide Details

runCmd: breakpoint list output: Current breakpoints: 1: file = 'main2.cpp', line = 21, exact_match = 0, locations = 1 1.1: where = test_run_to_address_dsym`b(int) + 22 at main2.cpp:21:17, address = test_run_to_address_dsym[0x0000000100000e66], unresolved, hit count = 0

Hide Details

Hide Details

Hide Details

runCmd: thread backtrace output: * thread #1, queue = 'com.apple.main-thread', stop reason = breakpoint 1.1 * frame #0: 0x000000010e516e66 test_run_to_address_dsym`b(val=1) at main2.cpp:21:17 frame #1: 0x000000010e516e0d test_run_to_address_dsym`a(val=1) at main2.cpp:11:16 frame #2: 0x000000010e516ee0 test_run_to_address_dsym`main(argc=1, argv=0x00007ffee16e9470) at main2.cpp:36:14 frame #3: 0x00007fff67d6a085 libdyld.dylib`start + 1

Hide Details

Hide Details

runCmd: breakpoint list output: Current breakpoints: 1: file = 'main2.cpp', line = 21, exact_match = 0, locations = 1 Options: disabled 1.1: where = test_run_to_address_dsym`b(int) + 22 at main2.cpp:21:17, address = 0x000000010e516e66, unresolved, hit count = 1

Hide Details

Hide Details

Hide Details

runCmd: thread backtrace output: * thread #1, queue = 'com.apple.main-thread', stop reason = step over * frame #0: 0x000000010e516e9d test_run_to_address_dsym`b(val=1) at main2.cpp:26:12 frame #1: 0x000000010e516e0d test_run_to_address_dsym`a(val=1) at main2.cpp:11:16 frame #2: 0x000000010e516ee0 test_run_to_address_dsym`main(argc=1, argv=0x00007ffee16e9470) at main2.cpp:36:14 frame #3: 0x00007fff67d6a085 libdyld.dylib`start + 1

Hide Details

Hide Details

runCmd: process status output: Process 13934 stopped * thread #1, queue = 'com.apple.main-thread', stop reason = run to address: 0x000000010e516e66 frame #0: 0x000000010e516e66 test_run_to_address_dsym`b(val=2) at main2.cpp:21:17 18 int b(int val) 19 { 20 int rc = c(val); -> 21 void *ptr = malloc(1024); // thread step-out of malloc into function b. ^ 22 if (!ptr) 23 return -1; 24 else

Hide Details

Hide Details

<bound method SBProcess.Kill of <lldb.SBProcess; proxy of <Swig Object of type 'lldb::SBProcess *' at 0x113f31de0> >>: success

Hide Details

PASS: LLDB (/Users/buildslave/jenkins/workspace/lldb-cmake-sanitized/lldb-build/bin/clang-11-x86_64) :: test_run_to_address_dsym (TestThreadAPI.ThreadAPITestCase) runCmd: settings clear -all output:

Hide Details

runCmd: settings set symbols.enable-external-lookup false output:

Hide Details

runCmd: settings set target.auto-apply-fixits false output:

Hide Details

runCmd: settings set plugin.process.gdb-remote.packet-timeout 60 output:

Hide Details

runCmd: settings set symbols.clang-modules-cache-path "/Users/buildslave/jenkins/workspace/lldb-cmake-sanitized/lldb-build/lldb-test-build.noindex/module-cache-lldb/lldb-api" output:

Hide Details

runCmd: settings set use-color false output:

Hide Details

runCmd: setting set target.prefer-dynamic-value no-dynamic-values output:

Hide Details

runCmd: settings set target.env-vars ASAN_OPTIONS=detect_stack_use_after_return=1 DYLD_INSERT_LIBRARIES=/Users/buildslave/jenkins/workspace/lldb-cmake-sanitized/host-compiler/lib/clang/11.0.0/lib/darwin/libclang_rt.asan_osx_dynamic.dylib output:

Hide Details

runCmd: breakpoint list output: Current breakpoints: 1: file = 'main2.cpp', line = 21, exact_match = 0, locations = 1 1.1: where = test_run_to_address_dwarf`b(int) + 22 at main2.cpp:21:17, address = test_run_to_address_dwarf[0x0000000100000e66], unresolved, hit count = 0

Hide Details

Hide Details

Hide Details

runCmd: thread backtrace output: * thread #1, queue = 'com.apple.main-thread', stop reason = breakpoint 1.1 * frame #0: 0x000000010d7c0e66 test_run_to_address_dwarf`b(val=1) at main2.cpp:21:17 frame #1: 0x000000010d7c0e0d test_run_to_address_dwarf`a(val=1) at main2.cpp:11:16 frame #2: 0x000000010d7c0ee0 test_run_to_address_dwarf`main(argc=1, argv=0x00007ffee243f470) at main2.cpp:36:14 frame #3: 0x00007fff67d6a085 libdyld.dylib`start + 1

Hide Details

Hide Details

runCmd: breakpoint list output: Current breakpoints: 1: file = 'main2.cpp', line = 21, exact_match = 0, locations = 1 Options: disabled 1.1: where = test_run_to_address_dwarf`b(int) + 22 at main2.cpp:21:17, address = 0x000000010d7c0e66, unresolved, hit count = 1

Hide Details

Hide Details

Hide Details

runCmd: thread backtrace output: * thread #1, queue = 'com.apple.main-thread', stop reason = step over * frame #0: 0x000000010d7c0e9d test_run_to_address_dwarf`b(val=1) at main2.cpp:26:12 frame #1: 0x000000010d7c0e0d test_run_to_address_dwarf`a(val=1) at main2.cpp:11:16 frame #2: 0x000000010d7c0ee0 test_run_to_address_dwarf`main(argc=1, argv=0x00007ffee243f470) at main2.cpp:36:14 frame #3: 0x00007fff67d6a085 libdyld.dylib`start + 1

Hide Details

Hide Details

runCmd: process status output: Process 14049 stopped * thread #1, queue = 'com.apple.main-thread', stop reason = run to address: 0x000000010d7c0e66 frame #0: 0x000000010d7c0e66 test_run_to_address_dwarf`b(val=2) at main2.cpp:21:17 18 int b(int val) 19 { 20 int rc = c(val); -> 21 void *ptr = malloc(1024); // thread step-out of malloc into function b. ^ 22 if (!ptr) 23 return -1; 24 else

Hide Details

Hide Details

<bound method SBProcess.Kill of <lldb.SBProcess; proxy of <Swig Object of type 'lldb::SBProcess *' at 0x113a4c960> >>: success

Hide Details

PASS: LLDB (/Users/buildslave/jenkins/workspace/lldb-cmake-sanitized/lldb-build/bin/clang-11-x86_64) :: test_run_to_address_dwarf (TestThreadAPI.ThreadAPITestCase) UNSUPPORTED: LLDB (/Users/buildslave/jenkins/workspace/lldb-cmake-sanitized/lldb-build/bin/clang-11-x86_64) :: test_run_to_address_dwo (TestThreadAPI.ThreadAPITestCase) (test case does not fall in any category of interest for this run) runCmd: settings clear -all output:

Hide Details

runCmd: settings set symbols.enable-external-lookup false output:

Hide Details

runCmd: settings set target.auto-apply-fixits false output:

Hide Details

runCmd: settings set plugin.process.gdb-remote.packet-timeout 60 output:

Hide Details

runCmd: settings set symbols.clang-modules-cache-path "/Users/buildslave/jenkins/workspace/lldb-cmake-sanitized/lldb-build/lldb-test-build.noindex/module-cache-lldb/lldb-api" output:

Hide Details

runCmd: settings set use-color false output:

Hide Details

runCmd: setting set target.prefer-dynamic-value no-dynamic-values output:

Hide Details

runCmd: settings set target.env-vars ASAN_OPTIONS=detect_stack_use_after_return=1 DYLD_INSERT_LIBRARIES=/Users/buildslave/jenkins/workspace/lldb-cmake-sanitized/host-compiler/lib/clang/11.0.0/lib/darwin/libclang_rt.asan_osx_dynamic.dylib output:

Hide Details

runCmd: breakpoint list output: Current breakpoints: 1: file = 'main2.cpp', line = 21, exact_match = 0, locations = 1 1.1: where = test_run_to_address_gmodules`b(int) + 22 at main2.cpp:21:17, address = test_run_to_address_gmodules[0x0000000100000e66], unresolved, hit count = 0

Hide Details

Hide Details

Hide Details

runCmd: thread backtrace output: * thread #1, queue = 'com.apple.main-thread', stop reason = breakpoint 1.1 * frame #0: 0x0000000106dbde66 test_run_to_address_gmodules`b(val=1) at main2.cpp:21:17 frame #1: 0x0000000106dbde0d test_run_to_address_gmodules`a(val=1) at main2.cpp:11:16 frame #2: 0x0000000106dbdee0 test_run_to_address_gmodules`main(argc=1, argv=0x00007ffee8e42460) at main2.cpp:36:14 frame #3: 0x00007fff67d6a085 libdyld.dylib`start + 1

Hide Details

Hide Details

runCmd: breakpoint list output: Current breakpoints: 1: file = 'main2.cpp', line = 21, exact_match = 0, locations = 1 Options: disabled 1.1: where = test_run_to_address_gmodules`b(int) + 22 at main2.cpp:21:17, address = 0x0000000106dbde66, unresolved, hit count = 1

Hide Details

Hide Details

Hide Details

runCmd: thread backtrace output: * thread #1, queue = 'com.apple.main-thread', stop reason = step over * frame #0: 0x0000000106dbde9d test_run_to_address_gmodules`b(val=1) at main2.cpp:26:12 frame #1: 0x0000000106dbde0d test_run_to_address_gmodules`a(val=1) at main2.cpp:11:16 frame #2: 0x0000000106dbdee0 test_run_to_address_gmodules`main(argc=1, argv=0x00007ffee8e42460) at main2.cpp:36:14 frame #3: 0x00007fff67d6a085 libdyld.dylib`start + 1

Hide Details

Hide Details

runCmd: process status output: Process 14212 stopped * thread #1, queue = 'com.apple.main-thread', stop reason = run to address: 0x0000000106dbde66 frame #0: 0x0000000106dbde66 test_run_to_address_gmodules`b(val=2) at main2.cpp:21:17 18 int b(int val) 19 { 20 int rc = c(val); -> 21 void *ptr = malloc(1024); // thread step-out of malloc into function b. ^ 22 if (!ptr) 23 return -1; 24 else

Hide Details

Hide Details

<bound method SBProcess.Kill of <lldb.SBProcess; proxy of <Swig Object of type 'lldb::SBProcess *' at 0x1141302d0> >>: success

Hide Details

PASS: LLDB (/Users/buildslave/jenkins/workspace/lldb-cmake-sanitized/lldb-build/bin/clang-11-x86_64) :: test_run_to_address_gmodules (TestThreadAPI.ThreadAPITestCase) runCmd: settings clear -all output:

Hide Details

runCmd: settings set symbols.enable-external-lookup false output:

Hide Details

runCmd: settings set target.auto-apply-fixits false output:

Hide Details

runCmd: settings set plugin.process.gdb-remote.packet-timeout 60 output:

Hide Details

runCmd: settings set symbols.clang-modules-cache-path "/Users/buildslave/jenkins/workspace/lldb-cmake-sanitized/lldb-build/lldb-test-build.noindex/module-cache-lldb/lldb-api" output:

Hide Details

runCmd: settings set use-color false output:

Hide Details

runCmd: setting set target.prefer-dynamic-value no-dynamic-values output:

Hide Details

runCmd: settings set target.env-vars ASAN_OPTIONS=detect_stack_use_after_return=1 DYLD_INSERT_LIBRARIES=/Users/buildslave/jenkins/workspace/lldb-cmake-sanitized/host-compiler/lib/clang/11.0.0/lib/darwin/libclang_rt.asan_osx_dynamic.dylib output:

Hide Details

FAIL: LLDB (/Users/buildslave/jenkins/workspace/lldb-cmake-sanitized/lldb-build/bin/clang-11-x86_64) :: test_step_out_of_malloc_into_function_b_dsym (TestThreadAPI.ThreadAPITestCase) <bound method SBProcess.Kill of <lldb.SBProcess; proxy of <Swig Object of type 'lldb::SBProcess *' at 0x113a4c990> >>: success

Hide Details

runCmd: settings clear -all output:

Hide Details

runCmd: settings set symbols.enable-external-lookup false output:

Hide Details

runCmd: settings set target.auto-apply-fixits false output:

Hide Details

runCmd: settings set plugin.process.gdb-remote.packet-timeout 60 output:

Hide Details

runCmd: settings set symbols.clang-modules-cache-path "/Users/buildslave/jenkins/workspace/lldb-cmake-sanitized/lldb-build/lldb-test-build.noindex/module-cache-lldb/lldb-api" output:

Hide Details

runCmd: settings set use-color false output:

Hide Details

runCmd: setting set target.prefer-dynamic-value no-dynamic-values output:

Hide Details

runCmd: settings set target.env-vars ASAN_OPTIONS=detect_stack_use_after_return=1 DYLD_INSERT_LIBRARIES=/Users/buildslave/jenkins/workspace/lldb-cmake-sanitized/host-compiler/lib/clang/11.0.0/lib/darwin/libclang_rt.asan_osx_dynamic.dylib output:

Hide Details

FAIL: LLDB (/Users/buildslave/jenkins/workspace/lldb-cmake-sanitized/lldb-build/bin/clang-11-x86_64) :: test_step_out_of_malloc_into_function_b_dwarf (TestThreadAPI.ThreadAPITestCase) <bound method SBProcess.Kill of <lldb.SBProcess; proxy of <Swig Object of type 'lldb::SBProcess *' at 0x113f31de0> >>: success

Hide Details

UNSUPPORTED: LLDB (/Users/buildslave/jenkins/workspace/lldb-cmake-sanitized/lldb-build/bin/clang-11-x86_64) :: test_step_out_of_malloc_into_function_b_dwo (TestThreadAPI.ThreadAPITestCase) (test case does not fall in any category of interest for this run) runCmd: settings clear -all output:

Hide Details

runCmd: settings set symbols.enable-external-lookup false output:

Hide Details

runCmd: settings set target.auto-apply-fixits false output:

Hide Details

runCmd: settings set plugin.process.gdb-remote.packet-timeout 60 output:

Hide Details

runCmd: settings set symbols.clang-modules-cache-path "/Users/buildslave/jenkins/workspace/lldb-cmake-sanitized/lldb-build/lldb-test-build.noindex/module-cache-lldb/lldb-api" output:

Hide Details

runCmd: settings set use-color false output:

Hide Details

runCmd: setting set target.prefer-dynamic-value no-dynamic-values output:

Hide Details

runCmd: settings set target.env-vars ASAN_OPTIONS=detect_stack_use_after_return=1 DYLD_INSERT_LIBRARIES=/Users/buildslave/jenkins/workspace/lldb-cmake-sanitized/host-compiler/lib/clang/11.0.0/lib/darwin/libclang_rt.asan_osx_dynamic.dylib output:

Hide Details

FAIL: LLDB (/Users/buildslave/jenkins/workspace/lldb-cmake-sanitized/lldb-build/bin/clang-11-x86_64) :: test_step_out_of_malloc_into_function_b_gmodules (TestThreadAPI.ThreadAPITestCase) <bound method SBProcess.Kill of <lldb.SBProcess; proxy of <Swig Object of type 'lldb::SBProcess *' at 0x113a4c990> >>: success

Hide Details

runCmd: settings clear -all output:

Hide Details

runCmd: settings set symbols.enable-external-lookup false output:

Hide Details

runCmd: settings set target.auto-apply-fixits false output:

Hide Details

runCmd: settings set plugin.process.gdb-remote.packet-timeout 60 output:

Hide Details

runCmd: settings set symbols.clang-modules-cache-path "/Users/buildslave/jenkins/workspace/lldb-cmake-sanitized/lldb-build/lldb-test-build.noindex/module-cache-lldb/lldb-api" output:

Hide Details

runCmd: settings set use-color false output:

Hide Details

runCmd: setting set target.prefer-dynamic-value no-dynamic-values output:

Hide Details

runCmd: settings set target.env-vars ASAN_OPTIONS=detect_stack_use_after_return=1 DYLD_INSERT_LIBRARIES=/Users/buildslave/jenkins/workspace/lldb-cmake-sanitized/host-compiler/lib/clang/11.0.0/lib/darwin/libclang_rt.asan_osx_dynamic.dylib output:

Hide Details

runCmd: breakpoint list output: Current breakpoints: 1: file = 'main2.cpp', line = 21, exact_match = 0, locations = 1 1.1: where = test_step_over_3_times_dsym`b(int) + 22 at main2.cpp:21:17, address = test_step_over_3_times_dsym[0x0000000100000e66], unresolved, hit count = 0

Hide Details

Hide Details

Hide Details

runCmd: thread backtrace output: * thread #1, queue = 'com.apple.main-thread', stop reason = breakpoint 1.1 * frame #0: 0x000000010d498e66 test_step_over_3_times_dsym`b(val=1) at main2.cpp:21:17 frame #1: 0x000000010d498e0d test_step_over_3_times_dsym`a(val=1) at main2.cpp:11:16 frame #2: 0x000000010d498ee0 test_step_over_3_times_dsym`main(argc=1, argv=0x00007ffee2767468) at main2.cpp:36:14 frame #3: 0x00007fff67d6a085 libdyld.dylib`start + 1 frame #4: 0x00007fff67d6a085 libdyld.dylib`start + 1

Hide Details

Hide Details

runCmd: thread backtrace output: * thread #1, queue = 'com.apple.main-thread', stop reason = step over * frame #0: 0x000000010d498e9d test_step_over_3_times_dsym`b(val=1) at main2.cpp:26:12 frame #1: 0x000000010d498e0d test_step_over_3_times_dsym`a(val=1) at main2.cpp:11:16 frame #2: 0x000000010d498ee0 test_step_over_3_times_dsym`main(argc=1, argv=0x00007ffee2767468) at main2.cpp:36:14 frame #3: 0x00007fff67d6a085 libdyld.dylib`start + 1 frame #4: 0x00007fff67d6a085 libdyld.dylib`start + 1

Hide Details

Hide Details

<bound method SBProcess.Kill of <lldb.SBProcess; proxy of <Swig Object of type 'lldb::SBProcess *' at 0x113f31de0> >>: success

Hide Details

PASS: LLDB (/Users/buildslave/jenkins/workspace/lldb-cmake-sanitized/lldb-build/bin/clang-11-x86_64) :: test_step_over_3_times_dsym (TestThreadAPI.ThreadAPITestCase) runCmd: settings clear -all output:

Hide Details

runCmd: settings set symbols.enable-external-lookup false output:

Hide Details

runCmd: settings set target.auto-apply-fixits false output:

Hide Details

runCmd: settings set plugin.process.gdb-remote.packet-timeout 60 output:

Hide Details

runCmd: settings set symbols.clang-modules-cache-path "/Users/buildslave/jenkins/workspace/lldb-cmake-sanitized/lldb-build/lldb-test-build.noindex/module-cache-lldb/lldb-api" output:

Hide Details

runCmd: settings set use-color false output:

Hide Details

runCmd: setting set target.prefer-dynamic-value no-dynamic-values output:

Hide Details

runCmd: settings set target.env-vars ASAN_OPTIONS=detect_stack_use_after_return=1 DYLD_INSERT_LIBRARIES=/Users/buildslave/jenkins/workspace/lldb-cmake-sanitized/host-compiler/lib/clang/11.0.0/lib/darwin/libclang_rt.asan_osx_dynamic.dylib output:

Hide Details

runCmd: breakpoint list output: Current breakpoints: 1: file = 'main2.cpp', line = 21, exact_match = 0, locations = 1 1.1: where = test_step_over_3_times_dwarf`b(int) + 22 at main2.cpp:21:17, address = test_step_over_3_times_dwarf[0x0000000100000e66], unresolved, hit count = 0

Hide Details

Hide Details

Hide Details

runCmd: thread backtrace output: * thread #1, queue = 'com.apple.main-thread', stop reason = breakpoint 1.1 * frame #0: 0x00000001022efe66 test_step_over_3_times_dwarf`b(val=1) at main2.cpp:21:17 frame #1: 0x00000001022efe0d test_step_over_3_times_dwarf`a(val=1) at main2.cpp:11:16 frame #2: 0x00000001022efee0 test_step_over_3_times_dwarf`main(argc=1, argv=0x00007ffeed910460) at main2.cpp:36:14 frame #3: 0x00007fff67d6a085 libdyld.dylib`start + 1

Hide Details

Hide Details

runCmd: thread backtrace output: * thread #1, queue = 'com.apple.main-thread', stop reason = step over * frame #0: 0x00000001022efe9d test_step_over_3_times_dwarf`b(val=1) at main2.cpp:26:12 frame #1: 0x00000001022efe0d test_step_over_3_times_dwarf`a(val=1) at main2.cpp:11:16 frame #2: 0x00000001022efee0 test_step_over_3_times_dwarf`main(argc=1, argv=0x00007ffeed910460) at main2.cpp:36:14 frame #3: 0x00007fff67d6a085 libdyld.dylib`start + 1

Hide Details

Hide Details

<bound method SBProcess.Kill of <lldb.SBProcess; proxy of <Swig Object of type 'lldb::SBProcess *' at 0x113a4c990> >>: success

Hide Details

PASS: LLDB (/Users/buildslave/jenkins/workspace/lldb-cmake-sanitized/lldb-build/bin/clang-11-x86_64) :: test_step_over_3_times_dwarf (TestThreadAPI.ThreadAPITestCase) UNSUPPORTED: LLDB (/Users/buildslave/jenkins/workspace/lldb-cmake-sanitized/lldb-build/bin/clang-11-x86_64) :: test_step_over_3_times_dwo (TestThreadAPI.ThreadAPITestCase) (test case does not fall in any category of interest for this run) runCmd: settings clear -all output:

Hide Details

runCmd: settings set symbols.enable-external-lookup false output:

Hide Details

runCmd: settings set target.auto-apply-fixits false output:

Hide Details

runCmd: settings set plugin.process.gdb-remote.packet-timeout 60 output:

Hide Details

runCmd: settings set symbols.clang-modules-cache-path "/Users/buildslave/jenkins/workspace/lldb-cmake-sanitized/lldb-build/lldb-test-build.noindex/module-cache-lldb/lldb-api" output:

Hide Details

runCmd: settings set use-color false output:

Hide Details

runCmd: setting set target.prefer-dynamic-value no-dynamic-values output:

Hide Details

runCmd: settings set target.env-vars ASAN_OPTIONS=detect_stack_use_after_return=1 DYLD_INSERT_LIBRARIES=/Users/buildslave/jenkins/workspace/lldb-cmake-sanitized/host-compiler/lib/clang/11.0.0/lib/darwin/libclang_rt.asan_osx_dynamic.dylib output:

Hide Details

runCmd: breakpoint list output: Current breakpoints: 1: file = 'main2.cpp', line = 21, exact_match = 0, locations = 1 1.1: where = test_step_over_3_times_gmodules`b(int) + 22 at main2.cpp:21:17, address = test_step_over_3_times_gmodules[0x0000000100000e66], unresolved, hit count = 0

Hide Details

Hide Details

Hide Details

runCmd: thread backtrace output: * thread #1, queue = 'com.apple.main-thread', stop reason = breakpoint 1.1 * frame #0: 0x000000010d6d4e66 test_step_over_3_times_gmodules`b(val=1) at main2.cpp:21:17 frame #1: 0x000000010d6d4e0d test_step_over_3_times_gmodules`a(val=1) at main2.cpp:11:16 frame #2: 0x000000010d6d4ee0 test_step_over_3_times_gmodules`main(argc=1, argv=0x00007ffee252b458) at main2.cpp:36:14 frame #3: 0x00007fff67d6a085 libdyld.dylib`start + 1 frame #4: 0x00007fff67d6a085 libdyld.dylib`start + 1

Hide Details

Hide Details

runCmd: thread backtrace output: * thread #1, queue = 'com.apple.main-thread', stop reason = step over * frame #0: 0x000000010d6d4e9d test_step_over_3_times_gmodules`b(val=1) at main2.cpp:26:12 frame #1: 0x000000010d6d4e0d test_step_over_3_times_gmodules`a(val=1) at main2.cpp:11:16 frame #2: 0x000000010d6d4ee0 test_step_over_3_times_gmodules`main(argc=1, argv=0x00007ffee252b458) at main2.cpp:36:14 frame #3: 0x00007fff67d6a085 libdyld.dylib`start + 1 frame #4: 0x00007fff67d6a085 libdyld.dylib`start + 1

Hide Details

Hide Details

<bound method SBProcess.Kill of <lldb.SBProcess; proxy of <Swig Object of type 'lldb::SBProcess *' at 0x1141302d0> >>: success

Hide Details

PASS: LLDB (/Users/buildslave/jenkins/workspace/lldb-cmake-sanitized/lldb-build/bin/clang-11-x86_64) :: test_step_over_3_times_gmodules (TestThreadAPI.ThreadAPITestCase) Restore dir to: /Users/buildslave/jenkins/workspace/lldb-cmake-sanitized/lldb-build/tools/lldb/test ====================================================================== ERROR: test_step_out_of_malloc_into_function_b_dsym (TestThreadAPI.ThreadAPITestCase) Test Python SBThread.StepOut() API to step out of a malloc call where the call site is at function b(). ---------------------------------------------------------------------- Traceback (most recent call last): File "/Users/buildslave/jenkins/workspace/lldb-cmake-sanitized/llvm-project/lldb/packages/Python/lldbsuite/test/lldbtest.py", line 1751, in test_method return attrvalue(self) File "/Users/buildslave/jenkins/workspace/lldb-cmake-sanitized/llvm-project/lldb/packages/Python/lldbsuite/test/decorators.py", line 110, in wrapper func(*args, **kwargs) File "/Users/buildslave/jenkins/workspace/lldb-cmake-sanitized/llvm-project/lldb/packages/Python/lldbsuite/test/decorators.py", line 110, in wrapper func(*args, **kwargs) File "/Users/buildslave/jenkins/workspace/lldb-cmake-sanitized/llvm-project/lldb/packages/Python/lldbsuite/test/decorators.py", line 110, in wrapper func(*args, **kwargs) File "/Users/buildslave/jenkins/workspace/lldb-cmake-sanitized/llvm-project/lldb/test/API/python_api/thread/TestThreadAPI.py", line 50, in test_step_out_of_malloc_into_function_b self.step_out_of_malloc_into_function_b(self.exe_name) File "/Users/buildslave/jenkins/workspace/lldb-cmake-sanitized/llvm-project/lldb/test/API/python_api/thread/TestThreadAPI.py", line 157, in step_out_of_malloc_into_function_b thread.IsValid(), AttributeError: 'NoneType' object has no attribute 'IsValid' Config=x86_64-/Users/buildslave/jenkins/workspace/lldb-cmake-sanitized/lldb-build/bin/clang-11 ====================================================================== ERROR: test_step_out_of_malloc_into_function_b_dwarf (TestThreadAPI.ThreadAPITestCase) Test Python SBThread.StepOut() API to step out of a malloc call where the call site is at function b(). ---------------------------------------------------------------------- Traceback (most recent call last): File "/Users/buildslave/jenkins/workspace/lldb-cmake-sanitized/llvm-project/lldb/packages/Python/lldbsuite/test/lldbtest.py", line 1751, in test_method return attrvalue(self) File "/Users/buildslave/jenkins/workspace/lldb-cmake-sanitized/llvm-project/lldb/packages/Python/lldbsuite/test/decorators.py", line 110, in wrapper func(*args, **kwargs) File "/Users/buildslave/jenkins/workspace/lldb-cmake-sanitized/llvm-project/lldb/packages/Python/lldbsuite/test/decorators.py", line 110, in wrapper func(*args, **kwargs) File "/Users/buildslave/jenkins/workspace/lldb-cmake-sanitized/llvm-project/lldb/packages/Python/lldbsuite/test/decorators.py", line 110, in wrapper func(*args, **kwargs) File "/Users/buildslave/jenkins/workspace/lldb-cmake-sanitized/llvm-project/lldb/test/API/python_api/thread/TestThreadAPI.py", line 50, in test_step_out_of_malloc_into_function_b self.step_out_of_malloc_into_function_b(self.exe_name) File "/Users/buildslave/jenkins/workspace/lldb-cmake-sanitized/llvm-project/lldb/test/API/python_api/thread/TestThreadAPI.py", line 157, in step_out_of_malloc_into_function_b thread.IsValid(), AttributeError: 'NoneType' object has no attribute 'IsValid' Config=x86_64-/Users/buildslave/jenkins/workspace/lldb-cmake-sanitized/lldb-build/bin/clang-11 ====================================================================== ERROR: test_step_out_of_malloc_into_function_b_gmodules (TestThreadAPI.ThreadAPITestCase) Test Python SBThread.StepOut() API to step out of a malloc call where the call site is at function b(). ---------------------------------------------------------------------- Traceback (most recent call last): File "/Users/buildslave/jenkins/workspace/lldb-cmake-sanitized/llvm-project/lldb/packages/Python/lldbsuite/test/lldbtest.py", line 1751, in test_method return attrvalue(self) File "/Users/buildslave/jenkins/workspace/lldb-cmake-sanitized/llvm-project/lldb/packages/Python/lldbsuite/test/decorators.py", line 110, in wrapper func(*args, **kwargs) File "/Users/buildslave/jenkins/workspace/lldb-cmake-sanitized/llvm-project/lldb/packages/Python/lldbsuite/test/decorators.py", line 110, in wrapper func(*args, **kwargs) File "/Users/buildslave/jenkins/workspace/lldb-cmake-sanitized/llvm-project/lldb/packages/Python/lldbsuite/test/decorators.py", line 110, in wrapper func(*args, **kwargs) File "/Users/buildslave/jenkins/workspace/lldb-cmake-sanitized/llvm-project/lldb/test/API/python_api/thread/TestThreadAPI.py", line 50, in test_step_out_of_malloc_into_function_b self.step_out_of_malloc_into_function_b(self.exe_name) File "/Users/buildslave/jenkins/workspace/lldb-cmake-sanitized/llvm-project/lldb/test/API/python_api/thread/TestThreadAPI.py", line 157, in step_out_of_malloc_into_function_b thread.IsValid(), AttributeError: 'NoneType' object has no attribute 'IsValid' Config=x86_64-/Users/buildslave/jenkins/workspace/lldb-cmake-sanitized/lldb-build/bin/clang-11 ---------------------------------------------------------------------- Ran 20 tests in 40.721s

Hide Details

RESULT: FAILED (12 passes, 0 failures, 3 errors, 5 skipped, 0 expected failures, 0 unexpected successes)

Hide Details

--

Hide Details

******************** PASS: lldb-unit :: Utility/./UtilityTests/RegularExpression.Empty (1000 of 1969) PASS: lldb-unit :: UnwindAssembly/x86/./UnwindAssemblyx86Tests/Testx86AssemblyInspectionEngine.Test64bitFramelessBigStackFrame (1001 of 1969) PASS: lldb-unit :: Process/minidump/./LLDBMinidumpTests/MinidumpParserTest.GetThreadContext_x86_64 (1002 of 1969) PASS: lldb-unit :: Expression/./ExpressionTests/DiagnosticManagerTest.PutStringSeverities (1003 of 1969) PASS: lldb-unit :: Utility/./UtilityTests/StringListTest.CopyList (1004 of 1969) PASS: lldb-shell :: SymbolFile/DWARF/split-dwarf-multiple-cu.ll (1005 of 1969) PASS: lldb-unit :: Symbol/./SymbolTests/TestTypeSystemClang.TestGetTypeClassDeclType (1006 of 1969) UNSUPPORTED: lldb-shell :: SymbolFile/target-symbols-add-unwind.test (1007 of 1969) UNSUPPORTED: lldb-shell :: SymbolFile/NativePDB/ast-functions-msvc.cpp (1008 of 1969) PASS: lldb-api :: tools/lldb-server/inferior-crash/TestGdbRemoteAbort.py (1009 of 1969) PASS: lldb-unit :: ScriptInterpreter/Python/./ScriptInterpreterPythonTests/PythonDataObjectsTest.TestCallable (1010 of 1969) UNSUPPORTED: lldb-shell :: ScriptInterpreter/Lua/bindings.test (1011 of 1969) PASS: lldb-unit :: UnwindAssembly/x86/./UnwindAssemblyx86Tests/Testx86AssemblyInspectionEngine.Test32bitFramelessSmallStackFrame (1012 of 1969) PASS: lldb-api :: commands/log/invalid-args/TestInvalidArgsLog.py (1013 of 1969) PASS: lldb-unit :: Utility/./UtilityTests/StringLexerTest.Peek (1014 of 1969) PASS: lldb-api :: commands/watchpoints/watchpoint_events/TestWatchpointEvents.py (1015 of 1969) PASS: lldb-api :: commands/expression/import-std-module/vector/TestVectorFromStdModule.py (1016 of 1969) PASS: lldb-unit :: Language/CPlusPlus/./LanguageCPlusPlusTests/CPlusPlusLanguage.FindAlternateFunctionManglings (1017 of 1969) PASS: lldb-unit :: Expression/./ExpressionTests/CppModuleConfigurationTest.AmbiguousCLib (1018 of 1969) PASS: lldb-unit :: Utility/./UtilityTests/ArgsTest.ReplaceArgumentAtIndexLonger (1019 of 1969) PASS: lldb-unit :: Utility/./UtilityTests/CompletionRequest.DuplicateFilteringWithComments (1020 of 1969) PASS: lldb-unit :: Utility/./UtilityTests/StringListTest.LongestCommonPrefixDuplicateElement (1021 of 1969) PASS: lldb-unit :: Symbol/./SymbolTests/LineEntryTest.GetSameLineContiguousAddressRangeNoInlines (1022 of 1969) UNSUPPORTED: lldb-api :: functionalities/darwin_log/filter/exact_match/subsystem/TestDarwinLogFilterMatchSubsystem.py (1023 of 1969) PASS: lldb-unit :: Expression/./ExpressionTests/DiagnosticManagerTest.GetStringMultiline (1024 of 1969) PASS: lldb-unit :: Language/Highlighting/./HighlighterTests/HighlighterTest.ClangUnterminatedString (1025 of 1969) PASS: lldb-api :: functionalities/data-formatter/ostypeformatting/TestFormattersOsType.py (1026 of 1969) PASS: lldb-shell :: ObjectFile/ELF/minidebuginfo-find-symbols.yaml (1027 of 1969) PASS: lldb-api :: lang/cpp/scope/TestCppScope.py (1028 of 1969) PASS: lldb-unit :: Utility/./UtilityTests/VMRange.Comparison (1029 of 1969) PASS: lldb-unit :: Utility/./UtilityTests/ArchSpecTest.OperatorBool (1030 of 1969) PASS: lldb-api :: commands/settings/quoting/TestQuoting.py (1031 of 1969) PASS: lldb-unit :: UnwindAssembly/x86/./UnwindAssemblyx86Tests/Testx86AssemblyInspectionEngine.TestSimple64bitFrameFunction (1032 of 1969) PASS: lldb-api :: commands/expression/rdar44436068/Test128BitsInteger.py (1033 of 1969) PASS: lldb-shell :: Quit/TestQuitExitCodeHexA.test (1034 of 1969) PASS: lldb-shell :: Settings/TestModuleCacheSanity.test (1035 of 1969) PASS: lldb-unit :: Expression/./ExpressionTests/DiagnosticManagerTest.GetStringBasic (1036 of 1969) PASS: lldb-api :: commands/expression/anonymous-struct/TestCallUserAnonTypedef.py (1037 of 1969) PASS: lldb-unit :: Utility/./UtilityTests/ScalarTest.SetValueFromCString (1038 of 1969) PASS: lldb-api :: functionalities/data-formatter/data-formatter-objc/cmtime/TestDataFormatterCMTime.py (1039 of 1969) PASS: lldb-api :: lang/cpp/nsimport/TestCppNsImport.py (1040 of 1969) PASS: lldb-api :: functionalities/breakpoint/step_over_breakpoint/TestStepOverBreakpoint.py (1041 of 1969) PASS: lldb-unit :: Host/./HostTests/NativeProcessProtocolTest.ReadCStringFromMemory_MaxSize (1042 of 1969) PASS: lldb-api :: functionalities/data-formatter/data-formatter-stl/libcxx/forward_list/TestDataFormatterLibcxxForwardList.py (1043 of 1969) PASS: lldb-api :: functionalities/breakpoint/breakpoint_command/TestBreakpointCommand.py (1044 of 1969) PASS: lldb-unit :: Language/Highlighting/./HighlighterTests/HighlighterTest.ClangStringLiterals (1045 of 1969) PASS: lldb-api :: macosx/duplicate-archive-members/TestDuplicateMembers.py (1046 of 1969) PASS: lldb-api :: lang/c/const_variables/TestConstVariables.py (1047 of 1969) PASS: lldb-shell :: SymbolFile/DWARF/forward-declarations.s (1048 of 1969) PASS: lldb-unit :: Utility/./UtilityTests/StringListTest.RemoveBlankLines (1049 of 1969) PASS: lldb-unit :: Language/Highlighting/./HighlighterTests/HighlighterTest.Keywords (1050 of 1969) PASS: lldb-api :: functionalities/breakpoint/scripted_bkpt/TestScriptedResolver.py (1051 of 1969) PASS: lldb-unit :: Utility/./UtilityTests/StringExtractorTest.GetHexBytesAvail_OddPair2 (1052 of 1969) UNSUPPORTED: lldb-shell :: Register/x86-64-ymm16-read.test (1053 of 1969) PASS: lldb-api :: functionalities/thread/concurrent_events/TestConcurrentDelayedCrashWithBreakpointSignal.py (1054 of 1969) PASS: lldb-api :: python_api/watchpoint/TestSetWatchpoint.py (1055 of 1969) UNSUPPORTED: lldb-api :: tools/lldb-server/thread-name/TestGdbRemoteThreadName.py (1056 of 1969) PASS: lldb-shell :: ObjectFile/PECOFF/invalid-export-table.yaml (1057 of 1969) PASS: lldb-api :: lang/cpp/operators/TestCppOperators.py (1058 of 1969) UNSUPPORTED: lldb-api :: functionalities/unwind/standard/TestStandardUnwind.py (1059 of 1969) UNSUPPORTED: lldb-shell :: Minidump/Windows/arm-fp-unwind.test (1060 of 1969) PASS: lldb-api :: commands/expression/vector_of_enums/TestVectorOfEnums.py (1061 of 1969) PASS: lldb-unit :: Utility/./UtilityTests/CompletionRequest.TryCompleteCurrentArgGood (1062 of 1969) PASS: lldb-unit :: Utility/./UtilityTests/ReproducerTest.SetReplay (1063 of 1969) PASS: lldb-api :: functionalities/data-formatter/data-formatter-advanced/TestDataFormatterAdv.py (1064 of 1969) UNSUPPORTED: lldb-api :: functionalities/signal/handle-segv/TestHandleSegv.py (1065 of 1969) PASS: lldb-api :: commands/expression/import_builtin_fileid/TestImportBuiltinFileID.py (1066 of 1969) PASS: lldb-api :: functionalities/thread/backtrace_all/TestBacktraceAll.py (1067 of 1969) PASS: lldb-api :: types/TestDoubleTypes.py (1068 of 1969) PASS: lldb-unit :: SymbolFile/NativePDB/./SymbolFileNativePDBTests/PDBFPOProgramToDWARFExpressionTests.InvalidOpUnary (1069 of 1969) PASS: lldb-unit :: ScriptInterpreter/Python/./ScriptInterpreterPythonTests/PythonDataObjectsTest.TestPythonTupleValues (1070 of 1969) PASS: lldb-shell :: SymbolFile/DWARF/debug-types-missing-signature.test (1071 of 1969) PASS: lldb-api :: functionalities/data-formatter/varscript_formatting/TestDataFormatterVarScriptFormatting.py (1072 of 1969) PASS: lldb-api :: commands/expression/context-object-objc/TestContextObjectObjc.py (1073 of 1969) PASS: lldb-unit :: Utility/./UtilityTests/RangeTest.LessThan (1074 of 1969) PASS: lldb-unit :: Process/minidump/./LLDBMinidumpTests/MinidumpParserTest.GetPid (1075 of 1969) PASS: lldb-api :: types/TestLongTypes.py (1076 of 1969) PASS: lldb-api :: lang/objc/objc-stepping/TestObjCStepping.py (1077 of 1969) PASS: lldb-api :: commands/expression/char/TestExprsChar.py (1078 of 1969) PASS: lldb-shell :: ObjectFile/MachO/lc_build_version.yaml (1079 of 1969) PASS: lldb-unit :: Symbol/./SymbolTests/TestTypeSystemClang.TestGetTypeClassTypeOf (1080 of 1969) PASS: lldb-api :: functionalities/data-formatter/summary-string-onfail/Test-rdar-9974002.py (1081 of 1969) PASS: lldb-api :: commands/expression/import-std-module/unique_ptr-dbg-info-content/TestUniquePtrDbgInfoContent.py (1082 of 1969) PASS: lldb-unit :: Expression/./ExpressionTests/DWARFExpression.DW_OP_piece (1083 of 1969) PASS: lldb-unit :: Language/Highlighting/./HighlighterTests/HighlighterTest.ClangCursorPosInOtherToken (1084 of 1969) PASS: lldb-shell :: SymbolFile/DWARF/debug-types-address-ranges.s (1085 of 1969) PASS: lldb-api :: commands/platform/basic/TestPlatformCommand.py (1086 of 1969) PASS: lldb-api :: functionalities/tail_call_frames/disambiguate_paths_to_common_sink/TestDisambiguatePathsToCommonSink.py (1087 of 1969) PASS: lldb-unit :: Signals/./SignalsTests/UnixSignalsTest.VersionChange (1088 of 1969) PASS: lldb-api :: types/TestCharTypeExpr.py (1089 of 1969) PASS: lldb-api :: lang/c/step-target/TestStepTarget.py (1090 of 1969) PASS: lldb-unit :: Utility/./UtilityTests/SerializationRountripTest.SerializeDeserializeCStringArrayNullptrElem (1091 of 1969) PASS: lldb-api :: functionalities/postmortem/elf-core/thread_crash/TestLinuxCoreThreads.py (1092 of 1969) PASS: lldb-unit :: Utility/./UtilityTests/ProcessInstanceInfo.Dump (1093 of 1969) PASS: lldb-api :: functionalities/breakpoint/serialize/TestBreakpointSerialization.py (1094 of 1969) PASS: lldb-unit :: Utility/./UtilityTests/OptionsWithRawTest.TerminatedQuote (1095 of 1969) PASS: lldb-unit :: Utility/./UtilityTests/ArgsTest.TestMultipleArgs (1096 of 1969) PASS: lldb-api :: commands/expression/persist_objc_pointeetype/TestPersistObjCPointeeType.py (1097 of 1969) PASS: lldb-api :: python_api/name_lookup/TestNameLookup.py (1098 of 1969) PASS: lldb-unit :: UnwindAssembly/x86/./UnwindAssemblyx86Tests/Testx86AssemblyInspectionEngine.TestPushImm (1099 of 1969) PASS: lldb-unit :: Language/Highlighting/./HighlighterTests/HighlighterTest.ClangSquareBrackets (1100 of 1969) PASS: lldb-api :: python_api/frame/TestFrames.py (1101 of 1969) PASS: lldb-api :: commands/expression/top-level/TestTopLevelExprs.py (1102 of 1969) PASS: lldb-unit :: Utility/./UtilityTests/StringListTest.InsertStringAtIndexStdString (1103 of 1969) PASS: lldb-unit :: Expression/./ExpressionTests/CppModuleConfigurationTest.LinuxLocalLibCpp (1104 of 1969) PASS: lldb-unit :: SymbolFile/DWARF/./SymbolFileDWARFTests/SymbolFileDWARFTests.TestAbbrevOutOfOrder (1105 of 1969) UNSUPPORTED: lldb-shell :: SymbolFile/PDB/func-symbols.test (1106 of 1969) PASS: lldb-api :: python_api/sbvalue_const_addrof/TestSBValueConstAddrOf.py (1107 of 1969) PASS: lldb-unit :: Utility/./UtilityTests/ArgsTest.TestInsertArg (1108 of 1969) PASS: lldb-unit :: Utility/./UtilityTests/StreamTeeTest.Write (1109 of 1969) PASS: lldb-unit :: ScriptInterpreter/Python/./ScriptInterpreterPythonTests/PythonDataObjectsTest.TestInstanceNameResolutionNoDot (1110 of 1969) UNSUPPORTED: lldb-api :: benchmarks/turnaround/TestCompileRunToBreakpointTurnaround.py (1111 of 1969) PASS: lldb-api :: functionalities/data-formatter/data-formatter-objc/TestDataFormatterObjCNSContainer.py (1112 of 1969) PASS: lldb-api :: lang/objc/objc-class-method/TestObjCClassMethod.py (1113 of 1969) PASS: lldb-unit :: Language/Highlighting/./HighlighterTests/HighlighterTest.ClangIdentifiers (1114 of 1969) PASS: lldb-shell :: SymbolFile/NativePDB/ast-methods.cpp (1115 of 1969) PASS: lldb-unit :: Host/./HostTests/FileSystemTest.GetByteSize (1116 of 1969) PASS: lldb-unit :: Utility/./UtilityTests/OptionsWithRawTest.ArgsButNoLeadingDash (1117 of 1969) PASS: lldb-api :: lang/objc/objc-super/TestObjCSuper.py (1118 of 1969) PASS: lldb-api :: tools/lldb-vscode/breakpoint/TestVSCode_setExceptionBreakpoints.py (1119 of 1969) PASS: lldb-api :: python_api/get-value-32bit-int/TestGetValue32BitInt.py (1120 of 1969) PASS: lldb-unit :: SymbolFile/NativePDB/./SymbolFileNativePDBTests/PDBFPOProgramToDWARFExpressionTests.MultipleDependentAssignments (1121 of 1969) PASS: lldb-api :: commands/process/attach/TestProcessAttach.py (1122 of 1969) PASS: lldb-unit :: Utility/./UtilityTests/StateTest.Formatv (1123 of 1969) PASS: lldb-unit :: Symbol/./SymbolTests/TestTypeSystemClang.TestConvertAccessTypeToAccessSpecifier (1124 of 1969) PASS: lldb-unit :: Utility/./UtilityTests/VMRange.Ordering (1125 of 1969) UNSUPPORTED: lldb-api :: lang/c/typedef/Testtypedef.py (1126 of 1969) PASS: lldb-unit :: ObjectFile/ELF/./ObjectFileELFTests/ObjectFileELFTest.SectionsResolveConsistently (1127 of 1969) PASS: lldb-unit :: Utility/./UtilityTests/ArchSpecTest.TestSetTriple (1128 of 1969) PASS: lldb-unit :: Utility/./UtilityTests/BinaryStreamTest.PutULEB128OneByte (1129 of 1969) UNSUPPORTED: lldb-api :: commands/gui/basic/TestGuiBasic.py (1130 of 1969) UNSUPPORTED: lldb-shell :: Register/x86-64-zmm-write.test (1131 of 1969) PASS: lldb-shell :: SymbolFile/NativePDB/globals-fundamental.cpp (1132 of 1969) PASS: lldb-shell :: Quit/TestQuitExitCodeTooManyArgs.test (1133 of 1969) PASS: lldb-shell :: ObjectFile/PECOFF/symbol.yaml (1134 of 1969) PASS: lldb-api :: functionalities/breakpoint/hardware_breakpoints/hardware_breakpoint_on_multiple_threads/TestHWBreakMultiThread.py (1135 of 1969) PASS: lldb-unit :: Utility/./UtilityTests/ArgsTest.TestAppendArg (1136 of 1969) XFAIL: lldb-shell :: Register/x86-64-ymm-write.test (1137 of 1969) PASS: lldb-shell :: SymbolFile/DWARF/dwarf5-debug_line.s (1138 of 1969) PASS: lldb-shell :: ObjectFile/ELF/section-permissions.yaml (1139 of 1969) PASS: lldb-unit :: Utility/./UtilityTests/AnsiTerminal.Basic (1140 of 1969) PASS: lldb-api :: python_api/value/TestValueAPI.py (1141 of 1969) PASS: lldb-unit :: ScriptInterpreter/Python/./ScriptInterpreterPythonTests/PythonDataObjectsTest.TestPythonDictionaryValueEquality (1142 of 1969) PASS: lldb-unit :: Process/gdb-remote/./ProcessGdbRemoteTests/GDBRemoteCommunicationClientTest.ReadRegister (1143 of 1969) PASS: lldb-api :: functionalities/gdb_remote_client/TestJLink6Armv7RegisterDefinition.py (1144 of 1969) PASS: lldb-unit :: ScriptInterpreter/Python/./ScriptInterpreterPythonTests/PythonDataObjectsTest.TestPythonListToStructuredList (1145 of 1969) PASS: lldb-api :: lang/cpp/accelerator-table/TestCPPAccelerator.py (1146 of 1969) PASS: lldb-api :: python_api/value_var_update/TestValueVarUpdate.py (1147 of 1969) PASS: lldb-unit :: Process/gdb-remote/./ProcessGdbRemoteTests/GDBRemoteCommunicationTest.ReadPacket_checksum (1148 of 1969) PASS: lldb-shell :: Commands/CommandScriptImmediateOutput/CommandScriptImmediateOutputConsole.test (1149 of 1969) PASS: lldb-unit :: Utility/./UtilityTests/StreamTest.ShiftOperatorChars (1150 of 1969) UNSUPPORTED: lldb-shell :: Unwind/eh-frame-small-fde.test (1151 of 1969) PASS: lldb-unit :: Utility/./UtilityTests/ScalarTest.APIntConstructor (1152 of 1969) PASS: lldb-unit :: Host/./HostTests/NativeProcessProtocolTest.SetBreakpointFailVerify (1153 of 1969) PASS: lldb-unit :: Utility/./UtilityTests/BinaryStreamTest.PutULEB128SixBytes (1154 of 1969) PASS: lldb-api :: functionalities/data-formatter/data-formatter-stl/libcxx/list/TestDataFormatterLibcxxList.py (1155 of 1969) PASS: lldb-unit :: Utility/./UtilityTests/OptionsWithRawTest.SingleWordSuffix (1156 of 1969) PASS: lldb-api :: functionalities/load_unload/TestLoadUnload.py (1157 of 1969) PASS: lldb-api :: functionalities/data-formatter/data-formatter-categories/TestDataFormatterCategories.py (1158 of 1969) PASS: lldb-unit :: Utility/./UtilityTests/StringListTest.SplitIntoLinesSingleTrailingCR (1159 of 1969) PASS: lldb-unit :: Utility/./UtilityTests/ProcessInstanceInfo.DumpTable_invalidUID (1160 of 1969) UNSUPPORTED: lldb-api :: functionalities/data-formatter/data-formatter-stl/libstdcpp/string/TestDataFormatterStdString.py (1161 of 1969) PASS: lldb-shell :: SymbolFile/DWARF/debug_ranges_and_rnglists.test (1162 of 1969) PASS: lldb-shell :: BuildScript/modes.test (1163 of 1969) PASS: lldb-shell :: SymbolFile/DWARF/find-basic-function.cpp (1164 of 1969) FAIL: lldb-api :: lang/objc/ptr_refs/TestPtrRefsObjC.py (1165 of 1969) ******************** TEST 'lldb-api :: lang/objc/ptr_refs/TestPtrRefsObjC.py' FAILED ******************** Script: -- /usr/local/bin/python /Users/buildslave/jenkins/workspace/lldb-cmake-sanitized/llvm-project/lldb/test/API/dotest.py --arch x86_64 -s /Users/buildslave/jenkins/workspace/lldb-cmake-sanitized/lldb-build/lldb-test-traces -S nm -u CXXFLAGS -u CFLAGS --codesign-identity lldb_codesign --server /Users/buildslave/jenkins/workspace/lldb-cmake-sanitized/lldb-build/./bin/debugserver --arch x86_64 --build-dir /Users/buildslave/jenkins/workspace/lldb-cmake-sanitized/lldb-build/lldb-test-build.noindex -s=/Users/buildslave/jenkins/workspace/lldb-cmake-sanitized/test/logs -t --env TERM=vt100 --env LLVM_LIBS_DIR=/Users/buildslave/jenkins/workspace/lldb-cmake-sanitized/lldb-build/./lib --inferior-env ASAN_OPTIONS=detect_stack_use_after_return=1 --inferior-env DYLD_INSERT_LIBRARIES=/Users/buildslave/jenkins/workspace/lldb-cmake-sanitized/host-compiler/lib/clang/11.0.0/lib/darwin/libclang_rt.asan_osx_dynamic.dylib --build-dir /Users/buildslave/jenkins/workspace/lldb-cmake-sanitized/lldb-build/lldb-test-build.noindex --lldb-module-cache-dir /Users/buildslave/jenkins/workspace/lldb-cmake-sanitized/lldb-build/lldb-test-build.noindex/module-cache-lldb/lldb-api --clang-module-cache-dir /Users/buildslave/jenkins/workspace/lldb-cmake-sanitized/lldb-build/lldb-test-build.noindex/module-cache-clang/lldb-api --executable /Users/buildslave/jenkins/workspace/lldb-cmake-sanitized/lldb-build/./bin/lldb --compiler /Users/buildslave/jenkins/workspace/lldb-cmake-sanitized/lldb-build/./bin/clang --dsymutil /Users/buildslave/jenkins/workspace/lldb-cmake-sanitized/lldb-build/./bin/dsymutil --filecheck /Users/buildslave/jenkins/workspace/lldb-cmake-sanitized/lldb-build/./bin/FileCheck --lldb-libs-dir /Users/buildslave/jenkins/workspace/lldb-cmake-sanitized/lldb-build/./lib /Users/buildslave/jenkins/workspace/lldb-cmake-sanitized/llvm-project/lldb/test/API/lang/objc/ptr_refs -p TestPtrRefsObjC.py -- Exit Code: 1

Hide Details

Command Output (stdout): -- lldb version 11.0.99 clang revision 4a6ebc03ba89340e119b3c2c6b8a6c721fff5fd5 llvm revision 4a6ebc03ba89340e119b3c2c6b8a6c721fff5fd5 "crashlog" and "save_crashlog" command installed, use the "--help" option for detailed help "malloc_info", "ptr_refs", "cstr_refs", "find_variable", and "objc_refs" commands have been installed, use the "--help" options on these commands for detailed help. LLDB library dir: /Users/buildslave/jenkins/workspace/lldb-cmake-sanitized/lldb-build/bin LLDB import library dir: /Users/buildslave/jenkins/workspace/lldb-cmake-sanitized/lldb-build/./lib libstdcxx tests will not be run because: Don't know how to build with libstdcxx on macosx Skipping following debug info categories: ['dwo'] 0x00007ffee117f468: stack in frame #0 of thread #1: tid 0x261e63 in variable at 0x7ffee117f468: (MyClass *) self = 0x00006020000000d0 0x00007ffee117f3e0: stack (red zone)

Hide Details

-- Command Output (stderr): -- error: 'ptr_refs' is not a valid command. error: 'ptr_refs' is not a valid command.

Hide Details

Session logs for test failures/errors/unexpected successes will go into directory '/Users/buildslave/jenkins/workspace/lldb-cmake-sanitized/test/logs' Command invoked: /Users/buildslave/jenkins/workspace/lldb-cmake-sanitized/llvm-project/lldb/test/API/dotest.py --arch x86_64 -s /Users/buildslave/jenkins/workspace/lldb-cmake-sanitized/lldb-build/lldb-test-traces -S nm -u CXXFLAGS -u CFLAGS --codesign-identity lldb_codesign --server /Users/buildslave/jenkins/workspace/lldb-cmake-sanitized/lldb-build/./bin/debugserver --arch x86_64 --build-dir /Users/buildslave/jenkins/workspace/lldb-cmake-sanitized/lldb-build/lldb-test-build.noindex -s=/Users/buildslave/jenkins/workspace/lldb-cmake-sanitized/test/logs -t --env TERM=vt100 --env LLVM_LIBS_DIR=/Users/buildslave/jenkins/workspace/lldb-cmake-sanitized/lldb-build/./lib --inferior-env ASAN_OPTIONS=detect_stack_use_after_return=1 --inferior-env DYLD_INSERT_LIBRARIES=/Users/buildslave/jenkins/workspace/lldb-cmake-sanitized/host-compiler/lib/clang/11.0.0/lib/darwin/libclang_rt.asan_osx_dynamic.dylib --build-dir /Users/buildslave/jenkins/workspace/lldb-cmake-sanitized/lldb-build/lldb-test-build.noindex --lldb-module-cache-dir /Users/buildslave/jenkins/workspace/lldb-cmake-sanitized/lldb-build/lldb-test-build.noindex/module-cache-lldb/lldb-api --clang-module-cache-dir /Users/buildslave/jenkins/workspace/lldb-cmake-sanitized/lldb-build/lldb-test-build.noindex/module-cache-clang/lldb-api --executable /Users/buildslave/jenkins/workspace/lldb-cmake-sanitized/lldb-build/./bin/lldb --compiler /Users/buildslave/jenkins/workspace/lldb-cmake-sanitized/lldb-build/./bin/clang --dsymutil /Users/buildslave/jenkins/workspace/lldb-cmake-sanitized/lldb-build/./bin/dsymutil --filecheck /Users/buildslave/jenkins/workspace/lldb-cmake-sanitized/lldb-build/./bin/FileCheck --lldb-libs-dir /Users/buildslave/jenkins/workspace/lldb-cmake-sanitized/lldb-build/./lib /Users/buildslave/jenkins/workspace/lldb-cmake-sanitized/llvm-project/lldb/test/API/lang/objc/ptr_refs -p TestPtrRefsObjC.py Change dir to: /Users/buildslave/jenkins/workspace/lldb-cmake-sanitized/llvm-project/lldb/test/API/lang/objc/ptr_refs runCmd: settings clear -all output:

Hide Details

runCmd: settings set symbols.enable-external-lookup false output:

Hide Details

runCmd: settings set target.auto-apply-fixits false output:

Hide Details

runCmd: settings set plugin.process.gdb-remote.packet-timeout 60 output:

Hide Details

runCmd: settings set symbols.clang-modules-cache-path "/Users/buildslave/jenkins/workspace/lldb-cmake-sanitized/lldb-build/lldb-test-build.noindex/module-cache-lldb/lldb-api" output:

Hide Details

runCmd: settings set use-color false output:

Hide Details

runCmd: setting set target.prefer-dynamic-value no-dynamic-values output:

Hide Details

runCmd: settings set target.env-vars ASAN_OPTIONS=detect_stack_use_after_return=1 DYLD_INSERT_LIBRARIES=/Users/buildslave/jenkins/workspace/lldb-cmake-sanitized/host-compiler/lib/clang/11.0.0/lib/darwin/libclang_rt.asan_osx_dynamic.dylib output:

Hide Details

runCmd: script import lldb.macosx.heap output: "crashlog" and "save_crashlog" command installed, use the "--help" option for detailed help "malloc_info", "ptr_refs", "cstr_refs", "find_variable", and "objc_refs" commands have been installed, use the "--help" options on these commands for detailed help.

Hide Details

Hide Details

runCmd: ptr_refs self output: 0x00007ffee117f468: stack in frame #0 of thread #1: tid 0x261e63 in variable at 0x7ffee117f468: (MyClass *) self = 0x00006020000000d0 0x00007ffee117f3e0: stack (red zone)

Hide Details

Hide Details

Expecting sub string: malloc Not matched

Hide Details

FAIL: LLDB (/Users/buildslave/jenkins/workspace/lldb-cmake-sanitized/lldb-build/bin/clang-11-x86_64) :: test_ptr_refs_dsym (TestPtrRefsObjC.TestPtrRefsObjC) <bound method SBProcess.Kill of <lldb.SBProcess; proxy of <Swig Object of type 'lldb::SBProcess *' at 0x10f1bb8a0> >>: success

Hide Details

runCmd: settings clear -all output:

Hide Details

runCmd: settings set symbols.enable-external-lookup false output:

Hide Details

runCmd: settings set target.auto-apply-fixits false output:

Hide Details

runCmd: settings set plugin.process.gdb-remote.packet-timeout 60 output:

Hide Details

runCmd: settings set symbols.clang-modules-cache-path "/Users/buildslave/jenkins/workspace/lldb-cmake-sanitized/lldb-build/lldb-test-build.noindex/module-cache-lldb/lldb-api" output:

Hide Details

runCmd: settings set use-color false output:

Hide Details

runCmd: setting set target.prefer-dynamic-value no-dynamic-values output:

Hide Details

runCmd: settings set target.env-vars ASAN_OPTIONS=detect_stack_use_after_return=1 DYLD_INSERT_LIBRARIES=/Users/buildslave/jenkins/workspace/lldb-cmake-sanitized/host-compiler/lib/clang/11.0.0/lib/darwin/libclang_rt.asan_osx_dynamic.dylib output:

Hide Details

runCmd: script import lldb.macosx.heap output:

Hide Details

runCmd: ptr_refs self runCmd failed! error: 'ptr_refs' is not a valid command.

Hide Details

Hide Details

XFAIL: LLDB (/Users/buildslave/jenkins/workspace/lldb-cmake-sanitized/lldb-build/bin/clang-11-x86_64) :: test_ptr_refs_dwarf (TestPtrRefsObjC.TestPtrRefsObjC) <bound method SBProcess.Kill of <lldb.SBProcess; proxy of <Swig Object of type 'lldb::SBProcess *' at 0x10e570990> >>: success

Hide Details

UNSUPPORTED: LLDB (/Users/buildslave/jenkins/workspace/lldb-cmake-sanitized/lldb-build/bin/clang-11-x86_64) :: test_ptr_refs_dwo (TestPtrRefsObjC.TestPtrRefsObjC) (test case does not fall in any category of interest for this run) runCmd: settings clear -all output:

Hide Details

runCmd: settings set symbols.enable-external-lookup false output:

Hide Details

runCmd: settings set target.auto-apply-fixits false output:

Hide Details

runCmd: settings set plugin.process.gdb-remote.packet-timeout 60 output:

Hide Details

runCmd: settings set symbols.clang-modules-cache-path "/Users/buildslave/jenkins/workspace/lldb-cmake-sanitized/lldb-build/lldb-test-build.noindex/module-cache-lldb/lldb-api" output:

Hide Details

runCmd: settings set use-color false output:

Hide Details

runCmd: setting set target.prefer-dynamic-value no-dynamic-values output:

Hide Details

runCmd: settings set target.env-vars ASAN_OPTIONS=detect_stack_use_after_return=1 DYLD_INSERT_LIBRARIES=/Users/buildslave/jenkins/workspace/lldb-cmake-sanitized/host-compiler/lib/clang/11.0.0/lib/darwin/libclang_rt.asan_osx_dynamic.dylib output:

Hide Details

runCmd: script import lldb.macosx.heap output:

Hide Details

runCmd: ptr_refs self runCmd failed! error: 'ptr_refs' is not a valid command.

Hide Details

Hide Details

XFAIL: LLDB (/Users/buildslave/jenkins/workspace/lldb-cmake-sanitized/lldb-build/bin/clang-11-x86_64) :: test_ptr_refs_gmodules (TestPtrRefsObjC.TestPtrRefsObjC) <bound method SBProcess.Kill of <lldb.SBProcess; proxy of <Swig Object of type 'lldb::SBProcess *' at 0x10f1bb1e0> >>: success

Hide Details

Restore dir to: /Users/buildslave/jenkins/workspace/lldb-cmake-sanitized/lldb-build/tools/lldb/test ====================================================================== FAIL: test_ptr_refs_dsym (TestPtrRefsObjC.TestPtrRefsObjC) Test the ptr_refs tool on Darwin with Objective-C ---------------------------------------------------------------------- Traceback (most recent call last): File "/Users/buildslave/jenkins/workspace/lldb-cmake-sanitized/llvm-project/lldb/packages/Python/lldbsuite/test/lldbtest.py", line 1751, in test_method return attrvalue(self) File "/Users/buildslave/jenkins/workspace/lldb-cmake-sanitized/llvm-project/lldb/packages/Python/lldbsuite/test/decorators.py", line 110, in wrapper func(*args, **kwargs) File "/Users/buildslave/jenkins/workspace/lldb-cmake-sanitized/llvm-project/lldb/test/API/lang/objc/ptr_refs/TestPtrRefsObjC.py", line 47, in test_ptr_refs self.expect("ptr_refs self", substrs=["malloc", "stack"]) File "/Users/buildslave/jenkins/workspace/lldb-cmake-sanitized/llvm-project/lldb/packages/Python/lldbsuite/test/lldbtest.py", line 2391, in expect if msg else EXP_MSG(str, output, exe)) AssertionError: False is not True : 'ptr_refs self' returns expected result, got '0x00007ffee117f468: stack in frame #0 of thread #1: tid 0x261e63 in variable at 0x7ffee117f468: (MyClass *) self = 0x00006020000000d0 0x00007ffee117f3e0: stack (red zone)' Config=x86_64-/Users/buildslave/jenkins/workspace/lldb-cmake-sanitized/lldb-build/bin/clang-11 ---------------------------------------------------------------------- Ran 4 tests in 23.747s

Hide Details

RESULT: FAILED (0 passes, 1 failures, 0 errors, 1 skipped, 2 expected failures, 0 unexpected successes)

Hide Details

--

Hide Details

******************** PASS: lldb-unit :: Host/./HostTests/FileSystemTest.Resolve (1166 of 1969) PASS: lldb-unit :: Utility/./UtilityTests/StringExtractorTest.GetU32LittleEndian (1167 of 1969) PASS: lldb-shell :: SymbolFile/NativePDB/break-by-line.cpp (1168 of 1969) PASS: lldb-unit :: Process/minidump/./LLDBMinidumpTests/MinidumpParserTest.GetMemoryRegionInfoLinuxMaps (1169 of 1969) PASS: lldb-api :: python_api/lldbutil/TestSwigVersion.py (1170 of 1969) UNSUPPORTED: lldb-shell :: ObjectFile/ELF/minidebuginfo-set-and-hit-breakpoint.test (1171 of 1969) PASS: lldb-api :: tools/lldb-vscode/stackTrace/TestVSCode_stackTrace.py (1172 of 1969) PASS: lldb-unit :: UnwindAssembly/x86/./UnwindAssemblyx86Tests/Testx86AssemblyInspectionEngine.TestSpillRegToStackViaMOVi386 (1173 of 1969) PASS: lldb-api :: python_api/interpreter/TestCommandInterpreterAPI.py (1174 of 1969) PASS: lldb-unit :: Symbol/./SymbolTests/DWARFCallFrameInfoTest.Basic_eh (1175 of 1969) PASS: lldb-unit :: Utility/./UtilityTests/BroadcasterTest.EventTypeHasListeners (1176 of 1969) PASS: lldb-unit :: Process/gdb-remote/./ProcessGdbRemoteTests/GDBRemoteCommunicationClientTest.SendSignalsToIgnore (1177 of 1969) PASS: lldb-api :: functionalities/data-formatter/cstring-utf8-summary/TestCstringUnicode.py (1178 of 1969) UNSUPPORTED: lldb-api :: functionalities/tsan/basic/TestTsanBasic.py (1179 of 1969) PASS: lldb-unit :: UnwindAssembly/x86/./UnwindAssemblyx86Tests/Testx86AssemblyInspectionEngine.TestDisassemblyJunkBytes (1180 of 1969) PASS: lldb-api :: functionalities/data-formatter/data-formatter-objc/TestDataFormatterObjCKVO.py (1181 of 1969) PASS: lldb-api :: lang/cpp/dynamic-value/TestDynamicValue.py (1182 of 1969) PASS: lldb-shell :: ObjectFile/PECOFF/basic-info.yaml (1183 of 1969) PASS: lldb-api :: api/listeners/TestListener.py (1184 of 1969) PASS: lldb-shell :: ObjectFile/PECOFF/uuid.yaml (1185 of 1969) PASS: lldb-unit :: Utility/./UtilityTests/StringExtractorTest.GetHexU8_InvalidHex_NoEof (1186 of 1969) PASS: lldb-api :: tools/lldb-server/TestGdbRemoteExitCode.py (1187 of 1969) PASS: lldb-api :: functionalities/thread/crash_during_step/TestCrashDuringStep.py (1188 of 1969) PASS: lldb-unit :: Signals/./SignalsTests/UnixSignalsTest.GetInfo (1189 of 1969) PASS: lldb-shell :: BuildScript/compiler-full-path.test (1190 of 1969) PASS: lldb-shell :: SymbolFile/NativePDB/tag-types.cpp (1191 of 1969) PASS: lldb-unit :: Language/Highlighting/./HighlighterTests/HighlighterTest.ClangCommas (1192 of 1969) PASS: lldb-unit :: SymbolFile/NativePDB/./SymbolFileNativePDBTests/PDBFPOProgramToDWARFExpressionTests.DependencyChain (1193 of 1969) PASS: lldb-api :: commands/process/launch/TestProcessLaunch.py (1194 of 1969) PASS: lldb-unit :: Utility/./UtilityTests/StringListTest.Join (1195 of 1969) PASS: lldb-api :: tools/lldb-server/TestGdbRemoteHostInfo.py (1196 of 1969) PASS: lldb-unit :: ScriptInterpreter/Python/./ScriptInterpreterPythonTests/PythonDataObjectsTest.TestScript (1197 of 1969) PASS: lldb-unit :: Process/gdb-remote/./ProcessGdbRemoteTests/GDBRemoteCommunicationClientTest.SendStopTracePacket (1198 of 1969) PASS: lldb-unit :: UnwindAssembly/x86/./UnwindAssemblyx86Tests/Testx86AssemblyInspectionEngine.TestPushEDI (1199 of 1969) PASS: lldb-unit :: Host/./HostTests/FileSystemTest.GetPermissions (1200 of 1969) PASS: lldb-api :: lang/c/function_types/TestFunctionTypes.py (1201 of 1969) PASS: lldb-api :: commands/frame/var/TestFrameVar.py (1202 of 1969) PASS: lldb-unit :: Target/./TargetTests/PathMappingListTest.RelativeTests (1203 of 1969) PASS: lldb-unit :: ScriptInterpreter/Python/./ScriptInterpreterPythonTests/PythonDataObjectsTest.TestOwnedReferences (1204 of 1969) PASS: lldb-api :: tools/lldb-vscode/breakpoint-events/TestVSCode_breakpointEvents.py (1205 of 1969) PASS: lldb-api :: lang/cpp/gmodules/TestWithModuleDebugging.py (1206 of 1969) PASS: lldb-api :: lang/c/vla/TestVLA.py (1207 of 1969) PASS: lldb-unit :: SymbolFile/DWARF/./SymbolFileDWARFTests/SymbolFileDWARFTests.TestAbbrevOrder1Start5 (1208 of 1969) PASS: lldb-shell :: Breakpoint/split-dwarf5-debug-stroffsets.test (1209 of 1969) PASS: lldb-api :: functionalities/plugins/python_os_plugin/TestPythonOSPlugin.py (1210 of 1969) PASS: lldb-unit :: Utility/./UtilityTests/StringListTest.AppendStringMove (1211 of 1969) PASS: lldb-api :: functionalities/thread/concurrent_events/TestConcurrentTwoWatchpointsOneBreakpoint.py (1212 of 1969) PASS: lldb-api :: tools/lldb-server/inferior-crash/TestGdbRemoteSegFault.py (1213 of 1969) PASS: lldb-unit :: Utility/./UtilityTests/RangeTest.SizeTypes (1214 of 1969) UNSUPPORTED: lldb-api :: lang/cpp/function-template-parameter-pack/TestFunctionTemplateParameterPack.py (1215 of 1969) PASS: lldb-unit :: UnwindAssembly/x86/./UnwindAssemblyx86Tests/Testx86AssemblyInspectionEngine.TestPopESI (1216 of 1969) PASS: lldb-unit :: Utility/./UtilityTests/StringLexerTest.NextIfList (1217 of 1969) PASS: lldb-api :: python_api/section/TestSectionAPI.py (1218 of 1969) PASS: lldb-unit :: Process/gdb-remote/./ProcessGdbRemoteTests/GDBRemoteClientBaseTest.InterruptNoResponse (1219 of 1969) PASS: lldb-api :: commands/expression/completion-in-lambda-and-unnamed-class/TestCompletionInLambdaAndUnnamedClass.py (1220 of 1969) PASS: lldb-unit :: Utility/./UtilityTests/StringListTest.DefaultConstructor (1221 of 1969) PASS: lldb-api :: commands/disassemble/basic/TestDisassembleBreakpoint.py (1222 of 1969) PASS: lldb-api :: commands/watchpoints/hello_watchpoint/TestMyFirstWatchpoint.py (1223 of 1969) PASS: lldb-unit :: Utility/./UtilityTests/StringListTest.PopBack (1224 of 1969) PASS: lldb-unit :: Language/Highlighting/./HighlighterTests/HighlighterTest.ClangOperators (1225 of 1969) PASS: lldb-unit :: Utility/./UtilityTests/StringExtractorTest.DecodeHexU8_Exact (1226 of 1969) PASS: lldb-api :: commands/expression/static-initializers/TestStaticInitializers.py (1227 of 1969) UNSUPPORTED: lldb-api :: functionalities/data-formatter/data-formatter-stl/libstdcpp/vector/TestDataFormatterStdVector.py (1228 of 1969) PASS: lldb-api :: functionalities/type_lookup/TestTypeLookup.py (1229 of 1969) PASS: lldb-api :: functionalities/data-formatter/data-formatter-stl/libcxx/bitset/TestDataFormatterLibcxxBitset.py (1230 of 1969) PASS: lldb-api :: tools/lldb-server/TestGdbRemoteProcessInfo.py (1231 of 1969) PASS: lldb-unit :: Utility/./UtilityTests/OptionsWithRawTest.QuotedSuffix (1232 of 1969) PASS: lldb-unit :: Utility/./UtilityTests/EnvironmentTest.EnvpConstruction (1233 of 1969) PASS: lldb-api :: macosx/indirect_symbol/TestIndirectSymbols.py (1234 of 1969) PASS: lldb-api :: commands/command/script/import/TestImport.py (1235 of 1969) PASS: lldb-api :: functionalities/data-formatter/data-formatter-stl/libcxx/unique_ptr/TestDataFormatterLibcxxUniquePtr.py (1236 of 1969) PASS: lldb-unit :: Utility/./UtilityTests/StringListTest.JoinNonSpace (1237 of 1969) PASS: lldb-unit :: Utility/./UtilityTests/StreamTest.AddressRangeEmptyRange (1238 of 1969) PASS: lldb-api :: macosx/queues/TestQueues.py (1239 of 1969) PASS: lldb-unit :: Utility/./UtilityTests/StringExtractorTest.GetNameColonValueNoColon (1240 of 1969) PASS: lldb-api :: lang/objc/direct-dispatch-step/TestObjCDirectDispatchStepping.py (1241 of 1969) PASS: lldb-api :: commands/breakpoint/command/list/TestBreakpointCommandList.py (1242 of 1969) PASS: lldb-unit :: Utility/./UtilityTests/StringListTest.InsertStringAtIndexOutOfBounds (1243 of 1969) PASS: lldb-unit :: Expression/./ExpressionTests/CppModuleConfigurationTest.Linux (1244 of 1969) PASS: lldb-shell :: Commands/command-script-import.test (1245 of 1969) PASS: lldb-unit :: Utility/./UtilityTests/SerializationRountripTest.SerializeDeserializeObjectPointer (1246 of 1969) PASS: lldb-api :: python_api/value/linked_list/TestValueAPILinkedList.py (1247 of 1969) PASS: lldb-api :: lang/cpp/template-function/TestTemplateFunctions.py (1248 of 1969) PASS: lldb-api :: types/TestCharType.py (1249 of 1969) PASS: lldb-unit :: Utility/./UtilityTests/StringExtractorTest.GetHexBytesAvail_Partial (1250 of 1969) PASS: lldb-unit :: Utility/./UtilityTests/AnsiTerminal.AtStart (1251 of 1969) PASS: lldb-shell :: ObjectFile/ELF/PT_LOAD-overlap-PT_TLS.yaml (1252 of 1969) PASS: lldb-unit :: Utility/./UtilityTests/NameMatchesTest.StartsWith (1253 of 1969) PASS: lldb-unit :: Utility/./UtilityTests/TimeoutTest.Construction (1254 of 1969) PASS: lldb-api :: functionalities/data-formatter/user-format-vs-summary/TestUserFormatVsSummary.py (1255 of 1969) UNSUPPORTED: lldb-api :: benchmarks/expression/TestExpressionCmd.py (1256 of 1969) PASS: lldb-shell :: SymbolFile/DWARF/debug_loc.s (1257 of 1969) PASS: lldb-api :: functionalities/set-data/TestSetData.py (1258 of 1969) PASS: lldb-api :: functionalities/breakpoint/breakpoint_locations/TestBreakpointLocations.py (1259 of 1969) PASS: lldb-unit :: Language/Highlighting/./HighlighterTests/HighlighterTest.DefaultHighlighter (1260 of 1969) PASS: lldb-unit :: Language/Highlighting/./HighlighterTests/HighlighterTest.ClangTrailingBackslashMissingNewLine (1261 of 1969) PASS: lldb-api :: functionalities/thread/jump/TestThreadJump.py (1262 of 1969) PASS: lldb-api :: python_api/function_symbol/TestSymbolAPI.py (1263 of 1969) PASS: lldb-api :: python_api/type/TestTypeList.py (1264 of 1969) PASS: lldb-shell :: SymbolFile/DWARF/find-inline-method.s (1265 of 1969) PASS: lldb-unit :: Utility/./UtilityTests/StreamTest.PutMaxHex64ByteOrderBig (1266 of 1969) PASS: lldb-api :: functionalities/data-formatter/data-formatter-globals/TestDataFormatterGlobals.py (1267 of 1969) UNSUPPORTED: lldb-shell :: Breakpoint/case-insensitive.test (1268 of 1969) PASS: lldb-unit :: ScriptInterpreter/Python/./ScriptInterpreterPythonTests/PythonDataObjectsTest.TestPythonDictionaryToStructuredDictionary (1269 of 1969) PASS: lldb-api :: commands/log/basic/TestLogging.py (1270 of 1969) UNSUPPORTED: lldb-api :: functionalities/darwin_log/filter/regex/activity-chain/TestDarwinLogFilterRegexActivityChain.py (1271 of 1969) PASS: lldb-unit :: Utility/./UtilityTests/StreamTest.PutNHex8 (1272 of 1969) PASS: lldb-unit :: Utility/./UtilityTests/StreamTest.PutHex16ByteOrderBig (1273 of 1969) UNSUPPORTED: lldb-api :: benchmarks/startup/TestStartupDelays.py (1274 of 1969) PASS: lldb-api :: lang/c/strings/TestCStrings.py (1275 of 1969) PASS: lldb-shell :: Reproducer/TestRelativePath.test (1276 of 1969) UNSUPPORTED: lldb-api :: functionalities/darwin_log/filter/exact_match/activity-chain/TestDarwinLogFilterMatchActivityChain.py (1277 of 1969) PASS: lldb-api :: lang/objc/objc-ivar-protocols/TestIvarProtocols.py (1278 of 1969) PASS: lldb-api :: lang/objcxx/cxx-bridged-po/TestObjCXXBridgedPO.py (1279 of 1969) PASS: lldb-api :: lang/c/set_values/TestSetValues.py (1280 of 1969) PASS: lldb-unit :: Process/gdb-remote/./ProcessGdbRemoteTests/GDBRemoteClientBaseTest.SendContinueDelegateStructuredDataReceipt (1281 of 1969) PASS: lldb-unit :: Utility/./UtilityTests/StringExtractorTest.GetU64BigEndian (1282 of 1969) PASS: lldb-api :: lang/objc/real-definition/TestRealDefinition.py (1283 of 1969) PASS: lldb-unit :: Utility/./UtilityTests/Flags.AnyClear (1284 of 1969) PASS: lldb-shell :: SymbolFile/DWARF/parallel-indexing-stress.s (1285 of 1969) PASS: lldb-unit :: Utility/./UtilityTests/StreamTest.PutHex64ByteOrderLittle (1286 of 1969) PASS: lldb-api :: functionalities/thread/create_after_attach/TestCreateAfterAttach.py (1287 of 1969) PASS: lldb-unit :: Host/./HostTests/TaskPoolTest.RunTasks (1288 of 1969) PASS: lldb-unit :: Utility/./UtilityTests/RangeTest.DefaultConstructor (1289 of 1969) PASS: lldb-api :: functionalities/breakpoint/require_hw_breakpoints/TestRequireHWBreakpoints.py (1290 of 1969) PASS: lldb-api :: functionalities/dead-strip/TestDeadStrip.py (1291 of 1969) PASS: lldb-unit :: Symbol/./SymbolTests/LineEntryTest.GetSameLineContiguousAddressRangeOneInline (1292 of 1969) PASS: lldb-api :: tools/lldb-vscode/variables/TestVSCode_variables.py (1293 of 1969) PASS: lldb-unit :: Utility/./UtilityTests/RangeDataVector.FindEntryIndexesThatContain_Overlap (1294 of 1969) PASS: lldb-api :: commands/expression/namespace_local_var_same_name_cpp_and_c/TestNamespaceLocalVarSameNameCppAndC.py (1295 of 1969) PASS: lldb-api :: python_api/breakpoint/TestBreakpointAPI.py (1296 of 1969) PASS: lldb-unit :: UnwindAssembly/x86/./UnwindAssemblyx86Tests/Testx86AssemblyInspectionEngine.TestPushESI (1297 of 1969) PASS: lldb-unit :: UnwindAssembly/x86/./UnwindAssemblyx86Tests/Testx86AssemblyInspectionEngine.Test64bitFramelessSmallStackFrame (1298 of 1969) PASS: lldb-unit :: Utility/./UtilityTests/SerializationRountripTest.SerializeDeserializePod (1299 of 1969) PASS: lldb-unit :: ObjectFile/PECOFF/./ObjectFilePECOFFTests/PECallFrameInfoTest.Chained_eh (1300 of 1969) PASS: lldb-unit :: ScriptInterpreter/Python/./ScriptInterpreterPythonTests/PythonDataObjectsTest.TestGlobalNameResolutionNoDot (1301 of 1969) PASS: lldb-api :: tools/lldb-server/commandline/TestStubSetSID.py (1302 of 1969) PASS: lldb-shell :: Settings/TestDisassemblyFormat.test (1303 of 1969) PASS: lldb-unit :: Utility/./UtilityTests/StreamTeeTest.SetStreamAtIndexOverwrite (1304 of 1969) PASS: lldb-shell :: Process/TestEnvironment.test (1305 of 1969) PASS: lldb-unit :: Symbol/./SymbolTests/TestClangASTImporter.DeportTypeTagDecl (1306 of 1969) PASS: lldb-unit :: Expression/./ExpressionTests/CppModuleConfigurationTest.Sysroot (1307 of 1969) UNSUPPORTED: lldb-api :: functionalities/thread/thread_specific_break_plus_condition/TestThreadSpecificBpPlusCondition.py (1308 of 1969) PASS: lldb-unit :: Utility/./UtilityTests/TimeoutTest.Format (1309 of 1969) PASS: lldb-unit :: Utility/./UtilityTests/UUIDTest.RelationalOperators (1310 of 1969) PASS: lldb-shell :: SymbolFile/DWARF/find-basic-variable.cpp (1311 of 1969) UNSUPPORTED: lldb-api :: functionalities/tsan/thread_leak/TestTsanThreadLeak.py (1312 of 1969) PASS: lldb-unit :: Process/minidump/./LLDBMinidumpTests/MinidumpParserTest.GetArchitecture (1313 of 1969) PASS: lldb-shell :: Settings/TestFrameFormatMangling.test (1314 of 1969) PASS: lldb-api :: lang/cpp/rvalue-references/TestRvalueReferences.py (1315 of 1969) PASS: lldb-api :: commands/expression/unicode-in-variable/TestUnicodeInVariable.py (1316 of 1969) PASS: lldb-unit :: Process/gdb-remote/./ProcessGdbRemoteTests/GDBRemoteCommunicationClientTest.GetMemoryRegionInfoInvalidResponse (1317 of 1969) PASS: lldb-api :: functionalities/breakpoint/breakpoint_by_line_and_column/TestBreakpointByLineAndColumn.py (1318 of 1969) PASS: lldb-unit :: Utility/./UtilityTests/StringLexerTest.NextIf (1319 of 1969) PASS: lldb-api :: commands/expression/dont_allow_jit/TestAllowJIT.py (1320 of 1969) PASS: lldb-unit :: UnwindAssembly/x86/./UnwindAssemblyx86Tests/Testx86AssemblyInspectionEngine.TestPushR15 (1321 of 1969) PASS: lldb-unit :: Utility/./UtilityTests/AnsiTerminal.WhiteSpace (1322 of 1969) PASS: lldb-api :: commands/expression/import-std-module/vector-bool/TestVectorBoolFromStdModule.py (1323 of 1969) UNSUPPORTED: lldb-api :: functionalities/thread/multi_break/TestMultipleBreakpoints.py (1324 of 1969) PASS: lldb-shell :: ObjectFile/ELF/netbsd-core-amd64.test (1325 of 1969) PASS: lldb-api :: functionalities/thread/concurrent_events/TestConcurrentDelayWatchBreak.py (1326 of 1969) PASS: lldb-api :: lang/objc/objc-new-syntax/TestObjCNewSyntaxDictionary.py (1327 of 1969) PASS: lldb-unit :: Host/./HostTests/MainLoopTest.Signal (1328 of 1969) PASS: lldb-api :: lang/cpp/gmodules-templates/TestGModules.py (1329 of 1969) PASS: lldb-api :: functionalities/thread/concurrent_events/TestConcurrentSignalDelayBreak.py (1330 of 1969) PASS: lldb-unit :: Symbol/./SymbolTests/Type.CompilerContextPattern (1331 of 1969) PASS: lldb-api :: functionalities/data-formatter/data-formatter-stl/libcxx/unordered/TestDataFormatterUnordered.py (1332 of 1969) UNSUPPORTED: lldb-shell :: SymbolFile/PDB/pointers.test (1333 of 1969) UNSUPPORTED: lldb-api :: functionalities/tsan/global_location/TestTsanGlobalLocation.py (1334 of 1969) PASS: lldb-api :: lang/c/blocks/TestBlocks.py (1335 of 1969) PASS: lldb-unit :: Platform/./LLDBPlatformTests/PlatformDarwinTest.FindXcodeContentsDirectoryInPath (1336 of 1969) PASS: lldb-api :: commands/expression/two-files/TestObjCTypeQueryFromOtherCompileUnit.py (1337 of 1969) PASS: lldb-unit :: Symbol/./SymbolTests/TestTypeSystemClang.TestGetBasicTypeFromEnum (1338 of 1969) PASS: lldb-unit :: Utility/./UtilityTests/BinaryStreamTest.PutULEB128ThreeBytes (1339 of 1969) PASS: lldb-api :: commands/command/script_alias/TestCommandScriptAlias.py (1340 of 1969) PASS: lldb-unit :: ObjectFile/ELF/./ObjectFileELFTests/ObjectFileELFTest.GetSymtab_NoSymEntryPointArmAddressClass (1341 of 1969) PASS: lldb-unit :: Expression/./ExpressionTests/DiagnosticManagerTest.AppendMessageAttachToLastDiag (1342 of 1969) XFAIL: lldb-shell :: SymbolFile/DWARF/find-type-in-function.cpp (1343 of 1969) PASS: lldb-shell :: Reproducer/Functionalities/TestDataFormatter.test (1344 of 1969) UNSUPPORTED: lldb-shell :: SymbolFile/PDB/typedefs.test (1345 of 1969) PASS: lldb-api :: functionalities/type_completion/TestTypeCompletion.py (1346 of 1969) PASS: lldb-unit :: Utility/./UtilityTests/FileSpecTest.IsRelative (1347 of 1969) PASS: lldb-unit :: Utility/./UtilityTests/UriParserTest.BadPort (1348 of 1969) PASS: lldb-api :: functionalities/postmortem/netbsd-core/TestNetBSDCore.py (1349 of 1969) PASS: lldb-unit :: Language/Highlighting/./HighlighterTests/HighlighterTest.ClangCursorPosAfterOtherToken (1350 of 1969) PASS: lldb-unit :: Utility/./UtilityTests/StreamTest.PutMaxHex64ByteOrderLittle (1351 of 1969) PASS: lldb-unit :: Host/./HostTests/FileSystemTest.EnumerateDirectory (1352 of 1969) PASS: lldb-unit :: Utility/./UtilityTests/RangeTest.EqualInvalid (1353 of 1969) PASS: lldb-api :: commands/watchpoints/watchpoint_set_command/TestWatchLocationWithWatchSet.py (1354 of 1969) PASS: lldb-unit :: Core/./LLDBCoreTests/RichManglingContextTest.FromCxxMethodName (1355 of 1969) PASS: lldb-api :: functionalities/gdb_remote_client/TestqOffsets.py (1356 of 1969) PASS: lldb-unit :: Utility/./UtilityTests/UriParserTest.BracketedHostnameWithColon (1357 of 1969) PASS: lldb-api :: commands/expression/context-object/TestContextObject.py (1358 of 1969) PASS: lldb-api :: functionalities/testid/TestTestId.py (1359 of 1969) PASS: lldb-shell :: Minidump/Windows/broken-unwind.test (1360 of 1969) PASS: lldb-api :: functionalities/process_crash_info/TestProcessCrashInfo.py (1361 of 1969) PASS: lldb-shell :: SymbolFile/DWARF/find-variable-file.cpp (1362 of 1969) PASS: lldb-api :: lang/objc/objc-foundation-dictionary-empty/TestNSDictionary0.py (1363 of 1969) PASS: lldb-unit :: Utility/./UtilityTests/DataExtractorTest.GetMaxU64 (1364 of 1969) PASS: lldb-unit :: Utility/./UtilityTests/StringExtractorTest.DecodeHexU8_Underflow2 (1365 of 1969) UNSUPPORTED: lldb-api :: functionalities/data-formatter/data-formatter-stl/libstdcpp/map/TestDataFormatterStdMap.py (1366 of 1969) UNSUPPORTED: lldb-api :: benchmarks/stepping/TestSteppingSpeed.py (1367 of 1969) PASS: lldb-shell :: Quit/TestQuitExitCode-30.test (1368 of 1969) PASS: lldb-unit :: Symbol/./SymbolTests/DWARFCallFrameInfoTest.Basic_dwarf4 (1369 of 1969) PASS: lldb-unit :: UnwindAssembly/x86/./UnwindAssemblyx86Tests/Testx86AssemblyInspectionEngine.TestAddRSP (1370 of 1969) PASS: lldb-api :: lang/cpp/multiple-inheritance/TestCppMultipleInheritance.py (1371 of 1969) PASS: lldb-unit :: SymbolFile/DWARF/./SymbolFileDWARFTests/SymbolFileDWARFTests.TestAbbrevMissingTerminator (1372 of 1969) PASS: lldb-api :: commands/expression/import-std-module/stack/TestStackFromStdModule.py (1373 of 1969) PASS: lldb-api :: lang/objc/variadic_methods/TestVariadicMethods.py (1374 of 1969) PASS: lldb-unit :: Utility/./UtilityTests/StringListTest.GetMaxStringLengthEqualSize (1375 of 1969) UNSUPPORTED: lldb-shell :: ScriptInterpreter/Lua/nested_sessions.test (1376 of 1969) PASS: lldb-api :: commands/expression/timeout/TestCallWithTimeout.py (1377 of 1969) PASS: lldb-unit :: Host/./HostTests/HostInfoTest.GetHostname (1378 of 1969) PASS: lldb-api :: python_api/disassemble-raw-data/TestDisassembleRawData.py (1379 of 1969) PASS: lldb-unit :: ScriptInterpreter/Python/./ScriptInterpreterPythonTests/PythonDataObjectsTest.TestRun (1380 of 1969) PASS: lldb-api :: commands/watchpoints/multiple_hits/TestMultipleHits.py (1381 of 1969) PASS: lldb-shell :: SymbolFile/DWARF/debug_rnglists-dwo.s (1382 of 1969) PASS: lldb-shell :: ObjectFile/ELF/section-addresses.yaml (1383 of 1969) PASS: lldb-api :: commands/expression/import-std-module/vector-of-vectors/TestVectorOfVectorsFromStdModule.py (1384 of 1969) PASS: lldb-api :: lang/cpp/nested-class-other-compilation-unit/TestNestedClassWithParentInAnotherCU.py (1385 of 1969) PASS: lldb-unit :: Utility/./UtilityTests/SubsystemRAIITest.SubsystemWithErrorFailure (1386 of 1969) PASS: lldb-unit :: Language/Highlighting/./HighlighterTests/HighlighterTest.ClangTrailingBackslashBeforeNewline (1387 of 1969) PASS: lldb-api :: functionalities/thread/concurrent_events/TestConcurrentTwoBreakpointsOneSignal.py (1388 of 1969) PASS: lldb-unit :: Utility/./UtilityTests/DataExtractorTest.UncommonAddressSize (1389 of 1969) PASS: lldb-unit :: Utility/./UtilityTests/VMRange.IsValid (1390 of 1969) PASS: lldb-unit :: Symbol/./SymbolTests/TestTypeSystemClang.TestGetEnumIntegerTypeInvalid (1391 of 1969) PASS: lldb-unit :: UnwindAssembly/x86/./UnwindAssemblyx86Tests/Testx86AssemblyInspectionEngine.TestPushR13 (1392 of 1969) PASS: lldb-unit :: Target/./TargetTests/PathMappingListTest.AbsoluteTests (1393 of 1969) PASS: lldb-shell :: SymbolFile/NativePDB/break-by-function.cpp (1394 of 1969) PASS: lldb-api :: functionalities/abbreviation/TestAbbreviations.py (1395 of 1969) PASS: lldb-api :: macosx/load-kext/TestLoadKext.py (1396 of 1969) PASS: lldb-unit :: Utility/./UtilityTests/StringListTest.SetSize (1397 of 1969) PASS: lldb-api :: lang/c/enum_types/TestEnumTypes.py (1398 of 1969) PASS: lldb-api :: functionalities/data-formatter/data-formatter-synth/TestDataFormatterSynth.py (1399 of 1969) PASS: lldb-shell :: SymbolFile/Breakpad/symtab.test (1400 of 1969) PASS: lldb-api :: source-manager/TestSourceManager.py (1401 of 1969) PASS: lldb-shell :: SymbolFile/Breakpad/line-table-missing-file.test (1402 of 1969) PASS: lldb-api :: python_api/lldbutil/frame/TestFrameUtils.py (1403 of 1969) PASS: lldb-unit :: Process/minidump/./LLDBMinidumpTests/MinidumpParserTest.GetMemoryRegionInfo (1404 of 1969) PASS: lldb-unit :: Expression/./ExpressionTests/DiagnosticManagerTest.PutStringMultiple (1405 of 1969) UNSUPPORTED: lldb-api :: lang/objc/rdar-12408181/TestRdar12408181.py (1406 of 1969) PASS: lldb-unit :: Utility/./UtilityTests/CompletionRequest.TryCompleteCurrentArgBad (1407 of 1969) PASS: lldb-api :: commands/expression/diagnostics/TestExprDiagnostics.py (1408 of 1969) PASS: lldb-unit :: Process/gdb-remote/./ProcessGdbRemoteTests/GDBRemoteClientBaseTest.SendContinueAndInterrupt2PacketBug (1409 of 1969) PASS: lldb-api :: macosx/find-dsym/bundle-with-dot-in-filename/TestBundleWithDotInFilename.py (1410 of 1969) UNSUPPORTED: lldb-shell :: SymbolFile/PDB/calling-conventions.test (1411 of 1969) PASS: lldb-unit :: Utility/./UtilityTests/NameMatchesTest.EndsWith (1412 of 1969) PASS: lldb-unit :: Utility/./UtilityTests/StringLexerTest.PutBack (1413 of 1969) PASS: lldb-unit :: Target/./TargetTests/PathMappingListTest.RemapRoot (1414 of 1969) PASS: lldb-api :: functionalities/data-formatter/data-formatter-stl/libcxx/list/loop/TestDataFormatterLibcxxListLoop.py (1415 of 1969) PASS: lldb-api :: commands/expression/deleting-implicit-copy-constructor/TestDeletingImplicitCopyConstructor.py (1416 of 1969) PASS: lldb-unit :: Utility/./UtilityTests/BinaryStreamTest.PutULEB128FiveBytes (1417 of 1969) PASS: lldb-unit :: Symbol/./SymbolTests/TestTypeSystemClang.TestNotDeletingUserCopyCstrDueToMoveCStr (1418 of 1969) PASS: lldb-unit :: UnwindAssembly/x86/./UnwindAssemblyx86Tests/Testx86AssemblyInspectionEngine.TestPushR14 (1419 of 1969) PASS: lldb-unit :: Utility/./UtilityTests/SerializationRountripTest.SerializeDeserializePodReferences (1420 of 1969) PASS: lldb-shell :: Settings/TestDisableColor.test (1421 of 1969) PASS: lldb-unit :: Utility/./UtilityTests/OptionsWithRawTest.LeadingSpaceArgs (1422 of 1969) PASS: lldb-unit :: Symbol/./SymbolTests/TestTypeSystemClang.TestGetBasicTypeFromName (1423 of 1969) PASS: lldb-api :: functionalities/tail_call_frames/cross_dso/TestCrossDSOTailCalls.py (1424 of 1969) PASS: lldb-unit :: Utility/./UtilityTests/StringExtractorTest.InitMisc (1425 of 1969) PASS: lldb-unit :: Utility/./UtilityTests/StringListTest.GetMaxStringLengthEmpty (1426 of 1969) PASS: lldb-api :: lang/objc/foundation/TestConstStrings.py (1427 of 1969) PASS: lldb-unit :: Process/gdb-remote/./ProcessGdbRemoteTests/GDBRemoteCommunicationClientTest.TestPacketSpeedJSON (1428 of 1969) PASS: lldb-unit :: Host/./HostTests/MainLoopTest.ReadObject (1429 of 1969) PASS: lldb-api :: macosx/add-dsym/TestAddDsymMidExecutionCommand.py (1430 of 1969) PASS: lldb-api :: sanity/TestSettingSkipping.py (1431 of 1969) PASS: lldb-unit :: Utility/./UtilityTests/FileSpecTest.EqualDotsPosix (1432 of 1969) PASS: lldb-unit :: ScriptInterpreter/Python/./ScriptInterpreterPythonTests/PythonDataObjectsTest.TestResetting (1433 of 1969) PASS: lldb-unit :: Utility/./UtilityTests/UriParserTest.BracketedHostnamePort (1434 of 1969) UNSUPPORTED: lldb-api :: terminal/TestEditline.py (1435 of 1969) UNSUPPORTED: lldb-shell :: SymbolFile/PDB/ast-restore.test (1436 of 1969) PASS: lldb-shell :: SymbolFile/NativePDB/global-classes.cpp (1437 of 1969) PASS: lldb-api :: functionalities/dynamic_value_child_count/TestDynamicValueChildCount.py (1438 of 1969) PASS: lldb-api :: commands/expression/call-function/TestCallUserDefinedFunction.py (1439 of 1969) UNSUPPORTED: lldb-shell :: SymbolFile/NativePDB/typedefs.cpp (1440 of 1969) PASS: lldb-unit :: ScriptInterpreter/Python/./ScriptInterpreterPythonTests/PythonDataObjectsTest.TestPythonByteArray (1441 of 1969) PASS: lldb-unit :: Utility/./UtilityTests/CompletionRequest.Constructor (1442 of 1969) PASS: lldb-api :: functionalities/tail_call_frames/ambiguous_tail_call_seq1/TestAmbiguousTailCallSeq1.py (1443 of 1969) PASS: lldb-unit :: Utility/./UtilityTests/RecordReplayTest.InstrumentedBar (1444 of 1969) PASS: lldb-unit :: Expression/./ExpressionTests/ClangExpressionDeclMapTest.TestUnknownIdentifierLookup (1445 of 1969) PASS: lldb-unit :: Utility/./UtilityTests/DataExtractorTest.GetCStrEmpty (1446 of 1969) PASS: lldb-unit :: Utility/./UtilityTests/RangeDataVector.FindEntryThatContains (1447 of 1969) PASS: lldb-unit :: Utility/./UtilityTests/TimerTest.CategoryTimes2 (1448 of 1969) PASS: lldb-unit :: Utility/./UtilityTests/StringListTest.SplitIntoLines (1449 of 1969) UNSUPPORTED: lldb-shell :: Unwind/unwind-plan-dwarf-dump.test (1450 of 1969) PASS: lldb-unit :: Utility/./UtilityTests/ArgsTest.TestTrailingBackslash (1451 of 1969) PASS: lldb-api :: commands/statistics/basic/TestStats.py (1452 of 1969) PASS: lldb-unit :: Process/gdb-remote/./ProcessGdbRemoteTests/GDBRemoteClientBaseTest.SendContinueAndAsyncSignal (1453 of 1969) UNSUPPORTED: lldb-api :: api/multiple-debuggers/TestMultipleDebuggers.py (1454 of 1969) PASS: lldb-unit :: Utility/./UtilityTests/AnsiTerminal.Incomplete (1455 of 1969) PASS: lldb-unit :: Utility/./UtilityTests/StreamTest.PutPtr (1456 of 1969) PASS: lldb-api :: commands/expression/weak_symbols/TestWeakSymbols.py (1457 of 1969) PASS: lldb-api :: functionalities/gdb_remote_client/TestWriteMemory.py (1458 of 1969) PASS: lldb-unit :: Utility/./UtilityTests/ArchSpecTest.TestParseMachCPUDashSubtypeTripleSimple (1459 of 1969) PASS: lldb-api :: functionalities/pre_run_dylibs/TestPreRunDylibs.py (1460 of 1969) PASS: lldb-api :: lang/cpp/unicode-literals/TestUnicodeLiterals.py (1461 of 1969) PASS: lldb-shell :: Commands/command-backtrace.test (1462 of 1969) PASS: lldb-api :: lang/cpp/modules-import/TestCXXModulesImport.py (1463 of 1969) PASS: lldb-api :: commands/watchpoints/step_over_watchpoint/TestStepOverWatchpoint.py (1464 of 1969) UNSUPPORTED: lldb-api :: functionalities/darwin_log/filter/regex/category/TestDarwinLogFilterRegexCategory.py (1465 of 1969) PASS: lldb-unit :: Utility/./UtilityTests/RangeTest.Slide (1466 of 1969) PASS: lldb-api :: commands/expression/import-std-module/unique_ptr/TestUniquePtrFromStdModule.py (1467 of 1969) PASS: lldb-unit :: SymbolFile/NativePDB/./SymbolFileNativePDBTests/PDBFPOProgramToDWARFExpressionTests.UnsupportedRASearch (1468 of 1969) PASS: lldb-unit :: SymbolFile/NativePDB/./SymbolFileNativePDBTests/PDBFPOProgramToDWARFExpressionTests.InvalidOpBinary (1469 of 1969) PASS: lldb-shell :: ObjectFile/ELF/compressed-sections.yaml (1470 of 1969) PASS: lldb-unit :: Expression/./ExpressionTests/DiagnosticManagerTest.GetStringMultipleDiags (1471 of 1969) PASS: lldb-api :: lang/cpp/std-function-step-into-callable/TestStdFunctionStepIntoCallable.py (1472 of 1969) PASS: lldb-shell :: Unwind/thread-step-out-ret-addr-check.test (1473 of 1969) PASS: lldb-shell :: SymbolFile/DWARF/dwo-type-in-main-file.s (1474 of 1969) PASS: lldb-api :: python_api/process/read-mem-cstring/TestReadMemCString.py (1475 of 1969) PASS: lldb-unit :: Utility/./UtilityTests/LogTest.LLDB_LOG_nullptr (1476 of 1969) PASS: lldb-shell :: SymbolFile/DWARF/dir-separator-no-comp-dir-relative-name.s (1477 of 1969) PASS: lldb-api :: commands/version/TestVersion.py (1478 of 1969) UNSUPPORTED: lldb-api :: python_api/disassemble-raw-data/TestDisassemble_VST1_64.py (1479 of 1969) PASS: lldb-api :: lang/objc/radar-9691614/TestObjCMethodReturningBOOL.py (1480 of 1969) PASS: lldb-unit :: Expression/./ExpressionTests/DiagnosticManagerTest.HasFixits (1481 of 1969) PASS: lldb-shell :: SymbolFile/DWARF/array-sizes.s (1482 of 1969) PASS: lldb-unit :: Utility/./UtilityTests/ArgsTest.TestSingleArgWithQuotedSpace (1483 of 1969) PASS: lldb-api :: functionalities/tail_call_frames/cross_object/TestCrossObjectTailCalls.py (1484 of 1969) PASS: lldb-api :: tools/lldb-server/TestGdbRemoteAttach.py (1485 of 1969) PASS: lldb-shell :: Settings/TestEchoCommands.test (1486 of 1969) PASS: lldb-unit :: Utility/./UtilityTests/Flags.IsClear (1487 of 1969) PASS: lldb-shell :: SymbolFile/DWARF/find-qualified-variable.cpp (1488 of 1969) UNSUPPORTED: lldb-shell :: Register/x86-ymm-read.test (1489 of 1969) PASS: lldb-unit :: Language/Highlighting/./HighlighterTests/HighlighterTest.FallbackHighlighter (1490 of 1969) PASS: lldb-api :: types/TestDoubleTypesExpr.py (1491 of 1969) PASS: lldb-api :: functionalities/data-formatter/data-formatter-stl/libcxx/set/TestDataFormatterLibcxxSet.py (1492 of 1969) PASS: lldb-unit :: Utility/./UtilityTests/CompletionRequest.FakeLastArg (1493 of 1969) PASS: lldb-unit :: Utility/./UtilityTests/StreamTeeTest.DefaultConstructor (1494 of 1969) PASS: lldb-unit :: Symbol/./SymbolTests/TestTypeSystemClang.TestBuiltinTypeForEncodingAndBitSize (1495 of 1969) PASS: lldb-unit :: Utility/./UtilityTests/ArgsTest.ReplaceArgumentAtIndexFarOutOfRange (1496 of 1969) PASS: lldb-unit :: Symbol/./SymbolTests/LineEntryTest.GetSameLineContiguousAddressRangeNestedInline (1497 of 1969) PASS: lldb-shell :: Unwind/trap_frame_sym_ctx.test (1498 of 1969) PASS: lldb-api :: commands/platform/basic/TestPlatformPython.py (1499 of 1969) PASS: lldb-shell :: Commands/command-breakpoint-col.test (1500 of 1969) PASS: lldb-api :: commands/frame/diagnose/dereference-function-return/TestDiagnoseDereferenceFunctionReturn.py (1501 of 1969) UNSUPPORTED: lldb-api :: commands/watchpoints/multi_watchpoint_slots/TestWatchpointMultipleSlots.py (1502 of 1969) PASS: lldb-unit :: Utility/./UtilityTests/FileSpecTest.Yaml (1503 of 1969) PASS: lldb-unit :: UnwindAssembly/x86/./UnwindAssemblyx86Tests/Testx86AssemblyInspectionEngine.TestSimple32bitFrameFunction (1504 of 1969) PASS: lldb-api :: macosx/lc-note/kern-ver-str/TestKernVerStrLCNOTE.py (1505 of 1969) PASS: lldb-unit :: Utility/./UtilityTests/OptionsWithRawTest.UnterminatedQuote (1506 of 1969) UNSUPPORTED: lldb-api :: functionalities/data-formatter/data-formatter-stl/libstdcpp/unique_ptr/TestDataFormatterStdUniquePtr.py (1507 of 1969) PASS: lldb-unit :: Utility/./UtilityTests/ArgsTest.TestOverwriteArgs (1508 of 1969) PASS: lldb-unit :: Symbol/./SymbolTests/TestClangASTImporter.CanImportInvalidType (1509 of 1969) PASS: lldb-unit :: Breakpoint/./LLDBBreakpointTests/BreakpointIDTest.StringIsBreakpointName (1510 of 1969) PASS: lldb-api :: functionalities/show_location/TestShowLocationDwarf5.py (1511 of 1969) UNSUPPORTED: lldb-api :: macosx/macabi/TestMacABImacOSFramework.py (1512 of 1969) PASS: lldb-api :: functionalities/thread/concurrent_events/TestConcurrentSignalNWatchNBreak.py (1513 of 1969) PASS: lldb-api :: types/TestShortType.py (1514 of 1969) PASS: lldb-unit :: Utility/./UtilityTests/AnsiTerminal.Empty (1515 of 1969) UNSUPPORTED: lldb-api :: commands/watchpoints/hello_watchlocation/TestWatchLocation.py (1516 of 1969) PASS: lldb-api :: functionalities/process_group/TestChangeProcessGroup.py (1517 of 1969) PASS: lldb-unit :: Utility/./UtilityTests/RecordReplayTest.InstrumentedBarPtr (1518 of 1969) PASS: lldb-unit :: SymbolFile/NativePDB/./SymbolFileNativePDBTests/PDBFPOProgramToDWARFExpressionTests.InvalidAssignmentSingle (1519 of 1969) PASS: lldb-api :: functionalities/thread/concurrent_events/TestConcurrentTwoWatchpointThreads.py (1520 of 1969) PASS: lldb-unit :: Process/gdb-remote/./ProcessGdbRemoteTests/GDBRemoteCommunicationClientTest.SendGetMetaDataPacket (1521 of 1969) PASS: lldb-api :: commands/target/create-no-such-arch/TestNoSuchArch.py (1522 of 1969) PASS: lldb-unit :: Utility/./UtilityTests/UriParserTest.BracketedHostname (1523 of 1969) PASS: lldb-unit :: Process/minidump/./LLDBMinidumpTests/MinidumpParserTest.GetMiscInfoWindows (1524 of 1969) PASS: lldb-unit :: Utility/./UtilityTests/StringListTest.InsertStringAtIndexStart (1525 of 1969) PASS: lldb-unit :: Utility/./UtilityTests/DataExtractorTest.GetBitfield (1526 of 1969) PASS: lldb-api :: commands/expression/call-function/TestCallStdStringFunction.py (1527 of 1969) PASS: lldb-unit :: Utility/./UtilityTests/StreamTest.PutHex16ByteOrderLittle (1528 of 1969) PASS: lldb-api :: functionalities/thread/concurrent_events/TestConcurrentTwoBreakpointThreads.py (1529 of 1969) PASS: lldb-shell :: SymbolFile/DWARF/clang-ast-from-dwarf-objc-property.m (1530 of 1969) PASS: lldb-api :: functionalities/stats_api/TestStatisticsAPI.py (1531 of 1969) PASS: lldb-shell :: Breakpoint/case-sensitive.test (1532 of 1969) PASS: lldb-unit :: Utility/./UtilityTests/RangeTest.Constructor (1533 of 1969) PASS: lldb-api :: functionalities/thread/backtrace_limit/TestBacktraceLimit.py (1534 of 1969) PASS: lldb-shell :: SymbolFile/DWARF/find-method.cpp (1535 of 1969) PASS: lldb-api :: lang/objc/objc-static-method-stripped/TestObjCStaticMethodStripped.py (1536 of 1969) PASS: lldb-unit :: Utility/./UtilityTests/RangeDataVector.CustomSort (1537 of 1969) UNSUPPORTED: lldb-api :: functionalities/data-formatter/data-formatter-stl/libstdcpp/iterator/TestDataFormatterStdIterator.py (1538 of 1969) PASS: lldb-shell :: Reproducer/TestReuseDirectory.test (1539 of 1969) PASS: lldb-unit :: Utility/./UtilityTests/BinaryStreamTest.PutULEB128FourBytes (1540 of 1969) PASS: lldb-unit :: Utility/./UtilityTests/CompletionRequest.TryCompleteCurrentArgMode (1541 of 1969) PASS: lldb-api :: python_api/debugger/TestDebuggerAPI.py (1542 of 1969) PASS: lldb-shell :: ObjectFile/PECOFF/basic-info-arm.yaml (1543 of 1969) PASS: lldb-api :: lang/objc/unicode-string/TestUnicodeString.py (1544 of 1969) PASS: lldb-api :: lang/c/array_types/TestArrayTypes.py (1545 of 1969) PASS: lldb-unit :: Utility/./UtilityTests/ArgsTest.ReplaceArgumentAtIndexOutOfRange (1546 of 1969) UNSUPPORTED: lldb-api :: tools/lldb-vscode/completions/TestVSCode_completions.py (1547 of 1969) PASS: lldb-api :: functionalities/postmortem/minidump/TestMiniDump.py (1548 of 1969) PASS: lldb-unit :: Utility/./UtilityTests/RecordReplayTest.InstrumentedFooSameThis (1549 of 1969) PASS: lldb-unit :: Utility/./UtilityTests/ArgsTest.ReplaceArgumentAtIndexShort (1550 of 1969) PASS: lldb-api :: lang/objc/foundation/TestObjCMethodsNSArray.py (1551 of 1969) UNSUPPORTED: lldb-api :: functionalities/longjmp/TestLongjmp.py (1552 of 1969) PASS: lldb-api :: commands/watchpoints/watchpoint_disable/TestWatchpointDisable.py (1553 of 1969) UNSUPPORTED: lldb-shell :: Register/x86-64-gp-write.test (1554 of 1969) PASS: lldb-unit :: UnwindAssembly/x86/./UnwindAssemblyx86Tests/Testx86AssemblyInspectionEngine.TestPopEBP (1555 of 1969) PASS: lldb-api :: commands/expression/import-std-module/empty-module/TestEmptyStdModule.py (1556 of 1969) PASS: lldb-api :: functionalities/breakpoint/consecutive_breakpoints/TestConsecutiveBreakpoints.py (1557 of 1969) PASS: lldb-unit :: Process/gdb-remote/./ProcessGdbRemoteTests/GDBRemoteCommunicationClientTest.SendGetDataPacket (1558 of 1969) PASS: lldb-api :: functionalities/data-formatter/data-formatter-disabling/TestDataFormatterDisabling.py (1559 of 1969) PASS: lldb-api :: lang/objc/objc-struct-return/TestObjCStructReturn.py (1560 of 1969) PASS: lldb-unit :: Utility/./UtilityTests/VASprintfTest.BufferResize (1561 of 1969) PASS: lldb-api :: commands/watchpoints/watchpoint_on_vectors/TestValueOfVectorVariable.py (1562 of 1969) PASS: lldb-unit :: Utility/./UtilityTests/StreamTest.PutChar (1563 of 1969) PASS: lldb-unit :: Symbol/./SymbolTests/TestTypeSystemClang.TestIsClangType (1564 of 1969) PASS: lldb-unit :: Utility/./UtilityTests/StringListTest.InsertStringAtIndexEnd (1565 of 1969) PASS: lldb-unit :: Symbol/./SymbolTests/TestClangASTImporter.CompleteFwdDeclWithOtherOrigin (1566 of 1969) PASS: lldb-unit :: UnwindAssembly/x86/./UnwindAssemblyx86Tests/Testx86AssemblyInspectionEngine.TestSimplex86_64Augmented (1567 of 1969) PASS: lldb-api :: functionalities/wrong_commands/TestWrongCommands.py (1568 of 1969) PASS: lldb-shell :: SymbolFile/DWARF/DW_OP_piece-struct.s (1569 of 1969) PASS: lldb-unit :: Host/./HostTests/ConnectionFileDescriptorTest.TCPGetURIv6 (1570 of 1969) PASS: lldb-unit :: Symbol/./SymbolTests/TestClangASTImporter.RecordLayout (1571 of 1969) PASS: lldb-unit :: Language/Highlighting/./HighlighterTests/HighlighterTest.ClangTrailingBackslashWithWhitespace (1572 of 1969) PASS: lldb-api :: commands/target/dump-symtab-demangle/TestDumpSymtabDemangle.py (1573 of 1969) PASS: lldb-shell :: ObjectFile/wasm/unified-debug-sections.yaml (1574 of 1969) PASS: lldb-api :: lang/objc/rdar-10967107/TestRdar10967107.py (1575 of 1969) PASS: lldb-api :: types/TestFloatTypesExpr.py (1576 of 1969) PASS: lldb-unit :: Utility/./UtilityTests/Flags.Test (1577 of 1969) UNSUPPORTED: lldb-shell :: SymbolFile/PDB/udt-layout.test (1578 of 1969) PASS: lldb-shell :: Breakpoint/dummy-target.test (1579 of 1969) PASS: lldb-api :: functionalities/thread/concurrent_events/TestConcurrentBreakpointsDelayedBreakpointOneWatchpoint.py (1580 of 1969) PASS: lldb-api :: commands/expression/import-std-module/weak_ptr/TestWeakPtrFromStdModule.py (1581 of 1969) PASS: lldb-api :: functionalities/breakpoint/breakpoint_command/TestBreakpointCommandsFromPython.py (1582 of 1969) PASS: lldb-unit :: Platform/./LLDBPlatformTests/PlatformDarwinTest.FindComponentInPath (1583 of 1969) PASS: lldb-unit :: Process/minidump/./LLDBMinidumpTests/MinidumpParserTest.FindMemoryRangeWithFullMemoryMinidump (1584 of 1969) PASS: lldb-api :: functionalities/data-formatter/data-formatter-stl/libcxx/tuple/TestDataFormatterLibcxxTuple.py (1585 of 1969) PASS: lldb-unit :: Utility/./UtilityTests/CompletionRequest.ShiftArguments (1586 of 1969) PASS: lldb-api :: tools/lldb-server/commandline/TestStubReverseConnect.py (1587 of 1969) PASS: lldb-api :: functionalities/data-formatter/ptr_ref_typedef/TestPtrRef2Typedef.py (1588 of 1969) PASS: lldb-unit :: Process/minidump/./LLDBMinidumpTests/MinidumpParserTest.MinidumpModuleOrder (1589 of 1969) PASS: lldb-unit :: Interpreter/./InterpreterTests/CompletionTest.DirCompletionAbsolute (1590 of 1969) PASS: lldb-api :: python_api/function_symbol/TestDisasmAPI.py (1591 of 1969) UNSUPPORTED: lldb-api :: functionalities/tsan/thread_numbers/TestTsanThreadNumbers.py (1592 of 1969) UNSUPPORTED: lldb-api :: commands/expression/call-restarts/TestCallThatRestarts.py (1593 of 1969) PASS: lldb-shell :: Settings/TestStopCommandSourceOnError.test (1594 of 1969) PASS: lldb-api :: lang/objc/conflicting-definition/TestConflictingDefinition.py (1595 of 1969) PASS: lldb-api :: lang/cpp/call-function/TestCallCPPFunction.py (1596 of 1969) PASS: lldb-api :: functionalities/breakpoint/global_constructor/TestBreakpointInGlobalConstructor.py (1597 of 1969) PASS: lldb-api :: python_api/sbenvironment/TestSBEnvironment.py (1598 of 1969) PASS: lldb-unit :: SymbolFile/NativePDB/./SymbolFileNativePDBTests/PDBFPOProgramToDWARFExpressionTests.InvalidAssignmentMultiple (1599 of 1969) PASS: lldb-unit :: debugserver/./debugserverTests/RNBSocket.LoopBackConnectIPv6 (1600 of 1969) UNSUPPORTED: lldb-shell :: SymbolFile/PDB/function-level-linking.test (1601 of 1969) PASS: lldb-shell :: SymbolFile/DWARF/dir-separator-posix.s (1602 of 1969) PASS: lldb-api :: python_api/process/io/TestProcessIO.py (1603 of 1969) PASS: lldb-api :: commands/expression/save_jit_objects/TestSaveJITObjects.py (1604 of 1969) PASS: lldb-unit :: ScriptInterpreter/Python/./ScriptInterpreterPythonTests/PythonDataObjectsTest.TestPythonCallableCheck (1605 of 1969) PASS: lldb-api :: functionalities/thread/concurrent_events/TestConcurrentDelayedCrashWithBreakpointWatchpoint.py (1606 of 1969) PASS: lldb-api :: lang/cpp/virtual-overload/TestVirtualOverload.py (1607 of 1969) PASS: lldb-unit :: Utility/./UtilityTests/BinaryStreamTest.PutSLEB128SixBytes (1608 of 1969) PASS: lldb-unit :: Utility/./UtilityTests/StringListTest.GetMaxStringLengthMixed (1609 of 1969) PASS: lldb-api :: functionalities/breakpoint/objc/TestObjCBreakpoints.py (1610 of 1969) PASS: lldb-unit :: Utility/./UtilityTests/SerializationRountripTest.SerializeDeserializeCStringArray (1611 of 1969) PASS: lldb-unit :: UnwindAssembly/x86/./UnwindAssemblyx86Tests/Testx86AssemblyInspectionEngine.TestMovRSPtoRBP (1612 of 1969) PASS: lldb-unit :: Utility/./UtilityTests/RangeTest.NotEqual (1613 of 1969) PASS: lldb-api :: functionalities/value_md5_crash/TestValueMD5Crash.py (1614 of 1969) PASS: lldb-unit :: Utility/./UtilityTests/UriParserTest.BadPort2 (1615 of 1969) PASS: lldb-unit :: Utility/./UtilityTests/StringExtractorTest.GetNameColonValueNoSemicolon (1616 of 1969) PASS: lldb-unit :: Symbol/./SymbolTests/TestTypeSystemClang.TestUnifyAccessSpecifiers (1617 of 1969) PASS: lldb-shell :: SymbolFile/NativePDB/function-types-classes.cpp (1618 of 1969) PASS: lldb-api :: lang/cpp/operator-overload/TestOperatorOverload.py (1619 of 1969) PASS: lldb-api :: functionalities/data-formatter/format-propagation/TestFormatPropagation.py (1620 of 1969) UNSUPPORTED: lldb-shell :: SymbolFile/dissassemble-entry-point.s (1621 of 1969) PASS: lldb-api :: macosx/safe-to-func-call/TestSafeFuncCalls.py (1622 of 1969) PASS: lldb-unit :: ScriptInterpreter/Python/./ScriptInterpreterPythonTests/PythonDataObjectsTest.TestDictionaryResolutionWithDot (1623 of 1969) PASS: lldb-unit :: Expression/./ExpressionTests/CppModuleConfigurationTest.UnrelatedLibrary (1624 of 1969) PASS: lldb-unit :: Symbol/./SymbolTests/Type.GetTypeScopeAndBasename (1625 of 1969) PASS: lldb-unit :: Utility/./UtilityTests/RangeTest.ContainsRange (1626 of 1969) PASS: lldb-unit :: Utility/./UtilityTests/ArchSpecTest.Compatibility (1627 of 1969) PASS: lldb-shell :: SymbolFile/DWARF/split-dwarf-inlining.cpp (1628 of 1969) PASS: lldb-unit :: UnwindAssembly/x86/./UnwindAssemblyx86Tests/Testx86AssemblyInspectionEngine.TestStackRealign8BitDisp_i386 (1629 of 1969) PASS: lldb-api :: lang/objc/objc_direct-methods/TestObjCDirectMethods.py (1630 of 1969) PASS: lldb-api :: lang/objc/objc++/TestObjCXX.py (1631 of 1969) PASS: lldb-shell :: SymbolFile/DWARF/DW_AT_low_pc-addrx.s (1632 of 1969) PASS: lldb-api :: lang/cpp/member-and-local-vars-with-same-name/TestMembersAndLocalsWithSameName.py (1633 of 1969) PASS: lldb-unit :: UnwindAssembly/x86/./UnwindAssemblyx86Tests/Testx86AssemblyInspectionEngine.TestLEAVE (1634 of 1969) PASS: lldb-unit :: UnwindAssembly/x86/./UnwindAssemblyx86Tests/Testx86AssemblyInspectionEngine.Test32BitOnlyInstruction (1635 of 1969) PASS: lldb-api :: functionalities/data-formatter/data-formatter-objc/nsstring/TestDataFormatterNSString.py (1636 of 1969) PASS: lldb-unit :: Utility/./UtilityTests/ProcessInstanceInfo.DumpTable (1637 of 1969) PASS: lldb-api :: functionalities/load_using_paths/TestLoadUsingPaths.py (1638 of 1969) PASS: lldb-unit :: Utility/./UtilityTests/StreamTest.PutRawBytesToMixedEndian (1639 of 1969) UNSUPPORTED: lldb-shell :: SymbolFile/PDB/type-quals.test (1640 of 1969) PASS: lldb-unit :: Process/gdb-remote/./ProcessGdbRemoteTests/GDBRemoteCommunicationClientTest.GetModulesInfoInvalidResponse (1641 of 1969) PASS: lldb-unit :: Utility/./UtilityTests/UriParserTest.Empty (1642 of 1969) PASS: lldb-api :: functionalities/data-formatter/data-formatter-stl/libcxx/multiset/TestDataFormatterLibcxxMultiSet.py (1643 of 1969) PASS: lldb-unit :: Utility/./UtilityTests/RegularExpression.CopyAssignment (1644 of 1969) PASS: lldb-shell :: ObjectFile/ELF/gnu-debuglink.yaml (1645 of 1969) PASS: lldb-shell :: ObjectFile/ELF/section-types-edgecases.yaml (1646 of 1969) PASS: lldb-api :: functionalities/postmortem/mach-core/TestMachCore.py (1647 of 1969) PASS: lldb-unit :: Target/./TargetTests/MCBasedABI.MapRegisterName (1648 of 1969) PASS: lldb-unit :: Symbol/./SymbolTests/TestClangASTImporter.CopyTypeTagDecl (1649 of 1969) PASS: lldb-api :: functionalities/data-formatter/data-formatter-caching/TestDataFormatterCaching.py (1650 of 1969) PASS: lldb-api :: commands/expression/formatters/TestFormatters.py (1651 of 1969) PASS: lldb-unit :: Utility/./UtilityTests/ArgsTest.TestQuotedUnknownEscape (1652 of 1969) UNSUPPORTED: lldb-api :: iohandler/completion/TestIOHandlerCompletion.py (1653 of 1969) PASS: lldb-shell :: Settings/TestSettingsSet.test (1654 of 1969) PASS: lldb-shell :: Breakpoint/debug_addrx.test (1655 of 1969) PASS: lldb-unit :: Utility/./UtilityTests/RangeTest.LessThanInvalid (1656 of 1969) PASS: lldb-unit :: Process/gdb-remote/./ProcessGdbRemoteTests/GDBRemoteCommunicationClientTest.WriteRegister (1657 of 1969) PASS: lldb-shell :: ObjectFile/ELF/PT_LOAD-empty.yaml (1658 of 1969) PASS: lldb-unit :: Utility/./UtilityTests/VMRange.ContainsRange (1659 of 1969) PASS: lldb-unit :: Expression/./ExpressionTests/ClangHostTest.ComputeClangResourceDirectory (1660 of 1969) PASS: lldb-api :: lang/cpp/unsigned_types/TestUnsignedTypes.py (1661 of 1969) PASS: lldb-unit :: UnwindAssembly/x86/./UnwindAssemblyx86Tests/Testx86AssemblyInspectionEngine.TestPushRBPWithREX (1662 of 1969) PASS: lldb-unit :: Symbol/./SymbolTests/PostfixExpression.ToDWARF (1663 of 1969) PASS: lldb-unit :: Utility/./UtilityTests/StreamTest.AddressRange (1664 of 1969) PASS: lldb-unit :: Utility/./UtilityTests/FileSpecTest.Match (1665 of 1969) PASS: lldb-shell :: SymbolFile/DWARF/deterministic-build.cpp (1666 of 1969) PASS: lldb-unit :: ScriptInterpreter/Python/./ScriptInterpreterPythonTests/PythonDataObjectsTest.TestPythonListValueEquality (1667 of 1969) PASS: lldb-api :: functionalities/data-formatter/nsarraysynth/TestNSArraySynthetic.py (1668 of 1969) PASS: lldb-api :: tools/lldb-server/TestGdbRemoteSingleStep.py (1669 of 1969) PASS: lldb-unit :: Utility/./UtilityTests/ScalarTest.Promotion (1670 of 1969) PASS: lldb-unit :: Process/gdb-remote/./ProcessGdbRemoteTests/GDBRemoteClientBaseTest.SendContinueAndLateInterrupt (1671 of 1969) PASS: lldb-api :: python_api/frame/get-variables/TestGetVariables.py (1672 of 1969) PASS: lldb-shell :: Expr/TestTypeOfDeclTypeExpr.test (1673 of 1969) UNSUPPORTED: lldb-shell :: SymbolFile/NativePDB/stack_unwinding01.cpp (1674 of 1969) PASS: lldb-unit :: Process/minidump/./LLDBMinidumpTests/MinidumpParserTest.GetMemoryRegionInfoFromMemoryList (1675 of 1969) PASS: lldb-api :: functionalities/data-formatter/data-formatter-stl/libcxx/variant/TestDataFormatterLibcxxVariant.py (1676 of 1969) PASS: lldb-unit :: Utility/./UtilityTests/StreamTeeTest.SetStreamAtIndexOutOfBounds (1677 of 1969) PASS: lldb-unit :: UnwindAssembly/x86/./UnwindAssemblyx86Tests/Testx86AssemblyInspectionEngine.TestStackRealign32BitDisp_x86_64 (1678 of 1969) XFAIL: lldb-shell :: Register/x86-mm-xmm-write.test (1679 of 1969) PASS: lldb-unit :: Host/./HostTests/SocketTest.DomainListenConnectAccept (1680 of 1969) PASS: lldb-unit :: Utility/./UtilityTests/FileSpecTest.EqualSeparator (1681 of 1969) PASS: lldb-unit :: Host/./HostTests/MainLoopTest.DetectsEOF (1682 of 1969) PASS: lldb-shell :: Minidump/memory-region-from-module.yaml (1683 of 1969) PASS: lldb-shell :: SymbolFile/DWARF/apple-index-is-used.cpp (1684 of 1969) PASS: lldb-unit :: Language/Highlighting/./HighlighterTests/HighlighterTest.ClangBraces (1685 of 1969) PASS: lldb-api :: functionalities/thread/concurrent_events/TestConcurrentCrashWithBreak.py (1686 of 1969) PASS: lldb-unit :: Host/./HostTests/FileSystemTest.FileAndDirectoryComponents (1687 of 1969) PASS: lldb-shell :: ObjectFile/MachO/subsections.yaml (1688 of 1969) PASS: lldb-api :: commands/expression/import-std-module/deque-dbg-info-content/TestDbgInfoContentDequeFromStdModule.py (1689 of 1969) PASS: lldb-unit :: SymbolFile/DWARF/./SymbolFileDWARFTests/SymbolFileDWARFTests.ParseArangesNonzeroSegmentSize (1690 of 1969) PASS: lldb-api :: lang/c/inlines/TestRedefinitionsInInlines.py (1691 of 1969) UNSUPPORTED: lldb-api :: functionalities/data-formatter/data-formatter-stl/libstdcpp/smart_ptr/TestDataFormatterStdSmartPtr.py (1692 of 1969) PASS: lldb-shell :: BuildScript/script-args.test (1693 of 1969) PASS: lldb-api :: tools/lldb-vscode/launch/TestVSCode_launch.py (1694 of 1969) PASS: lldb-shell :: Reproducer/TestWorkingDir.test (1695 of 1969) PASS: lldb-unit :: Utility/./UtilityTests/BinaryStreamTest.PutULEB128NineBytes (1696 of 1969) PASS: lldb-shell :: SymbolFile/DWARF/clang-ast-from-dwarf-unamed-and-anon-structs.cpp (1697 of 1969) UNSUPPORTED: lldb-api :: functionalities/darwin_log/filter/regex/message/TestDarwinLogFilterRegexMessage.py (1698 of 1969) PASS: lldb-api :: functionalities/data-formatter/data-formatter-stl/libcxx/iterator/TestDataFormatterLibccIterator.py (1699 of 1969) PASS: lldb-api :: lang/objc/modules-hash-mismatch/TestClangModulesHashMismatch.py (1700 of 1969) PASS: lldb-unit :: Host/./HostTests/HostInfoTest.GetAugmentedArchSpec (1701 of 1969) PASS: lldb-unit :: ScriptInterpreter/Python/./ScriptInterpreterPythonTests/PythonDataObjectsTest.TestPythonIntegerToStr (1702 of 1969) UNSUPPORTED: lldb-api :: lang/objc/foundation/TestFoundationDisassembly.py (1703 of 1969) PASS: lldb-unit :: Utility/./UtilityTests/VASprintfTest.EncodingError (1704 of 1969) PASS: lldb-unit :: Utility/./UtilityTests/NameMatchesTest.Ignore (1705 of 1969) PASS: lldb-unit :: Symbol/./SymbolTests/TestTypeSystemClang.TestGetTypeClassNested (1706 of 1969) PASS: lldb-unit :: Utility/./UtilityTests/StringExtractorTest.InitEmpty (1707 of 1969) PASS: lldb-api :: lang/objc/modules-inline-functions/TestModulesInlineFunctions.py (1708 of 1969) PASS: lldb-shell :: ObjectFile/wasm/stripped-debug-sections.yaml (1709 of 1969) PASS: lldb-api :: functionalities/inferior-crashing/TestInferiorCrashingStep.py (1710 of 1969) UNSUPPORTED: lldb-shell :: Process/Windows/exception_access_violation.cpp (1711 of 1969) PASS: lldb-unit :: Utility/./UtilityTests/ConstStringTest.CompareStringRef (1712 of 1969) PASS: lldb-api :: lang/cpp/class_static/TestStaticVariables.py (1713 of 1969) UNSUPPORTED: lldb-shell :: ExecControl/StopHook/stop-hook-threads.test (1714 of 1969) PASS: lldb-unit :: Utility/./UtilityTests/FileSpecTest.CopyByAppendingPathComponent (1715 of 1969) PASS: lldb-api :: functionalities/thread/concurrent_events/TestConcurrentSignalWatchBreak.py (1716 of 1969) PASS: lldb-shell :: ObjectFile/ELF/PT_LOAD-overlap.yaml (1717 of 1969) PASS: lldb-unit :: Utility/./UtilityTests/StreamTest.PutCharNull (1718 of 1969) PASS: lldb-api :: commands/apropos/with-process/TestAproposWithProcess.py (1719 of 1969) PASS: lldb-unit :: Core/./LLDBCoreTests/RichManglingContextTest.SwitchProvider (1720 of 1969) PASS: lldb-shell :: Reproducer/TestCrash.test (1721 of 1969) UNSUPPORTED: lldb-api :: functionalities/asan/TestMemoryHistory.py (1722 of 1969) PASS: lldb-api :: functionalities/breakpoint/move_nearest/TestMoveNearest.py (1723 of 1969) PASS: lldb-api :: functionalities/thread/concurrent_events/TestConcurrentCrashWithWatchpointBreakpointSignal.py (1724 of 1969) PASS: lldb-shell :: Host/TestCustomShell.test (1725 of 1969) PASS: lldb-api :: functionalities/return-value/TestReturnValue.py (1726 of 1969) PASS: lldb-api :: lang/mixed/TestMixedLanguages.py (1727 of 1969) PASS: lldb-unit :: Expression/./ExpressionTests/CppModuleConfigurationTest.UnknownLibCppFile (1728 of 1969) PASS: lldb-api :: lang/c/forward/TestForwardDeclaration.py (1729 of 1969) PASS: lldb-api :: lang/objc/modules-cache/TestClangModulesCache.py (1730 of 1969) PASS: lldb-unit :: Utility/./UtilityTests/OptionsWithRawTest.SingleWhitespaceInput (1731 of 1969) PASS: lldb-api :: tools/lldb-vscode/attach/TestVSCode_attach.py (1732 of 1969) PASS: lldb-unit :: SymbolFile/DWARF/./SymbolFileDWARFTests/SymbolFileDWARFTests.TestAbbrevValidAttrNullForm (1733 of 1969) PASS: lldb-unit :: Expression/./ExpressionTests/CppModuleConfigurationTest.MissingUsrInclude (1734 of 1969) PASS: lldb-unit :: Utility/./UtilityTests/BinaryStreamTest.PutSLEB128NineBytes (1735 of 1969) PASS: lldb-api :: lang/objc/forward-decl/TestForwardDecl.py (1736 of 1969) PASS: lldb-api :: functionalities/thread/concurrent_events/TestConcurrentTwoBreakpointsOneDelaySignal.py (1737 of 1969) PASS: lldb-shell :: Driver/TestRepl.test (1738 of 1969) PASS: lldb-api :: functionalities/data-formatter/data-formatter-python-synth/TestDataFormatterPythonSynth.py (1739 of 1969) PASS: lldb-api :: commands/add-dsym/uuid/TestAddDsymCommand.py (1740 of 1969) PASS: lldb-shell :: ObjectFile/Breakpad/discontiguous-sections.test (1741 of 1969) PASS: lldb-api :: lang/c/unicode/TestUnicodeSymbols.py (1742 of 1969) UNSUPPORTED: lldb-api :: commands/register/register/intel_xtended_registers/mpx_bound_violation/TestBoundViolation.py (1743 of 1969) PASS: lldb-api :: functionalities/gdb_remote_client/TestPlatformClient.py (1744 of 1969) PASS: lldb-unit :: Utility/./UtilityTests/StringListTest.JoinSingle (1745 of 1969) UNSUPPORTED: lldb-api :: functionalities/ubsan/basic/TestUbsanBasic.py (1746 of 1969) PASS: lldb-unit :: Utility/./UtilityTests/ArgsTest.EscapeLLDBCommandArgument (1747 of 1969) PASS: lldb-api :: functionalities/data-formatter/data-formatter-objc/TestDataFormatterObjCNSError.py (1748 of 1969) PASS: lldb-unit :: UnwindAssembly/x86/./UnwindAssemblyx86Tests/Testx86AssemblyInspectionEngine.TestPopEDI (1749 of 1969) PASS: lldb-unit :: Expression/./ExpressionTests/DWARFExpression.DW_OP_pick (1750 of 1969) PASS: lldb-unit :: Expression/./ExpressionTests/DiagnosticManagerTest.GetStringPreserveOrder (1751 of 1969) UNSUPPORTED: lldb-api :: functionalities/breakpoint/breakpoint_in_delayslot/TestAvoidBreakpointInDelaySlot.py (1752 of 1969) PASS: lldb-unit :: Utility/./UtilityTests/StructuredDataTest.StringDump (1753 of 1969) PASS: lldb-api :: commands/expression/import-std-module/list-dbg-info-content/TestDbgInfoContentListFromStdModule.py (1754 of 1969) PASS: lldb-unit :: Symbol/./SymbolTests/TestClangASTImporter.ImportInvalidType (1755 of 1969) PASS: lldb-unit :: UnwindAssembly/x86/./UnwindAssemblyx86Tests/Testx86AssemblyInspectionEngine.TestDisassemblyMidFunctionEpilogues (1756 of 1969) PASS: lldb-api :: lang/c/local_variables/TestLocalVariables.py (1757 of 1969) PASS: lldb-unit :: Host/./HostTests/SocketAddressTest.GetAddressInfo (1758 of 1969) PASS: lldb-unit :: Utility/./UtilityTests/UriParserTest.MinimalPort (1759 of 1969) PASS: lldb-shell :: SymbolFile/DWARF/dwp-debug-types.s (1760 of 1969) PASS: lldb-unit :: Utility/./UtilityTests/ArchSpecTest.TestParseMachCPUDashSubtypeTripleExtra (1761 of 1969) PASS: lldb-api :: lang/cpp/namespace/TestNamespace.py (1762 of 1969) UNSUPPORTED: lldb-shell :: BuildScript/toolchain-clang-cl.test (1763 of 1969) PASS: lldb-api :: commands/target/basic/TestTargetCommand.py (1764 of 1969) PASS: lldb-unit :: Utility/./UtilityTests/RangeTest.ContainsAddr (1765 of 1969) PASS: lldb-api :: commands/expression/function_template_specialization_temp_args/TestFunctionTemplateSpecializationTempArgs.py (1766 of 1969) UNSUPPORTED: lldb-shell :: BuildScript/toolchain-msvc.test (1767 of 1969) PASS: lldb-unit :: Utility/./UtilityTests/StreamTest.PutCharWhitespace (1768 of 1969) PASS: lldb-api :: lang/cpp/auto/TestCPPAuto.py (1769 of 1969) PASS: lldb-unit :: Utility/./UtilityTests/ScalarTest.ExtractBitfield (1770 of 1969) PASS: lldb-api :: functionalities/memory-region/TestMemoryRegion.py (1771 of 1969) PASS: lldb-shell :: SymbolFile/NativePDB/disassembly.cpp (1772 of 1969) PASS: lldb-unit :: Utility/./UtilityTests/StringExtractorTest.GetHexU8_Underflow (1773 of 1969) PASS: lldb-shell :: SymbolFile/DWARF/debug_loclists-dwo.s (1774 of 1969) PASS: lldb-unit :: Utility/./UtilityTests/AnsiTerminal.Unknown (1775 of 1969) PASS: lldb-api :: functionalities/data-formatter/nssetsynth/TestNSSetSynthetic.py (1776 of 1969) PASS: lldb-unit :: Process/gdb-remote/./ProcessGdbRemoteTests/GDBRemoteClientBaseTest.SendContinueDelegateInterface (1777 of 1969) PASS: lldb-unit :: Target/./TargetTests/ModuleCacheTest.GetAndPutStrangeHostname (1778 of 1969) PASS: lldb-unit :: Utility/./UtilityTests/VMRange.SetEndAddress (1779 of 1969) PASS: lldb-shell :: Breakpoint/split-dwarf-5-addrbase.test (1780 of 1969) PASS: lldb-shell :: SymbolFile/DWARF/debug-types-signature-loop.s (1781 of 1969) PASS: lldb-unit :: debugserver/./debugserverTests/RNBSocket.LoopBackListenIPv4 (1782 of 1969) PASS: lldb-shell :: ObjectFile/PECOFF/sections.yaml (1783 of 1969) PASS: lldb-api :: commands/expression/import-std-module/shared_ptr-dbg-info-content/TestSharedPtrDbgInfoContentFromStdModule.py (1784 of 1969) PASS: lldb-api :: commands/reproducer/invalid-args/TestInvalidArgsReproducer.py (1785 of 1969) PASS: lldb-api :: functionalities/inline-stepping/TestInlineStepping.py (1786 of 1969) PASS: lldb-api :: commands/expression/import-std-module/deque-basic/TestDequeFromStdModule.py (1787 of 1969) PASS: lldb-unit :: Core/./LLDBCoreTests/MangledTest.NameIndexes_FindFunctionSymbols (1788 of 1969) PASS: lldb-shell :: ObjectFile/ELF/many-sections.s (1789 of 1969) PASS: lldb-unit :: Target/./TargetTests/StackFrameRecognizerTest.NullModuleRegex (1790 of 1969) PASS: lldb-unit :: Utility/./UtilityTests/BinaryStreamTest.PutSLEB128FourBytes (1791 of 1969) PASS: lldb-api :: commands/watchpoints/multiple_threads/TestWatchpointMultipleThreads.py (1792 of 1969) PASS: lldb-api :: commands/expression/issue_11588/Test11588.py (1793 of 1969) PASS: lldb-api :: commands/expression/options/TestExprOptions.py (1794 of 1969) PASS: lldb-unit :: Language/CPlusPlus/./LanguageCPlusPlusTests/CPlusPlusLanguage.CPlusPlusNameParser (1795 of 1969) PASS: lldb-unit :: Utility/./UtilityTests/StreamTeeTest.GetStreamAtIndexOutOfBoundsEmpty (1796 of 1969) PASS: lldb-shell :: ScriptInterpreter/None/none.test (1797 of 1969) PASS: lldb-unit :: Utility/./UtilityTests/StringExtractorTest.GetHexBytes (1798 of 1969) UNSUPPORTED: lldb-api :: functionalities/darwin_log/format/TestDarwinLogMessageFormat.py (1799 of 1969) PASS: lldb-unit :: UnwindAssembly/x86/./UnwindAssemblyx86Tests/Testx86AssemblyInspectionEngine.TestPopR15 (1800 of 1969) PASS: lldb-api :: functionalities/postmortem/minidump-new/TestMiniDumpUUID.py (1801 of 1969) PASS: lldb-shell :: SymbolFile/Breakpad/line-table-mixed-path-styles.test (1802 of 1969) PASS: lldb-unit :: Utility/./UtilityTests/StreamTest.PutHex64ByteOrderBig (1803 of 1969) PASS: lldb-api :: lang/c/find_struct_type/TestFindStructTypes.py (1804 of 1969) PASS: lldb-shell :: Driver/TestCore.test (1805 of 1969) PASS: lldb-unit :: Utility/./UtilityTests/RecordReplayTest.InstrumentedFoo (1806 of 1969) UNSUPPORTED: lldb-shell :: Register/x86-gp-write.test (1807 of 1969) PASS: lldb-api :: commands/watchpoints/watchpoint_commands/TestWatchpointCommands.py (1808 of 1969) PASS: lldb-api :: functionalities/breakpoint/breakpoint_options/TestBreakpointOptions.py (1809 of 1969) PASS: lldb-unit :: Core/./LLDBCoreTests/MangledTest.EmptyForInvalidName (1810 of 1969) UNSUPPORTED: lldb-api :: functionalities/tty/TestTerminal.py (1811 of 1969) PASS: lldb-unit :: Target/./TargetTests/ExecutionContextTest.GetByteOrder (1812 of 1969) PASS: lldb-api :: lang/cpp/incomplete-types/TestCppIncompleteTypes.py (1813 of 1969) PASS: lldb-api :: functionalities/tail_call_frames/disambiguate_call_site/TestDisambiguateCallSite.py (1814 of 1969) PASS: lldb-api :: macosx/find-app-in-bundle/TestFindAppInBundle.py (1815 of 1969) PASS: lldb-api :: functionalities/backticks/TestBackticksWithoutATarget.py (1816 of 1969) PASS: lldb-unit :: ScriptInterpreter/Python/./ScriptInterpreterPythonTests/PythonDataObjectsTest.TestBorrowedReferences (1817 of 1969) PASS: lldb-unit :: Core/./LLDBCoreTests/MangledTest.ResultForValidName (1818 of 1969) PASS: lldb-unit :: Utility/./UtilityTests/StreamTest.AddressSuffix (1819 of 1969) PASS: lldb-shell :: Commands/CommandScriptImmediateOutput/CommandScriptImmediateOutputFile.test (1820 of 1969) PASS: lldb-unit :: Utility/./UtilityTests/TildeExpressionResolver.ResolveFullPath (1821 of 1969) PASS: lldb-unit :: Utility/./UtilityTests/StreamTeeTest.Constructor2Streams (1822 of 1969) PASS: lldb-api :: python_api/sbstructureddata/TestStructuredDataAPI.py (1823 of 1969) PASS: lldb-api :: functionalities/gdb_remote_client/TestNoWatchpointSupportInfo.py (1824 of 1969) PASS: lldb-api :: lang/cpp/char8_t/TestCxxChar8_t.py (1825 of 1969) PASS: lldb-api :: lang/cpp/enum_types/TestCPP11EnumTypes.py (1826 of 1969) PASS: lldb-unit :: Symbol/./SymbolTests/TestClangASTImporter.MetadataPropagationIndirectImport (1827 of 1969) PASS: lldb-api :: functionalities/data-formatter/data-formatter-stl/libcxx/map/TestDataFormatterLibccMap.py (1828 of 1969) PASS: lldb-shell :: SymbolFile/Breakpad/unwind-via-stack-cfi.test (1829 of 1969) PASS: lldb-shell :: Reproducer/Functionalities/TestStepping.test (1830 of 1969) PASS: lldb-api :: functionalities/tail_call_frames/sbapi_support/TestTailCallFrameSBAPI.py (1831 of 1969) PASS: lldb-unit :: Utility/./UtilityTests/GeneratorTest.Create (1832 of 1969) PASS: lldb-api :: commands/target/stop-hooks/TestStopHooks.py (1833 of 1969) PASS: lldb-unit :: Host/./HostTests/NativeProcessProtocolTest.SetBreakpointFailRead (1834 of 1969) PASS: lldb-api :: functionalities/data-formatter/language_category_updates/TestDataFormatterLanguageCategoryUpdates.py (1835 of 1969) FAIL: lldb-api :: functionalities/ptr_refs/TestPtrRefs.py (1836 of 1969) ******************** TEST 'lldb-api :: functionalities/ptr_refs/TestPtrRefs.py' FAILED ******************** Script: -- /usr/local/bin/python /Users/buildslave/jenkins/workspace/lldb-cmake-sanitized/llvm-project/lldb/test/API/dotest.py --arch x86_64 -s /Users/buildslave/jenkins/workspace/lldb-cmake-sanitized/lldb-build/lldb-test-traces -S nm -u CXXFLAGS -u CFLAGS --codesign-identity lldb_codesign --server /Users/buildslave/jenkins/workspace/lldb-cmake-sanitized/lldb-build/./bin/debugserver --arch x86_64 --build-dir /Users/buildslave/jenkins/workspace/lldb-cmake-sanitized/lldb-build/lldb-test-build.noindex -s=/Users/buildslave/jenkins/workspace/lldb-cmake-sanitized/test/logs -t --env TERM=vt100 --env LLVM_LIBS_DIR=/Users/buildslave/jenkins/workspace/lldb-cmake-sanitized/lldb-build/./lib --inferior-env ASAN_OPTIONS=detect_stack_use_after_return=1 --inferior-env DYLD_INSERT_LIBRARIES=/Users/buildslave/jenkins/workspace/lldb-cmake-sanitized/host-compiler/lib/clang/11.0.0/lib/darwin/libclang_rt.asan_osx_dynamic.dylib --build-dir /Users/buildslave/jenkins/workspace/lldb-cmake-sanitized/lldb-build/lldb-test-build.noindex --lldb-module-cache-dir /Users/buildslave/jenkins/workspace/lldb-cmake-sanitized/lldb-build/lldb-test-build.noindex/module-cache-lldb/lldb-api --clang-module-cache-dir /Users/buildslave/jenkins/workspace/lldb-cmake-sanitized/lldb-build/lldb-test-build.noindex/module-cache-clang/lldb-api --executable /Users/buildslave/jenkins/workspace/lldb-cmake-sanitized/lldb-build/./bin/lldb --compiler /Users/buildslave/jenkins/workspace/lldb-cmake-sanitized/lldb-build/./bin/clang --dsymutil /Users/buildslave/jenkins/workspace/lldb-cmake-sanitized/lldb-build/./bin/dsymutil --filecheck /Users/buildslave/jenkins/workspace/lldb-cmake-sanitized/lldb-build/./bin/FileCheck --lldb-libs-dir /Users/buildslave/jenkins/workspace/lldb-cmake-sanitized/lldb-build/./lib /Users/buildslave/jenkins/workspace/lldb-cmake-sanitized/llvm-project/lldb/test/API/functionalities/ptr_refs -p TestPtrRefs.py -- Exit Code: 1

Hide Details

Command Output (stdout): -- lldb version 11.0.99 clang revision 4a6ebc03ba89340e119b3c2c6b8a6c721fff5fd5 llvm revision 4a6ebc03ba89340e119b3c2c6b8a6c721fff5fd5 "crashlog" and "save_crashlog" command installed, use the "--help" option for detailed help "malloc_info", "ptr_refs", "cstr_refs", "find_variable", and "objc_refs" commands have been installed, use the "--help" options on these commands for detailed help. LLDB library dir: /Users/buildslave/jenkins/workspace/lldb-cmake-sanitized/lldb-build/bin LLDB import library dir: /Users/buildslave/jenkins/workspace/lldb-cmake-sanitized/lldb-build/./lib libstdcxx tests will not be run because: Don't know how to build with libstdcxx on macosx Skipping following debug info categories: ['dwo'] 0x00007ffee9d6a478: stack in frame #0 of thread #1: tid 0x2773e7 in variable at 0x7ffee9d6a478: (const char *) my_ptr = 0x00006020000000b0 "hello" 0x00007ffee9d6a410: stack (red zone)

Hide Details

-- Command Output (stderr): -- error: 'ptr_refs' is not a valid command. error: 'ptr_refs' is not a valid command.

Hide Details

Session logs for test failures/errors/unexpected successes will go into directory '/Users/buildslave/jenkins/workspace/lldb-cmake-sanitized/test/logs' Command invoked: /Users/buildslave/jenkins/workspace/lldb-cmake-sanitized/llvm-project/lldb/test/API/dotest.py --arch x86_64 -s /Users/buildslave/jenkins/workspace/lldb-cmake-sanitized/lldb-build/lldb-test-traces -S nm -u CXXFLAGS -u CFLAGS --codesign-identity lldb_codesign --server /Users/buildslave/jenkins/workspace/lldb-cmake-sanitized/lldb-build/./bin/debugserver --arch x86_64 --build-dir /Users/buildslave/jenkins/workspace/lldb-cmake-sanitized/lldb-build/lldb-test-build.noindex -s=/Users/buildslave/jenkins/workspace/lldb-cmake-sanitized/test/logs -t --env TERM=vt100 --env LLVM_LIBS_DIR=/Users/buildslave/jenkins/workspace/lldb-cmake-sanitized/lldb-build/./lib --inferior-env ASAN_OPTIONS=detect_stack_use_after_return=1 --inferior-env DYLD_INSERT_LIBRARIES=/Users/buildslave/jenkins/workspace/lldb-cmake-sanitized/host-compiler/lib/clang/11.0.0/lib/darwin/libclang_rt.asan_osx_dynamic.dylib --build-dir /Users/buildslave/jenkins/workspace/lldb-cmake-sanitized/lldb-build/lldb-test-build.noindex --lldb-module-cache-dir /Users/buildslave/jenkins/workspace/lldb-cmake-sanitized/lldb-build/lldb-test-build.noindex/module-cache-lldb/lldb-api --clang-module-cache-dir /Users/buildslave/jenkins/workspace/lldb-cmake-sanitized/lldb-build/lldb-test-build.noindex/module-cache-clang/lldb-api --executable /Users/buildslave/jenkins/workspace/lldb-cmake-sanitized/lldb-build/./bin/lldb --compiler /Users/buildslave/jenkins/workspace/lldb-cmake-sanitized/lldb-build/./bin/clang --dsymutil /Users/buildslave/jenkins/workspace/lldb-cmake-sanitized/lldb-build/./bin/dsymutil --filecheck /Users/buildslave/jenkins/workspace/lldb-cmake-sanitized/lldb-build/./bin/FileCheck --lldb-libs-dir /Users/buildslave/jenkins/workspace/lldb-cmake-sanitized/lldb-build/./lib /Users/buildslave/jenkins/workspace/lldb-cmake-sanitized/llvm-project/lldb/test/API/functionalities/ptr_refs -p TestPtrRefs.py Change dir to: /Users/buildslave/jenkins/workspace/lldb-cmake-sanitized/llvm-project/lldb/test/API/functionalities/ptr_refs runCmd: settings clear -all output:

Hide Details

runCmd: settings set symbols.enable-external-lookup false output:

Hide Details

runCmd: settings set target.auto-apply-fixits false output:

Hide Details

runCmd: settings set plugin.process.gdb-remote.packet-timeout 60 output:

Hide Details

runCmd: settings set symbols.clang-modules-cache-path "/Users/buildslave/jenkins/workspace/lldb-cmake-sanitized/lldb-build/lldb-test-build.noindex/module-cache-lldb/lldb-api" output:

Hide Details

runCmd: settings set use-color false output:

Hide Details

runCmd: setting set target.prefer-dynamic-value no-dynamic-values output:

Hide Details

runCmd: settings set target.env-vars ASAN_OPTIONS=detect_stack_use_after_return=1 DYLD_INSERT_LIBRARIES=/Users/buildslave/jenkins/workspace/lldb-cmake-sanitized/host-compiler/lib/clang/11.0.0/lib/darwin/libclang_rt.asan_osx_dynamic.dylib output:

Hide Details

runCmd: script import lldb.macosx.heap output: "crashlog" and "save_crashlog" command installed, use the "--help" option for detailed help "malloc_info", "ptr_refs", "cstr_refs", "find_variable", and "objc_refs" commands have been installed, use the "--help" options on these commands for detailed help.

Hide Details

Hide Details

runCmd: ptr_refs my_ptr output: 0x00007ffee9d6a478: stack in frame #0 of thread #1: tid 0x2773e7 in variable at 0x7ffee9d6a478: (const char *) my_ptr = 0x00006020000000b0 "hello" 0x00007ffee9d6a410: stack (red zone)

Hide Details

Hide Details

Expecting sub string: malloc Not matched

Hide Details

FAIL: LLDB (/Users/buildslave/jenkins/workspace/lldb-cmake-sanitized/lldb-build/bin/clang-11-x86_64) :: test_ptr_refs_dsym (TestPtrRefs.TestPtrRefs) <bound method SBProcess.Kill of <lldb.SBProcess; proxy of <Swig Object of type 'lldb::SBProcess *' at 0x1108358a0> >>: success

Hide Details

runCmd: settings clear -all output:

Hide Details

runCmd: settings set symbols.enable-external-lookup false output:

Hide Details

runCmd: settings set target.auto-apply-fixits false output:

Hide Details

runCmd: settings set plugin.process.gdb-remote.packet-timeout 60 output:

Hide Details

runCmd: settings set symbols.clang-modules-cache-path "/Users/buildslave/jenkins/workspace/lldb-cmake-sanitized/lldb-build/lldb-test-build.noindex/module-cache-lldb/lldb-api" output:

Hide Details

runCmd: settings set use-color false output:

Hide Details

runCmd: setting set target.prefer-dynamic-value no-dynamic-values output:

Hide Details

runCmd: settings set target.env-vars ASAN_OPTIONS=detect_stack_use_after_return=1 DYLD_INSERT_LIBRARIES=/Users/buildslave/jenkins/workspace/lldb-cmake-sanitized/host-compiler/lib/clang/11.0.0/lib/darwin/libclang_rt.asan_osx_dynamic.dylib output:

Hide Details

runCmd: script import lldb.macosx.heap output:

Hide Details

runCmd: ptr_refs my_ptr runCmd failed! error: 'ptr_refs' is not a valid command.

Hide Details

Hide Details

XFAIL: LLDB (/Users/buildslave/jenkins/workspace/lldb-cmake-sanitized/lldb-build/bin/clang-11-x86_64) :: test_ptr_refs_dwarf (TestPtrRefs.TestPtrRefs) <bound method SBProcess.Kill of <lldb.SBProcess; proxy of <Swig Object of type 'lldb::SBProcess *' at 0x10fbe7990> >>: success

Hide Details

UNSUPPORTED: LLDB (/Users/buildslave/jenkins/workspace/lldb-cmake-sanitized/lldb-build/bin/clang-11-x86_64) :: test_ptr_refs_dwo (TestPtrRefs.TestPtrRefs) (test case does not fall in any category of interest for this run) runCmd: settings clear -all output:

Hide Details

runCmd: settings set symbols.enable-external-lookup false output:

Hide Details

runCmd: settings set target.auto-apply-fixits false output:

Hide Details

runCmd: settings set plugin.process.gdb-remote.packet-timeout 60 output:

Hide Details

runCmd: settings set symbols.clang-modules-cache-path "/Users/buildslave/jenkins/workspace/lldb-cmake-sanitized/lldb-build/lldb-test-build.noindex/module-cache-lldb/lldb-api" output:

Hide Details

runCmd: settings set use-color false output:

Hide Details

runCmd: setting set target.prefer-dynamic-value no-dynamic-values output:

Hide Details

runCmd: settings set target.env-vars ASAN_OPTIONS=detect_stack_use_after_return=1 DYLD_INSERT_LIBRARIES=/Users/buildslave/jenkins/workspace/lldb-cmake-sanitized/host-compiler/lib/clang/11.0.0/lib/darwin/libclang_rt.asan_osx_dynamic.dylib output:

Hide Details

runCmd: script import lldb.macosx.heap output:

Hide Details

runCmd: ptr_refs my_ptr runCmd failed! error: 'ptr_refs' is not a valid command.

Hide Details

Hide Details

XFAIL: LLDB (/Users/buildslave/jenkins/workspace/lldb-cmake-sanitized/lldb-build/bin/clang-11-x86_64) :: test_ptr_refs_gmodules (TestPtrRefs.TestPtrRefs) <bound method SBProcess.Kill of <lldb.SBProcess; proxy of <Swig Object of type 'lldb::SBProcess *' at 0x1108351e0> >>: success

Hide Details

Restore dir to: /Users/buildslave/jenkins/workspace/lldb-cmake-sanitized/lldb-build/tools/lldb/test ====================================================================== FAIL: test_ptr_refs_dsym (TestPtrRefs.TestPtrRefs) Test format string functionality. ---------------------------------------------------------------------- Traceback (most recent call last): File "/Users/buildslave/jenkins/workspace/lldb-cmake-sanitized/llvm-project/lldb/packages/Python/lldbsuite/test/lldbtest.py", line 1751, in test_method return attrvalue(self) File "/Users/buildslave/jenkins/workspace/lldb-cmake-sanitized/llvm-project/lldb/packages/Python/lldbsuite/test/decorators.py", line 110, in wrapper func(*args, **kwargs) File "/Users/buildslave/jenkins/workspace/lldb-cmake-sanitized/llvm-project/lldb/test/API/functionalities/ptr_refs/TestPtrRefs.py", line 47, in test_ptr_refs self.expect("ptr_refs my_ptr", substrs=["malloc", "stack"]) File "/Users/buildslave/jenkins/workspace/lldb-cmake-sanitized/llvm-project/lldb/packages/Python/lldbsuite/test/lldbtest.py", line 2391, in expect if msg else EXP_MSG(str, output, exe)) AssertionError: False is not True : 'ptr_refs my_ptr' returns expected result, got '0x00007ffee9d6a478: stack in frame #0 of thread #1: tid 0x2773e7 in variable at 0x7ffee9d6a478: (const char *) my_ptr = 0x00006020000000b0 "hello" 0x00007ffee9d6a410: stack (red zone)' Config=x86_64-/Users/buildslave/jenkins/workspace/lldb-cmake-sanitized/lldb-build/bin/clang-11 ---------------------------------------------------------------------- Ran 4 tests in 7.809s

Hide Details

RESULT: FAILED (0 passes, 1 failures, 0 errors, 1 skipped, 2 expected failures, 0 unexpected successes)

Hide Details

--

Hide Details

******************** PASS: lldb-api :: functionalities/gdb_remote_client/TestIOSSimulator.py (1837 of 1969) UNSUPPORTED: lldb-api :: linux/add-symbols/TestTargetSymbolsAddCommand.py (1838 of 1969) PASS: lldb-unit :: Utility/./UtilityTests/ArgsTest.StringListConstructor (1839 of 1969) PASS: lldb-unit :: Utility/./UtilityTests/DataExtractorTest.GetMaxU64_unchecked (1840 of 1969) PASS: lldb-unit :: Target/./TargetTests/ExecutionContextTest.GetByteOrderProcess (1841 of 1969) PASS: lldb-unit :: Utility/./UtilityTests/SharedCluster.ClusterManager (1842 of 1969) PASS: lldb-shell :: ObjectFile/ELF/avr-basic-info.yaml (1843 of 1969) UNSUPPORTED: lldb-api :: functionalities/darwin_log/filter/regex/subsystem/TestDarwinLogFilterRegexSubsystem.py (1844 of 1969) PASS: lldb-shell :: Register/x86-64-read.test (1845 of 1969) PASS: lldb-unit :: Utility/./UtilityTests/ScalarTest.Equality (1846 of 1969) PASS: lldb-api :: python_api/default-constructor/TestDefaultConstructorForAPIObjects.py (1847 of 1969) PASS: lldb-unit :: Utility/./UtilityTests/StringListTest.LongestCommonPrefixNoPrefix (1848 of 1969) PASS: lldb-api :: functionalities/breakpoint/debugbreak/TestDebugBreak.py (1849 of 1969) PASS: lldb-unit :: Utility/./UtilityTests/StringListTest.GetMaxStringLengthIncreasingSize (1850 of 1969) PASS: lldb-unit :: Language/Highlighting/./HighlighterTests/HighlighterTest.DefaultHighlighterWithCursor (1851 of 1969) UNSUPPORTED: lldb-shell :: SymbolFile/NativePDB/local-variables.cpp (1852 of 1969) PASS: lldb-api :: functionalities/inferior-assert/TestInferiorAssert.py (1853 of 1969) UNSUPPORTED: lldb-shell :: SymbolFile/PDB/compilands.test (1854 of 1969) PASS: lldb-api :: tools/lldb-server/TestGdbRemoteKill.py (1855 of 1969) UNSUPPORTED: lldb-api :: tools/lldb-server/TestGdbRemoteModuleInfo.py (1856 of 1969) PASS: lldb-api :: lang/cpp/char1632_t/TestChar1632T.py (1857 of 1969) PASS: lldb-api :: functionalities/multiword-commands/TestMultiWordCommands.py (1858 of 1969) UNSUPPORTED: lldb-shell :: Register/arm-fp-read.test (1859 of 1969) PASS: lldb-shell :: SymbolFile/DWARF/dir-separator-no-comp-dir.s (1860 of 1969) PASS: lldb-shell :: ObjectFile/ELF/duplicate-section.yaml (1861 of 1969) PASS: lldb-unit :: Symbol/./SymbolTests/TestTypeSystemClang.TestDisplayName (1862 of 1969) PASS: lldb-api :: tools/lldb-server/TestGdbRemote_qThreadStopInfo.py (1863 of 1969) PASS: lldb-unit :: Utility/./UtilityTests/NameMatchesTest.RegularExpression (1864 of 1969) PASS: lldb-unit :: ObjectFile/Breakpad/./ObjectFileBreakpadTests/StackCFIRecord.parse (1865 of 1969) PASS: lldb-unit :: Process/gdb-remote/./ProcessGdbRemoteTests/GDBRemoteCommunicationClientTest.GetQOffsets (1866 of 1969) PASS: lldb-unit :: UnwindAssembly/x86/./UnwindAssemblyx86Tests/Testx86AssemblyInspectionEngine.TestSubRSP (1867 of 1969) PASS: lldb-unit :: Utility/./UtilityTests/FileSpecTest.EqualDotsWindows (1868 of 1969) PASS: lldb-api :: lang/c/local_types/TestUseClosestType.py (1869 of 1969) UNSUPPORTED: lldb-shell :: Watchpoint/netbsd-nouserdbregs.test (1870 of 1969) PASS: lldb-unit :: Host/./HostTests/Host.WaitStatusFormat (1871 of 1969) PASS: lldb-shell :: Recognizer/assert.test (1872 of 1969) PASS: lldb-api :: lang/c/shared_lib_stripped_symbols/TestSharedLibStrippedSymbols.py (1873 of 1969) PASS: lldb-api :: functionalities/data-formatter/data-formatter-smart-array/TestDataFormatterSmartArray.py (1874 of 1969) PASS: lldb-api :: functionalities/breakpoint/comp_dir_symlink/TestCompDirSymLink.py (1875 of 1969) UNSUPPORTED: lldb-shell :: SymbolFile/PDB/vbases.test (1876 of 1969) PASS: lldb-unit :: Host/./HostTests/FileActionTest.Open (1877 of 1969) PASS: lldb-api :: functionalities/gdb_remote_client/TestRegDefinitionInParts.py (1878 of 1969) PASS: lldb-unit :: Host/./HostTests/NativeProcessProtocolTest.SetBreakpointFailWrite (1879 of 1969) PASS: lldb-unit :: Process/gdb-remote/./ProcessGdbRemoteTests/GDBRemoteClientBaseTest.SendPacketAndReceiveResponseWithOutputSupport (1880 of 1969) PASS: lldb-unit :: UnwindAssembly/x86/./UnwindAssemblyx86Tests/Testx86AssemblyInspectionEngine.TestPushEBX (1881 of 1969) PASS: lldb-unit :: Utility/./UtilityTests/LogChannelEnabledTest.LogThread (1882 of 1969) PASS: lldb-unit :: Utility/./UtilityTests/StringExtractorTest.GetHexBytes_Partial (1883 of 1969) PASS: lldb-unit :: ScriptInterpreter/Python/./ScriptInterpreterPythonTests/PythonDataObjectsTest.TestPythonInteger (1884 of 1969) PASS: lldb-api :: functionalities/jitloader_gdb/TestJITLoaderGDB.py (1885 of 1969) PASS: lldb-api :: python_api/formatters/TestFormattersSBAPI.py (1886 of 1969) PASS: lldb-shell :: Driver/TestSingleQuote.test (1887 of 1969) PASS: lldb-unit :: UnwindAssembly/x86/./UnwindAssemblyx86Tests/Testx86AssemblyInspectionEngine.TestPushR12 (1888 of 1969) UNSUPPORTED: lldb-api :: lang/cpp/static_members/TestCPPStaticMembers.py (1889 of 1969) PASS: lldb-unit :: UnwindAssembly/x86/./UnwindAssemblyx86Tests/Testx86AssemblyInspectionEngine.TestPopR12 (1890 of 1969) PASS: lldb-unit :: Utility/./UtilityTests/NameMatchesTest.Equals (1891 of 1969) PASS: lldb-unit :: Utility/./UtilityTests/OptionsWithRawTest.EmptySuffix (1892 of 1969) PASS: lldb-unit :: ScriptInterpreter/Python/./ScriptInterpreterPythonTests/PythonDataObjectsTest.TestPythonDictionaryManipulation (1893 of 1969) PASS: lldb-unit :: ObjectFile/Breakpad/./ObjectFileBreakpadTests/InfoRecord.parse (1894 of 1969) PASS: lldb-shell :: SymbolFile/Breakpad/unwind-via-stack-win.test (1895 of 1969) PASS: lldb-api :: commands/expression/import-std-module/vector-dbg-info-content/TestDbgInfoContentVectorFromStdModule.py (1896 of 1969) PASS: lldb-api :: functionalities/thread/thread_exit/TestThreadExit.py (1897 of 1969) PASS: lldb-api :: functionalities/deleted-executable/TestDeletedExecutable.py (1898 of 1969) UNSUPPORTED: lldb-api :: functionalities/darwin_log/basic/TestDarwinLogBasic.py (1899 of 1969) PASS: lldb-unit :: Utility/./UtilityTests/OptionsWithRawTest.WhitespaceSuffix (1900 of 1969) PASS: lldb-shell :: Reproducer/TestDump.test (1901 of 1969) PASS: lldb-shell :: SymbolFile/DWARF/debug_rnglists.s (1902 of 1969) PASS: lldb-unit :: Core/./LLDBCoreTests/RichManglingContextTest.IPDRealloc (1903 of 1969) PASS: lldb-unit :: Utility/./UtilityTests/VMRange.Clear (1904 of 1969) PASS: lldb-api :: commands/command/invalid-args/TestInvalidArgsCommand.py (1905 of 1969) PASS: lldb-unit :: Utility/./UtilityTests/ScalarTest.GetValue (1906 of 1969) PASS: lldb-unit :: Utility/./UtilityTests/ScalarTest.RightShiftOperator (1907 of 1969) PASS: lldb-shell :: SymbolFile/DWARF/debug-line-basic.s (1908 of 1969) PASS: lldb-api :: python_api/target/TestTargetAPI.py (1909 of 1969) PASS: lldb-shell :: SymbolFile/symbol-binding.test (1910 of 1969) PASS: lldb-unit :: Symbol/./SymbolTests/TestClangASTImporter.CopyDeclTagDecl (1911 of 1969) PASS: lldb-api :: commands/expression/import-std-module/shared_ptr/TestSharedPtrFromStdModule.py (1912 of 1969) PASS: lldb-api :: commands/command/script/TestCommandScript.py (1913 of 1969) PASS: lldb-unit :: Utility/./UtilityTests/UriParserTest.MinimalPath (1914 of 1969) PASS: lldb-unit :: Utility/./UtilityTests/StringExtractorTest.GetHexU8_Exact_NoEof (1915 of 1969) PASS: lldb-unit :: Utility/./UtilityTests/StringListTest.SplitIntoLinesEmpty (1916 of 1969) PASS: lldb-api :: lang/objc/modules-auto-import/TestModulesAutoImport.py (1917 of 1969) PASS: lldb-unit :: Utility/./UtilityTests/ArchSpecTest.YAML (1918 of 1969) PASS: lldb-shell :: ObjectFile/PECOFF/section-types.yaml (1919 of 1969) PASS: lldb-api :: functionalities/data-formatter/setvaluefromcstring/TestSetValueFromCString.py (1920 of 1969) PASS: lldb-unit :: Process/minidump/./LLDBMinidumpTests/MinidumpParserTest.GetLinuxProcStatus (1921 of 1969) PASS: lldb-shell :: SymbolFile/DWARF/dwarf5-atomic.s (1922 of 1969) PASS: lldb-unit :: Utility/./UtilityTests/RangeTest.NotEqualInvalid (1923 of 1969) UNSUPPORTED: lldb-api :: functionalities/darwin_log/source/info/TestDarwinLogSourceInfo.py (1924 of 1969) PASS: lldb-api :: tools/lldb-server/register-reading/TestGdbRemoteGPacket.py (1925 of 1969) PASS: lldb-api :: functionalities/thread/exit_during_step/TestExitDuringStep.py (1926 of 1969) PASS: lldb-unit :: Utility/./UtilityTests/BinaryStreamTest.PutSLEB128MaxValue (1927 of 1969) PASS: lldb-api :: tools/lldb-vscode/breakpoint/TestVSCode_setBreakpoints.py (1928 of 1969) PASS: lldb-unit :: Utility/./UtilityTests/StreamTest.PutCStringWithStringRef (1929 of 1969) PASS: lldb-unit :: Utility/./UtilityTests/BinaryStreamTest.PutULEB128One (1930 of 1969) PASS: lldb-api :: commands/register/register/register_command/TestRegisters.py (1931 of 1969) PASS: lldb-unit :: Utility/./UtilityTests/ConstStringTest.NullAndEmptyStates (1932 of 1969) PASS: lldb-shell :: ObjectFile/wasm/embedded-debug-sections.yaml (1933 of 1969) PASS: lldb-unit :: Utility/./UtilityTests/StringListTest.LongestCommonPrefixSingleElement (1934 of 1969) PASS: lldb-unit :: Interpreter/./InterpreterTests/OptionArgParserTest.toScriptLanguage (1935 of 1969) PASS: lldb-api :: functionalities/data-formatter/var-in-aggregate-misuse/TestVarInAggregateMisuse.py (1936 of 1969) PASS: lldb-api :: functionalities/data-formatter/data-formatter-stl/libcxx/atomic/TestLibCxxAtomic.py (1937 of 1969) PASS: lldb-unit :: Utility/./UtilityTests/StreamTeeTest.GetStreamAtIndexOutOfBounds (1938 of 1969) PASS: lldb-shell :: SymbolFile/NativePDB/globals-bss.cpp (1939 of 1969) PASS: lldb-api :: python_api/findvalue_duplist/TestSBFrameFindValue.py (1940 of 1969) PASS: lldb-api :: macosx/nslog/TestDarwinNSLogOutput.py (1941 of 1969) PASS: lldb-api :: functionalities/data-formatter/dump_dynamic/TestDumpDynamic.py (1942 of 1969) PASS: lldb-api :: lang/objc/objc-new-syntax/TestObjCNewSyntaxArray.py (1943 of 1969) PASS: lldb-api :: lang/cpp/stl/TestStdCXXDisassembly.py (1944 of 1969) PASS: lldb-api :: lang/c/struct_types/TestStructTypes.py (1945 of 1969) PASS: lldb-unit :: Utility/./UtilityTests/EnvironmentTest.EnvpConversion (1946 of 1969) UNSUPPORTED: lldb-shell :: ScriptInterpreter/Lua/breakpoint_callback.test (1947 of 1969) PASS: lldb-shell :: VSCode/TestOptions.test (1948 of 1969) PASS: lldb-unit :: Symbol/./SymbolTests/TestTypeSystemClang.TestRemoveFastQualifiers (1949 of 1969) PASS: lldb-unit :: ScriptInterpreter/Python/./ScriptInterpreterPythonTests/PythonDataObjectsTest.TestGlobalNameResolutionWithDot (1950 of 1969) UNSUPPORTED: lldb-api :: functionalities/darwin_log/filter/exact_match/activity/TestDarwinLogFilterMatchActivity.py (1951 of 1969) UNSUPPORTED: lldb-api :: benchmarks/libcxxmap/TestBenchmarkLibcxxMap.py (1952 of 1969) PASS: lldb-unit :: Host/./HostTests/FileSystemTest.OpenErrno (1953 of 1969) PASS: lldb-unit :: Editline/./EditlineTests/EditlineTestFixture.EditlineReceivesMultiLineText (1954 of 1969) PASS: lldb-shell :: Reproducer/TestCaptureEnvOverride.test (1955 of 1969) PASS: lldb-unit :: Expression/./ExpressionTests/DiagnosticManagerTest.GetStringSeverityLabels (1956 of 1969) PASS: lldb-unit :: Utility/./UtilityTests/StringListTest.CopyListSingle (1957 of 1969) PASS: lldb-api :: functionalities/rerun/TestRerun.py (1958 of 1969) PASS: lldb-shell :: ObjectFile/Breakpad/uuid-matching-mac.test (1959 of 1969) PASS: lldb-api :: functionalities/data-formatter/data-formatter-stl/libcxx/optional/TestDataFormatterLibcxxOptional.py (1960 of 1969) PASS: lldb-shell :: ObjectFile/Breakpad/sections-trailing-func.test (1961 of 1969) PASS: lldb-api :: functionalities/thread/concurrent_events/TestConcurrentTwoBreakpointsOneWatchpoint.py (1962 of 1969) UNSUPPORTED: lldb-api :: functionalities/thread/create_during_step/TestCreateDuringStep.py (1963 of 1969) PASS: lldb-unit :: Utility/./UtilityTests/RangeDataVector.FindEntryIndexesThatContain (1964 of 1969) PASS: lldb-shell :: SymbolFile/DWARF/compilercontext.ll (1965 of 1969) PASS: lldb-shell :: SymbolFile/DWARF/childless-compile-unit.s (1966 of 1969) PASS: lldb-api :: functionalities/thread/step_out/TestThreadStepOut.py (1967 of 1969) PASS: lldb-api :: lang/c/shared_lib/TestSharedLib.py (1968 of 1969) PASS: lldb-api :: lang/objc/modules-app-update/TestClangModulesAppUpdate.py (1969 of 1969)

Hide Details

Testing Time: 4352.13s ******************** Failing Tests (3): lldb-api :: python_api/thread/TestThreadAPI.py lldb-api :: lang/objc/ptr_refs/TestPtrRefsObjC.py lldb-api :: functionalities/ptr_refs/TestPtrRefs.py

Hide Details

Hide Details

Slowest Tests: -------------------------------------------------------------------------- 91.69s: lldb-api :: functionalities/gdb_remote_client/TestWasm.py 95.28s: lldb-api :: types/TestLongTypes.py 95.32s: lldb-api :: commands/settings/TestSettings.py 102.19s: lldb-api :: python_api/exprpath_synthetic/TestExprPathSynthetic.py 113.69s: lldb-api :: lang/objc/foundation/TestObjCMethodsNSError.py 113.86s: lldb-api :: lang/objc/objc-new-syntax/TestObjCNewSyntaxArray.py 114.05s: lldb-api :: lang/objc/foundation/TestObjCMethodsString.py 114.61s: lldb-api :: lang/objc/objc-new-syntax/TestObjCNewSyntaxDictionary.py 120.53s: lldb-api :: tools/lldb-server/TestGdbRemote_qThreadStopInfo.py 136.90s: lldb-api :: lang/objc/exceptions/TestObjCExceptions.py 140.22s: lldb-api :: lang/objc/real-definition/TestRealDefinition.py 151.68s: lldb-api :: lang/objc/objc-new-syntax/TestObjCNewSyntaxLiteral.py 157.36s: lldb-api :: types/TestLongTypesExpr.py 162.82s: lldb-api :: lang/cpp/namespace/TestNamespaceLookup.py 215.25s: lldb-api :: lang/objc/foundation/TestObjCMethods.py 239.57s: lldb-api :: lang/objc/hidden-ivars/TestHiddenIvars.py 248.39s: lldb-api :: tools/lldb-server/TestGdbRemoteThreadsInStopReply.py 257.38s: lldb-api :: api/multithreaded/TestMultithreaded.py 273.90s: lldb-api :: lang/cpp/enum_types/TestCPP11EnumTypes.py 356.27s: lldb-api :: tools/lldb-server/TestLldbGdbServer.py

Hide Details

Tests Times: -------------------------------------------------------------------------- [ Range ] :: [ Percentage ] :: [ Count ] -------------------------------------------------------------------------- [ 0s, 20s) :: [********************************** ] :: [1712/1969] [ 20s, 40s) :: [** ] :: [ 135/1969] [ 40s, 60s) :: [* ] :: [ 73/1969] [ 60s, 80s) :: [ ] :: [ 25/1969] [ 80s,100s) :: [ ] :: [ 7/1969] [100s,120s) :: [ ] :: [ 5/1969] [120s,140s) :: [ ] :: [ 2/1969] [140s,160s) :: [ ] :: [ 3/1969] [160s,180s) :: [ ] :: [ 1/1969] [180s,200s) :: [ ] :: [ 0/1969] [200s,220s) :: [ ] :: [ 1/1969] [220s,240s) :: [ ] :: [ 0/1969] [240s,260s) :: [ ] :: [ 2/1969] [260s,280s) :: [ ] :: [ 2/1969] [280s,300s) :: [ ] :: [ 0/1969] [300s,320s) :: [ ] :: [ 0/1969] [320s,340s) :: [ ] :: [ 0/1969] [340s,360s) :: [ ] :: [ 1/1969] Expected Passes : 1795 Expected Failures : 6 Unsupported Tests : 165 Unexpected Failures: 3 FAILED: tools/lldb/test/CMakeFiles/check-lldb-lit cd /Users/buildslave/jenkins/workspace/lldb-cmake-sanitized/lldb-build/tools/lldb/test && /usr/local/bin/python /Users/buildslave/jenkins/workspace/lldb-cmake-sanitized/lldb-build/./bin/llvm-lit -v --time-tests --shuffle --xunit-xml-output=/Users/buildslave/jenkins/workspace/lldb-cmake-sanitized/test/results.xml -v -j 4 --timeout 1200 /Users/buildslave/jenkins/workspace/lldb-cmake-sanitized/lldb-build/tools/lldb/test ninja: build stopped: subcommand failed. Command failed: Command '['/usr/bin/env', 'TERM=vt100', '/usr/local/bin/ninja', '-v', 'check-lldb']' returned non-zero exit status 1. Command: ['/usr/bin/env', 'TERM=vt100', '/usr/local/bin/ninja', '-v', 'check-lldb'] [Pipeline] } [Pipeline] // timeout [Pipeline] } [Pipeline] // stage [Pipeline] stage [Pipeline] { (Declarative: Post Actions) [Pipeline] scanForIssues [Clang (LLVM based)] Sleeping for 5 seconds due to JENKINS-32191... [Clang (LLVM based)] Parsing console log (workspace: '/Users/buildslave/jenkins/workspace/lldb-cmake-sanitized') [Clang (LLVM based)] Successfully parsed console log [Clang (LLVM based)] -> found 5 issues (skipped 0 duplicates) [Clang (LLVM based)] Post processing issues on 'green-dragon-23' with source code encoding 'UTF-8' [Clang (LLVM based)] Creating SCM blamer to obtain author and commit information for affected files [Clang (LLVM based)] Creating SCM miner to obtain statistics for affected repository files [Clang (LLVM based)] Resolving file names for all issues in source directory '/Users/buildslave/jenkins/workspace/lldb-cmake-sanitized' [Clang (LLVM based)] -> resolved paths in source directory (4 found, 0 not found) [Clang (LLVM based)] Resolving module names from module definitions (build.xml, pom.xml, or Manifest.mf files) [Clang (LLVM based)] -> resolved module names for 5 issues [Clang (LLVM based)] Resolving package names (or namespaces) by parsing the affected files [Clang (LLVM based)] -> resolved package names of 4 affected files [Clang (LLVM based)] No filter has been set, publishing all 5 issues [Clang (LLVM based)] Creating fingerprints for all affected code blocks to track issues over different builds [Clang (LLVM based)] -> created fingerprints for 5 issues (skipped 0 issues) [Clang (LLVM based)] Copying affected files to Jenkins' build folder '/Users/Shared/Jenkins/Home/jobs/lldb-cmake-sanitized/builds/1138/files-with-issues' [Clang (LLVM based)] -> 4 copied, 0 not in workspace, 0 not-found, 0 with I/O error [Pipeline] junit Recording test results [Pipeline] } [Pipeline] // stage [Pipeline] } [Pipeline] // withEnv [Pipeline] } [Pipeline] // node [Pipeline] End of Pipeline ERROR: script returned exit code 1 Finished: FAILURE