FailedConsole Output

Skipping 1,641 KB.. Full Log
eterPythonTests/PythonDataObjectsTest.TestPythonListManipulation (979 of 1972)
PASS: lldb-api :: lang/cpp/const_this/TestConstThis.py (980 of 1972)
PASS: lldb-unit :: UnwindAssembly/x86/./UnwindAssemblyx86Tests/Testx86AssemblyInspectionEngine.TestPopESI (981 of 1972)
PASS: lldb-api :: commands/watchpoints/watchpoint_commands/command/TestWatchpointCommandPython.py (982 of 1972)
PASS: lldb-api :: functionalities/data-formatter/nssetsynth/TestNSSetSynthetic.py (983 of 1972)
PASS: lldb-api :: commands/statistics/basic/TestStats.py (984 of 1972)
UNSUPPORTED: lldb-api :: lang/objc/bitfield_ivars/TestBitfieldIvars.py (985 of 1972)
PASS: lldb-shell :: Settings/TestSettingsSet.test (986 of 1972)
PASS: lldb-unit :: ObjectFile/Breakpad/./ObjectFileBreakpadTests/FileRecord.parse (987 of 1972)
PASS: lldb-unit :: Process/minidump/./LLDBMinidumpTests/MinidumpParserTest.MinidumpModuleOrder (988 of 1972)
PASS: lldb-shell :: Commands/command-script-import.test (989 of 1972)
PASS: lldb-api :: functionalities/thread/concurrent_events/TestConcurrentCrashWithWatchpointBreakpointSignal.py (990 of 1972)
PASS: lldb-unit :: Utility/./UtilityTests/LogChannelEnabledTest.LLDB_LOG_ERROR (991 of 1972)
PASS: lldb-unit :: Utility/./UtilityTests/BinaryStreamTest.PutSLEB128ThreeBytes (992 of 1972)
PASS: lldb-api :: lang/cpp/rvalue-references/TestRvalueReferences.py (993 of 1972)
PASS: lldb-unit :: Language/Highlighting/./HighlighterTests/HighlighterTest.DefaultHighlighter (994 of 1972)
PASS: lldb-api :: functionalities/breakpoint/breakpoint_hit_count/TestBreakpointHitCount.py (995 of 1972)
PASS: lldb-api :: functionalities/breakpoint/auto_continue/TestBreakpointAutoContinue.py (996 of 1972)
PASS: lldb-shell :: ObjectFile/Breakpad/breakpad-identification.test (997 of 1972)
PASS: lldb-api :: commands/expression/calculator_mode/TestCalculatorMode.py (998 of 1972)
PASS: lldb-unit :: Utility/./UtilityTests/SubsystemRAIITest.SubsystemWithErrorSuccess (999 of 1972)
PASS: lldb-shell :: Expr/TestIRMemoryMap.test (1000 of 1972)
UNSUPPORTED: lldb-api :: benchmarks/continue/TestBenchmarkContinue.py (1001 of 1972)
PASS: lldb-shell :: SymbolFile/DWARF/debug_aranges-empty-section.s (1002 of 1972)
PASS: lldb-api :: functionalities/data-formatter/data-formatter-synthtype/TestDataFormatterSynthType.py (1003 of 1972)
UNSUPPORTED: lldb-api :: benchmarks/turnaround/TestCompileRunToBreakpointTurnaround.py (1004 of 1972)
PASS: lldb-api :: python_api/value/linked_list/TestValueAPILinkedList.py (1005 of 1972)
PASS: lldb-api :: lang/cpp/enum_types/TestCPP11EnumTypes.py (1006 of 1972)
PASS: lldb-unit :: Utility/./UtilityTests/StreamTest.PutULEB128 (1007 of 1972)
XFAIL: lldb-shell :: Register/x86-mm-xmm-read.test (1008 of 1972)
PASS: lldb-shell :: Reproducer/TestDriverOptions.test (1009 of 1972)
PASS: lldb-unit :: Host/./HostTests/SocketTest.TCPListen0GetPort (1010 of 1972)
PASS: lldb-shell :: Commands/command-source.test (1011 of 1972)
UNSUPPORTED: lldb-api :: functionalities/tsan/basic/TestTsanBasic.py (1012 of 1972)
PASS: lldb-unit :: Language/Highlighting/./HighlighterTests/HighlighterTest.ClangTrailingBackslashMissingNewLine (1013 of 1972)
PASS: lldb-api :: functionalities/thread/concurrent_events/TestConcurrentBreakpointsDelayedBreakpointOneWatchpoint.py (1014 of 1972)
PASS: lldb-unit :: Symbol/./SymbolTests/TestTypeSystemClang.TestGetBasicTypeFromName (1015 of 1972)
PASS: lldb-api :: functionalities/gdb_remote_client/TestJLink6Armv7RegisterDefinition.py (1016 of 1972)
PASS: lldb-api :: functionalities/breakpoint/global_constructor/TestBreakpointInGlobalConstructor.py (1017 of 1972)
PASS: lldb-unit :: Utility/./UtilityTests/OptionsWithRawTest.EmptySuffix (1018 of 1972)
PASS: lldb-unit :: UnwindAssembly/x86/./UnwindAssemblyx86Tests/Testx86AssemblyInspectionEngine.TestPopR12 (1019 of 1972)
PASS: lldb-unit :: Utility/./UtilityTests/Flags.AllClear (1020 of 1972)
PASS: lldb-unit :: Utility/./UtilityTests/ProcessInstanceInfoMatch.Name (1021 of 1972)
PASS: lldb-api :: commands/command/nested_alias/TestNestedAlias.py (1022 of 1972)
PASS: lldb-api :: types/TestLongTypes.py (1023 of 1972)
PASS: lldb-unit :: Utility/./UtilityTests/StringListTest.InsertStringAtIndexEnd (1024 of 1972)
PASS: lldb-unit :: UnwindAssembly/x86/./UnwindAssemblyx86Tests/Testx86AssemblyInspectionEngine.TestPushRBX (1025 of 1972)
PASS: lldb-unit :: Utility/./UtilityTests/BinaryStreamTest.PutSLEB128FourBytes (1026 of 1972)
PASS: lldb-unit :: Utility/./UtilityTests/StringListTest.CopyListSingle (1027 of 1972)
PASS: lldb-api :: functionalities/thread/concurrent_events/TestConcurrentTwoBreakpointThreads.py (1028 of 1972)
PASS: lldb-api :: functionalities/gdb_remote_client/TestPlatformClient.py (1029 of 1972)
PASS: lldb-api :: python_api/exprpath_synthetic/TestExprPathSynthetic.py (1030 of 1972)
PASS: lldb-unit :: Language/Highlighting/./HighlighterTests/HighlighterTest.ClangCursorOutOfBounds (1031 of 1972)
PASS: lldb-unit :: Core/./LLDBCoreTests/RichManglingContextTest.IPDRealloc (1032 of 1972)
PASS: lldb-api :: functionalities/gdb_remote_client/TestNoWatchpointSupportInfo.py (1033 of 1972)
PASS: lldb-unit :: Utility/./UtilityTests/LogChannelTest.Enable (1034 of 1972)
PASS: lldb-api :: lang/cpp/gmodules/TestWithModuleDebugging.py (1035 of 1972)
PASS: lldb-unit :: Process/minidump/./LLDBMinidumpTests/MinidumpParserTest.GetLinuxProcStatus_no_stream (1036 of 1972)
PASS: lldb-unit :: Utility/./UtilityTests/StreamTest.PutRawBytesToBigEndian (1037 of 1972)
PASS: lldb-api :: lang/objc/objc-ivar-protocols/TestIvarProtocols.py (1038 of 1972)
UNSUPPORTED: lldb-api :: functionalities/thread/thread_specific_break_plus_condition/TestThreadSpecificBpPlusCondition.py (1039 of 1972)
UNSUPPORTED: lldb-shell :: Watchpoint/netbsd-nouserdbregs.test (1040 of 1972)
UNSUPPORTED: lldb-api :: tools/lldb-server/libraries-svr4/TestGdbRemoteLibrariesSvr4Support.py (1041 of 1972)
PASS: lldb-unit :: Utility/./UtilityTests/StreamTest.PutNHex8 (1042 of 1972)
UNSUPPORTED: lldb-api :: functionalities/darwin_log/filter/exact_match/message/TestDarwinLogFilterMatchMessage.py (1043 of 1972)
PASS: lldb-unit :: Host/./HostTests/MainLoopTest.ReadObject (1044 of 1972)
PASS: lldb-api :: commands/expression/call-function/TestCallBuiltinFunction.py (1045 of 1972)
PASS: lldb-api :: functionalities/tail_call_frames/disambiguate_tail_call_seq/TestDisambiguateTailCallSeq.py (1046 of 1972)
PASS: lldb-unit :: SymbolFile/DWARF/./SymbolFileDWARFTests/SymbolFileDWARFTests.TestAbbrevInvalidNULLTag (1047 of 1972)
PASS: lldb-unit :: Utility/./UtilityTests/RangeTest.NotEqualInvalid (1048 of 1972)
PASS: lldb-api :: functionalities/data-formatter/data-formatter-synth/TestDataFormatterSynth.py (1049 of 1972)
PASS: lldb-unit :: Utility/./UtilityTests/UserIDResolver.GetGroupName (1050 of 1972)
UNSUPPORTED: lldb-api :: functionalities/darwin_log/filter/exact_match/activity-chain/TestDarwinLogFilterMatchActivityChain.py (1051 of 1972)
PASS: lldb-unit :: Process/minidump/./LLDBMinidumpTests/MinidumpParserTest.FindMemoryRange (1052 of 1972)
PASS: lldb-unit :: Utility/./UtilityTests/StringExtractorTest.GetNameColonValueSuccess (1053 of 1972)
PASS: lldb-unit :: Utility/./UtilityTests/StringListTest.ShiftStdString (1054 of 1972)
PASS: lldb-api :: functionalities/thread/crash_during_step/TestCrashDuringStep.py (1055 of 1972)
PASS: lldb-api :: commands/source/info/TestSourceInfo.py (1056 of 1972)
PASS: lldb-api :: macosx/duplicate-archive-members/TestDuplicateMembers.py (1057 of 1972)
PASS: lldb-unit :: Utility/./UtilityTests/ArgsTest.StringListConstructor (1058 of 1972)
PASS: lldb-api :: commands/expression/deleting-implicit-copy-constructor/TestDeletingImplicitCopyConstructor.py (1059 of 1972)
PASS: lldb-api :: api/multithreaded/TestMultithreaded.py (1060 of 1972)
PASS: lldb-api :: tools/lldb-server/TestGdbRemoteThreadsInStopReply.py (1061 of 1972)
PASS: lldb-unit :: Target/./TargetTests/MCBasedABI.MapRegisterName (1062 of 1972)
PASS: lldb-unit :: Utility/./UtilityTests/RangeTest.SetRangeBase (1063 of 1972)
PASS: lldb-shell :: Settings/TestFrameFormatNoColor.test (1064 of 1972)
PASS: lldb-unit :: Utility/./UtilityTests/StreamTeeTest.Constructor1Stream (1065 of 1972)
PASS: lldb-unit :: Utility/./UtilityTests/StreamTest.ShiftOperatorChars (1066 of 1972)
PASS: lldb-api :: functionalities/data-formatter/data-formatter-enum-format/TestDataFormatterEnumFormat.py (1067 of 1972)
PASS: lldb-api :: lang/cpp/modules-import/TestCXXModulesImport.py (1068 of 1972)
PASS: lldb-api :: commands/gui/invalid-args/TestInvalidArgsGui.py (1069 of 1972)
PASS: lldb-unit :: UnwindAssembly/x86/./UnwindAssemblyx86Tests/Testx86AssemblyInspectionEngine.TestPopR13 (1070 of 1972)
PASS: lldb-unit :: UnwindAssembly/x86/./UnwindAssemblyx86Tests/Testx86AssemblyInspectionEngine.TestPopRBPWithREX (1071 of 1972)
PASS: lldb-shell :: ObjectFile/ELF/PT_LOAD-overlap-section.yaml (1072 of 1972)
PASS: lldb-unit :: SymbolFile/DWARF/./SymbolFileDWARFTests/SymbolFileDWARFTests.TestAbbrevOutOfOrder (1073 of 1972)
PASS: lldb-api :: commands/register/register/register_command/TestRegisters.py (1074 of 1972)
UNSUPPORTED: lldb-shell :: Register/x86-64-gp-write.test (1075 of 1972)
PASS: lldb-api :: functionalities/step-avoids-no-debug/TestStepNoDebug.py (1076 of 1972)
PASS: lldb-unit :: Utility/./UtilityTests/BinaryStreamTest.PutULEB128Zero (1077 of 1972)
PASS: lldb-unit :: Utility/./UtilityTests/StatusTest.ErrorConversion (1078 of 1972)
PASS: lldb-shell :: SymbolFile/DWARF/debug-line-basic.s (1079 of 1972)
PASS: lldb-unit :: Utility/./UtilityTests/RangeTest.NotEqual (1080 of 1972)
PASS: lldb-api :: functionalities/target-new-solib-notifications/TestModuleLoadedNotifys.py (1081 of 1972)
PASS: lldb-unit :: Process/gdb-remote/./ProcessGdbRemoteTests/GDBRemoteCommunicationClientTest.WriteRegisterNoSuffix (1082 of 1972)
PASS: lldb-api :: lang/c/strings/TestCStrings.py (1083 of 1972)
PASS: lldb-unit :: Utility/./UtilityTests/FileSpecTest.IsRelative (1084 of 1972)
PASS: lldb-unit :: Interpreter/./InterpreterTests/OptionArgParserTest.toBoolean (1085 of 1972)
PASS: lldb-api :: commands/expression/result_numbering/TestResultNumbering.py (1086 of 1972)
PASS: lldb-unit :: Utility/./UtilityTests/RecordReplayTest.InstrumentedFooSameThis (1087 of 1972)
PASS: lldb-api :: lang/cpp/unsigned_types/TestUnsignedTypes.py (1088 of 1972)
PASS: lldb-unit :: Utility/./UtilityTests/ScalarTest.GetValue (1089 of 1972)
PASS: lldb-unit :: Expression/./ExpressionTests/DiagnosticManagerTest.AppendMessageAttachToLastDiag (1090 of 1972)
PASS: lldb-api :: lang/cpp/chained-calls/TestCppChainedCalls.py (1091 of 1972)
PASS: lldb-shell :: ObjectFile/ELF/PT_TLS-overlap-PT_LOAD.yaml (1092 of 1972)
UNSUPPORTED: lldb-shell :: Register/x86-ymm-read.test (1093 of 1972)
PASS: lldb-unit :: Utility/./UtilityTests/BinaryStreamTest.PutULEB128OneByte (1094 of 1972)
PASS: lldb-shell :: ScriptInterpreter/None/none.test (1095 of 1972)
PASS: lldb-shell :: ObjectFile/ELF/base-address.yaml (1096 of 1972)
PASS: lldb-api :: commands/expression/invalid-args/TestInvalidArgsExpression.py (1097 of 1972)
PASS: lldb-api :: functionalities/data-formatter/ptr_ref_typedef/TestPtrRef2Typedef.py (1098 of 1972)
PASS: lldb-unit :: Utility/./UtilityTests/ProcessInfoTest.Constructor (1099 of 1972)
PASS: lldb-shell :: SymbolFile/Breakpad/line-table-missing-file.test (1100 of 1972)
UNSUPPORTED: lldb-api :: tools/lldb-server/TestGdbRemoteModuleInfo.py (1101 of 1972)
PASS: lldb-api :: lang/cpp/type_lookup/TestCppTypeLookup.py (1102 of 1972)
PASS: lldb-unit :: UnwindAssembly/x86/./UnwindAssemblyx86Tests/Testx86AssemblyInspectionEngine.TestSimplei386ugmented (1103 of 1972)
PASS: lldb-unit :: Utility/./UtilityTests/DataExtractorTest.GetCStrUnterminated (1104 of 1972)
PASS: lldb-unit :: Language/Highlighting/./HighlighterTests/HighlighterTest.DefaultHighlighterWithCursorOutOfBounds (1105 of 1972)
PASS: lldb-api :: lang/objc/objc-super/TestObjCSuper.py (1106 of 1972)
PASS: lldb-api :: functionalities/avoids-fd-leak/TestFdLeak.py (1107 of 1972)
PASS: lldb-unit :: SymbolFile/DWARF/./SymbolFileDWARFTests/SymbolFileDWARFTests.TestAbbrevNullAttrValidForm (1108 of 1972)
PASS: lldb-unit :: Utility/./UtilityTests/StreamTeeTest.SetStreamAtIndexOverwrite (1109 of 1972)
PASS: lldb-shell :: BuildScript/compiler-full-path.test (1110 of 1972)
PASS: lldb-shell :: SymbolFile/NativePDB/break-by-line.cpp (1111 of 1972)
PASS: lldb-unit :: Utility/./UtilityTests/StreamTest.AddressPrefix (1112 of 1972)
XFAIL: lldb-shell :: Unwind/prefer-debug-over-eh-frame.test (1113 of 1972)
PASS: lldb-api :: functionalities/thread/concurrent_events/TestConcurrentWatchpointDelayWatchpointOneBreakpoint.py (1114 of 1972)
PASS: lldb-api :: functionalities/gdb_remote_client/TestNestedRegDefinitions.py (1115 of 1972)
PASS: lldb-unit :: Process/minidump/./LLDBMinidumpTests/MinidumpParserTest.GetMemoryRegionInfo (1116 of 1972)
UNSUPPORTED: lldb-api :: commands/target/auto-install-main-executable/TestAutoInstallMainExecutable.py (1117 of 1972)
PASS: lldb-unit :: Utility/./UtilityTests/UriParserTest.TypicalPortPath (1118 of 1972)
PASS: lldb-unit :: Host/./HostTests/NativeProcessProtocolTest.SetBreakpointFailWrite (1119 of 1972)
PASS: lldb-unit :: Utility/./UtilityTests/RecordReplayTest.InstrumentedFoo (1120 of 1972)
PASS: lldb-api :: tools/lldb-server/TestGdbRemote_vCont.py (1121 of 1972)
PASS: lldb-api :: commands/expression/dollar-in-variable/TestDollarInVariable.py (1122 of 1972)
PASS: lldb-unit :: Utility/./UtilityTests/TimeoutTest.Format (1123 of 1972)
UNSUPPORTED: lldb-shell :: SymbolFile/PDB/variables-locations.test (1124 of 1972)
PASS: lldb-unit :: Utility/./UtilityTests/FileSpecTest.GetPath (1125 of 1972)
PASS: lldb-unit :: UnwindAssembly/x86/./UnwindAssemblyx86Tests/Testx86AssemblyInspectionEngine.TestPushEBX (1126 of 1972)
PASS: lldb-unit :: Utility/./UtilityTests/StringExtractorTest.GetHexU8_Extra_NoEof (1127 of 1972)
PASS: lldb-api :: functionalities/data-formatter/data-formatter-advanced/TestDataFormatterAdv.py (1128 of 1972)
PASS: lldb-unit :: Utility/./UtilityTests/RangeTest.DoesIntersect (1129 of 1972)
PASS: lldb-api :: arm/emulation/TestEmulations.py (1130 of 1972)
PASS: lldb-unit :: Host/./HostTests/SocketTest.DomainListenConnectAccept (1131 of 1972)
PASS: lldb-unit :: Utility/./UtilityTests/StringListTest.InsertStringAtIndexOutOfBounds (1132 of 1972)
PASS: lldb-unit :: Utility/./UtilityTests/FileSpecTest.Equal (1133 of 1972)
PASS: lldb-shell :: SymbolFile/DWARF/clang-ast-from-dwarf-objc-property.m (1134 of 1972)
PASS: lldb-unit :: Utility/./UtilityTests/StreamTest.AddressNoSuffix (1135 of 1972)
PASS: lldb-api :: functionalities/data-formatter/data-formatter-stl/libcxx/string/TestDataFormatterLibcxxString.py (1136 of 1972)
PASS: lldb-api :: commands/log/basic/TestLogging.py (1137 of 1972)
PASS: lldb-api :: functionalities/history/TestHistoryRecall.py (1138 of 1972)
PASS: lldb-api :: commands/process/attach-resume/TestAttachResume.py (1139 of 1972)
PASS: lldb-unit :: debugserver/./debugserverTests/RNBSocket.LoopBackListenIPv6 (1140 of 1972)
PASS: lldb-api :: lang/mixed/TestMixedLanguages.py (1141 of 1972)
PASS: lldb-unit :: Utility/./UtilityTests/RangeTest.ContainsAddrInvalid (1142 of 1972)
PASS: lldb-api :: functionalities/breakpoint/inlined_breakpoints/TestInlinedBreakpoints.py (1143 of 1972)
PASS: lldb-api :: commands/frame/diagnose/dereference-argument/TestDiagnoseDereferenceArgument.py (1144 of 1972)
PASS: lldb-unit :: Host/./HostTests/SocketTest.DomainGetConnectURI (1145 of 1972)
PASS: lldb-unit :: Utility/./UtilityTests/Flags.AnySet (1146 of 1972)
PASS: lldb-unit :: Utility/./UtilityTests/SerializationRountripTest.SerializeDeserializePodPointers (1147 of 1972)
PASS: lldb-api :: functionalities/data-formatter/data-formatter-stl/libcxx/atomic/TestLibCxxAtomic.py (1148 of 1972)
PASS: lldb-unit :: ObjectFile/PECOFF/./ObjectFilePECOFFTests/PECallFrameInfoTest.Chained_eh (1149 of 1972)
PASS: lldb-api :: functionalities/data-formatter/data-formatter-objc/TestDataFormatterObjCNSContainer.py (1150 of 1972)
PASS: lldb-unit :: ScriptInterpreter/Python/./ScriptInterpreterPythonTests/PythonDataObjectsTest.TestPythonTupleToStructuredList (1151 of 1972)
PASS: lldb-unit :: SymbolFile/NativePDB/./SymbolFileNativePDBTests/PDBFPOProgramToDWARFExpressionTests.UnresolvedRegisterReference (1152 of 1972)
PASS: lldb-api :: commands/frame/diagnose/bad-reference/TestBadReference.py (1153 of 1972)
PASS: lldb-shell :: Driver/LocalLLDBInit.test (1154 of 1972)
PASS: lldb-unit :: UnwindAssembly/x86/./UnwindAssemblyx86Tests/Testx86AssemblyInspectionEngine.TestPushESI (1155 of 1972)
PASS: lldb-api :: lang/cpp/unique-types/TestUniqueTypes.py (1156 of 1972)
PASS: lldb-unit :: Utility/./UtilityTests/StringListTest.LongestCommonPrefixEmpty (1157 of 1972)
PASS: lldb-unit :: ScriptInterpreter/Python/./ScriptInterpreterPythonTests/PythonDataObjectsTest.TestPythonIntegerToStructuredInteger (1158 of 1972)
PASS: lldb-shell :: Minidump/dump-all.test (1159 of 1972)
PASS: lldb-api :: commands/expression/ir-interpreter-phi-nodes/TestIRInterpreterPHINodes.py (1160 of 1972)
PASS: lldb-unit :: Utility/./UtilityTests/ArgsTest.TestSingleQuotedArgWithSpace (1161 of 1972)
PASS: lldb-shell :: Quit/TestQuitExitCodeHex0.test (1162 of 1972)
PASS: lldb-shell :: ObjectFile/MachO/lc_version_min.yaml (1163 of 1972)
PASS: lldb-unit :: Utility/./UtilityTests/StringListTest.AppendStringMove (1164 of 1972)
PASS: lldb-unit :: Utility/./UtilityTests/BinaryStreamTest.PutULEB128TwoBytes (1165 of 1972)
PASS: lldb-unit :: ScriptInterpreter/Python/./ScriptInterpreterPythonTests/PythonDataObjectsTest.TestTypeNameResolutionNoDot (1166 of 1972)
PASS: lldb-api :: lang/objc/modules-non-objc-target/TestObjCModulesNonObjCTarget.py (1167 of 1972)
PASS: lldb-api :: lang/objc/objc-foundation-dictionary-empty/TestNSDictionary0.py (1168 of 1972)
PASS: lldb-unit :: Symbol/./SymbolTests/TestClangASTImporter.RecordLayout (1169 of 1972)
PASS: lldb-unit :: Host/./HostTests/NativeProcessProtocolTest.ReadCStringFromMemory_CrossPageBoundary (1170 of 1972)
PASS: lldb-unit :: Utility/./UtilityTests/StreamTest.PutHex16ByteOrderLittle (1171 of 1972)
PASS: lldb-shell :: Breakpoint/debug_addrx.test (1172 of 1972)
PASS: lldb-unit :: Core/./LLDBCoreTests/MangledTest.ResultForValidName (1173 of 1972)
PASS: lldb-unit :: SymbolFile/DWARF/./SymbolFileDWARFTests/SymbolFileDWARFTests.TestAbilitiesForDWARF (1174 of 1972)
PASS: lldb-unit :: Utility/./UtilityTests/VMRange.Clear (1175 of 1972)
PASS: lldb-api :: lang/c/unions/TestUnionMembers.py (1176 of 1972)
PASS: lldb-api :: lang/objc/objc-new-syntax/TestObjCNewSyntaxLiteral.py (1177 of 1972)
PASS: lldb-api :: commands/command/script/import/rdar-12586188/TestRdar12586188.py (1178 of 1972)
PASS: lldb-unit :: Expression/./ExpressionTests/DiagnosticManagerTest.PutStringMultiple (1179 of 1972)
PASS: lldb-unit :: Utility/./UtilityTests/ScalarTest.Comparison (1180 of 1972)
PASS: lldb-shell :: Minidump/breakpad-symbols.test (1181 of 1972)
UNSUPPORTED: lldb-shell :: Register/x86-zmm-write.test (1182 of 1972)
PASS: lldb-api :: lang/cpp/signed_types/TestSignedTypes.py (1183 of 1972)
PASS: lldb-shell :: SymbolFile/NativePDB/tag-types.cpp (1184 of 1972)
PASS: lldb-api :: lang/objc/objc-static-method/TestObjCStaticMethod.py (1185 of 1972)
PASS: lldb-shell :: Register/x86-64-gp-read.test (1186 of 1972)
PASS: lldb-api :: functionalities/breakpoint/breakpoint_ids/TestBreakpointIDs.py (1187 of 1972)
PASS: lldb-api :: commands/expression/import-std-module/list-dbg-info-content/TestDbgInfoContentListFromStdModule.py (1188 of 1972)
PASS: lldb-unit :: Process/minidump/./LLDBMinidumpTests/MinidumpParserTest.GetMemoryRegionInfoFromMemoryList (1189 of 1972)
PASS: lldb-shell :: Breakpoint/debug_rnglist_basic.test (1190 of 1972)
PASS: lldb-unit :: Utility/./UtilityTests/ArgsTest.BareSingleQuote (1191 of 1972)
PASS: lldb-unit :: Utility/./UtilityTests/NameMatchesTest.Contains (1192 of 1972)
PASS: lldb-api :: commands/expression/unwind_expression/TestUnwindExpression.py (1193 of 1972)
PASS: lldb-api :: tools/lldb-vscode/attach/TestVSCode_attach.py (1194 of 1972)
UNSUPPORTED: lldb-shell :: SymbolFile/PDB/calling-conventions.test (1195 of 1972)
PASS: lldb-unit :: Utility/./UtilityTests/StringExtractorTest.GetHexU8_InvalidHex_NoEof (1196 of 1972)
PASS: lldb-shell :: Minidump/fb-dump.test (1197 of 1972)
PASS: lldb-api :: functionalities/return-value/TestReturnValue.py (1198 of 1972)
PASS: lldb-api :: functionalities/data-formatter/data-formatter-caching/TestDataFormatterCaching.py (1199 of 1972)
UNSUPPORTED: lldb-api :: lang/cpp/function-template-parameter-pack/TestFunctionTemplateParameterPack.py (1200 of 1972)
PASS: lldb-shell :: ObjectFile/ELF/avr-basic-info.yaml (1201 of 1972)
PASS: lldb-unit :: Process/gdb-remote/./ProcessGdbRemoteTests/GDBRemoteCommunicationClientTest.GetModulesInfo (1202 of 1972)
PASS: lldb-shell :: ObjectFile/PECOFF/symbol.yaml (1203 of 1972)
PASS: lldb-api :: functionalities/postmortem/minidump/TestMiniDump.py (1204 of 1972)
PASS: lldb-unit :: Interpreter/./InterpreterTests/CompletionTest.DirCompletionAbsolute (1205 of 1972)
PASS: lldb-api :: functionalities/step_scripted/TestStepScripted.py (1206 of 1972)
PASS: lldb-unit :: Utility/./UtilityTests/SerializationRountripTest.SerializeDeserializeCStringNull (1207 of 1972)
PASS: lldb-unit :: Process/gdb-remote/./ProcessGdbRemoteTests/GDBRemoteCommunicationClientTest.TestPacketSpeedJSON (1208 of 1972)
PASS: lldb-api :: functionalities/inferior-changed/TestInferiorChanged.py (1209 of 1972)
PASS: lldb-unit :: Utility/./UtilityTests/StringExtractorTest.GetHexU8_Extra (1210 of 1972)
PASS: lldb-shell :: ObjectFile/ELF/PT_LOAD-empty.yaml (1211 of 1972)
PASS: lldb-unit :: UnwindAssembly/x86/./UnwindAssemblyx86Tests/Testx86AssemblyInspectionEngine.TestStackRealignMSVC_i386 (1212 of 1972)
PASS: lldb-unit :: Utility/./UtilityTests/CompletionRequest.DuplicateFiltering (1213 of 1972)
PASS: lldb-shell :: Settings/TestModuleCacheSanity.test (1214 of 1972)
PASS: lldb-api :: functionalities/wrong_commands/TestWrongCommands.py (1215 of 1972)
PASS: lldb-api :: lang/cpp/bitfields/TestCppBitfields.py (1216 of 1972)
PASS: lldb-api :: functionalities/breakpoint/breakpoint_by_line_and_column/TestBreakpointByLineAndColumn.py (1217 of 1972)
PASS: lldb-unit :: ObjectFile/PECOFF/./ObjectFilePECOFFTests/PECallFrameInfoTest.Frame_reg_eh (1218 of 1972)
PASS: lldb-api :: python_api/file_handle/TestFileHandle.py (1219 of 1972)
PASS: lldb-unit :: Utility/./UtilityTests/StringExtractorTest.GetHexU8_Underflow (1220 of 1972)
PASS: lldb-unit :: Utility/./UtilityTests/StringExtractorTest.GetHexU8_Underflow_NoEof (1221 of 1972)
PASS: lldb-api :: commands/frame/diagnose/dereference-this/TestDiagnoseDereferenceThis.py (1222 of 1972)
UNSUPPORTED: lldb-api :: functionalities/thread/multi_break/TestMultipleBreakpoints.py (1223 of 1972)
PASS: lldb-unit :: Utility/./UtilityTests/ArgsTest.ReplaceArgumentAtIndexLonger (1224 of 1972)
PASS: lldb-shell :: Breakpoint/debug_rnglist_rlestartend.test (1225 of 1972)
PASS: lldb-unit :: Utility/./UtilityTests/RangeTest.Clear (1226 of 1972)
PASS: lldb-api :: macosx/universal/TestUniversal.py (1227 of 1972)
PASS: lldb-unit :: Utility/./UtilityTests/ArgsTest.TestQuotedTrailingBackslash (1228 of 1972)
PASS: lldb-unit :: SymbolFile/NativePDB/./SymbolFileNativePDBTests/PDBFPOProgramToDWARFExpressionTests.UnresolvedDependentCyclicRegisterAssignmentReference (1229 of 1972)
PASS: lldb-api :: lang/cpp/template-function/TestTemplateFunctions.py (1230 of 1972)
PASS: lldb-api :: commands/expression/import-std-module/stack/TestStackFromStdModule.py (1231 of 1972)
UNSUPPORTED: lldb-api :: linux/thread/create_during_instruction_step/TestCreateDuringInstructionStep.py (1232 of 1972)
UNSUPPORTED: lldb-shell :: SymbolFile/PDB/function-level-linking.test (1233 of 1972)
PASS: lldb-api :: lang/c/global_variables/TestGlobalVariables.py (1234 of 1972)
PASS: lldb-api :: functionalities/data-formatter/var-in-aggregate-misuse/TestVarInAggregateMisuse.py (1235 of 1972)
PASS: lldb-unit :: Utility/./UtilityTests/StringListTest.ForRange (1236 of 1972)
PASS: lldb-api :: commands/process/attach/attach_denied/TestAttachDenied.py (1237 of 1972)
PASS: lldb-api :: python_api/interpreter/TestRunCommandInterpreterAPI.py (1238 of 1972)
PASS: lldb-unit :: Process/gdb-remote/./ProcessGdbRemoteTests/GDBRemoteCommunicationClientTest.SyncThreadState (1239 of 1972)
PASS: lldb-unit :: Host/./HostTests/FileSystemTest.GetPermissions (1240 of 1972)
PASS: lldb-unit :: Utility/./UtilityTests/StreamTest.ShiftOperatorStrings (1241 of 1972)
PASS: lldb-api :: functionalities/load_using_paths/TestLoadUsingPaths.py (1242 of 1972)
PASS: lldb-shell :: SymbolFile/DWARF/dwarf5_locations.s (1243 of 1972)
PASS: lldb-api :: lang/cpp/function_refs/TestFunctionRefs.py (1244 of 1972)
PASS: lldb-unit :: Utility/./UtilityTests/LogChannelTest.EnableOptions (1245 of 1972)
PASS: lldb-unit :: Process/minidump/./LLDBMinidumpTests/MinidumpParserTest.GetPid (1246 of 1972)
PASS: lldb-unit :: Utility/./UtilityTests/StreamTest.PutMaxHex64ByteOrderBig (1247 of 1972)
PASS: lldb-shell :: Settings/TestFrameFormatMangling.test (1248 of 1972)
UNSUPPORTED: lldb-shell :: Register/aarch64-fp-read.test (1249 of 1972)
UNSUPPORTED: lldb-api :: commands/register/register/intel_xtended_registers/TestMPXRegisters.py (1250 of 1972)
PASS: lldb-api :: functionalities/breakpoint/breakpoint_command/TestRegexpBreakCommand.py (1251 of 1972)
PASS: lldb-api :: commands/expression/import-std-module/empty-module/TestEmptyStdModule.py (1252 of 1972)
PASS: lldb-api :: commands/expression/import-std-module/no-std-module/TestMissingStdModule.py (1253 of 1972)
PASS: lldb-api :: lang/c/array_types/TestArrayTypes.py (1254 of 1972)
PASS: lldb-api :: macosx/queues/TestQueues.py (1255 of 1972)
PASS: lldb-unit :: Host/./HostTests/NativeProcessProtocolTest.SetBreakpointFailVerify (1256 of 1972)
PASS: lldb-api :: functionalities/breakpoint/breakpoint_ignore_count/TestBreakpointIgnoreCount.py (1257 of 1972)
PASS: lldb-unit :: Utility/./UtilityTests/StringListTest.JoinEmpty (1258 of 1972)
UNSUPPORTED: lldb-api :: tools/lldb-server/thread-name/TestGdbRemoteThreadName.py (1259 of 1972)
PASS: lldb-api :: functionalities/data-formatter/data-formatter-objc/TestDataFormatterObjCPlain.py (1260 of 1972)
PASS: lldb-api :: tools/lldb-server/TestGdbRemoteSingleStep.py (1261 of 1972)
PASS: lldb-api :: lang/cpp/accelerator-table/TestCPPAccelerator.py (1262 of 1972)
PASS: lldb-unit :: Utility/./UtilityTests/AnsiTerminal.Twice (1263 of 1972)
PASS: lldb-api :: functionalities/data-formatter/ostypeformatting/TestFormattersOsType.py (1264 of 1972)
PASS: lldb-unit :: Target/./TargetTests/ExecutionContextTest.GetByteOrderTarget (1265 of 1972)
UNSUPPORTED: lldb-api :: functionalities/process_save_core/TestProcessSaveCore.py (1266 of 1972)
PASS: lldb-api :: lang/cpp/this/TestCPPThis.py (1267 of 1972)
UNSUPPORTED: lldb-shell :: Register/x86-64-zmm-write.test (1268 of 1972)
UNSUPPORTED: lldb-shell :: SymbolFile/NativePDB/ast-functions-msvc.cpp (1269 of 1972)
PASS: lldb-shell :: ObjectFile/wasm/stripped-debug-sections.yaml (1270 of 1972)
PASS: lldb-unit :: Utility/./UtilityTests/ArgsTest.EscapeLLDBCommandArgument (1271 of 1972)
PASS: lldb-unit :: Utility/./UtilityTests/Flags.Clear (1272 of 1972)
PASS: lldb-api :: functionalities/tail_call_frames/thread_step_out_or_return/TestSteppingOutWithArtificialFrames.py (1273 of 1972)
PASS: lldb-unit :: SymbolFile/NativePDB/./SymbolFileNativePDBTests/PDBFPOProgramToDWARFExpressionTests.DependencyChain (1274 of 1972)
PASS: lldb-api :: functionalities/thread/concurrent_events/TestConcurrentWatchBreak.py (1275 of 1972)
PASS: lldb-shell :: ObjectFile/ELF/gnu-debuglink.yaml (1276 of 1972)
PASS: lldb-shell :: ObjectFile/ELF/PT_LOAD-overlap-PT_TLS.yaml (1277 of 1972)
UNSUPPORTED: lldb-api :: functionalities/breakpoint/breakpoint_callback_command_source/TestBreakpointCallbackCommandSource.py (1278 of 1972)
PASS: lldb-unit :: Utility/./UtilityTests/ArchSpecTest.TripleComponentsWereSpecified (1279 of 1972)
PASS: lldb-unit :: ObjectFile/ELF/./ObjectFileELFTests/ObjectFileELFTest.GetSymtab_NoSymEntryPointArmAddressClass (1280 of 1972)
PASS: lldb-api :: lang/cpp/char8_t/TestCxxChar8_t.py (1281 of 1972)
PASS: lldb-unit :: UnwindAssembly/x86/./UnwindAssemblyx86Tests/Testx86AssemblyInspectionEngine.TestPopRBP (1282 of 1972)
PASS: lldb-unit :: Utility/./UtilityTests/StringLexerTest.PutBack (1283 of 1972)
UNSUPPORTED: lldb-api :: arm/breakpoint-thumb-codesection/TestBreakpointThumbCodesection.py (1284 of 1972)
UNSUPPORTED: lldb-shell :: Unwind/eh-frame-small-fde.test (1285 of 1972)
PASS: lldb-api :: functionalities/mtc/simple/TestMTCSimple.py (1286 of 1972)
PASS: lldb-unit :: Utility/./UtilityTests/VMRange.ContainsAddr (1287 of 1972)
PASS: lldb-unit :: Utility/./UtilityTests/RegularExpression.CopyAssignment (1288 of 1972)
PASS: lldb-unit :: Utility/./UtilityTests/NameMatchesTest.Equals (1289 of 1972)
PASS: lldb-api :: functionalities/data-formatter/vector-types/TestVectorTypesFormatting.py (1290 of 1972)
PASS: lldb-unit :: UnwindAssembly/x86/./UnwindAssemblyx86Tests/Testx86AssemblyInspectionEngine.TestSimple32bitFrameFunction (1291 of 1972)
UNSUPPORTED: lldb-shell :: SymbolFile/NativePDB/local-variables.cpp (1292 of 1972)
PASS: lldb-unit :: Utility/./UtilityTests/OptionsWithRawTest.LeadingSpaceArgs (1293 of 1972)
PASS: lldb-api :: functionalities/breakpoint/debugbreak/TestDebugBreak.py (1294 of 1972)
PASS: lldb-shell :: ObjectFile/ELF/short-build-id.yaml (1295 of 1972)
PASS: lldb-api :: lang/cpp/function-qualifiers/TestCppFunctionQualifiers.py (1296 of 1972)
UNSUPPORTED: lldb-api :: commands/watchpoints/hello_watchlocation/TestWatchLocation.py (1297 of 1972)
PASS: lldb-api :: commands/expression/import-std-module/vector-of-vectors/TestVectorOfVectorsFromStdModule.py (1298 of 1972)
PASS: lldb-api :: lang/cpp/unicode-literals/TestUnicodeLiterals.py (1299 of 1972)
PASS: lldb-unit :: Utility/./UtilityTests/DataExtractorTest.GetMaxS64 (1300 of 1972)
UNSUPPORTED: lldb-shell :: Register/x86-zmm-read.test (1301 of 1972)
PASS: lldb-api :: functionalities/gdb_remote_client/TestqOffsets.py (1302 of 1972)
UNSUPPORTED: lldb-shell :: Register/x86-64-xmm16-write.test (1303 of 1972)
PASS: lldb-api :: lang/cpp/incomplete-types/TestCppIncompleteTypes.py (1304 of 1972)
PASS: lldb-unit :: Utility/./UtilityTests/DataExtractorTest.GetMaxU64 (1305 of 1972)
UNSUPPORTED: lldb-api :: commands/expression/multiline-completion/TestMultilineCompletion.py (1306 of 1972)
PASS: lldb-api :: functionalities/thread/exit_during_break/TestExitDuringBreak.py (1307 of 1972)
PASS: lldb-api :: lang/objc/rdar-10967107/TestRdar10967107.py (1308 of 1972)
PASS: lldb-unit :: Utility/./UtilityTests/StringExtractorTest.GetU32LittleEndian (1309 of 1972)
PASS: lldb-unit :: ScriptInterpreter/Python/./ScriptInterpreterPythonTests/PythonDataObjectsTest.TestPythonInteger (1310 of 1972)
PASS: lldb-api :: commands/frame/language/TestGuessLanguage.py (1311 of 1972)
PASS: lldb-shell :: Expr/TestMultilineExpr.test (1312 of 1972)
PASS: lldb-shell :: SymbolFile/DWARF/gnu-style-compression.cpp (1313 of 1972)
PASS: lldb-unit :: Utility/./UtilityTests/StringExtractorTest.DecodeHexU8_Exact (1314 of 1972)
UNSUPPORTED: lldb-shell :: ScriptInterpreter/Lua/breakpoint_callback.test (1315 of 1972)
PASS: lldb-shell :: SymbolFile/NativePDB/ast-functions.cpp (1316 of 1972)
PASS: lldb-api :: lang/objc/foundation/TestObjCMethodsNSArray.py (1317 of 1972)
PASS: lldb-unit :: SymbolFile/DWARF/./SymbolFileDWARFTests/SymbolFileDWARFTests.ParseArangesNonzeroSegmentSize (1318 of 1972)
PASS: lldb-api :: commands/expression/import-std-module/forward_list/TestForwardListFromStdModule.py (1319 of 1972)
PASS: lldb-unit :: Process/gdb-remote/./ProcessGdbRemoteTests/GDBRemoteCommunicationClientTest.SendStopTracePacket (1320 of 1972)
PASS: lldb-api :: python_api/value/change_values/TestChangeValueAPI.py (1321 of 1972)
PASS: lldb-api :: python_api/watchpoint/TestWatchpointIter.py (1322 of 1972)
PASS: lldb-unit :: Utility/./UtilityTests/StringListTest.LongestCommonPrefixDuplicateElement (1323 of 1972)
PASS: lldb-api :: commands/command/script_alias/TestCommandScriptAlias.py (1324 of 1972)
PASS: lldb-api :: commands/expression/regression-access-function-template-in-record/TestRegressionAccessFunctionTemplateInRecord.py (1325 of 1972)
PASS: lldb-unit :: Breakpoint/./LLDBBreakpointTests/BreakpointIDTest.StringIsBreakpointName (1326 of 1972)
PASS: lldb-shell :: ObjectFile/PECOFF/basic-info-arm.yaml (1327 of 1972)
PASS: lldb-unit :: Utility/./UtilityTests/ArgsTest.TestInsertArg (1328 of 1972)
PASS: lldb-api :: functionalities/thread/concurrent_events/TestConcurrentWatchBreakDelay.py (1329 of 1972)
PASS: lldb-api :: commands/expression/test/TestExprs.py (1330 of 1972)
PASS: lldb-api :: commands/expression/anonymous-struct/TestCallUserAnonTypedef.py (1331 of 1972)
PASS: lldb-shell :: Driver/TestConvenienceVariables.test (1332 of 1972)
UNSUPPORTED: lldb-api :: functionalities/darwin_log/filter/exact_match/subsystem/TestDarwinLogFilterMatchSubsystem.py (1333 of 1972)
PASS: lldb-unit :: ScriptInterpreter/Python/./ScriptInterpreterPythonTests/PythonDataObjectsTest.TestPythonIntegerToStr (1334 of 1972)
PASS: lldb-unit :: SymbolFile/NativePDB/./SymbolFileNativePDBTests/PDBFPOProgramToDWARFExpressionTests.InvalidOpUnary (1335 of 1972)
PASS: lldb-api :: functionalities/postmortem/elf-core/thread_crash/TestLinuxCoreThreads.py (1336 of 1972)
PASS: lldb-unit :: Utility/./UtilityTests/StringExtractorTest.DecodeHexU8_Underflow2 (1337 of 1972)
PASS: lldb-shell :: Breakpoint/debug_rnglistx_rlex.test (1338 of 1972)
PASS: lldb-shell :: SymbolFile/DWARF/find-variable-dwo.cpp (1339 of 1972)
PASS: lldb-api :: functionalities/postmortem/minidump-new/TestMiniDumpUUID.py (1340 of 1972)
PASS: lldb-shell :: SymbolFile/DWARF/find-inline-method.s (1341 of 1972)
PASS: lldb-unit :: Target/./TargetTests/PathMappingListTest.RelativeTests (1342 of 1972)
PASS: lldb-api :: functionalities/data-formatter/data-formatter-objc/TestDataFormatterObjCNSData.py (1343 of 1972)
PASS: lldb-shell :: SymbolFile/NativePDB/ast-types.cpp (1344 of 1972)
PASS: lldb-unit :: Utility/./UtilityTests/StreamTest.PutStringAsRawHex8 (1345 of 1972)
PASS: lldb-api :: commands/watchpoints/watchpoint_on_vectors/TestValueOfVectorVariable.py (1346 of 1972)
PASS: lldb-unit :: Utility/./UtilityTests/StringListTest.Clear (1347 of 1972)
PASS: lldb-unit :: Symbol/./SymbolTests/DWARFCallFrameInfoTest.Basic_dwarf4 (1348 of 1972)
PASS: lldb-unit :: UnwindAssembly/x86/./UnwindAssemblyx86Tests/Testx86AssemblyInspectionEngine.TestPopEBX (1349 of 1972)
PASS: lldb-api :: lang/cpp/frame-var-anon-unions/TestFrameVariableAnonymousUnions.py (1350 of 1972)
PASS: lldb-unit :: Utility/./UtilityTests/StringExtractorTest.GetHexU8_Underflow2 (1351 of 1972)
UNSUPPORTED: lldb-api :: functionalities/darwin_log/filter/regex/category/TestDarwinLogFilterRegexCategory.py (1352 of 1972)
PASS: lldb-shell :: SymbolFile/DWARF/debug-types-basic.test (1353 of 1972)
PASS: lldb-unit :: ObjectFile/Breakpad/./ObjectFileBreakpadTests/FuncRecord.parse (1354 of 1972)
PASS: lldb-unit :: Utility/./UtilityTests/ConstStringTest.CompareConstString (1355 of 1972)
PASS: lldb-unit :: Process/minidump/./LLDBMinidumpTests/RegisterContextMinidump.ConvertMinidumpContext_x86_32 (1356 of 1972)
PASS: lldb-unit :: Process/gdb-remote/./ProcessGdbRemoteTests/GDBRemoteCommunicationClientTest.SendGetTraceConfigPacket (1357 of 1972)
PASS: lldb-api :: python_api/name_lookup/TestNameLookup.py (1358 of 1972)
PASS: lldb-unit :: Utility/./UtilityTests/RangeTest.ContainsAddr (1359 of 1972)
PASS: lldb-api :: functionalities/thread/exit_during_step/TestExitDuringStep.py (1360 of 1972)
PASS: lldb-unit :: Expression/./ExpressionTests/DiagnosticManagerTest.AppendMessageSubsequentDiags (1361 of 1972)
PASS: lldb-unit :: Utility/./UtilityTests/ScalarTest.RightShiftOperator (1362 of 1972)
PASS: lldb-unit :: Utility/./UtilityTests/StreamTest.AddressRangeSize (1363 of 1972)
PASS: lldb-api :: lang/cpp/class_static/TestStaticVariables.py (1364 of 1972)
PASS: lldb-unit :: Process/gdb-remote/./ProcessGdbRemoteTests/GDBRemoteClientBaseTest.SendContinueAndAsyncPacket (1365 of 1972)
PASS: lldb-api :: lang/cpp/lambdas/TestLambdas.py (1366 of 1972)
PASS: lldb-unit :: Utility/./UtilityTests/StringExtractorTest.DecodeHexU8_InvalidHex (1367 of 1972)
UNSUPPORTED: lldb-api :: commands/register/register/intel_xtended_registers/mpx_bound_violation/TestBoundViolation.py (1368 of 1972)
PASS: lldb-api :: functionalities/data-formatter/typedef_array/TestTypedefArray.py (1369 of 1972)
PASS: lldb-unit :: UnwindAssembly/x86/./UnwindAssemblyx86Tests/Testx86AssemblyInspectionEngine.Test64bitFramelessSmallStackFrame (1370 of 1972)
PASS: lldb-unit :: Symbol/./SymbolTests/PostfixExpression.ParseOneExpression (1371 of 1972)
UNSUPPORTED: lldb-shell :: SymbolFile/PDB/func-symbols.test (1372 of 1972)
PASS: lldb-api :: functionalities/data-formatter/data-formatter-stl/libcxx/optional/TestDataFormatterLibcxxOptional.py (1373 of 1972)
PASS: lldb-unit :: Utility/./UtilityTests/LogChannelEnabledTest.LogThread (1374 of 1972)
PASS: lldb-unit :: Host/./HostTests/FileSystemTest.Exists (1375 of 1972)
PASS: lldb-api :: lang/objc/objc-struct-argument/TestObjCStructArgument.py (1376 of 1972)
PASS: lldb-api :: functionalities/breakpoint/require_hw_breakpoints/TestRequireHWBreakpoints.py (1377 of 1972)
PASS: lldb-api :: functionalities/data-formatter/synthupdate/TestSyntheticFilterRecompute.py (1378 of 1972)
PASS: lldb-api :: functionalities/breakpoint/address_breakpoints/TestBadAddressBreakpoints.py (1379 of 1972)
PASS: lldb-unit :: Utility/./UtilityTests/StringListTest.InsertStringAtIndexMove (1380 of 1972)
PASS: lldb-unit :: Expression/./ExpressionTests/ClangExpressionDeclMapTest.TestUnknownIdentifierLookup (1381 of 1972)
PASS: lldb-api :: commands/version/TestVersion.py (1382 of 1972)
PASS: lldb-unit :: UnwindAssembly/x86/./UnwindAssemblyx86Tests/Testx86AssemblyInspectionEngine.TestPushRBPWithREX (1383 of 1972)
PASS: lldb-unit :: Utility/./UtilityTests/RecordReplayTest.InstrumentedBarPtr (1384 of 1972)
PASS: lldb-unit :: tools/lldb-server/tests/./LLDBServerTests/StandardStartupTest.TestStopReplyContainsThreadPcs (1385 of 1972)
PASS: lldb-unit :: Language/Highlighting/./HighlighterTests/HighlighterTest.ClangTrailingBackslashBeforeNewline (1386 of 1972)
PASS: lldb-unit :: Utility/./UtilityTests/StreamTest.AddressEmptyPrefix (1387 of 1972)
PASS: lldb-api :: python_api/sbtype_typeclass/TestSBTypeTypeClass.py (1388 of 1972)
PASS: lldb-unit :: Utility/./UtilityTests/ArchSpecTest.MergeFrom (1389 of 1972)
PASS: lldb-unit :: Utility/./UtilityTests/TimeoutTest.Construction (1390 of 1972)
PASS: lldb-unit :: Utility/./UtilityTests/ScalarTest.SetValueFromCString (1391 of 1972)
PASS: lldb-unit :: Utility/./UtilityTests/RangeTest.ContainsEndInclusiveInvalid (1392 of 1972)
UNSUPPORTED: lldb-shell :: SymbolFile/PDB/function-nested-block.test (1393 of 1972)
PASS: lldb-shell :: BuildScript/script-args.test (1394 of 1972)
UNSUPPORTED: lldb-shell :: Breakpoint/ppc64-localentry.test (1395 of 1972)
PASS: lldb-api :: functionalities/data-formatter/data-formatter-stl/libcxx/vbool/TestDataFormatterLibcxxVBool.py (1396 of 1972)
PASS: lldb-api :: functionalities/breakpoint/dummy_target_breakpoints/TestBreakpointsWithNoTargets.py (1397 of 1972)
PASS: lldb-api :: functionalities/gdb_remote_client/TestGDBRemoteLoad.py (1398 of 1972)
PASS: lldb-unit :: Host/./HostTests/NativeProcessProtocolTest.ReadCStringFromMemory (1399 of 1972)
PASS: lldb-unit :: Platform/./LLDBPlatformTests/PlatformDarwinTest.FindXcodeContentsDirectoryInPath (1400 of 1972)
PASS: lldb-unit :: Symbol/./SymbolTests/TestTypeSystemClang.TestConvertAccessTypeToAccessSpecifier (1401 of 1972)
PASS: lldb-api :: python_api/watchpoint/watchlocation/TestTargetWatchAddress.py (1402 of 1972)
PASS: lldb-unit :: Utility/./UtilityTests/StringListTest.AppendListCStringArray (1403 of 1972)
PASS: lldb-api :: functionalities/breakpoint/hardware_breakpoints/hardware_breakpoint_on_multiple_threads/TestHWBreakMultiThread.py (1404 of 1972)
PASS: lldb-shell :: SymbolFile/Breakpad/symtab.test (1405 of 1972)
PASS: lldb-unit :: Utility/./UtilityTests/StringLexerTest.Peek (1406 of 1972)
PASS: lldb-unit :: Process/gdb-remote/./ProcessGdbRemoteTests/GDBRemoteCommunicationClientTest.GetQOffsets (1407 of 1972)
PASS: lldb-api :: lang/objc/objc-baseclass-sbtype/TestObjCBaseClassSBType.py (1408 of 1972)
PASS: lldb-api :: commands/frame/diagnose/local-variable/TestLocalVariable.py (1409 of 1972)
UNSUPPORTED: lldb-api :: functionalities/darwin_log/filter/regex/activity/TestDarwinLogFilterRegexActivity.py (1410 of 1972)
PASS: lldb-unit :: Utility/./UtilityTests/FileSpecTest.EqualSeparator (1411 of 1972)
PASS: lldb-api :: commands/expression/import-std-module/vector-bool/TestVectorBoolFromStdModule.py (1412 of 1972)
PASS: lldb-unit :: Process/gdb-remote/./ProcessGdbRemoteTests/GDBRemoteCommunicationServerTest.SendErrorResponse_UnimplementedError (1413 of 1972)
UNSUPPORTED: lldb-api :: linux/mix-dwo-and-regular-objects/TestMixedDwarfBinary.py (1414 of 1972)
PASS: lldb-unit :: Process/minidump/./LLDBMinidumpTests/RegisterContextMinidump.ConvertMinidumpContext_x86_64 (1415 of 1972)
PASS: lldb-api :: functionalities/tail_call_frames/inlining_and_tail_calls/TestInliningAndTailCalls.py (1416 of 1972)
PASS: lldb-unit :: Host/./HostTests/FileSystemTest.GetByteSize (1417 of 1972)
PASS: lldb-unit :: ScriptInterpreter/Python/./ScriptInterpreterPythonTests/PythonDataObjectsTest.TestPythonCallableCheck (1418 of 1972)
PASS: lldb-api :: functionalities/abbreviation/TestAbbreviations.py (1419 of 1972)
PASS: lldb-api :: sanity/TestModuleCacheSanity.py (1420 of 1972)
PASS: lldb-api :: lang/cpp/diamond/TestDiamond.py (1421 of 1972)
PASS: lldb-unit :: Language/Highlighting/./HighlighterTests/HighlighterTest.ClangCursorPosAfterOtherToken (1422 of 1972)
PASS: lldb-api :: lang/c/tls_globals/TestTlsGlobals.py (1423 of 1972)
PASS: lldb-unit :: Utility/./UtilityTests/ProcessInstanceInfoList.Yaml (1424 of 1972)
PASS: lldb-shell :: SymbolFile/DWARF/find-qualified-variable.cpp (1425 of 1972)
PASS: lldb-api :: tools/lldb-server/TestLldbGdbServer.py (1426 of 1972)
PASS: lldb-api :: functionalities/load_unload/TestLoadUnload.py (1427 of 1972)
PASS: lldb-api :: lang/cpp/member-and-local-vars-with-same-name/TestMembersAndLocalsWithSameName.py (1428 of 1972)
PASS: lldb-unit :: Utility/./UtilityTests/DataExtractorTest.GetMaxU64_unchecked (1429 of 1972)
PASS: lldb-api :: commands/platform/basic/TestPlatformPython.py (1430 of 1972)
PASS: lldb-unit :: Utility/./UtilityTests/StreamTest.PutCharWhitespace (1431 of 1972)
PASS: lldb-shell :: Driver/TestCore.test (1432 of 1972)
PASS: lldb-api :: python_api/formatters/TestFormattersSBAPI.py (1433 of 1972)
PASS: lldb-unit :: Utility/./UtilityTests/TildeExpressionResolver.ResolveFullPath (1434 of 1972)
PASS: lldb-api :: lang/objc/objc_direct-methods/TestObjCDirectMethods.py (1435 of 1972)
PASS: lldb-api :: functionalities/breakpoint/comp_dir_symlink/TestCompDirSymLink.py (1436 of 1972)
PASS: lldb-unit :: Utility/./UtilityTests/UriParserTest.Minimal (1437 of 1972)
PASS: lldb-shell :: ObjectFile/PECOFF/export-dllfunc.yaml (1438 of 1972)
PASS: lldb-api :: commands/expression/import-std-module/deque-basic/TestDequeFromStdModule.py (1439 of 1972)
PASS: lldb-api :: python_api/breakpoint/TestBreakpointAPI.py (1440 of 1972)
PASS: lldb-shell :: Breakpoint/dummy-target.test (1441 of 1972)
PASS: lldb-api :: functionalities/type_completion/TestTypeCompletion.py (1442 of 1972)
PASS: lldb-shell :: Commands/command-disassemble-process.yaml (1443 of 1972)
PASS: lldb-unit :: UnwindAssembly/x86/./UnwindAssemblyx86Tests/Testx86AssemblyInspectionEngine.TestPushR13 (1444 of 1972)
PASS: lldb-unit :: Process/minidump/./LLDBMinidumpTests/MinidumpParserTest.GetMiscInfoWindows (1445 of 1972)
PASS: lldb-api :: commands/expression/top-level/TestTopLevelExprs.py (1446 of 1972)
PASS: lldb-unit :: Utility/./UtilityTests/VASprintfTest.BufferResize (1447 of 1972)
PASS: lldb-unit :: Symbol/./SymbolTests/TestClangASTImporter.CanImportInvalidType (1448 of 1972)
PASS: lldb-unit :: Utility/./UtilityTests/ProcessInstanceInfo.Yaml (1449 of 1972)
PASS: lldb-shell :: SymbolFile/Breakpad/unwind-via-raSearch.test (1450 of 1972)
PASS: lldb-unit :: Language/Highlighting/./HighlighterTests/HighlighterTest.ClangCommas (1451 of 1972)
PASS: lldb-shell :: Minidump/disassemble-no-module.yaml (1452 of 1972)
PASS: lldb-api :: functionalities/inferior-crashing/TestInferiorCrashingStep.py (1453 of 1972)
PASS: lldb-unit :: Core/./LLDBCoreTests/RichManglingContextTest.Basic (1454 of 1972)
PASS: lldb-unit :: Utility/./UtilityTests/ArgsTest.TestSingleArg (1455 of 1972)
PASS: lldb-unit :: Utility/./UtilityTests/RangeTest.SlideZero (1456 of 1972)
PASS: lldb-api :: terminal/TestSTTYBeforeAndAfter.py (1457 of 1972)
PASS: lldb-unit :: ScriptInterpreter/Python/./ScriptInterpreterPythonTests/PythonDataObjectsTest.TestPythonTupleInitializerList2 (1458 of 1972)
UNSUPPORTED: lldb-api :: functionalities/exec/TestExec.py (1459 of 1972)
PASS: lldb-unit :: Process/gdb-remote/./ProcessGdbRemoteTests/GDBRemoteCommunicationClientTest.SendStartTracePacket (1460 of 1972)
PASS: lldb-shell :: SymbolFile/Breakpad/unwind-via-stack-win-no-memory-info.yaml (1461 of 1972)
PASS: lldb-api :: lang/cpp/virtual-functions/TestCppVirtualFunctions.py (1462 of 1972)
PASS: lldb-unit :: Utility/./UtilityTests/CompletionRequest.TryCompleteCurrentArgBad (1463 of 1972)
PASS: lldb-api :: commands/platform/process/list/TestProcessList.py (1464 of 1972)
PASS: lldb-unit :: Utility/./UtilityTests/SerializationRountripTest.SerializeDeserializeObjectPointer (1465 of 1972)
PASS: lldb-api :: functionalities/data-formatter/data-formatter-ptr-to-array/TestPtrToArrayFormatting.py (1466 of 1972)
PASS: lldb-api :: macosx/indirect_symbol/TestIndirectSymbols.py (1467 of 1972)
PASS: lldb-unit :: Utility/./UtilityTests/SerializationRountripTest.SerializeDeserializeCStringArrayNullptrElem (1468 of 1972)
PASS: lldb-unit :: Utility/./UtilityTests/StreamTest.QuotedCString (1469 of 1972)
PASS: lldb-unit :: UnwindAssembly/x86/./UnwindAssemblyx86Tests/Testx86AssemblyInspectionEngine.TestStackRealign8BitDisp_i386 (1470 of 1972)
PASS: lldb-unit :: Utility/./UtilityTests/StringListTest.Join (1471 of 1972)
PASS: lldb-api :: functionalities/var_path/TestVarPath.py (1472 of 1972)
PASS: lldb-unit :: SymbolFile/NativePDB/./SymbolFileNativePDBTests/PDBFPOProgramToDWARFExpressionTests.SingleAssignmentRegisterRef (1473 of 1972)
PASS: lldb-api :: functionalities/signal/raise/TestRaise.py (1474 of 1972)
PASS: lldb-unit :: Utility/./UtilityTests/RangeDataVector.CustomSort (1475 of 1972)
PASS: lldb-api :: functionalities/float-display/TestFloatDisplay.py (1476 of 1972)
PASS: lldb-unit :: Utility/./UtilityTests/ArgsTest.TestUnknownEscape (1477 of 1972)
PASS: lldb-api :: functionalities/tail_call_frames/cross_dso/TestCrossDSOTailCalls.py (1478 of 1972)
PASS: lldb-unit :: ObjectFile/Breakpad/./ObjectFileBreakpadTests/LineRecord.parse (1479 of 1972)
PASS: lldb-api :: lang/cpp/operator-overload/TestOperatorOverload.py (1480 of 1972)
PASS: lldb-unit :: Expression/./ExpressionTests/DiagnosticManagerTest.GetStringMultiline (1481 of 1972)
PASS: lldb-unit :: Utility/./UtilityTests/UriParserTest.PortOverflow (1482 of 1972)
PASS: lldb-unit :: Utility/./UtilityTests/LogTest.Register (1483 of 1972)
PASS: lldb-api :: lang/c/shared_lib/TestSharedLib.py (1484 of 1972)
UNSUPPORTED: lldb-shell :: Register/x86-gp-write.test (1485 of 1972)
PASS: lldb-api :: commands/frame/var-scope/TestFrameVariableScope.py (1486 of 1972)
PASS: lldb-api :: tools/lldb-server/inferior-crash/TestGdbRemoteAbort.py (1487 of 1972)
UNSUPPORTED: lldb-api :: functionalities/asan/TestMemoryHistory.py (1488 of 1972)
PASS: lldb-shell :: SymbolFile/NativePDB/disassembly.cpp (1489 of 1972)
PASS: lldb-api :: functionalities/unwind/zeroth_frame/TestZerothFrame.py (1490 of 1972)
PASS: lldb-api :: python_api/objc_type/TestObjCType.py (1491 of 1972)
PASS: lldb-unit :: Utility/./UtilityTests/StringExtractorTest.GetHexBytesAvail_FullString (1492 of 1972)
PASS: lldb-api :: functionalities/data-formatter/parray/TestPrintArray.py (1493 of 1972)
PASS: lldb-unit :: Host/./HostTests/File.GetWaitableHandleFileno (1494 of 1972)
PASS: lldb-unit :: Utility/./UtilityTests/LogChannelTest.Disable (1495 of 1972)
PASS: lldb-unit :: ObjectFile/PECOFF/./ObjectFilePECOFFTests/PECallFrameInfoTest.Basic_eh (1496 of 1972)
PASS: lldb-api :: commands/watchpoints/hello_watchpoint/TestMyFirstWatchpoint.py (1497 of 1972)
PASS: lldb-api :: functionalities/breakpoint/scripted_bkpt/TestScriptedResolver.py (1498 of 1972)
UNSUPPORTED: lldb-api :: commands/expression/multiline-navigation/TestMultilineNavigation.py (1499 of 1972)
FAIL: lldb-api :: functionalities/ptr_refs/TestPtrRefs.py (1500 of 1972)
******************** TEST 'lldb-api :: functionalities/ptr_refs/TestPtrRefs.py' FAILED ********************
Script:
--
/usr/local/bin/python /Users/buildslave/jenkins/workspace/lldb-cmake-sanitized/llvm-project/lldb/test/API/dotest.py --arch x86_64 -s /Users/buildslave/jenkins/workspace/lldb-cmake-sanitized/lldb-build/lldb-test-traces -S nm -u CXXFLAGS -u CFLAGS --codesign-identity lldb_codesign --server /Users/buildslave/jenkins/workspace/lldb-cmake-sanitized/lldb-build/./bin/debugserver --arch x86_64 --build-dir /Users/buildslave/jenkins/workspace/lldb-cmake-sanitized/lldb-build/lldb-test-build.noindex -s=/Users/buildslave/jenkins/workspace/lldb-cmake-sanitized/test/logs -t --env TERM=vt100 --env LLVM_LIBS_DIR=/Users/buildslave/jenkins/workspace/lldb-cmake-sanitized/lldb-build/./lib --inferior-env ASAN_OPTIONS=detect_stack_use_after_return=1 --inferior-env DYLD_INSERT_LIBRARIES=/Users/buildslave/jenkins/workspace/lldb-cmake-sanitized/host-compiler/lib/clang/11.0.0/lib/darwin/libclang_rt.asan_osx_dynamic.dylib --build-dir /Users/buildslave/jenkins/workspace/lldb-cmake-sanitized/lldb-build/lldb-test-build.noindex --lldb-module-cache-dir /Users/buildslave/jenkins/workspace/lldb-cmake-sanitized/lldb-build/lldb-test-build.noindex/module-cache-lldb/lldb-api --clang-module-cache-dir /Users/buildslave/jenkins/workspace/lldb-cmake-sanitized/lldb-build/lldb-test-build.noindex/module-cache-clang/lldb-api --executable /Users/buildslave/jenkins/workspace/lldb-cmake-sanitized/lldb-build/./bin/lldb --compiler /Users/buildslave/jenkins/workspace/lldb-cmake-sanitized/lldb-build/./bin/clang --dsymutil /Users/buildslave/jenkins/workspace/lldb-cmake-sanitized/lldb-build/./bin/dsymutil --filecheck /Users/buildslave/jenkins/workspace/lldb-cmake-sanitized/lldb-build/./bin/FileCheck --lldb-libs-dir /Users/buildslave/jenkins/workspace/lldb-cmake-sanitized/lldb-build/./lib /Users/buildslave/jenkins/workspace/lldb-cmake-sanitized/llvm-project/lldb/test/API/functionalities/ptr_refs -p TestPtrRefs.py
--
Exit Code: 1

Hide Details

Command Output (stdout): -- lldb version 11.0.99 clang revision 92744f624783d92a07db25bc76e181b879f17e5b llvm revision 92744f624783d92a07db25bc76e181b879f17e5b "crashlog" and "save_crashlog" command installed, use the "--help" option for detailed help "malloc_info", "ptr_refs", "cstr_refs", "find_variable", and "objc_refs" commands have been installed, use the "--help" options on these commands for detailed help. LLDB library dir: /Users/buildslave/jenkins/workspace/lldb-cmake-sanitized/lldb-build/bin LLDB import library dir: /Users/buildslave/jenkins/workspace/lldb-cmake-sanitized/lldb-build/./lib libstdcxx tests will not be run because: Don't know how to build with libstdcxx on macosx Skipping following debug info categories: ['dwo'] 0x00007ffee4a45478: stack in frame #0 of thread #1: tid 0xf13a59 in variable at 0x7ffee4a45478: (const char *) my_ptr = 0x00006020000000b0 "hello" 0x00007ffee4a45410: stack (red zone)

Hide Details

-- Command Output (stderr): -- error: 'ptr_refs' is not a valid command. error: 'ptr_refs' is not a valid command.

Hide Details

Session logs for test failures/errors/unexpected successes will go into directory '/Users/buildslave/jenkins/workspace/lldb-cmake-sanitized/test/logs' Command invoked: /Users/buildslave/jenkins/workspace/lldb-cmake-sanitized/llvm-project/lldb/test/API/dotest.py --arch x86_64 -s /Users/buildslave/jenkins/workspace/lldb-cmake-sanitized/lldb-build/lldb-test-traces -S nm -u CXXFLAGS -u CFLAGS --codesign-identity lldb_codesign --server /Users/buildslave/jenkins/workspace/lldb-cmake-sanitized/lldb-build/./bin/debugserver --arch x86_64 --build-dir /Users/buildslave/jenkins/workspace/lldb-cmake-sanitized/lldb-build/lldb-test-build.noindex -s=/Users/buildslave/jenkins/workspace/lldb-cmake-sanitized/test/logs -t --env TERM=vt100 --env LLVM_LIBS_DIR=/Users/buildslave/jenkins/workspace/lldb-cmake-sanitized/lldb-build/./lib --inferior-env ASAN_OPTIONS=detect_stack_use_after_return=1 --inferior-env DYLD_INSERT_LIBRARIES=/Users/buildslave/jenkins/workspace/lldb-cmake-sanitized/host-compiler/lib/clang/11.0.0/lib/darwin/libclang_rt.asan_osx_dynamic.dylib --build-dir /Users/buildslave/jenkins/workspace/lldb-cmake-sanitized/lldb-build/lldb-test-build.noindex --lldb-module-cache-dir /Users/buildslave/jenkins/workspace/lldb-cmake-sanitized/lldb-build/lldb-test-build.noindex/module-cache-lldb/lldb-api --clang-module-cache-dir /Users/buildslave/jenkins/workspace/lldb-cmake-sanitized/lldb-build/lldb-test-build.noindex/module-cache-clang/lldb-api --executable /Users/buildslave/jenkins/workspace/lldb-cmake-sanitized/lldb-build/./bin/lldb --compiler /Users/buildslave/jenkins/workspace/lldb-cmake-sanitized/lldb-build/./bin/clang --dsymutil /Users/buildslave/jenkins/workspace/lldb-cmake-sanitized/lldb-build/./bin/dsymutil --filecheck /Users/buildslave/jenkins/workspace/lldb-cmake-sanitized/lldb-build/./bin/FileCheck --lldb-libs-dir /Users/buildslave/jenkins/workspace/lldb-cmake-sanitized/lldb-build/./lib /Users/buildslave/jenkins/workspace/lldb-cmake-sanitized/llvm-project/lldb/test/API/functionalities/ptr_refs -p TestPtrRefs.py Change dir to: /Users/buildslave/jenkins/workspace/lldb-cmake-sanitized/llvm-project/lldb/test/API/functionalities/ptr_refs runCmd: settings clear -all output:

Hide Details

runCmd: settings set symbols.enable-external-lookup false output:

Hide Details

runCmd: settings set target.auto-apply-fixits false output:

Hide Details

runCmd: settings set plugin.process.gdb-remote.packet-timeout 60 output:

Hide Details

runCmd: settings set symbols.clang-modules-cache-path "/Users/buildslave/jenkins/workspace/lldb-cmake-sanitized/lldb-build/lldb-test-build.noindex/module-cache-lldb/lldb-api" output:

Hide Details

runCmd: settings set use-color false output:

Hide Details

runCmd: setting set target.prefer-dynamic-value no-dynamic-values output:

Hide Details

runCmd: settings set target.env-vars ASAN_OPTIONS=detect_stack_use_after_return=1 DYLD_INSERT_LIBRARIES=/Users/buildslave/jenkins/workspace/lldb-cmake-sanitized/host-compiler/lib/clang/11.0.0/lib/darwin/libclang_rt.asan_osx_dynamic.dylib output:

Hide Details

runCmd: script import lldb.macosx.heap output: "crashlog" and "save_crashlog" command installed, use the "--help" option for detailed help "malloc_info", "ptr_refs", "cstr_refs", "find_variable", and "objc_refs" commands have been installed, use the "--help" options on these commands for detailed help.

Hide Details

Hide Details

runCmd: ptr_refs my_ptr output: 0x00007ffee4a45478: stack in frame #0 of thread #1: tid 0xf13a59 in variable at 0x7ffee4a45478: (const char *) my_ptr = 0x00006020000000b0 "hello" 0x00007ffee4a45410: stack (red zone)

Hide Details

Hide Details

Expecting sub string: malloc Not matched

Hide Details

FAIL: LLDB (/Users/buildslave/jenkins/workspace/lldb-cmake-sanitized/lldb-build/bin/clang-11-x86_64) :: test_ptr_refs_dsym (TestPtrRefs.TestPtrRefs) <bound method SBProcess.Kill of <lldb.SBProcess; proxy of <Swig Object of type 'lldb::SBProcess *' at 0x1228a78a0> >>: success

Hide Details

runCmd: settings clear -all output:

Hide Details

runCmd: settings set symbols.enable-external-lookup false output:

Hide Details

runCmd: settings set target.auto-apply-fixits false output:

Hide Details

runCmd: settings set plugin.process.gdb-remote.packet-timeout 60 output:

Hide Details

runCmd: settings set symbols.clang-modules-cache-path "/Users/buildslave/jenkins/workspace/lldb-cmake-sanitized/lldb-build/lldb-test-build.noindex/module-cache-lldb/lldb-api" output:

Hide Details

runCmd: settings set use-color false output:

Hide Details

runCmd: setting set target.prefer-dynamic-value no-dynamic-values output:

Hide Details

runCmd: settings set target.env-vars ASAN_OPTIONS=detect_stack_use_after_return=1 DYLD_INSERT_LIBRARIES=/Users/buildslave/jenkins/workspace/lldb-cmake-sanitized/host-compiler/lib/clang/11.0.0/lib/darwin/libclang_rt.asan_osx_dynamic.dylib output:

Hide Details

runCmd: script import lldb.macosx.heap output:

Hide Details

runCmd: ptr_refs my_ptr runCmd failed! error: 'ptr_refs' is not a valid command.

Hide Details

Hide Details

XFAIL: LLDB (/Users/buildslave/jenkins/workspace/lldb-cmake-sanitized/lldb-build/bin/clang-11-x86_64) :: test_ptr_refs_dwarf (TestPtrRefs.TestPtrRefs) <bound method SBProcess.Kill of <lldb.SBProcess; proxy of <Swig Object of type 'lldb::SBProcess *' at 0x10b5d2990> >>: success

Hide Details

UNSUPPORTED: LLDB (/Users/buildslave/jenkins/workspace/lldb-cmake-sanitized/lldb-build/bin/clang-11-x86_64) :: test_ptr_refs_dwo (TestPtrRefs.TestPtrRefs) (test case does not fall in any category of interest for this run) runCmd: settings clear -all output:

Hide Details

runCmd: settings set symbols.enable-external-lookup false output:

Hide Details

runCmd: settings set target.auto-apply-fixits false output:

Hide Details

runCmd: settings set plugin.process.gdb-remote.packet-timeout 60 output:

Hide Details

runCmd: settings set symbols.clang-modules-cache-path "/Users/buildslave/jenkins/workspace/lldb-cmake-sanitized/lldb-build/lldb-test-build.noindex/module-cache-lldb/lldb-api" output:

Hide Details

runCmd: settings set use-color false output:

Hide Details

runCmd: setting set target.prefer-dynamic-value no-dynamic-values output:

Hide Details

runCmd: settings set target.env-vars ASAN_OPTIONS=detect_stack_use_after_return=1 DYLD_INSERT_LIBRARIES=/Users/buildslave/jenkins/workspace/lldb-cmake-sanitized/host-compiler/lib/clang/11.0.0/lib/darwin/libclang_rt.asan_osx_dynamic.dylib output:

Hide Details

runCmd: script import lldb.macosx.heap output:

Hide Details

runCmd: ptr_refs my_ptr runCmd failed! error: 'ptr_refs' is not a valid command.

Hide Details

Hide Details

XFAIL: LLDB (/Users/buildslave/jenkins/workspace/lldb-cmake-sanitized/lldb-build/bin/clang-11-x86_64) :: test_ptr_refs_gmodules (TestPtrRefs.TestPtrRefs) <bound method SBProcess.Kill of <lldb.SBProcess; proxy of <Swig Object of type 'lldb::SBProcess *' at 0x1228a71e0> >>: success

Hide Details

Restore dir to: /Users/buildslave/jenkins/workspace/lldb-cmake-sanitized/lldb-build/tools/lldb/test ====================================================================== FAIL: test_ptr_refs_dsym (TestPtrRefs.TestPtrRefs) Test format string functionality. ---------------------------------------------------------------------- Traceback (most recent call last): File "/Users/buildslave/jenkins/workspace/lldb-cmake-sanitized/llvm-project/lldb/packages/Python/lldbsuite/test/lldbtest.py", line 1751, in test_method return attrvalue(self) File "/Users/buildslave/jenkins/workspace/lldb-cmake-sanitized/llvm-project/lldb/packages/Python/lldbsuite/test/decorators.py", line 110, in wrapper func(*args, **kwargs) File "/Users/buildslave/jenkins/workspace/lldb-cmake-sanitized/llvm-project/lldb/test/API/functionalities/ptr_refs/TestPtrRefs.py", line 47, in test_ptr_refs self.expect("ptr_refs my_ptr", substrs=["malloc", "stack"]) File "/Users/buildslave/jenkins/workspace/lldb-cmake-sanitized/llvm-project/lldb/packages/Python/lldbsuite/test/lldbtest.py", line 2391, in expect if msg else EXP_MSG(str, output, exe)) AssertionError: False is not True : 'ptr_refs my_ptr' returns expected result, got '0x00007ffee4a45478: stack in frame #0 of thread #1: tid 0xf13a59 in variable at 0x7ffee4a45478: (const char *) my_ptr = 0x00006020000000b0 "hello" 0x00007ffee4a45410: stack (red zone)' Config=x86_64-/Users/buildslave/jenkins/workspace/lldb-cmake-sanitized/lldb-build/bin/clang-11 ---------------------------------------------------------------------- Ran 4 tests in 8.985s

Hide Details

RESULT: FAILED (0 passes, 1 failures, 0 errors, 1 skipped, 2 expected failures, 0 unexpected successes)

Hide Details

--

Hide Details

******************** PASS: lldb-api :: tools/lldb-vscode/variables/TestVSCode_variables.py (1501 of 1972) PASS: lldb-unit :: Expression/./ExpressionTests/DiagnosticManagerTest.PutStringSeverities (1502 of 1972) PASS: lldb-shell :: SymbolFile/NativePDB/function-types-calling-conv.cpp (1503 of 1972) PASS: lldb-unit :: Process/minidump/./LLDBMinidumpTests/MinidumpParserTest.FindMemoryRangeWithFullMemoryMinidump (1504 of 1972) PASS: lldb-unit :: Expression/./ExpressionTests/CppModuleConfigurationTest.Sysroot (1505 of 1972) PASS: lldb-unit :: Utility/./UtilityTests/RegularExpression.Valid (1506 of 1972) PASS: lldb-unit :: Utility/./UtilityTests/VASprintfTest.NoBufferResize (1507 of 1972) PASS: lldb-unit :: Utility/./UtilityTests/SerializationRountripTest.SerializeDeserializePod (1508 of 1972) PASS: lldb-api :: lang/objc/objc-static-method-stripped/TestObjCStaticMethodStripped.py (1509 of 1972) PASS: lldb-shell :: ObjectFile/ELF/netbsd-core-amd64.test (1510 of 1972) PASS: lldb-api :: functionalities/gdb_remote_client/TestGDBRemoteClient.py (1511 of 1972) PASS: lldb-api :: lang/objc/objc-property/TestObjCProperty.py (1512 of 1972) PASS: lldb-shell :: Commands/command-backtrace.test (1513 of 1972) PASS: lldb-shell :: SymbolFile/Breakpad/line-table-discontinuous-file-ids.test (1514 of 1972) PASS: lldb-api :: functionalities/data-formatter/data-formatter-stl/libcxx/bitset/TestDataFormatterLibcxxBitset.py (1515 of 1972) PASS: lldb-unit :: Utility/./UtilityTests/StringListTest.LongestCommonPrefixNoPrefix (1516 of 1972) UNSUPPORTED: lldb-shell :: SymbolFile/PDB/ast-restore.test (1517 of 1972) PASS: lldb-api :: lang/objc/direct-dispatch-step/TestObjCDirectDispatchStepping.py (1518 of 1972) PASS: lldb-api :: commands/target/basic/TestTargetCommand.py (1519 of 1972) PASS: lldb-shell :: ObjectFile/PECOFF/section-types.yaml (1520 of 1972) PASS: lldb-unit :: Utility/./UtilityTests/StringExtractorTest.GetHexBytesAvail (1521 of 1972) PASS: lldb-shell :: ObjectFile/PECOFF/sections-names.yaml (1522 of 1972) PASS: lldb-unit :: Utility/./UtilityTests/ListenerTest.GetEventImmediate (1523 of 1972) PASS: lldb-api :: functionalities/thread/concurrent_events/TestConcurrentManyBreakpoints.py (1524 of 1972) PASS: lldb-unit :: Utility/./UtilityTests/StreamTeeTest.Assignment (1525 of 1972) PASS: lldb-api :: functionalities/data-formatter/data-formatter-stl/libcxx/function/TestLibCxxFunction.py (1526 of 1972) PASS: lldb-shell :: SymbolFile/DWARF/win-i386-line-table.s (1527 of 1972) PASS: lldb-unit :: ScriptInterpreter/Python/./ScriptInterpreterPythonTests/PythonDataObjectsTest.TestOwnedReferences (1528 of 1972) PASS: lldb-shell :: Reproducer/TestGDBRemoteRepro.test (1529 of 1972) PASS: lldb-shell :: SymbolFile/DWARF/DW_OP_piece-struct.s (1530 of 1972) PASS: lldb-api :: functionalities/data-formatter/data-formatter-objc/TestDataFormatterObjCKVO.py (1531 of 1972) PASS: lldb-api :: commands/expression/test/TestExprs2.py (1532 of 1972) PASS: lldb-unit :: Language/Highlighting/./HighlighterTests/HighlighterTest.ClangCursorPosInOtherToken (1533 of 1972) PASS: lldb-api :: functionalities/multiword-commands/TestMultiWordCommands.py (1534 of 1972) PASS: lldb-api :: lang/objc/objc-dyn-sbtype/TestObjCDynamicSBType.py (1535 of 1972) PASS: lldb-unit :: UnwindAssembly/x86/./UnwindAssemblyx86Tests/Testx86AssemblyInspectionEngine.Test64bitFramelessBigStackFrame (1536 of 1972) PASS: lldb-shell :: SymbolFile/DWARF/compilercontext.ll (1537 of 1972) PASS: lldb-unit :: Utility/./UtilityTests/VMRange.Ordering (1538 of 1972) UNSUPPORTED: lldb-api :: functionalities/data-formatter/data-formatter-stl/libstdcpp/list/TestDataFormatterStdList.py (1539 of 1972) PASS: lldb-api :: functionalities/gdb_remote_client/TestIOSSimulator.py (1540 of 1972) PASS: lldb-shell :: Driver/TestNoUseColor.test (1541 of 1972) PASS: lldb-api :: lang/c/step_over_no_deadlock/TestStepOverDoesntBlock.py (1542 of 1972) PASS: lldb-shell :: ObjectFile/ELF/build-id-case.yaml (1543 of 1972) PASS: lldb-api :: functionalities/thread/concurrent_events/TestConcurrentDelaySignalBreak.py (1544 of 1972) PASS: lldb-api :: functionalities/gdb_remote_client/TestWriteMemory.py (1545 of 1972) PASS: lldb-unit :: Symbol/./SymbolTests/PostfixExpression.ToDWARF (1546 of 1972) PASS: lldb-api :: lang/cpp/nested-class-other-compilation-unit/TestNestedClassWithParentInAnotherCU.py (1547 of 1972) PASS: lldb-api :: tools/lldb-vscode/breakpoint/TestVSCode_setBreakpoints.py (1548 of 1972) PASS: lldb-unit :: Utility/./UtilityTests/StringListTest.RemoveBlankLines (1549 of 1972) PASS: lldb-unit :: Language/Highlighting/./HighlighterTests/HighlighterTest.ClangStringLiterals (1550 of 1972) PASS: lldb-unit :: Utility/./UtilityTests/ArgsTest.TestOverwriteArgs (1551 of 1972) PASS: lldb-shell :: ObjectFile/ELF/section-overlap.yaml (1552 of 1972) PASS: lldb-unit :: Symbol/./SymbolTests/Type.GetTypeScopeAndBasename (1553 of 1972) PASS: lldb-unit :: Signals/./SignalsTests/UnixSignalsTest.GetInfo (1554 of 1972) PASS: lldb-api :: lang/cpp/nsimport/TestCppNsImport.py (1555 of 1972) PASS: lldb-api :: lang/cpp/static_methods/TestCPPStaticMethods.py (1556 of 1972) UNSUPPORTED: lldb-shell :: ObjectFile/ELF/minidebuginfo-set-and-hit-breakpoint.test (1557 of 1972) PASS: lldb-unit :: Process/gdb-remote/./ProcessGdbRemoteTests/GDBRemoteClientBaseTest.SendContinueDelegateInterface (1558 of 1972) PASS: lldb-unit :: Utility/./UtilityTests/AnsiTerminal.Incomplete (1559 of 1972) PASS: lldb-shell :: ScriptInterpreter/Python/crashlog.test (1560 of 1972) UNSUPPORTED: lldb-api :: arm/breakpoint-it/TestBreakpointIt.py (1561 of 1972) UNSUPPORTED: lldb-api :: android/platform/TestDefaultCacheLineSize.py (1562 of 1972) PASS: lldb-unit :: Process/minidump/./LLDBMinidumpTests/MinidumpParserTest.GetThreadsAndGetThreadContext (1563 of 1972) PASS: lldb-api :: lang/objc/foundation/TestObjCMethods2.py (1564 of 1972) PASS: lldb-api :: commands/expression/import-std-module/conflicts/TestStdModuleWithConflicts.py (1565 of 1972) PASS: lldb-unit :: Utility/./UtilityTests/StringListTest.ShiftMove (1566 of 1972) PASS: lldb-shell :: Unwind/thread-step-out-ret-addr-check.test (1567 of 1972) PASS: lldb-api :: functionalities/inferior-crashing/recursive-inferior/TestRecursiveInferiorStep.py (1568 of 1972) PASS: lldb-unit :: Platform/./LLDBPlatformTests/PlatformDarwinTest.TestParseVersionBuildDir (1569 of 1972) PASS: lldb-api :: macosx/version_zero/TestGetVersionZeroVersion.py (1570 of 1972) PASS: lldb-unit :: Symbol/./SymbolTests/TestClangASTImporter.MetadataPropagation (1571 of 1972) PASS: lldb-unit :: Process/minidump/./LLDBMinidumpTests/MinidumpParserTest.GetFilteredModuleList (1572 of 1972) PASS: lldb-api :: functionalities/thread/concurrent_events/TestConcurrentCrashWithSignal.py (1573 of 1972) PASS: lldb-api :: functionalities/thread/create_after_attach/TestCreateAfterAttach.py (1574 of 1972) PASS: lldb-unit :: Utility/./UtilityTests/GeneratorTest.Get (1575 of 1972) PASS: lldb-api :: functionalities/data-formatter/data-formatter-synthval/TestDataFormatterSynthVal.py (1576 of 1972) PASS: lldb-shell :: Breakpoint/implicit_const_form_support.test (1577 of 1972) PASS: lldb-shell :: ObjectFile/PECOFF/invalid-export-table.yaml (1578 of 1972) PASS: lldb-unit :: tools/lldb-server/tests/./LLDBServerTests/TestBase.DebugserverEnv (1579 of 1972) UNSUPPORTED: lldb-shell :: Unwind/unwind-plan-dwarf-dump.test (1580 of 1972) PASS: lldb-shell :: SymbolFile/DWARF/array-sizes.s (1581 of 1972) PASS: lldb-api :: functionalities/thread/backtrace_all/TestBacktraceAll.py (1582 of 1972) PASS: lldb-api :: functionalities/thread/backtrace_limit/TestBacktraceLimit.py (1583 of 1972) PASS: lldb-unit :: UnwindAssembly/x86/./UnwindAssemblyx86Tests/Testx86AssemblyInspectionEngine.TestMovRSPtoRBP (1584 of 1972) PASS: lldb-unit :: Utility/./UtilityTests/UriParserTest.BracketedHostnamePort (1585 of 1972) PASS: lldb-unit :: Utility/./UtilityTests/StringListTest.CopyListEmpty (1586 of 1972) FAIL: lldb-api :: python_api/thread/TestThreadAPI.py (1587 of 1972) ******************** TEST 'lldb-api :: python_api/thread/TestThreadAPI.py' FAILED ******************** Script: -- /usr/local/bin/python /Users/buildslave/jenkins/workspace/lldb-cmake-sanitized/llvm-project/lldb/test/API/dotest.py --arch x86_64 -s /Users/buildslave/jenkins/workspace/lldb-cmake-sanitized/lldb-build/lldb-test-traces -S nm -u CXXFLAGS -u CFLAGS --codesign-identity lldb_codesign --server /Users/buildslave/jenkins/workspace/lldb-cmake-sanitized/lldb-build/./bin/debugserver --arch x86_64 --build-dir /Users/buildslave/jenkins/workspace/lldb-cmake-sanitized/lldb-build/lldb-test-build.noindex -s=/Users/buildslave/jenkins/workspace/lldb-cmake-sanitized/test/logs -t --env TERM=vt100 --env LLVM_LIBS_DIR=/Users/buildslave/jenkins/workspace/lldb-cmake-sanitized/lldb-build/./lib --inferior-env ASAN_OPTIONS=detect_stack_use_after_return=1 --inferior-env DYLD_INSERT_LIBRARIES=/Users/buildslave/jenkins/workspace/lldb-cmake-sanitized/host-compiler/lib/clang/11.0.0/lib/darwin/libclang_rt.asan_osx_dynamic.dylib --build-dir /Users/buildslave/jenkins/workspace/lldb-cmake-sanitized/lldb-build/lldb-test-build.noindex --lldb-module-cache-dir /Users/buildslave/jenkins/workspace/lldb-cmake-sanitized/lldb-build/lldb-test-build.noindex/module-cache-lldb/lldb-api --clang-module-cache-dir /Users/buildslave/jenkins/workspace/lldb-cmake-sanitized/lldb-build/lldb-test-build.noindex/module-cache-clang/lldb-api --executable /Users/buildslave/jenkins/workspace/lldb-cmake-sanitized/lldb-build/./bin/lldb --compiler /Users/buildslave/jenkins/workspace/lldb-cmake-sanitized/lldb-build/./bin/clang --dsymutil /Users/buildslave/jenkins/workspace/lldb-cmake-sanitized/lldb-build/./bin/dsymutil --filecheck /Users/buildslave/jenkins/workspace/lldb-cmake-sanitized/lldb-build/./bin/FileCheck --lldb-libs-dir /Users/buildslave/jenkins/workspace/lldb-cmake-sanitized/lldb-build/./lib /Users/buildslave/jenkins/workspace/lldb-cmake-sanitized/llvm-project/lldb/test/API/python_api/thread -p TestThreadAPI.py -- Exit Code: 1

Hide Details

Command Output (stdout): -- lldb version 11.0.99 clang revision 92744f624783d92a07db25bc76e181b879f17e5b llvm revision 92744f624783d92a07db25bc76e181b879f17e5b LLDB library dir: /Users/buildslave/jenkins/workspace/lldb-cmake-sanitized/lldb-build/bin LLDB import library dir: /Users/buildslave/jenkins/workspace/lldb-cmake-sanitized/lldb-build/./lib libstdcxx tests will not be run because: Don't know how to build with libstdcxx on macosx Skipping following debug info categories: ['dwo'] start addr: 0x1075fce66 end addr: 0x1075fce70 start addr: 0x10984ee66 end addr: 0x10984ee70 start addr: 0x105a78e66 end addr: 0x105a78e70

Hide Details

-- Command Output (stderr): --

Hide Details

Session logs for test failures/errors/unexpected successes will go into directory '/Users/buildslave/jenkins/workspace/lldb-cmake-sanitized/test/logs' Command invoked: /Users/buildslave/jenkins/workspace/lldb-cmake-sanitized/llvm-project/lldb/test/API/dotest.py --arch x86_64 -s /Users/buildslave/jenkins/workspace/lldb-cmake-sanitized/lldb-build/lldb-test-traces -S nm -u CXXFLAGS -u CFLAGS --codesign-identity lldb_codesign --server /Users/buildslave/jenkins/workspace/lldb-cmake-sanitized/lldb-build/./bin/debugserver --arch x86_64 --build-dir /Users/buildslave/jenkins/workspace/lldb-cmake-sanitized/lldb-build/lldb-test-build.noindex -s=/Users/buildslave/jenkins/workspace/lldb-cmake-sanitized/test/logs -t --env TERM=vt100 --env LLVM_LIBS_DIR=/Users/buildslave/jenkins/workspace/lldb-cmake-sanitized/lldb-build/./lib --inferior-env ASAN_OPTIONS=detect_stack_use_after_return=1 --inferior-env DYLD_INSERT_LIBRARIES=/Users/buildslave/jenkins/workspace/lldb-cmake-sanitized/host-compiler/lib/clang/11.0.0/lib/darwin/libclang_rt.asan_osx_dynamic.dylib --build-dir /Users/buildslave/jenkins/workspace/lldb-cmake-sanitized/lldb-build/lldb-test-build.noindex --lldb-module-cache-dir /Users/buildslave/jenkins/workspace/lldb-cmake-sanitized/lldb-build/lldb-test-build.noindex/module-cache-lldb/lldb-api --clang-module-cache-dir /Users/buildslave/jenkins/workspace/lldb-cmake-sanitized/lldb-build/lldb-test-build.noindex/module-cache-clang/lldb-api --executable /Users/buildslave/jenkins/workspace/lldb-cmake-sanitized/lldb-build/./bin/lldb --compiler /Users/buildslave/jenkins/workspace/lldb-cmake-sanitized/lldb-build/./bin/clang --dsymutil /Users/buildslave/jenkins/workspace/lldb-cmake-sanitized/lldb-build/./bin/dsymutil --filecheck /Users/buildslave/jenkins/workspace/lldb-cmake-sanitized/lldb-build/./bin/FileCheck --lldb-libs-dir /Users/buildslave/jenkins/workspace/lldb-cmake-sanitized/lldb-build/./lib /Users/buildslave/jenkins/workspace/lldb-cmake-sanitized/llvm-project/lldb/test/API/python_api/thread -p TestThreadAPI.py Change dir to: /Users/buildslave/jenkins/workspace/lldb-cmake-sanitized/llvm-project/lldb/test/API/python_api/thread runCmd: settings clear -all output:

Hide Details

runCmd: settings set symbols.enable-external-lookup false output:

Hide Details

runCmd: settings set target.auto-apply-fixits false output:

Hide Details

runCmd: settings set plugin.process.gdb-remote.packet-timeout 60 output:

Hide Details

runCmd: settings set symbols.clang-modules-cache-path "/Users/buildslave/jenkins/workspace/lldb-cmake-sanitized/lldb-build/lldb-test-build.noindex/module-cache-lldb/lldb-api" output:

Hide Details

runCmd: settings set use-color false output:

Hide Details

runCmd: setting set target.prefer-dynamic-value no-dynamic-values output:

Hide Details

runCmd: settings set target.env-vars ASAN_OPTIONS=detect_stack_use_after_return=1 DYLD_INSERT_LIBRARIES=/Users/buildslave/jenkins/workspace/lldb-cmake-sanitized/host-compiler/lib/clang/11.0.0/lib/darwin/libclang_rt.asan_osx_dynamic.dylib output:

Hide Details

runCmd: breakpoint list output: Current breakpoints: 1: file = 'main.cpp', line = 17, exact_match = 0, locations = 1 1.1: where = a.out`main + 115 at main.cpp:17:5, address = a.out[0x0000000100000f53], unresolved, hit count = 0

Hide Details

Hide Details

Hide Details

runCmd: process status output: Process 57901 stopped * thread #1, queue = 'com.apple.main-thread', stop reason = breakpoint 1.1 frame #0: 0x0000000107fa8f53 a.out`main(argc=1, argv=0x00007ffee7c574c8) at main.cpp:17:5 14 15 printf("after the loop: my_char='%c'\n", my_char); // 'my_char' should print out as 'x'. 16 -> 17 return 0; // Set break point at this line and check variable 'my_char'. ^ 18 }

Hide Details

Hide Details

<bound method SBProcess.Kill of <lldb.SBProcess; proxy of <Swig Object of type 'lldb::SBProcess *' at 0x125163ab0> >>: success

Hide Details

PASS: LLDB (/Users/buildslave/jenkins/workspace/lldb-cmake-sanitized/lldb-build/bin/clang-11-x86_64) :: test_get_process_dsym (TestThreadAPI.ThreadAPITestCase) runCmd: settings clear -all output:

Hide Details

runCmd: settings set symbols.enable-external-lookup false output:

Hide Details

runCmd: settings set target.auto-apply-fixits false output:

Hide Details

runCmd: settings set plugin.process.gdb-remote.packet-timeout 60 output:

Hide Details

runCmd: settings set symbols.clang-modules-cache-path "/Users/buildslave/jenkins/workspace/lldb-cmake-sanitized/lldb-build/lldb-test-build.noindex/module-cache-lldb/lldb-api" output:

Hide Details

runCmd: settings set use-color false output:

Hide Details

runCmd: setting set target.prefer-dynamic-value no-dynamic-values output:

Hide Details

runCmd: settings set target.env-vars ASAN_OPTIONS=detect_stack_use_after_return=1 DYLD_INSERT_LIBRARIES=/Users/buildslave/jenkins/workspace/lldb-cmake-sanitized/host-compiler/lib/clang/11.0.0/lib/darwin/libclang_rt.asan_osx_dynamic.dylib output:

Hide Details

runCmd: breakpoint list output: Current breakpoints: 1: file = 'main.cpp', line = 17, exact_match = 0, locations = 1 1.1: where = a.out`main + 115 at main.cpp:17:5, address = a.out[0x0000000100000f53], unresolved, hit count = 0

Hide Details

Hide Details

Hide Details

runCmd: process status output: Process 58017 stopped * thread #1, queue = 'com.apple.main-thread', stop reason = breakpoint 1.1 frame #0: 0x00000001094ecf53 a.out`main(argc=1, argv=0x00007ffee6713498) at main.cpp:17:5 14 15 printf("after the loop: my_char='%c'\n", my_char); // 'my_char' should print out as 'x'. 16 -> 17 return 0; // Set break point at this line and check variable 'my_char'. ^ 18 }

Hide Details

Hide Details

<bound method SBProcess.Kill of <lldb.SBProcess; proxy of <Swig Object of type 'lldb::SBProcess *' at 0x10de40990> >>: success

Hide Details

PASS: LLDB (/Users/buildslave/jenkins/workspace/lldb-cmake-sanitized/lldb-build/bin/clang-11-x86_64) :: test_get_process_dwarf (TestThreadAPI.ThreadAPITestCase) UNSUPPORTED: LLDB (/Users/buildslave/jenkins/workspace/lldb-cmake-sanitized/lldb-build/bin/clang-11-x86_64) :: test_get_process_dwo (TestThreadAPI.ThreadAPITestCase) (test case does not fall in any category of interest for this run) runCmd: settings clear -all output:

Hide Details

runCmd: settings set symbols.enable-external-lookup false output:

Hide Details

runCmd: settings set target.auto-apply-fixits false output:

Hide Details

runCmd: settings set plugin.process.gdb-remote.packet-timeout 60 output:

Hide Details

runCmd: settings set symbols.clang-modules-cache-path "/Users/buildslave/jenkins/workspace/lldb-cmake-sanitized/lldb-build/lldb-test-build.noindex/module-cache-lldb/lldb-api" output:

Hide Details

runCmd: settings set use-color false output:

Hide Details

runCmd: setting set target.prefer-dynamic-value no-dynamic-values output:

Hide Details

runCmd: settings set target.env-vars ASAN_OPTIONS=detect_stack_use_after_return=1 DYLD_INSERT_LIBRARIES=/Users/buildslave/jenkins/workspace/lldb-cmake-sanitized/host-compiler/lib/clang/11.0.0/lib/darwin/libclang_rt.asan_osx_dynamic.dylib output:

Hide Details

runCmd: breakpoint list output: Current breakpoints: 1: file = 'main.cpp', line = 17, exact_match = 0, locations = 1 1.1: where = a.out`main + 115 at main.cpp:17:5, address = a.out[0x0000000100000f53], unresolved, hit count = 0

Hide Details

Hide Details

Hide Details

runCmd: process status output: Process 58174 stopped * thread #1, queue = 'com.apple.main-thread', stop reason = breakpoint 1.1 frame #0: 0x000000010a251f53 a.out`main(argc=1, argv=0x00007ffee59ae498) at main.cpp:17:5 14 15 printf("after the loop: my_char='%c'\n", my_char); // 'my_char' should print out as 'x'. 16 -> 17 return 0; // Set break point at this line and check variable 'my_char'. ^ 18 }

Hide Details

Hide Details

<bound method SBProcess.Kill of <lldb.SBProcess; proxy of <Swig Object of type 'lldb::SBProcess *' at 0x1251638d0> >>: success

Hide Details

PASS: LLDB (/Users/buildslave/jenkins/workspace/lldb-cmake-sanitized/lldb-build/bin/clang-11-x86_64) :: test_get_process_gmodules (TestThreadAPI.ThreadAPITestCase) runCmd: settings clear -all output:

Hide Details

runCmd: settings set symbols.enable-external-lookup false output:

Hide Details

runCmd: settings set target.auto-apply-fixits false output:

Hide Details

runCmd: settings set plugin.process.gdb-remote.packet-timeout 60 output:

Hide Details

runCmd: settings set symbols.clang-modules-cache-path "/Users/buildslave/jenkins/workspace/lldb-cmake-sanitized/lldb-build/lldb-test-build.noindex/module-cache-lldb/lldb-api" output:

Hide Details

runCmd: settings set use-color false output:

Hide Details

runCmd: setting set target.prefer-dynamic-value no-dynamic-values output:

Hide Details

runCmd: settings set target.env-vars ASAN_OPTIONS=detect_stack_use_after_return=1 DYLD_INSERT_LIBRARIES=/Users/buildslave/jenkins/workspace/lldb-cmake-sanitized/host-compiler/lib/clang/11.0.0/lib/darwin/libclang_rt.asan_osx_dynamic.dylib output:

Hide Details

<bound method SBProcess.Kill of <lldb.SBProcess; proxy of <Swig Object of type 'lldb::SBProcess *' at 0x10de40960> >>: success

Hide Details

PASS: LLDB (/Users/buildslave/jenkins/workspace/lldb-cmake-sanitized/lldb-build/bin/clang-11-x86_64) :: test_get_stop_description_dsym (TestThreadAPI.ThreadAPITestCase) runCmd: settings clear -all output:

Hide Details

runCmd: settings set symbols.enable-external-lookup false output:

Hide Details

runCmd: settings set target.auto-apply-fixits false output:

Hide Details

runCmd: settings set plugin.process.gdb-remote.packet-timeout 60 output:

Hide Details

runCmd: settings set symbols.clang-modules-cache-path "/Users/buildslave/jenkins/workspace/lldb-cmake-sanitized/lldb-build/lldb-test-build.noindex/module-cache-lldb/lldb-api" output:

Hide Details

runCmd: settings set use-color false output:

Hide Details

runCmd: setting set target.prefer-dynamic-value no-dynamic-values output:

Hide Details

runCmd: settings set target.env-vars ASAN_OPTIONS=detect_stack_use_after_return=1 DYLD_INSERT_LIBRARIES=/Users/buildslave/jenkins/workspace/lldb-cmake-sanitized/host-compiler/lib/clang/11.0.0/lib/darwin/libclang_rt.asan_osx_dynamic.dylib output:

Hide Details

<bound method SBProcess.Kill of <lldb.SBProcess; proxy of <Swig Object of type 'lldb::SBProcess *' at 0x124bae2d0> >>: success

Hide Details

PASS: LLDB (/Users/buildslave/jenkins/workspace/lldb-cmake-sanitized/lldb-build/bin/clang-11-x86_64) :: test_get_stop_description_dwarf (TestThreadAPI.ThreadAPITestCase) UNSUPPORTED: LLDB (/Users/buildslave/jenkins/workspace/lldb-cmake-sanitized/lldb-build/bin/clang-11-x86_64) :: test_get_stop_description_dwo (TestThreadAPI.ThreadAPITestCase) (test case does not fall in any category of interest for this run) runCmd: settings clear -all output:

Hide Details

runCmd: settings set symbols.enable-external-lookup false output:

Hide Details

runCmd: settings set target.auto-apply-fixits false output:

Hide Details

runCmd: settings set plugin.process.gdb-remote.packet-timeout 60 output:

Hide Details

runCmd: settings set symbols.clang-modules-cache-path "/Users/buildslave/jenkins/workspace/lldb-cmake-sanitized/lldb-build/lldb-test-build.noindex/module-cache-lldb/lldb-api" output:

Hide Details

runCmd: settings set use-color false output:

Hide Details

runCmd: setting set target.prefer-dynamic-value no-dynamic-values output:

Hide Details

runCmd: settings set target.env-vars ASAN_OPTIONS=detect_stack_use_after_return=1 DYLD_INSERT_LIBRARIES=/Users/buildslave/jenkins/workspace/lldb-cmake-sanitized/host-compiler/lib/clang/11.0.0/lib/darwin/libclang_rt.asan_osx_dynamic.dylib output:

Hide Details

<bound method SBProcess.Kill of <lldb.SBProcess; proxy of <Swig Object of type 'lldb::SBProcess *' at 0x10de40990> >>: success

Hide Details

PASS: LLDB (/Users/buildslave/jenkins/workspace/lldb-cmake-sanitized/lldb-build/bin/clang-11-x86_64) :: test_get_stop_description_gmodules (TestThreadAPI.ThreadAPITestCase) runCmd: settings clear -all output:

Hide Details

runCmd: settings set symbols.enable-external-lookup false output:

Hide Details

runCmd: settings set target.auto-apply-fixits false output:

Hide Details

runCmd: settings set plugin.process.gdb-remote.packet-timeout 60 output:

Hide Details

runCmd: settings set symbols.clang-modules-cache-path "/Users/buildslave/jenkins/workspace/lldb-cmake-sanitized/lldb-build/lldb-test-build.noindex/module-cache-lldb/lldb-api" output:

Hide Details

runCmd: settings set use-color false output:

Hide Details

runCmd: setting set target.prefer-dynamic-value no-dynamic-values output:

Hide Details

runCmd: settings set target.env-vars ASAN_OPTIONS=detect_stack_use_after_return=1 DYLD_INSERT_LIBRARIES=/Users/buildslave/jenkins/workspace/lldb-cmake-sanitized/host-compiler/lib/clang/11.0.0/lib/darwin/libclang_rt.asan_osx_dynamic.dylib output:

Hide Details

runCmd: breakpoint list output: Current breakpoints: 1: file = 'main2.cpp', line = 21, exact_match = 0, locations = 1 1.1: where = test_run_to_address_dsym`b(int) + 22 at main2.cpp:21:17, address = test_run_to_address_dsym[0x0000000100000e66], unresolved, hit count = 0

Hide Details

Hide Details

Hide Details

runCmd: thread backtrace output: * thread #1, queue = 'com.apple.main-thread', stop reason = breakpoint 1.1 * frame #0: 0x00000001075fce66 test_run_to_address_dsym`b(val=1) at main2.cpp:21:17 frame #1: 0x00000001075fce0d test_run_to_address_dsym`a(val=1) at main2.cpp:11:16 frame #2: 0x00000001075fcee0 test_run_to_address_dsym`main(argc=1, argv=0x00007ffee8603470) at main2.cpp:36:14 frame #3: 0x00007fff67d6a085 libdyld.dylib`start + 1

Hide Details

Hide Details

runCmd: breakpoint list output: Current breakpoints: 1: file = 'main2.cpp', line = 21, exact_match = 0, locations = 1 Options: disabled 1.1: where = test_run_to_address_dsym`b(int) + 22 at main2.cpp:21:17, address = 0x00000001075fce66, unresolved, hit count = 1

Hide Details

Hide Details

Hide Details

runCmd: thread backtrace output: * thread #1, queue = 'com.apple.main-thread', stop reason = step over * frame #0: 0x00000001075fce9d test_run_to_address_dsym`b(val=1) at main2.cpp:26:12 frame #1: 0x00000001075fce0d test_run_to_address_dsym`a(val=1) at main2.cpp:11:16 frame #2: 0x00000001075fcee0 test_run_to_address_dsym`main(argc=1, argv=0x00007ffee8603470) at main2.cpp:36:14 frame #3: 0x00007fff67d6a085 libdyld.dylib`start + 1

Hide Details

Hide Details

runCmd: process status output: Process 58529 stopped * thread #1, queue = 'com.apple.main-thread', stop reason = run to address: 0x00000001075fce66 frame #0: 0x00000001075fce66 test_run_to_address_dsym`b(val=2) at main2.cpp:21:17 18 int b(int val) 19 { 20 int rc = c(val); -> 21 void *ptr = malloc(1024); // thread step-out of malloc into function b. ^ 22 if (!ptr) 23 return -1; 24 else

Hide Details

Hide Details

<bound method SBProcess.Kill of <lldb.SBProcess; proxy of <Swig Object of type 'lldb::SBProcess *' at 0x1249afde0> >>: success

Hide Details

PASS: LLDB (/Users/buildslave/jenkins/workspace/lldb-cmake-sanitized/lldb-build/bin/clang-11-x86_64) :: test_run_to_address_dsym (TestThreadAPI.ThreadAPITestCase) runCmd: settings clear -all output:

Hide Details

runCmd: settings set symbols.enable-external-lookup false output:

Hide Details

runCmd: settings set target.auto-apply-fixits false output:

Hide Details

runCmd: settings set plugin.process.gdb-remote.packet-timeout 60 output:

Hide Details

runCmd: settings set symbols.clang-modules-cache-path "/Users/buildslave/jenkins/workspace/lldb-cmake-sanitized/lldb-build/lldb-test-build.noindex/module-cache-lldb/lldb-api" output:

Hide Details

runCmd: settings set use-color false output:

Hide Details

runCmd: setting set target.prefer-dynamic-value no-dynamic-values output:

Hide Details

runCmd: settings set target.env-vars ASAN_OPTIONS=detect_stack_use_after_return=1 DYLD_INSERT_LIBRARIES=/Users/buildslave/jenkins/workspace/lldb-cmake-sanitized/host-compiler/lib/clang/11.0.0/lib/darwin/libclang_rt.asan_osx_dynamic.dylib output:

Hide Details

runCmd: breakpoint list output: Current breakpoints: 1: file = 'main2.cpp', line = 21, exact_match = 0, locations = 1 1.1: where = test_run_to_address_dwarf`b(int) + 22 at main2.cpp:21:17, address = test_run_to_address_dwarf[0x0000000100000e66], unresolved, hit count = 0

Hide Details

Hide Details

Hide Details

runCmd: thread backtrace output: * thread #1, queue = 'com.apple.main-thread', stop reason = breakpoint 1.1 * frame #0: 0x000000010984ee66 test_run_to_address_dwarf`b(val=1) at main2.cpp:21:17 frame #1: 0x000000010984ee0d test_run_to_address_dwarf`a(val=1) at main2.cpp:11:16 frame #2: 0x000000010984eee0 test_run_to_address_dwarf`main(argc=1, argv=0x00007ffee63b1470) at main2.cpp:36:14 frame #3: 0x00007fff67d6a085 libdyld.dylib`start + 1

Hide Details

Hide Details

runCmd: breakpoint list output: Current breakpoints: 1: file = 'main2.cpp', line = 21, exact_match = 0, locations = 1 Options: disabled 1.1: where = test_run_to_address_dwarf`b(int) + 22 at main2.cpp:21:17, address = 0x000000010984ee66, unresolved, hit count = 1

Hide Details

Hide Details

Hide Details

runCmd: thread backtrace output: * thread #1, queue = 'com.apple.main-thread', stop reason = step over * frame #0: 0x000000010984ee9d test_run_to_address_dwarf`b(val=1) at main2.cpp:26:12 frame #1: 0x000000010984ee0d test_run_to_address_dwarf`a(val=1) at main2.cpp:11:16 frame #2: 0x000000010984eee0 test_run_to_address_dwarf`main(argc=1, argv=0x00007ffee63b1470) at main2.cpp:36:14 frame #3: 0x00007fff67d6a085 libdyld.dylib`start + 1

Hide Details

Hide Details

runCmd: process status output: Process 58639 stopped * thread #1, queue = 'com.apple.main-thread', stop reason = run to address: 0x000000010984ee66 frame #0: 0x000000010984ee66 test_run_to_address_dwarf`b(val=2) at main2.cpp:21:17 18 int b(int val) 19 { 20 int rc = c(val); -> 21 void *ptr = malloc(1024); // thread step-out of malloc into function b. ^ 22 if (!ptr) 23 return -1; 24 else

Hide Details

Hide Details

<bound method SBProcess.Kill of <lldb.SBProcess; proxy of <Swig Object of type 'lldb::SBProcess *' at 0x10de40960> >>: success

Hide Details

PASS: LLDB (/Users/buildslave/jenkins/workspace/lldb-cmake-sanitized/lldb-build/bin/clang-11-x86_64) :: test_run_to_address_dwarf (TestThreadAPI.ThreadAPITestCase) UNSUPPORTED: LLDB (/Users/buildslave/jenkins/workspace/lldb-cmake-sanitized/lldb-build/bin/clang-11-x86_64) :: test_run_to_address_dwo (TestThreadAPI.ThreadAPITestCase) (test case does not fall in any category of interest for this run) runCmd: settings clear -all output:

Hide Details

runCmd: settings set symbols.enable-external-lookup false output:

Hide Details

runCmd: settings set target.auto-apply-fixits false output:

Hide Details

runCmd: settings set plugin.process.gdb-remote.packet-timeout 60 output:

Hide Details

runCmd: settings set symbols.clang-modules-cache-path "/Users/buildslave/jenkins/workspace/lldb-cmake-sanitized/lldb-build/lldb-test-build.noindex/module-cache-lldb/lldb-api" output:

Hide Details

runCmd: settings set use-color false output:

Hide Details

runCmd: setting set target.prefer-dynamic-value no-dynamic-values output:

Hide Details

runCmd: settings set target.env-vars ASAN_OPTIONS=detect_stack_use_after_return=1 DYLD_INSERT_LIBRARIES=/Users/buildslave/jenkins/workspace/lldb-cmake-sanitized/host-compiler/lib/clang/11.0.0/lib/darwin/libclang_rt.asan_osx_dynamic.dylib output:

Hide Details

runCmd: breakpoint list output: Current breakpoints: 1: file = 'main2.cpp', line = 21, exact_match = 0, locations = 1 1.1: where = test_run_to_address_gmodules`b(int) + 22 at main2.cpp:21:17, address = test_run_to_address_gmodules[0x0000000100000e66], unresolved, hit count = 0

Hide Details

Hide Details

Hide Details

runCmd: thread backtrace output: * thread #1, queue = 'com.apple.main-thread', stop reason = breakpoint 1.1 * frame #0: 0x0000000105a78e66 test_run_to_address_gmodules`b(val=1) at main2.cpp:21:17 frame #1: 0x0000000105a78e0d test_run_to_address_gmodules`a(val=1) at main2.cpp:11:16 frame #2: 0x0000000105a78ee0 test_run_to_address_gmodules`main(argc=1, argv=0x00007ffeea187460) at main2.cpp:36:14 frame #3: 0x00007fff67d6a085 libdyld.dylib`start + 1

Hide Details

Hide Details

runCmd: breakpoint list output: Current breakpoints: 1: file = 'main2.cpp', line = 21, exact_match = 0, locations = 1 Options: disabled 1.1: where = test_run_to_address_gmodules`b(int) + 22 at main2.cpp:21:17, address = 0x0000000105a78e66, unresolved, hit count = 1

Hide Details

Hide Details

Hide Details

runCmd: thread backtrace output: * thread #1, queue = 'com.apple.main-thread', stop reason = step over * frame #0: 0x0000000105a78e9d test_run_to_address_gmodules`b(val=1) at main2.cpp:26:12 frame #1: 0x0000000105a78e0d test_run_to_address_gmodules`a(val=1) at main2.cpp:11:16 frame #2: 0x0000000105a78ee0 test_run_to_address_gmodules`main(argc=1, argv=0x00007ffeea187460) at main2.cpp:36:14 frame #3: 0x00007fff67d6a085 libdyld.dylib`start + 1

Hide Details

Hide Details

runCmd: process status output: Process 58705 stopped * thread #1, queue = 'com.apple.main-thread', stop reason = run to address: 0x0000000105a78e66 frame #0: 0x0000000105a78e66 test_run_to_address_gmodules`b(val=2) at main2.cpp:21:17 18 int b(int val) 19 { 20 int rc = c(val); -> 21 void *ptr = malloc(1024); // thread step-out of malloc into function b. ^ 22 if (!ptr) 23 return -1; 24 else

Hide Details

Hide Details

<bound method SBProcess.Kill of <lldb.SBProcess; proxy of <Swig Object of type 'lldb::SBProcess *' at 0x124bae2d0> >>: success

Hide Details

PASS: LLDB (/Users/buildslave/jenkins/workspace/lldb-cmake-sanitized/lldb-build/bin/clang-11-x86_64) :: test_run_to_address_gmodules (TestThreadAPI.ThreadAPITestCase) runCmd: settings clear -all output:

Hide Details

runCmd: settings set symbols.enable-external-lookup false output:

Hide Details

runCmd: settings set target.auto-apply-fixits false output:

Hide Details

runCmd: settings set plugin.process.gdb-remote.packet-timeout 60 output:

Hide Details

runCmd: settings set symbols.clang-modules-cache-path "/Users/buildslave/jenkins/workspace/lldb-cmake-sanitized/lldb-build/lldb-test-build.noindex/module-cache-lldb/lldb-api" output:

Hide Details

runCmd: settings set use-color false output:

Hide Details

runCmd: setting set target.prefer-dynamic-value no-dynamic-values output:

Hide Details

runCmd: settings set target.env-vars ASAN_OPTIONS=detect_stack_use_after_return=1 DYLD_INSERT_LIBRARIES=/Users/buildslave/jenkins/workspace/lldb-cmake-sanitized/host-compiler/lib/clang/11.0.0/lib/darwin/libclang_rt.asan_osx_dynamic.dylib output:

Hide Details

FAIL: LLDB (/Users/buildslave/jenkins/workspace/lldb-cmake-sanitized/lldb-build/bin/clang-11-x86_64) :: test_step_out_of_malloc_into_function_b_dsym (TestThreadAPI.ThreadAPITestCase) <bound method SBProcess.Kill of <lldb.SBProcess; proxy of <Swig Object of type 'lldb::SBProcess *' at 0x10de40990> >>: success

Hide Details

runCmd: settings clear -all output:

Hide Details

runCmd: settings set symbols.enable-external-lookup false output:

Hide Details

runCmd: settings set target.auto-apply-fixits false output:

Hide Details

runCmd: settings set plugin.process.gdb-remote.packet-timeout 60 output:

Hide Details

runCmd: settings set symbols.clang-modules-cache-path "/Users/buildslave/jenkins/workspace/lldb-cmake-sanitized/lldb-build/lldb-test-build.noindex/module-cache-lldb/lldb-api" output:

Hide Details

runCmd: settings set use-color false output:

Hide Details

runCmd: setting set target.prefer-dynamic-value no-dynamic-values output:

Hide Details

runCmd: settings set target.env-vars ASAN_OPTIONS=detect_stack_use_after_return=1 DYLD_INSERT_LIBRARIES=/Users/buildslave/jenkins/workspace/lldb-cmake-sanitized/host-compiler/lib/clang/11.0.0/lib/darwin/libclang_rt.asan_osx_dynamic.dylib output:

Hide Details

FAIL: LLDB (/Users/buildslave/jenkins/workspace/lldb-cmake-sanitized/lldb-build/bin/clang-11-x86_64) :: test_step_out_of_malloc_into_function_b_dwarf (TestThreadAPI.ThreadAPITestCase) <bound method SBProcess.Kill of <lldb.SBProcess; proxy of <Swig Object of type 'lldb::SBProcess *' at 0x1249afde0> >>: success

Hide Details

UNSUPPORTED: LLDB (/Users/buildslave/jenkins/workspace/lldb-cmake-sanitized/lldb-build/bin/clang-11-x86_64) :: test_step_out_of_malloc_into_function_b_dwo (TestThreadAPI.ThreadAPITestCase) (test case does not fall in any category of interest for this run) runCmd: settings clear -all output:

Hide Details

runCmd: settings set symbols.enable-external-lookup false output:

Hide Details

runCmd: settings set target.auto-apply-fixits false output:

Hide Details

runCmd: settings set plugin.process.gdb-remote.packet-timeout 60 output:

Hide Details

runCmd: settings set symbols.clang-modules-cache-path "/Users/buildslave/jenkins/workspace/lldb-cmake-sanitized/lldb-build/lldb-test-build.noindex/module-cache-lldb/lldb-api" output:

Hide Details

runCmd: settings set use-color false output:

Hide Details

runCmd: setting set target.prefer-dynamic-value no-dynamic-values output:

Hide Details

runCmd: settings set target.env-vars ASAN_OPTIONS=detect_stack_use_after_return=1 DYLD_INSERT_LIBRARIES=/Users/buildslave/jenkins/workspace/lldb-cmake-sanitized/host-compiler/lib/clang/11.0.0/lib/darwin/libclang_rt.asan_osx_dynamic.dylib output:

Hide Details

FAIL: LLDB (/Users/buildslave/jenkins/workspace/lldb-cmake-sanitized/lldb-build/bin/clang-11-x86_64) :: test_step_out_of_malloc_into_function_b_gmodules (TestThreadAPI.ThreadAPITestCase) <bound method SBProcess.Kill of <lldb.SBProcess; proxy of <Swig Object of type 'lldb::SBProcess *' at 0x10de40990> >>: success

Hide Details

runCmd: settings clear -all output:

Hide Details

runCmd: settings set symbols.enable-external-lookup false output:

Hide Details

runCmd: settings set target.auto-apply-fixits false output:

Hide Details

runCmd: settings set plugin.process.gdb-remote.packet-timeout 60 output:

Hide Details

runCmd: settings set symbols.clang-modules-cache-path "/Users/buildslave/jenkins/workspace/lldb-cmake-sanitized/lldb-build/lldb-test-build.noindex/module-cache-lldb/lldb-api" output:

Hide Details

runCmd: settings set use-color false output:

Hide Details

runCmd: setting set target.prefer-dynamic-value no-dynamic-values output:

Hide Details

runCmd: settings set target.env-vars ASAN_OPTIONS=detect_stack_use_after_return=1 DYLD_INSERT_LIBRARIES=/Users/buildslave/jenkins/workspace/lldb-cmake-sanitized/host-compiler/lib/clang/11.0.0/lib/darwin/libclang_rt.asan_osx_dynamic.dylib output:

Hide Details

runCmd: breakpoint list output: Current breakpoints: 1: file = 'main2.cpp', line = 21, exact_match = 0, locations = 1 1.1: where = test_step_over_3_times_dsym`b(int) + 22 at main2.cpp:21:17, address = test_step_over_3_times_dsym[0x0000000100000e66], unresolved, hit count = 0

Hide Details

Hide Details

Hide Details

runCmd: thread backtrace output: * thread #1, queue = 'com.apple.main-thread', stop reason = breakpoint 1.1 * frame #0: 0x0000000109749e66 test_step_over_3_times_dsym`b(val=1) at main2.cpp:21:17 frame #1: 0x0000000109749e0d test_step_over_3_times_dsym`a(val=1) at main2.cpp:11:16 frame #2: 0x0000000109749ee0 test_step_over_3_times_dsym`main(argc=1, argv=0x00007ffee64b6468) at main2.cpp:36:14 frame #3: 0x00007fff67d6a085 libdyld.dylib`start + 1 frame #4: 0x00007fff67d6a085 libdyld.dylib`start + 1

Hide Details

Hide Details

runCmd: thread backtrace output: * thread #1, queue = 'com.apple.main-thread', stop reason = step over * frame #0: 0x0000000109749e9d test_step_over_3_times_dsym`b(val=1) at main2.cpp:26:12 frame #1: 0x0000000109749e0d test_step_over_3_times_dsym`a(val=1) at main2.cpp:11:16 frame #2: 0x0000000109749ee0 test_step_over_3_times_dsym`main(argc=1, argv=0x00007ffee64b6468) at main2.cpp:36:14 frame #3: 0x00007fff67d6a085 libdyld.dylib`start + 1 frame #4: 0x00007fff67d6a085 libdyld.dylib`start + 1

Hide Details

Hide Details

<bound method SBProcess.Kill of <lldb.SBProcess; proxy of <Swig Object of type 'lldb::SBProcess *' at 0x1249afde0> >>: success

Hide Details

PASS: LLDB (/Users/buildslave/jenkins/workspace/lldb-cmake-sanitized/lldb-build/bin/clang-11-x86_64) :: test_step_over_3_times_dsym (TestThreadAPI.ThreadAPITestCase) runCmd: settings clear -all output:

Hide Details

runCmd: settings set symbols.enable-external-lookup false output:

Hide Details

runCmd: settings set target.auto-apply-fixits false output:

Hide Details

runCmd: settings set plugin.process.gdb-remote.packet-timeout 60 output:

Hide Details

runCmd: settings set symbols.clang-modules-cache-path "/Users/buildslave/jenkins/workspace/lldb-cmake-sanitized/lldb-build/lldb-test-build.noindex/module-cache-lldb/lldb-api" output:

Hide Details

runCmd: settings set use-color false output:

Hide Details

runCmd: setting set target.prefer-dynamic-value no-dynamic-values output:

Hide Details

runCmd: settings set target.env-vars ASAN_OPTIONS=detect_stack_use_after_return=1 DYLD_INSERT_LIBRARIES=/Users/buildslave/jenkins/workspace/lldb-cmake-sanitized/host-compiler/lib/clang/11.0.0/lib/darwin/libclang_rt.asan_osx_dynamic.dylib output:

Hide Details

runCmd: breakpoint list output: Current breakpoints: 1: file = 'main2.cpp', line = 21, exact_match = 0, locations = 1 1.1: where = test_step_over_3_times_dwarf`b(int) + 22 at main2.cpp:21:17, address = test_step_over_3_times_dwarf[0x0000000100000e66], unresolved, hit count = 0

Hide Details

Hide Details

Hide Details

runCmd: thread backtrace output: * thread #1, queue = 'com.apple.main-thread', stop reason = breakpoint 1.1 * frame #0: 0x0000000104f0be66 test_step_over_3_times_dwarf`b(val=1) at main2.cpp:21:17 frame #1: 0x0000000104f0be0d test_step_over_3_times_dwarf`a(val=1) at main2.cpp:11:16 frame #2: 0x0000000104f0bee0 test_step_over_3_times_dwarf`main(argc=1, argv=0x00007ffeeacf4460) at main2.cpp:36:14 frame #3: 0x00007fff67d6a085 libdyld.dylib`start + 1

Hide Details

Hide Details

runCmd: thread backtrace output: * thread #1, queue = 'com.apple.main-thread', stop reason = step over * frame #0: 0x0000000104f0be9d test_step_over_3_times_dwarf`b(val=1) at main2.cpp:26:12 frame #1: 0x0000000104f0be0d test_step_over_3_times_dwarf`a(val=1) at main2.cpp:11:16 frame #2: 0x0000000104f0bee0 test_step_over_3_times_dwarf`main(argc=1, argv=0x00007ffeeacf4460) at main2.cpp:36:14 frame #3: 0x00007fff67d6a085 libdyld.dylib`start + 1

Hide Details

Hide Details

<bound method SBProcess.Kill of <lldb.SBProcess; proxy of <Swig Object of type 'lldb::SBProcess *' at 0x10de40990> >>: success

Hide Details

PASS: LLDB (/Users/buildslave/jenkins/workspace/lldb-cmake-sanitized/lldb-build/bin/clang-11-x86_64) :: test_step_over_3_times_dwarf (TestThreadAPI.ThreadAPITestCase) UNSUPPORTED: LLDB (/Users/buildslave/jenkins/workspace/lldb-cmake-sanitized/lldb-build/bin/clang-11-x86_64) :: test_step_over_3_times_dwo (TestThreadAPI.ThreadAPITestCase) (test case does not fall in any category of interest for this run) runCmd: settings clear -all output:

Hide Details

runCmd: settings set symbols.enable-external-lookup false output:

Hide Details

runCmd: settings set target.auto-apply-fixits false output:

Hide Details

runCmd: settings set plugin.process.gdb-remote.packet-timeout 60 output:

Hide Details

runCmd: settings set symbols.clang-modules-cache-path "/Users/buildslave/jenkins/workspace/lldb-cmake-sanitized/lldb-build/lldb-test-build.noindex/module-cache-lldb/lldb-api" output:

Hide Details

runCmd: settings set use-color false output:

Hide Details

runCmd: setting set target.prefer-dynamic-value no-dynamic-values output:

Hide Details

runCmd: settings set target.env-vars ASAN_OPTIONS=detect_stack_use_after_return=1 DYLD_INSERT_LIBRARIES=/Users/buildslave/jenkins/workspace/lldb-cmake-sanitized/host-compiler/lib/clang/11.0.0/lib/darwin/libclang_rt.asan_osx_dynamic.dylib output:

Hide Details

runCmd: breakpoint list output: Current breakpoints: 1: file = 'main2.cpp', line = 21, exact_match = 0, locations = 1 1.1: where = test_step_over_3_times_gmodules`b(int) + 22 at main2.cpp:21:17, address = test_step_over_3_times_gmodules[0x0000000100000e66], unresolved, hit count = 0

Hide Details

Hide Details

Hide Details

runCmd: thread backtrace output: * thread #1, queue = 'com.apple.main-thread', stop reason = breakpoint 1.1 * frame #0: 0x0000000102ae4e66 test_step_over_3_times_gmodules`b(val=1) at main2.cpp:21:17 frame #1: 0x0000000102ae4e0d test_step_over_3_times_gmodules`a(val=1) at main2.cpp:11:16 frame #2: 0x0000000102ae4ee0 test_step_over_3_times_gmodules`main(argc=1, argv=0x00007ffeed11b458) at main2.cpp:36:14 frame #3: 0x00007fff67d6a085 libdyld.dylib`start + 1 frame #4: 0x00007fff67d6a085 libdyld.dylib`start + 1

Hide Details

Hide Details

runCmd: thread backtrace output: * thread #1, queue = 'com.apple.main-thread', stop reason = step over * frame #0: 0x0000000102ae4e9d test_step_over_3_times_gmodules`b(val=1) at main2.cpp:26:12 frame #1: 0x0000000102ae4e0d test_step_over_3_times_gmodules`a(val=1) at main2.cpp:11:16 frame #2: 0x0000000102ae4ee0 test_step_over_3_times_gmodules`main(argc=1, argv=0x00007ffeed11b458) at main2.cpp:36:14 frame #3: 0x00007fff67d6a085 libdyld.dylib`start + 1 frame #4: 0x00007fff67d6a085 libdyld.dylib`start + 1

Hide Details

Hide Details

<bound method SBProcess.Kill of <lldb.SBProcess; proxy of <Swig Object of type 'lldb::SBProcess *' at 0x124bae2d0> >>: success

Hide Details

PASS: LLDB (/Users/buildslave/jenkins/workspace/lldb-cmake-sanitized/lldb-build/bin/clang-11-x86_64) :: test_step_over_3_times_gmodules (TestThreadAPI.ThreadAPITestCase) Restore dir to: /Users/buildslave/jenkins/workspace/lldb-cmake-sanitized/lldb-build/tools/lldb/test ====================================================================== ERROR: test_step_out_of_malloc_into_function_b_dsym (TestThreadAPI.ThreadAPITestCase) Test Python SBThread.StepOut() API to step out of a malloc call where the call site is at function b(). ---------------------------------------------------------------------- Traceback (most recent call last): File "/Users/buildslave/jenkins/workspace/lldb-cmake-sanitized/llvm-project/lldb/packages/Python/lldbsuite/test/lldbtest.py", line 1751, in test_method return attrvalue(self) File "/Users/buildslave/jenkins/workspace/lldb-cmake-sanitized/llvm-project/lldb/packages/Python/lldbsuite/test/decorators.py", line 110, in wrapper func(*args, **kwargs) File "/Users/buildslave/jenkins/workspace/lldb-cmake-sanitized/llvm-project/lldb/packages/Python/lldbsuite/test/decorators.py", line 110, in wrapper func(*args, **kwargs) File "/Users/buildslave/jenkins/workspace/lldb-cmake-sanitized/llvm-project/lldb/packages/Python/lldbsuite/test/decorators.py", line 110, in wrapper func(*args, **kwargs) File "/Users/buildslave/jenkins/workspace/lldb-cmake-sanitized/llvm-project/lldb/test/API/python_api/thread/TestThreadAPI.py", line 50, in test_step_out_of_malloc_into_function_b self.step_out_of_malloc_into_function_b(self.exe_name) File "/Users/buildslave/jenkins/workspace/lldb-cmake-sanitized/llvm-project/lldb/test/API/python_api/thread/TestThreadAPI.py", line 157, in step_out_of_malloc_into_function_b thread.IsValid(), AttributeError: 'NoneType' object has no attribute 'IsValid' Config=x86_64-/Users/buildslave/jenkins/workspace/lldb-cmake-sanitized/lldb-build/bin/clang-11 ====================================================================== ERROR: test_step_out_of_malloc_into_function_b_dwarf (TestThreadAPI.ThreadAPITestCase) Test Python SBThread.StepOut() API to step out of a malloc call where the call site is at function b(). ---------------------------------------------------------------------- Traceback (most recent call last): File "/Users/buildslave/jenkins/workspace/lldb-cmake-sanitized/llvm-project/lldb/packages/Python/lldbsuite/test/lldbtest.py", line 1751, in test_method return attrvalue(self) File "/Users/buildslave/jenkins/workspace/lldb-cmake-sanitized/llvm-project/lldb/packages/Python/lldbsuite/test/decorators.py", line 110, in wrapper func(*args, **kwargs) File "/Users/buildslave/jenkins/workspace/lldb-cmake-sanitized/llvm-project/lldb/packages/Python/lldbsuite/test/decorators.py", line 110, in wrapper func(*args, **kwargs) File "/Users/buildslave/jenkins/workspace/lldb-cmake-sanitized/llvm-project/lldb/packages/Python/lldbsuite/test/decorators.py", line 110, in wrapper func(*args, **kwargs) File "/Users/buildslave/jenkins/workspace/lldb-cmake-sanitized/llvm-project/lldb/test/API/python_api/thread/TestThreadAPI.py", line 50, in test_step_out_of_malloc_into_function_b self.step_out_of_malloc_into_function_b(self.exe_name) File "/Users/buildslave/jenkins/workspace/lldb-cmake-sanitized/llvm-project/lldb/test/API/python_api/thread/TestThreadAPI.py", line 157, in step_out_of_malloc_into_function_b thread.IsValid(), AttributeError: 'NoneType' object has no attribute 'IsValid' Config=x86_64-/Users/buildslave/jenkins/workspace/lldb-cmake-sanitized/lldb-build/bin/clang-11 ====================================================================== ERROR: test_step_out_of_malloc_into_function_b_gmodules (TestThreadAPI.ThreadAPITestCase) Test Python SBThread.StepOut() API to step out of a malloc call where the call site is at function b(). ---------------------------------------------------------------------- Traceback (most recent call last): File "/Users/buildslave/jenkins/workspace/lldb-cmake-sanitized/llvm-project/lldb/packages/Python/lldbsuite/test/lldbtest.py", line 1751, in test_method return attrvalue(self) File "/Users/buildslave/jenkins/workspace/lldb-cmake-sanitized/llvm-project/lldb/packages/Python/lldbsuite/test/decorators.py", line 110, in wrapper func(*args, **kwargs) File "/Users/buildslave/jenkins/workspace/lldb-cmake-sanitized/llvm-project/lldb/packages/Python/lldbsuite/test/decorators.py", line 110, in wrapper func(*args, **kwargs) File "/Users/buildslave/jenkins/workspace/lldb-cmake-sanitized/llvm-project/lldb/packages/Python/lldbsuite/test/decorators.py", line 110, in wrapper func(*args, **kwargs) File "/Users/buildslave/jenkins/workspace/lldb-cmake-sanitized/llvm-project/lldb/test/API/python_api/thread/TestThreadAPI.py", line 50, in test_step_out_of_malloc_into_function_b self.step_out_of_malloc_into_function_b(self.exe_name) File "/Users/buildslave/jenkins/workspace/lldb-cmake-sanitized/llvm-project/lldb/test/API/python_api/thread/TestThreadAPI.py", line 157, in step_out_of_malloc_into_function_b thread.IsValid(), AttributeError: 'NoneType' object has no attribute 'IsValid' Config=x86_64-/Users/buildslave/jenkins/workspace/lldb-cmake-sanitized/lldb-build/bin/clang-11 ---------------------------------------------------------------------- Ran 20 tests in 40.550s

Hide Details

RESULT: FAILED (12 passes, 0 failures, 3 errors, 5 skipped, 0 expected failures, 0 unexpected successes)

Hide Details

--

Hide Details

******************** PASS: lldb-unit :: Utility/./UtilityTests/StructuredDataTest.StringDump (1588 of 1972) PASS: lldb-api :: lang/objc/ivar-IMP/TestObjCiVarIMP.py (1589 of 1972) PASS: lldb-unit :: Utility/./UtilityTests/ConstStringTest.UpdateMangledCounterpart (1590 of 1972) PASS: lldb-unit :: Utility/./UtilityTests/ConstStringTest.NullAndEmptyStates (1591 of 1972) PASS: lldb-unit :: Utility/./UtilityTests/OptionsWithRawTest.ArgsButNoLeadingDash (1592 of 1972) PASS: lldb-api :: functionalities/data-formatter/nsarraysynth/TestNSArraySynthetic.py (1593 of 1972) UNSUPPORTED: lldb-api :: functionalities/breakpoint/breakpoint_in_delayslot/TestAvoidBreakpointInDelaySlot.py (1594 of 1972) PASS: lldb-unit :: DataFormatter/./LLDBFormatterTests/FormatManagerTests.CompatibleLangs (1595 of 1972) PASS: lldb-unit :: Utility/./UtilityTests/SubsystemRAIITest.SubsystemWithErrorFailure (1596 of 1972) PASS: lldb-api :: commands/frame/recognizer/TestFrameRecognizer.py (1597 of 1972) PASS: lldb-unit :: Utility/./UtilityTests/ArchSpecTest.OperatorBool (1598 of 1972) PASS: lldb-unit :: Utility/./UtilityTests/TimerTest.CategoryTimesStats (1599 of 1972) PASS: lldb-api :: lang/cpp/class_types/TestClassTypes.py (1600 of 1972) PASS: lldb-unit :: Process/minidump/./LLDBMinidumpTests/MinidumpParserTest.MinidumpDuplicateModuleMinAddress (1601 of 1972) PASS: lldb-api :: lang/cpp/gmodules-templates/TestGModules.py (1602 of 1972) PASS: lldb-unit :: Utility/./UtilityTests/OptionsWithRawTest.EmptySuffixSingleWhitespace (1603 of 1972) PASS: lldb-api :: commands/expression/import-std-module/vector-dbg-info-content/TestDbgInfoContentVectorFromStdModule.py (1604 of 1972) PASS: lldb-unit :: Host/./HostTests/ConnectionFileDescriptorTest.TCPGetURIv6 (1605 of 1972) PASS: lldb-unit :: ScriptInterpreter/Python/./ScriptInterpreterPythonTests/PythonDataObjectsTest.TestPythonDictionaryManipulation (1606 of 1972) PASS: lldb-unit :: Utility/./UtilityTests/StreamTest.PutSLEB128 (1607 of 1972) PASS: lldb-unit :: Utility/./UtilityTests/RangeTest.Constructor (1608 of 1972) PASS: lldb-api :: commands/expression/persistent_types/TestPersistentTypes.py (1609 of 1972) UNSUPPORTED: lldb-api :: benchmarks/stepping/TestSteppingSpeed.py (1610 of 1972) UNSUPPORTED: lldb-api :: functionalities/tsan/multiple/TestTsanMultiple.py (1611 of 1972) PASS: lldb-api :: functionalities/completion/TestCompletion.py (1612 of 1972) PASS: lldb-unit :: Utility/./UtilityTests/AnsiTerminal.Basic (1613 of 1972) PASS: lldb-api :: lang/c/anonymous/TestAnonymous.py (1614 of 1972) PASS: lldb-api :: commands/expression/ir-interpreter/TestIRInterpreter.py (1615 of 1972) UNSUPPORTED: lldb-api :: tools/lldb-server/signal-filtering/TestGdbRemote_QPassSignals.py (1616 of 1972) PASS: lldb-api :: api/listeners/TestListener.py (1617 of 1972) UNSUPPORTED: lldb-shell :: Register/x86-ymm-write.test (1618 of 1972) UNSUPPORTED: lldb-api :: python_api/disassemble-raw-data/TestDisassemble_VST1_64.py (1619 of 1972) PASS: lldb-shell :: Heap/heap-cstr.test (1620 of 1972) PASS: lldb-unit :: Expression/./ExpressionTests/CppModuleConfigurationTest.AmbiguousCLib (1621 of 1972) PASS: lldb-api :: functionalities/thread/concurrent_events/TestConcurrentTwoWatchpointThreads.py (1622 of 1972) PASS: lldb-api :: lang/objc/foundation/TestObjCMethodsNSError.py (1623 of 1972) PASS: lldb-unit :: ScriptInterpreter/Python/./ScriptInterpreterPythonTests/PythonDataObjectsTest.TestRun (1624 of 1972) PASS: lldb-unit :: Language/Highlighting/./HighlighterTests/HighlighterTest.ClangPreserveNewLine (1625 of 1972) PASS: lldb-api :: commands/expression/import-std-module/vector/TestVectorFromStdModule.py (1626 of 1972) PASS: lldb-api :: driver/batch_mode/TestBatchMode.py (1627 of 1972) PASS: lldb-api :: commands/expression/static-initializers/TestStaticInitializers.py (1628 of 1972) UNSUPPORTED: lldb-api :: functionalities/data-formatter/data-formatter-stl/libstdcpp/map/TestDataFormatterStdMap.py (1629 of 1972) PASS: lldb-api :: commands/target/stop-hooks/TestStopHooks.py (1630 of 1972) UNSUPPORTED: lldb-api :: benchmarks/libcxxlist/TestBenchmarkLibcxxList.py (1631 of 1972) PASS: lldb-api :: functionalities/data-formatter/data-formatter-stl/libcxx/list/TestDataFormatterLibcxxList.py (1632 of 1972) PASS: lldb-unit :: Utility/./UtilityTests/StreamTest.PutHex16ByteOrderBig (1633 of 1972) PASS: lldb-shell :: SymbolFile/DWARF/debug_loc.s (1634 of 1972) PASS: lldb-unit :: Symbol/./SymbolTests/LineEntryTest.GetSameLineContiguousAddressRangeNoInlines (1635 of 1972) PASS: lldb-api :: lang/cpp/dynamic-value/TestCppValueCast.py (1636 of 1972) PASS: lldb-unit :: Utility/./UtilityTests/AnsiTerminal.WhiteSpace (1637 of 1972) PASS: lldb-api :: python_api/frame/TestFrames.py (1638 of 1972) PASS: lldb-api :: commands/expression/radar_9531204/TestPrintfAfterUp.py (1639 of 1972) PASS: lldb-unit :: Host/./HostTests/NativeProcessProtocolTest.ReadCStringFromMemory_MaxSize (1640 of 1972) PASS: lldb-unit :: Utility/./UtilityTests/TimerTest.CategoryTimes (1641 of 1972) UNSUPPORTED: lldb-shell :: Register/x86-64-xmm16-read.test (1642 of 1972) PASS: lldb-unit :: Utility/./UtilityTests/Flags.AnyClear (1643 of 1972) PASS: lldb-unit :: Language/Highlighting/./HighlighterTests/HighlighterTest.ClangCursorPosEndOfLine (1644 of 1972) PASS: lldb-unit :: UnwindAssembly/x86/./UnwindAssemblyx86Tests/Testx86AssemblyInspectionEngine.TestDisassemblyMidFunctionEpilogues (1645 of 1972) PASS: lldb-api :: lang/objc/objc-ivar-stripped/TestObjCIvarStripped.py (1646 of 1972) PASS: lldb-shell :: Reproducer/TestPythonImport.test (1647 of 1972) PASS: lldb-unit :: Host/./HostTests/FileActionTest.Open (1648 of 1972) PASS: lldb-shell :: ObjectFile/ELF/basic-info.yaml (1649 of 1972) PASS: lldb-api :: functionalities/data-formatter/summary-string-onfail/Test-rdar-9974002.py (1650 of 1972) PASS: lldb-api :: functionalities/thread/concurrent_events/TestConcurrentCrashWithWatchpoint.py (1651 of 1972) PASS: lldb-unit :: Host/./HostTests/ProcessLaunchInfoTest.Constructor (1652 of 1972) PASS: lldb-unit :: Utility/./UtilityTests/StructuredDataTest.ParseJSONFromFile (1653 of 1972) PASS: lldb-unit :: Utility/./UtilityTests/StringListTest.SetSize (1654 of 1972) PASS: lldb-unit :: Utility/./UtilityTests/BinaryStreamTest.PutSLEB128MaxValue (1655 of 1972) PASS: lldb-unit :: Expression/./ExpressionTests/DiagnosticManagerTest.GetStringNoDiags (1656 of 1972) PASS: lldb-unit :: Utility/./UtilityTests/ScalarTest.CastOperations (1657 of 1972) PASS: lldb-unit :: Symbol/./SymbolTests/TestTypeSystemClang.TestGetTypeClassDeclType (1658 of 1972) PASS: lldb-unit :: Utility/./UtilityTests/RangeTest.Slide (1659 of 1972) PASS: lldb-unit :: Symbol/./SymbolTests/TestTypeSystemClang.TestGetTypeClassNested (1660 of 1972) PASS: lldb-shell :: SymbolFile/DWARF/dwo-type-in-main-file.s (1661 of 1972) PASS: lldb-unit :: UnwindAssembly/x86/./UnwindAssemblyx86Tests/Testx86AssemblyInspectionEngine.TestPushR15 (1662 of 1972) PASS: lldb-api :: commands/expression/call-throws/TestCallThatThrows.py (1663 of 1972) PASS: lldb-api :: types/TestDoubleTypes.py (1664 of 1972) PASS: lldb-unit :: Utility/./UtilityTests/StringListTest.GetSize (1665 of 1972) PASS: lldb-api :: lang/objc/foundation/TestRuntimeTypes.py (1666 of 1972) PASS: lldb-api :: python_api/value/empty_class/TestValueAPIEmptyClass.py (1667 of 1972) PASS: lldb-api :: tools/lldb-server/TestGdbRemoteExpeditedRegisters.py (1668 of 1972) UNSUPPORTED: lldb-api :: functionalities/tty/TestTerminal.py (1669 of 1972) PASS: lldb-unit :: Utility/./UtilityTests/StringListTest.InsertStringAtIndexStart (1670 of 1972) PASS: lldb-api :: commands/expression/rdar44436068/Test128BitsInteger.py (1671 of 1972) PASS: lldb-unit :: Expression/./ExpressionTests/CppModuleConfigurationTest.AmbiguousLibCpp (1672 of 1972) PASS: lldb-unit :: Expression/./ExpressionTests/DiagnosticManagerTest.FixedExpression (1673 of 1972) PASS: lldb-unit :: Utility/./UtilityTests/StreamTeeTest.CopyConstructor (1674 of 1972) PASS: lldb-unit :: UnwindAssembly/x86/./UnwindAssemblyx86Tests/Testx86AssemblyInspectionEngine.TestPushExtended (1675 of 1972) PASS: lldb-api :: functionalities/thread/concurrent_events/TestConcurrentSignalNWatchNBreak.py (1676 of 1972) PASS: lldb-unit :: Utility/./UtilityTests/RangeTest.ContainsRangeStartingFromZero (1677 of 1972) PASS: lldb-shell :: SymbolFile/DWARF/dir-separator-windows.s (1678 of 1972) PASS: lldb-api :: lang/cpp/exceptions/TestCPPExceptionBreakpoints.py (1679 of 1972) PASS: lldb-unit :: Language/Highlighting/./HighlighterTests/HighlighterTest.Colons (1680 of 1972) PASS: lldb-unit :: debugserver/./debugserverTests/RNBSocket.LoopBackConnectIPv4 (1681 of 1972) PASS: lldb-api :: commands/expression/call-function/TestCallStdStringFunction.py (1682 of 1972) PASS: lldb-unit :: Host/./HostTests/File.GetStreamFromDescriptor (1683 of 1972) PASS: lldb-shell :: SymbolFile/DWARF/debug-types-missing-signature.test (1684 of 1972) PASS: lldb-unit :: Expression/./ExpressionTests/DWARFExpression.DW_OP_convert (1685 of 1972) PASS: lldb-api :: python_api/watchpoint/TestSetWatchpoint.py (1686 of 1972) PASS: lldb-unit :: Expression/./ExpressionTests/CppModuleConfigurationTest.LinuxLocalLibCpp (1687 of 1972) PASS: lldb-shell :: ScriptInterpreter/Python/scripted_breakpoint.test (1688 of 1972) PASS: lldb-api :: functionalities/gdb_remote_client/TestRestartBug.py (1689 of 1972) PASS: lldb-unit :: Utility/./UtilityTests/UriParserTest.Empty (1690 of 1972) PASS: lldb-unit :: Utility/./UtilityTests/LogTest.LLDB_LOG_nullptr (1691 of 1972) PASS: lldb-shell :: ObjectFile/ELF/many-sections.s (1692 of 1972) PASS: lldb-shell :: Breakpoint/case-sensitive.test (1693 of 1972) PASS: lldb-api :: commands/target/create-no-such-arch/TestNoSuchArch.py (1694 of 1972) PASS: lldb-api :: functionalities/thread/step_until/TestStepUntil.py (1695 of 1972) UNSUPPORTED: lldb-shell :: ScriptInterpreter/Lua/watchpoint_callback.test (1696 of 1972) PASS: lldb-unit :: Utility/./UtilityTests/BinaryStreamTest.PutULEB128ThreeBytes (1697 of 1972) PASS: lldb-unit :: Symbol/./SymbolTests/TestTypeSystemClang.TestGetBasicTypeFromEnum (1698 of 1972) PASS: lldb-unit :: Symbol/./SymbolTests/TestTypeSystemClang.TestGetEnumIntegerTypeUnexpectedType (1699 of 1972) PASS: lldb-unit :: Utility/./UtilityTests/StreamTest.PutHex8 (1700 of 1972) PASS: lldb-unit :: SymbolFile/DWARF/./SymbolFileDWARFTests/SymbolFileDWARFTests.TestAbbrevMissingTerminator (1701 of 1972) PASS: lldb-unit :: Utility/./UtilityTests/OptionsWithRawTest.ArgsButNoDelimiter (1702 of 1972) PASS: lldb-unit :: Utility/./UtilityTests/StringListTest.Assignment (1703 of 1972) PASS: lldb-unit :: Utility/./UtilityTests/AnsiTerminal.Empty (1704 of 1972) PASS: lldb-api :: commands/expression/scoped_enums/TestScopedEnumType.py (1705 of 1972) PASS: lldb-unit :: Signals/./SignalsTests/UnixSignalsTest.GetFilteredSignals (1706 of 1972) PASS: lldb-api :: lang/cpp/thread_local/TestThreadLocal.py (1707 of 1972) PASS: lldb-api :: tools/lldb-server/TestGdbRemoteRegisterState.py (1708 of 1972) UNSUPPORTED: lldb-api :: commands/expression/call-restarts/TestCallThatRestarts.py (1709 of 1972) PASS: lldb-shell :: Settings/TestDisableColor.test (1710 of 1972) PASS: lldb-unit :: Utility/./UtilityTests/ScalarTest.Scalar_512 (1711 of 1972) PASS: lldb-unit :: Utility/./UtilityTests/BroadcasterTest.BroadcastEvent (1712 of 1972) PASS: lldb-api :: functionalities/data-formatter/data-formatter-globals/TestDataFormatterGlobals.py (1713 of 1972) PASS: lldb-unit :: SymbolFile/NativePDB/./SymbolFileNativePDBTests/PDBFPOProgramToDWARFExpressionTests.UnresolvedRegisterAssignmentReference (1714 of 1972) PASS: lldb-api :: python_api/sbdata/TestSBData.py (1715 of 1972) UNSUPPORTED: lldb-api :: functionalities/darwin_log/filter/exact_match/category/TestDarwinLogFilterMatchCategory.py (1716 of 1972) PASS: lldb-unit :: Host/./HostTests/SocketTest.TCPListen0ConnectAccept (1717 of 1972) PASS: lldb-api :: python_api/lldbutil/frame/TestFrameUtils.py (1718 of 1972) PASS: lldb-unit :: ScriptInterpreter/Python/./ScriptInterpreterPythonTests/PythonDataObjectsTest.TestGlobalNameResolutionNoDot (1719 of 1972) PASS: lldb-shell :: Reproducer/TestReuseDirectory.test (1720 of 1972) PASS: lldb-unit :: Expression/./ExpressionTests/DiagnosticManagerTest.GetStringPreserveOrder (1721 of 1972) PASS: lldb-api :: commands/expression/issue_11588/Test11588.py (1722 of 1972) PASS: lldb-api :: functionalities/data-formatter/cstring-utf8-summary/TestCstringUnicode.py (1723 of 1972) PASS: lldb-unit :: Interpreter/./InterpreterTests/CompletionTest.DirCompletionUsername (1724 of 1972) PASS: lldb-api :: commands/expression/call-function/TestCallUserDefinedFunction.py (1725 of 1972) PASS: lldb-unit :: Expression/./ExpressionTests/DiagnosticManagerTest.PutString (1726 of 1972) PASS: lldb-unit :: Symbol/./SymbolTests/TestTypeSystemClang.TestGetTypeClassTypeOfExpr (1727 of 1972) PASS: lldb-api :: functionalities/data-formatter/data-formatter-stl/libstdcpp/unique_ptr/invalid/TestDataFormatterInvalidStdUniquePtr.py (1728 of 1972) PASS: lldb-shell :: Reproducer/TestWorkingDir.test (1729 of 1972) PASS: lldb-api :: functionalities/data-formatter/data-formatter-smart-array/TestDataFormatterSmartArray.py (1730 of 1972) PASS: lldb-api :: python_api/lldbutil/iter/TestRegistersIterator.py (1731 of 1972) PASS: lldb-unit :: Utility/./UtilityTests/ProcessInstanceInfo.Dump (1732 of 1972) PASS: lldb-unit :: Process/minidump/./LLDBMinidumpTests/MinidumpParserTest.GetThreadContext_x86_64 (1733 of 1972) PASS: lldb-api :: lang/objc/modules-inline-functions/TestModulesInlineFunctions.py (1734 of 1972) PASS: lldb-api :: commands/expression/import-std-module/queue/TestQueueFromStdModule.py (1735 of 1972) PASS: lldb-unit :: Utility/./UtilityTests/OptionsWithRawTest.WhitespaceInput (1736 of 1972) PASS: lldb-unit :: Utility/./UtilityTests/StringLexerTest.AdvanceIf (1737 of 1972) PASS: lldb-unit :: Utility/./UtilityTests/RegularExpression.Match (1738 of 1972) PASS: lldb-api :: functionalities/inferior-assert/TestInferiorAssert.py (1739 of 1972) PASS: lldb-api :: functionalities/breakpoint/breakpoint_conditions/TestBreakpointConditions.py (1740 of 1972) PASS: lldb-unit :: Utility/./UtilityTests/IndexToObjectTest.ObjectForIndex (1741 of 1972) PASS: lldb-api :: python_api/target/TestTargetAPI.py (1742 of 1972) PASS: lldb-unit :: Utility/./UtilityTests/UriParserTest.LongPath (1743 of 1972) PASS: lldb-api :: commands/watchpoints/watchpoint_disable/TestWatchpointDisable.py (1744 of 1972) PASS: lldb-unit :: Utility/./UtilityTests/SerializationRountripTest.SerializeDeserializeCStringArrayNullptr (1745 of 1972) PASS: lldb-unit :: Process/gdb-remote/./ProcessGdbRemoteTests/GDBRemoteClientBaseTest.SendContinueDelegateStructuredDataReceipt (1746 of 1972) PASS: lldb-api :: types/TestShortType.py (1747 of 1972) PASS: lldb-unit :: Utility/./UtilityTests/TimerTest.CategoryTimes2 (1748 of 1972) PASS: lldb-unit :: Language/Highlighting/./HighlighterTests/HighlighterTest.ClangIdentifiers (1749 of 1972) PASS: lldb-shell :: ScriptInterpreter/None/import_module.test (1750 of 1972) PASS: lldb-api :: lang/objc/objc-optimized/TestObjcOptimized.py (1751 of 1972) PASS: lldb-unit :: Process/gdb-remote/./ProcessGdbRemoteTests/GDBRemoteClientBaseTest.SendPacketAndReceiveResponseWithOutputSupport (1752 of 1972) PASS: lldb-shell :: ObjectFile/wasm/embedded-debug-sections.yaml (1753 of 1972) PASS: lldb-unit :: Platform/./LLDBPlatformTests/PlatformDarwinTest.GetSDKNameForType (1754 of 1972) PASS: lldb-api :: functionalities/data-formatter/data-formatter-script/TestDataFormatterScript.py (1755 of 1972) PASS: lldb-api :: commands/expression/argument_passing_restrictions/TestArgumentPassingRestrictions.py (1756 of 1972) PASS: lldb-unit :: Utility/./UtilityTests/StringLexerTest.NextIfList (1757 of 1972) PASS: lldb-api :: functionalities/thread/concurrent_events/TestConcurrentTwoBreakpointsOneSignal.py (1758 of 1972) PASS: lldb-unit :: Utility/./UtilityTests/NameMatchesTest.Ignore (1759 of 1972) PASS: lldb-api :: lang/c/set_values/TestSetValues.py (1760 of 1972) PASS: lldb-unit :: Utility/./UtilityTests/StateTest.Formatv (1761 of 1972) PASS: lldb-unit :: Utility/./UtilityTests/RangeDataVector.FindEntryIndexesThatContain_Overlap (1762 of 1972) PASS: lldb-api :: functionalities/backticks/TestBackticksWithoutATarget.py (1763 of 1972) PASS: lldb-api :: tools/lldb-server/TestGdbRemote_qThreadStopInfo.py (1764 of 1972) PASS: lldb-shell :: ObjectFile/PECOFF/sections.yaml (1765 of 1972) PASS: lldb-unit :: Process/gdb-remote/./ProcessGdbRemoteTests/GDBRemoteCommunicationClientTest.GetMemoryRegionInfoInvalidResponse (1766 of 1972) UNSUPPORTED: lldb-api :: benchmarks/expression/TestRepeatedExprs.py (1767 of 1972) PASS: lldb-api :: commands/watchpoints/watchpoint_size/TestWatchpointSizes.py (1768 of 1972) PASS: lldb-unit :: SymbolFile/NativePDB/./SymbolFileNativePDBTests/PDBFPOProgramToDWARFExpressionTests.InvalidAssignmentMultiple (1769 of 1972) PASS: lldb-api :: macosx/add-dsym/TestAddDsymMidExecutionCommand.py (1770 of 1972) PASS: lldb-unit :: Host/./HostTests/FileSystemTest.MakeAbsolute (1771 of 1972) PASS: lldb-shell :: SymbolFile/DWARF/split-dwarf-multiple-cu.ll (1772 of 1972) PASS: lldb-api :: lang/cpp/offsetof/TestOffsetofCpp.py (1773 of 1972) PASS: lldb-api :: commands/target/dump-symtab-demangle/TestDumpSymtabDemangle.py (1774 of 1972) PASS: lldb-api :: functionalities/signal/handle-abrt/TestHandleAbort.py (1775 of 1972) UNSUPPORTED: lldb-shell :: ScriptInterpreter/Lua/independent_state.test (1776 of 1972) PASS: lldb-unit :: Target/./TargetTests/ExecutionContextTest.GetByteOrderProcess (1777 of 1972) PASS: lldb-api :: lang/cpp/wchar_t/TestCxxWCharT.py (1778 of 1972) PASS: lldb-api :: functionalities/data-formatter/type_summary_list_arg/TestTypeSummaryListArg.py (1779 of 1972) PASS: lldb-unit :: Process/minidump/./LLDBMinidumpTests/MinidumpParserTest.GetMemory (1780 of 1972) PASS: lldb-unit :: UnwindAssembly/x86/./UnwindAssemblyx86Tests/Testx86AssemblyInspectionEngine.TestPushEDX (1781 of 1972) PASS: lldb-unit :: ScriptInterpreter/Python/./ScriptInterpreterPythonTests/PythonDataObjectsTest.TestResetting (1782 of 1972) PASS: lldb-shell :: SymbolFile/DWARF/dwp-separate-debug-file.cpp (1783 of 1972) PASS: lldb-unit :: Utility/./UtilityTests/RangeTest.Copy (1784 of 1972) PASS: lldb-shell :: Driver/TestFile.test (1785 of 1972) PASS: lldb-api :: tools/lldb-server/TestGdbRemoteProcessInfo.py (1786 of 1972) PASS: lldb-unit :: Signals/./SignalsTests/UnixSignalsTest.VersionChange (1787 of 1972) PASS: lldb-unit :: UnwindAssembly/x86/./UnwindAssemblyx86Tests/Testx86AssemblyInspectionEngine.TestPushEBP (1788 of 1972) PASS: lldb-unit :: Utility/./UtilityTests/StreamTest.ChangingByteOrder (1789 of 1972) PASS: lldb-api :: lang/cpp/stl/TestStdCXXDisassembly.py (1790 of 1972) PASS: lldb-shell :: Commands/command-regex-delete.test (1791 of 1972) PASS: lldb-unit :: UnwindAssembly/x86/./UnwindAssemblyx86Tests/Testx86AssemblyInspectionEngine.TestPushR14 (1792 of 1972) PASS: lldb-unit :: ScriptInterpreter/Python/./ScriptInterpreterPythonTests/PythonDataObjectsTest.TestPythonBoolean (1793 of 1972) PASS: lldb-unit :: Utility/./UtilityTests/StringExtractorTest.GetHexU8_Exact_NoEof (1794 of 1972) PASS: lldb-unit :: Utility/./UtilityTests/ArgsTest.TestMultipleArgs (1795 of 1972) PASS: lldb-api :: functionalities/data-formatter/setvaluefromcstring/TestSetValueFromCString.py (1796 of 1972) PASS: lldb-unit :: Expression/./ExpressionTests/CppModuleConfigurationTest.MissingUsrInclude (1797 of 1972) PASS: lldb-shell :: ObjectFile/Breakpad/uuid-matching-mac.test (1798 of 1972) PASS: lldb-unit :: Utility/./UtilityTests/LogChannelEnabledTest.LogGetLogThread (1799 of 1972) UNSUPPORTED: lldb-api :: commands/gui/basic/TestGuiBasic.py (1800 of 1972) UNSUPPORTED: lldb-shell :: SymbolFile/PDB/class-layout.test (1801 of 1972) PASS: lldb-api :: functionalities/gdb_remote_client/TestArmRegisterDefinition.py (1802 of 1972) UNSUPPORTED: lldb-shell :: Register/x86-64-zmm-read.test (1803 of 1972) PASS: lldb-unit :: Utility/./UtilityTests/StreamTest.PutHex64ByteOrderLittle (1804 of 1972) PASS: lldb-shell :: SymbolFile/NativePDB/function-types-builtins.cpp (1805 of 1972) PASS: lldb-unit :: Utility/./UtilityTests/StreamTest.Indent (1806 of 1972) PASS: lldb-api :: functionalities/tail_call_frames/ambiguous_tail_call_seq1/TestAmbiguousTailCallSeq1.py (1807 of 1972) PASS: lldb-shell :: SymbolFile/NativePDB/function-types-classes.cpp (1808 of 1972) PASS: lldb-api :: python_api/disassemble-raw-data/TestDisassembleRawData.py (1809 of 1972) PASS: lldb-unit :: debugserver/./debugserverTests/JSON.Parse (1810 of 1972) PASS: lldb-unit :: Interpreter/./InterpreterTests/OptionArgParserTest.toChar (1811 of 1972) PASS: lldb-shell :: SymbolFile/DWARF/dwarf5-atomic.s (1812 of 1972) PASS: lldb-unit :: Host/./HostTests/MainLoopTest.DetectsEOF (1813 of 1972) PASS: lldb-unit :: Utility/./UtilityTests/FileSpecTest.FileAndDirectoryComponents (1814 of 1972) PASS: lldb-unit :: Symbol/./SymbolTests/TestTypeSystemClang.TestFunctionTemplateInRecordConstruction (1815 of 1972) PASS: lldb-unit :: ObjectFile/ELF/./ObjectFileELFTests/ObjectFileELFTest.GetSymtab_NoSymEntryPointArmThumbAddressClass (1816 of 1972) PASS: lldb-api :: lang/c/inlines/TestRedefinitionsInInlines.py (1817 of 1972) PASS: lldb-shell :: SymbolFile/DWARF/debug_rnglists-dwo.s (1818 of 1972) PASS: lldb-api :: types/TestFloatTypesExpr.py (1819 of 1972) PASS: lldb-unit :: Utility/./UtilityTests/StringExtractorTest.GetU32BigEndian (1820 of 1972) PASS: lldb-unit :: debugserver/./debugserverTests/RNBSocket.AnyListen (1821 of 1972) PASS: lldb-unit :: Utility/./UtilityTests/ConstStringTest.MangledCounterpart (1822 of 1972) PASS: lldb-shell :: ObjectFile/ELF/minidebuginfo-corrupt-xz.yaml (1823 of 1972) PASS: lldb-api :: lang/objc/objc++/TestObjCXX.py (1824 of 1972) PASS: lldb-unit :: Utility/./UtilityTests/BinaryStreamTest.PutSLEB128NineBytes (1825 of 1972) PASS: lldb-api :: lang/c/function_types/TestFunctionTypes.py (1826 of 1972) UNSUPPORTED: lldb-api :: lang/cpp/static_members/TestCPPStaticMembers.py (1827 of 1972) PASS: lldb-unit :: Utility/./UtilityTests/UUIDTest.RelationalOperators (1828 of 1972) UNSUPPORTED: lldb-api :: lang/cpp/printf/TestPrintf.py (1829 of 1972) PASS: lldb-unit :: Utility/./UtilityTests/BinaryStreamTest.PutSLEB128SevenBytes (1830 of 1972) PASS: lldb-api :: lang/c/stepping/TestThreadStepping.py (1831 of 1972) PASS: lldb-unit :: Host/./HostTests/NativeProcessProtocolTest.ReadMemoryWithoutTrap (1832 of 1972) PASS: lldb-api :: commands/process/launch-with-shellexpand/TestLaunchWithShellExpand.py (1833 of 1972) PASS: lldb-unit :: Utility/./UtilityTests/StreamTeeTest.Constructor2Streams (1834 of 1972) PASS: lldb-shell :: Driver/TestRepl.test (1835 of 1972) PASS: lldb-api :: types/TestRecursiveTypes.py (1836 of 1972) PASS: lldb-unit :: Utility/./UtilityTests/StringListTest.LongestCommonPrefix (1837 of 1972) PASS: lldb-api :: commands/expression/completion-crash-incomplete-record/TestCompletionCrashIncompleteRecord.py (1838 of 1972) PASS: lldb-api :: lang/cpp/stl/TestSTL.py (1839 of 1972) PASS: lldb-api :: tools/lldb-server/inferior-crash/TestGdbRemoteSegFault.py (1840 of 1972) PASS: lldb-api :: lang/objc/foundation/TestConstStrings.py (1841 of 1972) UNSUPPORTED: lldb-api :: functionalities/signal/handle-segv/TestHandleSegv.py (1842 of 1972) PASS: lldb-api :: tools/lldb-server/commandline/TestStubReverseConnect.py (1843 of 1972) PASS: lldb-shell :: ObjectFile/MachO/symtab.yaml (1844 of 1972) PASS: lldb-api :: lang/c/modules/TestCModules.py (1845 of 1972) PASS: lldb-unit :: Utility/./UtilityTests/StringExtractorTest.GetNameColonValueNoColon (1846 of 1972) PASS: lldb-api :: lang/objc/print-obj/TestPrintObj.py (1847 of 1972) PASS: lldb-api :: lang/cpp/char1632_t/TestChar1632T.py (1848 of 1972) PASS: lldb-unit :: Utility/./UtilityTests/ArgsTest.GetArgumentArrayRef (1849 of 1972) PASS: lldb-unit :: Utility/./UtilityTests/StringExtractorTest.GetHexU8_InvalidHex (1850 of 1972) PASS: lldb-unit :: Utility/./UtilityTests/StreamTest.PutRawBytesToMixedEndian (1851 of 1972) PASS: lldb-api :: commands/expression/import-std-module/forward_list-dbg-info-content/TestDbgInfoContentForwardListFromStdModule.py (1852 of 1972) PASS: lldb-api :: python_api/function_symbol/TestSymbolAPI.py (1853 of 1972) PASS: lldb-unit :: Utility/./UtilityTests/StreamTeeTest.Flush (1854 of 1972) PASS: lldb-shell :: Host/TestCustomShell.test (1855 of 1972) PASS: lldb-unit :: Process/minidump/./LLDBMinidumpTests/MinidumpParserTest.GetMemoryRegionInfoLinuxMaps (1856 of 1972) PASS: lldb-unit :: Utility/./UtilityTests/EnvironmentTest.EnvpConstruction (1857 of 1972) PASS: lldb-api :: python_api/hello_world/TestHelloWorld.py (1858 of 1972) UNSUPPORTED: lldb-api :: functionalities/data-formatter/data-formatter-stl/libstdcpp/vbool/TestDataFormatterStdVBool.py (1859 of 1972) PASS: lldb-shell :: Quit/TestQuitExitCodeTooManyArgs.test (1860 of 1972) PASS: lldb-unit :: Utility/./UtilityTests/StringListTest.JoinMultiCharSeparator (1861 of 1972) PASS: lldb-api :: commands/expression/import_builtin_fileid/TestImportBuiltinFileID.py (1862 of 1972) PASS: lldb-unit :: Utility/./UtilityTests/StreamTest.PutCStringWithStringRef (1863 of 1972) PASS: lldb-shell :: VSCode/TestOptions.test (1864 of 1972) PASS: lldb-api :: api/log/TestAPILog.py (1865 of 1972) UNSUPPORTED: lldb-api :: functionalities/thread/create_during_step/TestCreateDuringStep.py (1866 of 1972) PASS: lldb-unit :: ScriptInterpreter/Python/./ScriptInterpreterPythonTests/PythonDataObjectsTest.TestPythonTupleInitializerList (1867 of 1972) PASS: lldb-unit :: Process/minidump/./LLDBMinidumpTests/MinidumpParserTest.GetThreadContext_x86_32 (1868 of 1972) PASS: lldb-unit :: Utility/./UtilityTests/RangeDataVector.FindEntryThatContains (1869 of 1972) PASS: lldb-unit :: SymbolFile/NativePDB/./SymbolFileNativePDBTests/PDBFPOProgramToDWARFExpressionTests.MultipleIndependentAssignments (1870 of 1972) PASS: lldb-api :: functionalities/process_group/TestChangeProcessGroup.py (1871 of 1972) PASS: lldb-unit :: Utility/./UtilityTests/StreamTest.SetIndentLevel (1872 of 1972) PASS: lldb-api :: functionalities/data-formatter/format-propagation/TestFormatPropagation.py (1873 of 1972) PASS: lldb-api :: functionalities/postmortem/wow64_minidump/TestWow64MiniDump.py (1874 of 1972) PASS: lldb-api :: commands/process/launch/TestProcessLaunch.py (1875 of 1972) PASS: lldb-api :: python_api/process/read-mem-cstring/TestReadMemCString.py (1876 of 1972) PASS: lldb-api :: commands/expression/persistent_ptr_update/TestPersistentPtrUpdate.py (1877 of 1972) PASS: lldb-api :: functionalities/thread/concurrent_events/TestConcurrentManyCrash.py (1878 of 1972) PASS: lldb-unit :: Host/./HostTests/SocketAddressTest.GetAddressInfo (1879 of 1972) PASS: lldb-unit :: Host/./HostTests/NativeProcessProtocolTest.SetBreakpoint (1880 of 1972) PASS: lldb-unit :: Utility/./UtilityTests/StreamTest.AddressSuffix (1881 of 1972) PASS: lldb-shell :: Quit/TestQuitExitCodeHexA.test (1882 of 1972) PASS: lldb-unit :: Utility/./UtilityTests/ScalarTest.Equality (1883 of 1972) PASS: lldb-unit :: ScriptInterpreter/Python/./ScriptInterpreterPythonTests/PythonDataObjectsTest.TestPythonString (1884 of 1972) PASS: lldb-shell :: SymbolFile/DWARF/childless-compile-unit.s (1885 of 1972) PASS: lldb-api :: functionalities/jitloader_gdb/TestJITLoaderGDB.py (1886 of 1972) PASS: lldb-unit :: ScriptInterpreter/Python/./ScriptInterpreterPythonTests/PythonDataObjectsTest.TestInstanceNameResolutionNoDot (1887 of 1972) PASS: lldb-api :: python_api/process/TestProcessAPI.py (1888 of 1972) PASS: lldb-shell :: SymbolFile/Breakpad/unwind-via-stack-win.test (1889 of 1972) PASS: lldb-api :: functionalities/reproducers/attach/TestReproducerAttach.py (1890 of 1972) PASS: lldb-shell :: SymbolFile/NativePDB/break-by-function.cpp (1891 of 1972) PASS: lldb-unit :: Host/./HostTests/NativeProcessProtocolTest.SetBreakpointFailRead (1892 of 1972) PASS: lldb-shell :: SymbolFile/DWARF/dwp-debug-types.s (1893 of 1972) PASS: lldb-unit :: Utility/./UtilityTests/StatusTest.Formatv (1894 of 1972) PASS: lldb-unit :: UnwindAssembly/x86/./UnwindAssemblyx86Tests/Testx86AssemblyInspectionEngine.TestCALLNextInsn (1895 of 1972) PASS: lldb-unit :: ScriptInterpreter/Python/./ScriptInterpreterPythonTests/PythonDataObjectsTest.TestPythonStringToStr (1896 of 1972) PASS: lldb-unit :: Utility/./UtilityTests/VMRange.Comparison (1897 of 1972) PASS: lldb-unit :: Target/./TargetTests/ModuleCacheTest.GetAndPutUuidExists (1898 of 1972) PASS: lldb-api :: functionalities/optimized_code/TestNoASanExceptionAfterEvalOP_piece.py (1899 of 1972) PASS: lldb-unit :: ScriptInterpreter/Python/./ScriptInterpreterPythonTests/PythonDataObjectsTest.TestPythonBytes (1900 of 1972) PASS: lldb-api :: lang/c/conflicting-symbol/TestConflictingSymbol.py (1901 of 1972) UNSUPPORTED: lldb-shell :: Register/aarch64-gp-read.test (1902 of 1972) PASS: lldb-api :: python_api/class_members/TestSBTypeClassMembers.py (1903 of 1972) UNSUPPORTED: lldb-api :: commands/expression/macros/TestMacros.py (1904 of 1972) PASS: lldb-api :: python_api/interpreter/TestCommandInterpreterAPI.py (1905 of 1972) PASS: lldb-unit :: Utility/./UtilityTests/StreamTeeTest.GetStreamAtIndexOutOfBoundsEmpty (1906 of 1972) PASS: lldb-unit :: Utility/./UtilityTests/StringListTest.CopyList (1907 of 1972) PASS: lldb-unit :: UnwindAssembly/x86/./UnwindAssemblyx86Tests/Testx86AssemblyInspectionEngine.TestPush0 (1908 of 1972) PASS: lldb-api :: functionalities/thread/step_out/TestThreadStepOut.py (1909 of 1972) PASS: lldb-api :: functionalities/data-formatter/data-formatter-stl/libcxx/forward_list/TestDataFormatterLibcxxForwardList.py (1910 of 1972) PASS: lldb-api :: tools/lldb-server/register-reading/TestGdbRemoteGPacket.py (1911 of 1972) UNSUPPORTED: lldb-shell :: Breakpoint/case-insensitive.test (1912 of 1972) PASS: lldb-unit :: Expression/./ExpressionTests/CppModuleConfigurationTest.LibCppV2 (1913 of 1972) PASS: lldb-api :: commands/settings/quoting/TestQuoting.py (1914 of 1972) PASS: lldb-shell :: SymbolFile/DWARF/anon_class_w_and_wo_export_symbols.ll (1915 of 1972) PASS: lldb-unit :: Expression/./ExpressionTests/DiagnosticManagerTest.AddDiagnostic (1916 of 1972) PASS: lldb-shell :: Recognizer/assert.test (1917 of 1972) PASS: lldb-unit :: Symbol/./SymbolTests/TestTypeSystemClang.TestUnifyAccessSpecifiers (1918 of 1972) PASS: lldb-unit :: SymbolFile/NativePDB/./SymbolFileNativePDBTests/PDBFPOProgramToDWARFExpressionTests.UnresolvedCyclicRegisterAssignmentReference (1919 of 1972) PASS: lldb-unit :: Utility/./UtilityTests/ArchSpecTest.MergeFromMachOUnknown (1920 of 1972) PASS: lldb-api :: tools/lldb-server/TestAppleSimulatorOSType.py (1921 of 1972) PASS: lldb-api :: commands/frame/select/TestFrameSelect.py (1922 of 1972) PASS: lldb-unit :: Utility/./UtilityTests/CompletionRequest.TestCompletionOwnership (1923 of 1972) PASS: lldb-unit :: Utility/./UtilityTests/StreamTest.AddressPrefixAndSuffix (1924 of 1972) PASS: lldb-shell :: Reproducer/TestVersionCheck.test (1925 of 1972) PASS: lldb-unit :: Host/./HostTests/TaskPoolTest.TaskMap (1926 of 1972) PASS: lldb-unit :: Utility/./UtilityTests/StringExtractorTest.DecodeHexU8_InvalidHex2 (1927 of 1972) PASS: lldb-api :: sample_test/TestSampleTest.py (1928 of 1972) PASS: lldb-unit :: Host/./HostTests/TaskPoolTest.RunTasks (1929 of 1972) PASS: lldb-unit :: UnwindAssembly/x86/./UnwindAssemblyx86Tests/Testx86AssemblyInspectionEngine.TestSpillRegToStackViaMOVx86_64 (1930 of 1972) PASS: lldb-unit :: Host/./HostTests/TaskPoolTest.AddTask (1931 of 1972) PASS: lldb-api :: functionalities/data-formatter/data-formatter-disabling/TestDataFormatterDisabling.py (1932 of 1972) PASS: lldb-unit :: Utility/./UtilityTests/ProcessInstanceInfo.DumpTable (1933 of 1972) UNSUPPORTED: lldb-api :: functionalities/unwind/standard/TestStandardUnwind.py (1934 of 1972) PASS: lldb-unit :: Utility/./UtilityTests/UUIDTest.Validity (1935 of 1972) PASS: lldb-unit :: ScriptInterpreter/Python/./ScriptInterpreterPythonTests/PythonDataObjectsTest.TestDictionaryResolutionWithDot (1936 of 1972) PASS: lldb-api :: tools/lldb-vscode/breakpoint-events/TestVSCode_breakpointEvents.py (1937 of 1972) PASS: lldb-unit :: ScriptInterpreter/Python/./ScriptInterpreterPythonTests/PythonDataObjectsTest.TestExtractingUInt64ThroughStructuredData (1938 of 1972) PASS: lldb-api :: functionalities/multidebugger_commands/TestMultipleDebuggersCommands.py (1939 of 1972) PASS: lldb-api :: functionalities/tail_call_frames/cross_object/TestCrossObjectTailCalls.py (1940 of 1972) PASS: lldb-unit :: Utility/./UtilityTests/LogChannelTest.List (1941 of 1972) UNSUPPORTED: lldb-shell :: SymbolFile/NativePDB/stack_unwinding01.cpp (1942 of 1972) XFAIL: lldb-shell :: Register/x86-64-ymm-write.test (1943 of 1972) PASS: lldb-api :: python_api/section/TestSectionAPI.py (1944 of 1972) PASS: lldb-api :: lang/cpp/template/TestTemplateArgs.py (1945 of 1972) PASS: lldb-unit :: UnwindAssembly/x86/./UnwindAssemblyx86Tests/Testx86AssemblyInspectionEngine.Testi386IgnoredRegisters (1946 of 1972) PASS: lldb-unit :: tools/lldb-server/tests/./LLDBServerTests/TestBase.LaunchModePreservesEnvironment (1947 of 1972) PASS: lldb-unit :: Utility/./UtilityTests/BinaryStreamTest.PutULEB128EightBytes (1948 of 1972) PASS: lldb-unit :: Host/./HostTests/FileSystemTest.EnumerateDirectory (1949 of 1972) PASS: lldb-unit :: Process/gdb-remote/./ProcessGdbRemoteTests/GDBRemoteCommunicationClientTest.WriteRegister (1950 of 1972) PASS: lldb-unit :: Utility/./UtilityTests/FileSpecTest.PrependPathComponent (1951 of 1972) PASS: lldb-api :: macosx/thread-names/TestInterruptThreadNames.py (1952 of 1972) PASS: lldb-unit :: Symbol/./SymbolTests/TestClangASTImporter.DeportTypeTagDecl (1953 of 1972) PASS: lldb-shell :: BuildScript/modes.test (1954 of 1972) PASS: lldb-api :: functionalities/thread/concurrent_events/TestConcurrentNWatchNBreak.py (1955 of 1972) PASS: lldb-api :: functionalities/breakpoint/consecutive_breakpoints/TestConsecutiveBreakpoints.py (1956 of 1972) UNSUPPORTED: lldb-api :: commands/watchpoints/variable_out_of_scope/TestWatchedVarHitWhenInScope.py (1957 of 1972) PASS: lldb-unit :: Utility/./UtilityTests/BinaryStreamTest.PutSLEB128Zero (1958 of 1972) PASS: lldb-unit :: SymbolFile/DWARF/./SymbolFileDWARFTests/SymbolFileDWARFTests.TestAbbrevOrder1Start5 (1959 of 1972) PASS: lldb-shell :: SymbolFile/DWARF/dwarf5-debug_line.s (1960 of 1972) PASS: lldb-api :: functionalities/data-formatter/data-formatter-python-synth/TestDataFormatterPythonSynth.py (1961 of 1972) PASS: lldb-unit :: Process/minidump/./LLDBMinidumpTests/MinidumpParserTest.GetThreadContext_x86_32_wow64 (1962 of 1972) PASS: lldb-api :: types/TestShortTypeExpr.py (1963 of 1972) PASS: lldb-unit :: Utility/./UtilityTests/RecordReplayTest.InstrumentedBar (1964 of 1972) PASS: lldb-api :: python_api/value/TestValueAPI.py (1965 of 1972) PASS: lldb-unit :: Core/./LLDBCoreTests/RichManglingContextTest.SwitchProvider (1966 of 1972) PASS: lldb-unit :: Core/./LLDBCoreTests/MangledTest.EmptyForInvalidName (1967 of 1972) PASS: lldb-api :: functionalities/thread/concurrent_events/TestConcurrentSignalWatch.py (1968 of 1972) PASS: lldb-api :: lang/cpp/global_operators/TestCppGlobalOperators.py (1969 of 1972) PASS: lldb-api :: lang/c/struct_types/TestStructTypes.py (1970 of 1972) PASS: lldb-api :: commands/watchpoints/multiple_threads/TestWatchpointMultipleThreads.py (1971 of 1972) PASS: lldb-api :: types/TestIntegerType.py (1972 of 1972)

Hide Details

Testing Time: 4372.95s ******************** Failing Tests (3): lldb-api :: lang/objc/ptr_refs/TestPtrRefsObjC.py lldb-api :: functionalities/ptr_refs/TestPtrRefs.py lldb-api :: python_api/thread/TestThreadAPI.py

Hide Details

Hide Details

Slowest Tests: -------------------------------------------------------------------------- 91.68s: lldb-api :: functionalities/gdb_remote_client/TestWasm.py 96.82s: lldb-api :: functionalities/data-formatter/poarray/TestPrintObjectArray.py 108.90s: lldb-api :: python_api/lldbutil/iter/TestLLDBIterator.py 112.66s: lldb-api :: lang/objc/foundation/TestObjCMethodsNSError.py 112.79s: lldb-api :: lang/objc/objc-new-syntax/TestObjCNewSyntaxArray.py 112.82s: lldb-api :: lang/objc/foundation/TestObjCMethodsString.py 115.38s: lldb-api :: lang/objc/objc-new-syntax/TestObjCNewSyntaxDictionary.py 117.16s: lldb-api :: lang/objc/conflicting-definition/TestConflictingDefinition.py 120.58s: lldb-api :: tools/lldb-server/TestGdbRemote_qThreadStopInfo.py 131.79s: lldb-api :: types/TestLongTypesExpr.py 137.76s: lldb-api :: lang/objc/exceptions/TestObjCExceptions.py 137.88s: lldb-api :: lang/objc/real-definition/TestRealDefinition.py 151.67s: lldb-api :: lang/objc/objc-new-syntax/TestObjCNewSyntaxLiteral.py 166.73s: lldb-api :: lang/cpp/namespace/TestNamespaceLookup.py 215.09s: lldb-api :: lang/objc/foundation/TestObjCMethods.py 216.81s: lldb-api :: lang/objc/hidden-ivars/TestHiddenIvars.py 242.22s: lldb-api :: api/multithreaded/TestMultithreaded.py 248.75s: lldb-api :: tools/lldb-server/TestGdbRemoteThreadsInStopReply.py 268.69s: lldb-api :: lang/cpp/enum_types/TestCPP11EnumTypes.py 371.26s: lldb-api :: tools/lldb-server/TestLldbGdbServer.py

Hide Details

Tests Times: -------------------------------------------------------------------------- [ Range ] :: [ Percentage ] :: [ Count ] -------------------------------------------------------------------------- [ 0s, 20s) :: [********************************** ] :: [1717/1972] [ 20s, 40s) :: [** ] :: [ 127/1972] [ 40s, 60s) :: [* ] :: [ 80/1972] [ 60s, 80s) :: [ ] :: [ 24/1972] [ 80s,100s) :: [ ] :: [ 6/1972] [100s,120s) :: [ ] :: [ 6/1972] [120s,140s) :: [ ] :: [ 2/1972] [140s,160s) :: [ ] :: [ 3/1972] [160s,180s) :: [ ] :: [ 1/1972] [180s,200s) :: [ ] :: [ 0/1972] [200s,220s) :: [ ] :: [ 0/1972] [220s,240s) :: [ ] :: [ 2/1972] [240s,260s) :: [ ] :: [ 2/1972] [260s,280s) :: [ ] :: [ 1/1972] [280s,300s) :: [ ] :: [ 0/1972] [300s,320s) :: [ ] :: [ 0/1972] [320s,340s) :: [ ] :: [ 0/1972] [340s,360s) :: [ ] :: [ 0/1972] [360s,380s) :: [ ] :: [ 1/1972] Expected Passes : 1797 Expected Failures : 6 Unsupported Tests : 166 Unexpected Failures: 3 FAILED: tools/lldb/test/CMakeFiles/check-lldb-lit cd /Users/buildslave/jenkins/workspace/lldb-cmake-sanitized/lldb-build/tools/lldb/test && /usr/local/bin/python /Users/buildslave/jenkins/workspace/lldb-cmake-sanitized/lldb-build/./bin/llvm-lit -v --time-tests --shuffle --xunit-xml-output=/Users/buildslave/jenkins/workspace/lldb-cmake-sanitized/test/results.xml -v -j 4 --timeout 1200 /Users/buildslave/jenkins/workspace/lldb-cmake-sanitized/lldb-build/tools/lldb/test ninja: build stopped: subcommand failed. Command failed: Command '['/usr/bin/env', 'TERM=vt100', '/usr/local/bin/ninja', '-v', 'check-lldb']' returned non-zero exit status 1. Command: ['/usr/bin/env', 'TERM=vt100', '/usr/local/bin/ninja', '-v', 'check-lldb'] [Pipeline] } [Pipeline] // timeout [Pipeline] } [Pipeline] // stage [Pipeline] stage [Pipeline] { (Declarative: Post Actions) [Pipeline] scanForIssues [Clang (LLVM based)] Sleeping for 5 seconds due to JENKINS-32191... [Clang (LLVM based)] Parsing console log (workspace: '/Users/buildslave/jenkins/workspace/lldb-cmake-sanitized') [Clang (LLVM based)] Successfully parsed console log [Clang (LLVM based)] -> found 1 issue (skipped 0 duplicates) [Clang (LLVM based)] Post processing issues on 'green-dragon-23' with source code encoding 'UTF-8' [Clang (LLVM based)] Creating SCM blamer to obtain author and commit information for affected files [Clang (LLVM based)] Creating SCM miner to obtain statistics for affected repository files [Clang (LLVM based)] Resolving file names for all issues in source directory '/Users/buildslave/jenkins/workspace/lldb-cmake-sanitized' [Clang (LLVM based)] -> resolved paths in source directory (1 found, 0 not found) [Clang (LLVM based)] Resolving module names from module definitions (build.xml, pom.xml, or Manifest.mf files) [Clang (LLVM based)] -> resolved module names for 1 issues [Clang (LLVM based)] Resolving package names (or namespaces) by parsing the affected files [Clang (LLVM based)] -> resolved package names of 1 affected files [Clang (LLVM based)] No filter has been set, publishing all 1 issues [Clang (LLVM based)] Creating fingerprints for all affected code blocks to track issues over different builds [Clang (LLVM based)] -> created fingerprints for 1 issues (skipped 0 issues) [Clang (LLVM based)] Copying affected files to Jenkins' build folder '/Users/Shared/Jenkins/Home/jobs/lldb-cmake-sanitized/builds/1147/files-with-issues' [Clang (LLVM based)] -> 1 copied, 0 not in workspace, 0 not-found, 0 with I/O error [Pipeline] junit Recording test results [Pipeline] } [Pipeline] // stage [Pipeline] } [Pipeline] // withEnv [Pipeline] } [Pipeline] // node [Pipeline] End of Pipeline ERROR: script returned exit code 1 Finished: FAILURE