FailedConsole Output

Skipping 611 KB.. Full Log
alities/thread/concurrent_events/TestConcurrentDelaySignalBreak.py (1036 of 1972)
UNSUPPORTED: lldb-shell :: SymbolFile/PDB/ast-restore.test (1037 of 1972)
PASS: lldb-unit :: Utility/./UtilityTests/StreamTest.AddressPrefix (1038 of 1972)
PASS: lldb-shell :: SymbolFile/Breakpad/symtab-macho.test (1039 of 1972)
PASS: lldb-api :: lang/cpp/symbols/TestSymbols.py (1040 of 1972)
PASS: lldb-api :: functionalities/data-formatter/data-formatter-objc/TestDataFormatterObjCNSDate.py (1041 of 1972)
PASS: lldb-unit :: Utility/./UtilityTests/TimerTest.CategoryTimesNested (1042 of 1972)
PASS: lldb-api :: lang/objc/self/TestObjCSelf.py (1043 of 1972)
PASS: lldb-api :: commands/expression/import-std-module/empty-module/TestEmptyStdModule.py (1044 of 1972)
PASS: lldb-shell :: ObjectFile/wasm/stripped-debug-sections.yaml (1045 of 1972)
PASS: lldb-shell :: ObjectFile/ELF/minidebuginfo-corrupt-xz.yaml (1046 of 1972)
PASS: lldb-unit :: ScriptInterpreter/Python/./ScriptInterpreterPythonTests/PythonDataObjectsTest.TestPythonStringToStructuredString (1047 of 1972)
UNSUPPORTED: lldb-api :: functionalities/process_save_core/TestProcessSaveCore.py (1048 of 1972)
PASS: lldb-api :: commands/expression/import-std-module/conflicts/TestStdModuleWithConflicts.py (1049 of 1972)
PASS: lldb-unit :: Utility/./UtilityTests/StatusTest.Formatv (1050 of 1972)
PASS: lldb-api :: commands/watchpoints/step_over_watchpoint/TestStepOverWatchpoint.py (1051 of 1972)
PASS: lldb-unit :: Utility/./UtilityTests/Flags.IsClear (1052 of 1972)
UNSUPPORTED: lldb-shell :: Process/Windows/exception_access_violation.cpp (1053 of 1972)
PASS: lldb-shell :: SymbolFile/DWARF/debug_ranges_and_rnglists.test (1054 of 1972)
PASS: lldb-api :: commands/frame/diagnose/dereference-this/TestDiagnoseDereferenceThis.py (1055 of 1972)
PASS: lldb-shell :: SymbolFile/DWARF/apple-index-is-used.cpp (1056 of 1972)
PASS: lldb-unit :: UnwindAssembly/x86/./UnwindAssemblyx86Tests/Testx86AssemblyInspectionEngine.TestPopR13 (1057 of 1972)
PASS: lldb-unit :: Utility/./UtilityTests/StringListTest.PopBack (1058 of 1972)
PASS: lldb-unit :: Utility/./UtilityTests/StreamTest.Indent (1059 of 1972)
PASS: lldb-unit :: Utility/./UtilityTests/StringListTest.ShiftMove (1060 of 1972)
PASS: lldb-unit :: Utility/./UtilityTests/LogChannelTest.Enable (1061 of 1972)
PASS: lldb-shell :: SymbolFile/DWARF/debug_line-relative_path.s (1062 of 1972)
PASS: lldb-unit :: SymbolFile/NativePDB/./SymbolFileNativePDBTests/PDBFPOProgramToDWARFExpressionTests.UnknownOp (1063 of 1972)
PASS: lldb-shell :: ObjectFile/ELF/compressed-sections.yaml (1064 of 1972)
PASS: lldb-unit :: Utility/./UtilityTests/StreamTest.PutULEB128 (1065 of 1972)
PASS: lldb-unit :: ObjectFile/ELF/./ObjectFileELFTests/ObjectFileELFTest.GetSymtab_NoSymEntryPointArmAddressClass (1066 of 1972)
PASS: lldb-api :: python_api/value/linked_list/TestValueAPILinkedList.py (1067 of 1972)
UNSUPPORTED: lldb-shell :: Register/x86-zmm-read.test (1068 of 1972)
PASS: lldb-unit :: Utility/./UtilityTests/RangeTest.NotEqual (1069 of 1972)
PASS: lldb-api :: arm/emulation/TestEmulations.py (1070 of 1972)
PASS: lldb-shell :: Settings/TestLineMarkerColor.test (1071 of 1972)
PASS: lldb-shell :: SymbolFile/DWARF/DW_OP_piece-struct.s (1072 of 1972)
PASS: lldb-shell :: SymbolFile/DWARF/find-basic-variable.cpp (1073 of 1972)
PASS: lldb-unit :: Symbol/./SymbolTests/LineEntryTest.GetSameLineContiguousAddressRangeOneInline (1074 of 1972)
PASS: lldb-unit :: Utility/./UtilityTests/StreamTest.QuotedCString (1075 of 1972)
PASS: lldb-shell :: SymbolFile/DWARF/debug_loc_and_loclists.s (1076 of 1972)
PASS: lldb-unit :: Utility/./UtilityTests/BroadcasterTest.EventTypeHasListeners (1077 of 1972)
PASS: lldb-unit :: Utility/./UtilityTests/FileSpecTest.Equal (1078 of 1972)
PASS: lldb-shell :: SymbolFile/DWARF/find-inline-method.s (1079 of 1972)
UNSUPPORTED: lldb-api :: macosx/macabi/TestMacABImacOSFramework.py (1080 of 1972)
PASS: lldb-unit :: Utility/./UtilityTests/RegisterValueTest.GetSet8 (1081 of 1972)
PASS: lldb-shell :: Breakpoint/jitbp_elf.test (1082 of 1972)
PASS: lldb-unit :: Symbol/./SymbolTests/LineEntryTest.GetSameLineContiguousAddressRangeNestedInline (1083 of 1972)
PASS: lldb-shell :: Minidump/disassemble-no-module.yaml (1084 of 1972)
PASS: lldb-unit :: Host/./HostTests/NativeProcessProtocolTest.SetBreakpointFailWrite (1085 of 1972)
PASS: lldb-api :: lang/c/stepping/TestThreadStepping.py (1086 of 1972)
PASS: lldb-shell :: Reproducer/TestReuseDirectory.test (1087 of 1972)
PASS: lldb-unit :: Utility/./UtilityTests/StringListTest.ShiftCString (1088 of 1972)
PASS: lldb-unit :: ObjectFile/PECOFF/./ObjectFilePECOFFTests/PECallFrameInfoTest.Frame_reg_eh (1089 of 1972)
PASS: lldb-api :: functionalities/breakpoint/global_constructor/TestBreakpointInGlobalConstructor.py (1090 of 1972)
PASS: lldb-unit :: ScriptInterpreter/Python/./ScriptInterpreterPythonTests/PythonDataObjectsTest.TestPythonTupleSize (1091 of 1972)
PASS: lldb-api :: lang/c/anonymous/TestAnonymous.py (1092 of 1972)
PASS: lldb-shell :: Breakpoint/debug_addrx.test (1093 of 1972)
PASS: lldb-unit :: Utility/./UtilityTests/ConstStringTest.CompareStringRef (1094 of 1972)
PASS: lldb-unit :: Utility/./UtilityTests/StringListTest.JoinThree (1095 of 1972)
PASS: lldb-unit :: Utility/./UtilityTests/StreamTest.PutHex32ByteOrderBig (1096 of 1972)
PASS: lldb-api :: functionalities/inferior-crashing/TestInferiorCrashing.py (1097 of 1972)
PASS: lldb-unit :: Utility/./UtilityTests/Flags.GetBitSize (1098 of 1972)
PASS: lldb-unit :: Utility/./UtilityTests/StreamTest.AddressRangeEmptyRange (1099 of 1972)
PASS: lldb-unit :: Process/minidump/./LLDBMinidumpTests/MinidumpParserTest.GetMiscInfo_no_stream (1100 of 1972)
PASS: lldb-api :: python_api/signals/TestSignalsAPI.py (1101 of 1972)
PASS: lldb-unit :: ScriptInterpreter/Python/./ScriptInterpreterPythonTests/PythonDataObjectsTest.TestPythonTupleToStructuredList (1102 of 1972)
PASS: lldb-api :: functionalities/process_crash_info/TestProcessCrashInfo.py (1103 of 1972)
PASS: lldb-unit :: UnwindAssembly/x86/./UnwindAssemblyx86Tests/Testx86AssemblyInspectionEngine.TestAddESP (1104 of 1972)
PASS: lldb-unit :: Host/./HostTests/TaskPoolTest.AddTask (1105 of 1972)
PASS: lldb-api :: python_api/sbenvironment/TestSBEnvironment.py (1106 of 1972)
UNSUPPORTED: lldb-api :: linux/sepdebugsymlink/TestTargetSymbolsSepDebugSymlink.py (1107 of 1972)
PASS: lldb-unit :: Utility/./UtilityTests/Flags.Clear (1108 of 1972)
UNSUPPORTED: lldb-api :: commands/register/register/intel_xtended_registers/mpx_offset_intersection/TestMPXOffsetIntersection.py (1109 of 1972)
PASS: lldb-api :: functionalities/memory-region/TestMemoryRegion.py (1110 of 1972)
PASS: lldb-unit :: Language/Highlighting/./HighlighterTests/HighlighterTest.Keywords (1111 of 1972)
PASS: lldb-api :: functionalities/data-formatter/array_typedef/TestArrayTypedef.py (1112 of 1972)
PASS: lldb-api :: lang/cpp/breakpoint-commands/TestCPPBreakpointCommands.py (1113 of 1972)
PASS: lldb-unit :: UnwindAssembly/x86/./UnwindAssemblyx86Tests/Testx86AssemblyInspectionEngine.Test32bitFramelessBigStackFrame (1114 of 1972)
PASS: lldb-unit :: Host/./HostTests/FileSystemTest.Resolve (1115 of 1972)
PASS: lldb-unit :: Utility/./UtilityTests/SerializationRountripTest.SerializeDeserializePod (1116 of 1972)
PASS: lldb-unit :: Host/./HostTests/SocketTest.TCPListen0GetPort (1117 of 1972)
PASS: lldb-api :: functionalities/data-formatter/data-formatter-proper-plurals/TestFormattersOneIsSingular.py (1118 of 1972)
UNSUPPORTED: lldb-api :: functionalities/darwin_log/filter/exact_match/message/TestDarwinLogFilterMatchMessage.py (1119 of 1972)
UNSUPPORTED: lldb-shell :: Minidump/Windows/arm-fp-unwind.test (1120 of 1972)
PASS: lldb-unit :: Utility/./UtilityTests/StreamTest.AddressNoSuffix (1121 of 1972)
PASS: lldb-unit :: Symbol/./SymbolTests/TestTypeSystemClang.TestGetBasicTypeFromName (1122 of 1972)
PASS: lldb-api :: functionalities/gdb_remote_client/TestGDBRemoteClient.py (1123 of 1972)
PASS: lldb-shell :: ObjectFile/MachO/lc_version_min.yaml (1124 of 1972)
PASS: lldb-unit :: Utility/./UtilityTests/AnsiTerminal.Unknown (1125 of 1972)
PASS: lldb-unit :: Symbol/./SymbolTests/PostfixExpression.ToDWARF (1126 of 1972)
PASS: lldb-unit :: UnwindAssembly/x86/./UnwindAssemblyx86Tests/Testx86AssemblyInspectionEngine.TestPopRBPWithREX (1127 of 1972)
PASS: lldb-unit :: UnwindAssembly/x86/./UnwindAssemblyx86Tests/Testx86AssemblyInspectionEngine.TestStackRealign8BitDisp_i386 (1128 of 1972)
PASS: lldb-api :: functionalities/signal/TestSendSignal.py (1129 of 1972)
PASS: lldb-unit :: UnwindAssembly/x86/./UnwindAssemblyx86Tests/Testx86AssemblyInspectionEngine.Test32BitOnlyInstruction (1130 of 1972)
PASS: lldb-unit :: Utility/./UtilityTests/OptionsWithRawTest.WhitespaceInput (1131 of 1972)
UNSUPPORTED: lldb-api :: functionalities/thread/state/TestThreadStates.py (1132 of 1972)
PASS: lldb-api :: lang/c/blocks/TestBlocks.py (1133 of 1972)
PASS: lldb-api :: python_api/get-value-32bit-int/TestGetValue32BitInt.py (1134 of 1972)
PASS: lldb-api :: functionalities/data-formatter/type_summary_list_script/TestTypeSummaryListScript.py (1135 of 1972)
PASS: lldb-api :: commands/command/script/import/rdar-12586188/TestRdar12586188.py (1136 of 1972)
PASS: lldb-api :: functionalities/data-formatter/data-formatter-stl/libcxx/queue/TestDataFormatterLibcxxQueue.py (1137 of 1972)
PASS: lldb-unit :: Utility/./UtilityTests/SerializationRountripTest.SerializeDeserializeCStringNull (1138 of 1972)
PASS: lldb-unit :: Utility/./UtilityTests/StreamTeeTest.AppendStream (1139 of 1972)
PASS: lldb-api :: functionalities/target_var/TestTargetVar.py (1140 of 1972)
PASS: lldb-api :: python_api/class_members/TestSBTypeClassMembers.py (1141 of 1972)
PASS: lldb-unit :: UnwindAssembly/x86/./UnwindAssemblyx86Tests/Testx86AssemblyInspectionEngine.TestDisassemblyJunkBytes (1142 of 1972)
UNSUPPORTED: lldb-api :: functionalities/darwin_log/filter/regex/activity/TestDarwinLogFilterRegexActivity.py (1143 of 1972)
PASS: lldb-unit :: Utility/./UtilityTests/RangeDataVector.FindEntryThatContains_Overlap (1144 of 1972)
PASS: lldb-api :: commands/watchpoints/watchpoint_commands/TestWatchpointCommands.py (1145 of 1972)
PASS: lldb-api :: functionalities/gdb_remote_client/TestJLink6Armv7RegisterDefinition.py (1146 of 1972)
PASS: lldb-unit :: Utility/./UtilityTests/StringExtractorTest.DecodeHexU8_InvalidHex (1147 of 1972)
UNSUPPORTED: lldb-api :: functionalities/darwin_log/filter/regex/message/TestDarwinLogFilterRegexMessage.py (1148 of 1972)
PASS: lldb-unit :: ScriptInterpreter/Python/./ScriptInterpreterPythonTests/PythonDataObjectsTest.TestResetting (1149 of 1972)
PASS: lldb-unit :: Host/./HostTests/MainLoopTest.Signal (1150 of 1972)
PASS: lldb-shell :: Commands/command-backtrace.test (1151 of 1972)
PASS: lldb-shell :: SymbolFile/DWARF/clang-ast-from-dwarf-objc-property.m (1152 of 1972)
PASS: lldb-unit :: Utility/./UtilityTests/Flags.AllSet (1153 of 1972)
PASS: lldb-shell :: Commands/command-thread-select.test (1154 of 1972)
PASS: lldb-api :: lang/c/unions/TestUnionMembers.py (1155 of 1972)
PASS: lldb-api :: functionalities/load_using_paths/TestLoadUsingPaths.py (1156 of 1972)
PASS: lldb-unit :: Utility/./UtilityTests/SharedCluster.ClusterManager (1157 of 1972)
PASS: lldb-unit :: Utility/./UtilityTests/RegularExpression.Match (1158 of 1972)
PASS: lldb-unit :: SymbolFile/DWARF/./SymbolFileDWARFTests/SymbolFileDWARFTests.TestAbbrevInvalidNULLTag (1159 of 1972)
PASS: lldb-unit :: Utility/./UtilityTests/StringListTest.InsertStringAtIndexStdString (1160 of 1972)
PASS: lldb-api :: commands/expression/scoped_enums/TestScopedEnumType.py (1161 of 1972)
PASS: lldb-api :: tools/lldb-server/TestGdbRemoteSingleStep.py (1162 of 1972)
PASS: lldb-shell :: Reproducer/Functionalities/TestExpressionEvaluation.test (1163 of 1972)
PASS: lldb-unit :: Language/Highlighting/./HighlighterTests/HighlighterTest.ClangSquareBrackets (1164 of 1972)
PASS: lldb-api :: functionalities/data-formatter/data-formatter-stl/libcxx/bitset/TestDataFormatterLibcxxBitset.py (1165 of 1972)
PASS: lldb-api :: lang/objc/objc-ivar-protocols/TestIvarProtocols.py (1166 of 1972)
UNSUPPORTED: lldb-shell :: Register/x86-ymm-read.test (1167 of 1972)
PASS: lldb-unit :: Utility/./UtilityTests/StringExtractorTest.GetHexU8_Underflow2 (1168 of 1972)
PASS: lldb-api :: lang/cpp/dynamic-value/TestDynamicValue.py (1169 of 1972)
PASS: lldb-shell :: ObjectFile/Breakpad/uuid-matching-mac.test (1170 of 1972)
PASS: lldb-api :: functionalities/var_path/TestVarPath.py (1171 of 1972)
PASS: lldb-unit :: Utility/./UtilityTests/StringExtractorTest.DecodeHexU8_Underflow2 (1172 of 1972)
PASS: lldb-api :: functionalities/gdb_remote_client/TestArmRegisterDefinition.py (1173 of 1972)
UNSUPPORTED: lldb-shell :: Unwind/unwind-plan-dwarf-dump.test (1174 of 1972)
PASS: lldb-api :: commands/expression/timeout/TestCallWithTimeout.py (1175 of 1972)
PASS: lldb-api :: functionalities/gdb_remote_client/TestStopPCs.py (1176 of 1972)
PASS: lldb-unit :: Utility/./UtilityTests/StringExtractorTest.GetHexBytes_Partial (1177 of 1972)
PASS: lldb-unit :: UnwindAssembly/x86/./UnwindAssemblyx86Tests/Testx86AssemblyInspectionEngine.Test32bitFramelessSmallStackFrame (1178 of 1972)
PASS: lldb-api :: functionalities/data-formatter/data-formatter-stl/libcxx/initializerlist/TestInitializerList.py (1179 of 1972)
PASS: lldb-unit :: Utility/./UtilityTests/StringListTest.InsertStringAtIndexEnd (1180 of 1972)
PASS: lldb-api :: lang/c/vla/TestVLA.py (1181 of 1972)
PASS: lldb-unit :: Utility/./UtilityTests/StreamTest.PutRawBytesToBigEndian (1182 of 1972)
PASS: lldb-unit :: Utility/./UtilityTests/StringListTest.LongestCommonPrefixNoPrefix (1183 of 1972)
PASS: lldb-unit :: Utility/./UtilityTests/StringListTest.Clear (1184 of 1972)
PASS: lldb-shell :: SymbolFile/NativePDB/ast-functions.cpp (1185 of 1972)
PASS: lldb-shell :: Minidump/Windows/find-module.test (1186 of 1972)
PASS: lldb-unit :: Process/gdb-remote/./ProcessGdbRemoteTests/GDBRemoteCommunicationClientTest.SendSignalsToIgnore (1187 of 1972)
PASS: lldb-unit :: Utility/./UtilityTests/RangeTest.Clear (1188 of 1972)
PASS: lldb-unit :: Platform/./LLDBPlatformTests/PlatformDarwinTest.GetSDKNameForType (1189 of 1972)
PASS: lldb-unit :: Symbol/./SymbolTests/PostfixExpression.ParseOneExpression (1190 of 1972)
PASS: lldb-unit :: Utility/./UtilityTests/AnsiTerminal.KnownPrefix (1191 of 1972)
PASS: lldb-unit :: Utility/./UtilityTests/FileSpecTest.EqualSeparator (1192 of 1972)
PASS: lldb-unit :: ScriptInterpreter/Python/./ScriptInterpreterPythonTests/PythonDataObjectsTest.TestPythonBytes (1193 of 1972)
PASS: lldb-unit :: Process/gdb-remote/./ProcessGdbRemoteTests/GDBRemoteCommunicationClientTest.SaveRestoreRegistersNoSuffix (1194 of 1972)
PASS: lldb-unit :: Language/CPlusPlus/./LanguageCPlusPlusTests/CPlusPlusLanguage.ExtractContextAndIdentifier (1195 of 1972)
UNSUPPORTED: lldb-api :: tools/lldb-server/TestGdbRemoteModuleInfo.py (1196 of 1972)
PASS: lldb-unit :: Platform/./LLDBPlatformTests/PlatformDarwinTest.TestParseVersionBuildDir (1197 of 1972)
PASS: lldb-shell :: ObjectFile/PECOFF/invalid-export-table.yaml (1198 of 1972)
PASS: lldb-unit :: Utility/./UtilityTests/ConstStringTest.UpdateMangledCounterpart (1199 of 1972)
PASS: lldb-shell :: Register/x86-64-ymm-read.test (1200 of 1972)
PASS: lldb-unit :: Utility/./UtilityTests/ConstStringTest.CompareConstString (1201 of 1972)
PASS: lldb-api :: functionalities/breakpoint/consecutive_breakpoints/TestConsecutiveBreakpoints.py (1202 of 1972)
PASS: lldb-unit :: Utility/./UtilityTests/UriParserTest.MinimalPortPath (1203 of 1972)
PASS: lldb-shell :: SymbolFile/Breakpad/line-table-mixed-path-styles.test (1204 of 1972)
PASS: lldb-unit :: Process/minidump/./LLDBMinidumpTests/MinidumpParserTest.GetMemoryRegionInfoFromMemoryList (1205 of 1972)
PASS: lldb-unit :: UnwindAssembly/x86/./UnwindAssemblyx86Tests/Testx86AssemblyInspectionEngine.Test64bitFramelessBigStackFrame (1206 of 1972)
PASS: lldb-api :: functionalities/breakpoint/debugbreak/TestDebugBreak.py (1207 of 1972)
PASS: lldb-unit :: Utility/./UtilityTests/StringExtractorTest.GetHexBytes_OddPair (1208 of 1972)
PASS: lldb-unit :: Utility/./UtilityTests/StringListTest.GetMaxStringLengthEqualSize (1209 of 1972)
PASS: lldb-api :: python_api/interpreter/TestRunCommandInterpreterAPI.py (1210 of 1972)
PASS: lldb-unit :: Utility/./UtilityTests/StreamTest.PutSLEB128 (1211 of 1972)
PASS: lldb-unit :: Process/minidump/./LLDBMinidumpTests/MinidumpParserTest.GetThreadContext_x86_64 (1212 of 1972)
PASS: lldb-api :: commands/watchpoints/multiple_hits/TestMultipleHits.py (1213 of 1972)
PASS: lldb-api :: functionalities/tail_call_frames/cross_dso/TestCrossDSOTailCalls.py (1214 of 1972)
PASS: lldb-unit :: Process/gdb-remote/./ProcessGdbRemoteTests/GDBRemoteCommunicationClientTest.SendGetDataPacket (1215 of 1972)
PASS: lldb-api :: functionalities/thread/crash_during_step/TestCrashDuringStep.py (1216 of 1972)
UNSUPPORTED: lldb-api :: benchmarks/expression/TestRepeatedExprs.py (1217 of 1972)
PASS: lldb-api :: functionalities/data-formatter/data-formatter-objc/TestDataFormatterObjCNSBundle.py (1218 of 1972)
PASS: lldb-api :: lang/c/function_types/TestFunctionTypes.py (1219 of 1972)
PASS: lldb-unit :: Expression/./ExpressionTests/DiagnosticManagerTest.HasFixits (1220 of 1972)
UNSUPPORTED: lldb-api :: commands/register/register/intel_xtended_registers/TestMPXRegisters.py (1221 of 1972)
PASS: lldb-unit :: Utility/./UtilityTests/BinaryStreamTest.PutULEB128SixBytes (1222 of 1972)
PASS: lldb-unit :: Core/./LLDBCoreTests/RichManglingContextTest.Basic (1223 of 1972)
PASS: lldb-shell :: Breakpoint/debug_rnglist_offset_pair.test (1224 of 1972)
PASS: lldb-unit :: UnwindAssembly/x86/./UnwindAssemblyx86Tests/Testx86AssemblyInspectionEngine.TestPushEDI (1225 of 1972)
PASS: lldb-api :: functionalities/thread/concurrent_events/TestConcurrentTwoBreakpointsOneSignal.py (1226 of 1972)
PASS: lldb-unit :: Utility/./UtilityTests/StreamTest.PutMaxHex64ByteOrderLittle (1227 of 1972)
PASS: lldb-unit :: Utility/./UtilityTests/OptionsWithRawTest.LeadingSpaceArgs (1228 of 1972)
UNSUPPORTED: lldb-api :: commands/register/register/intel_xtended_registers/mpx_bound_violation/TestBoundViolation.py (1229 of 1972)
PASS: lldb-shell :: ObjectFile/ELF/avr-basic-info.yaml (1230 of 1972)
PASS: lldb-api :: commands/expression/import-std-module/shared_ptr/TestSharedPtrFromStdModule.py (1231 of 1972)
PASS: lldb-unit :: UnwindAssembly/x86/./UnwindAssemblyx86Tests/Testx86AssemblyInspectionEngine.TestStackRealignMSVC_i386 (1232 of 1972)
PASS: lldb-api :: functionalities/data-formatter/data-formatter-stl/libcxx/list/TestDataFormatterLibcxxList.py (1233 of 1972)
PASS: lldb-unit :: UnwindAssembly/x86/./UnwindAssemblyx86Tests/Testx86AssemblyInspectionEngine.TestStackRealign32BitDisp_x86_64 (1234 of 1972)
UNSUPPORTED: lldb-api :: android/platform/TestDefaultCacheLineSize.py (1235 of 1972)
UNSUPPORTED: lldb-api :: functionalities/darwin_log/basic/TestDarwinLogBasic.py (1236 of 1972)
PASS: lldb-unit :: ScriptInterpreter/Python/./ScriptInterpreterPythonTests/PythonDataObjectsTest.TestPythonIntegerToStructuredInteger (1237 of 1972)
PASS: lldb-shell :: SymbolFile/DWARF/dwp-separate-debug-file.cpp (1238 of 1972)
UNSUPPORTED: lldb-api :: lang/c/typedef/Testtypedef.py (1239 of 1972)
PASS: lldb-api :: commands/expression/unicode-in-variable/TestUnicodeInVariable.py (1240 of 1972)
PASS: lldb-unit :: Process/minidump/./LLDBMinidumpTests/MinidumpParserTest.GetLinuxProcStatus_no_stream (1241 of 1972)
PASS: lldb-shell :: SymbolFile/DWARF/debug-types-dwo-cross-reference.cpp (1242 of 1972)
PASS: lldb-unit :: Utility/./UtilityTests/Flags.Test (1243 of 1972)
PASS: lldb-unit :: Utility/./UtilityTests/BinaryStreamTest.PutULEB128MaxValue (1244 of 1972)
PASS: lldb-unit :: Utility/./UtilityTests/StringLexerTest.PutBack (1245 of 1972)
PASS: lldb-shell :: Register/x86-64-read.test (1246 of 1972)
PASS: lldb-unit :: Utility/./UtilityTests/FileSpecTest.GuessPathStyle (1247 of 1972)
PASS: lldb-shell :: ObjectFile/ELF/section-permissions.yaml (1248 of 1972)
PASS: lldb-unit :: Symbol/./SymbolTests/TestTypeSystemClang.TestDisplayName (1249 of 1972)
PASS: lldb-api :: lang/cpp/exceptions/TestCPPExceptionBreakpoints.py (1250 of 1972)
PASS: lldb-api :: functionalities/thread/exit_during_break/TestExitDuringBreak.py (1251 of 1972)
PASS: lldb-unit :: Expression/./ExpressionTests/DWARFExpression.DW_OP_piece (1252 of 1972)
PASS: lldb-api :: lang/objc/objc-property/TestObjCProperty.py (1253 of 1972)
PASS: lldb-unit :: Utility/./UtilityTests/StringExtractorTest.GetHexU8_InvalidHex (1254 of 1972)
PASS: lldb-api :: functionalities/data-formatter/data-formatter-objc/TestDataFormatterObjCPlain.py (1255 of 1972)
PASS: lldb-unit :: Utility/./UtilityTests/UriParserTest.MinimalPort (1256 of 1972)
PASS: lldb-api :: functionalities/data-formatter/hexcaps/TestDataFormatterHexCaps.py (1257 of 1972)
PASS: lldb-unit :: ScriptInterpreter/Python/./ScriptInterpreterPythonTests/PythonDataObjectsTest.TestPythonByteArray (1258 of 1972)
PASS: lldb-unit :: Language/Highlighting/./HighlighterTests/HighlighterTest.ClangScalarLiterals (1259 of 1972)
PASS: lldb-api :: functionalities/breakpoint/cpp_exception/TestCPPExceptionBreakpoint.py (1260 of 1972)
PASS: lldb-api :: commands/expression/function_template_specialization_temp_args/TestFunctionTemplateSpecializationTempArgs.py (1261 of 1972)
PASS: lldb-unit :: Symbol/./SymbolTests/TestClangASTImporter.CopyDeclTagDecl (1262 of 1972)
PASS: lldb-api :: commands/disassemble/basic/TestFrameDisassemble.py (1263 of 1972)
PASS: lldb-unit :: Symbol/./SymbolTests/PostfixExpression.ParseFPOProgram (1264 of 1972)
PASS: lldb-unit :: Process/minidump/./LLDBMinidumpTests/MinidumpParserTest.GetExceptionStream (1265 of 1972)
PASS: lldb-unit :: Utility/./UtilityTests/Flags.AllClear (1266 of 1972)
PASS: lldb-api :: commands/expression/invalid-args/TestInvalidArgsExpression.py (1267 of 1972)
PASS: lldb-api :: functionalities/postmortem/elf-core/TestLinuxCore.py (1268 of 1972)
PASS: lldb-api :: types/TestDoubleTypesExpr.py (1269 of 1972)
PASS: lldb-api :: functionalities/data-formatter/data-formatter-stl/libcxx/forward_list/TestDataFormatterLibcxxForwardList.py (1270 of 1972)
UNSUPPORTED: lldb-api :: functionalities/darwin_log/filter/exact_match/activity/TestDarwinLogFilterMatchActivity.py (1271 of 1972)
PASS: lldb-api :: functionalities/type_completion/TestTypeCompletion.py (1272 of 1972)
PASS: lldb-api :: lang/cpp/offsetof/TestOffsetofCpp.py (1273 of 1972)
PASS: lldb-shell :: ScriptInterpreter/Python/scripted_breakpoint.test (1274 of 1972)
PASS: lldb-api :: lang/objcxx/objcxx-ivar-vector/TestIvarVector.py (1275 of 1972)
PASS: lldb-unit :: Utility/./UtilityTests/RangeTest.EqualInvalid (1276 of 1972)
PASS: lldb-api :: commands/expression/entry-bp/TestExprEntryBP.py (1277 of 1972)
PASS: lldb-api :: functionalities/data-formatter/data-formatter-stl/libcxx/vbool/TestDataFormatterLibcxxVBool.py (1278 of 1972)
PASS: lldb-shell :: SymbolFile/DWARF/debug_loc-aslr.s (1279 of 1972)
PASS: lldb-api :: lang/cpp/signed_types/TestSignedTypes.py (1280 of 1972)
PASS: lldb-unit :: ScriptInterpreter/Python/./ScriptInterpreterPythonTests/PythonDataObjectsTest.TestExceptions (1281 of 1972)
UNSUPPORTED: lldb-api :: functionalities/gdb_remote_client/TestWasm.py (1282 of 1972)
PASS: lldb-unit :: Symbol/./SymbolTests/TestTypeSystemClang.TestGetEnumIntegerTypeBasicTypes (1283 of 1972)
PASS: lldb-api :: functionalities/gdb_remote_client/TestqOffsets.py (1284 of 1972)
PASS: lldb-unit :: Utility/./UtilityTests/StreamTest.PutBytesAsRawHex8ToBigEndian (1285 of 1972)
PASS: lldb-unit :: Utility/./UtilityTests/RangeTest.ContainsRange (1286 of 1972)
PASS: lldb-unit :: Utility/./UtilityTests/CompletionRequest.Constructor (1287 of 1972)
PASS: lldb-unit :: Utility/./UtilityTests/RangeDataVector.FindEntryThatContains (1288 of 1972)
PASS: lldb-unit :: Process/gdb-remote/./ProcessGdbRemoteTests/GDBRemoteCommunicationClientTest.WriteRegister (1289 of 1972)
PASS: lldb-unit :: Utility/./UtilityTests/StringListTest.JoinEmpty (1290 of 1972)
PASS: lldb-unit :: Utility/./UtilityTests/StreamTest.PutHex16ByteOrderLittle (1291 of 1972)
PASS: lldb-unit :: Utility/./UtilityTests/UriParserTest.SchemeHostSeparator2 (1292 of 1972)
PASS: lldb-api :: python_api/lldbutil/TestSwigVersion.py (1293 of 1972)
PASS: lldb-api :: python_api/sbstructureddata/TestStructuredDataAPI.py (1294 of 1972)
PASS: lldb-shell :: ObjectFile/Breakpad/breakpad-identification.test (1295 of 1972)
UNSUPPORTED: lldb-api :: commands/expression/multiline-navigation/TestMultilineNavigation.py (1296 of 1972)
PASS: lldb-unit :: Expression/./ExpressionTests/CppModuleConfigurationTest.MissingUsrInclude (1297 of 1972)
PASS: lldb-shell :: SymbolFile/DWARF/dwo-type-in-main-file.s (1298 of 1972)
UNSUPPORTED: lldb-api :: iohandler/completion/TestIOHandlerCompletion.py (1299 of 1972)
PASS: lldb-unit :: Symbol/./SymbolTests/TestTypeSystemClang.TestBuiltinTypeForEncodingAndBitSize (1300 of 1972)
PASS: lldb-unit :: Utility/./UtilityTests/UriParserTest.Empty (1301 of 1972)
PASS: lldb-unit :: Utility/./UtilityTests/LogChannelEnabledTest.LLDB_LOG_ERROR (1302 of 1972)
PASS: lldb-api :: commands/expression/options/TestExprOptions.py (1303 of 1972)
PASS: lldb-api :: functionalities/data-formatter/data-formatter-stl/libcxx/unordered/TestDataFormatterUnordered.py (1304 of 1972)
PASS: lldb-shell :: Unwind/thread-step-out-ret-addr-check.test (1305 of 1972)
FAIL: lldb-api :: functionalities/ptr_refs/TestPtrRefs.py (1306 of 1972)
******************** TEST 'lldb-api :: functionalities/ptr_refs/TestPtrRefs.py' FAILED ********************
Script:
--
/usr/local/bin/python /Users/buildslave/jenkins/workspace/lldb-cmake-sanitized/llvm-project/lldb/test/API/dotest.py --arch x86_64 -s /Users/buildslave/jenkins/workspace/lldb-cmake-sanitized/lldb-build/lldb-test-traces -S nm -u CXXFLAGS -u CFLAGS --codesign-identity lldb_codesign --server /Users/buildslave/jenkins/workspace/lldb-cmake-sanitized/lldb-build/./bin/debugserver --arch x86_64 --build-dir /Users/buildslave/jenkins/workspace/lldb-cmake-sanitized/lldb-build/lldb-test-build.noindex -s=/Users/buildslave/jenkins/workspace/lldb-cmake-sanitized/test/logs -t --env TERM=vt100 --env LLVM_LIBS_DIR=/Users/buildslave/jenkins/workspace/lldb-cmake-sanitized/lldb-build/./lib --inferior-env ASAN_OPTIONS=detect_stack_use_after_return=1 --inferior-env DYLD_INSERT_LIBRARIES=/Users/buildslave/jenkins/workspace/lldb-cmake-sanitized/host-compiler/lib/clang/11.0.0/lib/darwin/libclang_rt.asan_osx_dynamic.dylib --build-dir /Users/buildslave/jenkins/workspace/lldb-cmake-sanitized/lldb-build/lldb-test-build.noindex --lldb-module-cache-dir /Users/buildslave/jenkins/workspace/lldb-cmake-sanitized/lldb-build/lldb-test-build.noindex/module-cache-lldb/lldb-api --clang-module-cache-dir /Users/buildslave/jenkins/workspace/lldb-cmake-sanitized/lldb-build/lldb-test-build.noindex/module-cache-clang/lldb-api --executable /Users/buildslave/jenkins/workspace/lldb-cmake-sanitized/lldb-build/./bin/lldb --compiler /Users/buildslave/jenkins/workspace/lldb-cmake-sanitized/lldb-build/./bin/clang --dsymutil /Users/buildslave/jenkins/workspace/lldb-cmake-sanitized/lldb-build/./bin/dsymutil --filecheck /Users/buildslave/jenkins/workspace/lldb-cmake-sanitized/lldb-build/./bin/FileCheck --lldb-libs-dir /Users/buildslave/jenkins/workspace/lldb-cmake-sanitized/lldb-build/./lib /Users/buildslave/jenkins/workspace/lldb-cmake-sanitized/llvm-project/lldb/test/API/functionalities/ptr_refs -p TestPtrRefs.py
--
Exit Code: 1

Command Output (stdout):
--
lldb version 11.0.99
  clang revision 71ae267d1f4117473eb00d9fd3391733b843ca3c
  llvm revision 71ae267d1f4117473eb00d9fd3391733b843ca3c
"crashlog" and "save_crashlog" command installed, use the "--help" option for detailed help
"malloc_info", "ptr_refs", "cstr_refs", "find_variable", and "objc_refs" commands have been installed, use the "--help" options on these commands for detailed help.
LLDB library dir: /Users/buildslave/jenkins/workspace/lldb-cmake-sanitized/lldb-build/bin
LLDB import library dir: /Users/buildslave/jenkins/workspace/lldb-cmake-sanitized/lldb-build/./lib
libstdcxx tests will not be run because: Don't know how to build with libstdcxx on macosx
Skipping following debug info categories: ['dwo']
0x00007ffeea853478: stack in frame #0 of thread #1: tid 0x30427 in variable at 0x7ffeea853478:
    (const char *) my_ptr = 0x00006020000000b0 "hello"
0x00007ffeea853410: stack (red zone)

--
Command Output (stderr):
--
error: 'ptr_refs' is not a valid command.
error: 'ptr_refs' is not a valid command.

Session logs for test failures/errors/unexpected successes will go into directory '/Users/buildslave/jenkins/workspace/lldb-cmake-sanitized/test/logs'
Command invoked: /Users/buildslave/jenkins/workspace/lldb-cmake-sanitized/llvm-project/lldb/test/API/dotest.py --arch x86_64 -s /Users/buildslave/jenkins/workspace/lldb-cmake-sanitized/lldb-build/lldb-test-traces -S nm -u CXXFLAGS -u CFLAGS --codesign-identity lldb_codesign --server /Users/buildslave/jenkins/workspace/lldb-cmake-sanitized/lldb-build/./bin/debugserver --arch x86_64 --build-dir /Users/buildslave/jenkins/workspace/lldb-cmake-sanitized/lldb-build/lldb-test-build.noindex -s=/Users/buildslave/jenkins/workspace/lldb-cmake-sanitized/test/logs -t --env TERM=vt100 --env LLVM_LIBS_DIR=/Users/buildslave/jenkins/workspace/lldb-cmake-sanitized/lldb-build/./lib --inferior-env ASAN_OPTIONS=detect_stack_use_after_return=1 --inferior-env DYLD_INSERT_LIBRARIES=/Users/buildslave/jenkins/workspace/lldb-cmake-sanitized/host-compiler/lib/clang/11.0.0/lib/darwin/libclang_rt.asan_osx_dynamic.dylib --build-dir /Users/buildslave/jenkins/workspace/lldb-cmake-sanitized/lldb-build/lldb-test-build.noindex --lldb-module-cache-dir /Users/buildslave/jenkins/workspace/lldb-cmake-sanitized/lldb-build/lldb-test-build.noindex/module-cache-lldb/lldb-api --clang-module-cache-dir /Users/buildslave/jenkins/workspace/lldb-cmake-sanitized/lldb-build/lldb-test-build.noindex/module-cache-clang/lldb-api --executable /Users/buildslave/jenkins/workspace/lldb-cmake-sanitized/lldb-build/./bin/lldb --compiler /Users/buildslave/jenkins/workspace/lldb-cmake-sanitized/lldb-build/./bin/clang --dsymutil /Users/buildslave/jenkins/workspace/lldb-cmake-sanitized/lldb-build/./bin/dsymutil --filecheck /Users/buildslave/jenkins/workspace/lldb-cmake-sanitized/lldb-build/./bin/FileCheck --lldb-libs-dir /Users/buildslave/jenkins/workspace/lldb-cmake-sanitized/lldb-build/./lib /Users/buildslave/jenkins/workspace/lldb-cmake-sanitized/llvm-project/lldb/test/API/functionalities/ptr_refs -p TestPtrRefs.py
Change dir to: /Users/buildslave/jenkins/workspace/lldb-cmake-sanitized/llvm-project/lldb/test/API/functionalities/ptr_refs
runCmd: settings clear -all
output: 

runCmd: settings set symbols.enable-external-lookup false
output: 

runCmd: settings set target.auto-apply-fixits false
output: 

runCmd: settings set plugin.process.gdb-remote.packet-timeout 60
output: 

runCmd: settings set symbols.clang-modules-cache-path "/Users/buildslave/jenkins/workspace/lldb-cmake-sanitized/lldb-build/lldb-test-build.noindex/module-cache-lldb/lldb-api"
output: 

runCmd: settings set use-color false
output: 

runCmd: setting set target.prefer-dynamic-value no-dynamic-values
output: 

runCmd: settings set target.env-vars ASAN_OPTIONS=detect_stack_use_after_return=1 DYLD_INSERT_LIBRARIES=/Users/buildslave/jenkins/workspace/lldb-cmake-sanitized/host-compiler/lib/clang/11.0.0/lib/darwin/libclang_rt.asan_osx_dynamic.dylib
output: 

runCmd: script import lldb.macosx.heap
output: "crashlog" and "save_crashlog" command installed, use the "--help" option for detailed help
"malloc_info", "ptr_refs", "cstr_refs", "find_variable", and "objc_refs" commands have been installed, use the "--help" options on these commands for detailed help.


runCmd: ptr_refs my_ptr
output: 0x00007ffeea853478: stack in frame #0 of thread #1: tid 0x30427 in variable at 0x7ffeea853478:
    (const char *) my_ptr = 0x00006020000000b0 "hello"
0x00007ffeea853410: stack (red zone)


Expecting sub string: malloc
Not matched

FAIL: LLDB (/Users/buildslave/jenkins/workspace/lldb-cmake-sanitized/lldb-build/bin/clang-11-x86_64) :: test_ptr_refs_dsym (TestPtrRefs.TestPtrRefs)
<bound method SBProcess.Kill of <lldb.SBProcess; proxy of <Swig Object of type 'lldb::SBProcess *' at 0x10ea6d8a0> >>: success

runCmd: settings clear -all
output: 

runCmd: settings set symbols.enable-external-lookup false
output: 

runCmd: settings set target.auto-apply-fixits false
output: 

runCmd: settings set plugin.process.gdb-remote.packet-timeout 60
output: 

runCmd: settings set symbols.clang-modules-cache-path "/Users/buildslave/jenkins/workspace/lldb-cmake-sanitized/lldb-build/lldb-test-build.noindex/module-cache-lldb/lldb-api"
output: 

runCmd: settings set use-color false
output: 

runCmd: setting set target.prefer-dynamic-value no-dynamic-values
output: 

runCmd: settings set target.env-vars ASAN_OPTIONS=detect_stack_use_after_return=1 DYLD_INSERT_LIBRARIES=/Users/buildslave/jenkins/workspace/lldb-cmake-sanitized/host-compiler/lib/clang/11.0.0/lib/darwin/libclang_rt.asan_osx_dynamic.dylib
output: 

runCmd: script import lldb.macosx.heap
output: 

runCmd: ptr_refs my_ptr
runCmd failed!
error: 'ptr_refs' is not a valid command.


XFAIL: LLDB (/Users/buildslave/jenkins/workspace/lldb-cmake-sanitized/lldb-build/bin/clang-11-x86_64) :: test_ptr_refs_dwarf (TestPtrRefs.TestPtrRefs)
<bound method SBProcess.Kill of <lldb.SBProcess; proxy of <Swig Object of type 'lldb::SBProcess *' at 0x10de22990> >>: success

UNSUPPORTED: LLDB (/Users/buildslave/jenkins/workspace/lldb-cmake-sanitized/lldb-build/bin/clang-11-x86_64) :: test_ptr_refs_dwo (TestPtrRefs.TestPtrRefs) (test case does not fall in any category of interest for this run) 
runCmd: settings clear -all
output: 

runCmd: settings set symbols.enable-external-lookup false
output: 

runCmd: settings set target.auto-apply-fixits false
output: 

runCmd: settings set plugin.process.gdb-remote.packet-timeout 60
output: 

runCmd: settings set symbols.clang-modules-cache-path "/Users/buildslave/jenkins/workspace/lldb-cmake-sanitized/lldb-build/lldb-test-build.noindex/module-cache-lldb/lldb-api"
output: 

runCmd: settings set use-color false
output: 

runCmd: setting set target.prefer-dynamic-value no-dynamic-values
output: 

runCmd: settings set target.env-vars ASAN_OPTIONS=detect_stack_use_after_return=1 DYLD_INSERT_LIBRARIES=/Users/buildslave/jenkins/workspace/lldb-cmake-sanitized/host-compiler/lib/clang/11.0.0/lib/darwin/libclang_rt.asan_osx_dynamic.dylib
output: 

runCmd: script import lldb.macosx.heap
output: 

runCmd: ptr_refs my_ptr
runCmd failed!
error: 'ptr_refs' is not a valid command.


XFAIL: LLDB (/Users/buildslave/jenkins/workspace/lldb-cmake-sanitized/lldb-build/bin/clang-11-x86_64) :: test_ptr_refs_gmodules (TestPtrRefs.TestPtrRefs)
<bound method SBProcess.Kill of <lldb.SBProcess; proxy of <Swig Object of type 'lldb::SBProcess *' at 0x10ea6d1e0> >>: success

Restore dir to: /Users/buildslave/jenkins/workspace/lldb-cmake-sanitized/lldb-build/tools/lldb/test
======================================================================
FAIL: test_ptr_refs_dsym (TestPtrRefs.TestPtrRefs)
   Test format string functionality.
----------------------------------------------------------------------
Traceback (most recent call last):
  File "/Users/buildslave/jenkins/workspace/lldb-cmake-sanitized/llvm-project/lldb/packages/Python/lldbsuite/test/lldbtest.py", line 1751, in test_method
    return attrvalue(self)
  File "/Users/buildslave/jenkins/workspace/lldb-cmake-sanitized/llvm-project/lldb/packages/Python/lldbsuite/test/decorators.py", line 110, in wrapper
    func(*args, **kwargs)
  File "/Users/buildslave/jenkins/workspace/lldb-cmake-sanitized/llvm-project/lldb/test/API/functionalities/ptr_refs/TestPtrRefs.py", line 47, in test_ptr_refs
    self.expect("ptr_refs my_ptr", substrs=["malloc", "stack"])
  File "/Users/buildslave/jenkins/workspace/lldb-cmake-sanitized/llvm-project/lldb/packages/Python/lldbsuite/test/lldbtest.py", line 2391, in expect
    if msg else EXP_MSG(str, output, exe))
AssertionError: False is not True : 'ptr_refs my_ptr' returns expected result, got '0x00007ffeea853478: stack in frame #0 of thread #1: tid 0x30427 in variable at 0x7ffeea853478:
    (const char *) my_ptr = 0x00006020000000b0 "hello"
0x00007ffeea853410: stack (red zone)'
Config=x86_64-/Users/buildslave/jenkins/workspace/lldb-cmake-sanitized/lldb-build/bin/clang-11
----------------------------------------------------------------------
Ran 4 tests in 8.537s

RESULT: FAILED (0 passes, 1 failures, 0 errors, 1 skipped, 2 expected failures, 0 unexpected successes)

--

********************
PASS: lldb-unit :: Symbol/./SymbolTests/TestTypeSystemClang.TestIsClangType (1307 of 1972)
PASS: lldb-unit :: Language/Highlighting/./HighlighterTests/HighlighterTest.HighlighterSelectionType (1308 of 1972)
PASS: lldb-shell :: ObjectFile/ELF/PT_LOAD-overlap.yaml (1309 of 1972)
PASS: lldb-api :: types/TestIntegerTypeExpr.py (1310 of 1972)
PASS: lldb-api :: commands/expression/fixits/TestFixIts.py (1311 of 1972)
PASS: lldb-unit :: Utility/./UtilityTests/DataExtractorTest.PeekData (1312 of 1972)
PASS: lldb-api :: commands/expression/rdar42038760/TestScalarURem.py (1313 of 1972)
PASS: lldb-api :: functionalities/thread/concurrent_events/TestConcurrentManyCrash.py (1314 of 1972)
PASS: lldb-shell :: Commands/command-regex-unalias.test (1315 of 1972)
PASS: lldb-api :: lang/objc/objc-struct-return/TestObjCStructReturn.py (1316 of 1972)
PASS: lldb-unit :: Utility/./UtilityTests/TimerTest.CategoryTimes2 (1317 of 1972)
PASS: lldb-api :: python_api/file_handle/TestFileHandle.py (1318 of 1972)
PASS: lldb-api :: lang/c/local_variables/TestLocalVariables.py (1319 of 1972)
PASS: lldb-api :: functionalities/inferior-assert/TestInferiorAssert.py (1320 of 1972)
PASS: lldb-api :: functionalities/thread/concurrent_events/TestConcurrentSignalDelayBreak.py (1321 of 1972)
PASS: lldb-api :: functionalities/thread/concurrent_events/TestConcurrentCrashWithBreak.py (1322 of 1972)
PASS: lldb-api :: functionalities/gdb_remote_client/TestNestedRegDefinitions.py (1323 of 1972)
UNSUPPORTED: lldb-api :: functionalities/tsan/cpp_global_location/TestTsanCPPGlobalLocation.py (1324 of 1972)
PASS: lldb-api :: commands/target/create-no-such-arch/TestNoSuchArch.py (1325 of 1972)
UNSUPPORTED: lldb-shell :: ScriptInterpreter/Lua/breakpoint_callback.test (1326 of 1972)
PASS: lldb-unit :: Process/minidump/./LLDBMinidumpTests/MinidumpParserTest.GetPid (1327 of 1972)
PASS: lldb-api :: tools/lldb-server/register-reading/TestGdbRemoteGPacket.py (1328 of 1972)
PASS: lldb-api :: functionalities/inferior-crashing/recursive-inferior/TestRecursiveInferiorStep.py (1329 of 1972)
PASS: lldb-shell :: Minidump/memory-region.yaml (1330 of 1972)
PASS: lldb-api :: commands/expression/import-std-module/unique_ptr-dbg-info-content/TestUniquePtrDbgInfoContent.py (1331 of 1972)
PASS: lldb-api :: commands/frame/diagnose/inheritance/TestDiagnoseInheritance.py (1332 of 1972)
PASS: lldb-api :: commands/expression/persistent_variables/TestPersistentVariables.py (1333 of 1972)
PASS: lldb-api :: lang/c/inlines/TestRedefinitionsInInlines.py (1334 of 1972)
PASS: lldb-api :: macosx/thread_suspend/TestInternalThreadSuspension.py (1335 of 1972)
PASS: lldb-unit :: Utility/./UtilityTests/CompletionRequest.ShiftArguments (1336 of 1972)
PASS: lldb-api :: functionalities/data-formatter/data-formatter-stl/libcxx/atomic/TestLibCxxAtomic.py (1337 of 1972)
PASS: lldb-unit :: UnwindAssembly/x86/./UnwindAssemblyx86Tests/Testx86AssemblyInspectionEngine.TestPushESI (1338 of 1972)
PASS: lldb-api :: commands/expression/namespace_local_var_same_name_cpp_and_c/TestNamespaceLocalVarSameNameCppAndC.py (1339 of 1972)
PASS: lldb-unit :: Host/./HostTests/SocketTest.DomainListenConnectAccept (1340 of 1972)
PASS: lldb-shell :: Commands/command-source.test (1341 of 1972)
PASS: lldb-api :: functionalities/tail_call_frames/sbapi_support/TestTailCallFrameSBAPI.py (1342 of 1972)
PASS: lldb-unit :: Expression/./ExpressionTests/CppModuleConfigurationTest.UnknownLibCppFile (1343 of 1972)
PASS: lldb-shell :: ObjectFile/PECOFF/export-dllfunc.yaml (1344 of 1972)
PASS: lldb-unit :: Utility/./UtilityTests/StreamTest.AddressSize (1345 of 1972)
PASS: lldb-api :: functionalities/tail_call_frames/thread_step_out_message/TestArtificialFrameStepOutMessage.py (1346 of 1972)
PASS: lldb-shell :: SymbolFile/NativePDB/function-types-builtins.cpp (1347 of 1972)
PASS: lldb-unit :: Host/./HostTests/FileSystemTest.MakeAbsolute (1348 of 1972)
PASS: lldb-api :: functionalities/gdb_remote_client/TestTargetXMLArch.py (1349 of 1972)
PASS: lldb-shell :: Reproducer/TestVersionCheck.test (1350 of 1972)
PASS: lldb-shell :: SymbolFile/NativePDB/function-types-calling-conv.cpp (1351 of 1972)
PASS: lldb-unit :: Utility/./UtilityTests/AnsiTerminal.AtEnd (1352 of 1972)
PASS: lldb-shell :: Quit/TestQuitExitCodeHexA.test (1353 of 1972)
PASS: lldb-unit :: Utility/./UtilityTests/ListenerTest.GetEventImmediate (1354 of 1972)
PASS: lldb-shell :: Commands/command-breakpoint-col.test (1355 of 1972)
PASS: lldb-api :: lang/c/strings/TestCStrings.py (1356 of 1972)
PASS: lldb-unit :: Utility/./UtilityTests/ScalarTest.CastOperations (1357 of 1972)
PASS: lldb-api :: tools/lldb-server/TestGdbRemoteHostInfo.py (1358 of 1972)
PASS: lldb-api :: functionalities/data-formatter/data-formatter-objc/TestDataFormatterObjCNSError.py (1359 of 1972)
PASS: lldb-api :: functionalities/reproducers/attach/TestReproducerAttach.py (1360 of 1972)
PASS: lldb-unit :: Process/minidump/./LLDBMinidumpTests/MinidumpParserTest.GetMemory (1361 of 1972)
UNSUPPORTED: lldb-api :: benchmarks/libcxxlist/TestBenchmarkLibcxxList.py (1362 of 1972)
PASS: lldb-shell :: SymbolFile/DWARF/DW_AT_low_pc-addrx.s (1363 of 1972)
PASS: lldb-unit :: Utility/./UtilityTests/RecordReplayTest.InstrumentedBar (1364 of 1972)
PASS: lldb-unit :: tools/lldb-server/tests/./LLDBServerTests/StandardStartupTest.TestStopReplyContainsThreadPcs (1365 of 1972)
PASS: lldb-unit :: Utility/./UtilityTests/DataExtractorTest.GetCStrAtNullOffset (1366 of 1972)
PASS: lldb-api :: functionalities/data-formatter/data-formatter-objc/nsindexpath/TestDataFormatterNSIndexPath.py (1367 of 1972)
PASS: lldb-unit :: Expression/./ExpressionTests/CppModuleConfigurationTest.UnrelatedLibrary (1368 of 1972)
PASS: lldb-unit :: Core/./LLDBCoreTests/RichManglingContextTest.IPDRealloc (1369 of 1972)
PASS: lldb-unit :: UnwindAssembly/x86/./UnwindAssemblyx86Tests/Testx86AssemblyInspectionEngine.TestSubESP (1370 of 1972)
PASS: lldb-api :: commands/command/history/TestCommandHistory.py (1371 of 1972)
UNSUPPORTED: lldb-shell :: ScriptInterpreter/Lua/lua.test (1372 of 1972)
PASS: lldb-api :: lang/c/global_variables/TestGlobalVariables.py (1373 of 1972)
PASS: lldb-unit :: Utility/./UtilityTests/ReproducerTest.SetCapture (1374 of 1972)
PASS: lldb-unit :: Utility/./UtilityTests/StreamTest.PutPtr (1375 of 1972)
PASS: lldb-unit :: Utility/./UtilityTests/OptionsWithRawTest.SingleWordSuffix (1376 of 1972)
UNSUPPORTED: lldb-shell :: SymbolFile/PDB/typedefs.test (1377 of 1972)
PASS: lldb-unit :: Expression/./ExpressionTests/CppModuleConfigurationTest.Linux (1378 of 1972)
PASS: lldb-api :: lang/objc/variadic_methods/TestVariadicMethods.py (1379 of 1972)
PASS: lldb-unit :: DataFormatter/./LLDBFormatterTests/FormatManagerTests.CompatibleLangs (1380 of 1972)
PASS: lldb-unit :: Utility/./UtilityTests/DataExtractorTest.GetCStrUnterminated (1381 of 1972)
PASS: lldb-unit :: Utility/./UtilityTests/RangeTest.DefaultConstructor (1382 of 1972)
PASS: lldb-unit :: Utility/./UtilityTests/RangeTest.SizeTypes (1383 of 1972)
PASS: lldb-unit :: Utility/./UtilityTests/ArchSpecTest.TestSetTriple (1384 of 1972)
PASS: lldb-unit :: Process/minidump/./LLDBMinidumpTests/MinidumpParserTest.GetArchitecture (1385 of 1972)
PASS: lldb-unit :: Utility/./UtilityTests/AnsiTerminal.Incomplete (1386 of 1972)
PASS: lldb-shell :: Minidump/Windows/Sigsegv/sigsegv.test (1387 of 1972)
PASS: lldb-unit :: Symbol/./SymbolTests/DWARFCallFrameInfoTest.Basic_eh (1388 of 1972)
PASS: lldb-api :: functionalities/lazy-loading/TestLazyLoading.py (1389 of 1972)
PASS: lldb-unit :: Target/./TargetTests/ExecutionContextTest.GetByteOrderProcess (1390 of 1972)
PASS: lldb-unit :: Host/./HostTests/FileSystemTest.Readable (1391 of 1972)
PASS: lldb-unit :: Utility/./UtilityTests/LogTest.Unregister (1392 of 1972)
PASS: lldb-unit :: Language/Highlighting/./HighlighterTests/HighlighterTest.ClangComments (1393 of 1972)
PASS: lldb-api :: lang/objc/orderedset/TestOrderedSet.py (1394 of 1972)
PASS: lldb-api :: functionalities/thread/concurrent_events/TestConcurrentBreakpointDelayBreakpointOneSignal.py (1395 of 1972)
PASS: lldb-api :: commands/watchpoints/hello_watchpoint/TestMyFirstWatchpoint.py (1396 of 1972)
PASS: lldb-unit :: Utility/./UtilityTests/TimerTest.CategoryTimesStats (1397 of 1972)
PASS: lldb-api :: api/log/TestAPILog.py (1398 of 1972)
PASS: lldb-unit :: Utility/./UtilityTests/StreamTest.PutCStringWithStringRef (1399 of 1972)
UNSUPPORTED: lldb-api :: api/multiple-debuggers/TestMultipleDebuggers.py (1400 of 1972)
PASS: lldb-api :: python_api/sblaunchinfo/TestSBLaunchInfo.py (1401 of 1972)
PASS: lldb-api :: lang/c/step-target/TestStepTarget.py (1402 of 1972)
PASS: lldb-api :: functionalities/data-formatter/data-formatter-objc/TestDataFormatterObjCCF.py (1403 of 1972)
PASS: lldb-api :: lang/objc/modules-hash-mismatch/TestClangModulesHashMismatch.py (1404 of 1972)
PASS: lldb-unit :: Utility/./UtilityTests/OptionsWithRawTest.ArgsButNoLeadingDash (1405 of 1972)
UNSUPPORTED: lldb-shell :: Register/x86-64-zmm-write.test (1406 of 1972)
PASS: lldb-api :: lang/cpp/namespace/TestNamespace.py (1407 of 1972)
UNSUPPORTED: lldb-shell :: Register/x86-zmm-write.test (1408 of 1972)
PASS: lldb-api :: lang/cpp/llvm-style/TestLLVMStyle.py (1409 of 1972)
PASS: lldb-api :: commands/watchpoints/watchpoint_set_command/TestWatchLocationWithWatchSet.py (1410 of 1972)
UNSUPPORTED: lldb-api :: lang/cpp/printf/TestPrintf.py (1411 of 1972)
PASS: lldb-api :: functionalities/data-formatter/synthupdate/TestSyntheticFilterRecompute.py (1412 of 1972)
PASS: lldb-unit :: ObjectFile/Breakpad/./ObjectFileBreakpadTests/FileRecord.parse (1413 of 1972)
PASS: lldb-api :: functionalities/completion/TestCompletion.py (1414 of 1972)
PASS: lldb-api :: functionalities/thread/concurrent_events/TestConcurrentCrashWithWatchpointBreakpointSignal.py (1415 of 1972)
PASS: lldb-unit :: ScriptInterpreter/Python/./ScriptInterpreterPythonTests/PythonDataObjectsTest.TestPythonListManipulation (1416 of 1972)
PASS: lldb-unit :: Utility/./UtilityTests/UriParserTest.SchemeHostSeparator4 (1417 of 1972)
PASS: lldb-shell :: SymbolFile/DWARF/deterministic-build.cpp (1418 of 1972)
UNSUPPORTED: lldb-shell :: SymbolFile/DWARF/debug-types-expressions.test (1419 of 1972)
PASS: lldb-unit :: Utility/./UtilityTests/FileSpecTest.CopyByAppendingPathComponent (1420 of 1972)
PASS: lldb-unit :: Utility/./UtilityTests/StringListTest.InsertStringAtIndexStart (1421 of 1972)
PASS: lldb-unit :: Utility/./UtilityTests/StringListTest.InsertStringAtIndexMove (1422 of 1972)
PASS: lldb-api :: commands/expression/import-std-module/vector-dbg-info-content/TestDbgInfoContentVectorFromStdModule.py (1423 of 1972)
PASS: lldb-api :: commands/expression/top-level/TestTopLevelExprs.py (1424 of 1972)
PASS: lldb-unit :: Utility/./UtilityTests/StreamTest.AddressRange (1425 of 1972)
PASS: lldb-shell :: Host/TestCustomShell.test (1426 of 1972)
PASS: lldb-shell :: BuildScript/compiler-full-path.test (1427 of 1972)
PASS: lldb-api :: lang/cpp/template/TestTemplateArgs.py (1428 of 1972)
PASS: lldb-unit :: Editline/./EditlineTests/EditlineTestFixture.EditlineReceivesSingleLineText (1429 of 1972)
PASS: lldb-api :: commands/expression/import-std-module/basic/TestImportStdModule.py (1430 of 1972)
PASS: lldb-shell :: ObjectFile/wasm/embedded-debug-sections.yaml (1431 of 1972)
PASS: lldb-api :: lang/objc/modules/TestObjCModules.py (1432 of 1972)
PASS: lldb-unit :: Host/./HostTests/MainLoopTest.UnmonitoredSignal (1433 of 1972)
PASS: lldb-shell :: SymbolFile/Breakpad/symtab.test (1434 of 1972)
PASS: lldb-api :: functionalities/breakpoint/breakpoint_command/TestBreakpointCommandsFromPython.py (1435 of 1972)
PASS: lldb-unit :: Utility/./UtilityTests/UriParserTest.BracketedHostnameWithColon (1436 of 1972)
PASS: lldb-unit :: Utility/./UtilityTests/ScalarTest.Promotion (1437 of 1972)
PASS: lldb-unit :: Target/./TargetTests/PathMappingListTest.RemapRoot (1438 of 1972)
PASS: lldb-unit :: Utility/./UtilityTests/StreamTest.ShiftOperatorStrings (1439 of 1972)
PASS: lldb-api :: lang/cpp/class-template-parameter-pack/TestClassTemplateParameterPack.py (1440 of 1972)
PASS: lldb-unit :: Expression/./ExpressionTests/CppModuleConfigurationTest.Sysroot (1441 of 1972)
PASS: lldb-unit :: Utility/./UtilityTests/StringExtractorTest.GetHexU8_Exact (1442 of 1972)
PASS: lldb-unit :: Language/CPlusPlus/./LanguageCPlusPlusTests/CPlusPlusLanguage.FindAlternateFunctionManglings (1443 of 1972)
PASS: lldb-shell :: SymbolFile/DWARF/dir-separator-no-comp-dir-relative-name.s (1444 of 1972)
PASS: lldb-unit :: Process/minidump/./LLDBMinidumpTests/MinidumpParserTest.GetThreadContext_x86_32_wow64 (1445 of 1972)
PASS: lldb-api :: lang/cpp/char1632_t/TestChar1632T.py (1446 of 1972)
UNSUPPORTED: lldb-api :: functionalities/tsan/thread_numbers/TestTsanThreadNumbers.py (1447 of 1972)
PASS: lldb-unit :: Host/./HostTests/Host.WaitStatusFormat (1448 of 1972)
PASS: lldb-unit :: Utility/./UtilityTests/RegularExpression.Valid (1449 of 1972)
PASS: lldb-api :: macosx/version_zero/TestGetVersionZeroVersion.py (1450 of 1972)
PASS: lldb-unit :: Utility/./UtilityTests/StreamTeeTest.Write (1451 of 1972)
PASS: lldb-unit :: Host/./HostTests/FileSystemTest.FileAndDirectoryComponents (1452 of 1972)
PASS: lldb-api :: commands/expression/calculator_mode/TestCalculatorMode.py (1453 of 1972)
PASS: lldb-api :: functionalities/tail_call_frames/disambiguate_call_site/TestDisambiguateCallSite.py (1454 of 1972)
PASS: lldb-unit :: Utility/./UtilityTests/StringExtractorTest.GetHexBytesAvail_OddPair2 (1455 of 1972)
PASS: lldb-api :: functionalities/breakpoint/breakpoint_command/TestRegexpBreakCommand.py (1456 of 1972)
PASS: lldb-unit :: Utility/./UtilityTests/CompletionRequest.TryCompleteCurrentArgMode (1457 of 1972)
PASS: lldb-api :: lang/objc/objc-ivar-stripped/TestObjCIvarStripped.py (1458 of 1972)
PASS: lldb-shell :: Quit/TestQuitExitCode0.test (1459 of 1972)
PASS: lldb-unit :: Utility/./UtilityTests/SubsystemRAIITest.SubsystemWithErrorFailure (1460 of 1972)
PASS: lldb-shell :: SymbolFile/DWARF/find-basic-type.cpp (1461 of 1972)
PASS: lldb-unit :: Language/Highlighting/./HighlighterTests/HighlighterTest.Colons (1462 of 1972)
UNSUPPORTED: lldb-api :: functionalities/darwin_log/source/debug/TestDarwinLogSourceDebug.py (1463 of 1972)
UNSUPPORTED: lldb-api :: python_api/event/TestEvents.py (1464 of 1972)
PASS: lldb-unit :: Utility/./UtilityTests/StringExtractorTest.GetHexBytes_FullString (1465 of 1972)
PASS: lldb-unit :: Process/gdb-remote/./ProcessGdbRemoteTests/GDBRemoteClientBaseTest.SendContinueAndInterrupt2PacketBug (1466 of 1972)
PASS: lldb-unit :: Utility/./UtilityTests/StringExtractorTest.GetHexU8_Underflow (1467 of 1972)
PASS: lldb-api :: commands/expression/issue_11588/Test11588.py (1468 of 1972)
UNSUPPORTED: lldb-shell :: SymbolFile/PDB/pointers.test (1469 of 1972)
UNSUPPORTED: lldb-api :: functionalities/asan/TestReportData.py (1470 of 1972)
PASS: lldb-unit :: Utility/./UtilityTests/StreamTest.AddressPrefixAndSuffix (1471 of 1972)
PASS: lldb-shell :: SymbolFile/DWARF/debug-types-address-ranges.s (1472 of 1972)
PASS: lldb-unit :: UnwindAssembly/x86/./UnwindAssemblyx86Tests/Testx86AssemblyInspectionEngine.Testi386IgnoredRegisters (1473 of 1972)
PASS: lldb-api :: commands/expression/test/TestExprs.py (1474 of 1972)
PASS: lldb-unit :: Utility/./UtilityTests/StringLexerTest.NextIfList (1475 of 1972)
PASS: lldb-api :: commands/frame/diagnose/complicated-expression/TestComplicatedExpression.py (1476 of 1972)
PASS: lldb-api :: lang/objc/objc-static-method/TestObjCStaticMethod.py (1477 of 1972)
PASS: lldb-unit :: Utility/./UtilityTests/LogTest.Register (1478 of 1972)
PASS: lldb-shell :: ObjectFile/PECOFF/uuid.yaml (1479 of 1972)
PASS: lldb-unit :: Utility/./UtilityTests/UriParserTest.BadPort2 (1480 of 1972)
PASS: lldb-api :: python_api/process/TestProcessAPI.py (1481 of 1972)
PASS: lldb-api :: commands/expression/import-std-module/unique_ptr/TestUniquePtrFromStdModule.py (1482 of 1972)
PASS: lldb-shell :: SymbolFile/Breakpad/unwind-via-stack-win-no-memory-info.yaml (1483 of 1972)
PASS: lldb-unit :: Utility/./UtilityTests/StringExtractorTest.GetHexBytesAvail_Underflow (1484 of 1972)
PASS: lldb-api :: functionalities/data-formatter/data-formatter-stl/libcxx/multiset/TestDataFormatterLibcxxMultiSet.py (1485 of 1972)
PASS: lldb-unit :: Symbol/./SymbolTests/TestTypeSystemClang.TestGetEnumIntegerTypeInvalid (1486 of 1972)
UNSUPPORTED: lldb-api :: functionalities/breakpoint/breakpoint_in_delayslot/TestAvoidBreakpointInDelaySlot.py (1487 of 1972)
PASS: lldb-shell :: SymbolFile/DWARF/debug_aranges-empty-section.s (1488 of 1972)
PASS: lldb-unit :: Utility/./UtilityTests/CompletionRequest.TestCompletionOwnership (1489 of 1972)
PASS: lldb-api :: lang/c/const_variables/TestConstVariables.py (1490 of 1972)
PASS: lldb-unit :: ScriptInterpreter/Python/./ScriptInterpreterPythonTests/PythonDataObjectsTest.TestInstanceNameResolutionNoDot (1491 of 1972)
PASS: lldb-unit :: Utility/./UtilityTests/RangeTest.ContainsRangeStartingFromZero (1492 of 1972)
UNSUPPORTED: lldb-api :: functionalities/unwind/standard/TestStandardUnwind.py (1493 of 1972)
PASS: lldb-unit :: Utility/./UtilityTests/StreamTest.ShiftOperatorChars (1494 of 1972)
PASS: lldb-api :: functionalities/dead-strip/TestDeadStrip.py (1495 of 1972)
PASS: lldb-unit :: Utility/./UtilityTests/StreamTeeTest.Assignment (1496 of 1972)
FAIL: lldb-api :: python_api/thread/TestThreadAPI.py (1497 of 1972)
******************** TEST 'lldb-api :: python_api/thread/TestThreadAPI.py' FAILED ********************
Script:
--
/usr/local/bin/python /Users/buildslave/jenkins/workspace/lldb-cmake-sanitized/llvm-project/lldb/test/API/dotest.py --arch x86_64 -s /Users/buildslave/jenkins/workspace/lldb-cmake-sanitized/lldb-build/lldb-test-traces -S nm -u CXXFLAGS -u CFLAGS --codesign-identity lldb_codesign --server /Users/buildslave/jenkins/workspace/lldb-cmake-sanitized/lldb-build/./bin/debugserver --arch x86_64 --build-dir /Users/buildslave/jenkins/workspace/lldb-cmake-sanitized/lldb-build/lldb-test-build.noindex -s=/Users/buildslave/jenkins/workspace/lldb-cmake-sanitized/test/logs -t --env TERM=vt100 --env LLVM_LIBS_DIR=/Users/buildslave/jenkins/workspace/lldb-cmake-sanitized/lldb-build/./lib --inferior-env ASAN_OPTIONS=detect_stack_use_after_return=1 --inferior-env DYLD_INSERT_LIBRARIES=/Users/buildslave/jenkins/workspace/lldb-cmake-sanitized/host-compiler/lib/clang/11.0.0/lib/darwin/libclang_rt.asan_osx_dynamic.dylib --build-dir /Users/buildslave/jenkins/workspace/lldb-cmake-sanitized/lldb-build/lldb-test-build.noindex --lldb-module-cache-dir /Users/buildslave/jenkins/workspace/lldb-cmake-sanitized/lldb-build/lldb-test-build.noindex/module-cache-lldb/lldb-api --clang-module-cache-dir /Users/buildslave/jenkins/workspace/lldb-cmake-sanitized/lldb-build/lldb-test-build.noindex/module-cache-clang/lldb-api --executable /Users/buildslave/jenkins/workspace/lldb-cmake-sanitized/lldb-build/./bin/lldb --compiler /Users/buildslave/jenkins/workspace/lldb-cmake-sanitized/lldb-build/./bin/clang --dsymutil /Users/buildslave/jenkins/workspace/lldb-cmake-sanitized/lldb-build/./bin/dsymutil --filecheck /Users/buildslave/jenkins/workspace/lldb-cmake-sanitized/lldb-build/./bin/FileCheck --lldb-libs-dir /Users/buildslave/jenkins/workspace/lldb-cmake-sanitized/lldb-build/./lib /Users/buildslave/jenkins/workspace/lldb-cmake-sanitized/llvm-project/lldb/test/API/python_api/thread -p TestThreadAPI.py
--
Exit Code: 1

Command Output (stdout):
--
lldb version 11.0.99
  clang revision 71ae267d1f4117473eb00d9fd3391733b843ca3c
  llvm revision 71ae267d1f4117473eb00d9fd3391733b843ca3c
LLDB library dir: /Users/buildslave/jenkins/workspace/lldb-cmake-sanitized/lldb-build/bin
LLDB import library dir: /Users/buildslave/jenkins/workspace/lldb-cmake-sanitized/lldb-build/./lib
libstdcxx tests will not be run because: Don't know how to build with libstdcxx on macosx
Skipping following debug info categories: ['dwo']
start addr: 0x10396ee66
end addr: 0x10396ee70
start addr: 0x10cc18e66
end addr: 0x10cc18e70
start addr: 0x10f507e66
end addr: 0x10f507e70

--
Command Output (stderr):
--

Session logs for test failures/errors/unexpected successes will go into directory '/Users/buildslave/jenkins/workspace/lldb-cmake-sanitized/test/logs'
Command invoked: /Users/buildslave/jenkins/workspace/lldb-cmake-sanitized/llvm-project/lldb/test/API/dotest.py --arch x86_64 -s /Users/buildslave/jenkins/workspace/lldb-cmake-sanitized/lldb-build/lldb-test-traces -S nm -u CXXFLAGS -u CFLAGS --codesign-identity lldb_codesign --server /Users/buildslave/jenkins/workspace/lldb-cmake-sanitized/lldb-build/./bin/debugserver --arch x86_64 --build-dir /Users/buildslave/jenkins/workspace/lldb-cmake-sanitized/lldb-build/lldb-test-build.noindex -s=/Users/buildslave/jenkins/workspace/lldb-cmake-sanitized/test/logs -t --env TERM=vt100 --env LLVM_LIBS_DIR=/Users/buildslave/jenkins/workspace/lldb-cmake-sanitized/lldb-build/./lib --inferior-env ASAN_OPTIONS=detect_stack_use_after_return=1 --inferior-env DYLD_INSERT_LIBRARIES=/Users/buildslave/jenkins/workspace/lldb-cmake-sanitized/host-compiler/lib/clang/11.0.0/lib/darwin/libclang_rt.asan_osx_dynamic.dylib --build-dir /Users/buildslave/jenkins/workspace/lldb-cmake-sanitized/lldb-build/lldb-test-build.noindex --lldb-module-cache-dir /Users/buildslave/jenkins/workspace/lldb-cmake-sanitized/lldb-build/lldb-test-build.noindex/module-cache-lldb/lldb-api --clang-module-cache-dir /Users/buildslave/jenkins/workspace/lldb-cmake-sanitized/lldb-build/lldb-test-build.noindex/module-cache-clang/lldb-api --executable /Users/buildslave/jenkins/workspace/lldb-cmake-sanitized/lldb-build/./bin/lldb --compiler /Users/buildslave/jenkins/workspace/lldb-cmake-sanitized/lldb-build/./bin/clang --dsymutil /Users/buildslave/jenkins/workspace/lldb-cmake-sanitized/lldb-build/./bin/dsymutil --filecheck /Users/buildslave/jenkins/workspace/lldb-cmake-sanitized/lldb-build/./bin/FileCheck --lldb-libs-dir /Users/buildslave/jenkins/workspace/lldb-cmake-sanitized/lldb-build/./lib /Users/buildslave/jenkins/workspace/lldb-cmake-sanitized/llvm-project/lldb/test/API/python_api/thread -p TestThreadAPI.py
Change dir to: /Users/buildslave/jenkins/workspace/lldb-cmake-sanitized/llvm-project/lldb/test/API/python_api/thread
runCmd: settings clear -all
output: 

runCmd: settings set symbols.enable-external-lookup false
output: 

runCmd: settings set target.auto-apply-fixits false
output: 

runCmd: settings set plugin.process.gdb-remote.packet-timeout 60
output: 

runCmd: settings set symbols.clang-modules-cache-path "/Users/buildslave/jenkins/workspace/lldb-cmake-sanitized/lldb-build/lldb-test-build.noindex/module-cache-lldb/lldb-api"
output: 

runCmd: settings set use-color false
output: 

runCmd: setting set target.prefer-dynamic-value no-dynamic-values
output: 

runCmd: settings set target.env-vars ASAN_OPTIONS=detect_stack_use_after_return=1 DYLD_INSERT_LIBRARIES=/Users/buildslave/jenkins/workspace/lldb-cmake-sanitized/host-compiler/lib/clang/11.0.0/lib/darwin/libclang_rt.asan_osx_dynamic.dylib
output: 

runCmd: breakpoint list
output: Current breakpoints:
1: file = 'main.cpp', line = 17, exact_match = 0, locations = 1
  1.1: where = a.out`main + 115 at main.cpp:17:5, address = a.out[0x0000000100000f53], unresolved, hit count = 0 



runCmd: process status
output: Process 15478 stopped
* thread #1, queue = 'com.apple.main-thread', stop reason = breakpoint 1.1
    frame #0: 0x000000010e4c6f53 a.out`main(argc=1, argv=0x00007ffee17394c8) at main.cpp:17:5
   14  	
   15  	    printf("after the loop: my_char='%c'\n", my_char); // 'my_char' should print out as 'x'.
   16  	
-> 17  	    return 0; // Set break point at this line and check variable 'my_char'.
    	    ^
   18  	}


<bound method SBProcess.Kill of <lldb.SBProcess; proxy of <Swig Object of type 'lldb::SBProcess *' at 0x10e2bbab0> >>: success

PASS: LLDB (/Users/buildslave/jenkins/workspace/lldb-cmake-sanitized/lldb-build/bin/clang-11-x86_64) :: test_get_process_dsym (TestThreadAPI.ThreadAPITestCase)
runCmd: settings clear -all
output: 

runCmd: settings set symbols.enable-external-lookup false
output: 

runCmd: settings set target.auto-apply-fixits false
output: 

runCmd: settings set plugin.process.gdb-remote.packet-timeout 60
output: 

runCmd: settings set symbols.clang-modules-cache-path "/Users/buildslave/jenkins/workspace/lldb-cmake-sanitized/lldb-build/lldb-test-build.noindex/module-cache-lldb/lldb-api"
output: 

runCmd: settings set use-color false
output: 

runCmd: setting set target.prefer-dynamic-value no-dynamic-values
output: 

runCmd: settings set target.env-vars ASAN_OPTIONS=detect_stack_use_after_return=1 DYLD_INSERT_LIBRARIES=/Users/buildslave/jenkins/workspace/lldb-cmake-sanitized/host-compiler/lib/clang/11.0.0/lib/darwin/libclang_rt.asan_osx_dynamic.dylib
output: 

runCmd: breakpoint list
output: Current breakpoints:
1: file = 'main.cpp', line = 17, exact_match = 0, locations = 1
  1.1: where = a.out`main + 115 at main.cpp:17:5, address = a.out[0x0000000100000f53], unresolved, hit count = 0 



runCmd: process status
output: Process 15561 stopped
* thread #1, queue = 'com.apple.main-thread', stop reason = breakpoint 1.1
    frame #0: 0x0000000108979f53 a.out`main(argc=1, argv=0x00007ffee7286498) at main.cpp:17:5
   14  	
   15  	    printf("after the loop: my_char='%c'\n", my_char); // 'my_char' should print out as 'x'.
   16  	
-> 17  	    return 0; // Set break point at this line and check variable 'my_char'.
    	    ^
   18  	}


<bound method SBProcess.Kill of <lldb.SBProcess; proxy of <Swig Object of type 'lldb::SBProcess *' at 0x10d61f990> >>: success

PASS: LLDB (/Users/buildslave/jenkins/workspace/lldb-cmake-sanitized/lldb-build/bin/clang-11-x86_64) :: test_get_process_dwarf (TestThreadAPI.ThreadAPITestCase)
UNSUPPORTED: LLDB (/Users/buildslave/jenkins/workspace/lldb-cmake-sanitized/lldb-build/bin/clang-11-x86_64) :: test_get_process_dwo (TestThreadAPI.ThreadAPITestCase) (test case does not fall in any category of interest for this run) 
runCmd: settings clear -all
output: 

runCmd: settings set symbols.enable-external-lookup false
output: 

runCmd: settings set target.auto-apply-fixits false
output: 

runCmd: settings set plugin.process.gdb-remote.packet-timeout 60
output: 

runCmd: settings set symbols.clang-modules-cache-path "/Users/buildslave/jenkins/workspace/lldb-cmake-sanitized/lldb-build/lldb-test-build.noindex/module-cache-lldb/lldb-api"
output: 

runCmd: settings set use-color false
output: 

runCmd: setting set target.prefer-dynamic-value no-dynamic-values
output: 

runCmd: settings set target.env-vars ASAN_OPTIONS=detect_stack_use_after_return=1 DYLD_INSERT_LIBRARIES=/Users/buildslave/jenkins/workspace/lldb-cmake-sanitized/host-compiler/lib/clang/11.0.0/lib/darwin/libclang_rt.asan_osx_dynamic.dylib
output: 

runCmd: breakpoint list
output: Current breakpoints:
1: file = 'main.cpp', line = 17, exact_match = 0, locations = 1
  1.1: where = a.out`main + 115 at main.cpp:17:5, address = a.out[0x0000000100000f53], unresolved, hit count = 0 



runCmd: process status
output: Process 15652 stopped
* thread #1, queue = 'com.apple.main-thread', stop reason = breakpoint 1.1
    frame #0: 0x0000000104b96f53 a.out`main(argc=1, argv=0x00007ffeeb069498) at main.cpp:17:5
   14  	
   15  	    printf("after the loop: my_char='%c'\n", my_char); // 'my_char' should print out as 'x'.
   16  	
-> 17  	    return 0; // Set break point at this line and check variable 'my_char'.
    	    ^
   18  	}


<bound method SBProcess.Kill of <lldb.SBProcess; proxy of <Swig Object of type 'lldb::SBProcess *' at 0x10e2bb8d0> >>: success

PASS: LLDB (/Users/buildslave/jenkins/workspace/lldb-cmake-sanitized/lldb-build/bin/clang-11-x86_64) :: test_get_process_gmodules (TestThreadAPI.ThreadAPITestCase)
runCmd: settings clear -all
output: 

runCmd: settings set symbols.enable-external-lookup false
output: 

runCmd: settings set target.auto-apply-fixits false
output: 

runCmd: settings set plugin.process.gdb-remote.packet-timeout 60
output: 

runCmd: settings set symbols.clang-modules-cache-path "/Users/buildslave/jenkins/workspace/lldb-cmake-sanitized/lldb-build/lldb-test-build.noindex/module-cache-lldb/lldb-api"
output: 

runCmd: settings set use-color false
output: 

runCmd: setting set target.prefer-dynamic-value no-dynamic-values
output: 

runCmd: settings set target.env-vars ASAN_OPTIONS=detect_stack_use_after_return=1 DYLD_INSERT_LIBRARIES=/Users/buildslave/jenkins/workspace/lldb-cmake-sanitized/host-compiler/lib/clang/11.0.0/lib/darwin/libclang_rt.asan_osx_dynamic.dylib
output: 

<bound method SBProcess.Kill of <lldb.SBProcess; proxy of <Swig Object of type 'lldb::SBProcess *' at 0x10d61f960> >>: success

PASS: LLDB (/Users/buildslave/jenkins/workspace/lldb-cmake-sanitized/lldb-build/bin/clang-11-x86_64) :: test_get_stop_description_dsym (TestThreadAPI.ThreadAPITestCase)
runCmd: settings clear -all
output: 

runCmd: settings set symbols.enable-external-lookup false
output: 

runCmd: settings set target.auto-apply-fixits false
output: 

runCmd: settings set plugin.process.gdb-remote.packet-timeout 60
output: 

runCmd: settings set symbols.clang-modules-cache-path "/Users/buildslave/jenkins/workspace/lldb-cmake-sanitized/lldb-build/lldb-test-build.noindex/module-cache-lldb/lldb-api"
output: 

runCmd: settings set use-color false
output: 

runCmd: setting set target.prefer-dynamic-value no-dynamic-values
output: 

runCmd: settings set target.env-vars ASAN_OPTIONS=detect_stack_use_after_return=1 DYLD_INSERT_LIBRARIES=/Users/buildslave/jenkins/workspace/lldb-cmake-sanitized/host-compiler/lib/clang/11.0.0/lib/darwin/libclang_rt.asan_osx_dynamic.dylib
output: 

<bound method SBProcess.Kill of <lldb.SBProcess; proxy of <Swig Object of type 'lldb::SBProcess *' at 0x10dd062d0> >>: success

PASS: LLDB (/Users/buildslave/jenkins/workspace/lldb-cmake-sanitized/lldb-build/bin/clang-11-x86_64) :: test_get_stop_description_dwarf (TestThreadAPI.ThreadAPITestCase)
UNSUPPORTED: LLDB (/Users/buildslave/jenkins/workspace/lldb-cmake-sanitized/lldb-build/bin/clang-11-x86_64) :: test_get_stop_description_dwo (TestThreadAPI.ThreadAPITestCase) (test case does not fall in any category of interest for this run) 
runCmd: settings clear -all
output: 

runCmd: settings set symbols.enable-external-lookup false
output: 

runCmd: settings set target.auto-apply-fixits false
output: 

runCmd: settings set plugin.process.gdb-remote.packet-timeout 60
output: 

runCmd: settings set symbols.clang-modules-cache-path "/Users/buildslave/jenkins/workspace/lldb-cmake-sanitized/lldb-build/lldb-test-build.noindex/module-cache-lldb/lldb-api"
output: 

runCmd: settings set use-color false
output: 

runCmd: setting set target.prefer-dynamic-value no-dynamic-values
output: 

runCmd: settings set target.env-vars ASAN_OPTIONS=detect_stack_use_after_return=1 DYLD_INSERT_LIBRARIES=/Users/buildslave/jenkins/workspace/lldb-cmake-sanitized/host-compiler/lib/clang/11.0.0/lib/darwin/libclang_rt.asan_osx_dynamic.dylib
output: 

<bound method SBProcess.Kill of <lldb.SBProcess; proxy of <Swig Object of type 'lldb::SBProcess *' at 0x10d61f990> >>: success

PASS: LLDB (/Users/buildslave/jenkins/workspace/lldb-cmake-sanitized/lldb-build/bin/clang-11-x86_64) :: test_get_stop_description_gmodules (TestThreadAPI.ThreadAPITestCase)
runCmd: settings clear -all
output: 

runCmd: settings set symbols.enable-external-lookup false
output: 

runCmd: settings set target.auto-apply-fixits false
output: 

runCmd: settings set plugin.process.gdb-remote.packet-timeout 60
output: 

runCmd: settings set symbols.clang-modules-cache-path "/Users/buildslave/jenkins/workspace/lldb-cmake-sanitized/lldb-build/lldb-test-build.noindex/module-cache-lldb/lldb-api"
output: 

runCmd: settings set use-color false
output: 

runCmd: setting set target.prefer-dynamic-value no-dynamic-values
output: 

runCmd: settings set target.env-vars ASAN_OPTIONS=detect_stack_use_after_return=1 DYLD_INSERT_LIBRARIES=/Users/buildslave/jenkins/workspace/lldb-cmake-sanitized/host-compiler/lib/clang/11.0.0/lib/darwin/libclang_rt.asan_osx_dynamic.dylib
output: 

runCmd: breakpoint list
output: Current breakpoints:
1: file = 'main2.cpp', line = 21, exact_match = 0, locations = 1
  1.1: where = test_run_to_address_dsym`b(int) + 22 at main2.cpp:21:17, address = test_run_to_address_dsym[0x0000000100000e66], unresolved, hit count = 0 



runCmd: thread backtrace
output: * thread #1, queue = 'com.apple.main-thread', stop reason = breakpoint 1.1
  * frame #0: 0x000000010396ee66 test_run_to_address_dsym`b(val=1) at main2.cpp:21:17
    frame #1: 0x000000010396ee0d test_run_to_address_dsym`a(val=1) at main2.cpp:11:16
    frame #2: 0x000000010396eee0 test_run_to_address_dsym`main(argc=1, argv=0x00007ffeec291470) at main2.cpp:36:14
    frame #3: 0x00007fff6d99a085 libdyld.dylib`start + 1


runCmd: breakpoint list
output: Current breakpoints:
1: file = 'main2.cpp', line = 21, exact_match = 0, locations = 1 Options: disabled 
  1.1: where = test_run_to_address_dsym`b(int) + 22 at main2.cpp:21:17, address = 0x000000010396ee66, unresolved, hit count = 1 



runCmd: thread backtrace
output: * thread #1, queue = 'com.apple.main-thread', stop reason = step over
  * frame #0: 0x000000010396ee9d test_run_to_address_dsym`b(val=1) at main2.cpp:26:12
    frame #1: 0x000000010396ee0d test_run_to_address_dsym`a(val=1) at main2.cpp:11:16
    frame #2: 0x000000010396eee0 test_run_to_address_dsym`main(argc=1, argv=0x00007ffeec291470) at main2.cpp:36:14
    frame #3: 0x00007fff6d99a085 libdyld.dylib`start + 1


runCmd: process status
output: Process 15994 stopped
* thread #1, queue = 'com.apple.main-thread', stop reason = run to address: 0x000000010396ee66 
    frame #0: 0x000000010396ee66 test_run_to_address_dsym`b(val=2) at main2.cpp:21:17
   18  	int b(int val)
   19  	{
   20  	    int rc = c(val);
-> 21  	    void *ptr = malloc(1024); // thread step-out of malloc into function b.
    	                ^
   22  	    if (!ptr)
   23  	        return -1;
   24  	    else


<bound method SBProcess.Kill of <lldb.SBProcess; proxy of <Swig Object of type 'lldb::SBProcess *' at 0x10db07de0> >>: success

PASS: LLDB (/Users/buildslave/jenkins/workspace/lldb-cmake-sanitized/lldb-build/bin/clang-11-x86_64) :: test_run_to_address_dsym (TestThreadAPI.ThreadAPITestCase)
runCmd: settings clear -all
output: 

runCmd: settings set symbols.enable-external-lookup false
output: 

runCmd: settings set target.auto-apply-fixits false
output: 

runCmd: settings set plugin.process.gdb-remote.packet-timeout 60
output: 

runCmd: settings set symbols.clang-modules-cache-path "/Users/buildslave/jenkins/workspace/lldb-cmake-sanitized/lldb-build/lldb-test-build.noindex/module-cache-lldb/lldb-api"
output: 

runCmd: settings set use-color false
output: 

runCmd: setting set target.prefer-dynamic-value no-dynamic-values
output: 

runCmd: settings set target.env-vars ASAN_OPTIONS=detect_stack_use_after_return=1 DYLD_INSERT_LIBRARIES=/Users/buildslave/jenkins/workspace/lldb-cmake-sanitized/host-compiler/lib/clang/11.0.0/lib/darwin/libclang_rt.asan_osx_dynamic.dylib
output: 

runCmd: breakpoint list
output: Current breakpoints:
1: file = 'main2.cpp', line = 21, exact_match = 0, locations = 1
  1.1: where = test_run_to_address_dwarf`b(int) + 22 at main2.cpp:21:17, address = test_run_to_address_dwarf[0x0000000100000e66], unresolved, hit count = 0 



runCmd: thread backtrace
output: * thread #1, queue = 'com.apple.main-thread', stop reason = breakpoint 1.1
  * frame #0: 0x000000010cc18e66 test_run_to_address_dwarf`b(val=1) at main2.cpp:21:17
    frame #1: 0x000000010cc18e0d test_run_to_address_dwarf`a(val=1) at main2.cpp:11:16
    frame #2: 0x000000010cc18ee0 test_run_to_address_dwarf`main(argc=1, argv=0x00007ffee2fe7470) at main2.cpp:36:14
    frame #3: 0x00007fff6d99a085 libdyld.dylib`start + 1


runCmd: breakpoint list
output: Current breakpoints:
1: file = 'main2.cpp', line = 21, exact_match = 0, locations = 1 Options: disabled 
  1.1: where = test_run_to_address_dwarf`b(int) + 22 at main2.cpp:21:17, address = 0x000000010cc18e66, unresolved, hit count = 1 



runCmd: thread backtrace
output: * thread #1, queue = 'com.apple.main-thread', stop reason = step over
  * frame #0: 0x000000010cc18e9d test_run_to_address_dwarf`b(val=1) at main2.cpp:26:12
    frame #1: 0x000000010cc18e0d test_run_to_address_dwarf`a(val=1) at main2.cpp:11:16
    frame #2: 0x000000010cc18ee0 test_run_to_address_dwarf`main(argc=1, argv=0x00007ffee2fe7470) at main2.cpp:36:14
    frame #3: 0x00007fff6d99a085 libdyld.dylib`start + 1


runCmd: process status
output: Process 16121 stopped
* thread #1, queue = 'com.apple.main-thread', stop reason = run to address: 0x000000010cc18e66 
    frame #0: 0x000000010cc18e66 test_run_to_address_dwarf`b(val=2) at main2.cpp:21:17
   18  	int b(int val)
   19  	{
   20  	    int rc = c(val);
-> 21  	    void *ptr = malloc(1024); // thread step-out of malloc into function b.
    	                ^
   22  	    if (!ptr)
   23  	        return -1;
   24  	    else


<bound method SBProcess.Kill of <lldb.SBProcess; proxy of <Swig Object of type 'lldb::SBProcess *' at 0x10d61f960> >>: success

PASS: LLDB (/Users/buildslave/jenkins/workspace/lldb-cmake-sanitized/lldb-build/bin/clang-11-x86_64) :: test_run_to_address_dwarf (TestThreadAPI.ThreadAPITestCase)
UNSUPPORTED: LLDB (/Users/buildslave/jenkins/workspace/lldb-cmake-sanitized/lldb-build/bin/clang-11-x86_64) :: test_run_to_address_dwo (TestThreadAPI.ThreadAPITestCase) (test case does not fall in any category of interest for this run) 
runCmd: settings clear -all
output: 

runCmd: settings set symbols.enable-external-lookup false
output: 

runCmd: settings set target.auto-apply-fixits false
output: 

runCmd: settings set plugin.process.gdb-remote.packet-timeout 60
output: 

runCmd: settings set symbols.clang-modules-cache-path "/Users/buildslave/jenkins/workspace/lldb-cmake-sanitized/lldb-build/lldb-test-build.noindex/module-cache-lldb/lldb-api"
output: 

runCmd: settings set use-color false
output: 

runCmd: setting set target.prefer-dynamic-value no-dynamic-values
output: 

runCmd: settings set target.env-vars ASAN_OPTIONS=detect_stack_use_after_return=1 DYLD_INSERT_LIBRARIES=/Users/buildslave/jenkins/workspace/lldb-cmake-sanitized/host-compiler/lib/clang/11.0.0/lib/darwin/libclang_rt.asan_osx_dynamic.dylib
output: 

runCmd: breakpoint list
output: Current breakpoints:
1: file = 'main2.cpp', line = 21, exact_match = 0, locations = 1
  1.1: where = test_run_to_address_gmodules`b(int) + 22 at main2.cpp:21:17, address = test_run_to_address_gmodules[0x0000000100000e66], unresolved, hit count = 0 



runCmd: thread backtrace
output: * thread #1, queue = 'com.apple.main-thread', stop reason = breakpoint 1.1
  * frame #0: 0x000000010f507e66 test_run_to_address_gmodules`b(val=1) at main2.cpp:21:17
    frame #1: 0x000000010f507e0d test_run_to_address_gmodules`a(val=1) at main2.cpp:11:16
    frame #2: 0x000000010f507ee0 test_run_to_address_gmodules`main(argc=1, argv=0x00007ffee06f8460) at main2.cpp:36:14
    frame #3: 0x00007fff6d99a085 libdyld.dylib`start + 1


runCmd: breakpoint list
output: Current breakpoints:
1: file = 'main2.cpp', line = 21, exact_match = 0, locations = 1 Options: disabled 
  1.1: where = test_run_to_address_gmodules`b(int) + 22 at main2.cpp:21:17, address = 0x000000010f507e66, unresolved, hit count = 1 



runCmd: thread backtrace
output: * thread #1, queue = 'com.apple.main-thread', stop reason = step over
  * frame #0: 0x000000010f507e9d test_run_to_address_gmodules`b(val=1) at main2.cpp:26:12
    frame #1: 0x000000010f507e0d test_run_to_address_gmodules`a(val=1) at main2.cpp:11:16
    frame #2: 0x000000010f507ee0 test_run_to_address_gmodules`main(argc=1, argv=0x00007ffee06f8460) at main2.cpp:36:14
    frame #3: 0x00007fff6d99a085 libdyld.dylib`start + 1


runCmd: process status
output: Process 16233 stopped
* thread #1, queue = 'com.apple.main-thread', stop reason = run to address: 0x000000010f507e66 
    frame #0: 0x000000010f507e66 test_run_to_address_gmodules`b(val=2) at main2.cpp:21:17
   18  	int b(int val)
   19  	{
   20  	    int rc = c(val);
-> 21  	    void *ptr = malloc(1024); // thread step-out of malloc into function b.
    	                ^
   22  	    if (!ptr)
   23  	        return -1;
   24  	    else


<bound method SBProcess.Kill of <lldb.SBProcess; proxy of <Swig Object of type 'lldb::SBProcess *' at 0x10dd062d0> >>: success

PASS: LLDB (/Users/buildslave/jenkins/workspace/lldb-cmake-sanitized/lldb-build/bin/clang-11-x86_64) :: test_run_to_address_gmodules (TestThreadAPI.ThreadAPITestCase)
runCmd: settings clear -all
output: 

runCmd: settings set symbols.enable-external-lookup false
output: 

runCmd: settings set target.auto-apply-fixits false
output: 

runCmd: settings set plugin.process.gdb-remote.packet-timeout 60
output: 

runCmd: settings set symbols.clang-modules-cache-path "/Users/buildslave/jenkins/workspace/lldb-cmake-sanitized/lldb-build/lldb-test-build.noindex/module-cache-lldb/lldb-api"
output: 

runCmd: settings set use-color false
output: 

runCmd: setting set target.prefer-dynamic-value no-dynamic-values
output: 

runCmd: settings set target.env-vars ASAN_OPTIONS=detect_stack_use_after_return=1 DYLD_INSERT_LIBRARIES=/Users/buildslave/jenkins/workspace/lldb-cmake-sanitized/host-compiler/lib/clang/11.0.0/lib/darwin/libclang_rt.asan_osx_dynamic.dylib
output: 

FAIL: LLDB (/Users/buildslave/jenkins/workspace/lldb-cmake-sanitized/lldb-build/bin/clang-11-x86_64) :: test_step_out_of_malloc_into_function_b_dsym (TestThreadAPI.ThreadAPITestCase)
<bound method SBProcess.Kill of <lldb.SBProcess; proxy of <Swig Object of type 'lldb::SBProcess *' at 0x10d61f990> >>: success

runCmd: settings clear -all
output: 

runCmd: settings set symbols.enable-external-lookup false
output: 

runCmd: settings set target.auto-apply-fixits false
output: 

runCmd: settings set plugin.process.gdb-remote.packet-timeout 60
output: 

runCmd: settings set symbols.clang-modules-cache-path "/Users/buildslave/jenkins/workspace/lldb-cmake-sanitized/lldb-build/lldb-test-build.noindex/module-cache-lldb/lldb-api"
output: 

runCmd: settings set use-color false
output: 

runCmd: setting set target.prefer-dynamic-value no-dynamic-values
output: 

runCmd: settings set target.env-vars ASAN_OPTIONS=detect_stack_use_after_return=1 DYLD_INSERT_LIBRARIES=/Users/buildslave/jenkins/workspace/lldb-cmake-sanitized/host-compiler/lib/clang/11.0.0/lib/darwin/libclang_rt.asan_osx_dynamic.dylib
output: 

FAIL: LLDB (/Users/buildslave/jenkins/workspace/lldb-cmake-sanitized/lldb-build/bin/clang-11-x86_64) :: test_step_out_of_malloc_into_function_b_dwarf (TestThreadAPI.ThreadAPITestCase)
<bound method SBProcess.Kill of <lldb.SBProcess; proxy of <Swig Object of type 'lldb::SBProcess *' at 0x10db07de0> >>: success

UNSUPPORTED: LLDB (/Users/buildslave/jenkins/workspace/lldb-cmake-sanitized/lldb-build/bin/clang-11-x86_64) :: test_step_out_of_malloc_into_function_b_dwo (TestThreadAPI.ThreadAPITestCase) (test case does not fall in any category of interest for this run) 
runCmd: settings clear -all
output: 

runCmd: settings set symbols.enable-external-lookup false
output: 

runCmd: settings set target.auto-apply-fixits false
output: 

runCmd: settings set plugin.process.gdb-remote.packet-timeout 60
output: 

runCmd: settings set symbols.clang-modules-cache-path "/Users/buildslave/jenkins/workspace/lldb-cmake-sanitized/lldb-build/lldb-test-build.noindex/module-cache-lldb/lldb-api"
output: 

runCmd: settings set use-color false
output: 

runCmd: setting set target.prefer-dynamic-value no-dynamic-values
output: 

runCmd: settings set target.env-vars ASAN_OPTIONS=detect_stack_use_after_return=1 DYLD_INSERT_LIBRARIES=/Users/buildslave/jenkins/workspace/lldb-cmake-sanitized/host-compiler/lib/clang/11.0.0/lib/darwin/libclang_rt.asan_osx_dynamic.dylib
output: 

FAIL: LLDB (/Users/buildslave/jenkins/workspace/lldb-cmake-sanitized/lldb-build/bin/clang-11-x86_64) :: test_step_out_of_malloc_into_function_b_gmodules (TestThreadAPI.ThreadAPITestCase)
<bound method SBProcess.Kill of <lldb.SBProcess; proxy of <Swig Object of type 'lldb::SBProcess *' at 0x10d61f990> >>: success

runCmd: settings clear -all
output: 

runCmd: settings set symbols.enable-external-lookup false
output: 

runCmd: settings set target.auto-apply-fixits false
output: 

runCmd: settings set plugin.process.gdb-remote.packet-timeout 60
output: 

runCmd: settings set symbols.clang-modules-cache-path "/Users/buildslave/jenkins/workspace/lldb-cmake-sanitized/lldb-build/lldb-test-build.noindex/module-cache-lldb/lldb-api"
output: 

runCmd: settings set use-color false
output: 

runCmd: setting set target.prefer-dynamic-value no-dynamic-values
output: 

runCmd: settings set target.env-vars ASAN_OPTIONS=detect_stack_use_after_return=1 DYLD_INSERT_LIBRARIES=/Users/buildslave/jenkins/workspace/lldb-cmake-sanitized/host-compiler/lib/clang/11.0.0/lib/darwin/libclang_rt.asan_osx_dynamic.dylib
output: 

runCmd: breakpoint list
output: Current breakpoints:
1: file = 'main2.cpp', line = 21, exact_match = 0, locations = 1
  1.1: where = test_step_over_3_times_dsym`b(int) + 22 at main2.cpp:21:17, address = test_step_over_3_times_dsym[0x0000000100000e66], unresolved, hit count = 0 



runCmd: thread backtrace
output: * thread #1, queue = 'com.apple.main-thread', stop reason = breakpoint 1.1
  * frame #0: 0x0000000106221e66 test_step_over_3_times_dsym`b(val=1) at main2.cpp:21:17
    frame #1: 0x0000000106221e0d test_step_over_3_times_dsym`a(val=1) at main2.cpp:11:16
    frame #2: 0x0000000106221ee0 test_step_over_3_times_dsym`main(argc=1, argv=0x00007ffee99de468) at main2.cpp:36:14
    frame #3: 0x00007fff6d99a085 libdyld.dylib`start + 1
    frame #4: 0x00007fff6d99a085 libdyld.dylib`start + 1


runCmd: thread backtrace
output: * thread #1, queue = 'com.apple.main-thread', stop reason = step over
  * frame #0: 0x0000000106221e9d test_step_over_3_times_dsym`b(val=1) at main2.cpp:26:12
    frame #1: 0x0000000106221e0d test_step_over_3_times_dsym`a(val=1) at main2.cpp:11:16
    frame #2: 0x0000000106221ee0 test_step_over_3_times_dsym`main(argc=1, argv=0x00007ffee99de468) at main2.cpp:36:14
    frame #3: 0x00007fff6d99a085 libdyld.dylib`start + 1
    frame #4: 0x00007fff6d99a085 libdyld.dylib`start + 1


<bound method SBProcess.Kill of <lldb.SBProcess; proxy of <Swig Object of type 'lldb::SBProcess *' at 0x10db07de0> >>: success

PASS: LLDB (/Users/buildslave/jenkins/workspace/lldb-cmake-sanitized/lldb-build/bin/clang-11-x86_64) :: test_step_over_3_times_dsym (TestThreadAPI.ThreadAPITestCase)
runCmd: settings clear -all
output: 

runCmd: settings set symbols.enable-external-lookup false
output: 

runCmd: settings set target.auto-apply-fixits false
output: 

runCmd: settings set plugin.process.gdb-remote.packet-timeout 60
output: 

runCmd: settings set symbols.clang-modules-cache-path "/Users/buildslave/jenkins/workspace/lldb-cmake-sanitized/lldb-build/lldb-test-build.noindex/module-cache-lldb/lldb-api"
output: 

runCmd: settings set use-color false
output: 

runCmd: setting set target.prefer-dynamic-value no-dynamic-values
output: 

runCmd: settings set target.env-vars ASAN_OPTIONS=detect_stack_use_after_return=1 DYLD_INSERT_LIBRARIES=/Users/buildslave/jenkins/workspace/lldb-cmake-sanitized/host-compiler/lib/clang/11.0.0/lib/darwin/libclang_rt.asan_osx_dynamic.dylib
output: 

runCmd: breakpoint list
output: Current breakpoints:
1: file = 'main2.cpp', line = 21, exact_match = 0, locations = 1
  1.1: where = test_step_over_3_times_dwarf`b(int) + 22 at main2.cpp:21:17, address = test_step_over_3_times_dwarf[0x0000000100000e66], unresolved, hit count = 0 



runCmd: thread backtrace
output: * thread #1, queue = 'com.apple.main-thread', stop reason = breakpoint 1.1
  * frame #0: 0x0000000101e47e66 test_step_over_3_times_dwarf`b(val=1) at main2.cpp:21:17
    frame #1: 0x0000000101e47e0d test_step_over_3_times_dwarf`a(val=1) at main2.cpp:11:16
    frame #2: 0x0000000101e47ee0 test_step_over_3_times_dwarf`main(argc=1, argv=0x00007ffeeddb8460) at main2.cpp:36:14
    frame #3: 0x00007fff6d99a085 libdyld.dylib`start + 1


runCmd: thread backtrace
output: * thread #1, queue = 'com.apple.main-thread', stop reason = step over
  * frame #0: 0x0000000101e47e9d test_step_over_3_times_dwarf`b(val=1) at main2.cpp:26:12
    frame #1: 0x0000000101e47e0d test_step_over_3_times_dwarf`a(val=1) at main2.cpp:11:16
    frame #2: 0x0000000101e47ee0 test_step_over_3_times_dwarf`main(argc=1, argv=0x00007ffeeddb8460) at main2.cpp:36:14
    frame #3: 0x00007fff6d99a085 libdyld.dylib`start + 1


<bound method SBProcess.Kill of <lldb.SBProcess; proxy of <Swig Object of type 'lldb::SBProcess *' at 0x10d61f990> >>: success

PASS: LLDB (/Users/buildslave/jenkins/workspace/lldb-cmake-sanitized/lldb-build/bin/clang-11-x86_64) :: test_step_over_3_times_dwarf (TestThreadAPI.ThreadAPITestCase)
UNSUPPORTED: LLDB (/Users/buildslave/jenkins/workspace/lldb-cmake-sanitized/lldb-build/bin/clang-11-x86_64) :: test_step_over_3_times_dwo (TestThreadAPI.ThreadAPITestCase) (test case does not fall in any category of interest for this run) 
runCmd: settings clear -all
output: 

runCmd: settings set symbols.enable-external-lookup false
output: 

runCmd: settings set target.auto-apply-fixits false
output: 

runCmd: settings set plugin.process.gdb-remote.packet-timeout 60
output: 

runCmd: settings set symbols.clang-modules-cache-path "/Users/buildslave/jenkins/workspace/lldb-cmake-sanitized/lldb-build/lldb-test-build.noindex/module-cache-lldb/lldb-api"
output: 

runCmd: settings set use-color false
output: 

runCmd: setting set target.prefer-dynamic-value no-dynamic-values
output: 

runCmd: settings set target.env-vars ASAN_OPTIONS=detect_stack_use_after_return=1 DYLD_INSERT_LIBRARIES=/Users/buildslave/jenkins/workspace/lldb-cmake-sanitized/host-compiler/lib/clang/11.0.0/lib/darwin/libclang_rt.asan_osx_dynamic.dylib
output: 

runCmd: breakpoint list
output: Current breakpoints:
1: file = 'main2.cpp', line = 21, exact_match = 0, locations = 1
  1.1: where = test_step_over_3_times_gmodules`b(int) + 22 at main2.cpp:21:17, address = test_step_over_3_times_gmodules[0x0000000100000e66], unresolved, hit count = 0 



runCmd: thread backtrace
output: * thread #1, queue = 'com.apple.main-thread', stop reason = breakpoint 1.1
  * frame #0: 0x0000000100277e66 test_step_over_3_times_gmodules`b(val=1) at main2.cpp:21:17
    frame #1: 0x0000000100277e0d test_step_over_3_times_gmodules`a(val=1) at main2.cpp:11:16
    frame #2: 0x0000000100277ee0 test_step_over_3_times_gmodules`main(argc=1, argv=0x00007ffeef988458) at main2.cpp:36:14
    frame #3: 0x00007fff6d99a085 libdyld.dylib`start + 1
    frame #4: 0x00007fff6d99a085 libdyld.dylib`start + 1


runCmd: thread backtrace
output: * thread #1, queue = 'com.apple.main-thread', stop reason = step over
  * frame #0: 0x0000000100277e9d test_step_over_3_times_gmodules`b(val=1) at main2.cpp:26:12
    frame #1: 0x0000000100277e0d test_step_over_3_times_gmodules`a(val=1) at main2.cpp:11:16
    frame #2: 0x0000000100277ee0 test_step_over_3_times_gmodules`main(argc=1, argv=0x00007ffeef988458) at main2.cpp:36:14
    frame #3: 0x00007fff6d99a085 libdyld.dylib`start + 1
    frame #4: 0x00007fff6d99a085 libdyld.dylib`start + 1


<bound method SBProcess.Kill of <lldb.SBProcess; proxy of <Swig Object of type 'lldb::SBProcess *' at 0x10dd062d0> >>: success

PASS: LLDB (/Users/buildslave/jenkins/workspace/lldb-cmake-sanitized/lldb-build/bin/clang-11-x86_64) :: test_step_over_3_times_gmodules (TestThreadAPI.ThreadAPITestCase)
Restore dir to: /Users/buildslave/jenkins/workspace/lldb-cmake-sanitized/lldb-build/tools/lldb/test
======================================================================
ERROR: test_step_out_of_malloc_into_function_b_dsym (TestThreadAPI.ThreadAPITestCase)
    Test Python SBThread.StepOut() API to step out of a malloc call where the call site is at function b().
----------------------------------------------------------------------
Traceback (most recent call last):
  File "/Users/buildslave/jenkins/workspace/lldb-cmake-sanitized/llvm-project/lldb/packages/Python/lldbsuite/test/lldbtest.py", line 1751, in test_method
    return attrvalue(self)
  File "/Users/buildslave/jenkins/workspace/lldb-cmake-sanitized/llvm-project/lldb/packages/Python/lldbsuite/test/decorators.py", line 110, in wrapper
    func(*args, **kwargs)
  File "/Users/buildslave/jenkins/workspace/lldb-cmake-sanitized/llvm-project/lldb/packages/Python/lldbsuite/test/decorators.py", line 110, in wrapper
    func(*args, **kwargs)
  File "/Users/buildslave/jenkins/workspace/lldb-cmake-sanitized/llvm-project/lldb/packages/Python/lldbsuite/test/decorators.py", line 110, in wrapper
    func(*args, **kwargs)
  File "/Users/buildslave/jenkins/workspace/lldb-cmake-sanitized/llvm-project/lldb/test/API/python_api/thread/TestThreadAPI.py", line 50, in test_step_out_of_malloc_into_function_b
    self.step_out_of_malloc_into_function_b(self.exe_name)
  File "/Users/buildslave/jenkins/workspace/lldb-cmake-sanitized/llvm-project/lldb/test/API/python_api/thread/TestThreadAPI.py", line 157, in step_out_of_malloc_into_function_b
    thread.IsValid(),
AttributeError: 'NoneType' object has no attribute 'IsValid'
Config=x86_64-/Users/buildslave/jenkins/workspace/lldb-cmake-sanitized/lldb-build/bin/clang-11
======================================================================
ERROR: test_step_out_of_malloc_into_function_b_dwarf (TestThreadAPI.ThreadAPITestCase)
    Test Python SBThread.StepOut() API to step out of a malloc call where the call site is at function b().
----------------------------------------------------------------------
Traceback (most recent call last):
  File "/Users/buildslave/jenkins/workspace/lldb-cmake-sanitized/llvm-project/lldb/packages/Python/lldbsuite/test/lldbtest.py", line 1751, in test_method
    return attrvalue(self)
  File "/Users/buildslave/jenkins/workspace/lldb-cmake-sanitized/llvm-project/lldb/packages/Python/lldbsuite/test/decorators.py", line 110, in wrapper
    func(*args, **kwargs)
  File "/Users/buildslave/jenkins/workspace/lldb-cmake-sanitized/llvm-project/lldb/packages/Python/lldbsuite/test/decorators.py", line 110, in wrapper
    func(*args, **kwargs)
  File "/Users/buildslave/jenkins/workspace/lldb-cmake-sanitized/llvm-project/lldb/packages/Python/lldbsuite/test/decorators.py", line 110, in wrapper
    func(*args, **kwargs)
  File "/Users/buildslave/jenkins/workspace/lldb-cmake-sanitized/llvm-project/lldb/test/API/python_api/thread/TestThreadAPI.py", line 50, in test_step_out_of_malloc_into_function_b
    self.step_out_of_malloc_into_function_b(self.exe_name)
  File "/Users/buildslave/jenkins/workspace/lldb-cmake-sanitized/llvm-project/lldb/test/API/python_api/thread/TestThreadAPI.py", line 157, in step_out_of_malloc_into_function_b
    thread.IsValid(),
AttributeError: 'NoneType' object has no attribute 'IsValid'
Config=x86_64-/Users/buildslave/jenkins/workspace/lldb-cmake-sanitized/lldb-build/bin/clang-11
======================================================================
ERROR: test_step_out_of_malloc_into_function_b_gmodules (TestThreadAPI.ThreadAPITestCase)
    Test Python SBThread.StepOut() API to step out of a malloc call where the call site is at function b().
----------------------------------------------------------------------
Traceback (most recent call last):
  File "/Users/buildslave/jenkins/workspace/lldb-cmake-sanitized/llvm-project/lldb/packages/Python/lldbsuite/test/lldbtest.py", line 1751, in test_method
    return attrvalue(self)
  File "/Users/buildslave/jenkins/workspace/lldb-cmake-sanitized/llvm-project/lldb/packages/Python/lldbsuite/test/decorators.py", line 110, in wrapper
    func(*args, **kwargs)
  File "/Users/buildslave/jenkins/workspace/lldb-cmake-sanitized/llvm-project/lldb/packages/Python/lldbsuite/test/decorators.py", line 110, in wrapper
    func(*args, **kwargs)
  File "/Users/buildslave/jenkins/workspace/lldb-cmake-sanitized/llvm-project/lldb/packages/Python/lldbsuite/test/decorators.py", line 110, in wrapper
    func(*args, **kwargs)
  File "/Users/buildslave/jenkins/workspace/lldb-cmake-sanitized/llvm-project/lldb/test/API/python_api/thread/TestThreadAPI.py", line 50, in test_step_out_of_malloc_into_function_b
    self.step_out_of_malloc_into_function_b(self.exe_name)
  File "/Users/buildslave/jenkins/workspace/lldb-cmake-sanitized/llvm-project/lldb/test/API/python_api/thread/TestThreadAPI.py", line 157, in step_out_of_malloc_into_function_b
    thread.IsValid(),
AttributeError: 'NoneType' object has no attribute 'IsValid'
Config=x86_64-/Users/buildslave/jenkins/workspace/lldb-cmake-sanitized/lldb-build/bin/clang-11
----------------------------------------------------------------------
Ran 20 tests in 37.960s

RESULT: FAILED (12 passes, 0 failures, 3 errors, 5 skipped, 0 expected failures, 0 unexpected successes)

--

********************
PASS: lldb-api :: lang/c/offsetof/TestOffsetof.py (1498 of 1972)
PASS: lldb-unit :: SymbolFile/NativePDB/./SymbolFileNativePDBTests/PDBFPOProgramToDWARFExpressionTests.UnresolvedRegisterAssignmentReference (1499 of 1972)
UNSUPPORTED: lldb-shell :: ScriptInterpreter/Lua/convenience_variables.test (1500 of 1972)
PASS: lldb-unit :: tools/lldb-server/tests/./LLDBServerTests/TestBase.DebugserverEnv (1501 of 1972)
PASS: lldb-api :: commands/process/launch-with-shellexpand/TestLaunchWithShellExpand.py (1502 of 1972)
PASS: lldb-unit :: Utility/./UtilityTests/FileSpecTest.FormatFileSpec (1503 of 1972)
PASS: lldb-api :: commands/expression/completion-in-lambda-and-unnamed-class/TestCompletionInLambdaAndUnnamedClass.py (1504 of 1972)
PASS: lldb-shell :: Settings/TestFrameFormatMangling.test (1505 of 1972)
PASS: lldb-unit :: Utility/./UtilityTests/ArgsTest.ReplaceArgumentAtIndexFarOutOfRange (1506 of 1972)
PASS: lldb-unit :: Utility/./UtilityTests/StreamTest.PutCharWhitespace (1507 of 1972)
PASS: lldb-unit :: Utility/./UtilityTests/StringListTest.AppendStringMove (1508 of 1972)
UNSUPPORTED: lldb-shell :: ScriptInterpreter/Lua/command_script_import.test (1509 of 1972)
PASS: lldb-unit :: Utility/./UtilityTests/BinaryStreamTest.PutSLEB128SixBytes (1510 of 1972)
PASS: lldb-api :: python_api/type/TestTypeList.py (1511 of 1972)
PASS: lldb-unit :: Host/./HostTests/SocketTest.TCPListen0ConnectAccept (1512 of 1972)
PASS: lldb-api :: python_api/lldbutil/iter/TestRegistersIterator.py (1513 of 1972)
PASS: lldb-api :: lang/objc/foundation/TestSymbolTable.py (1514 of 1972)
PASS: lldb-api :: python_api/findvalue_duplist/TestSBFrameFindValue.py (1515 of 1972)
PASS: lldb-unit :: Utility/./UtilityTests/LogChannelTest.EnableOptions (1516 of 1972)
PASS: lldb-api :: python_api/sbtype_typeclass/TestSBTypeTypeClass.py (1517 of 1972)
PASS: lldb-unit :: debugserver/./debugserverTests/RNBSocket.LoopBackListenIPv6 (1518 of 1972)
PASS: lldb-unit :: Language/Highlighting/./HighlighterTests/HighlighterTest.ClangPreserveNewLine (1519 of 1972)
PASS: lldb-unit :: Utility/./UtilityTests/UUIDTest.Validity (1520 of 1972)
PASS: lldb-api :: commands/frame/diagnose/local-variable/TestLocalVariable.py (1521 of 1972)
PASS: lldb-unit :: Utility/./UtilityTests/UUIDTest.SetFromStringRef (1522 of 1972)
PASS: lldb-api :: lang/c/bitfields/TestBitfields.py (1523 of 1972)
UNSUPPORTED: lldb-shell :: ScriptInterpreter/Lua/watchpoint_callback.test (1524 of 1972)
PASS: lldb-unit :: Utility/./UtilityTests/LogChannelEnabledTest.LogThread (1525 of 1972)
PASS: lldb-unit :: Utility/./UtilityTests/ArgsTest.ReplaceArgumentAtIndexLonger (1526 of 1972)
PASS: lldb-unit :: Target/./TargetTests/StackFrameRecognizerTest.NullModuleRegex (1527 of 1972)
PASS: lldb-api :: tools/lldb-server/TestGdbRemote_qThreadStopInfo.py (1528 of 1972)
PASS: lldb-api :: functionalities/object-file/TestImageListMultiArchitecture.py (1529 of 1972)
PASS: lldb-unit :: UnwindAssembly/x86/./UnwindAssemblyx86Tests/Testx86AssemblyInspectionEngine.TestSimple32bitFrameFunction (1530 of 1972)
PASS: lldb-unit :: UnwindAssembly/x86/./UnwindAssemblyx86Tests/Testx86AssemblyInspectionEngine.TestSpillRegToStackViaMOVx86_64 (1531 of 1972)
PASS: lldb-api :: commands/expression/static-initializers/TestStaticInitializers.py (1532 of 1972)
PASS: lldb-unit :: UnwindAssembly/x86/./UnwindAssemblyx86Tests/Testx86AssemblyInspectionEngine.TestPopR14 (1533 of 1972)
PASS: lldb-unit :: Utility/./UtilityTests/GeneratorTest.Create (1534 of 1972)
PASS: lldb-api :: commands/breakpoint/command/list/TestBreakpointCommandList.py (1535 of 1972)
PASS: lldb-api :: lang/cpp/diamond/TestDiamond.py (1536 of 1972)
PASS: lldb-api :: lang/cpp/namespace_definitions/TestNamespaceDefinitions.py (1537 of 1972)
PASS: lldb-shell :: Unwind/trap_frame_sym_ctx.test (1538 of 1972)
PASS: lldb-unit :: Utility/./UtilityTests/BinaryStreamTest.PutULEB128ThreeBytes (1539 of 1972)
PASS: lldb-api :: functionalities/breakpoint/breakpoint_options/TestBreakpointOptions.py (1540 of 1972)
PASS: lldb-unit :: Utility/./UtilityTests/ArchSpecTest.OperatorBool (1541 of 1972)
PASS: lldb-api :: functionalities/tail_call_frames/thread_step_out_or_return/TestSteppingOutWithArtificialFrames.py (1542 of 1972)
PASS: lldb-unit :: Utility/./UtilityTests/UserIDResolver.GetGroupName (1543 of 1972)
PASS: lldb-unit :: UnwindAssembly/x86/./UnwindAssemblyx86Tests/Testx86AssemblyInspectionEngine.TestPushR12 (1544 of 1972)
PASS: lldb-unit :: Expression/./ExpressionTests/DiagnosticManagerTest.PutString (1545 of 1972)
PASS: lldb-unit :: Utility/./UtilityTests/ConstStringTest.FromMidOfBufferStringRef (1546 of 1972)
PASS: lldb-unit :: ScriptInterpreter/Python/./ScriptInterpreterPythonTests/PythonDataObjectsTest.TestGlobalNameResolutionNoDot (1547 of 1972)
PASS: lldb-unit :: Language/Highlighting/./HighlighterTests/HighlighterTest.ClangOperators (1548 of 1972)
PASS: lldb-api :: functionalities/thread/step_out/TestThreadStepOut.py (1549 of 1972)
PASS: lldb-shell :: Settings/TestFrameFormatNoColor.test (1550 of 1972)
PASS: lldb-unit :: Utility/./UtilityTests/StringListTest.LongestCommonPrefixDuplicateElement (1551 of 1972)
PASS: lldb-unit :: Utility/./UtilityTests/OptionsWithRawTest.TerminatedQuote (1552 of 1972)
PASS: lldb-api :: lang/c/conflicting-symbol/TestConflictingSymbol.py (1553 of 1972)
PASS: lldb-shell :: Settings/TestDisassemblyFormat.test (1554 of 1972)
PASS: lldb-api :: sanity/TestModuleCacheSanity.py (1555 of 1972)
PASS: lldb-unit :: Process/gdb-remote/./ProcessGdbRemoteTests/GDBRemoteClientBaseTest.InterruptNoResponse (1556 of 1972)
PASS: lldb-api :: lang/cpp/nsimport/TestCppNsImport.py (1557 of 1972)
PASS: lldb-api :: lang/cpp/trivial_abi/TestTrivialABI.py (1558 of 1972)
PASS: lldb-unit :: Utility/./UtilityTests/ProcessInfoTest.Constructor (1559 of 1972)
PASS: lldb-shell :: Settings/TestDisableColor.test (1560 of 1972)
PASS: lldb-api :: api/check_public_api_headers/TestPublicAPIHeaders.py (1561 of 1972)
PASS: lldb-unit :: UnwindAssembly/x86/./UnwindAssemblyx86Tests/Testx86AssemblyInspectionEngine.TestPopR15 (1562 of 1972)
UNSUPPORTED: lldb-api :: commands/watchpoints/variable_out_of_scope/TestWatchedVarHitWhenInScope.py (1563 of 1972)
PASS: lldb-unit :: Utility/./UtilityTests/LogChannelEnabledTest.LogVerboseThread (1564 of 1972)
PASS: lldb-api :: lang/objc/foundation/TestConstStrings.py (1565 of 1972)
PASS: lldb-unit :: Host/./HostTests/SocketTest.UDPGetConnectURI (1566 of 1972)
PASS: lldb-unit :: Utility/./UtilityTests/RangeTest.SetRangeBase (1567 of 1972)
PASS: lldb-api :: functionalities/data-formatter/pyobjsynthprovider/TestPyObjSynthProvider.py (1568 of 1972)
PASS: lldb-unit :: Host/./HostTests/FileActionTest.Open (1569 of 1972)
PASS: lldb-unit :: Utility/./UtilityTests/StringExtractorTest.InitMisc (1570 of 1972)
PASS: lldb-api :: commands/expression/xvalue/TestXValuePrinting.py (1571 of 1972)
PASS: lldb-api :: commands/frame/diagnose/bad-reference/TestBadReference.py (1572 of 1972)
PASS: lldb-shell :: SymbolFile/DWARF/compilercontext.ll (1573 of 1972)
PASS: lldb-api :: functionalities/breakpoint/breakpoint_hit_count/TestBreakpointHitCount.py (1574 of 1972)
PASS: lldb-shell :: ObjectFile/ELF/section-overlap.yaml (1575 of 1972)
PASS: lldb-shell :: Heap/heap-cstr.test (1576 of 1972)
PASS: lldb-api :: functionalities/data-formatter/user-format-vs-summary/TestUserFormatVsSummary.py (1577 of 1972)
PASS: lldb-api :: functionalities/signal/handle-abrt/TestHandleAbort.py (1578 of 1972)
PASS: lldb-unit :: Utility/./UtilityTests/StringListTest.LongestCommonPrefix (1579 of 1972)
PASS: lldb-api :: tools/lldb-server/TestGdbRemoteRegisterState.py (1580 of 1972)
PASS: lldb-unit :: Utility/./UtilityTests/StringExtractorTest.GetHexBytesAvail_Partial (1581 of 1972)
PASS: lldb-unit :: Utility/./UtilityTests/Flags.AnySet (1582 of 1972)
PASS: lldb-unit :: SymbolFile/DWARF/./SymbolFileDWARFTests/SymbolFileDWARFTests.TestAbbrevOrder1Start1 (1583 of 1972)
PASS: lldb-api :: functionalities/data-formatter/nsdictionarysynth/TestNSDictionarySynthetic.py (1584 of 1972)
PASS: lldb-unit :: UnwindAssembly/x86/./UnwindAssemblyx86Tests/Testx86AssemblyInspectionEngine.TestPushR15 (1585 of 1972)
PASS: lldb-unit :: Expression/./ExpressionTests/CppModuleConfigurationTest.LibCppV2 (1586 of 1972)
PASS: lldb-unit :: Utility/./UtilityTests/FileSpecTest.EqualDotsWindows (1587 of 1972)
PASS: lldb-unit :: Utility/./UtilityTests/ArchSpecTest.TestParseMachCPUDashSubtypeTripleSimple (1588 of 1972)
PASS: lldb-unit :: Utility/./UtilityTests/ListenerTest.GetEventWait (1589 of 1972)
PASS: lldb-shell :: ObjectFile/PECOFF/basic-info.yaml (1590 of 1972)
UNSUPPORTED: lldb-shell :: Register/x86-gp-read.test (1591 of 1972)
PASS: lldb-api :: types/TestLongTypesExpr.py (1592 of 1972)
PASS: lldb-unit :: Utility/./UtilityTests/ScalarTest.APIntConstructor (1593 of 1972)
PASS: lldb-api :: macosx/find-app-in-bundle/TestFindAppInBundle.py (1594 of 1972)
PASS: lldb-unit :: Utility/./UtilityTests/StringListTest.RemoveBlankLines (1595 of 1972)
PASS: lldb-api :: commands/frame/recognizer/TestFrameRecognizer.py (1596 of 1972)
PASS: lldb-unit :: Utility/./UtilityTests/ScalarTest.RightShiftOperator (1597 of 1972)
UNSUPPORTED: lldb-api :: functionalities/data-formatter/data-formatter-stl/libstdcpp/list/TestDataFormatterStdList.py (1598 of 1972)
PASS: lldb-api :: functionalities/postmortem/netbsd-core/TestNetBSDCore.py (1599 of 1972)
PASS: lldb-api :: macosx/DBGSourcePathRemapping/TestDSYMSourcePathRemapping.py (1600 of 1972)
PASS: lldb-unit :: Utility/./UtilityTests/ConstStringTest.NullAndEmptyStates (1601 of 1972)
PASS: lldb-api :: tools/lldb-vscode/breakpoint/TestVSCode_setBreakpoints.py (1602 of 1972)
PASS: lldb-unit :: UnwindAssembly/x86/./UnwindAssemblyx86Tests/Testx86AssemblyInspectionEngine.TestPopEBX (1603 of 1972)
UNSUPPORTED: lldb-api :: functionalities/thread/create_during_step/TestCreateDuringStep.py (1604 of 1972)
PASS: lldb-unit :: ScriptInterpreter/Python/./ScriptInterpreterPythonTests/PythonDataObjectsTest.TestPythonTupleValues (1605 of 1972)
PASS: lldb-shell :: SymbolFile/DWARF/split-dwarf-multiple-cu.ll (1606 of 1972)
PASS: lldb-shell :: SymbolFile/DWARF/find-basic-namespace.cpp (1607 of 1972)
PASS: lldb-api :: functionalities/source-map/TestTargetSourceMap.py (1608 of 1972)
PASS: lldb-unit :: Utility/./UtilityTests/StringListTest.CopyListEmpty (1609 of 1972)
PASS: lldb-unit :: debugserver/./debugserverTests/RNBSocket.LoopBackConnectIPv4 (1610 of 1972)
PASS: lldb-api :: lang/cpp/stl/TestSTL.py (1611 of 1972)
PASS: lldb-shell :: Driver/TestProcessAttach.test (1612 of 1972)
PASS: lldb-api :: commands/platform/basic/TestPlatformCommand.py (1613 of 1972)
PASS: lldb-api :: functionalities/data-formatter/data-formatter-stl/libstdcpp/unique_ptr/invalid/TestDataFormatterInvalidStdUniquePtr.py (1614 of 1972)
PASS: lldb-unit :: Utility/./UtilityTests/BinaryStreamTest.PutULEB128EightBytes (1615 of 1972)
PASS: lldb-unit :: Utility/./UtilityTests/VASprintfTest.BufferResize (1616 of 1972)
PASS: lldb-unit :: Signals/./SignalsTests/UnixSignalsTest.GetFilteredSignals (1617 of 1972)
PASS: lldb-unit :: Editline/./EditlineTests/EditlineTestFixture.EditlineReceivesMultiLineText (1618 of 1972)
PASS: lldb-api :: lang/objc/ivar-IMP/TestObjCiVarIMP.py (1619 of 1972)
PASS: lldb-unit :: ScriptInterpreter/Python/./ScriptInterpreterPythonTests/PythonDataObjectsTest.TestScript (1620 of 1972)
PASS: lldb-unit :: SymbolFile/NativePDB/./SymbolFileNativePDBTests/PDBFPOProgramToDWARFExpressionTests.InvalidOpUnary (1621 of 1972)
PASS: lldb-api :: commands/command/invalid-args/TestInvalidArgsCommand.py (1622 of 1972)
PASS: lldb-api :: functionalities/data-formatter/language_category_updates/TestDataFormatterLanguageCategoryUpdates.py (1623 of 1972)
PASS: lldb-shell :: SymbolFile/NativePDB/function-types-classes.cpp (1624 of 1972)
PASS: lldb-unit :: Utility/./UtilityTests/VMRange.ContainsRange (1625 of 1972)
PASS: lldb-shell :: Reproducer/Functionalities/TestStepping.test (1626 of 1972)
PASS: lldb-api :: functionalities/gdb_remote_client/TestRestartBug.py (1627 of 1972)
PASS: lldb-unit :: Symbol/./SymbolTests/TestTypeSystemClang.TestGetBasicTypeFromEnum (1628 of 1972)
PASS: lldb-api :: functionalities/data-formatter/data-formatter-synthval/TestDataFormatterSynthVal.py (1629 of 1972)
PASS: lldb-unit :: Utility/./UtilityTests/TildeExpressionResolver.ResolveFullPath (1630 of 1972)
PASS: lldb-unit :: Host/./HostTests/NativeProcessProtocolTest.ReadCStringFromMemory (1631 of 1972)
PASS: lldb-unit :: Utility/./UtilityTests/BinaryStreamTest.PutSLEB128OneByte (1632 of 1972)
PASS: lldb-unit :: Utility/./UtilityTests/SubsystemRAIITest.SubsystemWithErrorSuccess (1633 of 1972)
PASS: lldb-api :: functionalities/inferior-crashing/recursive-inferior/TestRecursiveInferior.py (1634 of 1972)
PASS: lldb-shell :: ObjectFile/ELF/many-sections.s (1635 of 1972)
PASS: lldb-unit :: Utility/./UtilityTests/SerializationRountripTest.SerializeDeserializeCStringArrayNullptr (1636 of 1972)
PASS: lldb-unit :: Symbol/./SymbolTests/TestClangASTImporter.DeportTypeTagDecl (1637 of 1972)
PASS: lldb-api :: commands/watchpoints/watchpoint_disable/TestWatchpointDisable.py (1638 of 1972)
PASS: lldb-api :: macosx/nslog/TestDarwinNSLogOutput.py (1639 of 1972)
PASS: lldb-unit :: Utility/./UtilityTests/RangeDataVector.FindEntryIndexesThatContain_Overlap (1640 of 1972)
PASS: lldb-unit :: UnwindAssembly/x86/./UnwindAssemblyx86Tests/Testx86AssemblyInspectionEngine.TestPushR13 (1641 of 1972)
PASS: lldb-unit :: Process/gdb-remote/./ProcessGdbRemoteTests/GDBRemoteClientBaseTest.SendContinueAndWait (1642 of 1972)
PASS: lldb-api :: commands/watchpoints/watchpoint_size/TestWatchpointSizes.py (1643 of 1972)
PASS: lldb-api :: python_api/formatters/TestFormattersSBAPI.py (1644 of 1972)
PASS: lldb-shell :: Quit/TestQuitExitCode-30.test (1645 of 1972)
PASS: lldb-unit :: Utility/./UtilityTests/OptionsWithRawTest.EmptyInput (1646 of 1972)
PASS: lldb-shell :: SymbolFile/DWARF/find-basic-function.cpp (1647 of 1972)
PASS: lldb-api :: types/TestCharTypeExpr.py (1648 of 1972)
PASS: lldb-shell :: Breakpoint/case-sensitive.test (1649 of 1972)
UNSUPPORTED: lldb-shell :: Expr/TestIRMemoryMapWindows.test (1650 of 1972)
PASS: lldb-unit :: Symbol/./SymbolTests/TestTypeSystemClang.TestDeletingImplicitCopyCstrDueToMoveCStr (1651 of 1972)
PASS: lldb-unit :: Host/./HostTests/ConnectionFileDescriptorTest.TCPGetURIv4 (1652 of 1972)
PASS: lldb-unit :: Utility/./UtilityTests/UriParserTest.BracketedHostname (1653 of 1972)
PASS: lldb-unit :: Utility/./UtilityTests/StringListTest.JoinSingle (1654 of 1972)
PASS: lldb-unit :: Host/./HostTests/File.GetWaitableHandleFileno (1655 of 1972)
PASS: lldb-unit :: Language/Highlighting/./HighlighterTests/HighlighterTest.ClangCursorPosAfterOtherToken (1656 of 1972)
PASS: lldb-api :: commands/frame/select/TestFrameSelect.py (1657 of 1972)
PASS: lldb-api :: functionalities/testid/TestTestId.py (1658 of 1972)
PASS: lldb-unit :: UnwindAssembly/x86/./UnwindAssemblyx86Tests/Testx86AssemblyInspectionEngine.TestPushRBP (1659 of 1972)
PASS: lldb-api :: functionalities/breakpoint/hardware_breakpoints/hardware_breakpoint_on_multiple_threads/TestHWBreakMultiThread.py (1660 of 1972)
PASS: lldb-unit :: Language/Highlighting/./HighlighterTests/HighlighterTest.ClangTrailingBackslashMissingNewLine (1661 of 1972)
PASS: lldb-shell :: ObjectFile/ELF/build-id-case.yaml (1662 of 1972)
PASS: lldb-api :: functionalities/data-formatter/ptr_ref_typedef/TestPtrRef2Typedef.py (1663 of 1972)
PASS: lldb-api :: commands/target/dump-symtab-demangle/TestDumpSymtabDemangle.py (1664 of 1972)
PASS: lldb-unit :: Utility/./UtilityTests/StreamTest.AddressRangeInvalidRange (1665 of 1972)
PASS: lldb-unit :: Symbol/./SymbolTests/TestClangASTImporter.RecordLayout (1666 of 1972)
PASS: lldb-api :: commands/expression/persistent_ptr_update/TestPersistentPtrUpdate.py (1667 of 1972)
PASS: lldb-unit :: ScriptInterpreter/Python/./ScriptInterpreterPythonTests/PythonDataObjectsTest.TestExtractingUInt64ThroughStructuredData (1668 of 1972)
PASS: lldb-api :: lang/cpp/nested-class-other-compilation-unit/TestNestedClassWithParentInAnotherCU.py (1669 of 1972)
PASS: lldb-api :: commands/expression/import-std-module/sysroot/TestStdModuleSysroot.py (1670 of 1972)
PASS: lldb-unit :: Utility/./UtilityTests/FileSpecTest.EqualDotsPosixRoot (1671 of 1972)
PASS: lldb-unit :: Utility/./UtilityTests/StatusTest.ErrorConversion (1672 of 1972)
PASS: lldb-api :: functionalities/dynamic_value_child_count/TestDynamicValueChildCount.py (1673 of 1972)
PASS: lldb-shell :: Driver/TestTarget.test (1674 of 1972)
PASS: lldb-api :: functionalities/data-formatter/data-formatter-globals/TestDataFormatterGlobals.py (1675 of 1972)
PASS: lldb-api :: functionalities/gdb_remote_client/TestRegDefinitionInParts.py (1676 of 1972)
UNSUPPORTED: lldb-api :: functionalities/tty/TestTerminal.py (1677 of 1972)
PASS: lldb-shell :: Commands/CommandScriptImmediateOutput/CommandScriptImmediateOutputFile.test (1678 of 1972)
PASS: lldb-unit :: ScriptInterpreter/Python/./ScriptInterpreterPythonTests/PythonDataObjectsTest.TestModuleNameResolutionNoDot (1679 of 1972)
PASS: lldb-api :: types/TestLongTypes.py (1680 of 1972)
PASS: lldb-unit :: Utility/./UtilityTests/ScalarTest.SetValueFromCString (1681 of 1972)
PASS: lldb-unit :: UnwindAssembly/x86/./UnwindAssemblyx86Tests/Testx86AssemblyInspectionEngine.TestMovRSPtoRBP (1682 of 1972)
PASS: lldb-shell :: ObjectFile/ELF/PT_LOAD.yaml (1683 of 1972)
PASS: lldb-api :: lang/objc/objc-dyn-sbtype/TestObjCDynamicSBType.py (1684 of 1972)
PASS: lldb-unit :: Utility/./UtilityTests/ScalarTest.GetValue (1685 of 1972)
PASS: lldb-unit :: Process/minidump/./LLDBMinidumpTests/MinidumpParserTest.GetMemoryRegionInfoFromMemory64List (1686 of 1972)
PASS: lldb-unit :: Utility/./UtilityTests/StringListTest.CopyList (1687 of 1972)
PASS: lldb-api :: functionalities/inferior-crashing/TestInferiorCrashingStep.py (1688 of 1972)
PASS: lldb-api :: functionalities/thread/concurrent_events/TestConcurrentWatchpointWithDelayWatchpointThreads.py (1689 of 1972)
PASS: lldb-unit :: Utility/./UtilityTests/StreamTest.PutHex8 (1690 of 1972)
PASS: lldb-unit :: Utility/./UtilityTests/StringLexerTest.GetUnlexed (1691 of 1972)
UNSUPPORTED: lldb-api :: lang/objc/foundation/TestFoundationDisassembly.py (1692 of 1972)
PASS: lldb-unit :: Host/./HostTests/FileSystemTest.GetPermissions (1693 of 1972)
PASS: lldb-api :: commands/expression/import-std-module/shared_ptr-dbg-info-content/TestSharedPtrDbgInfoContentFromStdModule.py (1694 of 1972)
PASS: lldb-unit :: Language/Highlighting/./HighlighterTests/HighlighterTest.ClangStringLiterals (1695 of 1972)
PASS: lldb-api :: functionalities/data-formatter/data-formatter-stl/libcxx/list/loop/TestDataFormatterLibcxxListLoop.py (1696 of 1972)
PASS: lldb-api :: functionalities/data-formatter/nsarraysynth/TestNSArraySynthetic.py (1697 of 1972)
PASS: lldb-shell :: Quit/TestQuitExitCodeHex0.test (1698 of 1972)
UNSUPPORTED: lldb-api :: linux/add-symbols/TestTargetSymbolsAddCommand.py (1699 of 1972)
PASS: lldb-api :: functionalities/data-formatter/typedef_array/TestTypedefArray.py (1700 of 1972)
PASS: lldb-api :: macosx/duplicate-archive-members/TestDuplicateMembers.py (1701 of 1972)
PASS: lldb-shell :: Settings/TestStopCommandSourceOnError.test (1702 of 1972)
PASS: lldb-api :: functionalities/data-formatter/dump_dynamic/TestDumpDynamic.py (1703 of 1972)
PASS: lldb-shell :: Minidump/no-process-id.yaml (1704 of 1972)
PASS: lldb-api :: commands/log/invalid-args/TestInvalidArgsLog.py (1705 of 1972)
PASS: lldb-api :: commands/expression/ir-interpreter-phi-nodes/TestIRInterpreterPHINodes.py (1706 of 1972)
PASS: lldb-api :: functionalities/breakpoint/breakpoint_language/TestBreakpointLanguage.py (1707 of 1972)
PASS: lldb-api :: lang/cpp/lambdas/TestLambdas.py (1708 of 1972)
PASS: lldb-api :: functionalities/thread/concurrent_events/TestConcurrentTwoWatchpointsOneDelayBreakpoint.py (1709 of 1972)
PASS: lldb-unit :: UnwindAssembly/x86/./UnwindAssemblyx86Tests/Testx86AssemblyInspectionEngine.TestPushECX (1710 of 1972)
PASS: lldb-unit :: Host/./HostTests/File.GetStreamFromDescriptor (1711 of 1972)
PASS: lldb-shell :: SymbolFile/NativePDB/source-list.cpp (1712 of 1972)
PASS: lldb-api :: functionalities/data-formatter/stringprinter/TestStringPrinter.py (1713 of 1972)
PASS: lldb-api :: functionalities/thread/concurrent_events/TestConcurrentWatchBreak.py (1714 of 1972)
PASS: lldb-unit :: SymbolFile/DWARF/./SymbolFileDWARFTests/SymbolFileDWARFTests.TestAbbrevOrder1Start5 (1715 of 1972)
PASS: lldb-unit :: Utility/./UtilityTests/IndexToObjectTest.ObjectForIndex (1716 of 1972)
PASS: lldb-api :: commands/expression/import-std-module/forward_list/TestForwardListFromStdModule.py (1717 of 1972)
PASS: lldb-unit :: SymbolFile/DWARF/./SymbolFileDWARFTests/SymbolFileDWARFTests.ParseArangesNonzeroSegmentSize (1718 of 1972)
PASS: lldb-shell :: SymbolFile/DWARF/forward-declarations.s (1719 of 1972)
PASS: lldb-api :: lang/cpp/virtual-overload/TestVirtualOverload.py (1720 of 1972)
PASS: lldb-api :: tools/lldb-server/TestLldbGdbServer.py (1721 of 1972)
PASS: lldb-api :: lang/objc/radar-9691614/TestObjCMethodReturningBOOL.py (1722 of 1972)
PASS: lldb-unit :: Utility/./UtilityTests/StringExtractorTest.GetHexU8_Extra (1723 of 1972)
PASS: lldb-api :: commands/expression/result_numbering/TestResultNumbering.py (1724 of 1972)
PASS: lldb-api :: functionalities/breakpoint/breakpoint_ids/TestBreakpointIDs.py (1725 of 1972)
PASS: lldb-api :: functionalities/data-formatter/parray/TestPrintArray.py (1726 of 1972)
PASS: lldb-shell :: SymbolFile/NativePDB/ast-types.cpp (1727 of 1972)
PASS: lldb-api :: commands/command/script_alias/TestCommandScriptAlias.py (1728 of 1972)
PASS: lldb-unit :: UnwindAssembly/x86/./UnwindAssemblyx86Tests/Testx86AssemblyInspectionEngine.TestSpillRegToStackViaMOVi386 (1729 of 1972)
PASS: lldb-api :: functionalities/breakpoint/move_nearest/TestMoveNearest.py (1730 of 1972)
PASS: lldb-api :: commands/expression/two-files/TestObjCTypeQueryFromOtherCompileUnit.py (1731 of 1972)
PASS: lldb-unit :: Utility/./UtilityTests/VMRange.Ordering (1732 of 1972)
PASS: lldb-api :: commands/expression/ir-interpreter/TestIRInterpreter.py (1733 of 1972)
PASS: lldb-unit :: UnwindAssembly/x86/./UnwindAssemblyx86Tests/Testx86AssemblyInspectionEngine.TestPush0 (1734 of 1972)
PASS: lldb-api :: lang/objc/global_ptrs/TestGlobalObjects.py (1735 of 1972)
PASS: lldb-unit :: Process/gdb-remote/./ProcessGdbRemoteTests/GDBRemoteCommunicationClientTest.SendGetTraceConfigPacket (1736 of 1972)
PASS: lldb-api :: commands/expression/po_verbosity/TestPoVerbosity.py (1737 of 1972)
PASS: lldb-unit :: ScriptInterpreter/Python/./ScriptInterpreterPythonTests/PythonDataObjectsTest.TestPythonListToStructuredList (1738 of 1972)
PASS: lldb-api :: python_api/hello_world/TestHelloWorld.py (1739 of 1972)
PASS: lldb-api :: commands/expression/import-std-module/deque-basic/TestDequeFromStdModule.py (1740 of 1972)
PASS: lldb-unit :: Expression/./ExpressionTests/DiagnosticManagerTest.GetStringSeverityLabels (1741 of 1972)
PASS: lldb-api :: lang/objc/direct-dispatch-step/TestObjCDirectDispatchStepping.py (1742 of 1972)
PASS: lldb-api :: commands/expression/namespace_local_var_same_name_obj_c/TestNamespaceLocalVarSameNameObjC.py (1743 of 1972)
UNSUPPORTED: lldb-api :: functionalities/data-formatter/data-formatter-stl/libstdcpp/string/TestDataFormatterStdString.py (1744 of 1972)
PASS: lldb-unit :: Utility/./UtilityTests/StringListTest.Join (1745 of 1972)
PASS: lldb-api :: driver/batch_mode/TestBatchMode.py (1746 of 1972)
PASS: lldb-api :: lang/objc/objc-builtin-types/TestObjCBuiltinTypes.py (1747 of 1972)
PASS: lldb-unit :: Utility/./UtilityTests/ArgsTest.TestInsertArg (1748 of 1972)
PASS: lldb-unit :: Utility/./UtilityTests/StringListTest.SplitIntoLines (1749 of 1972)
PASS: lldb-unit :: Utility/./UtilityTests/StringExtractorTest.GetHexBytesAvail_FullString (1750 of 1972)
PASS: lldb-api :: functionalities/data-formatter/synthcapping/TestSyntheticCapping.py (1751 of 1972)
PASS: lldb-unit :: Core/./LLDBCoreTests/StreamCallbackTest.Callback (1752 of 1972)
PASS: lldb-api :: api/multiple-targets/TestMultipleTargets.py (1753 of 1972)
UNSUPPORTED: lldb-api :: functionalities/thread/concurrent_events/TestConcurrentManySignals.py (1754 of 1972)
PASS: lldb-api :: lang/objc/modules-incomplete/TestIncompleteModules.py (1755 of 1972)
PASS: lldb-unit :: Host/./HostTests/MainLoopTest.TerminatesImmediately (1756 of 1972)
PASS: lldb-api :: functionalities/gdb_remote_client/TestWriteMemory.py (1757 of 1972)
PASS: lldb-unit :: Utility/./UtilityTests/LogChannelEnabledTest.log_options (1758 of 1972)
PASS: lldb-unit :: Host/./HostTests/FileSystemTest.OpenErrno (1759 of 1972)
PASS: lldb-api :: python_api/watchpoint/TestWatchpointIgnoreCount.py (1760 of 1972)
PASS: lldb-unit :: UnwindAssembly/x86/./UnwindAssemblyx86Tests/Testx86AssemblyInspectionEngine.TestPushImm (1761 of 1972)
PASS: lldb-api :: lang/cpp/wchar_t/TestCxxWCharT.py (1762 of 1972)
UNSUPPORTED: lldb-shell :: ObjectFile/ELF/minidebuginfo-set-and-hit-breakpoint.test (1763 of 1972)
PASS: lldb-api :: commands/expression/import-std-module/vector-bool/TestVectorBoolFromStdModule.py (1764 of 1972)
PASS: lldb-unit :: Utility/./UtilityTests/StringListTest.DefaultConstructor (1765 of 1972)
PASS: lldb-api :: functionalities/load_unload/TestLoadUnload.py (1766 of 1972)
PASS: lldb-unit :: Utility/./UtilityTests/StringLexerTest.AdvanceIf (1767 of 1972)
PASS: lldb-api :: functionalities/data-formatter/frameformat_smallstruct/TestFrameFormatSmallStruct.py (1768 of 1972)
PASS: lldb-shell :: ObjectFile/MachO/subsections.yaml (1769 of 1972)
PASS: lldb-api :: lang/objc/objc-super/TestObjCSuper.py (1770 of 1972)
PASS: lldb-shell :: ObjectFile/wasm/unified-debug-sections.yaml (1771 of 1972)
PASS: lldb-unit :: Utility/./UtilityTests/TimerTest.CategoryTimes (1772 of 1972)
PASS: lldb-api :: functionalities/data-formatter/data-formatter-stl/libcxx/tuple/TestDataFormatterLibcxxTuple.py (1773 of 1972)
PASS: lldb-unit :: Utility/./UtilityTests/ArgsTest.ReplaceArgumentAtIndexShort (1774 of 1972)
UNSUPPORTED: lldb-shell :: SymbolFile/PDB/function-level-linking.test (1775 of 1972)
PASS: lldb-api :: commands/help/TestHelp.py (1776 of 1972)
PASS: lldb-shell :: Expr/TestIRMemoryMap.test (1777 of 1972)
PASS: lldb-shell :: VSCode/TestOptions.test (1778 of 1972)
PASS: lldb-shell :: ScriptInterpreter/None/none.test (1779 of 1972)
PASS: lldb-unit :: UnwindAssembly/x86/./UnwindAssemblyx86Tests/Testx86AssemblyInspectionEngine.TestPopEBP (1780 of 1972)
PASS: lldb-api :: python_api/sbvalue_persist/TestSBValuePersist.py (1781 of 1972)
PASS: lldb-unit :: Breakpoint/./LLDBBreakpointTests/BreakpointIDTest.StringIsBreakpointName (1782 of 1972)
PASS: lldb-api :: lang/objc/foundation/TestObjCMethods2.py (1783 of 1972)
PASS: lldb-unit :: Utility/./UtilityTests/RangeTest.Copy (1784 of 1972)
PASS: lldb-api :: macosx/find-dsym/bundle-with-dot-in-filename/TestBundleWithDotInFilename.py (1785 of 1972)
PASS: lldb-api :: lang/cpp/dynamic-value/TestCppValueCast.py (1786 of 1972)
PASS: lldb-unit :: Expression/./ExpressionTests/DiagnosticManagerTest.FixedExpression (1787 of 1972)
PASS: lldb-api :: lang/objcxx/hide-runtime-values/TestObjCXXHideRuntimeValues.py (1788 of 1972)
PASS: lldb-shell :: SymbolFile/NativePDB/nested-types.cpp (1789 of 1972)
PASS: lldb-api :: commands/expression/import-std-module/list/TestListFromStdModule.py (1790 of 1972)
PASS: lldb-api :: commands/expression/import-std-module/no-std-module/TestMissingStdModule.py (1791 of 1972)
PASS: lldb-unit :: Utility/./UtilityTests/RangeTest.ContainsAddrInvalid (1792 of 1972)
PASS: lldb-unit :: Utility/./UtilityTests/ScalarTest.Comparison (1793 of 1972)
PASS: lldb-unit :: Utility/./UtilityTests/StreamTest.PutBytesAsRawHex8ToMixedEndian (1794 of 1972)
PASS: lldb-unit :: Host/./HostTests/MainLoopTest.DetectsEOF (1795 of 1972)
PASS: lldb-unit :: Core/./LLDBCoreTests/MangledTest.EmptyForInvalidName (1796 of 1972)
PASS: lldb-unit :: Language/Highlighting/./HighlighterTests/HighlighterTest.ClangCursorPos (1797 of 1972)
PASS: lldb-api :: commands/target/basic/TestTargetCommand.py (1798 of 1972)
PASS: lldb-unit :: Utility/./UtilityTests/StreamTest.ShiftOperatorPtr (1799 of 1972)
PASS: lldb-unit :: Utility/./UtilityTests/DataExtractorTest.GetMaxS64 (1800 of 1972)
PASS: lldb-unit :: ObjectFile/ELF/./ObjectFileELFTests/ObjectFileELFTest.GetModuleSpecifications_EarlySectionHeaders (1801 of 1972)
PASS: lldb-unit :: Utility/./UtilityTests/ConstStringTest.format_provider (1802 of 1972)
PASS: lldb-unit :: Utility/./UtilityTests/StringListTest.SplitIntoLinesSingleTrailingCR (1803 of 1972)
PASS: lldb-unit :: Target/./TargetTests/MemoryRegionInfoTest.Formatv (1804 of 1972)
PASS: lldb-unit :: Utility/./UtilityTests/ArgsTest.TestTrailingBackslash (1805 of 1972)
PASS: lldb-api :: functionalities/data-formatter/ostypeformatting/TestFormattersOsType.py (1806 of 1972)
PASS: lldb-api :: commands/expression/persistent_types/TestNestedPersistentTypes.py (1807 of 1972)
PASS: lldb-api :: functionalities/breakpoint/breakpoint_names/TestBreakpointNames.py (1808 of 1972)
UNSUPPORTED: lldb-api :: functionalities/data-formatter/data-formatter-stl/libstdcpp/vector/TestDataFormatterStdVector.py (1809 of 1972)
PASS: lldb-unit :: UnwindAssembly/x86/./UnwindAssemblyx86Tests/Testx86AssemblyInspectionEngine.TestPopESI (1810 of 1972)
PASS: lldb-unit :: UnwindAssembly/x86/./UnwindAssemblyx86Tests/Testx86AssemblyInspectionEngine.TestLEAVE (1811 of 1972)
PASS: lldb-unit :: ObjectFile/ELF/./ObjectFileELFTests/ObjectFileELFTest.GetSymtab_NoSymEntryPointArmThumbAddressClass (1812 of 1972)
PASS: lldb-api :: functionalities/breakpoint/breakpoint_locations/TestBreakpointLocations.py (1813 of 1972)
PASS: lldb-api :: functionalities/breakpoint/breakpoint_by_line_and_column/TestBreakpointByLineAndColumn.py (1814 of 1972)
PASS: lldb-unit :: UnwindAssembly/x86/./UnwindAssemblyx86Tests/Testx86AssemblyInspectionEngine.TestPushRBX (1815 of 1972)
PASS: lldb-shell :: Commands/command-disassemble-process.yaml (1816 of 1972)
PASS: lldb-unit :: Process/gdb-remote/./ProcessGdbRemoteTests/GDBRemoteCommunicationClientTest.SendGetMetaDataPacket (1817 of 1972)
PASS: lldb-unit :: Target/./TargetTests/PathMappingListTest.AbsoluteTests (1818 of 1972)
PASS: lldb-api :: python_api/lldbutil/frame/TestFrameUtils.py (1819 of 1972)
PASS: lldb-api :: commands/expression/import-std-module/list-dbg-info-content/TestDbgInfoContentListFromStdModule.py (1820 of 1972)
PASS: lldb-api :: lang/objc/objc-static-method-stripped/TestObjCStaticMethodStripped.py (1821 of 1972)
PASS: lldb-unit :: Host/./HostTests/HostInfoTest.GetHostname (1822 of 1972)
PASS: lldb-api :: commands/expression/radar_9531204/TestPrintfAfterUp.py (1823 of 1972)
PASS: lldb-unit :: Utility/./UtilityTests/BinaryStreamTest.PutSLEB128Zero (1824 of 1972)
PASS: lldb-api :: functionalities/wrong_commands/TestWrongCommands.py (1825 of 1972)
PASS: lldb-unit :: Utility/./UtilityTests/ScalarTest.GetBytes (1826 of 1972)
PASS: lldb-unit :: Utility/./UtilityTests/StringExtractorTest.GetHexU8_InvalidHex_NoEof (1827 of 1972)
PASS: lldb-api :: lang/cpp/this/TestCPPThis.py (1828 of 1972)
PASS: lldb-api :: functionalities/breakpoint/objc/TestObjCBreakpoints.py (1829 of 1972)
PASS: lldb-unit :: Utility/./UtilityTests/EventTest.DumpEventDataBytes (1830 of 1972)
UNSUPPORTED: lldb-shell :: SymbolFile/PDB/vbases.test (1831 of 1972)
PASS: lldb-unit :: Language/Highlighting/./HighlighterTests/HighlighterTest.ClangBraces (1832 of 1972)
PASS: lldb-unit :: Utility/./UtilityTests/UriParserTest.PortOverflow (1833 of 1972)
PASS: lldb-shell :: ObjectFile/Breakpad/sections.test (1834 of 1972)
PASS: lldb-unit :: SymbolFile/NativePDB/./SymbolFileNativePDBTests/PDBFPOProgramToDWARFExpressionTests.UnresolvedRegisterReference (1835 of 1972)
PASS: lldb-unit :: Utility/./UtilityTests/ArgsTest.TestArgv (1836 of 1972)
PASS: lldb-api :: python_api/default-constructor/TestDefaultConstructorForAPIObjects.py (1837 of 1972)
PASS: lldb-unit :: Utility/./UtilityTests/ArchSpecTest.Compatibility (1838 of 1972)
PASS: lldb-unit :: Utility/./UtilityTests/StreamTest.PutHex16ByteOrderBig (1839 of 1972)
PASS: lldb-api :: commands/expression/pr35310/TestExprsBug35310.py (1840 of 1972)
PASS: lldb-unit :: Target/./TargetTests/ExecutionContextTest.GetByteOrder (1841 of 1972)
PASS: lldb-api :: commands/expression/import-std-module/weak_ptr/TestWeakPtrFromStdModule.py (1842 of 1972)
PASS: lldb-unit :: Utility/./UtilityTests/StringExtractorTest.DecodeHexU8_InvalidHex2 (1843 of 1972)
PASS: lldb-shell :: Settings/TestSettingsWrite.test (1844 of 1972)
PASS: lldb-unit :: UnwindAssembly/x86/./UnwindAssemblyx86Tests/Testx86AssemblyInspectionEngine.TestPushExtended (1845 of 1972)
PASS: lldb-api :: commands/frame/diagnose/array/TestArray.py (1846 of 1972)
UNSUPPORTED: lldb-shell :: Register/x86-64-xmm16-write.test (1847 of 1972)
PASS: lldb-api :: functionalities/memory/cache/TestMemoryCache.py (1848 of 1972)
PASS: lldb-unit :: Process/gdb-remote/./ProcessGdbRemoteTests/GDBRemoteClientBaseTest.SendContinueAndLateInterrupt (1849 of 1972)
UNSUPPORTED: lldb-shell :: Register/aarch64-gp-read.test (1850 of 1972)
PASS: lldb-shell :: ObjectFile/ELF/short-build-id.yaml (1851 of 1972)
PASS: lldb-unit :: Utility/./UtilityTests/StringListTest.InsertStringAtIndexOutOfBounds (1852 of 1972)
PASS: lldb-unit :: Utility/./UtilityTests/DataExtractorTest.GetCStrAtEnd (1853 of 1972)
PASS: lldb-shell :: SymbolFile/DWARF/debug_ranges-missing-section.s (1854 of 1972)
PASS: lldb-api :: functionalities/show_location/TestShowLocationDwarf5.py (1855 of 1972)
PASS: lldb-api :: lang/objc/foundation/TestObjCMethods.py (1856 of 1972)
PASS: lldb-unit :: Target/./TargetTests/MCBasedABI.MapRegisterName (1857 of 1972)
PASS: lldb-unit :: Utility/./UtilityTests/RangeDataVector.CustomSort (1858 of 1972)
PASS: lldb-api :: commands/expression/call-throws/TestCallThatThrows.py (1859 of 1972)
PASS: lldb-api :: lang/objc/foundation/TestObjCMethodsString.py (1860 of 1972)
PASS: lldb-unit :: Utility/./UtilityTests/OptionsWithRawTest.SingleWhitespaceInput (1861 of 1972)
PASS: lldb-api :: functionalities/breakpoint/dummy_target_breakpoints/TestBreakpointsWithNoTargets.py (1862 of 1972)
PASS: lldb-unit :: Utility/./UtilityTests/ScalarTest.Equality (1863 of 1972)
PASS: lldb-api :: functionalities/data-formatter/data-formatter-stl/libcxx/variant/TestDataFormatterLibcxxVariant.py (1864 of 1972)
PASS: lldb-api :: commands/expression/diagnostics/TestExprDiagnostics.py (1865 of 1972)
PASS: lldb-api :: functionalities/data-formatter/data-formatter-smart-array/TestDataFormatterSmartArray.py (1866 of 1972)
UNSUPPORTED: lldb-api :: benchmarks/continue/TestBenchmarkContinue.py (1867 of 1972)
PASS: lldb-unit :: ScriptInterpreter/Python/./ScriptInterpreterPythonTests/PythonDataObjectsTest.TestObjectAttributes (1868 of 1972)
PASS: lldb-api :: functionalities/thread/concurrent_events/TestConcurrentBreakpointOneDelayBreakpointThreads.py (1869 of 1972)
PASS: lldb-api :: functionalities/plugins/command_plugin/TestPluginCommands.py (1870 of 1972)
PASS: lldb-unit :: Utility/./UtilityTests/StreamTest.PutCharNull (1871 of 1972)
PASS: lldb-unit :: Utility/./UtilityTests/SubsystemRAIITest.NormalSubsystem (1872 of 1972)
PASS: lldb-api :: python_api/function_symbol/TestSymbolAPI.py (1873 of 1972)
PASS: lldb-unit :: Symbol/./SymbolTests/TestClangASTImporter.CopyTypeTagDecl (1874 of 1972)
UNSUPPORTED: lldb-shell :: SymbolFile/NativePDB/local-variables.cpp (1875 of 1972)
PASS: lldb-api :: lang/objc/real-definition/TestRealDefinition.py (1876 of 1972)
UNSUPPORTED: lldb-api :: linux/thread/create_during_instruction_step/TestCreateDuringInstructionStep.py (1877 of 1972)
PASS: lldb-unit :: ScriptInterpreter/Python/./ScriptInterpreterPythonTests/PythonDataObjectsTest.TestPythonString (1878 of 1972)
PASS: lldb-unit :: Platform/./LLDBPlatformTests/PlatformDarwinTest.FindComponentInPath (1879 of 1972)
PASS: lldb-unit :: SymbolFile/NativePDB/./SymbolFileNativePDBTests/PDBFPOProgramToDWARFExpressionTests.MultipleDependentAssignments (1880 of 1972)
PASS: lldb-api :: commands/expression/anonymous-struct/TestCallUserAnonTypedef.py (1881 of 1972)
PASS: lldb-api :: tools/lldb-server/inferior-crash/TestGdbRemoteAbort.py (1882 of 1972)
PASS: lldb-api :: commands/watchpoints/watchpoint_commands/command/TestWatchpointCommandPython.py (1883 of 1972)
PASS: lldb-unit :: Utility/./UtilityTests/DataExtractorTest.GetBitfield (1884 of 1972)
PASS: lldb-api :: lang/c/set_values/TestSetValues.py (1885 of 1972)
PASS: lldb-api :: types/TestShortTypeExpr.py (1886 of 1972)
PASS: lldb-unit :: Utility/./UtilityTests/RangeTest.NotEqualInvalid (1887 of 1972)
PASS: lldb-unit :: Language/Highlighting/./HighlighterTests/HighlighterTest.ClangCursorPosBeforeOtherToken (1888 of 1972)
UNSUPPORTED: lldb-shell :: SymbolFile/PDB/variables-locations.test (1889 of 1972)
PASS: lldb-shell :: ObjectFile/MachO/symtab.yaml (1890 of 1972)
PASS: lldb-unit :: SymbolFile/DWARF/./SymbolFileDWARFTests/SymbolFileDWARFTests.TestAbbrevNullAttrValidForm (1891 of 1972)
PASS: lldb-unit :: Utility/./UtilityTests/StringLexerTest.Next (1892 of 1972)
PASS: lldb-api :: functionalities/pre_run_dylibs/TestPreRunDylibs.py (1893 of 1972)
PASS: lldb-unit :: UnwindAssembly/x86/./UnwindAssemblyx86Tests/Testx86AssemblyInspectionEngine.TestPushRBPWithREX (1894 of 1972)
PASS: lldb-api :: functionalities/data-formatter/data-formatter-objc/TestDataFormatterObjCNSURL.py (1895 of 1972)
PASS: lldb-unit :: UnwindAssembly/x86/./UnwindAssemblyx86Tests/Testx86AssemblyInspectionEngine.TestPopR12 (1896 of 1972)
PASS: lldb-shell :: SymbolFile/DWARF/debug-types-dwarf5.s (1897 of 1972)
PASS: lldb-api :: python_api/debugger/TestDebuggerAPI.py (1898 of 1972)
PASS: lldb-shell :: Breakpoint/split-dwarf5-debug-stroffsets.test (1899 of 1972)
PASS: lldb-unit :: UnwindAssembly/x86/./UnwindAssemblyx86Tests/Testx86AssemblyInspectionEngine.TestPopRBX (1900 of 1972)
PASS: lldb-unit :: Utility/./UtilityTests/BinaryStreamTest.PutULEB128NineBytes (1901 of 1972)
PASS: lldb-api :: functionalities/data-formatter/data-formatter-objc/nsstring/TestDataFormatterNSString.py (1902 of 1972)
PASS: lldb-api :: macosx/lc-note/kern-ver-str/TestKernVerStrLCNOTE.py (1903 of 1972)
PASS: lldb-unit :: Utility/./UtilityTests/StringListTest.AppendList (1904 of 1972)
PASS: lldb-shell :: SymbolFile/DWARF/array-sizes.s (1905 of 1972)
PASS: lldb-api :: functionalities/data-formatter/data-formatter-objc/TestDataFormatterObjNSException.py (1906 of 1972)
PASS: lldb-unit :: Utility/./UtilityTests/StringExtractorTest.GetHexU8_Extra_NoEof (1907 of 1972)
PASS: lldb-unit :: Expression/./ExpressionTests/ClangHostTest.ComputeClangResourceDirectory (1908 of 1972)
PASS: lldb-unit :: debugserver/./debugserverTests/RNBSocket.LoopBackListenIPv4 (1909 of 1972)
PASS: lldb-unit :: Utility/./UtilityTests/StringExtractorTest.DecodeHexU8_Underflow (1910 of 1972)
PASS: lldb-unit :: Utility/./UtilityTests/RangeTest.DoesIntersect (1911 of 1972)
UNSUPPORTED: lldb-api :: benchmarks/stepping/TestSteppingSpeed.py (1912 of 1972)
PASS: lldb-unit :: Utility/./UtilityTests/StringListTest.ForRangeEmpty (1913 of 1972)
PASS: lldb-unit :: Utility/./UtilityTests/CompletionRequest.TryCompleteCurrentArgGood (1914 of 1972)
PASS: lldb-api :: lang/cpp/unsigned_types/TestUnsignedTypes.py (1915 of 1972)
PASS: lldb-shell :: SymbolFile/DWARF/find-variable-file.cpp (1916 of 1972)
PASS: lldb-unit :: Symbol/./SymbolTests/TestClangASTImporter.MetadataPropagation (1917 of 1972)
PASS: lldb-unit :: UnwindAssembly/x86/./UnwindAssemblyx86Tests/Testx86AssemblyInspectionEngine.TestAddRSP (1918 of 1972)
PASS: lldb-unit :: ObjectFile/Breakpad/./ObjectFileBreakpadTests/ModuleRecord.parse (1919 of 1972)
XFAIL: lldb-shell :: Register/x86-mm-xmm-read.test (1920 of 1972)
PASS: lldb-api :: functionalities/conditional_break/TestConditionalBreak.py (1921 of 1972)
PASS: lldb-unit :: SymbolFile/NativePDB/./SymbolFileNativePDBTests/PDBFPOProgramToDWARFExpressionTests.UnresolvedDependentCyclicRegisterAssignmentReference (1922 of 1972)
UNSUPPORTED: lldb-shell :: Register/x86-gp-write.test (1923 of 1972)
PASS: lldb-unit :: UnwindAssembly/x86/./UnwindAssemblyx86Tests/Testx86AssemblyInspectionEngine.TestSpArithx86_64Augmented (1924 of 1972)
PASS: lldb-unit :: Utility/./UtilityTests/StringListTest.SetSize (1925 of 1972)
PASS: lldb-unit :: tools/lldb-server/tests/./LLDBServerTests/TestBase.LaunchModePreservesEnvironment (1926 of 1972)
UNSUPPORTED: lldb-api :: commands/expression/call-restarts/TestCallThatRestarts.py (1927 of 1972)
PASS: lldb-api :: lang/cpp/auto/TestCPPAuto.py (1928 of 1972)
PASS: lldb-shell :: Recognizer/assert.test (1929 of 1972)
PASS: lldb-unit :: Utility/./UtilityTests/StringListTest.SplitIntoLinesEmpty (1930 of 1972)
PASS: lldb-unit :: Utility/./UtilityTests/RangeTest.SlideZero (1931 of 1972)
UNSUPPORTED: lldb-shell :: ExecControl/StopHook/stop-hook-threads.test (1932 of 1972)
PASS: lldb-unit :: Language/Highlighting/./HighlighterTests/HighlighterTest.FallbackHighlighter (1933 of 1972)
PASS: lldb-api :: lang/objc/objc-foundation-dictionary-empty/TestNSDictionary0.py (1934 of 1972)
PASS: lldb-unit :: Utility/./UtilityTests/ArchSpecTest.TripleComponentsWereSpecified (1935 of 1972)
PASS: lldb-api :: lang/cpp/constructors/TestCppConstructors.py (1936 of 1972)
PASS: lldb-unit :: Host/./HostTests/ConnectionFileDescriptorTest.TCPGetURIv6 (1937 of 1972)
PASS: lldb-api :: macosx/order/TestOrderFile.py (1938 of 1972)
PASS: lldb-api :: lang/objc/objc-new-syntax/TestObjCNewSyntaxLiteral.py (1939 of 1972)
PASS: lldb-unit :: Utility/./UtilityTests/ArgsTest.DoubleQuotedItem (1940 of 1972)
FAIL: lldb-api :: lang/objc/ptr_refs/TestPtrRefsObjC.py (1941 of 1972)
******************** TEST 'lldb-api :: lang/objc/ptr_refs/TestPtrRefsObjC.py' FAILED ********************
Script:
--
/usr/local/bin/python /Users/buildslave/jenkins/workspace/lldb-cmake-sanitized/llvm-project/lldb/test/API/dotest.py --arch x86_64 -s /Users/buildslave/jenkins/workspace/lldb-cmake-sanitized/lldb-build/lldb-test-traces -S nm -u CXXFLAGS -u CFLAGS --codesign-identity lldb_codesign --server /Users/buildslave/jenkins/workspace/lldb-cmake-sanitized/lldb-build/./bin/debugserver --arch x86_64 --build-dir /Users/buildslave/jenkins/workspace/lldb-cmake-sanitized/lldb-build/lldb-test-build.noindex -s=/Users/buildslave/jenkins/workspace/lldb-cmake-sanitized/test/logs -t --env TERM=vt100 --env LLVM_LIBS_DIR=/Users/buildslave/jenkins/workspace/lldb-cmake-sanitized/lldb-build/./lib --inferior-env ASAN_OPTIONS=detect_stack_use_after_return=1 --inferior-env DYLD_INSERT_LIBRARIES=/Users/buildslave/jenkins/workspace/lldb-cmake-sanitized/host-compiler/lib/clang/11.0.0/lib/darwin/libclang_rt.asan_osx_dynamic.dylib --build-dir /Users/buildslave/jenkins/workspace/lldb-cmake-sanitized/lldb-build/lldb-test-build.noindex --lldb-module-cache-dir /Users/buildslave/jenkins/workspace/lldb-cmake-sanitized/lldb-build/lldb-test-build.noindex/module-cache-lldb/lldb-api --clang-module-cache-dir /Users/buildslave/jenkins/workspace/lldb-cmake-sanitized/lldb-build/lldb-test-build.noindex/module-cache-clang/lldb-api --executable /Users/buildslave/jenkins/workspace/lldb-cmake-sanitized/lldb-build/./bin/lldb --compiler /Users/buildslave/jenkins/workspace/lldb-cmake-sanitized/lldb-build/./bin/clang --dsymutil /Users/buildslave/jenkins/workspace/lldb-cmake-sanitized/lldb-build/./bin/dsymutil --filecheck /Users/buildslave/jenkins/workspace/lldb-cmake-sanitized/lldb-build/./bin/FileCheck --lldb-libs-dir /Users/buildslave/jenkins/workspace/lldb-cmake-sanitized/lldb-build/./lib /Users/buildslave/jenkins/workspace/lldb-cmake-sanitized/llvm-project/lldb/test/API/lang/objc/ptr_refs -p TestPtrRefsObjC.py
--
Exit Code: 1

Command Output (stdout):
--
lldb version 11.0.99
  clang revision 71ae267d1f4117473eb00d9fd3391733b843ca3c
  llvm revision 71ae267d1f4117473eb00d9fd3391733b843ca3c
"crashlog" and "save_crashlog" command installed, use the "--help" option for detailed help
"malloc_info", "ptr_refs", "cstr_refs", "find_variable", and "objc_refs" commands have been installed, use the "--help" options on these commands for detailed help.
LLDB library dir: /Users/buildslave/jenkins/workspace/lldb-cmake-sanitized/lldb-build/bin
LLDB import library dir: /Users/buildslave/jenkins/workspace/lldb-cmake-sanitized/lldb-build/./lib
libstdcxx tests will not be run because: Don't know how to build with libstdcxx on macosx
Skipping following debug info categories: ['dwo']
0x00007ffee031c468: stack in frame #0 of thread #1: tid 0x48224 in variable at 0x7ffee031c468:
    (MyClass *) self = 0x00006020000000d0
0x00007ffee031c3e0: stack (red zone)

--
Command Output (stderr):
--
error: 'ptr_refs' is not a valid command.
error: 'ptr_refs' is not a valid command.

Session logs for test failures/errors/unexpected successes will go into directory '/Users/buildslave/jenkins/workspace/lldb-cmake-sanitized/test/logs'
Command invoked: /Users/buildslave/jenkins/workspace/lldb-cmake-sanitized/llvm-project/lldb/test/API/dotest.py --arch x86_64 -s /Users/buildslave/jenkins/workspace/lldb-cmake-sanitized/lldb-build/lldb-test-traces -S nm -u CXXFLAGS -u CFLAGS --codesign-identity lldb_codesign --server /Users/buildslave/jenkins/workspace/lldb-cmake-sanitized/lldb-build/./bin/debugserver --arch x86_64 --build-dir /Users/buildslave/jenkins/workspace/lldb-cmake-sanitized/lldb-build/lldb-test-build.noindex -s=/Users/buildslave/jenkins/workspace/lldb-cmake-sanitized/test/logs -t --env TERM=vt100 --env LLVM_LIBS_DIR=/Users/buildslave/jenkins/workspace/lldb-cmake-sanitized/lldb-build/./lib --inferior-env ASAN_OPTIONS=detect_stack_use_after_return=1 --inferior-env DYLD_INSERT_LIBRARIES=/Users/buildslave/jenkins/workspace/lldb-cmake-sanitized/host-compiler/lib/clang/11.0.0/lib/darwin/libclang_rt.asan_osx_dynamic.dylib --build-dir /Users/buildslave/jenkins/workspace/lldb-cmake-sanitized/lldb-build/lldb-test-build.noindex --lldb-module-cache-dir /Users/buildslave/jenkins/workspace/lldb-cmake-sanitized/lldb-build/lldb-test-build.noindex/module-cache-lldb/lldb-api --clang-module-cache-dir /Users/buildslave/jenkins/workspace/lldb-cmake-sanitized/lldb-build/lldb-test-build.noindex/module-cache-clang/lldb-api --executable /Users/buildslave/jenkins/workspace/lldb-cmake-sanitized/lldb-build/./bin/lldb --compiler /Users/buildslave/jenkins/workspace/lldb-cmake-sanitized/lldb-build/./bin/clang --dsymutil /Users/buildslave/jenkins/workspace/lldb-cmake-sanitized/lldb-build/./bin/dsymutil --filecheck /Users/buildslave/jenkins/workspace/lldb-cmake-sanitized/lldb-build/./bin/FileCheck --lldb-libs-dir /Users/buildslave/jenkins/workspace/lldb-cmake-sanitized/lldb-build/./lib /Users/buildslave/jenkins/workspace/lldb-cmake-sanitized/llvm-project/lldb/test/API/lang/objc/ptr_refs -p TestPtrRefsObjC.py
Change dir to: /Users/buildslave/jenkins/workspace/lldb-cmake-sanitized/llvm-project/lldb/test/API/lang/objc/ptr_refs
runCmd: settings clear -all
output: 

runCmd: settings set symbols.enable-external-lookup false
output: 

runCmd: settings set target.auto-apply-fixits false
output: 

runCmd: settings set plugin.process.gdb-remote.packet-timeout 60
output: 

runCmd: settings set symbols.clang-modules-cache-path "/Users/buildslave/jenkins/workspace/lldb-cmake-sanitized/lldb-build/lldb-test-build.noindex/module-cache-lldb/lldb-api"
output: 

runCmd: settings set use-color false
output: 

runCmd: setting set target.prefer-dynamic-value no-dynamic-values
output: 

runCmd: settings set target.env-vars ASAN_OPTIONS=detect_stack_use_after_return=1 DYLD_INSERT_LIBRARIES=/Users/buildslave/jenkins/workspace/lldb-cmake-sanitized/host-compiler/lib/clang/11.0.0/lib/darwin/libclang_rt.asan_osx_dynamic.dylib
output: 

runCmd: script import lldb.macosx.heap
output: "crashlog" and "save_crashlog" command installed, use the "--help" option for detailed help
"malloc_info", "ptr_refs", "cstr_refs", "find_variable", and "objc_refs" commands have been installed, use the "--help" options on these commands for detailed help.


runCmd: ptr_refs self
output: 0x00007ffee031c468: stack in frame #0 of thread #1: tid 0x48224 in variable at 0x7ffee031c468:
    (MyClass *) self = 0x00006020000000d0
0x00007ffee031c3e0: stack (red zone)


Expecting sub string: malloc
Not matched

FAIL: LLDB (/Users/buildslave/jenkins/workspace/lldb-cmake-sanitized/lldb-build/bin/clang-11-x86_64) :: test_ptr_refs_dsym (TestPtrRefsObjC.TestPtrRefsObjC)
<bound method SBProcess.Kill of <lldb.SBProcess; proxy of <Swig Object of type 'lldb::SBProcess *' at 0x109ed88a0> >>: success

runCmd: settings clear -all
output: 

runCmd: settings set symbols.enable-external-lookup false
output: 

runCmd: settings set target.auto-apply-fixits false
output: 

runCmd: settings set plugin.process.gdb-remote.packet-timeout 60
output: 

runCmd: settings set symbols.clang-modules-cache-path "/Users/buildslave/jenkins/workspace/lldb-cmake-sanitized/lldb-build/lldb-test-build.noindex/module-cache-lldb/lldb-api"
output: 

runCmd: settings set use-color false
output: 

runCmd: setting set target.prefer-dynamic-value no-dynamic-values
output: 

runCmd: settings set target.env-vars ASAN_OPTIONS=detect_stack_use_after_return=1 DYLD_INSERT_LIBRARIES=/Users/buildslave/jenkins/workspace/lldb-cmake-sanitized/host-compiler/lib/clang/11.0.0/lib/darwin/libclang_rt.asan_osx_dynamic.dylib
output: 

runCmd: script import lldb.macosx.heap
output: 

runCmd: ptr_refs self
runCmd failed!
error: 'ptr_refs' is not a valid command.


XFAIL: LLDB (/Users/buildslave/jenkins/workspace/lldb-cmake-sanitized/lldb-build/bin/clang-11-x86_64) :: test_ptr_refs_dwarf (TestPtrRefsObjC.TestPtrRefsObjC)
<bound method SBProcess.Kill of <lldb.SBProcess; proxy of <Swig Object of type 'lldb::SBProcess *' at 0x10928a990> >>: success

UNSUPPORTED: LLDB (/Users/buildslave/jenkins/workspace/lldb-cmake-sanitized/lldb-build/bin/clang-11-x86_64) :: test_ptr_refs_dwo (TestPtrRefsObjC.TestPtrRefsObjC) (test case does not fall in any category of interest for this run) 
runCmd: settings clear -all
output: 

runCmd: settings set symbols.enable-external-lookup false
output: 

runCmd: settings set target.auto-apply-fixits false
output: 

runCmd: settings set plugin.process.gdb-remote.packet-timeout 60
output: 

runCmd: settings set symbols.clang-modules-cache-path "/Users/buildslave/jenkins/workspace/lldb-cmake-sanitized/lldb-build/lldb-test-build.noindex/module-cache-lldb/lldb-api"
output: 

runCmd: settings set use-color false
output: 

runCmd: setting set target.prefer-dynamic-value no-dynamic-values
output: 

runCmd: settings set target.env-vars ASAN_OPTIONS=detect_stack_use_after_return=1 DYLD_INSERT_LIBRARIES=/Users/buildslave/jenkins/workspace/lldb-cmake-sanitized/host-compiler/lib/clang/11.0.0/lib/darwin/libclang_rt.asan_osx_dynamic.dylib
output: 

runCmd: script import lldb.macosx.heap
output: 

runCmd: ptr_refs self
runCmd failed!
error: 'ptr_refs' is not a valid command.


XFAIL: LLDB (/Users/buildslave/jenkins/workspace/lldb-cmake-sanitized/lldb-build/bin/clang-11-x86_64) :: test_ptr_refs_gmodules (TestPtrRefsObjC.TestPtrRefsObjC)
<bound method SBProcess.Kill of <lldb.SBProcess; proxy of <Swig Object of type 'lldb::SBProcess *' at 0x109ed81e0> >>: success

Restore dir to: /Users/buildslave/jenkins/workspace/lldb-cmake-sanitized/lldb-build/tools/lldb/test
======================================================================
FAIL: test_ptr_refs_dsym (TestPtrRefsObjC.TestPtrRefsObjC)
   Test the ptr_refs tool on Darwin with Objective-C
----------------------------------------------------------------------
Traceback (most recent call last):
  File "/Users/buildslave/jenkins/workspace/lldb-cmake-sanitized/llvm-project/lldb/packages/Python/lldbsuite/test/lldbtest.py", line 1751, in test_method
    return attrvalue(self)
  File "/Users/buildslave/jenkins/workspace/lldb-cmake-sanitized/llvm-project/lldb/packages/Python/lldbsuite/test/decorators.py", line 110, in wrapper
    func(*args, **kwargs)
  File "/Users/buildslave/jenkins/workspace/lldb-cmake-sanitized/llvm-project/lldb/test/API/lang/objc/ptr_refs/TestPtrRefsObjC.py", line 47, in test_ptr_refs
    self.expect("ptr_refs self", substrs=["malloc", "stack"])
  File "/Users/buildslave/jenkins/workspace/lldb-cmake-sanitized/llvm-project/lldb/packages/Python/lldbsuite/test/lldbtest.py", line 2391, in expect
    if msg else EXP_MSG(str, output, exe))
AssertionError: False is not True : 'ptr_refs self' returns expected result, got '0x00007ffee031c468: stack in frame #0 of thread #1: tid 0x48224 in variable at 0x7ffee031c468:
    (MyClass *) self = 0x00006020000000d0
0x00007ffee031c3e0: stack (red zone)'
Config=x86_64-/Users/buildslave/jenkins/workspace/lldb-cmake-sanitized/lldb-build/bin/clang-11
----------------------------------------------------------------------
Ran 4 tests in 22.838s

RESULT: FAILED (0 passes, 1 failures, 0 errors, 1 skipped, 2 expected failures, 0 unexpected successes)

--

********************
PASS: lldb-api :: macosx/profile_vrs_detach/TestDetachVrsProfile.py (1942 of 1972)
PASS: lldb-unit :: Expression/./ExpressionTests/DWARFExpression.DW_OP_convert (1943 of 1972)
PASS: lldb-api :: tools/lldb-server/commandline/TestStubSetSID.py (1944 of 1972)
PASS: lldb-unit :: Utility/./UtilityTests/ProcessInstanceInfo.DumpTable (1945 of 1972)
PASS: lldb-unit :: Utility/./UtilityTests/RangeTest.LessThanInvalid (1946 of 1972)
PASS: lldb-unit :: Utility/./UtilityTests/VMRange.ContainsAddr (1947 of 1972)
PASS: lldb-shell :: SymbolFile/DWARF/dwarf5-partial-index.cpp (1948 of 1972)
PASS: lldb-api :: commands/expression/cast_int_to_anonymous_enum/TestCastIntToAnonymousEnum.py (1949 of 1972)
PASS: lldb-api :: lang/objc/objc-ivar-offsets/TestObjCIvarOffsets.py (1950 of 1972)
PASS: lldb-unit :: Process/gdb-remote/./ProcessGdbRemoteTests/GDBRemoteCommunicationServerTest.SendErrorResponse_StringError (1951 of 1972)
PASS: lldb-api :: functionalities/breakpoint/scripted_bkpt/TestScriptedResolver.py (1952 of 1972)
PASS: lldb-api :: commands/expression/radar_8638051/Test8638051.py (1953 of 1972)
PASS: lldb-unit :: UnwindAssembly/x86/./UnwindAssemblyx86Tests/Testx86AssemblyInspectionEngine.TestSimplei386ugmented (1954 of 1972)
PASS: lldb-api :: python_api/process/io/TestProcessIO.py (1955 of 1972)
PASS: lldb-api :: commands/gui/invalid-args/TestInvalidArgsGui.py (1956 of 1972)
UNSUPPORTED: lldb-shell :: ScriptInterpreter/Lua/independent_state.test (1957 of 1972)
PASS: lldb-api :: functionalities/breakpoint/inlined_breakpoints/TestInlinedBreakpoints.py (1958 of 1972)
PASS: lldb-api :: functionalities/data-formatter/boolreference/TestFormattersBoolRefPtr.py (1959 of 1972)
PASS: lldb-api :: lang/c/stepping/TestStepAndBreakpoints.py (1960 of 1972)
PASS: lldb-api :: functionalities/postmortem/wow64_minidump/TestWow64MiniDump.py (1961 of 1972)
PASS: lldb-api :: lang/mixed/TestMixedLanguages.py (1962 of 1972)
PASS: lldb-shell :: SymbolFile/DWARF/win-i386-line-table.s (1963 of 1972)
PASS: lldb-api :: source-manager/TestSourceManager.py (1964 of 1972)
PASS: lldb-unit :: Process/gdb-remote/./ProcessGdbRemoteTests/GDBRemoteClientBaseTest.SendContinueAndAsyncPacket (1965 of 1972)
PASS: lldb-api :: functionalities/rerun/TestRerun.py (1966 of 1972)
PASS: lldb-api :: lang/cpp/type_lookup/TestCppTypeLookup.py (1967 of 1972)
PASS: lldb-unit :: Utility/./UtilityTests/StringExtractorTest.GetNameColonValueNoSemicolon (1968 of 1972)
PASS: lldb-unit :: Process/minidump/./LLDBMinidumpTests/MinidumpParserTest.GetThreadsAndGetThreadContext (1969 of 1972)
PASS: lldb-api :: functionalities/data-formatter/data-formatter-stl/libcxx/iterator/TestDataFormatterLibccIterator.py (1970 of 1972)
PASS: lldb-api :: lang/cpp/global_operators/TestCppGlobalOperators.py (1971 of 1972)
PASS: lldb-api :: functionalities/data-formatter/data-formatter-stl/libcxx/unique_ptr/TestDataFormatterLibcxxUniquePtr.py (1972 of 1972)

Testing Time: 4344.60s
********************
Failing Tests (3):
    lldb-api :: functionalities/ptr_refs/TestPtrRefs.py
    lldb-api :: python_api/thread/TestThreadAPI.py
    lldb-api :: lang/objc/ptr_refs/TestPtrRefsObjC.py


Slowest Tests:
--------------------------------------------------------------------------
91.92s: lldb-api :: functionalities/gdb_remote_client/TestWasm.py
94.35s: lldb-api :: commands/settings/TestSettings.py
94.56s: lldb-api :: types/TestLongTypes.py
108.43s: lldb-api :: python_api/lldbutil/iter/TestLLDBIterator.py
113.14s: lldb-api :: lang/objc/objc-new-syntax/TestObjCNewSyntaxArray.py
113.52s: lldb-api :: lang/objc/foundation/TestObjCMethodsString.py
114.28s: lldb-api :: lang/objc/foundation/TestObjCMethodsNSError.py
114.55s: lldb-api :: lang/objc/objc-new-syntax/TestObjCNewSyntaxDictionary.py
120.72s: lldb-api :: tools/lldb-server/TestGdbRemote_qThreadStopInfo.py
128.52s: lldb-api :: types/TestLongTypesExpr.py
137.87s: lldb-api :: lang/objc/exceptions/TestObjCExceptions.py
138.83s: lldb-api :: lang/objc/real-definition/TestRealDefinition.py
151.05s: lldb-api :: lang/objc/objc-new-syntax/TestObjCNewSyntaxLiteral.py
167.53s: lldb-api :: lang/cpp/namespace/TestNamespaceLookup.py
213.93s: lldb-api :: lang/objc/foundation/TestObjCMethods.py
215.09s: lldb-api :: lang/objc/hidden-ivars/TestHiddenIvars.py
249.27s: lldb-api :: tools/lldb-server/TestGdbRemoteThreadsInStopReply.py
252.29s: lldb-api :: api/multithreaded/TestMultithreaded.py
273.24s: lldb-api :: lang/cpp/enum_types/TestCPP11EnumTypes.py
369.55s: lldb-api :: tools/lldb-server/TestLldbGdbServer.py

Tests Times:
--------------------------------------------------------------------------
[   Range   ] :: [               Percentage               ] :: [  Count  ]
--------------------------------------------------------------------------
[  0s, 20s) :: [**********************************      ] :: [1716/1972]
[ 20s, 40s) :: [**                                      ] :: [ 124/1972]
[ 40s, 60s) :: [*                                       ] :: [  80/1972]
[ 60s, 80s) :: [                                        ] :: [  27/1972]
[ 80s,100s) :: [                                        ] :: [   8/1972]
[100s,120s) :: [                                        ] :: [   5/1972]
[120s,140s) :: [                                        ] :: [   2/1972]
[140s,160s) :: [                                        ] :: [   3/1972]
[160s,180s) :: [                                        ] :: [   1/1972]
[180s,200s) :: [                                        ] :: [   0/1972]
[200s,220s) :: [                                        ] :: [   1/1972]
[220s,240s) :: [                                        ] :: [   1/1972]
[240s,260s) :: [                                        ] :: [   2/1972]
[260s,280s) :: [                                        ] :: [   0/1972]
[280s,300s) :: [                                        ] :: [   1/1972]
[300s,320s) :: [                                        ] :: [   0/1972]
[320s,340s) :: [                                        ] :: [   0/1972]
[340s,360s) :: [                                        ] :: [   0/1972]
[360s,380s) :: [                                        ] :: [   1/1972]
  Expected Passes    : 1797
  Expected Failures  : 6
  Unsupported Tests  : 166
  Unexpected Failures: 3
FAILED: tools/lldb/test/CMakeFiles/check-lldb-lit 
cd /Users/buildslave/jenkins/workspace/lldb-cmake-sanitized/lldb-build/tools/lldb/test && /usr/local/bin/python /Users/buildslave/jenkins/workspace/lldb-cmake-sanitized/lldb-build/./bin/llvm-lit -v --time-tests --shuffle --xunit-xml-output=/Users/buildslave/jenkins/workspace/lldb-cmake-sanitized/test/results.xml -v -j 4 --timeout 1200 /Users/buildslave/jenkins/workspace/lldb-cmake-sanitized/lldb-build/tools/lldb/test
ninja: build stopped: subcommand failed.
Command failed: Command '['/usr/bin/env', 'TERM=vt100', '/usr/local/bin/ninja', '-v', 'check-lldb']' returned non-zero exit status 1.
Command: ['/usr/bin/env', 'TERM=vt100', '/usr/local/bin/ninja', '-v', 'check-lldb']