FailedConsole Output

Skipping 7,773 KB.. Full Log

Hide Details

frame #0: 0x0000000105ff0f53 a.out`main(argc=1, argv=0x00007ffee9c0f498) at main.cpp:17:5 14 15 printf("after the loop: my_char='%c'\n", my_char); // 'my_char' should print out as 'x'. 16 -> 17 return 0; // Set break point at this line and check variable 'my_char'. ^ 18 }

Hide Details

Hide Details

<bound method SBProcess.Kill of <lldb.SBProcess; proxy of <Swig Object of type 'lldb::SBProcess *' at 0x10cc5a8d0> >>: success

Hide Details

PASS: LLDB (/Users/buildslave/jenkins/workspace/lldb-cmake-sanitized/lldb-build/bin/clang-11-x86_64) :: test_get_process_gmodules (TestThreadAPI.ThreadAPITestCase) runCmd: settings clear -all output:

Hide Details

runCmd: settings set symbols.enable-external-lookup false output:

Hide Details

runCmd: settings set target.auto-apply-fixits false output:

Hide Details

runCmd: settings set plugin.process.gdb-remote.packet-timeout 60 output:

Hide Details

runCmd: settings set symbols.clang-modules-cache-path "/Users/buildslave/jenkins/workspace/lldb-cmake-sanitized/lldb-build/lldb-test-build.noindex/module-cache-lldb/lldb-api" output:

Hide Details

runCmd: settings set use-color false output:

Hide Details

runCmd: setting set target.prefer-dynamic-value no-dynamic-values output:

Hide Details

runCmd: settings set target.env-vars ASAN_OPTIONS=detect_stack_use_after_return=1 DYLD_INSERT_LIBRARIES=/Users/buildslave/jenkins/workspace/lldb-cmake-sanitized/host-compiler/lib/clang/11.0.0/lib/darwin/libclang_rt.asan_osx_dynamic.dylib output:

Hide Details

<bound method SBProcess.Kill of <lldb.SBProcess; proxy of <Swig Object of type 'lldb::SBProcess *' at 0x10bfc0960> >>: success

Hide Details

PASS: LLDB (/Users/buildslave/jenkins/workspace/lldb-cmake-sanitized/lldb-build/bin/clang-11-x86_64) :: test_get_stop_description_dsym (TestThreadAPI.ThreadAPITestCase) runCmd: settings clear -all output:

Hide Details

runCmd: settings set symbols.enable-external-lookup false output:

Hide Details

runCmd: settings set target.auto-apply-fixits false output:

Hide Details

runCmd: settings set plugin.process.gdb-remote.packet-timeout 60 output:

Hide Details

runCmd: settings set symbols.clang-modules-cache-path "/Users/buildslave/jenkins/workspace/lldb-cmake-sanitized/lldb-build/lldb-test-build.noindex/module-cache-lldb/lldb-api" output:

Hide Details

runCmd: settings set use-color false output:

Hide Details

runCmd: setting set target.prefer-dynamic-value no-dynamic-values output:

Hide Details

runCmd: settings set target.env-vars ASAN_OPTIONS=detect_stack_use_after_return=1 DYLD_INSERT_LIBRARIES=/Users/buildslave/jenkins/workspace/lldb-cmake-sanitized/host-compiler/lib/clang/11.0.0/lib/darwin/libclang_rt.asan_osx_dynamic.dylib output:

Hide Details

<bound method SBProcess.Kill of <lldb.SBProcess; proxy of <Swig Object of type 'lldb::SBProcess *' at 0x10c6a52d0> >>: success

Hide Details

PASS: LLDB (/Users/buildslave/jenkins/workspace/lldb-cmake-sanitized/lldb-build/bin/clang-11-x86_64) :: test_get_stop_description_dwarf (TestThreadAPI.ThreadAPITestCase) UNSUPPORTED: LLDB (/Users/buildslave/jenkins/workspace/lldb-cmake-sanitized/lldb-build/bin/clang-11-x86_64) :: test_get_stop_description_dwo (TestThreadAPI.ThreadAPITestCase) (test case does not fall in any category of interest for this run) runCmd: settings clear -all output:

Hide Details

runCmd: settings set symbols.enable-external-lookup false output:

Hide Details

runCmd: settings set target.auto-apply-fixits false output:

Hide Details

runCmd: settings set plugin.process.gdb-remote.packet-timeout 60 output:

Hide Details

runCmd: settings set symbols.clang-modules-cache-path "/Users/buildslave/jenkins/workspace/lldb-cmake-sanitized/lldb-build/lldb-test-build.noindex/module-cache-lldb/lldb-api" output:

Hide Details

runCmd: settings set use-color false output:

Hide Details

runCmd: setting set target.prefer-dynamic-value no-dynamic-values output:

Hide Details

runCmd: settings set target.env-vars ASAN_OPTIONS=detect_stack_use_after_return=1 DYLD_INSERT_LIBRARIES=/Users/buildslave/jenkins/workspace/lldb-cmake-sanitized/host-compiler/lib/clang/11.0.0/lib/darwin/libclang_rt.asan_osx_dynamic.dylib output:

Hide Details

<bound method SBProcess.Kill of <lldb.SBProcess; proxy of <Swig Object of type 'lldb::SBProcess *' at 0x10bfc0990> >>: success

Hide Details

PASS: LLDB (/Users/buildslave/jenkins/workspace/lldb-cmake-sanitized/lldb-build/bin/clang-11-x86_64) :: test_get_stop_description_gmodules (TestThreadAPI.ThreadAPITestCase) runCmd: settings clear -all output:

Hide Details

runCmd: settings set symbols.enable-external-lookup false output:

Hide Details

runCmd: settings set target.auto-apply-fixits false output:

Hide Details

runCmd: settings set plugin.process.gdb-remote.packet-timeout 60 output:

Hide Details

runCmd: settings set symbols.clang-modules-cache-path "/Users/buildslave/jenkins/workspace/lldb-cmake-sanitized/lldb-build/lldb-test-build.noindex/module-cache-lldb/lldb-api" output:

Hide Details

runCmd: settings set use-color false output:

Hide Details

runCmd: setting set target.prefer-dynamic-value no-dynamic-values output:

Hide Details

runCmd: settings set target.env-vars ASAN_OPTIONS=detect_stack_use_after_return=1 DYLD_INSERT_LIBRARIES=/Users/buildslave/jenkins/workspace/lldb-cmake-sanitized/host-compiler/lib/clang/11.0.0/lib/darwin/libclang_rt.asan_osx_dynamic.dylib output:

Hide Details

runCmd: breakpoint list output: Current breakpoints: 1: file = 'main2.cpp', line = 21, exact_match = 0, locations = 1 1.1: where = test_run_to_address_dsym`b(int) + 22 at main2.cpp:21:17, address = test_run_to_address_dsym[0x0000000100000e66], unresolved, hit count = 0

Hide Details

Hide Details

Hide Details

runCmd: thread backtrace output: * thread #1, queue = 'com.apple.main-thread', stop reason = breakpoint 1.1 * frame #0: 0x0000000103c3fe66 test_run_to_address_dsym`b(val=1) at main2.cpp:21:17 frame #1: 0x0000000103c3fe0d test_run_to_address_dsym`a(val=1) at main2.cpp:11:16 frame #2: 0x0000000103c3fee0 test_run_to_address_dsym`main(argc=1, argv=0x00007ffeebfc0470) at main2.cpp:36:14 frame #3: 0x00007fff75880085 libdyld.dylib`start + 1

Hide Details

Hide Details

runCmd: breakpoint list output: Current breakpoints: 1: file = 'main2.cpp', line = 21, exact_match = 0, locations = 1 Options: disabled 1.1: where = test_run_to_address_dsym`b(int) + 22 at main2.cpp:21:17, address = 0x0000000103c3fe66, unresolved, hit count = 1

Hide Details

Hide Details

Hide Details

runCmd: thread backtrace output: * thread #1, queue = 'com.apple.main-thread', stop reason = step over * frame #0: 0x0000000103c3fe9d test_run_to_address_dsym`b(val=1) at main2.cpp:26:12 frame #1: 0x0000000103c3fe0d test_run_to_address_dsym`a(val=1) at main2.cpp:11:16 frame #2: 0x0000000103c3fee0 test_run_to_address_dsym`main(argc=1, argv=0x00007ffeebfc0470) at main2.cpp:36:14 frame #3: 0x00007fff75880085 libdyld.dylib`start + 1

Hide Details

Hide Details

runCmd: process status output: Process 75375 stopped * thread #1, queue = 'com.apple.main-thread', stop reason = run to address: 0x0000000103c3fe66 frame #0: 0x0000000103c3fe66 test_run_to_address_dsym`b(val=2) at main2.cpp:21:17 18 int b(int val) 19 { 20 int rc = c(val); -> 21 void *ptr = malloc(1024); // thread step-out of malloc into function b. ^ 22 if (!ptr) 23 return -1; 24 else

Hide Details

Hide Details

<bound method SBProcess.Kill of <lldb.SBProcess; proxy of <Swig Object of type 'lldb::SBProcess *' at 0x10c4a5de0> >>: success

Hide Details

PASS: LLDB (/Users/buildslave/jenkins/workspace/lldb-cmake-sanitized/lldb-build/bin/clang-11-x86_64) :: test_run_to_address_dsym (TestThreadAPI.ThreadAPITestCase) runCmd: settings clear -all output:

Hide Details

runCmd: settings set symbols.enable-external-lookup false output:

Hide Details

runCmd: settings set target.auto-apply-fixits false output:

Hide Details

runCmd: settings set plugin.process.gdb-remote.packet-timeout 60 output:

Hide Details

runCmd: settings set symbols.clang-modules-cache-path "/Users/buildslave/jenkins/workspace/lldb-cmake-sanitized/lldb-build/lldb-test-build.noindex/module-cache-lldb/lldb-api" output:

Hide Details

runCmd: settings set use-color false output:

Hide Details

runCmd: setting set target.prefer-dynamic-value no-dynamic-values output:

Hide Details

runCmd: settings set target.env-vars ASAN_OPTIONS=detect_stack_use_after_return=1 DYLD_INSERT_LIBRARIES=/Users/buildslave/jenkins/workspace/lldb-cmake-sanitized/host-compiler/lib/clang/11.0.0/lib/darwin/libclang_rt.asan_osx_dynamic.dylib output:

Hide Details

runCmd: breakpoint list output: Current breakpoints: 1: file = 'main2.cpp', line = 21, exact_match = 0, locations = 1 1.1: where = test_run_to_address_dwarf`b(int) + 22 at main2.cpp:21:17, address = test_run_to_address_dwarf[0x0000000100000e66], unresolved, hit count = 0

Hide Details

Hide Details

Hide Details

runCmd: thread backtrace output: * thread #1, queue = 'com.apple.main-thread', stop reason = breakpoint 1.1 * frame #0: 0x0000000105d9ae66 test_run_to_address_dwarf`b(val=1) at main2.cpp:21:17 frame #1: 0x0000000105d9ae0d test_run_to_address_dwarf`a(val=1) at main2.cpp:11:16 frame #2: 0x0000000105d9aee0 test_run_to_address_dwarf`main(argc=1, argv=0x00007ffee9e65470) at main2.cpp:36:14 frame #3: 0x00007fff75880085 libdyld.dylib`start + 1

Hide Details

Hide Details

runCmd: breakpoint list output: Current breakpoints: 1: file = 'main2.cpp', line = 21, exact_match = 0, locations = 1 Options: disabled 1.1: where = test_run_to_address_dwarf`b(int) + 22 at main2.cpp:21:17, address = 0x0000000105d9ae66, unresolved, hit count = 1

Hide Details

Hide Details

Hide Details

runCmd: thread backtrace output: * thread #1, queue = 'com.apple.main-thread', stop reason = step over * frame #0: 0x0000000105d9ae9d test_run_to_address_dwarf`b(val=1) at main2.cpp:26:12 frame #1: 0x0000000105d9ae0d test_run_to_address_dwarf`a(val=1) at main2.cpp:11:16 frame #2: 0x0000000105d9aee0 test_run_to_address_dwarf`main(argc=1, argv=0x00007ffee9e65470) at main2.cpp:36:14 frame #3: 0x00007fff75880085 libdyld.dylib`start + 1

Hide Details

Hide Details

runCmd: process status output: Process 75533 stopped * thread #1, queue = 'com.apple.main-thread', stop reason = run to address: 0x0000000105d9ae66 frame #0: 0x0000000105d9ae66 test_run_to_address_dwarf`b(val=2) at main2.cpp:21:17 18 int b(int val) 19 { 20 int rc = c(val); -> 21 void *ptr = malloc(1024); // thread step-out of malloc into function b. ^ 22 if (!ptr) 23 return -1; 24 else

Hide Details

Hide Details

<bound method SBProcess.Kill of <lldb.SBProcess; proxy of <Swig Object of type 'lldb::SBProcess *' at 0x10bfc0960> >>: success

Hide Details

PASS: LLDB (/Users/buildslave/jenkins/workspace/lldb-cmake-sanitized/lldb-build/bin/clang-11-x86_64) :: test_run_to_address_dwarf (TestThreadAPI.ThreadAPITestCase) UNSUPPORTED: LLDB (/Users/buildslave/jenkins/workspace/lldb-cmake-sanitized/lldb-build/bin/clang-11-x86_64) :: test_run_to_address_dwo (TestThreadAPI.ThreadAPITestCase) (test case does not fall in any category of interest for this run) runCmd: settings clear -all output:

Hide Details

runCmd: settings set symbols.enable-external-lookup false output:

Hide Details

runCmd: settings set target.auto-apply-fixits false output:

Hide Details

runCmd: settings set plugin.process.gdb-remote.packet-timeout 60 output:

Hide Details

runCmd: settings set symbols.clang-modules-cache-path "/Users/buildslave/jenkins/workspace/lldb-cmake-sanitized/lldb-build/lldb-test-build.noindex/module-cache-lldb/lldb-api" output:

Hide Details

runCmd: settings set use-color false output:

Hide Details

runCmd: setting set target.prefer-dynamic-value no-dynamic-values output:

Hide Details

runCmd: settings set target.env-vars ASAN_OPTIONS=detect_stack_use_after_return=1 DYLD_INSERT_LIBRARIES=/Users/buildslave/jenkins/workspace/lldb-cmake-sanitized/host-compiler/lib/clang/11.0.0/lib/darwin/libclang_rt.asan_osx_dynamic.dylib output:

Hide Details

runCmd: breakpoint list output: Current breakpoints: 1: file = 'main2.cpp', line = 21, exact_match = 0, locations = 1 1.1: where = test_run_to_address_gmodules`b(int) + 22 at main2.cpp:21:17, address = test_run_to_address_gmodules[0x0000000100000e66], unresolved, hit count = 0

Hide Details

Hide Details

Hide Details

runCmd: thread backtrace output: * thread #1, queue = 'com.apple.main-thread', stop reason = breakpoint 1.1 * frame #0: 0x000000010878ee66 test_run_to_address_gmodules`b(val=1) at main2.cpp:21:17 frame #1: 0x000000010878ee0d test_run_to_address_gmodules`a(val=1) at main2.cpp:11:16 frame #2: 0x000000010878eee0 test_run_to_address_gmodules`main(argc=1, argv=0x00007ffee7471460) at main2.cpp:36:14 frame #3: 0x00007fff75880085 libdyld.dylib`start + 1

Hide Details

Hide Details

runCmd: breakpoint list output: Current breakpoints: 1: file = 'main2.cpp', line = 21, exact_match = 0, locations = 1 Options: disabled 1.1: where = test_run_to_address_gmodules`b(int) + 22 at main2.cpp:21:17, address = 0x000000010878ee66, unresolved, hit count = 1

Hide Details

Hide Details

Hide Details

runCmd: thread backtrace output: * thread #1, queue = 'com.apple.main-thread', stop reason = step over * frame #0: 0x000000010878ee9d test_run_to_address_gmodules`b(val=1) at main2.cpp:26:12 frame #1: 0x000000010878ee0d test_run_to_address_gmodules`a(val=1) at main2.cpp:11:16 frame #2: 0x000000010878eee0 test_run_to_address_gmodules`main(argc=1, argv=0x00007ffee7471460) at main2.cpp:36:14 frame #3: 0x00007fff75880085 libdyld.dylib`start + 1

Hide Details

Hide Details

runCmd: process status output: Process 75595 stopped * thread #1, queue = 'com.apple.main-thread', stop reason = run to address: 0x000000010878ee66 frame #0: 0x000000010878ee66 test_run_to_address_gmodules`b(val=2) at main2.cpp:21:17 18 int b(int val) 19 { 20 int rc = c(val); -> 21 void *ptr = malloc(1024); // thread step-out of malloc into function b. ^ 22 if (!ptr) 23 return -1; 24 else

Hide Details

Hide Details

<bound method SBProcess.Kill of <lldb.SBProcess; proxy of <Swig Object of type 'lldb::SBProcess *' at 0x10c6a52d0> >>: success

Hide Details

PASS: LLDB (/Users/buildslave/jenkins/workspace/lldb-cmake-sanitized/lldb-build/bin/clang-11-x86_64) :: test_run_to_address_gmodules (TestThreadAPI.ThreadAPITestCase) runCmd: settings clear -all output:

Hide Details

runCmd: settings set symbols.enable-external-lookup false output:

Hide Details

runCmd: settings set target.auto-apply-fixits false output:

Hide Details

runCmd: settings set plugin.process.gdb-remote.packet-timeout 60 output:

Hide Details

runCmd: settings set symbols.clang-modules-cache-path "/Users/buildslave/jenkins/workspace/lldb-cmake-sanitized/lldb-build/lldb-test-build.noindex/module-cache-lldb/lldb-api" output:

Hide Details

runCmd: settings set use-color false output:

Hide Details

runCmd: setting set target.prefer-dynamic-value no-dynamic-values output:

Hide Details

runCmd: settings set target.env-vars ASAN_OPTIONS=detect_stack_use_after_return=1 DYLD_INSERT_LIBRARIES=/Users/buildslave/jenkins/workspace/lldb-cmake-sanitized/host-compiler/lib/clang/11.0.0/lib/darwin/libclang_rt.asan_osx_dynamic.dylib output:

Hide Details

FAIL: LLDB (/Users/buildslave/jenkins/workspace/lldb-cmake-sanitized/lldb-build/bin/clang-11-x86_64) :: test_step_out_of_malloc_into_function_b_dsym (TestThreadAPI.ThreadAPITestCase) <bound method SBProcess.Kill of <lldb.SBProcess; proxy of <Swig Object of type 'lldb::SBProcess *' at 0x10bfc0990> >>: success

Hide Details

runCmd: settings clear -all output:

Hide Details

runCmd: settings set symbols.enable-external-lookup false output:

Hide Details

runCmd: settings set target.auto-apply-fixits false output:

Hide Details

runCmd: settings set plugin.process.gdb-remote.packet-timeout 60 output:

Hide Details

runCmd: settings set symbols.clang-modules-cache-path "/Users/buildslave/jenkins/workspace/lldb-cmake-sanitized/lldb-build/lldb-test-build.noindex/module-cache-lldb/lldb-api" output:

Hide Details

runCmd: settings set use-color false output:

Hide Details

runCmd: setting set target.prefer-dynamic-value no-dynamic-values output:

Hide Details

runCmd: settings set target.env-vars ASAN_OPTIONS=detect_stack_use_after_return=1 DYLD_INSERT_LIBRARIES=/Users/buildslave/jenkins/workspace/lldb-cmake-sanitized/host-compiler/lib/clang/11.0.0/lib/darwin/libclang_rt.asan_osx_dynamic.dylib output:

Hide Details

FAIL: LLDB (/Users/buildslave/jenkins/workspace/lldb-cmake-sanitized/lldb-build/bin/clang-11-x86_64) :: test_step_out_of_malloc_into_function_b_dwarf (TestThreadAPI.ThreadAPITestCase) <bound method SBProcess.Kill of <lldb.SBProcess; proxy of <Swig Object of type 'lldb::SBProcess *' at 0x10c4a5de0> >>: success

Hide Details

UNSUPPORTED: LLDB (/Users/buildslave/jenkins/workspace/lldb-cmake-sanitized/lldb-build/bin/clang-11-x86_64) :: test_step_out_of_malloc_into_function_b_dwo (TestThreadAPI.ThreadAPITestCase) (test case does not fall in any category of interest for this run) runCmd: settings clear -all output:

Hide Details

runCmd: settings set symbols.enable-external-lookup false output:

Hide Details

runCmd: settings set target.auto-apply-fixits false output:

Hide Details

runCmd: settings set plugin.process.gdb-remote.packet-timeout 60 output:

Hide Details

runCmd: settings set symbols.clang-modules-cache-path "/Users/buildslave/jenkins/workspace/lldb-cmake-sanitized/lldb-build/lldb-test-build.noindex/module-cache-lldb/lldb-api" output:

Hide Details

runCmd: settings set use-color false output:

Hide Details

runCmd: setting set target.prefer-dynamic-value no-dynamic-values output:

Hide Details

runCmd: settings set target.env-vars ASAN_OPTIONS=detect_stack_use_after_return=1 DYLD_INSERT_LIBRARIES=/Users/buildslave/jenkins/workspace/lldb-cmake-sanitized/host-compiler/lib/clang/11.0.0/lib/darwin/libclang_rt.asan_osx_dynamic.dylib output:

Hide Details

FAIL: LLDB (/Users/buildslave/jenkins/workspace/lldb-cmake-sanitized/lldb-build/bin/clang-11-x86_64) :: test_step_out_of_malloc_into_function_b_gmodules (TestThreadAPI.ThreadAPITestCase) <bound method SBProcess.Kill of <lldb.SBProcess; proxy of <Swig Object of type 'lldb::SBProcess *' at 0x10bfc0990> >>: success

Hide Details

runCmd: settings clear -all output:

Hide Details

runCmd: settings set symbols.enable-external-lookup false output:

Hide Details

runCmd: settings set target.auto-apply-fixits false output:

Hide Details

runCmd: settings set plugin.process.gdb-remote.packet-timeout 60 output:

Hide Details

runCmd: settings set symbols.clang-modules-cache-path "/Users/buildslave/jenkins/workspace/lldb-cmake-sanitized/lldb-build/lldb-test-build.noindex/module-cache-lldb/lldb-api" output:

Hide Details

runCmd: settings set use-color false output:

Hide Details

runCmd: setting set target.prefer-dynamic-value no-dynamic-values output:

Hide Details

runCmd: settings set target.env-vars ASAN_OPTIONS=detect_stack_use_after_return=1 DYLD_INSERT_LIBRARIES=/Users/buildslave/jenkins/workspace/lldb-cmake-sanitized/host-compiler/lib/clang/11.0.0/lib/darwin/libclang_rt.asan_osx_dynamic.dylib output:

Hide Details

runCmd: breakpoint list output: Current breakpoints: 1: file = 'main2.cpp', line = 21, exact_match = 0, locations = 1 1.1: where = test_step_over_3_times_dsym`b(int) + 22 at main2.cpp:21:17, address = test_step_over_3_times_dsym[0x0000000100000e66], unresolved, hit count = 0

Hide Details

Hide Details

Hide Details

runCmd: thread backtrace output: * thread #1, queue = 'com.apple.main-thread', stop reason = breakpoint 1.1 * frame #0: 0x0000000107f24e66 test_step_over_3_times_dsym`b(val=1) at main2.cpp:21:17 frame #1: 0x0000000107f24e0d test_step_over_3_times_dsym`a(val=1) at main2.cpp:11:16 frame #2: 0x0000000107f24ee0 test_step_over_3_times_dsym`main(argc=1, argv=0x00007ffee7cdb468) at main2.cpp:36:14 frame #3: 0x00007fff75880085 libdyld.dylib`start + 1 frame #4: 0x00007fff75880085 libdyld.dylib`start + 1

Hide Details

Hide Details

runCmd: thread backtrace output: * thread #1, queue = 'com.apple.main-thread', stop reason = step over * frame #0: 0x0000000107f24e9d test_step_over_3_times_dsym`b(val=1) at main2.cpp:26:12 frame #1: 0x0000000107f24e0d test_step_over_3_times_dsym`a(val=1) at main2.cpp:11:16 frame #2: 0x0000000107f24ee0 test_step_over_3_times_dsym`main(argc=1, argv=0x00007ffee7cdb468) at main2.cpp:36:14 frame #3: 0x00007fff75880085 libdyld.dylib`start + 1 frame #4: 0x00007fff75880085 libdyld.dylib`start + 1

Hide Details

Hide Details

<bound method SBProcess.Kill of <lldb.SBProcess; proxy of <Swig Object of type 'lldb::SBProcess *' at 0x10c4a5de0> >>: success

Hide Details

PASS: LLDB (/Users/buildslave/jenkins/workspace/lldb-cmake-sanitized/lldb-build/bin/clang-11-x86_64) :: test_step_over_3_times_dsym (TestThreadAPI.ThreadAPITestCase) runCmd: settings clear -all output:

Hide Details

runCmd: settings set symbols.enable-external-lookup false output:

Hide Details

runCmd: settings set target.auto-apply-fixits false output:

Hide Details

runCmd: settings set plugin.process.gdb-remote.packet-timeout 60 output:

Hide Details

runCmd: settings set symbols.clang-modules-cache-path "/Users/buildslave/jenkins/workspace/lldb-cmake-sanitized/lldb-build/lldb-test-build.noindex/module-cache-lldb/lldb-api" output:

Hide Details

runCmd: settings set use-color false output:

Hide Details

runCmd: setting set target.prefer-dynamic-value no-dynamic-values output:

Hide Details

runCmd: settings set target.env-vars ASAN_OPTIONS=detect_stack_use_after_return=1 DYLD_INSERT_LIBRARIES=/Users/buildslave/jenkins/workspace/lldb-cmake-sanitized/host-compiler/lib/clang/11.0.0/lib/darwin/libclang_rt.asan_osx_dynamic.dylib output:

Hide Details

runCmd: breakpoint list output: Current breakpoints: 1: file = 'main2.cpp', line = 21, exact_match = 0, locations = 1 1.1: where = test_step_over_3_times_dwarf`b(int) + 22 at main2.cpp:21:17, address = test_step_over_3_times_dwarf[0x0000000100000e66], unresolved, hit count = 0

Hide Details

Hide Details

Hide Details

runCmd: thread backtrace output: * thread #1, queue = 'com.apple.main-thread', stop reason = breakpoint 1.1 * frame #0: 0x000000010afc6e66 test_step_over_3_times_dwarf`b(val=1) at main2.cpp:21:17 frame #1: 0x000000010afc6e0d test_step_over_3_times_dwarf`a(val=1) at main2.cpp:11:16 frame #2: 0x000000010afc6ee0 test_step_over_3_times_dwarf`main(argc=1, argv=0x00007ffee4c39460) at main2.cpp:36:14 frame #3: 0x00007fff75880085 libdyld.dylib`start + 1

Hide Details

Hide Details

runCmd: thread backtrace output: * thread #1, queue = 'com.apple.main-thread', stop reason = step over * frame #0: 0x000000010afc6e9d test_step_over_3_times_dwarf`b(val=1) at main2.cpp:26:12 frame #1: 0x000000010afc6e0d test_step_over_3_times_dwarf`a(val=1) at main2.cpp:11:16 frame #2: 0x000000010afc6ee0 test_step_over_3_times_dwarf`main(argc=1, argv=0x00007ffee4c39460) at main2.cpp:36:14 frame #3: 0x00007fff75880085 libdyld.dylib`start + 1

Hide Details

Hide Details

<bound method SBProcess.Kill of <lldb.SBProcess; proxy of <Swig Object of type 'lldb::SBProcess *' at 0x10bfc0990> >>: success

Hide Details

PASS: LLDB (/Users/buildslave/jenkins/workspace/lldb-cmake-sanitized/lldb-build/bin/clang-11-x86_64) :: test_step_over_3_times_dwarf (TestThreadAPI.ThreadAPITestCase) UNSUPPORTED: LLDB (/Users/buildslave/jenkins/workspace/lldb-cmake-sanitized/lldb-build/bin/clang-11-x86_64) :: test_step_over_3_times_dwo (TestThreadAPI.ThreadAPITestCase) (test case does not fall in any category of interest for this run) runCmd: settings clear -all output:

Hide Details

runCmd: settings set symbols.enable-external-lookup false output:

Hide Details

runCmd: settings set target.auto-apply-fixits false output:

Hide Details

runCmd: settings set plugin.process.gdb-remote.packet-timeout 60 output:

Hide Details

runCmd: settings set symbols.clang-modules-cache-path "/Users/buildslave/jenkins/workspace/lldb-cmake-sanitized/lldb-build/lldb-test-build.noindex/module-cache-lldb/lldb-api" output:

Hide Details

runCmd: settings set use-color false output:

Hide Details

runCmd: setting set target.prefer-dynamic-value no-dynamic-values output:

Hide Details

runCmd: settings set target.env-vars ASAN_OPTIONS=detect_stack_use_after_return=1 DYLD_INSERT_LIBRARIES=/Users/buildslave/jenkins/workspace/lldb-cmake-sanitized/host-compiler/lib/clang/11.0.0/lib/darwin/libclang_rt.asan_osx_dynamic.dylib output:

Hide Details

runCmd: breakpoint list output: Current breakpoints: 1: file = 'main2.cpp', line = 21, exact_match = 0, locations = 1 1.1: where = test_step_over_3_times_gmodules`b(int) + 22 at main2.cpp:21:17, address = test_step_over_3_times_gmodules[0x0000000100000e66], unresolved, hit count = 0

Hide Details

Hide Details

Hide Details

runCmd: thread backtrace output: * thread #1, queue = 'com.apple.main-thread', stop reason = breakpoint 1.1 * frame #0: 0x000000010ffcbe66 test_step_over_3_times_gmodules`b(val=1) at main2.cpp:21:17 frame #1: 0x000000010ffcbe0d test_step_over_3_times_gmodules`a(val=1) at main2.cpp:11:16 frame #2: 0x000000010ffcbee0 test_step_over_3_times_gmodules`main(argc=1, argv=0x00007ffedfc34458) at main2.cpp:36:14 frame #3: 0x00007fff75880085 libdyld.dylib`start + 1 frame #4: 0x00007fff75880085 libdyld.dylib`start + 1

Hide Details

Hide Details

runCmd: thread backtrace output: * thread #1, queue = 'com.apple.main-thread', stop reason = step over * frame #0: 0x000000010ffcbe9d test_step_over_3_times_gmodules`b(val=1) at main2.cpp:26:12 frame #1: 0x000000010ffcbe0d test_step_over_3_times_gmodules`a(val=1) at main2.cpp:11:16 frame #2: 0x000000010ffcbee0 test_step_over_3_times_gmodules`main(argc=1, argv=0x00007ffedfc34458) at main2.cpp:36:14 frame #3: 0x00007fff75880085 libdyld.dylib`start + 1 frame #4: 0x00007fff75880085 libdyld.dylib`start + 1

Hide Details

Hide Details

<bound method SBProcess.Kill of <lldb.SBProcess; proxy of <Swig Object of type 'lldb::SBProcess *' at 0x10c6a52d0> >>: success

Hide Details

PASS: LLDB (/Users/buildslave/jenkins/workspace/lldb-cmake-sanitized/lldb-build/bin/clang-11-x86_64) :: test_step_over_3_times_gmodules (TestThreadAPI.ThreadAPITestCase) Restore dir to: /Users/buildslave/jenkins/workspace/lldb-cmake-sanitized/lldb-build/tools/lldb/test ====================================================================== ERROR: test_step_out_of_malloc_into_function_b_dsym (TestThreadAPI.ThreadAPITestCase) Test Python SBThread.StepOut() API to step out of a malloc call where the call site is at function b(). ---------------------------------------------------------------------- Traceback (most recent call last): File "/Users/buildslave/jenkins/workspace/lldb-cmake-sanitized/llvm-project/lldb/packages/Python/lldbsuite/test/lldbtest.py", line 1751, in test_method return attrvalue(self) File "/Users/buildslave/jenkins/workspace/lldb-cmake-sanitized/llvm-project/lldb/packages/Python/lldbsuite/test/decorators.py", line 110, in wrapper func(*args, **kwargs) File "/Users/buildslave/jenkins/workspace/lldb-cmake-sanitized/llvm-project/lldb/packages/Python/lldbsuite/test/decorators.py", line 110, in wrapper func(*args, **kwargs) File "/Users/buildslave/jenkins/workspace/lldb-cmake-sanitized/llvm-project/lldb/packages/Python/lldbsuite/test/decorators.py", line 110, in wrapper func(*args, **kwargs) File "/Users/buildslave/jenkins/workspace/lldb-cmake-sanitized/llvm-project/lldb/test/API/python_api/thread/TestThreadAPI.py", line 50, in test_step_out_of_malloc_into_function_b self.step_out_of_malloc_into_function_b(self.exe_name) File "/Users/buildslave/jenkins/workspace/lldb-cmake-sanitized/llvm-project/lldb/test/API/python_api/thread/TestThreadAPI.py", line 157, in step_out_of_malloc_into_function_b thread.IsValid(), AttributeError: 'NoneType' object has no attribute 'IsValid' Config=x86_64-/Users/buildslave/jenkins/workspace/lldb-cmake-sanitized/lldb-build/bin/clang-11 ====================================================================== ERROR: test_step_out_of_malloc_into_function_b_dwarf (TestThreadAPI.ThreadAPITestCase) Test Python SBThread.StepOut() API to step out of a malloc call where the call site is at function b(). ---------------------------------------------------------------------- Traceback (most recent call last): File "/Users/buildslave/jenkins/workspace/lldb-cmake-sanitized/llvm-project/lldb/packages/Python/lldbsuite/test/lldbtest.py", line 1751, in test_method return attrvalue(self) File "/Users/buildslave/jenkins/workspace/lldb-cmake-sanitized/llvm-project/lldb/packages/Python/lldbsuite/test/decorators.py", line 110, in wrapper func(*args, **kwargs) File "/Users/buildslave/jenkins/workspace/lldb-cmake-sanitized/llvm-project/lldb/packages/Python/lldbsuite/test/decorators.py", line 110, in wrapper func(*args, **kwargs) File "/Users/buildslave/jenkins/workspace/lldb-cmake-sanitized/llvm-project/lldb/packages/Python/lldbsuite/test/decorators.py", line 110, in wrapper func(*args, **kwargs) File "/Users/buildslave/jenkins/workspace/lldb-cmake-sanitized/llvm-project/lldb/test/API/python_api/thread/TestThreadAPI.py", line 50, in test_step_out_of_malloc_into_function_b self.step_out_of_malloc_into_function_b(self.exe_name) File "/Users/buildslave/jenkins/workspace/lldb-cmake-sanitized/llvm-project/lldb/test/API/python_api/thread/TestThreadAPI.py", line 157, in step_out_of_malloc_into_function_b thread.IsValid(), AttributeError: 'NoneType' object has no attribute 'IsValid' Config=x86_64-/Users/buildslave/jenkins/workspace/lldb-cmake-sanitized/lldb-build/bin/clang-11 ====================================================================== ERROR: test_step_out_of_malloc_into_function_b_gmodules (TestThreadAPI.ThreadAPITestCase) Test Python SBThread.StepOut() API to step out of a malloc call where the call site is at function b(). ---------------------------------------------------------------------- Traceback (most recent call last): File "/Users/buildslave/jenkins/workspace/lldb-cmake-sanitized/llvm-project/lldb/packages/Python/lldbsuite/test/lldbtest.py", line 1751, in test_method return attrvalue(self) File "/Users/buildslave/jenkins/workspace/lldb-cmake-sanitized/llvm-project/lldb/packages/Python/lldbsuite/test/decorators.py", line 110, in wrapper func(*args, **kwargs) File "/Users/buildslave/jenkins/workspace/lldb-cmake-sanitized/llvm-project/lldb/packages/Python/lldbsuite/test/decorators.py", line 110, in wrapper func(*args, **kwargs) File "/Users/buildslave/jenkins/workspace/lldb-cmake-sanitized/llvm-project/lldb/packages/Python/lldbsuite/test/decorators.py", line 110, in wrapper func(*args, **kwargs) File "/Users/buildslave/jenkins/workspace/lldb-cmake-sanitized/llvm-project/lldb/test/API/python_api/thread/TestThreadAPI.py", line 50, in test_step_out_of_malloc_into_function_b self.step_out_of_malloc_into_function_b(self.exe_name) File "/Users/buildslave/jenkins/workspace/lldb-cmake-sanitized/llvm-project/lldb/test/API/python_api/thread/TestThreadAPI.py", line 157, in step_out_of_malloc_into_function_b thread.IsValid(), AttributeError: 'NoneType' object has no attribute 'IsValid' Config=x86_64-/Users/buildslave/jenkins/workspace/lldb-cmake-sanitized/lldb-build/bin/clang-11 ---------------------------------------------------------------------- Ran 20 tests in 39.632s

Hide Details

RESULT: FAILED (12 passes, 0 failures, 3 errors, 5 skipped, 0 expected failures, 0 unexpected successes)

Hide Details

--

Hide Details

******************** PASS: lldb-unit :: Target/./TargetTests/PathMappingListTest.RelativeTests (880 of 1976) PASS: lldb-api :: commands/watchpoints/watchpoint_commands/condition/TestWatchpointConditionCmd.py (881 of 1976) PASS: lldb-api :: lang/cpp/stl/TestSTL.py (882 of 1976) PASS: lldb-shell :: Quit/TestQuitExitCode-30.test (883 of 1976) PASS: lldb-api :: macosx/lc-note/kern-ver-str/TestKernVerStrLCNOTE.py (884 of 1976) PASS: lldb-unit :: Utility/./UtilityTests/BroadcasterTest.BroadcastEvent (885 of 1976) PASS: lldb-unit :: Utility/./UtilityTests/ArgsTest.TestQuotedUnknownEscape (886 of 1976) PASS: lldb-shell :: ObjectFile/ELF/PT_LOAD-overlap-section.yaml (887 of 1976) PASS: lldb-shell :: Settings/TestEchoCommands.test (888 of 1976) PASS: lldb-api :: python_api/symbol-context/TestSymbolContext.py (889 of 1976) PASS: lldb-unit :: Utility/./UtilityTests/StringLexerTest.AdvanceIf (890 of 1976) PASS: lldb-api :: lang/objc/real-definition/TestRealDefinition.py (891 of 1976) PASS: lldb-unit :: Process/minidump/./LLDBMinidumpTests/MinidumpParserTest.InvalidMinidump (892 of 1976) PASS: lldb-shell :: ObjectFile/PECOFF/basic-info-arm64.yaml (893 of 1976) PASS: lldb-unit :: Symbol/./SymbolTests/TestTypeSystemClang.TestIsClangType (894 of 1976) PASS: lldb-unit :: Process/minidump/./LLDBMinidumpTests/MinidumpParserTest.GetThreadsAndGetThreadContext (895 of 1976) PASS: lldb-api :: lang/c/forward/TestForwardDeclaration.py (896 of 1976) PASS: lldb-api :: functionalities/lazy-loading/TestLazyLoading.py (897 of 1976) PASS: lldb-api :: lang/objc/modules-hash-mismatch/TestClangModulesHashMismatch.py (898 of 1976) PASS: lldb-unit :: Utility/./UtilityTests/SerializationRountripTest.SerializeDeserializeCStringArrayNullptr (899 of 1976) PASS: lldb-api :: lang/cpp/class_static/TestStaticVariables.py (900 of 1976) PASS: lldb-unit :: Symbol/./SymbolTests/TestTypeSystemClang.TestGetTypeClassTypeOf (901 of 1976) PASS: lldb-api :: commands/expression/rdar42038760/TestScalarURem.py (902 of 1976) PASS: lldb-api :: commands/gui/invalid-args/TestInvalidArgsGui.py (903 of 1976) PASS: lldb-api :: tools/lldb-server/TestGdbRemoteExitCode.py (904 of 1976) PASS: lldb-api :: functionalities/thread/backtrace_all/TestBacktraceAll.py (905 of 1976) PASS: lldb-unit :: Utility/./UtilityTests/StringListTest.LongestCommonPrefixEmpty (906 of 1976) PASS: lldb-shell :: SymbolFile/NativePDB/global-classes.cpp (907 of 1976) PASS: lldb-api :: functionalities/memory-region/TestMemoryRegion.py (908 of 1976) PASS: lldb-api :: functionalities/breakpoint/breakpoint_options/TestBreakpointOptions.py (909 of 1976) PASS: lldb-unit :: Utility/./UtilityTests/OptionsWithRawTest.EmptyInput (910 of 1976) PASS: lldb-api :: commands/expression/import-std-module/vector-bool/TestVectorBoolFromStdModule.py (911 of 1976) PASS: lldb-api :: commands/command/invalid-args/TestInvalidArgsCommand.py (912 of 1976) PASS: lldb-unit :: Process/minidump/./LLDBMinidumpTests/MinidumpParserTest.FindMemoryRangeWithFullMemoryMinidump (913 of 1976) PASS: lldb-unit :: Utility/./UtilityTests/ProcessInfoTest.Constructor (914 of 1976) PASS: lldb-api :: tools/lldb-server/commandline/TestStubReverseConnect.py (915 of 1976) PASS: lldb-unit :: Symbol/./SymbolTests/TestClangASTImporter.MetadataPropagationIndirectImport (916 of 1976) PASS: lldb-unit :: Utility/./UtilityTests/StringListTest.LongestCommonPrefixNoPrefix (917 of 1976) PASS: lldb-shell :: Commands/command-thread-select.test (918 of 1976) PASS: lldb-unit :: ScriptInterpreter/Python/./ScriptInterpreterPythonTests/PythonDataObjectsTest.TestGlobalNameResolutionNoDot (919 of 1976) PASS: lldb-shell :: SymbolFile/Breakpad/line-table-edgecases.test (920 of 1976) PASS: lldb-unit :: Utility/./UtilityTests/StringLexerTest.Peek (921 of 1976) PASS: lldb-shell :: SymbolFile/DWARF/win-i386-line-table.s (922 of 1976) PASS: lldb-unit :: Language/Highlighting/./HighlighterTests/HighlighterTest.HighlighterSelectionType (923 of 1976) PASS: lldb-unit :: Process/minidump/./LLDBMinidumpTests/MinidumpParserTest.GetThreadContext_x86_64 (924 of 1976) PASS: lldb-api :: functionalities/breakpoint/scripted_bkpt/TestScriptedResolver.py (925 of 1976) PASS: lldb-unit :: Utility/./UtilityTests/StringListTest.CopyList (926 of 1976) PASS: lldb-api :: lang/objc/objc-stepping/TestObjCStepping.py (927 of 1976) PASS: lldb-unit :: Symbol/./SymbolTests/SymbolsTest.TerminateLocateExecutableSymbolFileForUnknownExecutableAndUnknownSymbolFile (928 of 1976) PASS: lldb-shell :: Settings/TestDisassemblyFormat.test (929 of 1976) PASS: lldb-unit :: Process/gdb-remote/./ProcessGdbRemoteTests/GDBRemoteClientBaseTest.SendContinueDelegateStructuredDataReceipt (930 of 1976) UNSUPPORTED: lldb-api :: tools/lldb-server/platform-process-connect/TestPlatformProcessConnect.py (931 of 1976) PASS: lldb-unit :: Utility/./UtilityTests/OptionsWithRawTest.WhitespaceInput (932 of 1976) PASS: lldb-api :: commands/expression/issue_11588/Test11588.py (933 of 1976) PASS: lldb-unit :: Symbol/./SymbolTests/TestTypeSystemClang.TestGetEnumIntegerTypeUnexpectedType (934 of 1976) PASS: lldb-unit :: Host/./HostTests/SocketAddressTest.Set (935 of 1976) PASS: lldb-unit :: Utility/./UtilityTests/ArgsTest.ReplaceArgumentAtIndexFarOutOfRange (936 of 1976) PASS: lldb-unit :: debugserver/./debugserverTests/JSON.Parse (937 of 1976) PASS: lldb-unit :: tools/lldb-server/tests/./LLDBServerTests/StandardStartupTest.TestStopReplyContainsThreadPcs (938 of 1976) PASS: lldb-api :: functionalities/breakpoint/move_nearest/TestMoveNearest.py (939 of 1976) PASS: lldb-shell :: ObjectFile/ELF/section-permissions.yaml (940 of 1976) PASS: lldb-api :: types/TestCharType.py (941 of 1976) PASS: lldb-shell :: Register/x86-64-ymm-read.test (942 of 1976) PASS: lldb-unit :: Utility/./UtilityTests/BinaryStreamTest.PutULEB128One (943 of 1976) PASS: lldb-shell :: Reproducer/TestDiscard.test (944 of 1976) PASS: lldb-unit :: UnwindAssembly/x86/./UnwindAssemblyx86Tests/Testx86AssemblyInspectionEngine.TestDisassemblyMidFunctionEpilogues (945 of 1976) PASS: lldb-unit :: Utility/./UtilityTests/StringExtractorTest.GetHexBytesAvail (946 of 1976) PASS: lldb-api :: tools/lldb-vscode/breakpoint/TestVSCode_setBreakpoints.py (947 of 1976) PASS: lldb-unit :: ObjectFile/Breakpad/./ObjectFileBreakpadTests/InfoRecord.parse (948 of 1976) PASS: lldb-shell :: ObjectFile/PECOFF/sections-names.yaml (949 of 1976) UNSUPPORTED: lldb-api :: benchmarks/expression/TestExpressionCmd.py (950 of 1976) PASS: lldb-api :: lang/objc/radar-9691614/TestObjCMethodReturningBOOL.py (951 of 1976) PASS: lldb-unit :: Utility/./UtilityTests/StringListTest.ForRange (952 of 1976) PASS: lldb-shell :: SymbolFile/DWARF/debug-types-basic.test (953 of 1976) PASS: lldb-api :: commands/expression/result_numbering/TestResultNumbering.py (954 of 1976) PASS: lldb-api :: functionalities/tail_call_frames/ambiguous_tail_call_seq2/TestAmbiguousTailCallSeq2.py (955 of 1976) PASS: lldb-unit :: Utility/./UtilityTests/ArgsTest.ReplaceArgumentAtIndexEqual (956 of 1976) PASS: lldb-api :: lang/objc/objc-new-syntax/TestObjCNewSyntaxLiteral.py (957 of 1976) PASS: lldb-api :: lang/cpp/dynamic-value/TestCppValueCast.py (958 of 1976) PASS: lldb-unit :: Utility/./UtilityTests/StringListTest.GetMaxStringLengthIncreasingSize (959 of 1976) PASS: lldb-api :: functionalities/multiword-commands/TestMultiWordCommands.py (960 of 1976) PASS: lldb-api :: commands/disassemble/basic/TestDisassembleBreakpoint.py (961 of 1976) PASS: lldb-unit :: Utility/./UtilityTests/StreamTest.AddressRangeEmptyRange (962 of 1976) PASS: lldb-unit :: Utility/./UtilityTests/RegularExpression.Valid (963 of 1976) UNSUPPORTED: lldb-api :: iohandler/completion/TestIOHandlerCompletion.py (964 of 1976) PASS: lldb-unit :: ObjectFile/Breakpad/./ObjectFileBreakpadTests/FuncRecord.parse (965 of 1976) PASS: lldb-api :: functionalities/breakpoint/breakpoint_ids/TestBreakpointIDs.py (966 of 1976) PASS: lldb-unit :: UnwindAssembly/x86/./UnwindAssemblyx86Tests/Testx86AssemblyInspectionEngine.TestSubRSP (967 of 1976) PASS: lldb-api :: commands/expression/fixits/TestFixIts.py (968 of 1976) UNSUPPORTED: lldb-api :: functionalities/breakpoint/breakpoint_in_delayslot/TestAvoidBreakpointInDelaySlot.py (969 of 1976) PASS: lldb-unit :: UnwindAssembly/x86/./UnwindAssemblyx86Tests/Testx86AssemblyInspectionEngine.TestPush0 (970 of 1976) PASS: lldb-unit :: Utility/./UtilityTests/OptionsWithRawTest.QuotedSuffix (971 of 1976) PASS: lldb-api :: functionalities/postmortem/netbsd-core/TestNetBSDCore.py (972 of 1976) PASS: lldb-unit :: UnwindAssembly/x86/./UnwindAssemblyx86Tests/Testx86AssemblyInspectionEngine.TestLEAVE (973 of 1976) PASS: lldb-api :: functionalities/breakpoint/address_breakpoints/TestAddressBreakpoints.py (974 of 1976) PASS: lldb-shell :: ObjectFile/MachO/symtab.yaml (975 of 1976) PASS: lldb-shell :: Reproducer/TestDump.test (976 of 1976) PASS: lldb-unit :: Host/./HostTests/TaskPoolTest.RunTasks (977 of 1976) PASS: lldb-api :: commands/process/launch/TestProcessLaunch.py (978 of 1976) PASS: lldb-unit :: UnwindAssembly/x86/./UnwindAssemblyx86Tests/Testx86AssemblyInspectionEngine.Test32bitFramelessBigStackFrame (979 of 1976) PASS: lldb-api :: functionalities/thread/concurrent_events/TestConcurrentTwoBreakpointsOneWatchpoint.py (980 of 1976) PASS: lldb-api :: tools/lldb-server/register-reading/TestGdbRemoteGPacket.py (981 of 1976) PASS: lldb-api :: commands/expression/function_template_specialization_temp_args/TestFunctionTemplateSpecializationTempArgs.py (982 of 1976) UNSUPPORTED: lldb-api :: linux/thread/create_during_instruction_step/TestCreateDuringInstructionStep.py (983 of 1976) PASS: lldb-unit :: Host/./HostTests/SocketTest.UDPConnect (984 of 1976) UNSUPPORTED: lldb-shell :: Register/x86-64-ymm16-write.test (985 of 1976) PASS: lldb-unit :: Signals/./SignalsTests/UnixSignalsTest.GetFilteredSignals (986 of 1976) UNSUPPORTED: lldb-shell :: Register/x86-ymm-write.test (987 of 1976) PASS: lldb-api :: functionalities/memory/read/TestMemoryRead.py (988 of 1976) PASS: lldb-unit :: ScriptInterpreter/Python/./ScriptInterpreterPythonTests/PythonDataObjectsTest.TestPythonDictionaryToStructuredDictionary (989 of 1976) UNSUPPORTED: lldb-api :: functionalities/darwin_log/filter/regex/category/TestDarwinLogFilterRegexCategory.py (990 of 1976) PASS: lldb-api :: python_api/formatters/TestFormattersSBAPI.py (991 of 1976) PASS: lldb-unit :: SymbolFile/NativePDB/./SymbolFileNativePDBTests/PDBFPOProgramToDWARFExpressionTests.SingleAssignmentRegisterRef (992 of 1976) PASS: lldb-api :: types/TestLongTypes.py (993 of 1976) PASS: lldb-api :: commands/target/create-no-such-arch/TestNoSuchArch.py (994 of 1976) PASS: lldb-api :: functionalities/data-formatter/data-formatter-synthval/TestDataFormatterSynthVal.py (995 of 1976) UNSUPPORTED: lldb-api :: linux/mix-dwo-and-regular-objects/TestMixedDwarfBinary.py (996 of 1976) PASS: lldb-shell :: Reproducer/TestGDBRemoteRepro.test (997 of 1976) PASS: lldb-api :: functionalities/data-formatter/data-formatter-objc/TestDataFormatterObjCExpr.py (998 of 1976) UNSUPPORTED: lldb-shell :: Register/x86-64-ymm16-read.test (999 of 1976) PASS: lldb-unit :: Utility/./UtilityTests/StringExtractorTest.GetHexU8_Underflow_NoEof (1000 of 1976) PASS: lldb-shell :: Reproducer/Functionalities/TestImageList.test (1001 of 1976) PASS: lldb-api :: commands/watchpoints/watchpoint_size/TestWatchpointSizes.py (1002 of 1976) PASS: lldb-api :: commands/breakpoint/command/list/TestBreakpointCommandList.py (1003 of 1976) PASS: lldb-api :: lang/cpp/gmodules/TestWithModuleDebugging.py (1004 of 1976) UNSUPPORTED: lldb-api :: functionalities/tsan/multiple/TestTsanMultiple.py (1005 of 1976) PASS: lldb-shell :: Driver/TestProcessAttach.test (1006 of 1976) PASS: lldb-unit :: SymbolFile/NativePDB/./SymbolFileNativePDBTests/PDBFPOProgramToDWARFExpressionTests.MissingTargetRegister (1007 of 1976) PASS: lldb-api :: lang/objc/foundation/TestObjCMethods2.py (1008 of 1976) PASS: lldb-unit :: UnwindAssembly/x86/./UnwindAssemblyx86Tests/Testx86AssemblyInspectionEngine.TestSimple32bitFrameFunction (1009 of 1976) PASS: lldb-unit :: Utility/./UtilityTests/StreamTeeTest.Constructor1Stream (1010 of 1976) PASS: lldb-unit :: Utility/./UtilityTests/VMRange.CollectionContains (1011 of 1976) PASS: lldb-shell :: SymbolFile/DWARF/debug_loc-aslr.s (1012 of 1976) PASS: lldb-api :: lang/cpp/thread_local/TestThreadLocal.py (1013 of 1976) PASS: lldb-api :: functionalities/breakpoint/breakpoint_conditions/TestBreakpointConditions.py (1014 of 1976) PASS: lldb-shell :: SymbolFile/DWARF/forward-declarations.s (1015 of 1976) PASS: lldb-unit :: Utility/./UtilityTests/ArchSpecTest.TripleComponentsWereSpecified (1016 of 1976) PASS: lldb-api :: tools/lldb-server/TestGdbRemoteAttach.py (1017 of 1976) PASS: lldb-api :: lang/cpp/dynamic-value/TestDynamicValue.py (1018 of 1976) PASS: lldb-unit :: Utility/./UtilityTests/BinaryStreamTest.PutULEB128Zero (1019 of 1976) PASS: lldb-shell :: Minidump/dump-all.test (1020 of 1976) PASS: lldb-api :: functionalities/data-formatter/data-formatter-stl/libcxx/vector/TestDataFormatterLibcxxVector.py (1021 of 1976) PASS: lldb-api :: commands/expression/import-std-module/vector-of-vectors/TestVectorOfVectorsFromStdModule.py (1022 of 1976) PASS: lldb-unit :: Process/gdb-remote/./ProcessGdbRemoteTests/GDBRemoteClientBaseTest.SendContinueAndInterrupt2PacketBug (1023 of 1976) PASS: lldb-unit :: Utility/./UtilityTests/OptionsWithRawTest.SingleWordSuffix (1024 of 1976) PASS: lldb-unit :: Symbol/./SymbolTests/PostfixExpression.ParseOneExpression (1025 of 1976) PASS: lldb-unit :: Target/./TargetTests/ModuleCacheTest.GetAndPutStrangeHostname (1026 of 1976) UNSUPPORTED: lldb-shell :: Register/x86-ymm-read.test (1027 of 1976) PASS: lldb-api :: functionalities/postmortem/mach-core/TestMachCore.py (1028 of 1976) PASS: lldb-unit :: ScriptInterpreter/Python/./ScriptInterpreterPythonTests/PythonDataObjectsTest.TestScript (1029 of 1976) PASS: lldb-api :: python_api/module_section/TestModuleAndSection.py (1030 of 1976) PASS: lldb-unit :: ScriptInterpreter/Python/./ScriptInterpreterPythonTests/PythonDataObjectsTest.TestPythonCallableCheck (1031 of 1976) PASS: lldb-shell :: Reproducer/Functionalities/TestDataFormatter.test (1032 of 1976) PASS: lldb-unit :: Expression/./ExpressionTests/ClangExpressionDeclMapTest.TestUnknownIdentifierLookup (1033 of 1976) PASS: lldb-unit :: Utility/./UtilityTests/CompletionRequest.TryCompleteCurrentArgBad (1034 of 1976) PASS: lldb-unit :: Expression/./ExpressionTests/DiagnosticManagerTest.AppendMessageAttachToLastDiag (1035 of 1976) PASS: lldb-unit :: Utility/./UtilityTests/StreamTest.PutULEB128 (1036 of 1976) PASS: lldb-unit :: Utility/./UtilityTests/ArgsTest.StringListConstructor (1037 of 1976) PASS: lldb-unit :: Utility/./UtilityTests/OptionsWithRawTest.WhitespaceSuffix (1038 of 1976) PASS: lldb-api :: commands/expression/formatters/TestFormatters.py (1039 of 1976) PASS: lldb-unit :: ObjectFile/Breakpad/./ObjectFileBreakpadTests/StackCFIRecord.parse (1040 of 1976) PASS: lldb-shell :: Settings/TestSettingsSet.test (1041 of 1976) PASS: lldb-api :: driver/batch_mode/TestBatchMode.py (1042 of 1976) PASS: lldb-api :: functionalities/data-formatter/data-formatter-stl/libstdcpp/unique_ptr/invalid/TestDataFormatterInvalidStdUniquePtr.py (1043 of 1976) PASS: lldb-unit :: Utility/./UtilityTests/StateTest.Formatv (1044 of 1976) PASS: lldb-api :: commands/expression/import-std-module/weak_ptr/TestWeakPtrFromStdModule.py (1045 of 1976) PASS: lldb-unit :: Utility/./UtilityTests/StringExtractorTest.GetHexU8_Exact_NoEof (1046 of 1976) PASS: lldb-api :: functionalities/backticks/TestBackticksWithoutATarget.py (1047 of 1976) PASS: lldb-unit :: Utility/./UtilityTests/StreamTest.AddressRangeInvalidRange (1048 of 1976) PASS: lldb-unit :: Process/gdb-remote/./ProcessGdbRemoteTests/GDBRemoteCommunicationClientTest.SendSignalsToIgnore (1049 of 1976) PASS: lldb-api :: functionalities/thread/thread_exit/TestThreadExit.py (1050 of 1976) PASS: lldb-unit :: Utility/./UtilityTests/BinaryStreamTest.PutSLEB128OneByte (1051 of 1976) PASS: lldb-unit :: ScriptInterpreter/Python/./ScriptInterpreterPythonTests/PythonDataObjectsTest.TestPythonTupleToStructuredList (1052 of 1976) PASS: lldb-api :: lang/c/set_values/TestSetValues.py (1053 of 1976) PASS: lldb-api :: lang/c/stepping/TestThreadStepping.py (1054 of 1976) PASS: lldb-unit :: Utility/./UtilityTests/CompletionRequest.ShiftArguments (1055 of 1976) PASS: lldb-unit :: Utility/./UtilityTests/FileSpecTest.EqualDotsPosix (1056 of 1976) PASS: lldb-unit :: Utility/./UtilityTests/CompletionRequest.DuplicateFiltering (1057 of 1976) PASS: lldb-api :: functionalities/unwind/noreturn/TestNoreturnUnwind.py (1058 of 1976) PASS: lldb-unit :: Utility/./UtilityTests/StringListTest.JoinEmpty (1059 of 1976) PASS: lldb-unit :: Utility/./UtilityTests/RangeDataVector.FindEntryThatContains_Overlap (1060 of 1976) UNSUPPORTED: lldb-api :: lang/cpp/static_members/TestCPPStaticMembers.py (1061 of 1976) PASS: lldb-unit :: Utility/./UtilityTests/Flags.Test (1062 of 1976) PASS: lldb-api :: lang/cpp/gmodules-templates/TestGModules.py (1063 of 1976) PASS: lldb-unit :: Utility/./UtilityTests/ArgsTest.GetQuotedCommandString (1064 of 1976) PASS: lldb-unit :: Utility/./UtilityTests/StringExtractorTest.DecodeHexU8_InvalidHex (1065 of 1976) PASS: lldb-api :: tools/lldb-server/TestGdbRemoteKill.py (1066 of 1976) PASS: lldb-unit :: Utility/./UtilityTests/BinaryStreamTest.PutSLEB128Zero (1067 of 1976) PASS: lldb-unit :: Signals/./SignalsTests/UnixSignalsTest.GetInfo (1068 of 1976) PASS: lldb-unit :: Process/gdb-remote/./ProcessGdbRemoteTests/GDBRemoteClientBaseTest.SendContinueDelegateInterface (1069 of 1976) PASS: lldb-api :: functionalities/data-formatter/data-formatter-ptr-to-array/TestPtrToArrayFormatting.py (1070 of 1976) UNSUPPORTED: lldb-shell :: Register/x86-64-zmm-read.test (1071 of 1976) PASS: lldb-unit :: Utility/./UtilityTests/ScalarTest.ExtractBitfield (1072 of 1976) PASS: lldb-api :: functionalities/data-formatter/parray/TestPrintArray.py (1073 of 1976) PASS: lldb-unit :: Utility/./UtilityTests/VMRange.ContainsAddr (1074 of 1976) PASS: lldb-unit :: Utility/./UtilityTests/RangeTest.ClearWithStarAddress (1075 of 1976) PASS: lldb-api :: functionalities/step-avoids-no-debug/TestStepNoDebug.py (1076 of 1976) PASS: lldb-shell :: Breakpoint/debug_rnglist_rlestartend.test (1077 of 1976) PASS: lldb-unit :: SymbolFile/NativePDB/./SymbolFileNativePDBTests/PDBFPOProgramToDWARFExpressionTests.UnresolvedRegisterAssignmentReference (1078 of 1976) PASS: lldb-unit :: Utility/./UtilityTests/StringLexerTest.NextIf (1079 of 1976) PASS: lldb-api :: macosx/add-dsym/TestAddDsymMidExecutionCommand.py (1080 of 1976) PASS: lldb-unit :: UnwindAssembly/x86/./UnwindAssemblyx86Tests/Testx86AssemblyInspectionEngine.TestPushR14 (1081 of 1976) PASS: lldb-unit :: Utility/./UtilityTests/StringListTest.PopBack (1082 of 1976) PASS: lldb-unit :: Process/gdb-remote/./ProcessGdbRemoteTests/GDBRemoteCommunicationClientTest.GetModulesInfoInvalidResponse (1083 of 1976) PASS: lldb-unit :: Expression/./ExpressionTests/DWARFExpression.DW_OP_piece (1084 of 1976) PASS: lldb-api :: lang/objc/objc-class-method/TestObjCClassMethod.py (1085 of 1976) PASS: lldb-api :: commands/frame/recognizer/TestFrameRecognizer.py (1086 of 1976) PASS: lldb-unit :: Utility/./UtilityTests/StreamTest.PutMaxHex64ByteOrderBig (1087 of 1976) UNSUPPORTED: lldb-shell :: Breakpoint/case-insensitive.test (1088 of 1976) PASS: lldb-api :: lang/objc/variadic_methods/TestVariadicMethods.py (1089 of 1976) PASS: lldb-shell :: SymbolFile/DWARF/DW_OP_piece-struct.s (1090 of 1976) PASS: lldb-shell :: ObjectFile/ELF/netbsd-core-amd64.test (1091 of 1976) UNSUPPORTED: lldb-api :: functionalities/gdb_remote_client/TestWasm.py (1092 of 1976) PASS: lldb-unit :: Utility/./UtilityTests/UriParserTest.Empty (1093 of 1976) PASS: lldb-api :: commands/help/TestHelp.py (1094 of 1976) PASS: lldb-shell :: Quit/TestQuitExitCodeHex0.test (1095 of 1976) PASS: lldb-shell :: ObjectFile/ELF/basic-info.yaml (1096 of 1976) PASS: lldb-api :: lang/objc/objc-static-method-stripped/TestObjCStaticMethodStripped.py (1097 of 1976) PASS: lldb-unit :: Utility/./UtilityTests/RecordReplayTest.InstrumentedFoo (1098 of 1976) PASS: lldb-shell :: SymbolFile/DWARF/debug_loclists-dwo.s (1099 of 1976) PASS: lldb-unit :: ScriptInterpreter/Python/./ScriptInterpreterPythonTests/PythonDataObjectsTest.TestPythonStringToStructuredString (1100 of 1976) PASS: lldb-shell :: Minidump/Windows/broken-unwind.test (1101 of 1976) PASS: lldb-unit :: Process/gdb-remote/./ProcessGdbRemoteTests/GDBRemoteCommunicationClientTest.GetQOffsets (1102 of 1976) PASS: lldb-unit :: Utility/./UtilityTests/FileSpecTest.Equal (1103 of 1976) PASS: lldb-unit :: Utility/./UtilityTests/RangeTest.SlideZero (1104 of 1976) PASS: lldb-api :: tools/lldb-server/TestLldbGdbServer.py (1105 of 1976) PASS: lldb-unit :: Utility/./UtilityTests/DataExtractorTest.GetMaxU64_unchecked (1106 of 1976) PASS: lldb-unit :: Utility/./UtilityTests/UriParserTest.BracketedHostnameWithPortIPv6 (1107 of 1976) PASS: lldb-unit :: Utility/./UtilityTests/DataExtractorTest.GetCStrAtEnd (1108 of 1976) PASS: lldb-shell :: Watchpoint/SetErrorCases.test (1109 of 1976) PASS: lldb-unit :: Expression/./ExpressionTests/CppModuleConfigurationTest.AmbiguousCLib (1110 of 1976) PASS: lldb-unit :: Host/./HostTests/FileSystemTest.Readable (1111 of 1976) PASS: lldb-shell :: SymbolFile/DWARF/debug-types-dwarf5.s (1112 of 1976) PASS: lldb-unit :: Utility/./UtilityTests/ProcessInstanceInfo.DumpTable (1113 of 1976) PASS: lldb-unit :: Host/./HostTests/FileSystemTest.Exists (1114 of 1976) PASS: lldb-api :: commands/expression/call-function/TestCallUserDefinedFunction.py (1115 of 1976) PASS: lldb-unit :: Utility/./UtilityTests/ProcessInstanceInfo.Yaml (1116 of 1976) PASS: lldb-unit :: SymbolFile/NativePDB/./SymbolFileNativePDBTests/PDBFPOProgramToDWARFExpressionTests.UnsupportedRASearch (1117 of 1976) PASS: lldb-api :: python_api/file_handle/TestFileHandle.py (1118 of 1976) PASS: lldb-api :: functionalities/data-formatter/synthcapping/TestSyntheticCapping.py (1119 of 1976) PASS: lldb-unit :: Utility/./UtilityTests/ScalarTest.ComparisonFloat (1120 of 1976) PASS: lldb-shell :: Register/x86-64-gp-read.test (1121 of 1976) PASS: lldb-api :: functionalities/data-formatter/ptr_ref_typedef/TestPtrRef2Typedef.py (1122 of 1976) PASS: lldb-api :: functionalities/data-formatter/user-format-vs-summary/TestUserFormatVsSummary.py (1123 of 1976) PASS: lldb-unit :: Utility/./UtilityTests/RangeTest.ContainsAddr (1124 of 1976) PASS: lldb-unit :: Utility/./UtilityTests/RangeDataVector.FindEntryIndexesThatContain_Overlap (1125 of 1976) PASS: lldb-unit :: Utility/./UtilityTests/BinaryStreamTest.PutULEB128OneByte (1126 of 1976) PASS: lldb-unit :: ScriptInterpreter/Python/./ScriptInterpreterPythonTests/PythonDataObjectsTest.TestCallable (1127 of 1976) PASS: lldb-api :: functionalities/gdb_remote_client/TestGDBRemoteClient.py (1128 of 1976) PASS: lldb-api :: python_api/breakpoint/TestBreakpointAPI.py (1129 of 1976) PASS: lldb-shell :: Breakpoint/case-sensitive.test (1130 of 1976) PASS: lldb-api :: functionalities/thread/concurrent_events/TestConcurrentCrashWithSignal.py (1131 of 1976) PASS: lldb-api :: commands/process/attach/TestProcessAttach.py (1132 of 1976) PASS: lldb-api :: commands/watchpoints/multiple_threads/TestWatchpointMultipleThreads.py (1133 of 1976) PASS: lldb-shell :: Driver/LocalLLDBInit.test (1134 of 1976) PASS: lldb-unit :: Utility/./UtilityTests/ArchSpecTest.OperatorBool (1135 of 1976) PASS: lldb-unit :: Utility/./UtilityTests/StringListTest.JoinSingle (1136 of 1976) PASS: lldb-api :: functionalities/thread/concurrent_events/TestConcurrentDelayedCrashWithBreakpointWatchpoint.py (1137 of 1976) PASS: lldb-api :: lang/cpp/nsimport/TestCppNsImport.py (1138 of 1976) PASS: lldb-unit :: Utility/./UtilityTests/StreamTest.PutRawBytesToMixedEndian (1139 of 1976) PASS: lldb-unit :: Utility/./UtilityTests/ConstStringTest.YAML (1140 of 1976) PASS: lldb-shell :: Breakpoint/dummy-target.test (1141 of 1976) PASS: lldb-unit :: Platform/./LLDBPlatformTests/PlatformDarwinTest.GetSDKNameForType (1142 of 1976) PASS: lldb-unit :: Utility/./UtilityTests/StreamTest.AddressRange (1143 of 1976) PASS: lldb-shell :: ObjectFile/ELF/PT_LOAD-overlap.yaml (1144 of 1976) PASS: lldb-unit :: Utility/./UtilityTests/VASprintfTest.EncodingError (1145 of 1976) PASS: lldb-unit :: Utility/./UtilityTests/GeneratorTest.Create (1146 of 1976) PASS: lldb-shell :: SymbolFile/DWARF/gnu-style-compression.cpp (1147 of 1976) PASS: lldb-api :: commands/expression/radar_9531204/TestPrintfAfterUp.py (1148 of 1976) PASS: lldb-shell :: SymbolFile/NativePDB/ast-functions.cpp (1149 of 1976) PASS: lldb-unit :: Utility/./UtilityTests/StringListTest.GetMaxStringLengthEqualSize (1150 of 1976) PASS: lldb-shell :: SymbolFile/Breakpad/line-table.test (1151 of 1976) PASS: lldb-unit :: Utility/./UtilityTests/UriParserTest.MinimalPath (1152 of 1976) PASS: lldb-api :: lang/c/function_types/TestFunctionTypes.py (1153 of 1976) PASS: lldb-unit :: Utility/./UtilityTests/StringExtractorTest.GetU32BigEndian (1154 of 1976) PASS: lldb-shell :: SymbolFile/DWARF/debug_ranges-missing-section.s (1155 of 1976) UNSUPPORTED: lldb-api :: commands/expression/completion-crash-invalid-iterator/TestInvalidIteratorCompletionCrash.py (1156 of 1976) PASS: lldb-api :: tools/lldb-server/commandline/TestStubSetSID.py (1157 of 1976) PASS: lldb-api :: functionalities/data-formatter/data-formatter-advanced/TestDataFormatterAdv.py (1158 of 1976) PASS: lldb-api :: functionalities/thread/concurrent_events/TestConcurrentTwoBreakpointsOneDelaySignal.py (1159 of 1976) UNSUPPORTED: lldb-shell :: ScriptInterpreter/Lua/independent_state.test (1160 of 1976) PASS: lldb-unit :: Utility/./UtilityTests/EnvironmentTest.EnvpConstruction (1161 of 1976) PASS: lldb-unit :: Utility/./UtilityTests/RegularExpression.Invalid (1162 of 1976) PASS: lldb-unit :: Expression/./ExpressionTests/DiagnosticManagerTest.AppendMessageNoDiag (1163 of 1976) PASS: lldb-unit :: Process/minidump/./LLDBMinidumpTests/RegisterContextMinidump.ConvertMinidumpContext_x86_32 (1164 of 1976) PASS: lldb-api :: commands/expression/dollar-in-variable/TestDollarInVariable.py (1165 of 1976) PASS: lldb-api :: functionalities/data-formatter/data-formatter-objc/TestDataFormatterObjCNSError.py (1166 of 1976) PASS: lldb-api :: lang/cpp/virtual-functions/TestCppVirtualFunctions.py (1167 of 1976) PASS: lldb-unit :: Utility/./UtilityTests/RangeTest.ContainsRangeStartingFromZero (1168 of 1976) PASS: lldb-unit :: SymbolFile/NativePDB/./SymbolFileNativePDBTests/PDBFPOProgramToDWARFExpressionTests.DependencyChain (1169 of 1976) PASS: lldb-api :: commands/expression/ignore-artificial-constructors/TestIgnoreArtificialConstructors.py (1170 of 1976) PASS: lldb-unit :: Utility/./UtilityTests/ArgsTest.TestAppendArg (1171 of 1976) PASS: lldb-api :: commands/expression/context-object-objc/TestContextObjectObjc.py (1172 of 1976) PASS: lldb-unit :: Symbol/./SymbolTests/Type.CompilerContextPattern (1173 of 1976) PASS: lldb-unit :: Expression/./ExpressionTests/DiagnosticManagerTest.GetStringSeverityLabels (1174 of 1976) PASS: lldb-api :: functionalities/postmortem/wow64_minidump/TestWow64MiniDump.py (1175 of 1976) PASS: lldb-unit :: Utility/./UtilityTests/UriParserTest.TypicalPortPathIPv6 (1176 of 1976) PASS: lldb-unit :: Utility/./UtilityTests/StructuredDataTest.ParseJSONFromFile (1177 of 1976) PASS: lldb-api :: functionalities/gdb_remote_client/TestNoWatchpointSupportInfo.py (1178 of 1976) PASS: lldb-shell :: SymbolFile/DWARF/find-basic-type.cpp (1179 of 1976) PASS: lldb-api :: macosx/version_zero/TestGetVersionZeroVersion.py (1180 of 1976) PASS: lldb-unit :: Language/Highlighting/./HighlighterTests/HighlighterTest.ClangScalarLiterals (1181 of 1976) PASS: lldb-unit :: UnwindAssembly/x86/./UnwindAssemblyx86Tests/Testx86AssemblyInspectionEngine.TestStackRealign32BitDisp_x86_64 (1182 of 1976) PASS: lldb-shell :: Quit/TestQuitExitCodeNonInt.test (1183 of 1976) PASS: lldb-api :: functionalities/rerun/TestRerun.py (1184 of 1976) PASS: lldb-api :: lang/cpp/namespace_conflicts/TestNamespaceConflicts.py (1185 of 1976) PASS: lldb-unit :: Utility/./UtilityTests/StreamTest.PutHex32ByteOrderLittle (1186 of 1976) PASS: lldb-unit :: Utility/./UtilityTests/RecordReplayTest.InstrumentedBarRef (1187 of 1976) PASS: lldb-unit :: Language/CPlusPlus/./LanguageCPlusPlusTests/CPlusPlusLanguage.MethodNameParsing (1188 of 1976) PASS: lldb-unit :: Language/Highlighting/./HighlighterTests/HighlighterTest.ClangTrailingBackslashWithWhitespace (1189 of 1976) PASS: lldb-api :: functionalities/thread/concurrent_events/TestConcurrentDelaySignalBreak.py (1190 of 1976) PASS: lldb-unit :: Utility/./UtilityTests/ReproducerTest.SetCapture (1191 of 1976) PASS: lldb-api :: lang/cpp/llvm-style/TestLLVMStyle.py (1192 of 1976) PASS: lldb-unit :: Utility/./UtilityTests/StreamTest.AddressPrefixAndSuffix (1193 of 1976) PASS: lldb-unit :: Utility/./UtilityTests/FileSpecTest.EqualSeparator (1194 of 1976) PASS: lldb-api :: python_api/lldbutil/TestSwigVersion.py (1195 of 1976) PASS: lldb-unit :: Language/Highlighting/./HighlighterTests/HighlighterTest.ClangIdentifiers (1196 of 1976) PASS: lldb-unit :: Utility/./UtilityTests/StringExtractorTest.GetU64BigEndian (1197 of 1976) PASS: lldb-api :: functionalities/tail_call_frames/thread_step_out_message/TestArtificialFrameStepOutMessage.py (1198 of 1976) PASS: lldb-shell :: ObjectFile/ELF/base-address.yaml (1199 of 1976) PASS: lldb-api :: commands/expression/expr-in-syscall/TestExpressionInSyscall.py (1200 of 1976) PASS: lldb-unit :: Utility/./UtilityTests/StringListTest.InsertStringAtIndexMove (1201 of 1976) PASS: lldb-api :: lang/cpp/namespace_definitions/TestNamespaceDefinitions.py (1202 of 1976) PASS: lldb-api :: commands/expression/import-std-module/forward_list/TestForwardListFromStdModule.py (1203 of 1976) PASS: lldb-api :: functionalities/thread/concurrent_events/TestConcurrentSignalDelayWatch.py (1204 of 1976) UNSUPPORTED: lldb-shell :: Register/x86-64-xmm16-read.test (1205 of 1976) PASS: lldb-shell :: ObjectFile/MachO/lc_version_min.yaml (1206 of 1976) PASS: lldb-unit :: Utility/./UtilityTests/UriParserTest.BracketedHostnameWithColon (1207 of 1976) PASS: lldb-unit :: Host/./HostTests/NativeProcessProtocolTest.SetBreakpoint (1208 of 1976) PASS: lldb-api :: functionalities/thread/concurrent_events/TestConcurrentManyCrash.py (1209 of 1976) PASS: lldb-api :: commands/expression/unicode-in-variable/TestUnicodeInVariable.py (1210 of 1976) PASS: lldb-api :: types/TestShortType.py (1211 of 1976) UNSUPPORTED: lldb-api :: commands/register/register/intel_xtended_registers/mpx_offset_intersection/TestMPXOffsetIntersection.py (1212 of 1976) PASS: lldb-unit :: Language/Highlighting/./HighlighterTests/HighlighterTest.DefaultHighlighterWithCursorOutOfBounds (1213 of 1976) PASS: lldb-unit :: Utility/./UtilityTests/ScalarTest.Promotion (1214 of 1976) PASS: lldb-unit :: Expression/./ExpressionTests/DiagnosticManagerTest.PutStringSeverities (1215 of 1976) PASS: lldb-shell :: SymbolFile/DWARF/compilercontext.ll (1216 of 1976) PASS: lldb-unit :: UnwindAssembly/x86/./UnwindAssemblyx86Tests/Testx86AssemblyInspectionEngine.Test64bitFramelessBigStackFrame (1217 of 1976) PASS: lldb-shell :: ObjectFile/ELF/short-build-id.yaml (1218 of 1976) PASS: lldb-api :: commands/expression/char/TestExprsChar.py (1219 of 1976) PASS: lldb-unit :: Target/./TargetTests/ExecutionContextTest.GetByteOrderProcess (1220 of 1976) PASS: lldb-unit :: Utility/./UtilityTests/VMRange.Ordering (1221 of 1976) PASS: lldb-api :: lang/cpp/class_types/TestClassTypesDisassembly.py (1222 of 1976) PASS: lldb-api :: lang/objc/single-entry-dictionary/TestObjCSingleEntryDictionary.py (1223 of 1976) PASS: lldb-shell :: SymbolFile/NativePDB/break-by-line.cpp (1224 of 1976) PASS: lldb-api :: functionalities/thread/crash_during_step/TestCrashDuringStep.py (1225 of 1976) PASS: lldb-shell :: SymbolFile/DWARF/dir-separator-windows.s (1226 of 1976) PASS: lldb-unit :: Host/./HostTests/NativeProcessProtocolTest.ReadCStringFromMemory_CrossPageBoundary (1227 of 1976) PASS: lldb-api :: python_api/watchpoint/TestWatchpointIter.py (1228 of 1976) PASS: lldb-shell :: Reproducer/TestRelativePath.test (1229 of 1976) PASS: lldb-api :: functionalities/gdb_remote_client/TestStopPCs.py (1230 of 1976) PASS: lldb-unit :: Process/minidump/./LLDBMinidumpTests/MinidumpParserTest.GetMemory (1231 of 1976) PASS: lldb-unit :: Symbol/./SymbolTests/TestTypeSystemClang.TestGetEnumIntegerTypeInvalid (1232 of 1976) PASS: lldb-unit :: Process/minidump/./LLDBMinidumpTests/RegisterContextMinidump.CheckRegisterContextMinidump_ARM (1233 of 1976) PASS: lldb-unit :: Utility/./UtilityTests/AnsiTerminal.AtStart (1234 of 1976) PASS: lldb-unit :: Utility/./UtilityTests/FileSpecTest.Yaml (1235 of 1976) PASS: lldb-unit :: Utility/./UtilityTests/ScalarTest.SetValueFromCString (1236 of 1976) PASS: lldb-unit :: Host/./HostTests/SocketTest.DecodeHostAndPort (1237 of 1976) PASS: lldb-api :: types/TestFloatTypes.py (1238 of 1976) PASS: lldb-unit :: Utility/./UtilityTests/StreamTest.AddressSuffix (1239 of 1976) PASS: lldb-shell :: SymbolFile/DWARF/debug-types-dwo-cross-reference.cpp (1240 of 1976) PASS: lldb-shell :: SymbolFile/NativePDB/function-types-classes.cpp (1241 of 1976) PASS: lldb-api :: functionalities/thread/concurrent_events/TestConcurrentCrashWithWatchpoint.py (1242 of 1976) PASS: lldb-unit :: Utility/./UtilityTests/LogChannelTest.EnableOptions (1243 of 1976) PASS: lldb-api :: commands/command/source/TestCommandSource.py (1244 of 1976) PASS: lldb-shell :: Quit/TestQuitExitCode0.test (1245 of 1976) PASS: lldb-unit :: Symbol/./SymbolTests/TestTypeSystemClang.TestNotDeletingUserCopyCstrDueToMoveCStr (1246 of 1976) PASS: lldb-api :: lang/cpp/exceptions/TestCPPExceptionBreakpoints.py (1247 of 1976) PASS: lldb-api :: tools/lldb-server/TestAppleSimulatorOSType.py (1248 of 1976) UNSUPPORTED: lldb-shell :: Register/x86-64-zmm-write.test (1249 of 1976) PASS: lldb-unit :: ObjectFile/PECOFF/./ObjectFilePECOFFTests/PECallFrameInfoTest.Chained_eh (1250 of 1976) PASS: lldb-unit :: Symbol/./SymbolTests/TestClangASTImporter.DeportDeclTagDecl (1251 of 1976) PASS: lldb-unit :: Process/minidump/./LLDBMinidumpTests/MinidumpParserTest.GetMiscInfo_no_stream (1252 of 1976) PASS: lldb-api :: lang/cpp/bool/TestCPPBool.py (1253 of 1976) PASS: lldb-unit :: Utility/./UtilityTests/LogChannelTest.Disable (1254 of 1976) PASS: lldb-api :: lang/objc/objc-runtime-ivars/TestRuntimeIvars.py (1255 of 1976) PASS: lldb-unit :: Utility/./UtilityTests/ArchSpecTest.MergeFrom (1256 of 1976) PASS: lldb-unit :: Host/./HostTests/SocketTest.UDPGetConnectURI (1257 of 1976) PASS: lldb-shell :: Commands/command-regex-delete.test (1258 of 1976) PASS: lldb-unit :: Utility/./UtilityTests/StreamTest.PutCString (1259 of 1976) PASS: lldb-api :: functionalities/breakpoint/source_regexp/TestSourceRegexBreakpoints.py (1260 of 1976) PASS: lldb-api :: commands/expression/import-std-module/vector-dbg-info-content/TestDbgInfoContentVectorFromStdModule.py (1261 of 1976) PASS: lldb-unit :: Utility/./UtilityTests/StringExtractorTest.DecodeHexU8_Underflow2 (1262 of 1976) PASS: lldb-api :: macosx/thread_suspend/TestInternalThreadSuspension.py (1263 of 1976) PASS: lldb-api :: python_api/frame/inlines/TestInlinedFrame.py (1264 of 1976) PASS: lldb-unit :: Utility/./UtilityTests/RegularExpression.Empty (1265 of 1976) PASS: lldb-unit :: Utility/./UtilityTests/BinaryStreamTest.PutULEB128TwoBytes (1266 of 1976) PASS: lldb-unit :: UnwindAssembly/x86/./UnwindAssemblyx86Tests/Testx86AssemblyInspectionEngine.TestPopESI (1267 of 1976) PASS: lldb-shell :: Minidump/no-process-id.yaml (1268 of 1976) PASS: lldb-unit :: SymbolFile/DWARF/./SymbolFileDWARFTests/SymbolFileDWARFTests.TestAbbrevInvalidNULLTag (1269 of 1976) PASS: lldb-api :: functionalities/data-formatter/data-formatter-python-synth/TestDataFormatterPythonSynth.py (1270 of 1976) UNSUPPORTED: lldb-api :: functionalities/breakpoint/breakpoint_callback_command_source/TestBreakpointCallbackCommandSource.py (1271 of 1976) PASS: lldb-api :: functionalities/thread/jump/TestThreadJump.py (1272 of 1976) PASS: lldb-api :: lang/cpp/limit-debug-info/TestWithLimitDebugInfo.py (1273 of 1976) PASS: lldb-unit :: Language/Highlighting/./HighlighterTests/HighlighterTest.ClangUnterminatedString (1274 of 1976) UNSUPPORTED: lldb-api :: functionalities/darwin_log/filter/regex/subsystem/TestDarwinLogFilterRegexSubsystem.py (1275 of 1976) PASS: lldb-unit :: Utility/./UtilityTests/FileSpecTest.EqualDotsPosixRoot (1276 of 1976) PASS: lldb-unit :: ObjectFile/Breakpad/./ObjectFileBreakpadTests/LineRecord.parse (1277 of 1976) PASS: lldb-api :: lang/c/blocks/TestBlocks.py (1278 of 1976) UNSUPPORTED: lldb-api :: commands/expression/call-restarts/TestCallThatRestarts.py (1279 of 1976) PASS: lldb-shell :: Commands/command-breakpoint-col.test (1280 of 1976) PASS: lldb-unit :: Process/gdb-remote/./ProcessGdbRemoteTests/GDBRemoteCommunicationClientTest.GetMemoryRegionInfoInvalidResponse (1281 of 1976) PASS: lldb-unit :: Utility/./UtilityTests/LogTest.Unregister (1282 of 1976) UNSUPPORTED: lldb-api :: benchmarks/stepping/TestSteppingSpeed.py (1283 of 1976) PASS: lldb-api :: lang/cpp/covariant-return-types/TestCovariantReturnTypes.py (1284 of 1976) PASS: lldb-unit :: DataFormatter/./LLDBFormatterTests/FormatManagerTests.CompatibleLangs (1285 of 1976) PASS: lldb-unit :: UnwindAssembly/x86/./UnwindAssemblyx86Tests/Testx86AssemblyInspectionEngine.TestDisassemblyJunkBytes (1286 of 1976) PASS: lldb-unit :: Utility/./UtilityTests/AnsiTerminal.Twice (1287 of 1976) UNSUPPORTED: lldb-api :: functionalities/asan/TestMemoryHistory.py (1288 of 1976) PASS: lldb-unit :: Symbol/./SymbolTests/LineEntryTest.GetSameLineContiguousAddressRangeOneInline (1289 of 1976) PASS: lldb-unit :: Target/./TargetTests/PathMappingListTest.AbsoluteTests (1290 of 1976) PASS: lldb-shell :: Commands/CommandScriptImmediateOutput/CommandScriptImmediateOutputConsole.test (1291 of 1976) PASS: lldb-api :: commands/expression/diagnostics/TestExprDiagnostics.py (1292 of 1976) UNSUPPORTED: lldb-api :: functionalities/ubsan/user-expression/TestUbsanUserExpression.py (1293 of 1976) PASS: lldb-shell :: Driver/TestFile.test (1294 of 1976) PASS: lldb-api :: commands/expression/import-std-module/forward_list-dbg-info-content/TestDbgInfoContentForwardListFromStdModule.py (1295 of 1976) PASS: lldb-unit :: Target/./TargetTests/ExecutionContextTest.GetByteOrderTarget (1296 of 1976) PASS: lldb-api :: lang/objc/objc-struct-return/TestObjCStructReturn.py (1297 of 1976) PASS: lldb-api :: macosx/universal/TestUniversal.py (1298 of 1976) PASS: lldb-api :: functionalities/data-formatter/typedef_array/TestTypedefArray.py (1299 of 1976) PASS: lldb-api :: commands/platform/process/list/TestProcessList.py (1300 of 1976) PASS: lldb-unit :: Utility/./UtilityTests/ConstStringTest.CompareConstString (1301 of 1976) PASS: lldb-api :: functionalities/data-formatter/data-formatter-objc/TestDataFormatterObjCPlain.py (1302 of 1976) PASS: lldb-unit :: Process/minidump/./LLDBMinidumpTests/MinidumpParserTest.GetMemoryRegionInfo (1303 of 1976) PASS: lldb-shell :: SymbolFile/DWARF/array-sizes.s (1304 of 1976) PASS: lldb-unit :: Core/./LLDBCoreTests/RichManglingContextTest.FromCxxMethodName (1305 of 1976) PASS: lldb-shell :: Driver/TestCommands.test (1306 of 1976) UNSUPPORTED: lldb-api :: lang/cpp/printf/TestPrintf.py (1307 of 1976) PASS: lldb-shell :: Reproducer/TestVersionCheck.test (1308 of 1976) PASS: lldb-unit :: Utility/./UtilityTests/ArchSpecTest.TestParseMachCPUDashSubtypeTripleSimple (1309 of 1976) PASS: lldb-unit :: Utility/./UtilityTests/NameMatchesTest.EndsWith (1310 of 1976) PASS: lldb-unit :: UnwindAssembly/x86/./UnwindAssemblyx86Tests/Testx86AssemblyInspectionEngine.TestPushEBP (1311 of 1976) UNSUPPORTED: lldb-api :: benchmarks/startup/TestStartupDelays.py (1312 of 1976) PASS: lldb-unit :: Symbol/./SymbolTests/TestClangASTImporter.CopyTypeTagDecl (1313 of 1976) PASS: lldb-api :: lang/c/stepping/TestStepAndBreakpoints.py (1314 of 1976) PASS: lldb-unit :: Utility/./UtilityTests/GeneratorTest.GetOrCreate (1315 of 1976) PASS: lldb-api :: lang/cpp/char1632_t/TestChar1632T.py (1316 of 1976) PASS: lldb-unit :: UnwindAssembly/x86/./UnwindAssemblyx86Tests/Testx86AssemblyInspectionEngine.TestPushExtended (1317 of 1976) PASS: lldb-unit :: ScriptInterpreter/Python/./ScriptInterpreterPythonTests/PythonDataObjectsTest.TestPythonTupleValues (1318 of 1976) PASS: lldb-unit :: Process/gdb-remote/./ProcessGdbRemoteTests/GDBRemoteClientBaseTest.SendContinueAndAsyncPacket (1319 of 1976) PASS: lldb-api :: commands/watchpoints/step_over_watchpoint/TestStepOverWatchpoint.py (1320 of 1976) PASS: lldb-api :: lang/objc/exceptions/TestObjCExceptions.py (1321 of 1976) PASS: lldb-unit :: Utility/./UtilityTests/BinaryStreamTest.PutSLEB128MaxValue (1322 of 1976) PASS: lldb-shell :: ObjectFile/PECOFF/export-dllfunc.yaml (1323 of 1976) PASS: lldb-shell :: Breakpoint/split-dwarf5-debug-stroffsets.test (1324 of 1976) PASS: lldb-unit :: Symbol/./SymbolTests/DWARFCallFrameInfoTest.Basic_dwarf4 (1325 of 1976) PASS: lldb-api :: lang/cpp/stl/TestStdCXXDisassembly.py (1326 of 1976) PASS: lldb-shell :: ObjectFile/wasm/unified-debug-sections.yaml (1327 of 1976) PASS: lldb-unit :: debugserver/./debugserverTests/RNBSocket.AnyListen (1328 of 1976) PASS: lldb-unit :: Utility/./UtilityTests/Flags.Reset (1329 of 1976) PASS: lldb-unit :: Language/Highlighting/./HighlighterTests/HighlighterTest.ClangTrailingBackslashBeforeNewline (1330 of 1976) PASS: lldb-api :: commands/process/launch-with-shellexpand/TestLaunchWithShellExpand.py (1331 of 1976) PASS: lldb-unit :: Utility/./UtilityTests/FileSpecTest.IsRelative (1332 of 1976) PASS: lldb-api :: commands/version/TestVersion.py (1333 of 1976) PASS: lldb-api :: lang/objc/objc-optimized/TestObjcOptimized.py (1334 of 1976) PASS: lldb-unit :: Utility/./UtilityTests/OptionsWithRawTest.SingleWhitespaceInput (1335 of 1976) PASS: lldb-api :: functionalities/postmortem/minidump-new/TestMiniDumpNew.py (1336 of 1976) PASS: lldb-shell :: ObjectFile/ELF/build-id-case.yaml (1337 of 1976) PASS: lldb-unit :: Utility/./UtilityTests/RangeTest.ContainsAddrInvalid (1338 of 1976) PASS: lldb-api :: lang/objc/foundation/TestObjCMethodsNSError.py (1339 of 1976) PASS: lldb-unit :: Host/./HostTests/FileSystemTest.GetPermissions (1340 of 1976) PASS: lldb-shell :: SymbolFile/DWARF/debug-line-basic.s (1341 of 1976) PASS: lldb-unit :: Utility/./UtilityTests/StringListTest.GetMaxStringLengthDecreasingSize (1342 of 1976) PASS: lldb-unit :: Utility/./UtilityTests/StringListTest.AppendStringCString (1343 of 1976) PASS: lldb-api :: tools/lldb-vscode/breakpoint/TestVSCode_setFunctionBreakpoints.py (1344 of 1976) PASS: lldb-api :: functionalities/data-formatter/data-formatter-objc/TestDataFormatterObjCCF.py (1345 of 1976) PASS: lldb-api :: functionalities/breakpoint/serialize/TestBreakpointSerialization.py (1346 of 1976) PASS: lldb-unit :: Language/Highlighting/./HighlighterTests/HighlighterTest.ClangCursorPosBeforeOtherToken (1347 of 1976) PASS: lldb-shell :: SymbolFile/DWARF/dwp-debug-types.s (1348 of 1976) UNSUPPORTED: lldb-shell :: BuildScript/toolchain-clang-cl.test (1349 of 1976) PASS: lldb-shell :: Commands/command-script-import.test (1350 of 1976) PASS: lldb-shell :: Minidump/fb-dump.test (1351 of 1976) PASS: lldb-unit :: Host/./HostTests/NativeProcessProtocolTest.ReadCStringFromMemory (1352 of 1976) PASS: lldb-unit :: Utility/./UtilityTests/StringExtractorTest.GetHexU8_InvalidHex (1353 of 1976) PASS: lldb-api :: commands/disassemble/basic/TestFrameDisassemble.py (1354 of 1976) PASS: lldb-api :: api/multithreaded/TestMultithreaded.py (1355 of 1976) PASS: lldb-api :: lang/cpp/signed_types/TestSignedTypes.py (1356 of 1976) PASS: lldb-api :: commands/expression/call-function/TestCallStopAndContinue.py (1357 of 1976) PASS: lldb-unit :: ScriptInterpreter/Python/./ScriptInterpreterPythonTests/PythonDataObjectsTest.TestPythonIntegerToStr (1358 of 1976) PASS: lldb-shell :: Unwind/eh-frame-dwarf-unwind.test (1359 of 1976) PASS: lldb-api :: lang/objc/objc++/TestObjCXX.py (1360 of 1976) PASS: lldb-api :: lang/objc/print-obj/TestPrintObj.py (1361 of 1976) PASS: lldb-unit :: Utility/./UtilityTests/ConstStringTest.MangledCounterpart (1362 of 1976) PASS: lldb-api :: functionalities/tail_call_frames/disambiguate_call_site/TestDisambiguateCallSite.py (1363 of 1976) PASS: lldb-api :: commands/expression/import-std-module/empty-module/TestEmptyStdModule.py (1364 of 1976) PASS: lldb-api :: lang/c/inlines/TestRedefinitionsInInlines.py (1365 of 1976) PASS: lldb-unit :: Symbol/./SymbolTests/TestClangASTImporter.CompleteFwdDeclWithOtherOrigin (1366 of 1976) PASS: lldb-api :: commands/expression/ir-interpreter-phi-nodes/TestIRInterpreterPHINodes.py (1367 of 1976) PASS: lldb-api :: python_api/lldbutil/iter/TestRegistersIterator.py (1368 of 1976) PASS: lldb-unit :: Utility/./UtilityTests/ArchSpecTest.TestSetTriple (1369 of 1976) PASS: lldb-api :: commands/expression/invalid-args/TestInvalidArgsExpression.py (1370 of 1976) PASS: lldb-shell :: SymbolFile/DWARF/debug_rnglists-dwo.s (1371 of 1976) PASS: lldb-api :: functionalities/thread/concurrent_events/TestConcurrentBreakpointsDelayedBreakpointOneWatchpoint.py (1372 of 1976) PASS: lldb-unit :: Utility/./UtilityTests/ProcessInstanceInfo.DumpTable_invalidUID (1373 of 1976) UNSUPPORTED: lldb-shell :: ObjectFile/ELF/minidebuginfo-no-lzma.yaml (1374 of 1976) PASS: lldb-unit :: Utility/./UtilityTests/StreamTest.PutHex64ByteOrderBig (1375 of 1976) UNSUPPORTED: lldb-api :: functionalities/darwin_log/filter/regex/activity/TestDarwinLogFilterRegexActivity.py (1376 of 1976) PASS: lldb-unit :: Core/./LLDBCoreTests/UniqueCStringMap.NoDefaultConstructor (1377 of 1976) PASS: lldb-unit :: Symbol/./SymbolTests/DWARFCallFrameInfoTest.Basic_eh (1378 of 1976) UNSUPPORTED: lldb-shell :: Register/arm-gp-read.test (1379 of 1976) PASS: lldb-api :: commands/expression/import-std-module/shared_ptr-dbg-info-content/TestSharedPtrDbgInfoContentFromStdModule.py (1380 of 1976) UNSUPPORTED: lldb-api :: tools/lldb-vscode/completions/TestVSCode_completions.py (1381 of 1976) UNSUPPORTED: lldb-api :: functionalities/unwind/standard/TestStandardUnwind.py (1382 of 1976) PASS: lldb-api :: commands/expression/import-std-module/conflicts/TestStdModuleWithConflicts.py (1383 of 1976) PASS: lldb-shell :: SymbolFile/DWARF/dwo-type-in-main-file.s (1384 of 1976) PASS: lldb-shell :: SymbolFile/Breakpad/unwind-via-raSearch.test (1385 of 1976) PASS: lldb-unit :: Process/gdb-remote/./ProcessGdbRemoteTests/GDBRemoteClientBaseTest.SendContinueAndLateInterrupt (1386 of 1976) PASS: lldb-shell :: ObjectFile/ELF/section-types.yaml (1387 of 1976) PASS: lldb-api :: tools/lldb-server/TestGdbRemote_qThreadStopInfo.py (1388 of 1976) PASS: lldb-api :: python_api/interpreter/TestRunCommandInterpreterAPI.py (1389 of 1976) PASS: lldb-unit :: UnwindAssembly/x86/./UnwindAssemblyx86Tests/Testx86AssemblyInspectionEngine.TestSpillRegToStackViaMOVx86_64 (1390 of 1976) PASS: lldb-unit :: Host/./HostTests/SocketTest.TCPListen0ConnectAccept (1391 of 1976) PASS: lldb-api :: lang/c/offsetof/TestOffsetof.py (1392 of 1976) PASS: lldb-unit :: Interpreter/./InterpreterTests/OptionArgParserTest.toChar (1393 of 1976) PASS: lldb-unit :: Process/minidump/./LLDBMinidumpTests/MinidumpParserTest.GetFilteredModuleList (1394 of 1976) PASS: lldb-unit :: Utility/./UtilityTests/BinaryStreamTest.PutSLEB128EightBytes (1395 of 1976) PASS: lldb-unit :: SymbolFile/DWARF/./SymbolFileDWARFTests/SymbolFileDWARFTests.ParseArangesNonzeroSegmentSize (1396 of 1976) FAIL: lldb-api :: lang/objc/ptr_refs/TestPtrRefsObjC.py (1397 of 1976) ******************** TEST 'lldb-api :: lang/objc/ptr_refs/TestPtrRefsObjC.py' FAILED ******************** Script: -- /usr/local/bin/python /Users/buildslave/jenkins/workspace/lldb-cmake-sanitized/llvm-project/lldb/test/API/dotest.py --arch x86_64 -s /Users/buildslave/jenkins/workspace/lldb-cmake-sanitized/lldb-build/lldb-test-traces -S nm -u CXXFLAGS -u CFLAGS --codesign-identity lldb_codesign --server /Users/buildslave/jenkins/workspace/lldb-cmake-sanitized/lldb-build/./bin/debugserver --arch x86_64 --build-dir /Users/buildslave/jenkins/workspace/lldb-cmake-sanitized/lldb-build/lldb-test-build.noindex -s=/Users/buildslave/jenkins/workspace/lldb-cmake-sanitized/test/logs -t --env TERM=vt100 --env LLVM_LIBS_DIR=/Users/buildslave/jenkins/workspace/lldb-cmake-sanitized/lldb-build/./lib --inferior-env ASAN_OPTIONS=detect_stack_use_after_return=1 --inferior-env DYLD_INSERT_LIBRARIES=/Users/buildslave/jenkins/workspace/lldb-cmake-sanitized/host-compiler/lib/clang/11.0.0/lib/darwin/libclang_rt.asan_osx_dynamic.dylib --build-dir /Users/buildslave/jenkins/workspace/lldb-cmake-sanitized/lldb-build/lldb-test-build.noindex --lldb-module-cache-dir /Users/buildslave/jenkins/workspace/lldb-cmake-sanitized/lldb-build/lldb-test-build.noindex/module-cache-lldb/lldb-api --clang-module-cache-dir /Users/buildslave/jenkins/workspace/lldb-cmake-sanitized/lldb-build/lldb-test-build.noindex/module-cache-clang/lldb-api --executable /Users/buildslave/jenkins/workspace/lldb-cmake-sanitized/lldb-build/./bin/lldb --compiler /Users/buildslave/jenkins/workspace/lldb-cmake-sanitized/lldb-build/./bin/clang --dsymutil /Users/buildslave/jenkins/workspace/lldb-cmake-sanitized/lldb-build/./bin/dsymutil --filecheck /Users/buildslave/jenkins/workspace/lldb-cmake-sanitized/lldb-build/./bin/FileCheck --lldb-libs-dir /Users/buildslave/jenkins/workspace/lldb-cmake-sanitized/lldb-build/./lib /Users/buildslave/jenkins/workspace/lldb-cmake-sanitized/llvm-project/lldb/test/API/lang/objc/ptr_refs -p TestPtrRefsObjC.py -- Exit Code: 1

Hide Details

Command Output (stdout): -- lldb version 11.0.99 clang revision 351b19231554d4dba29c42c798176f1ff3286a32 llvm revision 351b19231554d4dba29c42c798176f1ff3286a32 "crashlog" and "save_crashlog" command installed, use the "--help" option for detailed help "malloc_info", "ptr_refs", "cstr_refs", "find_variable", and "objc_refs" commands have been installed, use the "--help" options on these commands for detailed help. LLDB library dir: /Users/buildslave/jenkins/workspace/lldb-cmake-sanitized/lldb-build/bin LLDB import library dir: /Users/buildslave/jenkins/workspace/lldb-cmake-sanitized/lldb-build/./lib libstdcxx tests will not be run because: Don't know how to build with libstdcxx on macosx Skipping following debug info categories: ['dwo'] 0x00007ffee8fe3468: stack in frame #0 of thread #1: tid 0x3497e in variable at 0x7ffee8fe3468: (MyClass *) self = 0x00006020000000d0 0x00007ffee8fe33e0: stack (red zone)

Hide Details

-- Command Output (stderr): -- error: 'ptr_refs' is not a valid command. error: 'ptr_refs' is not a valid command.

Hide Details

Session logs for test failures/errors/unexpected successes will go into directory '/Users/buildslave/jenkins/workspace/lldb-cmake-sanitized/test/logs' Command invoked: /Users/buildslave/jenkins/workspace/lldb-cmake-sanitized/llvm-project/lldb/test/API/dotest.py --arch x86_64 -s /Users/buildslave/jenkins/workspace/lldb-cmake-sanitized/lldb-build/lldb-test-traces -S nm -u CXXFLAGS -u CFLAGS --codesign-identity lldb_codesign --server /Users/buildslave/jenkins/workspace/lldb-cmake-sanitized/lldb-build/./bin/debugserver --arch x86_64 --build-dir /Users/buildslave/jenkins/workspace/lldb-cmake-sanitized/lldb-build/lldb-test-build.noindex -s=/Users/buildslave/jenkins/workspace/lldb-cmake-sanitized/test/logs -t --env TERM=vt100 --env LLVM_LIBS_DIR=/Users/buildslave/jenkins/workspace/lldb-cmake-sanitized/lldb-build/./lib --inferior-env ASAN_OPTIONS=detect_stack_use_after_return=1 --inferior-env DYLD_INSERT_LIBRARIES=/Users/buildslave/jenkins/workspace/lldb-cmake-sanitized/host-compiler/lib/clang/11.0.0/lib/darwin/libclang_rt.asan_osx_dynamic.dylib --build-dir /Users/buildslave/jenkins/workspace/lldb-cmake-sanitized/lldb-build/lldb-test-build.noindex --lldb-module-cache-dir /Users/buildslave/jenkins/workspace/lldb-cmake-sanitized/lldb-build/lldb-test-build.noindex/module-cache-lldb/lldb-api --clang-module-cache-dir /Users/buildslave/jenkins/workspace/lldb-cmake-sanitized/lldb-build/lldb-test-build.noindex/module-cache-clang/lldb-api --executable /Users/buildslave/jenkins/workspace/lldb-cmake-sanitized/lldb-build/./bin/lldb --compiler /Users/buildslave/jenkins/workspace/lldb-cmake-sanitized/lldb-build/./bin/clang --dsymutil /Users/buildslave/jenkins/workspace/lldb-cmake-sanitized/lldb-build/./bin/dsymutil --filecheck /Users/buildslave/jenkins/workspace/lldb-cmake-sanitized/lldb-build/./bin/FileCheck --lldb-libs-dir /Users/buildslave/jenkins/workspace/lldb-cmake-sanitized/lldb-build/./lib /Users/buildslave/jenkins/workspace/lldb-cmake-sanitized/llvm-project/lldb/test/API/lang/objc/ptr_refs -p TestPtrRefsObjC.py Change dir to: /Users/buildslave/jenkins/workspace/lldb-cmake-sanitized/llvm-project/lldb/test/API/lang/objc/ptr_refs runCmd: settings clear -all output:

Hide Details

runCmd: settings set symbols.enable-external-lookup false output:

Hide Details

runCmd: settings set target.auto-apply-fixits false output:

Hide Details

runCmd: settings set plugin.process.gdb-remote.packet-timeout 60 output:

Hide Details

runCmd: settings set symbols.clang-modules-cache-path "/Users/buildslave/jenkins/workspace/lldb-cmake-sanitized/lldb-build/lldb-test-build.noindex/module-cache-lldb/lldb-api" output:

Hide Details

runCmd: settings set use-color false output:

Hide Details

runCmd: setting set target.prefer-dynamic-value no-dynamic-values output:

Hide Details

runCmd: settings set target.env-vars ASAN_OPTIONS=detect_stack_use_after_return=1 DYLD_INSERT_LIBRARIES=/Users/buildslave/jenkins/workspace/lldb-cmake-sanitized/host-compiler/lib/clang/11.0.0/lib/darwin/libclang_rt.asan_osx_dynamic.dylib output:

Hide Details

runCmd: script import lldb.macosx.heap output: "crashlog" and "save_crashlog" command installed, use the "--help" option for detailed help "malloc_info", "ptr_refs", "cstr_refs", "find_variable", and "objc_refs" commands have been installed, use the "--help" options on these commands for detailed help.

Hide Details

Hide Details

runCmd: ptr_refs self output: 0x00007ffee8fe3468: stack in frame #0 of thread #1: tid 0x3497e in variable at 0x7ffee8fe3468: (MyClass *) self = 0x00006020000000d0 0x00007ffee8fe33e0: stack (red zone)

Hide Details

Hide Details

Expecting sub string: malloc Not matched

Hide Details

FAIL: LLDB (/Users/buildslave/jenkins/workspace/lldb-cmake-sanitized/lldb-build/bin/clang-11-x86_64) :: test_ptr_refs_dsym (TestPtrRefsObjC.TestPtrRefsObjC) <bound method SBProcess.Kill of <lldb.SBProcess; proxy of <Swig Object of type 'lldb::SBProcess *' at 0x1143fd8a0> >>: success

Hide Details

runCmd: settings clear -all output:

Hide Details

runCmd: settings set symbols.enable-external-lookup false output:

Hide Details

runCmd: settings set target.auto-apply-fixits false output:

Hide Details

runCmd: settings set plugin.process.gdb-remote.packet-timeout 60 output:

Hide Details

runCmd: settings set symbols.clang-modules-cache-path "/Users/buildslave/jenkins/workspace/lldb-cmake-sanitized/lldb-build/lldb-test-build.noindex/module-cache-lldb/lldb-api" output:

Hide Details

runCmd: settings set use-color false output:

Hide Details

runCmd: setting set target.prefer-dynamic-value no-dynamic-values output:

Hide Details

runCmd: settings set target.env-vars ASAN_OPTIONS=detect_stack_use_after_return=1 DYLD_INSERT_LIBRARIES=/Users/buildslave/jenkins/workspace/lldb-cmake-sanitized/host-compiler/lib/clang/11.0.0/lib/darwin/libclang_rt.asan_osx_dynamic.dylib output:

Hide Details

runCmd: script import lldb.macosx.heap output:

Hide Details

runCmd: ptr_refs self runCmd failed! error: 'ptr_refs' is not a valid command.

Hide Details

Hide Details

XFAIL: LLDB (/Users/buildslave/jenkins/workspace/lldb-cmake-sanitized/lldb-build/bin/clang-11-x86_64) :: test_ptr_refs_dwarf (TestPtrRefsObjC.TestPtrRefsObjC) <bound method SBProcess.Kill of <lldb.SBProcess; proxy of <Swig Object of type 'lldb::SBProcess *' at 0x113783990> >>: success

Hide Details

UNSUPPORTED: LLDB (/Users/buildslave/jenkins/workspace/lldb-cmake-sanitized/lldb-build/bin/clang-11-x86_64) :: test_ptr_refs_dwo (TestPtrRefsObjC.TestPtrRefsObjC) (test case does not fall in any category of interest for this run) runCmd: settings clear -all output:

Hide Details

runCmd: settings set symbols.enable-external-lookup false output:

Hide Details

runCmd: settings set target.auto-apply-fixits false output:

Hide Details

runCmd: settings set plugin.process.gdb-remote.packet-timeout 60 output:

Hide Details

runCmd: settings set symbols.clang-modules-cache-path "/Users/buildslave/jenkins/workspace/lldb-cmake-sanitized/lldb-build/lldb-test-build.noindex/module-cache-lldb/lldb-api" output:

Hide Details

runCmd: settings set use-color false output:

Hide Details

runCmd: setting set target.prefer-dynamic-value no-dynamic-values output:

Hide Details

runCmd: settings set target.env-vars ASAN_OPTIONS=detect_stack_use_after_return=1 DYLD_INSERT_LIBRARIES=/Users/buildslave/jenkins/workspace/lldb-cmake-sanitized/host-compiler/lib/clang/11.0.0/lib/darwin/libclang_rt.asan_osx_dynamic.dylib output:

Hide Details

runCmd: script import lldb.macosx.heap output:

Hide Details

runCmd: ptr_refs self runCmd failed! error: 'ptr_refs' is not a valid command.

Hide Details

Hide Details

XFAIL: LLDB (/Users/buildslave/jenkins/workspace/lldb-cmake-sanitized/lldb-build/bin/clang-11-x86_64) :: test_ptr_refs_gmodules (TestPtrRefsObjC.TestPtrRefsObjC) <bound method SBProcess.Kill of <lldb.SBProcess; proxy of <Swig Object of type 'lldb::SBProcess *' at 0x1143fd1e0> >>: success

Hide Details

Restore dir to: /Users/buildslave/jenkins/workspace/lldb-cmake-sanitized/lldb-build/tools/lldb/test ====================================================================== FAIL: test_ptr_refs_dsym (TestPtrRefsObjC.TestPtrRefsObjC) Test the ptr_refs tool on Darwin with Objective-C ---------------------------------------------------------------------- Traceback (most recent call last): File "/Users/buildslave/jenkins/workspace/lldb-cmake-sanitized/llvm-project/lldb/packages/Python/lldbsuite/test/lldbtest.py", line 1751, in test_method return attrvalue(self) File "/Users/buildslave/jenkins/workspace/lldb-cmake-sanitized/llvm-project/lldb/packages/Python/lldbsuite/test/decorators.py", line 110, in wrapper func(*args, **kwargs) File "/Users/buildslave/jenkins/workspace/lldb-cmake-sanitized/llvm-project/lldb/test/API/lang/objc/ptr_refs/TestPtrRefsObjC.py", line 47, in test_ptr_refs self.expect("ptr_refs self", substrs=["malloc", "stack"]) File "/Users/buildslave/jenkins/workspace/lldb-cmake-sanitized/llvm-project/lldb/packages/Python/lldbsuite/test/lldbtest.py", line 2391, in expect if msg else EXP_MSG(str, output, exe)) AssertionError: False is not True : 'ptr_refs self' returns expected result, got '0x00007ffee8fe3468: stack in frame #0 of thread #1: tid 0x3497e in variable at 0x7ffee8fe3468: (MyClass *) self = 0x00006020000000d0 0x00007ffee8fe33e0: stack (red zone)' Config=x86_64-/Users/buildslave/jenkins/workspace/lldb-cmake-sanitized/lldb-build/bin/clang-11 ---------------------------------------------------------------------- Ran 4 tests in 22.597s

Hide Details

RESULT: FAILED (0 passes, 1 failures, 0 errors, 1 skipped, 2 expected failures, 0 unexpected successes)

Hide Details

--

Hide Details

******************** PASS: lldb-unit :: Utility/./UtilityTests/StringListTest.AppendStringMove (1398 of 1976) PASS: lldb-unit :: Symbol/./SymbolTests/TestClangASTImporter.MetadataPropagationAfterCopying (1399 of 1976) PASS: lldb-api :: functionalities/breakpoint/breakpoint_command/TestRegexpBreakCommand.py (1400 of 1976) PASS: lldb-api :: functionalities/thread/thread_specific_break/TestThreadSpecificBreakpoint.py (1401 of 1976) PASS: lldb-api :: lang/c/modules/TestCModules.py (1402 of 1976) PASS: lldb-unit :: Utility/./UtilityTests/StructuredDataTest.StringDump (1403 of 1976) PASS: lldb-api :: lang/cpp/class_types/TestClassTypes.py (1404 of 1976) PASS: lldb-unit :: UnwindAssembly/x86/./UnwindAssemblyx86Tests/Testx86AssemblyInspectionEngine.TestCALLNextInsn (1405 of 1976) PASS: lldb-api :: lang/c/step_over_no_deadlock/TestStepOverDoesntBlock.py (1406 of 1976) PASS: lldb-api :: python_api/lldbutil/frame/TestFrameUtils.py (1407 of 1976) PASS: lldb-unit :: ScriptInterpreter/Python/./ScriptInterpreterPythonTests/PythonDataObjectsTest.TestRun (1408 of 1976) PASS: lldb-unit :: Process/minidump/./LLDBMinidumpTests/MinidumpParserTest.GetMiscInfoWindows (1409 of 1976) PASS: lldb-unit :: SymbolFile/DWARF/./SymbolFileDWARFTests/SymbolFileDWARFTests.TestAbilitiesForDWARF (1410 of 1976) PASS: lldb-shell :: SymbolFile/DWARF/debug_loc.s (1411 of 1976) PASS: lldb-unit :: Utility/./UtilityTests/BinaryStreamTest.PutULEB128EightBytes (1412 of 1976) PASS: lldb-api :: lang/objcxx/class-name-clash/TestNameClash.py (1413 of 1976) PASS: lldb-api :: commands/source/info/TestSourceInfo.py (1414 of 1976) PASS: lldb-unit :: Interpreter/./InterpreterTests/OptionArgParserTest.toScriptLanguage (1415 of 1976) PASS: lldb-unit :: Symbol/./SymbolTests/DWARFCallFrameInfoTest.Basic_dwarf3 (1416 of 1976) PASS: lldb-unit :: Utility/./UtilityTests/VMRange.Clear (1417 of 1976) PASS: lldb-api :: python_api/process/TestProcessAPI.py (1418 of 1976) PASS: lldb-unit :: UnwindAssembly/x86/./UnwindAssemblyx86Tests/Testx86AssemblyInspectionEngine.TestPushESI (1419 of 1976) UNSUPPORTED: lldb-shell :: SymbolFile/PDB/function-nested-block.test (1420 of 1976) PASS: lldb-api :: commands/expression/top-level/TestTopLevelExprs.py (1421 of 1976) PASS: lldb-shell :: BuildScript/script-args.test (1422 of 1976) PASS: lldb-unit :: Utility/./UtilityTests/GeneratorTest.Get (1423 of 1976) PASS: lldb-shell :: Minidump/disassemble-no-module.yaml (1424 of 1976) PASS: lldb-api :: functionalities/dead-strip/TestDeadStrip.py (1425 of 1976) PASS: lldb-api :: commands/log/invalid-args/TestInvalidArgsLog.py (1426 of 1976) PASS: lldb-api :: functionalities/target-new-solib-notifications/TestModuleLoadedNotifys.py (1427 of 1976) PASS: lldb-api :: types/TestCharTypeExpr.py (1428 of 1976) PASS: lldb-unit :: Utility/./UtilityTests/StringLexerTest.Next (1429 of 1976) PASS: lldb-api :: api/log/TestAPILog.py (1430 of 1976) PASS: lldb-api :: commands/expression/deleting-implicit-copy-constructor/TestDeletingImplicitCopyConstructor.py (1431 of 1976) PASS: lldb-api :: functionalities/data-formatter/data-formatter-stl/libcxx/function/TestLibCxxFunction.py (1432 of 1976) PASS: lldb-unit :: Symbol/./SymbolTests/Type.GetTypeScopeAndBasename (1433 of 1976) PASS: lldb-unit :: Utility/./UtilityTests/OptionsWithRawTest.LeadingSpaceArgs (1434 of 1976) PASS: lldb-unit :: Utility/./UtilityTests/UriParserTest.SchemeHostSeparator4 (1435 of 1976) UNSUPPORTED: lldb-shell :: SymbolFile/PDB/ast-restore.test (1436 of 1976) PASS: lldb-unit :: Host/./HostTests/ProcessLaunchInfoTest.Constructor (1437 of 1976) PASS: lldb-api :: functionalities/testid/TestTestId.py (1438 of 1976) PASS: lldb-unit :: Utility/./UtilityTests/StringExtractorTest.GetHexBytesAvail_FullString (1439 of 1976) PASS: lldb-api :: lang/cpp/extern_c/TestExternCSymbols.py (1440 of 1976) PASS: lldb-api :: commands/expression/completion-in-lambda-and-unnamed-class/TestCompletionInLambdaAndUnnamedClass.py (1441 of 1976) PASS: lldb-api :: lang/objc/objc-static-method/TestObjCStaticMethod.py (1442 of 1976) PASS: lldb-unit :: Utility/./UtilityTests/UUIDTest.SetFromStringRef (1443 of 1976) PASS: lldb-api :: functionalities/postmortem/elf-core/TestLinuxCore.py (1444 of 1976) PASS: lldb-api :: lang/objc/objc_direct-methods/TestObjCDirectMethods.py (1445 of 1976) PASS: lldb-unit :: Utility/./UtilityTests/FileSpecTest.GuessPathStyle (1446 of 1976) PASS: lldb-unit :: Interpreter/./InterpreterTests/CompletionTest.FileCompletionAbsolute (1447 of 1976) UNSUPPORTED: lldb-api :: functionalities/darwin_log/filter/regex/message/TestDarwinLogFilterRegexMessage.py (1448 of 1976) XFAIL: lldb-shell :: Register/x86-64-ymm-write.test (1449 of 1976) PASS: lldb-unit :: Utility/./UtilityTests/SerializationRountripTest.SerializeDeserializePodPointers (1450 of 1976) PASS: lldb-unit :: Utility/./UtilityTests/VMRange.IsValid (1451 of 1976) PASS: lldb-shell :: SymbolFile/DWARF/dir-separator-no-comp-dir-relative-name.s (1452 of 1976) PASS: lldb-api :: lang/cpp/breakpoint-commands/TestCPPBreakpointCommands.py (1453 of 1976) PASS: lldb-api :: functionalities/non-overlapping-index-variable-i/TestIndexVariable.py (1454 of 1976) PASS: lldb-unit :: Expression/./ExpressionTests/DiagnosticManagerTest.PutString (1455 of 1976) PASS: lldb-api :: functionalities/data-formatter/data-formatter-cpp/TestDataFormatterCpp.py (1456 of 1976) PASS: lldb-api :: functionalities/gdb_remote_client/TestNestedRegDefinitions.py (1457 of 1976) UNSUPPORTED: lldb-api :: linux/sepdebugsymlink/TestTargetSymbolsSepDebugSymlink.py (1458 of 1976) UNSUPPORTED: lldb-shell :: Register/x86-64-xmm16-write.test (1459 of 1976) UNSUPPORTED: lldb-shell :: SymbolFile/PDB/typedefs.test (1460 of 1976) PASS: lldb-unit :: Utility/./UtilityTests/StringListTest.SplitIntoLinesSingleTrailingCR (1461 of 1976) PASS: lldb-unit :: Utility/./UtilityTests/BinaryStreamTest.PutSLEB128NineBytes (1462 of 1976) PASS: lldb-api :: lang/cpp/overloaded-functions/TestOverloadedFunctions.py (1463 of 1976) PASS: lldb-unit :: UnwindAssembly/x86/./UnwindAssemblyx86Tests/Testx86AssemblyInspectionEngine.TestMovRSPtoRBP (1464 of 1976) PASS: lldb-api :: functionalities/thread/concurrent_events/TestConcurrentDelaySignalWatch.py (1465 of 1976) PASS: lldb-api :: commands/watchpoints/watchpoint_commands/command/TestWatchpointCommandPython.py (1466 of 1976) PASS: lldb-unit :: Utility/./UtilityTests/StringExtractorTest.DecodeHexU8_Underflow (1467 of 1976) UNSUPPORTED: lldb-shell :: SymbolFile/NativePDB/local-variables.cpp (1468 of 1976) PASS: lldb-api :: macosx/order/TestOrderFile.py (1469 of 1976) PASS: lldb-unit :: UnwindAssembly/x86/./UnwindAssemblyx86Tests/Testx86AssemblyInspectionEngine.TestStackRealign8BitDisp_i386 (1470 of 1976) PASS: lldb-api :: functionalities/data-formatter/data-formatter-stl/libcxx/vbool/TestDataFormatterLibcxxVBool.py (1471 of 1976) PASS: lldb-unit :: Utility/./UtilityTests/RangeTest.Slide (1472 of 1976) UNSUPPORTED: lldb-shell :: Register/x86-zmm-read.test (1473 of 1976) PASS: lldb-api :: functionalities/breakpoint/require_hw_breakpoints/TestRequireHWBreakpoints.py (1474 of 1976) PASS: lldb-unit :: Utility/./UtilityTests/StringExtractorTest.GetHexBytes_OddPair (1475 of 1976) PASS: lldb-unit :: Utility/./UtilityTests/OptionsWithRawTest.UnterminatedQuote (1476 of 1976) PASS: lldb-api :: lang/cpp/unicode-literals/TestUnicodeLiterals.py (1477 of 1976) PASS: lldb-api :: commands/frame/var/TestFrameVar.py (1478 of 1976) PASS: lldb-api :: lang/cpp/global_operators/TestCppGlobalOperators.py (1479 of 1976) PASS: lldb-unit :: Utility/./UtilityTests/ArgsTest.EscapeLLDBCommandArgument (1480 of 1976) UNSUPPORTED: lldb-api :: functionalities/tsan/global_location/TestTsanGlobalLocation.py (1481 of 1976) PASS: lldb-unit :: Utility/./UtilityTests/SerializationRountripTest.SerializeDeserializeObjectReference (1482 of 1976) PASS: lldb-api :: functionalities/thread/concurrent_events/TestConcurrentSignalDelayBreak.py (1483 of 1976) PASS: lldb-shell :: ObjectFile/wasm/basic.yaml (1484 of 1976) PASS: lldb-api :: functionalities/data-formatter/boolreference/TestFormattersBoolRefPtr.py (1485 of 1976) PASS: lldb-unit :: Utility/./UtilityTests/StatusTest.ErrorConversion (1486 of 1976) PASS: lldb-api :: python_api/watchpoint/condition/TestWatchpointConditionAPI.py (1487 of 1976) PASS: lldb-shell :: SymbolFile/NativePDB/s_constant.cpp (1488 of 1976) PASS: lldb-shell :: Minidump/breakpad-symbols.test (1489 of 1976) PASS: lldb-unit :: Utility/./UtilityTests/StreamTest.ShiftOperatorPtr (1490 of 1976) PASS: lldb-api :: functionalities/data-formatter/nssetsynth/TestNSSetSynthetic.py (1491 of 1976) PASS: lldb-shell :: Commands/command-source.test (1492 of 1976) PASS: lldb-unit :: Utility/./UtilityTests/StreamTeeTest.SetStreamAtIndexOutOfBounds (1493 of 1976) PASS: lldb-api :: commands/add-dsym/uuid/TestAddDsymCommand.py (1494 of 1976) PASS: lldb-unit :: ScriptInterpreter/Python/./ScriptInterpreterPythonTests/PythonDataObjectsTest.TestModuleNameResolutionNoDot (1495 of 1976) PASS: lldb-unit :: Process/gdb-remote/./ProcessGdbRemoteTests/GDBRemoteCommunicationClientTest.SendStopTracePacket (1496 of 1976) PASS: lldb-unit :: Utility/./UtilityTests/StringExtractorTest.DecodeHexU8_InvalidHex2 (1497 of 1976) PASS: lldb-unit :: Utility/./UtilityTests/StreamTest.PutHex64ByteOrderLittle (1498 of 1976) PASS: lldb-unit :: Utility/./UtilityTests/SerializationRountripTest.SerializeDeserializeCStringArray (1499 of 1976) PASS: lldb-unit :: Utility/./UtilityTests/StringListTest.JoinNonSpace (1500 of 1976) PASS: lldb-unit :: Utility/./UtilityTests/StreamTeeTest.GetStreamAtIndexOutOfBounds (1501 of 1976) PASS: lldb-unit :: Target/./TargetTests/PathMappingListTest.RemapRoot (1502 of 1976) PASS: lldb-unit :: Utility/./UtilityTests/StringListTest.JoinThree (1503 of 1976) PASS: lldb-api :: functionalities/breakpoint/step_over_breakpoint/TestStepOverBreakpoint.py (1504 of 1976) PASS: lldb-api :: lang/cpp/this/TestCPPThis.py (1505 of 1976) PASS: lldb-unit :: Utility/./UtilityTests/RangeTest.Clear (1506 of 1976) PASS: lldb-unit :: Core/./LLDBCoreTests/RichManglingContextTest.Basic (1507 of 1976) PASS: lldb-api :: commands/settings/quoting/TestQuoting.py (1508 of 1976) PASS: lldb-unit :: Utility/./UtilityTests/FileSpecTest.FormatFileSpec (1509 of 1976) PASS: lldb-unit :: SymbolFile/NativePDB/./SymbolFileNativePDBTests/PDBFPOProgramToDWARFExpressionTests.MultipleDependentAssignments (1510 of 1976) PASS: lldb-api :: lang/cpp/operator-overload/TestOperatorOverload.py (1511 of 1976) PASS: lldb-api :: lang/objc/modules-cache/TestClangModulesCache.py (1512 of 1976) PASS: lldb-unit :: Utility/./UtilityTests/FileSpecTest.RemoveLastPathComponent (1513 of 1976) PASS: lldb-api :: lang/cpp/unsigned_types/TestUnsignedTypes.py (1514 of 1976) PASS: lldb-unit :: UnwindAssembly/x86/./UnwindAssemblyx86Tests/Testx86AssemblyInspectionEngine.TestPushEBX (1515 of 1976) PASS: lldb-api :: functionalities/show_location/TestShowLocationDwarf5.py (1516 of 1976) PASS: lldb-shell :: SymbolFile/DWARF/anon_class_w_and_wo_export_symbols.ll (1517 of 1976) PASS: lldb-unit :: Language/CPlusPlus/./LanguageCPlusPlusTests/CPlusPlusLanguage.FindAlternateFunctionManglings (1518 of 1976) UNSUPPORTED: lldb-shell :: Unwind/eh-frame-small-fde.test (1519 of 1976) PASS: lldb-api :: lang/objcxx/cxx-bridged-po/TestObjCXXBridgedPO.py (1520 of 1976) PASS: lldb-unit :: SymbolFile/NativePDB/./SymbolFileNativePDBTests/PDBFPOProgramToDWARFExpressionTests.UnresolvedDependentCyclicRegisterAssignmentReference (1521 of 1976) PASS: lldb-unit :: Utility/./UtilityTests/SubsystemRAIITest.NormalSubsystem (1522 of 1976) UNSUPPORTED: lldb-api :: commands/watchpoints/hello_watchlocation/TestWatchLocation.py (1523 of 1976) PASS: lldb-unit :: Language/Highlighting/./HighlighterTests/HighlighterTest.ClangCursorPosInOtherToken (1524 of 1976) UNSUPPORTED: lldb-api :: functionalities/tsan/thread_numbers/TestTsanThreadNumbers.py (1525 of 1976) UNSUPPORTED: lldb-api :: functionalities/darwin_log/format/TestDarwinLogMessageFormat.py (1526 of 1976) PASS: lldb-api :: commands/watchpoints/watchpoint_commands/TestWatchpointCommands.py (1527 of 1976) PASS: lldb-api :: python_api/watchpoint/watchlocation/TestTargetWatchAddress.py (1528 of 1976) PASS: lldb-unit :: Utility/./UtilityTests/VMRange.ContainsRange (1529 of 1976) PASS: lldb-shell :: SymbolFile/DWARF/debug_rnglists.s (1530 of 1976) PASS: lldb-api :: lang/objc/ivar-IMP/TestObjCiVarIMP.py (1531 of 1976) PASS: lldb-unit :: Utility/./UtilityTests/FileSpecTest.OperatorBool (1532 of 1976) PASS: lldb-unit :: Utility/./UtilityTests/StreamTeeTest.Flush (1533 of 1976) PASS: lldb-shell :: SymbolFile/DWARF/dir-separator-no-comp-dir.s (1534 of 1976) PASS: lldb-api :: functionalities/gdb_remote_client/TestRecognizeBreakpoint.py (1535 of 1976) PASS: lldb-unit :: Utility/./UtilityTests/DataExtractorTest.GetMaxS64 (1536 of 1976) PASS: lldb-api :: functionalities/thread/exit_during_break/TestExitDuringBreak.py (1537 of 1976) PASS: lldb-shell :: Reproducer/TestDriverOptions.test (1538 of 1976) PASS: lldb-api :: lang/objc/objc-ivar-stripped/TestObjCIvarStripped.py (1539 of 1976) PASS: lldb-api :: lang/cpp/namespace/TestNamespaceLookup.py (1540 of 1976) PASS: lldb-api :: commands/expression/anonymous-struct/TestCallUserAnonTypedef.py (1541 of 1976) PASS: lldb-unit :: Symbol/./SymbolTests/PostfixExpression.ToDWARF (1542 of 1976) UNSUPPORTED: lldb-shell :: SymbolFile/PDB/function-level-linking.test (1543 of 1976) PASS: lldb-unit :: tools/lldb-server/tests/./LLDBServerTests/TestBase.LaunchModePreservesEnvironment (1544 of 1976) PASS: lldb-api :: lang/objc/modules-app-update/TestClangModulesAppUpdate.py (1545 of 1976) PASS: lldb-unit :: Utility/./UtilityTests/StreamTest.AddressEmptyPrefix (1546 of 1976) PASS: lldb-unit :: Utility/./UtilityTests/AnsiTerminal.Incomplete (1547 of 1976) PASS: lldb-unit :: Core/./LLDBCoreTests/MangledTest.ResultForBlockInvocation (1548 of 1976) PASS: lldb-shell :: ObjectFile/ELF/aarch64-relocations.yaml (1549 of 1976) PASS: lldb-api :: functionalities/tail_call_frames/inlining_and_tail_calls/TestInliningAndTailCalls.py (1550 of 1976) PASS: lldb-unit :: ObjectFile/ELF/./ObjectFileELFTests/ObjectFileELFTest.GetSymtab_NoSymEntryPointArmAddressClass (1551 of 1976) PASS: lldb-api :: functionalities/data-formatter/data-formatter-objc/cmtime/TestDataFormatterCMTime.py (1552 of 1976) PASS: lldb-shell :: ObjectFile/Breakpad/sections-trailing-func.test (1553 of 1976) PASS: lldb-unit :: Utility/./UtilityTests/ScalarTest.GetBytes (1554 of 1976) PASS: lldb-api :: tools/lldb-server/TestGdbRemoteHostInfo.py (1555 of 1976) PASS: lldb-api :: python_api/interpreter/TestCommandInterpreterAPI.py (1556 of 1976) PASS: lldb-unit :: Process/minidump/./LLDBMinidumpTests/MinidumpParserTest.GetMemoryRegionInfoLinuxMaps (1557 of 1976) PASS: lldb-api :: lang/cpp/chained-calls/TestCppChainedCalls.py (1558 of 1976) PASS: lldb-unit :: Utility/./UtilityTests/DataExtractorTest.GetBitfield (1559 of 1976) PASS: lldb-unit :: Utility/./UtilityTests/StringListTest.InsertStringAtIndexOutOfBounds (1560 of 1976) PASS: lldb-api :: commands/expression/static-initializers/TestStaticInitializers.py (1561 of 1976) PASS: lldb-api :: functionalities/data-formatter/data-formatter-caching/TestDataFormatterCaching.py (1562 of 1976) PASS: lldb-shell :: SymbolFile/DWARF/dwarf5-partial-index.cpp (1563 of 1976) UNSUPPORTED: lldb-api :: functionalities/darwin_log/filter/exact_match/activity/TestDarwinLogFilterMatchActivity.py (1564 of 1976) PASS: lldb-shell :: Settings/TestStopCommandSourceOnError.test (1565 of 1976) PASS: lldb-api :: types/TestIntegerType.py (1566 of 1976) PASS: lldb-api :: commands/register/register/register_command/TestRegisters.py (1567 of 1976) PASS: lldb-api :: functionalities/data-formatter/data-formatter-objc/TestDataFormatterObjCNSBundle.py (1568 of 1976) UNSUPPORTED: lldb-api :: functionalities/data-formatter/data-formatter-stl/libstdcpp/unique_ptr/TestDataFormatterStdUniquePtr.py (1569 of 1976) PASS: lldb-unit :: Utility/./UtilityTests/SharedCluster.ClusterManager (1570 of 1976) PASS: lldb-api :: macosx/thread-names/TestInterruptThreadNames.py (1571 of 1976) UNSUPPORTED: lldb-api :: tools/lldb-server/signal-filtering/TestGdbRemote_QPassSignals.py (1572 of 1976) PASS: lldb-api :: lang/cpp/std-function-step-into-callable/TestStdFunctionStepIntoCallable.py (1573 of 1976) PASS: lldb-unit :: Utility/./UtilityTests/StringExtractorTest.GetHexBytes_Underflow (1574 of 1976) PASS: lldb-api :: lang/objc/foundation/TestObjCMethodsString.py (1575 of 1976) PASS: lldb-unit :: Expression/./ExpressionTests/CppModuleConfigurationTest.LinuxLocalLibCpp (1576 of 1976) PASS: lldb-unit :: Symbol/./SymbolTests/TestTypeSystemClang.TestFunctionTemplateConstruction (1577 of 1976) PASS: lldb-unit :: Expression/./ExpressionTests/DiagnosticManagerTest.FixedExpression (1578 of 1976) PASS: lldb-unit :: Utility/./UtilityTests/StringListTest.ShiftMove (1579 of 1976) PASS: lldb-api :: functionalities/memory/find/TestMemoryFind.py (1580 of 1976) PASS: lldb-api :: functionalities/load_using_paths/TestLoadUsingPaths.py (1581 of 1976) PASS: lldb-api :: functionalities/tail_call_frames/disambiguate_tail_call_seq/TestDisambiguateTailCallSeq.py (1582 of 1976) PASS: lldb-api :: commands/expression/persistent_types/TestPersistentTypes.py (1583 of 1976) PASS: lldb-unit :: Utility/./UtilityTests/UriParserTest.SchemeHostSeparator (1584 of 1976) PASS: lldb-shell :: Settings/TestFrameFormatColor.test (1585 of 1976) PASS: lldb-unit :: ScriptInterpreter/Python/./ScriptInterpreterPythonTests/PythonDataObjectsTest.TestPythonDictionaryValueEquality (1586 of 1976) PASS: lldb-shell :: Minidump/Windows/Sigsegv/sigsegv.test (1587 of 1976) PASS: lldb-unit :: Process/gdb-remote/./ProcessGdbRemoteTests/GDBRemoteCommunicationClientTest.WriteRegisterNoSuffix (1588 of 1976) UNSUPPORTED: lldb-api :: functionalities/exec/TestExec.py (1589 of 1976) PASS: lldb-api :: python_api/frame/TestFrames.py (1590 of 1976) PASS: lldb-api :: functionalities/paths/TestPaths.py (1591 of 1976) PASS: lldb-unit :: Target/./TargetTests/MemoryRegionInfoTest.Formatv (1592 of 1976) PASS: lldb-api :: functionalities/thread/concurrent_events/TestConcurrentCrashWithWatchpointBreakpointSignal.py (1593 of 1976) PASS: lldb-unit :: Utility/./UtilityTests/RecordReplayTest.InstrumentedBar (1594 of 1976) PASS: lldb-unit :: Host/./HostTests/TaskPoolTest.AddTask (1595 of 1976) PASS: lldb-unit :: Utility/./UtilityTests/ConstStringTest.UpdateMangledCounterpart (1596 of 1976) PASS: lldb-shell :: SymbolFile/DWARF/find-variable-dwo.cpp (1597 of 1976) PASS: lldb-shell :: ObjectFile/ELF/netbsd-exec-8.99.30-amd64.yaml (1598 of 1976) PASS: lldb-shell :: SymbolFile/Breakpad/symtab.test (1599 of 1976) UNSUPPORTED: lldb-api :: benchmarks/frame_variable/TestFrameVariableResponse.py (1600 of 1976) PASS: lldb-unit :: Utility/./UtilityTests/ArgsTest.TestInsertArg (1601 of 1976) PASS: lldb-api :: functionalities/type_completion/TestTypeCompletion.py (1602 of 1976) PASS: lldb-unit :: Utility/./UtilityTests/StreamTest.ChangingByteOrder (1603 of 1976) PASS: lldb-unit :: Utility/./UtilityTests/ProcessInstanceInfoMatch.Name (1604 of 1976) PASS: lldb-api :: commands/expression/cast_int_to_anonymous_enum/TestCastIntToAnonymousEnum.py (1605 of 1976) UNSUPPORTED: lldb-shell :: Register/x86-gp-read.test (1606 of 1976) PASS: lldb-unit :: Utility/./UtilityTests/VASprintfTest.BufferResize (1607 of 1976) PASS: lldb-api :: functionalities/gdb_remote_client/TestRegDefinitionInParts.py (1608 of 1976) UNSUPPORTED: lldb-shell :: SymbolFile/Breakpad/stack-cfi-arm.yaml (1609 of 1976) PASS: lldb-api :: functionalities/plugins/command_plugin/TestPluginCommands.py (1610 of 1976) PASS: lldb-unit :: Target/./TargetTests/StackFrameRecognizerTest.NullModuleRegex (1611 of 1976) PASS: lldb-api :: tools/lldb-vscode/variables/TestVSCode_variables.py (1612 of 1976) PASS: lldb-api :: commands/frame/var-scope/TestFrameVariableScope.py (1613 of 1976) PASS: lldb-shell :: ObjectFile/PECOFF/basic-info.yaml (1614 of 1976) PASS: lldb-api :: commands/frame/diagnose/virtual-method-call/TestDiagnoseDereferenceVirtualMethodCall.py (1615 of 1976) PASS: lldb-api :: commands/expression/import-std-module/shared_ptr/TestSharedPtrFromStdModule.py (1616 of 1976) PASS: lldb-shell :: SymbolFile/DWARF/DW_AT_low_pc-addrx.s (1617 of 1976) PASS: lldb-unit :: Utility/./UtilityTests/ScalarTest.RightShiftOperator (1618 of 1976) PASS: lldb-unit :: Expression/./ExpressionTests/ClangExpressionDeclMapTest.TestPersistentDeclLookup (1619 of 1976) PASS: lldb-api :: macosx/function-starts/TestFunctionStarts.py (1620 of 1976) PASS: lldb-shell :: ObjectFile/PECOFF/section-types.yaml (1621 of 1976) PASS: lldb-unit :: Process/gdb-remote/./ProcessGdbRemoteTests/GDBRemoteCommunicationClientTest.TestPacketSpeedJSON (1622 of 1976) PASS: lldb-api :: lang/objc/hidden-ivars/TestHiddenIvars.py (1623 of 1976) PASS: lldb-unit :: ScriptInterpreter/Python/./ScriptInterpreterPythonTests/PythonDataObjectsTest.TestObjectAttributes (1624 of 1976) PASS: lldb-unit :: Process/gdb-remote/./ProcessGdbRemoteTests/GDBRemoteCommunicationServerTest.SendErrorResponse_ErrorNumber (1625 of 1976) PASS: lldb-unit :: Symbol/./SymbolTests/LineEntryTest.GetSameLineContiguousAddressRangeNoInlines (1626 of 1976) UNSUPPORTED: lldb-api :: functionalities/tsan/thread_leak/TestTsanThreadLeak.py (1627 of 1976) PASS: lldb-api :: lang/cpp/diamond/TestDiamond.py (1628 of 1976) PASS: lldb-shell :: Expr/TestMultilineExpr.test (1629 of 1976) PASS: lldb-api :: commands/expression/test/TestExprs.py (1630 of 1976) PASS: lldb-shell :: ObjectFile/Breakpad/discontiguous-sections.test (1631 of 1976) PASS: lldb-shell :: SymbolFile/DWARF/debug_loc_and_loclists.s (1632 of 1976) UNSUPPORTED: lldb-api :: functionalities/thread/thread_specific_break_plus_condition/TestThreadSpecificBpPlusCondition.py (1633 of 1976) PASS: lldb-api :: macosx/indirect_symbol/TestIndirectSymbols.py (1634 of 1976) PASS: lldb-unit :: Utility/./UtilityTests/SerializationRountripTest.SerializeDeserializeCStringArrayNullptrElem (1635 of 1976) PASS: lldb-api :: sample_test/TestSampleTest.py (1636 of 1976) PASS: lldb-shell :: SymbolFile/DWARF/DW_AT_loclists_base.s (1637 of 1976) PASS: lldb-unit :: ObjectFile/Breakpad/./ObjectFileBreakpadTests/FileRecord.parse (1638 of 1976) PASS: lldb-api :: functionalities/breakpoint/address_breakpoints/TestBadAddressBreakpoints.py (1639 of 1976) PASS: lldb-api :: macosx/safe-to-func-call/TestSafeFuncCalls.py (1640 of 1976) PASS: lldb-unit :: Expression/./ExpressionTests/CppModuleConfigurationTest.IgnoreLibStdCpp (1641 of 1976) PASS: lldb-shell :: Recognizer/assert.test (1642 of 1976) PASS: lldb-unit :: ScriptInterpreter/Python/./ScriptInterpreterPythonTests/PythonDataObjectsTest.TestPythonByteArray (1643 of 1976) PASS: lldb-unit :: Utility/./UtilityTests/Flags.Clear (1644 of 1976) PASS: lldb-api :: commands/expression/calculator_mode/TestCalculatorMode.py (1645 of 1976) PASS: lldb-unit :: SymbolFile/NativePDB/./SymbolFileNativePDBTests/PDBFPOProgramToDWARFExpressionTests.InvalidAssignmentSingle (1646 of 1976) PASS: lldb-unit :: UnwindAssembly/x86/./UnwindAssemblyx86Tests/Testx86AssemblyInspectionEngine.TestPopR15 (1647 of 1976) PASS: lldb-api :: python_api/sbdata/TestSBData.py (1648 of 1976) PASS: lldb-api :: commands/expression/timeout/TestCallWithTimeout.py (1649 of 1976) PASS: lldb-unit :: Process/gdb-remote/./ProcessGdbRemoteTests/GDBRemoteCommunicationClientTest.GetModulesInfo_UUID20 (1650 of 1976) PASS: lldb-api :: python_api/exprpath_synthetic/TestExprPathSynthetic.py (1651 of 1976) PASS: lldb-api :: functionalities/step_scripted/TestStepScripted.py (1652 of 1976) UNSUPPORTED: lldb-api :: commands/watchpoints/multi_watchpoint_slots/TestWatchpointMultipleSlots.py (1653 of 1976) PASS: lldb-unit :: Process/gdb-remote/./ProcessGdbRemoteTests/GDBRemoteCommunicationClientTest.GetModulesInfo (1654 of 1976) PASS: lldb-api :: functionalities/unwind/noreturn/module-end/TestNoReturnModuleEnd.py (1655 of 1976) PASS: lldb-api :: commands/expression/import-std-module/weak_ptr-dbg-info-content/TestDbgInfoContentWeakPtrFromStdModule.py (1656 of 1976) PASS: lldb-unit :: Utility/./UtilityTests/LogChannelTest.List (1657 of 1976) PASS: lldb-unit :: Language/Highlighting/./HighlighterTests/HighlighterTest.ClangTrailingBackslashMissingNewLine (1658 of 1976) PASS: lldb-unit :: Utility/./UtilityTests/StringListTest.AppendStringStdString (1659 of 1976) PASS: lldb-api :: lang/c/conflicting-symbol/TestConflictingSymbol.py (1660 of 1976) PASS: lldb-unit :: Utility/./UtilityTests/ArgsTest.DoubleQuotedItem (1661 of 1976) PASS: lldb-unit :: Utility/./UtilityTests/VASprintfTest.NoBufferResize (1662 of 1976) PASS: lldb-api :: lang/objcxx/hide-runtime-values/TestObjCXXHideRuntimeValues.py (1663 of 1976) PASS: lldb-unit :: Utility/./UtilityTests/SerializationRountripTest.SerializeDeserializeObjectPointer (1664 of 1976) PASS: lldb-unit :: Utility/./UtilityTests/ScalarTest.CastOperations (1665 of 1976) PASS: lldb-api :: python_api/hello_world/TestHelloWorld.py (1666 of 1976) PASS: lldb-api :: functionalities/avoids-fd-leak/TestFdLeak.py (1667 of 1976) PASS: lldb-unit :: Host/./HostTests/File.GetWaitableHandleFileno (1668 of 1976) PASS: lldb-api :: lang/cpp/function-qualifiers/TestCppFunctionQualifiers.py (1669 of 1976) PASS: lldb-unit :: Expression/./ExpressionTests/DiagnosticManagerTest.HasFixits (1670 of 1976) UNSUPPORTED: lldb-shell :: ScriptInterpreter/Lua/watchpoint_callback.test (1671 of 1976) PASS: lldb-unit :: Utility/./UtilityTests/ScalarTest.Scalar_512 (1672 of 1976) PASS: lldb-api :: functionalities/multidebugger_commands/TestMultipleDebuggersCommands.py (1673 of 1976) PASS: lldb-unit :: Utility/./UtilityTests/Flags.GetBitSize (1674 of 1976) PASS: lldb-api :: functionalities/tail_call_frames/sbapi_support/TestTailCallFrameSBAPI.py (1675 of 1976) PASS: lldb-shell :: ExecControl/StopHook/stop-hook.test (1676 of 1976) UNSUPPORTED: lldb-shell :: SymbolFile/PDB/variables.test (1677 of 1976) PASS: lldb-unit :: ScriptInterpreter/Python/./ScriptInterpreterPythonTests/PythonDataObjectsTest.TestPythonStringToStr (1678 of 1976) PASS: lldb-api :: functionalities/thread/concurrent_events/TestConcurrentTwoWatchpointsOneDelayBreakpoint.py (1679 of 1976) PASS: lldb-api :: functionalities/thread/concurrent_events/TestConcurrentSignalNWatchNBreak.py (1680 of 1976) PASS: lldb-api :: lang/objc/forward-decl/TestForwardDecl.py (1681 of 1976) PASS: lldb-api :: macosx/find-app-in-bundle/TestFindAppInBundle.py (1682 of 1976) PASS: lldb-api :: lang/objc/objc-struct-argument/TestObjCStructArgument.py (1683 of 1976) PASS: lldb-api :: functionalities/data-formatter/setvaluefromcstring/TestSetValueFromCString.py (1684 of 1976) PASS: lldb-shell :: Minidump/memory-region-from-module.yaml (1685 of 1976) PASS: lldb-api :: lang/c/strings/TestCStrings.py (1686 of 1976) PASS: lldb-api :: functionalities/data-formatter/data-formatter-stl/libcxx/optional/TestDataFormatterLibcxxOptional.py (1687 of 1976) PASS: lldb-api :: lang/objc/objc-super/TestObjCSuper.py (1688 of 1976) PASS: lldb-api :: python_api/section/TestSectionAPI.py (1689 of 1976) PASS: lldb-unit :: Utility/./UtilityTests/StringListTest.InsertStringAtIndexEnd (1690 of 1976) PASS: lldb-api :: source-manager/TestSourceManager.py (1691 of 1976) PASS: lldb-api :: functionalities/signal/handle-abrt/TestHandleAbort.py (1692 of 1976) PASS: lldb-unit :: Utility/./UtilityTests/StringExtractorTest.GetHexBytesAvail_OddPair2 (1693 of 1976) PASS: lldb-shell :: SymbolFile/DWARF/dwarf5-atomic.s (1694 of 1976) PASS: lldb-api :: commands/expression/import-std-module/unique_ptr-dbg-info-content/TestUniquePtrDbgInfoContent.py (1695 of 1976) PASS: lldb-api :: commands/expression/argument_passing_restrictions/TestArgumentPassingRestrictions.py (1696 of 1976) PASS: lldb-shell :: SymbolFile/DWARF/DW_OP_piece-smaller-than-struct.s (1697 of 1976) PASS: lldb-unit :: ScriptInterpreter/Python/./ScriptInterpreterPythonTests/PythonDataObjectsTest.TestPythonCallableInvoke (1698 of 1976) PASS: lldb-unit :: Process/minidump/./LLDBMinidumpTests/MinidumpParserTest.GetThreadContext_x86_32 (1699 of 1976) PASS: lldb-shell :: Quit/TestQuitExitCodeImplicit0.test (1700 of 1976) PASS: lldb-unit :: Process/gdb-remote/./ProcessGdbRemoteTests/GDBRemoteCommunicationClientTest.WriteRegister (1701 of 1976) PASS: lldb-api :: lang/mixed/TestMixedLanguages.py (1702 of 1976) PASS: lldb-api :: commands/expression/completion/TestExprCompletion.py (1703 of 1976) PASS: lldb-shell :: SymbolFile/DWARF/find-basic-function.cpp (1704 of 1976) PASS: lldb-unit :: UnwindAssembly/x86/./UnwindAssemblyx86Tests/Testx86AssemblyInspectionEngine.TestSpArithx86_64Augmented (1705 of 1976) PASS: lldb-unit :: UnwindAssembly/x86/./UnwindAssemblyx86Tests/Testx86AssemblyInspectionEngine.TestPushR13 (1706 of 1976) PASS: lldb-unit :: ScriptInterpreter/Python/./ScriptInterpreterPythonTests/PythonDataObjectsTest.TestBorrowedReferences (1707 of 1976) PASS: lldb-api :: functionalities/load_unload/TestLoadUnload.py (1708 of 1976) UNSUPPORTED: lldb-shell :: SymbolFile/target-symbols-add-unwind.test (1709 of 1976) PASS: lldb-unit :: Core/./LLDBCoreTests/RichManglingContextTest.SwitchProvider (1710 of 1976) UNSUPPORTED: lldb-api :: functionalities/data-formatter/data-formatter-stl/libstdcpp/vector/TestDataFormatterStdVector.py (1711 of 1976) PASS: lldb-api :: commands/target/dump-symtab-demangle/TestDumpSymtabDemangle.py (1712 of 1976) PASS: lldb-shell :: SymbolFile/Breakpad/symtab-macho.test (1713 of 1976) UNSUPPORTED: lldb-api :: commands/expression/macros/TestMacros.py (1714 of 1976) PASS: lldb-unit :: UnwindAssembly/x86/./UnwindAssemblyx86Tests/Testx86AssemblyInspectionEngine.TestSpillRegToStackViaMOVi386 (1715 of 1976) PASS: lldb-unit :: Utility/./UtilityTests/StringListTest.RemoveBlankLines (1716 of 1976) PASS: lldb-unit :: Utility/./UtilityTests/RangeTest.SizeTypes (1717 of 1976) PASS: lldb-unit :: Utility/./UtilityTests/RangeTest.ContainsEndInclusiveInvalid (1718 of 1976) UNSUPPORTED: lldb-api :: tools/lldb-server/libraries-svr4/TestGdbRemoteLibrariesSvr4Support.py (1719 of 1976) UNSUPPORTED: lldb-api :: tools/lldb-server/TestGdbRemote_vContThreads.py (1720 of 1976) PASS: lldb-unit :: ScriptInterpreter/Python/./ScriptInterpreterPythonTests/PythonDataObjectsTest.TestPythonTupleInitializerList2 (1721 of 1976) PASS: lldb-api :: tools/lldb-vscode/attach/TestVSCode_attach.py (1722 of 1976) PASS: lldb-api :: functionalities/data-formatter/data-formatter-named-summaries/TestDataFormatterNamedSummaries.py (1723 of 1976) PASS: lldb-api :: functionalities/data-formatter/frameformat_smallstruct/TestFrameFormatSmallStruct.py (1724 of 1976) PASS: lldb-unit :: ScriptInterpreter/Python/./ScriptInterpreterPythonTests/PythonDataObjectsTest.TestPythonTupleSize (1725 of 1976) PASS: lldb-shell :: ObjectFile/ELF/compressed-sections.yaml (1726 of 1976) PASS: lldb-api :: functionalities/optimized_code/TestNoASanExceptionAfterEvalOP_piece.py (1727 of 1976) PASS: lldb-unit :: Symbol/./SymbolTests/TestTypeSystemClang.TestUnifyAccessSpecifiers (1728 of 1976) PASS: lldb-unit :: debugserver/./debugserverTests/RNBSocket.LoopBackListenIPv4 (1729 of 1976) PASS: lldb-unit :: Language/Highlighting/./HighlighterTests/HighlighterTest.ClangOperators (1730 of 1976) PASS: lldb-unit :: Utility/./UtilityTests/FileSpecTest.Match (1731 of 1976) PASS: lldb-unit :: Utility/./UtilityTests/AnsiTerminal.Basic (1732 of 1976) PASS: lldb-unit :: Utility/./UtilityTests/CompletionRequest.TestCompletionOwnership (1733 of 1976) PASS: lldb-unit :: Utility/./UtilityTests/SubsystemRAIITest.SubsystemWithErrorSuccess (1734 of 1976) PASS: lldb-unit :: Utility/./UtilityTests/ArgsTest.TestSingleQuotedArgWithSpace (1735 of 1976) PASS: lldb-unit :: Utility/./UtilityTests/RegisterValueTest.GetSet8 (1736 of 1976) UNSUPPORTED: lldb-shell :: SymbolFile/dissassemble-entry-point.s (1737 of 1976) PASS: lldb-unit :: Utility/./UtilityTests/DeserializerTest.HasData (1738 of 1976) UNSUPPORTED: lldb-api :: functionalities/tsan/cpp_global_location/TestTsanCPPGlobalLocation.py (1739 of 1976) PASS: lldb-unit :: Expression/./ExpressionTests/CppModuleConfigurationTest.AmbiguousLibCpp (1740 of 1976) PASS: lldb-api :: functionalities/thread/concurrent_events/TestConcurrentBreakpointOneDelayBreakpointThreads.py (1741 of 1976) PASS: lldb-unit :: UnwindAssembly/x86/./UnwindAssemblyx86Tests/Testx86AssemblyInspectionEngine.TestPushR15 (1742 of 1976) UNSUPPORTED: lldb-api :: functionalities/darwin_log/basic/TestDarwinLogBasic.py (1743 of 1976) PASS: lldb-api :: commands/expression/no-deadlock/TestExprDoesntBlock.py (1744 of 1976) PASS: lldb-unit :: Expression/./ExpressionTests/DiagnosticManagerTest.GetStringBasic (1745 of 1976) PASS: lldb-unit :: Utility/./UtilityTests/UriParserTest.SchemeHostSeparator2 (1746 of 1976) UNSUPPORTED: lldb-api :: tools/lldb-server/TestGdbRemoteAuxvSupport.py (1747 of 1976) PASS: lldb-api :: tools/lldb-vscode/stackTrace/TestVSCode_stackTrace.py (1748 of 1976) PASS: lldb-api :: commands/frame/diagnose/dereference-this/TestDiagnoseDereferenceThis.py (1749 of 1976) PASS: lldb-unit :: Utility/./UtilityTests/StreamTest.SetIndentLevel (1750 of 1976) PASS: lldb-api :: commands/expression/rdar44436068/Test128BitsInteger.py (1751 of 1976) PASS: lldb-unit :: Process/gdb-remote/./ProcessGdbRemoteTests/GDBRemoteCommunicationClientTest.ReadRegister (1752 of 1976) PASS: lldb-shell :: SymbolFile/NativePDB/tag-types.cpp (1753 of 1976) PASS: lldb-api :: commands/expression/test/TestExprs2.py (1754 of 1976) PASS: lldb-unit :: Language/Highlighting/./HighlighterTests/HighlighterTest.FallbackHighlighter (1755 of 1976) PASS: lldb-unit :: Target/./TargetTests/ExecutionContextTest.GetByteOrder (1756 of 1976) PASS: lldb-api :: functionalities/type_lookup/TestTypeLookup.py (1757 of 1976) PASS: lldb-unit :: Utility/./UtilityTests/LogChannelEnabledTest.log_options (1758 of 1976) PASS: lldb-unit :: Utility/./UtilityTests/LogChannelEnabledTest.LogThread (1759 of 1976) UNSUPPORTED: lldb-api :: functionalities/darwin_log/source/debug/TestDarwinLogSourceDebug.py (1760 of 1976) PASS: lldb-api :: commands/expression/import-std-module/no-std-module/TestMissingStdModule.py (1761 of 1976) PASS: lldb-unit :: UnwindAssembly/x86/./UnwindAssemblyx86Tests/Testx86AssemblyInspectionEngine.Test64bitFramelessSmallStackFrame (1762 of 1976) PASS: lldb-api :: functionalities/fat_archives/TestFatArchives.py (1763 of 1976) PASS: lldb-api :: macosx/find-dsym/deep-bundle/TestDeepBundle.py (1764 of 1976) PASS: lldb-unit :: Utility/./UtilityTests/RangeTest.Copy (1765 of 1976) PASS: lldb-unit :: Host/./HostTests/File.GetStreamFromDescriptor (1766 of 1976) PASS: lldb-api :: lang/objc/orderedset/TestOrderedSet.py (1767 of 1976) PASS: lldb-shell :: SymbolFile/NativePDB/function-types-builtins.cpp (1768 of 1976) PASS: lldb-unit :: Utility/./UtilityTests/TimeoutTest.Construction (1769 of 1976) UNSUPPORTED: lldb-api :: functionalities/data-formatter/data-formatter-stl/libstdcpp/list/TestDataFormatterStdList.py (1770 of 1976) PASS: lldb-api :: python_api/process/read-mem-cstring/TestReadMemCString.py (1771 of 1976) PASS: lldb-unit :: Utility/./UtilityTests/BinaryStreamTest.PutSLEB128FourBytes (1772 of 1976) PASS: lldb-shell :: SymbolFile/DWARF/dir-separator-posix.s (1773 of 1976) PASS: lldb-unit :: UnwindAssembly/x86/./UnwindAssemblyx86Tests/Testx86AssemblyInspectionEngine.TestPopRBP (1774 of 1976) PASS: lldb-unit :: Language/Highlighting/./HighlighterTests/HighlighterTest.ClangPreserveNewLine (1775 of 1976) PASS: lldb-api :: lang/objc/modules-inline-functions/TestModulesInlineFunctions.py (1776 of 1976) PASS: lldb-unit :: Utility/./UtilityTests/CompletionRequest.TryCompleteCurrentArgMode (1777 of 1976) PASS: lldb-unit :: Symbol/./SymbolTests/TestTypeSystemClang.TestDeletingImplicitCopyCstrDueToMoveCStr (1778 of 1976) PASS: lldb-unit :: Utility/./UtilityTests/StringListTest.SplitIntoLinesEmpty (1779 of 1976) PASS: lldb-api :: commands/expression/call-function/TestCallBuiltinFunction.py (1780 of 1976) PASS: lldb-api :: lang/objc/objc-new-syntax/TestObjCNewSyntaxArray.py (1781 of 1976) PASS: lldb-unit :: Utility/./UtilityTests/UriParserTest.SchemeHostSeparator3 (1782 of 1976) PASS: lldb-unit :: Breakpoint/./LLDBBreakpointTests/BreakpointIDTest.StringIsBreakpointName (1783 of 1976) PASS: lldb-unit :: Utility/./UtilityTests/OptionsWithRawTest.EmptySuffix (1784 of 1976) PASS: lldb-unit :: SymbolFile/DWARF/./SymbolFileDWARFTests/SymbolFileDWARFTests.TestAbbrevNullAttrValidForm (1785 of 1976) PASS: lldb-unit :: Utility/./UtilityTests/ConstStringTest.FromMidOfBufferStringRef (1786 of 1976) PASS: lldb-unit :: SymbolFile/NativePDB/./SymbolFileNativePDBTests/PDBFPOProgramToDWARFExpressionTests.InvalidOpUnary (1787 of 1976) PASS: lldb-unit :: Utility/./UtilityTests/TimerTest.CategoryTimes (1788 of 1976) PASS: lldb-api :: lang/objc/modules/TestObjCModules.py (1789 of 1976) PASS: lldb-unit :: Utility/./UtilityTests/OptionsWithRawTest.ArgsButNoDelimiter (1790 of 1976) PASS: lldb-unit :: ObjectFile/ELF/./ObjectFileELFTests/ObjectFileELFTest.SectionsResolveConsistently (1791 of 1976) PASS: lldb-shell :: SymbolFile/DWARF/dwarf5-debug_line.s (1792 of 1976) PASS: lldb-unit :: Utility/./UtilityTests/StreamTest.PutBytesAsRawHex8ToLittleEndian (1793 of 1976) PASS: lldb-unit :: Utility/./UtilityTests/VMRange.SetEndAddress (1794 of 1976) PASS: lldb-api :: sanity/TestModuleCacheSanity.py (1795 of 1976) PASS: lldb-unit :: Process/minidump/./LLDBMinidumpTests/MinidumpParserTest.GetLinuxProcStatus_no_stream (1796 of 1976) PASS: lldb-unit :: Utility/./UtilityTests/NameMatchesTest.Contains (1797 of 1976) PASS: lldb-api :: functionalities/mtc/simple/TestMTCSimple.py (1798 of 1976) PASS: lldb-unit :: UnwindAssembly/x86/./UnwindAssemblyx86Tests/Testx86AssemblyInspectionEngine.TestPushR12 (1799 of 1976) UNSUPPORTED: lldb-api :: functionalities/thread/concurrent_events/TestConcurrentManySignals.py (1800 of 1976) PASS: lldb-unit :: Utility/./UtilityTests/UriParserTest.MinimalPortPath (1801 of 1976) PASS: lldb-api :: lang/cpp/enum_types/TestCPP11EnumTypes.py (1802 of 1976) PASS: lldb-api :: commands/expression/ir-interpreter/TestIRInterpreter.py (1803 of 1976) PASS: lldb-api :: functionalities/breakpoint/breakpoint_ignore_count/TestBreakpointIgnoreCount.py (1804 of 1976) PASS: lldb-shell :: ObjectFile/PECOFF/basic-info-arm.yaml (1805 of 1976) PASS: lldb-api :: lang/objc/modules-non-objc-target/TestObjCModulesNonObjCTarget.py (1806 of 1976) PASS: lldb-api :: lang/objc/foundation/TestSymbolTable.py (1807 of 1976) PASS: lldb-unit :: Utility/./UtilityTests/StringListTest.InsertStringAtIndexStart (1808 of 1976) PASS: lldb-shell :: ObjectFile/ELF/many-sections.s (1809 of 1976) PASS: lldb-api :: python_api/default-constructor/TestDefaultConstructorForAPIObjects.py (1810 of 1976) PASS: lldb-unit :: Core/./LLDBCoreTests/StreamCallbackTest.Callback (1811 of 1976) PASS: lldb-unit :: Utility/./UtilityTests/ScalarTest.APIntConstructor (1812 of 1976) PASS: lldb-unit :: Language/Highlighting/./HighlighterTests/HighlighterTest.ClangCursorPosEndOfLine (1813 of 1976) UNSUPPORTED: lldb-api :: commands/target/auto-install-main-executable/TestAutoInstallMainExecutable.py (1814 of 1976) PASS: lldb-unit :: Utility/./UtilityTests/StreamTest.PutHex32ByteOrderBig (1815 of 1976) PASS: lldb-shell :: ScriptInterpreter/None/import_module.test (1816 of 1976) PASS: lldb-unit :: Utility/./UtilityTests/StreamTest.QuotedCString (1817 of 1976) UNSUPPORTED: lldb-api :: functionalities/data-formatter/data-formatter-stl/libstdcpp/tuple/TestDataFormatterStdTuple.py (1818 of 1976) PASS: lldb-unit :: Utility/./UtilityTests/StatusTest.ErrorConstructor (1819 of 1976) PASS: lldb-unit :: Host/./HostTests/FileSystemTest.MakeAbsolute (1820 of 1976) PASS: lldb-unit :: Language/Highlighting/./HighlighterTests/HighlighterTest.ClangSquareBrackets (1821 of 1976) PASS: lldb-api :: python_api/sbstructureddata/TestStructuredDataAPI.py (1822 of 1976) PASS: lldb-shell :: SymbolFile/Breakpad/line-table-missing-file.test (1823 of 1976) PASS: lldb-unit :: Expression/./ExpressionTests/CppModuleConfigurationTest.Xcode (1824 of 1976) PASS: lldb-api :: python_api/sbtype_typeclass/TestSBTypeTypeClass.py (1825 of 1976) PASS: lldb-api :: functionalities/data-formatter/data-formatter-stl/libcxx/list/TestDataFormatterLibcxxList.py (1826 of 1976) PASS: lldb-api :: functionalities/thread/backtrace_limit/TestBacktraceLimit.py (1827 of 1976) PASS: lldb-unit :: Utility/./UtilityTests/UriParserTest.TypicalPortPathIPv4 (1828 of 1976) PASS: lldb-api :: functionalities/breakpoint/breakpoint_language/TestBreakpointLanguage.py (1829 of 1976) PASS: lldb-unit :: UnwindAssembly/x86/./UnwindAssemblyx86Tests/Testx86AssemblyInspectionEngine.TestAddESP (1830 of 1976) PASS: lldb-unit :: Utility/./UtilityTests/StringListTest.SplitIntoLines (1831 of 1976) PASS: lldb-unit :: ScriptInterpreter/Python/./ScriptInterpreterPythonTests/PythonDataObjectsTest.TestPythonFile (1832 of 1976) UNSUPPORTED: lldb-api :: lang/cpp/function-template-parameter-pack/TestFunctionTemplateParameterPack.py (1833 of 1976) PASS: lldb-unit :: Utility/./UtilityTests/OptionsWithRawTest.MultiWordSuffix (1834 of 1976) PASS: lldb-api :: python_api/name_lookup/TestNameLookup.py (1835 of 1976) PASS: lldb-unit :: Utility/./UtilityTests/StreamTest.AddressPrefix (1836 of 1976) PASS: lldb-api :: functionalities/data-formatter/data-formatter-globals/TestDataFormatterGlobals.py (1837 of 1976) PASS: lldb-api :: functionalities/data-formatter/data-formatter-objc/nsindexpath/TestDataFormatterNSIndexPath.py (1838 of 1976) PASS: lldb-unit :: Utility/./UtilityTests/Flags.AnySet (1839 of 1976) PASS: lldb-unit :: Utility/./UtilityTests/StringExtractorTest.GetHexBytesAvail_OddPair (1840 of 1976) UNSUPPORTED: lldb-api :: commands/register/register/intel_xtended_registers/mpx_bound_violation/TestBoundViolation.py (1841 of 1976) PASS: lldb-api :: functionalities/data-formatter/summary-string-onfail/Test-rdar-9974002.py (1842 of 1976) PASS: lldb-api :: functionalities/process_group/TestChangeProcessGroup.py (1843 of 1976) PASS: lldb-api :: commands/expression/persistent_variables/TestPersistentVariables.py (1844 of 1976) PASS: lldb-api :: lang/cpp/dynamic-value-same-basename/TestDynamicValueSameBase.py (1845 of 1976) PASS: lldb-unit :: Host/./HostTests/SocketTest.DomainListenConnectAccept (1846 of 1976) UNSUPPORTED: lldb-api :: functionalities/darwin_log/filter/exact_match/subsystem/TestDarwinLogFilterMatchSubsystem.py (1847 of 1976) PASS: lldb-unit :: Utility/./UtilityTests/LogChannelEnabledTest.LLDB_LOG_ERROR (1848 of 1976) PASS: lldb-api :: functionalities/breakpoint/cpp/TestCPPBreakpointLocations.py (1849 of 1976) PASS: lldb-api :: lang/c/vla/TestVLA.py (1850 of 1976) PASS: lldb-api :: functionalities/inferior-changed/TestInferiorChanged.py (1851 of 1976) UNSUPPORTED: lldb-api :: functionalities/unwind/ehframe/TestEhFrameUnwind.py (1852 of 1976) UNSUPPORTED: lldb-shell :: Register/aarch64-fp-read.test (1853 of 1976) PASS: lldb-api :: functionalities/signal/raise/TestRaise.py (1854 of 1976) PASS: lldb-shell :: SymbolFile/Breakpad/unwind-via-stack-cfi.test (1855 of 1976) PASS: lldb-api :: lang/cpp/virtual-overload/TestVirtualOverload.py (1856 of 1976) PASS: lldb-unit :: UnwindAssembly/x86/./UnwindAssemblyx86Tests/Testx86AssemblyInspectionEngine.TestSimple64bitFrameFunction (1857 of 1976) PASS: lldb-unit :: Utility/./UtilityTests/BinaryStreamTest.PutULEB128MaxValue (1858 of 1976) PASS: lldb-api :: functionalities/gdb_remote_client/TestIOSSimulator.py (1859 of 1976) PASS: lldb-api :: lang/cpp/constructors/TestCppConstructors.py (1860 of 1976) PASS: lldb-unit :: Host/./HostTests/NativeProcessProtocolTest.SetBreakpointFailVerify (1861 of 1976) PASS: lldb-unit :: Utility/./UtilityTests/StringExtractorTest.GetHexU8_InvalidHex_NoEof (1862 of 1976) PASS: lldb-api :: python_api/type/TestTypeList.py (1863 of 1976) PASS: lldb-api :: python_api/watchpoint/TestWatchpointIgnoreCount.py (1864 of 1976) PASS: lldb-api :: functionalities/thread/concurrent_events/TestConcurrentTwoBreakpointThreads.py (1865 of 1976) PASS: lldb-api :: functionalities/signal/TestSendSignal.py (1866 of 1976) PASS: lldb-api :: terminal/TestSTTYBeforeAndAfter.py (1867 of 1976) PASS: lldb-unit :: Host/./HostTests/MainLoopTest.UnmonitoredSignal (1868 of 1976) PASS: lldb-unit :: Utility/./UtilityTests/StringExtractorTest.GetHexBytes (1869 of 1976) PASS: lldb-shell :: ObjectFile/ELF/section-overlap.yaml (1870 of 1976) PASS: lldb-api :: lang/cpp/namespace/TestNamespace.py (1871 of 1976) UNSUPPORTED: lldb-api :: functionalities/data-formatter/data-formatter-stl/libstdcpp/string/TestDataFormatterStdString.py (1872 of 1976) PASS: lldb-unit :: Process/minidump/./LLDBMinidumpTests/MinidumpParserTest.MinidumpDuplicateModuleMinAddress (1873 of 1976) PASS: lldb-unit :: ScriptInterpreter/Python/./ScriptInterpreterPythonTests/PythonDataObjectsTest.TestPythonBytes (1874 of 1976) PASS: lldb-api :: functionalities/thread/concurrent_events/TestConcurrentWatchBreakDelay.py (1875 of 1976) PASS: lldb-unit :: Utility/./UtilityTests/SerializationRountripTest.SerializeDeserializePod (1876 of 1976) PASS: lldb-api :: functionalities/thread/num_threads/TestNumThreads.py (1877 of 1976) PASS: lldb-shell :: Settings/TestLineMarkerColor.test (1878 of 1976) PASS: lldb-unit :: Host/./HostTests/NativeProcessProtocolTest.SetBreakpointFailRead (1879 of 1976) PASS: lldb-api :: lang/cpp/trivial_abi/TestTrivialABI.py (1880 of 1976) XFAIL: lldb-shell :: SymbolFile/DWARF/find-type-in-function.cpp (1881 of 1976) PASS: lldb-unit :: Utility/./UtilityTests/EventTest.DumpEventDataBytes (1882 of 1976) PASS: lldb-api :: functionalities/thread/step_out/TestThreadStepOut.py (1883 of 1976) PASS: lldb-api :: tools/lldb-server/inferior-crash/TestGdbRemoteSegFault.py (1884 of 1976) PASS: lldb-unit :: ScriptInterpreter/Python/./ScriptInterpreterPythonTests/PythonDataObjectsTest.TestPythonString (1885 of 1976) PASS: lldb-api :: commands/process/attach/attach_denied/TestAttachDenied.py (1886 of 1976) PASS: lldb-api :: functionalities/thread/concurrent_events/TestConcurrentSignalBreak.py (1887 of 1976) PASS: lldb-api :: functionalities/breakpoint/breakpoint_locations/TestBreakpointLocations.py (1888 of 1976) PASS: lldb-unit :: Symbol/./SymbolTests/TestTypeSystemClang.TestFunctionTemplateInRecordConstruction (1889 of 1976) UNSUPPORTED: lldb-shell :: Minidump/Windows/arm-fp-unwind.test (1890 of 1976) PASS: lldb-unit :: Utility/./UtilityTests/DataExtractorTest.GetMaxU64 (1891 of 1976) PASS: lldb-unit :: Utility/./UtilityTests/StreamTeeTest.DefaultConstructor (1892 of 1976) PASS: lldb-api :: functionalities/data-formatter/data-formatter-stl/libcxx/map/TestDataFormatterLibccMap.py (1893 of 1976) PASS: lldb-shell :: Reproducer/TestReuseDirectory.test (1894 of 1976) UNSUPPORTED: lldb-shell :: ExecControl/StopHook/stop-hook-threads.test (1895 of 1976) PASS: lldb-unit :: Utility/./UtilityTests/RangeTest.ContainsEndInclusive (1896 of 1976) PASS: lldb-api :: functionalities/data-formatter/ostypeformatting/TestFormattersOsType.py (1897 of 1976) PASS: lldb-api :: functionalities/gdb_remote_client/TestRestartBug.py (1898 of 1976) PASS: lldb-api :: functionalities/breakpoint/consecutive_breakpoints/TestConsecutiveBreakpoints.py (1899 of 1976) PASS: lldb-api :: tools/lldb-server/TestGdbRemoteRegisterState.py (1900 of 1976) UNSUPPORTED: lldb-shell :: Breakpoint/ppc64-localentry.test (1901 of 1976) PASS: lldb-unit :: Utility/./UtilityTests/TildeExpressionResolver.ResolveFullPath (1902 of 1976) PASS: lldb-api :: commands/expression/pr35310/TestExprsBug35310.py (1903 of 1976) PASS: lldb-api :: macosx/find-dsym/bundle-with-dot-in-filename/TestBundleWithDotInFilename.py (1904 of 1976) PASS: lldb-unit :: Host/./HostTests/NativeProcessProtocolTest.ReadMemoryWithoutTrap (1905 of 1976) PASS: lldb-unit :: Utility/./UtilityTests/StringExtractorTest.GetHexBytes_Partial (1906 of 1976) PASS: lldb-api :: lang/cpp/accelerator-table/TestCPPAccelerator.py (1907 of 1976) PASS: lldb-api :: functionalities/data-formatter/pyobjsynthprovider/TestPyObjSynthProvider.py (1908 of 1976) PASS: lldb-api :: lang/objc/objc-builtin-types/TestObjCBuiltinTypes.py (1909 of 1976) PASS: lldb-unit :: Expression/./ExpressionTests/CppModuleConfigurationTest.UnrelatedLibrary (1910 of 1976) PASS: lldb-shell :: Quit/TestQuitExitCodeHexA.test (1911 of 1976) PASS: lldb-unit :: Utility/./UtilityTests/OptionsWithRawTest.ArgsButNoLeadingDash (1912 of 1976) PASS: lldb-unit :: Utility/./UtilityTests/AnsiTerminal.AtEnd (1913 of 1976) PASS: lldb-unit :: Utility/./UtilityTests/ArgsTest.TestArgv (1914 of 1976) PASS: lldb-api :: functionalities/value_md5_crash/TestValueMD5Crash.py (1915 of 1976) PASS: lldb-shell :: Driver/TestConvenienceVariables.test (1916 of 1976) PASS: lldb-api :: functionalities/conditional_break/TestConditionalBreak.py (1917 of 1976) PASS: lldb-api :: lang/c/unions/TestUnionMembers.py (1918 of 1976) PASS: lldb-unit :: Core/./LLDBCoreTests/MangledTest.EmptyForInvalidName (1919 of 1976) PASS: lldb-api :: tools/lldb-server/TestGdbRemoteProcessInfo.py (1920 of 1976) PASS: lldb-api :: functionalities/data-formatter/data-formatter-objc/nsstring/TestDataFormatterNSString.py (1921 of 1976) PASS: lldb-unit :: Process/gdb-remote/./ProcessGdbRemoteTests/GDBRemoteClientBaseTest.InterruptNoResponse (1922 of 1976) PASS: lldb-api :: commands/expression/codegen-crash-typedefdecl-not-in_declcontext/TestCodegenCrashTypedefDeclNotInDeclContext.py (1923 of 1976) PASS: lldb-unit :: Utility/./UtilityTests/StringListTest.JoinMultiCharSeparator (1924 of 1976) PASS: lldb-shell :: Commands/command-disassemble.s (1925 of 1976) PASS: lldb-api :: tools/lldb-server/inferior-crash/TestGdbRemoteAbort.py (1926 of 1976) PASS: lldb-unit :: Host/./HostTests/FileSystemTest.OpenErrno (1927 of 1976) PASS: lldb-api :: python_api/sblaunchinfo/TestSBLaunchInfo.py (1928 of 1976) PASS: lldb-unit :: Utility/./UtilityTests/StringExtractorTest.GetHexBytesAvail_Partial (1929 of 1976) PASS: lldb-api :: lang/c/tls_globals/TestTlsGlobals.py (1930 of 1976) PASS: lldb-unit :: Utility/./UtilityTests/ArgsTest.TestMultipleArgs (1931 of 1976) PASS: lldb-api :: commands/expression/persistent_types/TestNestedPersistentTypes.py (1932 of 1976) PASS: lldb-unit :: Utility/./UtilityTests/StringListTest.CopyListEmpty (1933 of 1976) PASS: lldb-shell :: SymbolFile/DWARF/debug_aranges-empty-section.s (1934 of 1976) PASS: lldb-api :: python_api/signals/TestSignalsAPI.py (1935 of 1976) XFAIL: lldb-shell :: Register/x86-mm-xmm-read.test (1936 of 1976) PASS: lldb-unit :: Target/./TargetTests/MCBasedABI.MapRegisterName (1937 of 1976) UNSUPPORTED: lldb-api :: functionalities/thread/state/TestThreadStates.py (1938 of 1976) PASS: lldb-unit :: Expression/./ExpressionTests/CppModuleConfigurationTest.MissingLibCpp (1939 of 1976) PASS: lldb-unit :: Utility/./UtilityTests/LogChannelEnabledTest.LogGetLogThread (1940 of 1976) PASS: lldb-api :: functionalities/data-formatter/data-formatter-synth/TestDataFormatterSynth.py (1941 of 1976) PASS: lldb-unit :: ObjectFile/ELF/./ObjectFileELFTests/ObjectFileELFTest.GetModuleSpecifications_EarlySectionHeaders (1942 of 1976) UNSUPPORTED: lldb-api :: tools/lldb-server/TestGdbRemoteModuleInfo.py (1943 of 1976) PASS: lldb-api :: functionalities/dynamic_value_child_count/TestDynamicValueChildCount.py (1944 of 1976) PASS: lldb-api :: commands/expression/import-std-module/deque-dbg-info-content/TestDbgInfoContentDequeFromStdModule.py (1945 of 1976) PASS: lldb-unit :: SymbolFile/DWARF/./SymbolFileDWARFTests/DWARFASTParserClangTests.EnsureAllDIEsInDeclContextHaveBeenParsedParsesOnlyMatchingEntries (1946 of 1976) PASS: lldb-api :: lang/cpp/auto/TestCPPAuto.py (1947 of 1976) PASS: lldb-unit :: UnwindAssembly/x86/./UnwindAssemblyx86Tests/Testx86AssemblyInspectionEngine.TestPushEDX (1948 of 1976) PASS: lldb-api :: api/check_public_api_headers/TestPublicAPIHeaders.py (1949 of 1976) PASS: lldb-shell :: SymbolFile/NativePDB/globals-fundamental.cpp (1950 of 1976) PASS: lldb-unit :: Utility/./UtilityTests/IndexToObjectTest.ObjectForIndex (1951 of 1976) PASS: lldb-api :: commands/expression/namespace_local_var_same_name_obj_c/TestNamespaceLocalVarSameNameObjC.py (1952 of 1976) PASS: lldb-shell :: ObjectFile/ELF/gnu-debuglink.yaml (1953 of 1976) PASS: lldb-api :: lang/objc/foundation/TestObjCMethodsNSArray.py (1954 of 1976) PASS: lldb-unit :: Utility/./UtilityTests/StringListTest.LongestCommonPrefixSingleElement (1955 of 1976) PASS: lldb-unit :: Utility/./UtilityTests/OptionsWithRawTest.EmptySuffixSingleWhitespace (1956 of 1976) PASS: lldb-unit :: Utility/./UtilityTests/RangeDataVector.CustomSort (1957 of 1976) PASS: lldb-unit :: Symbol/./SymbolTests/TestTypeSystemClang.TestGetTypeClassDeclType (1958 of 1976) PASS: lldb-unit :: ScriptInterpreter/Python/./ScriptInterpreterPythonTests/PythonDataObjectsTest.TestPythonTupleInitializerList (1959 of 1976) PASS: lldb-api :: functionalities/inferior-crashing/recursive-inferior/TestRecursiveInferiorStep.py (1960 of 1976) PASS: lldb-unit :: Utility/./UtilityTests/StreamTest.ShiftOperatorChars (1961 of 1976) PASS: lldb-shell :: SymbolFile/DWARF/find-method-local-struct.cpp (1962 of 1976) PASS: lldb-api :: functionalities/tail_call_frames/unambiguous_sequence/TestUnambiguousTailCalls.py (1963 of 1976) PASS: lldb-shell :: ObjectFile/ELF/duplicate-section.yaml (1964 of 1976) PASS: lldb-unit :: Utility/./UtilityTests/RangeDataVector.FindEntryThatContains (1965 of 1976) PASS: lldb-unit :: Utility/./UtilityTests/StringListTest.ForRangeEmpty (1966 of 1976) PASS: lldb-unit :: Host/./HostTests/SocketTest.TCPGetConnectURI (1967 of 1976) PASS: lldb-unit :: Process/minidump/./LLDBMinidumpTests/MinidumpParserTest.GetMemoryRegionInfoFromMemoryList (1968 of 1976) PASS: lldb-unit :: Utility/./UtilityTests/ListenerTest.GetEventWait (1969 of 1976) PASS: lldb-api :: commands/expression/import-std-module/basic/TestImportStdModule.py (1970 of 1976) PASS: lldb-unit :: Utility/./UtilityTests/StringListTest.InsertStringAtIndexStdString (1971 of 1976) PASS: lldb-shell :: ObjectFile/PECOFF/dep-modules.yaml (1972 of 1976) PASS: lldb-shell :: ObjectFile/MachO/subsections.yaml (1973 of 1976) PASS: lldb-unit :: Language/Highlighting/./HighlighterTests/HighlighterTest.ClangComments (1974 of 1976) PASS: lldb-api :: functionalities/data-formatter/data-formatter-script/TestDataFormatterScript.py (1975 of 1976) PASS: lldb-api :: commands/expression/import_builtin_fileid/TestImportBuiltinFileID.py (1976 of 1976)

Hide Details

Testing Time: 4351.86s ******************** Failing Tests (3): lldb-api :: functionalities/ptr_refs/TestPtrRefs.py lldb-api :: python_api/thread/TestThreadAPI.py lldb-api :: lang/objc/ptr_refs/TestPtrRefsObjC.py

Hide Details

Hide Details

Slowest Tests: -------------------------------------------------------------------------- 93.74s: lldb-api :: types/TestLongTypes.py 94.41s: lldb-api :: commands/settings/TestSettings.py 100.97s: lldb-api :: lang/objcxx/objcxx-ivar-vector/TestIvarVector.py 102.18s: lldb-api :: python_api/lldbutil/iter/TestLLDBIterator.py 110.83s: lldb-api :: lang/objc/objc-new-syntax/TestObjCNewSyntaxDictionary.py 111.88s: lldb-api :: lang/objc/foundation/TestObjCMethodsNSError.py 112.55s: lldb-api :: lang/objc/objc-new-syntax/TestObjCNewSyntaxArray.py 113.20s: lldb-api :: lang/objc/foundation/TestObjCMethodsString.py 120.32s: lldb-api :: tools/lldb-server/TestGdbRemote_qThreadStopInfo.py 130.01s: lldb-api :: types/TestLongTypesExpr.py 135.42s: lldb-api :: lang/objc/exceptions/TestObjCExceptions.py 139.88s: lldb-api :: lang/objc/real-definition/TestRealDefinition.py 152.70s: lldb-api :: lang/objc/objc-new-syntax/TestObjCNewSyntaxLiteral.py 163.94s: lldb-api :: lang/cpp/namespace/TestNamespaceLookup.py 214.24s: lldb-api :: lang/objc/foundation/TestObjCMethods.py 217.62s: lldb-api :: lang/objc/hidden-ivars/TestHiddenIvars.py 248.55s: lldb-api :: tools/lldb-server/TestGdbRemoteThreadsInStopReply.py 252.53s: lldb-api :: api/multithreaded/TestMultithreaded.py 274.11s: lldb-api :: lang/cpp/enum_types/TestCPP11EnumTypes.py 359.45s: lldb-api :: tools/lldb-server/TestLldbGdbServer.py

Hide Details

Tests Times: -------------------------------------------------------------------------- [ Range ] :: [ Percentage ] :: [ Count ] -------------------------------------------------------------------------- [ 0s, 20s) :: [********************************** ] :: [1727/1976] [ 20s, 40s) :: [** ] :: [ 132/1976] [ 40s, 60s) :: [* ] :: [ 68/1976] [ 60s, 80s) :: [ ] :: [ 25/1976] [ 80s,100s) :: [ ] :: [ 6/1976] [100s,120s) :: [ ] :: [ 6/1976] [120s,140s) :: [ ] :: [ 3/1976] [140s,160s) :: [ ] :: [ 2/1976] [160s,180s) :: [ ] :: [ 1/1976] [180s,200s) :: [ ] :: [ 0/1976] [200s,220s) :: [ ] :: [ 2/1976] [220s,240s) :: [ ] :: [ 0/1976] [240s,260s) :: [ ] :: [ 2/1976] [260s,280s) :: [ ] :: [ 1/1976] [280s,300s) :: [ ] :: [ 0/1976] [300s,320s) :: [ ] :: [ 0/1976] [320s,340s) :: [ ] :: [ 0/1976] [340s,360s) :: [ ] :: [ 1/1976] Expected Passes : 1800 Expected Failures : 6 Unsupported Tests : 167 Unexpected Failures: 3 FAILED: tools/lldb/test/CMakeFiles/check-lldb-lit cd /Users/buildslave/jenkins/workspace/lldb-cmake-sanitized/lldb-build/tools/lldb/test && /usr/local/bin/python /Users/buildslave/jenkins/workspace/lldb-cmake-sanitized/lldb-build/./bin/llvm-lit -v --time-tests --shuffle --xunit-xml-output=/Users/buildslave/jenkins/workspace/lldb-cmake-sanitized/test/results.xml -v -j 4 --timeout 1200 /Users/buildslave/jenkins/workspace/lldb-cmake-sanitized/lldb-build/tools/lldb/test ninja: build stopped: subcommand failed. Command failed: Command '['/usr/bin/env', 'TERM=vt100', '/usr/local/bin/ninja', '-v', 'check-lldb']' returned non-zero exit status 1. Command: ['/usr/bin/env', 'TERM=vt100', '/usr/local/bin/ninja', '-v', 'check-lldb'] [Pipeline] } [Pipeline] // timeout [Pipeline] } [Pipeline] // stage [Pipeline] stage [Pipeline] { (Declarative: Post Actions) [Pipeline] scanForIssues [Clang (LLVM based)] Sleeping for 5 seconds due to JENKINS-32191... [Clang (LLVM based)] Parsing console log (workspace: '/Users/buildslave/jenkins/workspace/lldb-cmake-sanitized') [Clang (LLVM based)] Successfully parsed console log [Clang (LLVM based)] -> found 4 issues (skipped 0 duplicates) [Clang (LLVM based)] Post processing issues on 'green-dragon-23' with source code encoding 'UTF-8' [Clang (LLVM based)] Creating SCM blamer to obtain author and commit information for affected files [Clang (LLVM based)] Creating SCM miner to obtain statistics for affected repository files [Clang (LLVM based)] Resolving file names for all issues in source directory '/Users/buildslave/jenkins/workspace/lldb-cmake-sanitized' [Clang (LLVM based)] -> resolved paths in source directory (3 found, 0 not found) [Clang (LLVM based)] Resolving module names from module definitions (build.xml, pom.xml, or Manifest.mf files) [Clang (LLVM based)] -> resolved module names for 4 issues [Clang (LLVM based)] Resolving package names (or namespaces) by parsing the affected files [Clang (LLVM based)] -> resolved package names of 3 affected files [Clang (LLVM based)] No filter has been set, publishing all 4 issues [Clang (LLVM based)] Creating fingerprints for all affected code blocks to track issues over different builds [Clang (LLVM based)] -> created fingerprints for 4 issues (skipped 0 issues) [Clang (LLVM based)] Copying affected files to Jenkins' build folder '/Users/Shared/Jenkins/Home/jobs/lldb-cmake-sanitized/builds/1152/files-with-issues' [Clang (LLVM based)] -> 3 copied, 0 not in workspace, 0 not-found, 0 with I/O error [Pipeline] junit Recording test results [Pipeline] } [Pipeline] // stage [Pipeline] } [Pipeline] // withEnv [Pipeline] } [Pipeline] // node [Pipeline] End of Pipeline ERROR: script returned exit code 1 Finished: FAILURE