FailedConsole Output

Skipping 7,769 KB.. Full Log
 1976)
PASS: lldb-shell :: SymbolFile/NativePDB/ast-types.cpp (555 of 1976)
PASS: lldb-api :: macosx/find-dsym/bundle-with-dot-in-filename/TestBundleWithDotInFilename.py (556 of 1976)
PASS: lldb-unit :: Process/gdb-remote/./ProcessGdbRemoteTests/GDBRemoteCommunicationClientTest.SaveRestoreRegistersNoSuffix (557 of 1976)
PASS: lldb-unit :: Symbol/./SymbolTests/TestClangASTImporter.MetadataPropagation (558 of 1976)
PASS: lldb-api :: functionalities/inferior-assert/TestInferiorAssert.py (559 of 1976)
PASS: lldb-unit :: Process/gdb-remote/./ProcessGdbRemoteTests/GDBRemoteCommunicationClientTest.GetModulesInfoInvalidResponse (560 of 1976)
PASS: lldb-api :: functionalities/stats_api/TestStatisticsAPI.py (561 of 1976)
PASS: lldb-unit :: Symbol/./SymbolTests/TestClangASTImporter.CopyDeclTagDecl (562 of 1976)
PASS: lldb-api :: functionalities/inferior-changed/TestInferiorChanged.py (563 of 1976)
PASS: lldb-unit :: Utility/./UtilityTests/EnvironmentTest.EnvpConstruction (564 of 1976)
PASS: lldb-unit :: Language/Highlighting/./HighlighterTests/HighlighterTest.Keywords (565 of 1976)
PASS: lldb-unit :: Utility/./UtilityTests/ArgsTest.AppendArguments (566 of 1976)
PASS: lldb-unit :: Utility/./UtilityTests/LogChannelEnabledTest.LogGetLogThread (567 of 1976)
PASS: lldb-shell :: ObjectFile/ELF/section-permissions.yaml (568 of 1976)
PASS: lldb-api :: commands/command/script_alias/TestCommandScriptAlias.py (569 of 1976)
PASS: lldb-unit :: Target/./TargetTests/PathMappingListTest.RelativeTests (570 of 1976)
PASS: lldb-shell :: ObjectFile/MachO/lc_build_version_notools.yaml (571 of 1976)
PASS: lldb-unit :: UnwindAssembly/x86/./UnwindAssemblyx86Tests/Testx86AssemblyInspectionEngine.TestPopEDI (572 of 1976)
PASS: lldb-unit :: Process/minidump/./LLDBMinidumpTests/MinidumpParserTest.GetFilteredModuleList (573 of 1976)
PASS: lldb-unit :: Utility/./UtilityTests/StringListTest.JoinNonSpace (574 of 1976)
PASS: lldb-shell :: SymbolFile/NativePDB/s_constant.cpp (575 of 1976)
PASS: lldb-api :: functionalities/data-formatter/pyobjsynthprovider/TestPyObjSynthProvider.py (576 of 1976)
PASS: lldb-unit :: Interpreter/./InterpreterTests/OptionArgParserTest.toChar (577 of 1976)
PASS: lldb-unit :: Expression/./ExpressionTests/CppModuleConfigurationTest.Linux (578 of 1976)
PASS: lldb-unit :: Utility/./UtilityTests/StatusTest.Formatv (579 of 1976)
UNSUPPORTED: lldb-shell :: ObjectFile/ELF/minidebuginfo-set-and-hit-breakpoint.test (580 of 1976)
PASS: lldb-unit :: Utility/./UtilityTests/StringListTest.InsertStringAtIndexOutOfBounds (581 of 1976)
PASS: lldb-unit :: ObjectFile/Breakpad/./ObjectFileBreakpadTests/InfoRecord.parse (582 of 1976)
PASS: lldb-unit :: Process/minidump/./LLDBMinidumpTests/RegisterContextMinidump.ConvertMinidumpContext_x86_32 (583 of 1976)
PASS: lldb-api :: functionalities/data-formatter/array_typedef/TestArrayTypedef.py (584 of 1976)
PASS: lldb-unit :: Symbol/./SymbolTests/Type.CompilerContextPattern (585 of 1976)
PASS: lldb-unit :: UnwindAssembly/x86/./UnwindAssemblyx86Tests/Testx86AssemblyInspectionEngine.TestPushRBX (586 of 1976)
PASS: lldb-api :: tools/lldb-vscode/breakpoint/TestVSCode_setBreakpoints.py (587 of 1976)
PASS: lldb-api :: commands/expression/timeout/TestCallWithTimeout.py (588 of 1976)
PASS: lldb-api :: functionalities/postmortem/elf-core/gcore/TestGCore.py (589 of 1976)
PASS: lldb-api :: lang/cpp/bitfields/TestCppBitfields.py (590 of 1976)
PASS: lldb-unit :: Utility/./UtilityTests/StringExtractorTest.GetHexU8_Underflow (591 of 1976)
PASS: lldb-api :: functionalities/data-formatter/data-formatter-objc/TestDataFormatterObjCNSError.py (592 of 1976)
PASS: lldb-shell :: ObjectFile/ELF/PT_LOAD-overlap-section.yaml (593 of 1976)
UNSUPPORTED: lldb-api :: benchmarks/startup/TestStartupDelays.py (594 of 1976)
PASS: lldb-unit :: Utility/./UtilityTests/ArgsTest.TestSingleArgWithQuotedSpace (595 of 1976)
PASS: lldb-unit :: ObjectFile/ELF/./ObjectFileELFTests/ObjectFileELFTest.GetSymtab_NoSymEntryPointArmAddressClass (596 of 1976)
PASS: lldb-unit :: Utility/./UtilityTests/StringListTest.InsertStringAtIndexEnd (597 of 1976)
PASS: lldb-api :: functionalities/data-formatter/data-formatter-categories/TestDataFormatterCategories.py (598 of 1976)
PASS: lldb-api :: functionalities/data-formatter/data-formatter-stl/libcxx/initializerlist/TestInitializerList.py (599 of 1976)
PASS: lldb-api :: commands/expression/import-std-module/basic/TestImportStdModule.py (600 of 1976)
PASS: lldb-api :: functionalities/signal/TestSendSignal.py (601 of 1976)
PASS: lldb-api :: commands/expression/namespace_local_var_same_name_obj_c/TestNamespaceLocalVarSameNameObjC.py (602 of 1976)
PASS: lldb-api :: lang/objc/radar-9691614/TestObjCMethodReturningBOOL.py (603 of 1976)
PASS: lldb-shell :: Quit/TestQuitExitCodeImplicit0.test (604 of 1976)
PASS: lldb-api :: functionalities/data-formatter/nsarraysynth/TestNSArraySynthetic.py (605 of 1976)
PASS: lldb-shell :: SymbolFile/NativePDB/disassembly.cpp (606 of 1976)
PASS: lldb-unit :: ObjectFile/PECOFF/./ObjectFilePECOFFTests/PECallFrameInfoTest.Basic_eh (607 of 1976)
PASS: lldb-api :: lang/objc/single-entry-dictionary/TestObjCSingleEntryDictionary.py (608 of 1976)
PASS: lldb-unit :: Utility/./UtilityTests/DataExtractorTest.GetMaxS64 (609 of 1976)
PASS: lldb-api :: lang/cpp/namespace_conflicts/TestNamespaceConflicts.py (610 of 1976)
PASS: lldb-api :: commands/command/delete/TestCommandDelete.py (611 of 1976)
PASS: lldb-shell :: ObjectFile/ELF/gnu-debuglink.yaml (612 of 1976)
PASS: lldb-unit :: Utility/./UtilityTests/UriParserTest.SchemeHostSeparator2 (613 of 1976)
PASS: lldb-api :: lang/cpp/operator-overload/TestOperatorOverload.py (614 of 1976)
PASS: lldb-unit :: Utility/./UtilityTests/StreamTest.AddressRangeInvalidRange (615 of 1976)
PASS: lldb-shell :: SymbolFile/NativePDB/function-types-builtins.cpp (616 of 1976)
PASS: lldb-shell :: ScriptInterpreter/None/import_module.test (617 of 1976)
PASS: lldb-unit :: Utility/./UtilityTests/SerializationRountripTest.SerializeDeserializeCStringArrayNullptr (618 of 1976)
PASS: lldb-shell :: ObjectFile/PECOFF/section-types.yaml (619 of 1976)
PASS: lldb-unit :: Utility/./UtilityTests/DataExtractorTest.GetCStrUnterminated (620 of 1976)
PASS: lldb-api :: functionalities/tail_call_frames/disambiguate_paths_to_common_sink/TestDisambiguatePathsToCommonSink.py (621 of 1976)
PASS: lldb-unit :: Process/gdb-remote/./ProcessGdbRemoteTests/GDBRemoteClientBaseTest.SendContinueAndLateInterrupt (622 of 1976)
UNSUPPORTED: lldb-api :: api/multiple-debuggers/TestMultipleDebuggers.py (623 of 1976)
PASS: lldb-api :: commands/expression/result_numbering/TestResultNumbering.py (624 of 1976)
PASS: lldb-shell :: Commands/CommandScriptImmediateOutput/CommandScriptImmediateOutputFile.test (625 of 1976)
PASS: lldb-api :: python_api/objc_type/TestObjCType.py (626 of 1976)
PASS: lldb-unit :: Utility/./UtilityTests/StringLexerTest.NextIf (627 of 1976)
PASS: lldb-unit :: UnwindAssembly/x86/./UnwindAssemblyx86Tests/Testx86AssemblyInspectionEngine.TestSpillRegToStackViaMOVi386 (628 of 1976)
PASS: lldb-unit :: Utility/./UtilityTests/UriParserTest.SchemeHostSeparator3 (629 of 1976)
PASS: lldb-unit :: Host/./HostTests/SocketAddressTest.GetAddressInfo (630 of 1976)
PASS: lldb-unit :: Process/gdb-remote/./ProcessGdbRemoteTests/GDBRemoteCommunicationClientTest.GetQOffsets (631 of 1976)
PASS: lldb-unit :: Utility/./UtilityTests/ArgsTest.ReplaceArgumentAtIndexShort (632 of 1976)
PASS: lldb-api :: functionalities/source-map/TestTargetSourceMap.py (633 of 1976)
PASS: lldb-unit :: Utility/./UtilityTests/StringExtractorTest.GetU64LittleEndian (634 of 1976)
UNSUPPORTED: lldb-api :: android/platform/TestDefaultCacheLineSize.py (635 of 1976)
PASS: lldb-api :: functionalities/thread/concurrent_events/TestConcurrentTwoWatchpointsOneDelayBreakpoint.py (636 of 1976)
PASS: lldb-api :: tools/lldb-server/commandline/TestStubSetSID.py (637 of 1976)
PASS: lldb-api :: functionalities/abbreviation/TestAbbreviations.py (638 of 1976)
PASS: lldb-unit :: Utility/./UtilityTests/StringListTest.Join (639 of 1976)
PASS: lldb-unit :: Host/./HostTests/MainLoopTest.UnmonitoredSignal (640 of 1976)
PASS: lldb-unit :: Symbol/./SymbolTests/TestTypeSystemClang.TestGetTypeClassTypeOfExpr (641 of 1976)
PASS: lldb-unit :: Process/gdb-remote/./ProcessGdbRemoteTests/GDBRemoteCommunicationClientTest.SendGetDataPacket (642 of 1976)
PASS: lldb-unit :: Utility/./UtilityTests/FileSpecTest.EqualSeparator (643 of 1976)
PASS: lldb-unit :: Utility/./UtilityTests/UriParserTest.TypicalPortPathIPv6 (644 of 1976)
PASS: lldb-api :: python_api/interpreter/TestCommandInterpreterAPI.py (645 of 1976)
PASS: lldb-shell :: ObjectFile/PECOFF/symbol.yaml (646 of 1976)
PASS: lldb-shell :: SymbolFile/DWARF/find-basic-type.cpp (647 of 1976)
PASS: lldb-api :: macosx/indirect_symbol/TestIndirectSymbols.py (648 of 1976)
PASS: lldb-api :: python_api/findvalue_duplist/TestSBFrameFindValue.py (649 of 1976)
PASS: lldb-unit :: Utility/./UtilityTests/GeneratorTest.GetOrCreate (650 of 1976)
UNSUPPORTED: lldb-shell :: SymbolFile/PDB/expressions.test (651 of 1976)
PASS: lldb-api :: commands/expression/radar_9531204/TestPrintfAfterUp.py (652 of 1976)
PASS: lldb-api :: functionalities/data-formatter/data-formatter-globals/TestDataFormatterGlobals.py (653 of 1976)
PASS: lldb-unit :: Utility/./UtilityTests/ArgsTest.TestArgv (654 of 1976)
PASS: lldb-api :: lang/cpp/function-qualifiers/TestCppFunctionQualifiers.py (655 of 1976)
PASS: lldb-api :: functionalities/gdb_remote_client/TestqOffsets.py (656 of 1976)
PASS: lldb-api :: functionalities/postmortem/elf-core/TestLinuxCore.py (657 of 1976)
PASS: lldb-unit :: Utility/./UtilityTests/UriParserTest.BracketedHostnameWithPortIPv6 (658 of 1976)
PASS: lldb-unit :: Utility/./UtilityTests/Predicate.WaitForValueEqualTo (659 of 1976)
PASS: lldb-unit :: Language/Highlighting/./HighlighterTests/HighlighterTest.HighlighterSelectionType (660 of 1976)
PASS: lldb-unit :: Host/./HostTests/SocketTest.TCPListen0GetPort (661 of 1976)
PASS: lldb-shell :: SymbolFile/DWARF/find-variable-dwo.cpp (662 of 1976)
UNSUPPORTED: lldb-shell :: Register/x86-ymm-read.test (663 of 1976)
PASS: lldb-unit :: Utility/./UtilityTests/Predicate.WaitForValueNotEqualTo (664 of 1976)
PASS: lldb-unit :: ObjectFile/PECOFF/./ObjectFilePECOFFTests/PECallFrameInfoTest.Frame_reg_eh (665 of 1976)
PASS: lldb-shell :: Commands/command-backtrace.test (666 of 1976)
PASS: lldb-api :: functionalities/data-formatter/data-formatter-smart-array/TestDataFormatterSmartArray.py (667 of 1976)
PASS: lldb-api :: functionalities/thread/step_out/TestThreadStepOut.py (668 of 1976)
PASS: lldb-api :: functionalities/data-formatter/data-formatter-objc/TestDataFormatterObjCNSDate.py (669 of 1976)
PASS: lldb-unit :: SymbolFile/NativePDB/./SymbolFileNativePDBTests/PDBFPOProgramToDWARFExpressionTests.UnsupportedRASearch (670 of 1976)
PASS: lldb-unit :: ScriptInterpreter/Python/./ScriptInterpreterPythonTests/PythonDataObjectsTest.TestPythonTupleValues (671 of 1976)
PASS: lldb-unit :: Target/./TargetTests/MemoryRegionInfoTest.Formatv (672 of 1976)
PASS: lldb-api :: lang/objc/modules-non-objc-target/TestObjCModulesNonObjCTarget.py (673 of 1976)
PASS: lldb-unit :: Utility/./UtilityTests/StringListTest.GetMaxStringLengthMixed (674 of 1976)
PASS: lldb-shell :: SymbolFile/DWARF/dwp-debug-types.s (675 of 1976)
PASS: lldb-unit :: Utility/./UtilityTests/StreamTest.AddressNoSuffix (676 of 1976)
PASS: lldb-unit :: Utility/./UtilityTests/RangeTest.ContainsAddr (677 of 1976)
PASS: lldb-unit :: Utility/./UtilityTests/BinaryStreamTest.PutSLEB128FiveBytes (678 of 1976)
PASS: lldb-api :: functionalities/gdb_remote_client/TestRecognizeBreakpoint.py (679 of 1976)
PASS: lldb-unit :: Symbol/./SymbolTests/PostfixExpression.ParseOneExpression (680 of 1976)
PASS: lldb-unit :: tools/lldb-server/tests/./LLDBServerTests/TestBase.LaunchModePreservesEnvironment (681 of 1976)
PASS: lldb-shell :: Minidump/dump-all.test (682 of 1976)
PASS: lldb-shell :: Recognizer/assert.test (683 of 1976)
PASS: lldb-shell :: SymbolFile/DWARF/debug_rnglists.s (684 of 1976)
PASS: lldb-shell :: Quit/TestQuitExitCodeHex0.test (685 of 1976)
PASS: lldb-unit :: Utility/./UtilityTests/StreamTest.PutULEB128 (686 of 1976)
PASS: lldb-unit :: ScriptInterpreter/Python/./ScriptInterpreterPythonTests/PythonDataObjectsTest.TestPythonListManipulation (687 of 1976)
PASS: lldb-shell :: SymbolFile/DWARF/parallel-indexing-stress.s (688 of 1976)
PASS: lldb-unit :: Utility/./UtilityTests/StreamTest.PutCharWhitespace (689 of 1976)
PASS: lldb-api :: functionalities/data-formatter/data-formatter-stl/libcxx/tuple/TestDataFormatterLibcxxTuple.py (690 of 1976)
PASS: lldb-unit :: ScriptInterpreter/Python/./ScriptInterpreterPythonTests/PythonDataObjectsTest.TestPythonStringToStructuredString (691 of 1976)
PASS: lldb-unit :: Utility/./UtilityTests/StringLexerTest.GetUnlexed (692 of 1976)
PASS: lldb-unit :: Utility/./UtilityTests/BinaryStreamTest.PutSLEB128NineBytes (693 of 1976)
PASS: lldb-api :: functionalities/gdb_remote_client/TestRestartBug.py (694 of 1976)
PASS: lldb-api :: functionalities/process_group/TestChangeProcessGroup.py (695 of 1976)
PASS: lldb-api :: lang/objc/foundation/TestObjCMethodsNSError.py (696 of 1976)
PASS: lldb-api :: api/check_public_api_headers/TestPublicAPIHeaders.py (697 of 1976)
PASS: lldb-unit :: Utility/./UtilityTests/CompletionRequest.TryCompleteCurrentArgMode (698 of 1976)
PASS: lldb-shell :: SymbolFile/NativePDB/bitfields.cpp (699 of 1976)
PASS: lldb-unit :: Utility/./UtilityTests/VMRange.Comparison (700 of 1976)
PASS: lldb-shell :: SymbolFile/Breakpad/unwind-via-stack-cfi.test (701 of 1976)
PASS: lldb-api :: lang/c/inlines/TestRedefinitionsInInlines.py (702 of 1976)
PASS: lldb-shell :: Driver/TestCore.test (703 of 1976)
PASS: lldb-api :: python_api/lldbutil/iter/TestLLDBIterator.py (704 of 1976)
PASS: lldb-unit :: Utility/./UtilityTests/ArgsTest.TestTrailingBackslash (705 of 1976)
PASS: lldb-api :: functionalities/unwind/sigtramp/TestSigtrampUnwind.py (706 of 1976)
PASS: lldb-api :: functionalities/data-formatter/ostypeformatting/TestFormattersOsType.py (707 of 1976)
PASS: lldb-unit :: Utility/./UtilityTests/StringExtractorTest.DecodeHexU8_Underflow2 (708 of 1976)
PASS: lldb-unit :: Utility/./UtilityTests/ArgsTest.TestQuotedTrailingBackslash (709 of 1976)
PASS: lldb-api :: functionalities/data-formatter/data-formatter-objc/TestDataFormatterObjNSException.py (710 of 1976)
PASS: lldb-unit :: Utility/./UtilityTests/RecordReplayTest.InstrumentedBar (711 of 1976)
PASS: lldb-unit :: Host/./HostTests/HostInfoTest.GetHostname (712 of 1976)
PASS: lldb-api :: functionalities/gdb_remote_client/TestJLink6Armv7RegisterDefinition.py (713 of 1976)
PASS: lldb-shell :: BuildScript/compiler-full-path.test (714 of 1976)
PASS: lldb-api :: functionalities/unwind/zeroth_frame/TestZerothFrame.py (715 of 1976)
PASS: lldb-api :: functionalities/set-data/TestSetData.py (716 of 1976)
PASS: lldb-unit :: Utility/./UtilityTests/StringListTest.ForRange (717 of 1976)
PASS: lldb-unit :: Utility/./UtilityTests/ArchSpecTest.TripleComponentsWereSpecified (718 of 1976)
PASS: lldb-api :: lang/cpp/breakpoint-commands/TestCPPBreakpointCommands.py (719 of 1976)
PASS: lldb-api :: functionalities/process_crash_info/TestProcessCrashInfo.py (720 of 1976)
PASS: lldb-unit :: Expression/./ExpressionTests/CppModuleConfigurationTest.Sysroot (721 of 1976)
PASS: lldb-unit :: Utility/./UtilityTests/RangeDataVector.FindEntryThatContains (722 of 1976)
UNSUPPORTED: lldb-shell :: Register/aarch64-fp-read.test (723 of 1976)
PASS: lldb-unit :: Utility/./UtilityTests/ScalarTest.Equality (724 of 1976)
UNSUPPORTED: lldb-api :: functionalities/asan/TestReportData.py (725 of 1976)
PASS: lldb-shell :: SymbolFile/DWARF/debug_loclists-dwo.s (726 of 1976)
PASS: lldb-shell :: SymbolFile/DWARF/dir-separator-no-comp-dir-relative-name.s (727 of 1976)
PASS: lldb-unit :: Utility/./UtilityTests/StateTest.Formatv (728 of 1976)
PASS: lldb-api :: python_api/value/empty_class/TestValueAPIEmptyClass.py (729 of 1976)
PASS: lldb-unit :: Utility/./UtilityTests/StreamTeeTest.SetStreamAtIndexOutOfBounds (730 of 1976)
PASS: lldb-api :: functionalities/breakpoint/breakpoint_hit_count/TestBreakpointHitCount.py (731 of 1976)
PASS: lldb-api :: lang/cpp/dynamic-value/TestCppValueCast.py (732 of 1976)
PASS: lldb-unit :: Utility/./UtilityTests/EventTest.DumpEventDataBytes (733 of 1976)
PASS: lldb-api :: lang/cpp/accelerator-table/TestCPPAccelerator.py (734 of 1976)
PASS: lldb-unit :: Language/Highlighting/./HighlighterTests/HighlighterTest.ClangCursorPosBeforeOtherToken (735 of 1976)
PASS: lldb-api :: commands/expression/completion-crash-incomplete-record/TestCompletionCrashIncompleteRecord.py (736 of 1976)
PASS: lldb-api :: lang/objc/modules-update/TestClangModulesUpdate.py (737 of 1976)
PASS: lldb-api :: sample_test/TestSampleInlineTest.py (738 of 1976)
PASS: lldb-api :: commands/expression/call-function/TestCallStopAndContinue.py (739 of 1976)
PASS: lldb-unit :: Utility/./UtilityTests/CompletionRequest.ShiftArguments (740 of 1976)
PASS: lldb-unit :: Utility/./UtilityTests/TimerTest.CategoryTimes2 (741 of 1976)
PASS: lldb-api :: functionalities/thread/jump/TestThreadJump.py (742 of 1976)
PASS: lldb-api :: python_api/frame/inlines/TestInlinedFrame.py (743 of 1976)
UNSUPPORTED: lldb-shell :: Breakpoint/case-insensitive.test (744 of 1976)
PASS: lldb-unit :: Utility/./UtilityTests/SerializationRountripTest.SerializeDeserializePod (745 of 1976)
PASS: lldb-shell :: SymbolFile/DWARF/gnu-style-compression.cpp (746 of 1976)
UNSUPPORTED: lldb-api :: benchmarks/expression/TestExpressionCmd.py (747 of 1976)
PASS: lldb-shell :: ScriptInterpreter/None/none.test (748 of 1976)
PASS: lldb-shell :: Minidump/fb-dump.test (749 of 1976)
UNSUPPORTED: lldb-api :: tools/lldb-server/thread-name/TestGdbRemoteThreadName.py (750 of 1976)
UNSUPPORTED: lldb-shell :: SymbolFile/DWARF/debug-types-expressions.test (751 of 1976)
PASS: lldb-api :: functionalities/postmortem/netbsd-core/TestNetBSDCore.py (752 of 1976)
PASS: lldb-unit :: SymbolFile/NativePDB/./SymbolFileNativePDBTests/PDBFPOProgramToDWARFExpressionTests.InvalidOpBinary (753 of 1976)
PASS: lldb-unit :: Utility/./UtilityTests/SerializationRountripTest.SerializeDeserializeObjectPointer (754 of 1976)
PASS: lldb-api :: functionalities/data-formatter/nsdictionarysynth/TestNSDictionarySynthetic.py (755 of 1976)
PASS: lldb-unit :: Host/./HostTests/NativeProcessProtocolTest.SetBreakpointFailVerify (756 of 1976)
PASS: lldb-api :: lang/cpp/constructors/TestCppConstructors.py (757 of 1976)
PASS: lldb-unit :: Utility/./UtilityTests/StringExtractorTest.GetU32LittleEndian (758 of 1976)
PASS: lldb-unit :: Utility/./UtilityTests/SerializationRountripTest.SerializeDeserializeCString (759 of 1976)
PASS: lldb-unit :: ScriptInterpreter/Python/./ScriptInterpreterPythonTests/PythonDataObjectsTest.TestPythonString (760 of 1976)
PASS: lldb-unit :: Utility/./UtilityTests/CompletionRequest.TryCompleteCurrentArgBad (761 of 1976)
PASS: lldb-api :: commands/expression/import-std-module/no-std-module/TestMissingStdModule.py (762 of 1976)
PASS: lldb-shell :: Breakpoint/case-sensitive.test (763 of 1976)
PASS: lldb-unit :: Symbol/./SymbolTests/DWARFCallFrameInfoTest.Basic_dwarf4 (764 of 1976)
PASS: lldb-unit :: Utility/./UtilityTests/ScalarTest.Scalar_512 (765 of 1976)
PASS: lldb-api :: functionalities/data-formatter/data-formatter-stl/libcxx/string/TestDataFormatterLibcxxString.py (766 of 1976)
PASS: lldb-unit :: Host/./HostTests/TaskPoolTest.TaskMap (767 of 1976)
PASS: lldb-api :: types/TestIntegerTypeExpr.py (768 of 1976)
PASS: lldb-shell :: SymbolFile/DWARF/find-variable-file.cpp (769 of 1976)
PASS: lldb-api :: functionalities/postmortem/minidump-new/TestMiniDumpUUID.py (770 of 1976)
PASS: lldb-shell :: Reproducer/TestVersionCheck.test (771 of 1976)
PASS: lldb-unit :: Utility/./UtilityTests/StringListTest.SplitIntoLinesEmpty (772 of 1976)
PASS: lldb-shell :: ObjectFile/PECOFF/uuid.yaml (773 of 1976)
PASS: lldb-api :: commands/expression/scoped_enums/TestScopedEnumType.py (774 of 1976)
PASS: lldb-unit :: Utility/./UtilityTests/LogChannelTest.Enable (775 of 1976)
PASS: lldb-unit :: Process/gdb-remote/./ProcessGdbRemoteTests/GDBRemoteCommunicationClientTest.SyncThreadState (776 of 1976)
PASS: lldb-unit :: Utility/./UtilityTests/RangeTest.DoesAdjoinOrIntersect (777 of 1976)
PASS: lldb-unit :: Host/./HostTests/FileSystemTest.GetByteSize (778 of 1976)
PASS: lldb-shell :: SymbolFile/DWARF/dwarf5-partial-index.cpp (779 of 1976)
PASS: lldb-api :: python_api/lldbutil/process/TestPrintStackTraces.py (780 of 1976)
UNSUPPORTED: lldb-shell :: SymbolFile/PDB/variables-locations.test (781 of 1976)
PASS: lldb-unit :: Utility/./UtilityTests/StringExtractorTest.GetHexBytesAvail_Partial (782 of 1976)
PASS: lldb-api :: functionalities/gdb_remote_client/TestThreadSelectionBug.py (783 of 1976)
PASS: lldb-shell :: ObjectFile/wasm/unified-debug-sections.yaml (784 of 1976)
UNSUPPORTED: lldb-api :: functionalities/darwin_log/filter/regex/activity/TestDarwinLogFilterRegexActivity.py (785 of 1976)
PASS: lldb-api :: commands/expression/import-std-module/deque-basic/TestDequeFromStdModule.py (786 of 1976)
PASS: lldb-unit :: Host/./HostTests/FileActionTest.Open (787 of 1976)
UNSUPPORTED: lldb-shell :: ScriptInterpreter/Lua/independent_state.test (788 of 1976)
PASS: lldb-api :: commands/frame/diagnose/dereference-argument/TestDiagnoseDereferenceArgument.py (789 of 1976)
PASS: lldb-api :: functionalities/data-formatter/data-formatter-objc/TestDataFormatterObjCNSContainer.py (790 of 1976)
PASS: lldb-unit :: Utility/./UtilityTests/ScalarTest.GetBytes (791 of 1976)
PASS: lldb-unit :: Utility/./UtilityTests/BinaryStreamTest.PutSLEB128TwoBytes (792 of 1976)
PASS: lldb-unit :: ScriptInterpreter/Python/./ScriptInterpreterPythonTests/PythonDataObjectsTest.TestPythonTupleInitializerList (793 of 1976)
PASS: lldb-api :: functionalities/data-formatter/data-formatter-disabling/TestDataFormatterDisabling.py (794 of 1976)
PASS: lldb-unit :: UnwindAssembly/x86/./UnwindAssemblyx86Tests/Testx86AssemblyInspectionEngine.TestPush0 (795 of 1976)
PASS: lldb-shell :: Commands/CommandScriptImmediateOutput/CommandScriptImmediateOutputConsole.test (796 of 1976)
PASS: lldb-unit :: Utility/./UtilityTests/StreamTest.ShiftOperatorChars (797 of 1976)
PASS: lldb-unit :: Utility/./UtilityTests/ArchSpecTest.TestParseMachCPUDashSubtypeTripleExtra (798 of 1976)
UNSUPPORTED: lldb-api :: lang/objc/rdar-12408181/TestRdar12408181.py (799 of 1976)
PASS: lldb-unit :: ScriptInterpreter/Python/./ScriptInterpreterPythonTests/PythonDataObjectsTest.TestPythonIntegerToStr (800 of 1976)
PASS: lldb-unit :: Utility/./UtilityTests/AnsiTerminal.WhiteSpace (801 of 1976)
PASS: lldb-api :: lang/objc/modules-auto-import/TestModulesAutoImport.py (802 of 1976)
PASS: lldb-shell :: SymbolFile/DWARF/debug-types-dwarf5.s (803 of 1976)
PASS: lldb-api :: functionalities/data-formatter/data-formatter-stl/libcxx/atomic/TestLibCxxAtomic.py (804 of 1976)
PASS: lldb-unit :: Process/minidump/./LLDBMinidumpTests/MinidumpParserTest.MinidumpModuleOrder (805 of 1976)
PASS: lldb-api :: functionalities/thread/create_after_attach/TestCreateAfterAttach.py (806 of 1976)
PASS: lldb-unit :: Expression/./ExpressionTests/CppModuleConfigurationTest.UnknownLibCppFile (807 of 1976)
PASS: lldb-api :: functionalities/abbreviation/TestCommonShortSpellings.py (808 of 1976)
PASS: lldb-api :: lang/cpp/const_this/TestConstThis.py (809 of 1976)
PASS: lldb-api :: functionalities/thread/concurrent_events/TestConcurrentNWatchNBreak.py (810 of 1976)
PASS: lldb-unit :: Host/./HostTests/MainLoopTest.Signal (811 of 1976)
PASS: lldb-unit :: Utility/./UtilityTests/UriParserTest.MinimalPath (812 of 1976)
PASS: lldb-api :: functionalities/thread/concurrent_events/TestConcurrentSignalBreak.py (813 of 1976)
PASS: lldb-unit :: Utility/./UtilityTests/ArgsTest.TestOverwriteArgs (814 of 1976)
PASS: lldb-api :: tools/lldb-server/commandline/TestStubReverseConnect.py (815 of 1976)
PASS: lldb-api :: functionalities/data-formatter/summary-string-onfail/Test-rdar-9974002.py (816 of 1976)
PASS: lldb-api :: functionalities/breakpoint/dummy_target_breakpoints/TestBreakpointsWithNoTargets.py (817 of 1976)
PASS: lldb-shell :: SymbolFile/DWARF/find-basic-variable.cpp (818 of 1976)
PASS: lldb-unit :: Utility/./UtilityTests/Flags.GetBitSize (819 of 1976)
UNSUPPORTED: lldb-api :: commands/register/register/intel_xtended_registers/mpx_offset_intersection/TestMPXOffsetIntersection.py (820 of 1976)
PASS: lldb-unit :: Utility/./UtilityTests/OptionsWithRawTest.EmptyInput (821 of 1976)
PASS: lldb-shell :: ObjectFile/Breakpad/sections.test (822 of 1976)
PASS: lldb-unit :: Utility/./UtilityTests/CompletionRequest.Constructor (823 of 1976)
PASS: lldb-api :: lang/objc/self/TestObjCSelf.py (824 of 1976)
PASS: lldb-unit :: Host/./HostTests/SocketTest.DomainGetConnectURI (825 of 1976)
PASS: lldb-unit :: Utility/./UtilityTests/BinaryStreamTest.PutSLEB128MaxValue (826 of 1976)
PASS: lldb-shell :: Reproducer/Functionalities/TestDataFormatter.test (827 of 1976)
PASS: lldb-unit :: Utility/./UtilityTests/StatusTest.ErrorConstructor (828 of 1976)
PASS: lldb-unit :: Target/./TargetTests/ExecutionContextTest.GetByteOrderProcess (829 of 1976)
PASS: lldb-api :: python_api/value_var_update/TestValueVarUpdate.py (830 of 1976)
PASS: lldb-unit :: UnwindAssembly/x86/./UnwindAssemblyx86Tests/Testx86AssemblyInspectionEngine.TestCALLNextInsn (831 of 1976)
PASS: lldb-unit :: Utility/./UtilityTests/RangeTest.ContainsRangeStartingFromZero (832 of 1976)
PASS: lldb-unit :: Process/gdb-remote/./ProcessGdbRemoteTests/GDBRemoteCommunicationClientTest.ReadRegister (833 of 1976)
PASS: lldb-unit :: SymbolFile/NativePDB/./SymbolFileNativePDBTests/PDBFPOProgramToDWARFExpressionTests.InvalidAssignmentMultiple (834 of 1976)
UNSUPPORTED: lldb-api :: commands/expression/macros/TestMacros.py (835 of 1976)
PASS: lldb-shell :: Breakpoint/debug_rnglist_basic.test (836 of 1976)
PASS: lldb-api :: lang/c/struct_types/TestStructTypes.py (837 of 1976)
PASS: lldb-unit :: Language/Highlighting/./HighlighterTests/HighlighterTest.Colons (838 of 1976)
UNSUPPORTED: lldb-api :: functionalities/param_entry_vals/basic_entry_values_x86_64/TestBasicEntryValuesX86_64.py (839 of 1976)
PASS: lldb-unit :: UnwindAssembly/x86/./UnwindAssemblyx86Tests/Testx86AssemblyInspectionEngine.Testi386IgnoredRegisters (840 of 1976)
PASS: lldb-api :: functionalities/thread/backtrace_limit/TestBacktraceLimit.py (841 of 1976)
PASS: lldb-api :: functionalities/fat_archives/TestFatArchives.py (842 of 1976)
PASS: lldb-shell :: Breakpoint/split-dwarf-5-addrbase.test (843 of 1976)
PASS: lldb-unit :: debugserver/./debugserverTests/JSON.Parse (844 of 1976)
PASS: lldb-unit :: Utility/./UtilityTests/GeneratorTest.Get (845 of 1976)
PASS: lldb-api :: functionalities/postmortem/minidump-new/TestMiniDumpNew.py (846 of 1976)
PASS: lldb-unit :: Process/minidump/./LLDBMinidumpTests/MinidumpParserTest.FindMemoryRange (847 of 1976)
PASS: lldb-api :: functionalities/avoids-fd-leak/TestFdLeak.py (848 of 1976)
UNSUPPORTED: lldb-api :: functionalities/darwin_log/filter/regex/message/TestDarwinLogFilterRegexMessage.py (849 of 1976)
PASS: lldb-shell :: SymbolFile/NativePDB/ast-functions.cpp (850 of 1976)
PASS: lldb-unit :: Host/./HostTests/TaskPoolTest.RunTasks (851 of 1976)
PASS: lldb-api :: commands/disassemble/basic/TestFrameDisassemble.py (852 of 1976)
PASS: lldb-api :: commands/settings/TestSettings.py (853 of 1976)
PASS: lldb-api :: functionalities/gdb_remote_client/TestWriteMemory.py (854 of 1976)
PASS: lldb-unit :: Utility/./UtilityTests/ReproducerTest.SetCapture (855 of 1976)
PASS: lldb-api :: commands/target/create-no-such-arch/TestNoSuchArch.py (856 of 1976)
PASS: lldb-api :: commands/command/script/TestCommandScript.py (857 of 1976)
PASS: lldb-unit :: ScriptInterpreter/Python/./ScriptInterpreterPythonTests/PythonDataObjectsTest.TestPythonTupleSize (858 of 1976)
PASS: lldb-shell :: Unwind/eh-frame-dwarf-unwind.test (859 of 1976)
PASS: lldb-shell :: Commands/command-disassemble.s (860 of 1976)
PASS: lldb-unit :: Utility/./UtilityTests/RangeTest.EqualInvalid (861 of 1976)
PASS: lldb-unit :: Expression/./ExpressionTests/DiagnosticManagerTest.GetStringSeverityLabels (862 of 1976)
PASS: lldb-unit :: Language/Highlighting/./HighlighterTests/HighlighterTest.HighlighterSelectionPath (863 of 1976)
PASS: lldb-api :: functionalities/data-formatter/vector-types/TestVectorTypesFormatting.py (864 of 1976)
PASS: lldb-api :: commands/watchpoints/watchpoint_commands/command/TestWatchpointCommandPython.py (865 of 1976)
PASS: lldb-unit :: Utility/./UtilityTests/ProcessInstanceInfo.Yaml (866 of 1976)
PASS: lldb-unit :: Utility/./UtilityTests/ProcessInstanceInfo.DumpTable (867 of 1976)
PASS: lldb-api :: commands/expression/completion/TestExprCompletion.py (868 of 1976)
PASS: lldb-api :: commands/frame/diagnose/array/TestArray.py (869 of 1976)
PASS: lldb-unit :: Utility/./UtilityTests/RegularExpression.Empty (870 of 1976)
PASS: lldb-unit :: UnwindAssembly/x86/./UnwindAssemblyx86Tests/Testx86AssemblyInspectionEngine.TestPushR12 (871 of 1976)
PASS: lldb-api :: commands/frame/diagnose/dereference-this/TestDiagnoseDereferenceThis.py (872 of 1976)
PASS: lldb-api :: sanity/TestSettingSkipping.py (873 of 1976)
PASS: lldb-unit :: UnwindAssembly/x86/./UnwindAssemblyx86Tests/Testx86AssemblyInspectionEngine.TestPushECX (874 of 1976)
PASS: lldb-api :: tools/lldb-server/TestAppleSimulatorOSType.py (875 of 1976)
PASS: lldb-api :: commands/expression/import-std-module/sysroot/TestStdModuleSysroot.py (876 of 1976)
PASS: lldb-shell :: SymbolFile/DWARF/find-qualified-variable.cpp (877 of 1976)
UNSUPPORTED: lldb-shell :: ScriptInterpreter/Lua/watchpoint_callback.test (878 of 1976)
PASS: lldb-unit :: Utility/./UtilityTests/ArgsTest.DoubleQuotedItem (879 of 1976)
PASS: lldb-api :: functionalities/step_scripted/TestStepScripted.py (880 of 1976)
PASS: lldb-unit :: Utility/./UtilityTests/StreamTest.AddressSuffix (881 of 1976)
PASS: lldb-shell :: ObjectFile/ELF/PT_LOAD-overlap-PT_TLS.yaml (882 of 1976)
PASS: lldb-shell :: Reproducer/TestWorkingDir.test (883 of 1976)
PASS: lldb-unit :: Utility/./UtilityTests/SerializationRountripTest.SerializeDeserializePodPointers (884 of 1976)
PASS: lldb-shell :: ObjectFile/ELF/short-build-id.yaml (885 of 1976)
PASS: lldb-unit :: Utility/./UtilityTests/StringListTest.GetSize (886 of 1976)
PASS: lldb-unit :: Expression/./ExpressionTests/ClangHostTest.ComputeClangResourceDirectory (887 of 1976)
PASS: lldb-unit :: UnwindAssembly/x86/./UnwindAssemblyx86Tests/Testx86AssemblyInspectionEngine.TestPopEBX (888 of 1976)
PASS: lldb-unit :: Expression/./ExpressionTests/DiagnosticManagerTest.GetStringPreserveOrder (889 of 1976)
PASS: lldb-api :: functionalities/rerun/TestRerun.py (890 of 1976)
UNSUPPORTED: lldb-shell :: Register/x86-64-xmm16-write.test (891 of 1976)
PASS: lldb-api :: lang/objc/global_ptrs/TestGlobalObjects.py (892 of 1976)
PASS: lldb-unit :: Language/Highlighting/./HighlighterTests/HighlighterTest.ClangEmptyInput (893 of 1976)
PASS: lldb-api :: macosx/load-kext/TestLoadKext.py (894 of 1976)
PASS: lldb-api :: arm/emulation/TestEmulations.py (895 of 1976)
UNSUPPORTED: lldb-api :: benchmarks/stepping/TestSteppingSpeed.py (896 of 1976)
PASS: lldb-api :: macosx/profile_vrs_detach/TestDetachVrsProfile.py (897 of 1976)
PASS: lldb-unit :: SymbolFile/DWARF/./SymbolFileDWARFTests/SymbolFileDWARFTests.TestAbbrevMissingTerminator (898 of 1976)
PASS: lldb-unit :: Host/./HostTests/MainLoopTest.DetectsEOF (899 of 1976)
PASS: lldb-api :: lang/objc/objc-struct-argument/TestObjCStructArgument.py (900 of 1976)
PASS: lldb-api :: functionalities/data-formatter/hexcaps/TestDataFormatterHexCaps.py (901 of 1976)
PASS: lldb-unit :: Utility/./UtilityTests/AnsiTerminal.Basic (902 of 1976)
PASS: lldb-api :: lang/cpp/template-function/TestTemplateFunctions.py (903 of 1976)
PASS: lldb-unit :: SymbolFile/DWARF/./SymbolFileDWARFTests/SymbolFileDWARFTests.TestAbbrevInvalidNULLTag (904 of 1976)
PASS: lldb-unit :: Platform/./LLDBPlatformTests/PlatformDarwinTest.GetSDKNameForType (905 of 1976)
PASS: lldb-unit :: Utility/./UtilityTests/LogChannelTest.List (906 of 1976)
PASS: lldb-api :: commands/expression/import-std-module/shared_ptr-dbg-info-content/TestSharedPtrDbgInfoContentFromStdModule.py (907 of 1976)
PASS: lldb-unit :: UnwindAssembly/x86/./UnwindAssemblyx86Tests/Testx86AssemblyInspectionEngine.TestSpillRegToStackViaMOVx86_64 (908 of 1976)
PASS: lldb-api :: python_api/value/TestValueAPI.py (909 of 1976)
PASS: lldb-unit :: Utility/./UtilityTests/StringExtractorTest.GetHexBytesAvail_OddPair2 (910 of 1976)
PASS: lldb-unit :: Process/gdb-remote/./ProcessGdbRemoteTests/GDBRemoteClientBaseTest.SendContinueAndInterrupt2PacketBug (911 of 1976)
PASS: lldb-unit :: Utility/./UtilityTests/ArchSpecTest.OperatorBool (912 of 1976)
UNSUPPORTED: lldb-api :: functionalities/darwin_log/basic/TestDarwinLogBasic.py (913 of 1976)
PASS: lldb-api :: functionalities/breakpoint/auto_continue/TestBreakpointAutoContinue.py (914 of 1976)
PASS: lldb-unit :: Process/minidump/./LLDBMinidumpTests/MinidumpParserTest.GetMemoryRegionInfoFromMemoryList (915 of 1976)
PASS: lldb-unit :: Utility/./UtilityTests/RangeTest.LessThanInvalid (916 of 1976)
PASS: lldb-api :: lang/objc/objc++/TestObjCXX.py (917 of 1976)
PASS: lldb-unit :: Utility/./UtilityTests/StringListTest.LongestCommonPrefixEmpty (918 of 1976)
UNSUPPORTED: lldb-api :: tools/lldb-server/platform-process-connect/TestPlatformProcessConnect.py (919 of 1976)
UNSUPPORTED: lldb-shell :: ScriptInterpreter/Lua/convenience_variables.test (920 of 1976)
UNSUPPORTED: lldb-api :: functionalities/darwin_log/filter/exact_match/activity/TestDarwinLogFilterMatchActivity.py (921 of 1976)
PASS: lldb-api :: lang/objc/objc-new-syntax/TestObjCNewSyntaxLiteral.py (922 of 1976)
PASS: lldb-api :: functionalities/thread/concurrent_events/TestConcurrentCrashWithWatchpointBreakpointSignal.py (923 of 1976)
PASS: lldb-unit :: Utility/./UtilityTests/StringExtractorTest.DecodeHexU8_InvalidHex2 (924 of 1976)
PASS: lldb-unit :: Utility/./UtilityTests/StringListTest.GetMaxStringLengthEqualSize (925 of 1976)
PASS: lldb-unit :: Expression/./ExpressionTests/CppModuleConfigurationTest.IgnoreLibStdCpp (926 of 1976)
PASS: lldb-shell :: SymbolFile/NativePDB/break-by-function.cpp (927 of 1976)
PASS: lldb-unit :: Utility/./UtilityTests/StringExtractorTest.GetHexBytes_OddPair (928 of 1976)
PASS: lldb-unit :: Symbol/./SymbolTests/SymbolsTest.TerminateLocateExecutableSymbolFileForUnknownExecutableAndUnknownSymbolFile (929 of 1976)
PASS: lldb-unit :: SymbolFile/NativePDB/./SymbolFileNativePDBTests/PDBFPOProgramToDWARFExpressionTests.SingleAssignmentRegisterRef (930 of 1976)
PASS: lldb-unit :: Interpreter/./InterpreterTests/CompletionTest.DirCompletionAbsolute (931 of 1976)
PASS: lldb-api :: python_api/class_members/TestSBTypeClassMembers.py (932 of 1976)
PASS: lldb-unit :: UnwindAssembly/x86/./UnwindAssemblyx86Tests/Testx86AssemblyInspectionEngine.TestSpArithx86_64Augmented (933 of 1976)
PASS: lldb-unit :: ScriptInterpreter/Python/./ScriptInterpreterPythonTests/PythonDataObjectsTest.TestPythonBoolean (934 of 1976)
PASS: lldb-unit :: Utility/./UtilityTests/StringListTest.PopBack (935 of 1976)
PASS: lldb-unit :: Utility/./UtilityTests/RangeDataVector.CustomSort (936 of 1976)
PASS: lldb-api :: functionalities/breakpoint/address_breakpoints/TestAddressBreakpoints.py (937 of 1976)
PASS: lldb-api :: lang/objc/modules-cache/TestClangModulesCache.py (938 of 1976)
XFAIL: lldb-shell :: Unwind/prefer-debug-over-eh-frame.test (939 of 1976)
PASS: lldb-unit :: Utility/./UtilityTests/StringExtractorTest.InitMisc (940 of 1976)
PASS: lldb-shell :: Minidump/disassemble-no-module.yaml (941 of 1976)
PASS: lldb-api :: functionalities/pre_run_dylibs/TestPreRunDylibs.py (942 of 1976)
PASS: lldb-unit :: Utility/./UtilityTests/StringExtractorTest.DecodeHexU8_InvalidHex (943 of 1976)
PASS: lldb-unit :: Utility/./UtilityTests/LogTest.Register (944 of 1976)
PASS: lldb-unit :: Utility/./UtilityTests/StreamTest.PutMaxHex64ByteOrderLittle (945 of 1976)
PASS: lldb-api :: functionalities/thread/concurrent_events/TestConcurrentDelaySignalBreak.py (946 of 1976)
PASS: lldb-unit :: UnwindAssembly/x86/./UnwindAssemblyx86Tests/Testx86AssemblyInspectionEngine.TestPopR12 (947 of 1976)
PASS: lldb-api :: python_api/formatters/TestFormattersSBAPI.py (948 of 1976)
PASS: lldb-api :: commands/expression/issue_11588/Test11588.py (949 of 1976)
PASS: lldb-shell :: Minidump/Windows/find-module.test (950 of 1976)
PASS: lldb-unit :: Process/minidump/./LLDBMinidumpTests/MinidumpParserTest.GetThreadsAndGetThreadContext (951 of 1976)
PASS: lldb-unit :: Utility/./UtilityTests/StreamTeeTest.Assignment (952 of 1976)
UNSUPPORTED: lldb-shell :: SymbolFile/PDB/compilands.test (953 of 1976)
PASS: lldb-api :: lang/objc/exceptions/TestObjCExceptions.py (954 of 1976)
PASS: lldb-unit :: UnwindAssembly/x86/./UnwindAssemblyx86Tests/Testx86AssemblyInspectionEngine.TestStackRealign32BitDisp_x86_64 (955 of 1976)
PASS: lldb-api :: functionalities/testid/TestTestId.py (956 of 1976)
PASS: lldb-shell :: SymbolFile/DWARF/DW_AT_loclists_base.s (957 of 1976)
PASS: lldb-api :: lang/c/global_variables/TestGlobalVariables.py (958 of 1976)
PASS: lldb-unit :: Utility/./UtilityTests/ArgsTest.ReplaceArgumentAtIndexLonger (959 of 1976)
PASS: lldb-shell :: Commands/command-disassemble-process.yaml (960 of 1976)
PASS: lldb-api :: commands/expression/fixits/TestFixIts.py (961 of 1976)
PASS: lldb-api :: commands/expression/call-throws/TestCallThatThrows.py (962 of 1976)
PASS: lldb-unit :: Utility/./UtilityTests/RangeTest.SizeTypes (963 of 1976)
PASS: lldb-shell :: SymbolFile/DWARF/clang-ast-from-dwarf-unamed-and-anon-structs.cpp (964 of 1976)
XFAIL: lldb-shell :: Register/x86-64-ymm-write.test (965 of 1976)
PASS: lldb-unit :: Language/Highlighting/./HighlighterTests/HighlighterTest.ClangBraces (966 of 1976)
PASS: lldb-api :: functionalities/unwind/noreturn/TestNoreturnUnwind.py (967 of 1976)
PASS: lldb-api :: commands/target/dump-symtab-demangle/TestDumpSymtabDemangle.py (968 of 1976)
PASS: lldb-api :: functionalities/breakpoint/objc/TestObjCBreakpoints.py (969 of 1976)
PASS: lldb-unit :: Utility/./UtilityTests/ArgsTest.TestMultipleArgs (970 of 1976)
PASS: lldb-unit :: Utility/./UtilityTests/FileSpecTest.Equal (971 of 1976)
PASS: lldb-unit :: Utility/./UtilityTests/StreamTest.PutHex32ByteOrderLittle (972 of 1976)
PASS: lldb-unit :: Utility/./UtilityTests/StringListTest.CopyListSingle (973 of 1976)
PASS: lldb-unit :: Utility/./UtilityTests/StreamTest.PutHex64ByteOrderBig (974 of 1976)
PASS: lldb-unit :: Process/minidump/./LLDBMinidumpTests/MinidumpParserTest.GetMemory (975 of 1976)
PASS: lldb-unit :: Core/./LLDBCoreTests/UniqueCStringMap.NoDefaultConstructor (976 of 1976)
PASS: lldb-unit :: Utility/./UtilityTests/AnsiTerminal.Twice (977 of 1976)
PASS: lldb-unit :: ScriptInterpreter/Python/./ScriptInterpreterPythonTests/PythonDataObjectsTest.TestPythonByteArray (978 of 1976)
PASS: lldb-api :: functionalities/breakpoint/require_hw_breakpoints/TestRequireHWBreakpoints.py (979 of 1976)
UNSUPPORTED: lldb-api :: benchmarks/expression/TestRepeatedExprs.py (980 of 1976)
PASS: lldb-shell :: ObjectFile/ELF/PT_LOAD.yaml (981 of 1976)
UNSUPPORTED: lldb-api :: benchmarks/frame_variable/TestFrameVariableResponse.py (982 of 1976)
PASS: lldb-unit :: Utility/./UtilityTests/FileSpecTest.CopyByAppendingPathComponent (983 of 1976)
PASS: lldb-api :: commands/expression/diagnostics/TestExprDiagnostics.py (984 of 1976)
PASS: lldb-api :: lang/cpp/enum_types/TestCPP11EnumTypes.py (985 of 1976)
PASS: lldb-unit :: SymbolFile/NativePDB/./SymbolFileNativePDBTests/PDBFPOProgramToDWARFExpressionTests.UnresolvedDependentCyclicRegisterAssignmentReference (986 of 1976)
PASS: lldb-unit :: Process/gdb-remote/./ProcessGdbRemoteTests/GDBRemoteClientBaseTest.SendContinueDelegateStructuredDataReceipt (987 of 1976)
PASS: lldb-unit :: Utility/./UtilityTests/GeneratorTest.Create (988 of 1976)
PASS: lldb-unit :: Utility/./UtilityTests/UriParserTest.MinimalPort (989 of 1976)
PASS: lldb-api :: lang/c/enum_types/TestEnumTypes.py (990 of 1976)
PASS: lldb-unit :: UnwindAssembly/x86/./UnwindAssemblyx86Tests/Testx86AssemblyInspectionEngine.Test32BitOnlyInstruction (991 of 1976)
PASS: lldb-shell :: SymbolFile/DWARF/inline-function-address-shared.test (992 of 1976)
PASS: lldb-api :: functionalities/data-formatter/data-formatter-stl/libcxx/set/TestDataFormatterLibcxxSet.py (993 of 1976)
PASS: lldb-unit :: Utility/./UtilityTests/VASprintfTest.BufferResize (994 of 1976)
PASS: lldb-api :: commands/expression/expr-in-syscall/TestExpressionInSyscall.py (995 of 1976)
PASS: lldb-shell :: SymbolFile/DWARF/debug-types-signature-loop.s (996 of 1976)
PASS: lldb-unit :: UnwindAssembly/x86/./UnwindAssemblyx86Tests/Testx86AssemblyInspectionEngine.TestPopR14 (997 of 1976)
PASS: lldb-api :: functionalities/gdb_remote_client/TestArmRegisterDefinition.py (998 of 1976)
PASS: lldb-shell :: ObjectFile/MachO/subsections.yaml (999 of 1976)
PASS: lldb-api :: functionalities/data-formatter/data-formatter-synthtype/TestDataFormatterSynthType.py (1000 of 1976)
PASS: lldb-unit :: Utility/./UtilityTests/IndexToObjectTest.ObjectForIndex (1001 of 1976)
PASS: lldb-api :: lang/cpp/template/TestTemplateArgs.py (1002 of 1976)
PASS: lldb-unit :: Utility/./UtilityTests/BinaryStreamTest.PutSLEB128OneByte (1003 of 1976)
PASS: lldb-unit :: Expression/./ExpressionTests/ClangExpressionDeclMapTest.TestUnknownIdentifierLookup (1004 of 1976)
PASS: lldb-api :: python_api/hello_world/TestHelloWorld.py (1005 of 1976)
PASS: lldb-shell :: Settings/TestSettingsSet.test (1006 of 1976)
PASS: lldb-unit :: Utility/./UtilityTests/StringExtractorTest.GetHexU8_InvalidHex_NoEof (1007 of 1976)
PASS: lldb-shell :: ScriptInterpreter/Python/scripted_breakpoint.test (1008 of 1976)
PASS: lldb-unit :: Utility/./UtilityTests/SerializationRountripTest.SerializeDeserializeCStringNull (1009 of 1976)
PASS: lldb-unit :: Utility/./UtilityTests/LogTest.Unregister (1010 of 1976)
PASS: lldb-unit :: Utility/./UtilityTests/BinaryStreamTest.PutULEB128ThreeBytes (1011 of 1976)
PASS: lldb-api :: lang/cpp/char1632_t/TestChar1632T.py (1012 of 1976)
PASS: lldb-unit :: Core/./LLDBCoreTests/StreamCallbackTest.Callback (1013 of 1976)
PASS: lldb-unit :: Symbol/./SymbolTests/PostfixExpression.ToDWARF (1014 of 1976)
PASS: lldb-shell :: Reproducer/TestDriverOptions.test (1015 of 1976)
PASS: lldb-unit :: Utility/./UtilityTests/ConstStringTest.MangledCounterpart (1016 of 1976)
PASS: lldb-shell :: ObjectFile/Breakpad/discontiguous-sections.test (1017 of 1976)
PASS: lldb-api :: functionalities/memory-region/TestMemoryRegion.py (1018 of 1976)
PASS: lldb-api :: functionalities/data-formatter/data-formatter-stl/libcxx/iterator/TestDataFormatterLibccIterator.py (1019 of 1976)
UNSUPPORTED: lldb-api :: lang/c/typedef/Testtypedef.py (1020 of 1976)
PASS: lldb-api :: commands/quit/TestQuit.py (1021 of 1976)
PASS: lldb-shell :: SymbolFile/NativePDB/global-classes.cpp (1022 of 1976)
PASS: lldb-shell :: Settings/TestLineMarkerColor.test (1023 of 1976)
PASS: lldb-unit :: Utility/./UtilityTests/BinaryStreamTest.PutSLEB128FourBytes (1024 of 1976)
PASS: lldb-api :: functionalities/data-formatter/data-formatter-objc/TestDataFormatterObjCCF.py (1025 of 1976)
PASS: lldb-unit :: Utility/./UtilityTests/SharedCluster.ClusterManager (1026 of 1976)
PASS: lldb-unit :: Utility/./UtilityTests/ArgsTest.TestSingleQuotedArgWithSpace (1027 of 1976)
PASS: lldb-api :: functionalities/type_lookup/TestTypeLookup.py (1028 of 1976)
PASS: lldb-unit :: Expression/./ExpressionTests/ClangHostTest.MacOSX (1029 of 1976)
PASS: lldb-unit :: Utility/./UtilityTests/StreamTeeTest.DefaultConstructor (1030 of 1976)
PASS: lldb-api :: python_api/signals/TestSignalsAPI.py (1031 of 1976)
PASS: lldb-unit :: Expression/./ExpressionTests/CppModuleConfigurationTest.LinuxLocalLibCpp (1032 of 1976)
PASS: lldb-unit :: Utility/./UtilityTests/ArgsTest.TestInsertArg (1033 of 1976)
PASS: lldb-unit :: Utility/./UtilityTests/NameMatchesTest.Equals (1034 of 1976)
PASS: lldb-unit :: Utility/./UtilityTests/DataExtractorTest.GetBitfield (1035 of 1976)
PASS: lldb-unit :: Utility/./UtilityTests/FileSpecTest.FormatFileSpec (1036 of 1976)
PASS: lldb-unit :: Utility/./UtilityTests/BinaryStreamTest.PutULEB128TwoBytes (1037 of 1976)
PASS: lldb-api :: python_api/lldbutil/TestSwigVersion.py (1038 of 1976)
PASS: lldb-shell :: ObjectFile/Breakpad/breakpad-identification.test (1039 of 1976)
PASS: lldb-api :: functionalities/breakpoint/source_regexp/TestSourceRegexBreakpoints.py (1040 of 1976)
PASS: lldb-unit :: Process/minidump/./LLDBMinidumpTests/MinidumpParserTest.GetPidWow64 (1041 of 1976)
PASS: lldb-unit :: UnwindAssembly/x86/./UnwindAssemblyx86Tests/Testx86AssemblyInspectionEngine.TestSubRSP (1042 of 1976)
PASS: lldb-api :: lang/cpp/dynamic-value/TestDynamicValue.py (1043 of 1976)
PASS: lldb-api :: functionalities/thread/thread_specific_break/TestThreadSpecificBreakpoint.py (1044 of 1976)
PASS: lldb-unit :: Process/minidump/./LLDBMinidumpTests/MinidumpParserTest.FindMemoryRangeWithFullMemoryMinidump (1045 of 1976)
PASS: lldb-api :: commands/frame/recognizer/TestFrameRecognizer.py (1046 of 1976)
PASS: lldb-api :: python_api/file_handle/TestFileHandle.py (1047 of 1976)
PASS: lldb-unit :: Utility/./UtilityTests/RangeTest.Slide (1048 of 1976)
PASS: lldb-unit :: Utility/./UtilityTests/RangeTest.DefaultConstructor (1049 of 1976)
PASS: lldb-unit :: Process/gdb-remote/./ProcessGdbRemoteTests/GDBRemoteCommunicationClientTest.WriteRegister (1050 of 1976)
PASS: lldb-unit :: Utility/./UtilityTests/BinaryStreamTest.PutULEB128SixBytes (1051 of 1976)
PASS: lldb-shell :: Commands/command-regex-delete.test (1052 of 1976)
PASS: lldb-shell :: SymbolFile/DWARF/find-function-regex.cpp (1053 of 1976)
PASS: lldb-unit :: Symbol/./SymbolTests/TestTypeSystemClang.TestBuiltinTypeForEncodingAndBitSize (1054 of 1976)
PASS: lldb-unit :: Utility/./UtilityTests/ScalarTest.GetValue (1055 of 1976)
PASS: lldb-unit :: Utility/./UtilityTests/OptionsWithRawTest.EmptySuffix (1056 of 1976)
PASS: lldb-api :: commands/expression/weak_symbols/TestWeakSymbols.py (1057 of 1976)
PASS: lldb-shell :: ObjectFile/wasm/basic.yaml (1058 of 1976)
PASS: lldb-unit :: tools/lldb-server/tests/./LLDBServerTests/TestBase.DebugserverEnv (1059 of 1976)
PASS: lldb-unit :: Host/./HostTests/NativeProcessProtocolTest.ReadMemoryWithoutTrap (1060 of 1976)
PASS: lldb-api :: commands/expression/test/TestExprs2.py (1061 of 1976)
PASS: lldb-shell :: Host/TestCustomShell.test (1062 of 1976)
PASS: lldb-unit :: Utility/./UtilityTests/StringListTest.Assignment (1063 of 1976)
PASS: lldb-unit :: UnwindAssembly/x86/./UnwindAssemblyx86Tests/Testx86AssemblyInspectionEngine.TestLEAVE (1064 of 1976)
PASS: lldb-unit :: Utility/./UtilityTests/TildeExpressionResolver.ResolveFullPath (1065 of 1976)
PASS: lldb-unit :: Utility/./UtilityTests/StringListTest.ForRangeEmpty (1066 of 1976)
PASS: lldb-api :: commands/expression/static-initializers/TestStaticInitializers.py (1067 of 1976)
PASS: lldb-unit :: Process/minidump/./LLDBMinidumpTests/MinidumpParserTest.MinidumpDuplicateModuleMinAddress (1068 of 1976)
PASS: lldb-api :: python_api/sbtype_typeclass/TestSBTypeTypeClass.py (1069 of 1976)
PASS: lldb-shell :: ObjectFile/ELF/section-overlap.yaml (1070 of 1976)
PASS: lldb-api :: commands/expression/import-std-module/unique_ptr/TestUniquePtrFromStdModule.py (1071 of 1976)
PASS: lldb-shell :: SymbolFile/NativePDB/ast-methods.cpp (1072 of 1976)
PASS: lldb-api :: python_api/sbstructureddata/TestStructuredDataAPI.py (1073 of 1976)
PASS: lldb-api :: macosx/duplicate-archive-members/TestDuplicateMembers.py (1074 of 1976)
PASS: lldb-unit :: Process/minidump/./LLDBMinidumpTests/MinidumpParserTest.GetThreadContext_x86_64 (1075 of 1976)
PASS: lldb-api :: lang/cpp/chained-calls/TestCppChainedCalls.py (1076 of 1976)
PASS: lldb-api :: functionalities/data-formatter/data-formatter-stl/libcxx/vector/TestDataFormatterLibcxxVector.py (1077 of 1976)
PASS: lldb-unit :: Utility/./UtilityTests/RangeTest.Constructor (1078 of 1976)
PASS: lldb-unit :: Utility/./UtilityTests/StreamTest.ShiftOperatorStrings (1079 of 1976)
PASS: lldb-shell :: SymbolFile/DWARF/debug_aranges-empty-section.s (1080 of 1976)
PASS: lldb-api :: functionalities/breakpoint/breakpoint_command/TestBreakpointCommandsFromPython.py (1081 of 1976)
PASS: lldb-api :: lang/objc/objc-new-syntax/TestObjCNewSyntaxArray.py (1082 of 1976)
PASS: lldb-api :: commands/command/script/import/rdar-12586188/TestRdar12586188.py (1083 of 1976)
PASS: lldb-unit :: UnwindAssembly/x86/./UnwindAssemblyx86Tests/Testx86AssemblyInspectionEngine.TestDisassemblyJunkBytes (1084 of 1976)
PASS: lldb-unit :: Symbol/./SymbolTests/LineEntryTest.GetSameLineContiguousAddressRangeNestedInline (1085 of 1976)
PASS: lldb-api :: functionalities/thread/concurrent_events/TestConcurrentWatchpointWithDelayWatchpointThreads.py (1086 of 1976)
PASS: lldb-unit :: ScriptInterpreter/Python/./ScriptInterpreterPythonTests/PythonDataObjectsTest.TestPythonDictionaryValueEquality (1087 of 1976)
PASS: lldb-unit :: UnwindAssembly/x86/./UnwindAssemblyx86Tests/Testx86AssemblyInspectionEngine.TestPushR14 (1088 of 1976)
PASS: lldb-api :: lang/objc/variadic_methods/TestVariadicMethods.py (1089 of 1976)
PASS: lldb-unit :: Utility/./UtilityTests/StreamTest.SetIndentLevel (1090 of 1976)
PASS: lldb-shell :: SymbolFile/DWARF/dir-separator-windows.s (1091 of 1976)
PASS: lldb-unit :: Core/./LLDBCoreTests/MangledTest.NameIndexes_FindFunctionSymbols (1092 of 1976)
PASS: lldb-api :: lang/cpp/multiple-inheritance/TestCppMultipleInheritance.py (1093 of 1976)
UNSUPPORTED: lldb-api :: terminal/TestEditline.py (1094 of 1976)
PASS: lldb-api :: functionalities/data-formatter/data-formatter-stl/libcxx/bitset/TestDataFormatterLibcxxBitset.py (1095 of 1976)
PASS: lldb-api :: api/listeners/TestListener.py (1096 of 1976)
PASS: lldb-shell :: SymbolFile/symbol-binding.test (1097 of 1976)
PASS: lldb-unit :: Symbol/./SymbolTests/TestClangASTImporter.MetadataPropagationIndirectImport (1098 of 1976)
PASS: lldb-unit :: SymbolFile/DWARF/./SymbolFileDWARFTests/SymbolFileDWARFTests.ParseArangesNonzeroSegmentSize (1099 of 1976)
PASS: lldb-unit :: Utility/./UtilityTests/RangeDataVector.FindEntryIndexesThatContain_Overlap (1100 of 1976)
PASS: lldb-unit :: UnwindAssembly/x86/./UnwindAssemblyx86Tests/Testx86AssemblyInspectionEngine.TestSimplei386ugmented (1101 of 1976)
PASS: lldb-unit :: Utility/./UtilityTests/FileSpecTest.EqualDotsPosixRoot (1102 of 1976)
PASS: lldb-unit :: ScriptInterpreter/Python/./ScriptInterpreterPythonTests/PythonDataObjectsTest.TestPythonCallableCheck (1103 of 1976)
PASS: lldb-unit :: Target/./TargetTests/PathMappingListTest.RemapRoot (1104 of 1976)
PASS: lldb-unit :: UnwindAssembly/x86/./UnwindAssemblyx86Tests/Testx86AssemblyInspectionEngine.Test32bitFramelessSmallStackFrame (1105 of 1976)
PASS: lldb-api :: commands/command/source/TestCommandSource.py (1106 of 1976)
PASS: lldb-shell :: Unwind/thread-step-out-ret-addr-check.test (1107 of 1976)
UNSUPPORTED: lldb-shell :: SymbolFile/NativePDB/typedefs.cpp (1108 of 1976)
PASS: lldb-api :: commands/command/nested_alias/TestNestedAlias.py (1109 of 1976)
PASS: lldb-unit :: Host/./HostTests/FileSystemTest.GetPermissions (1110 of 1976)
PASS: lldb-unit :: Utility/./UtilityTests/BinaryStreamTest.PutULEB128MaxValue (1111 of 1976)
UNSUPPORTED: lldb-api :: linux/mix-dwo-and-regular-objects/TestMixedDwarfBinary.py (1112 of 1976)
PASS: lldb-unit :: Utility/./UtilityTests/StreamTest.PutRawBytesToLittleEndian (1113 of 1976)
PASS: lldb-shell :: Reproducer/TestMultipleTargets.test (1114 of 1976)
PASS: lldb-unit :: Expression/./ExpressionTests/DWARFExpression.DW_OP_convert (1115 of 1976)
PASS: lldb-unit :: Utility/./UtilityTests/ArchSpecTest.MergeFrom (1116 of 1976)
PASS: lldb-unit :: Utility/./UtilityTests/NameMatchesTest.Contains (1117 of 1976)
PASS: lldb-unit :: Utility/./UtilityTests/UUIDTest.Validity (1118 of 1976)
PASS: lldb-api :: types/TestFloatTypesExpr.py (1119 of 1976)
PASS: lldb-api :: lang/objc/rdar-11355592/TestRdar11355592.py (1120 of 1976)
PASS: lldb-unit :: Process/minidump/./LLDBMinidumpTests/MinidumpParserTest.InvalidMinidump (1121 of 1976)
UNSUPPORTED: lldb-api :: commands/register/register/intel_xtended_registers/TestMPXRegisters.py (1122 of 1976)
PASS: lldb-api :: python_api/breakpoint/TestBreakpointAPI.py (1123 of 1976)
PASS: lldb-unit :: ScriptInterpreter/Python/./ScriptInterpreterPythonTests/PythonDataObjectsTest.TestPythonListValueEquality (1124 of 1976)
PASS: lldb-api :: types/TestShortTypeExpr.py (1125 of 1976)
PASS: lldb-unit :: Utility/./UtilityTests/RangeTest.NotEqualInvalid (1126 of 1976)
PASS: lldb-unit :: Utility/./UtilityTests/StreamTeeTest.Constructor2Streams (1127 of 1976)
PASS: lldb-unit :: Utility/./UtilityTests/UriParserTest.Empty (1128 of 1976)
PASS: lldb-api :: lang/c/shared_lib/TestSharedLib.py (1129 of 1976)
PASS: lldb-api :: commands/expression/import-std-module/forward_list-dbg-info-content/TestDbgInfoContentForwardListFromStdModule.py (1130 of 1976)
PASS: lldb-api :: functionalities/breakpoint/breakpoint_command/TestBreakpointCommand.py (1131 of 1976)
PASS: lldb-api :: tools/lldb-vscode/variables/TestVSCode_variables.py (1132 of 1976)
PASS: lldb-shell :: Driver/TestTarget.test (1133 of 1976)
XFAIL: lldb-shell :: Register/x86-mm-xmm-read.test (1134 of 1976)
PASS: lldb-unit :: Core/./LLDBCoreTests/RichManglingContextTest.IPDRealloc (1135 of 1976)
PASS: lldb-api :: functionalities/data-formatter/data-formatter-objc/nsindexpath/TestDataFormatterNSIndexPath.py (1136 of 1976)
PASS: lldb-api :: lang/objc/objc-super/TestObjCSuper.py (1137 of 1976)
PASS: lldb-unit :: ScriptInterpreter/Python/./ScriptInterpreterPythonTests/PythonDataObjectsTest.TestInstanceNameResolutionNoDot (1138 of 1976)
PASS: lldb-unit :: Process/minidump/./LLDBMinidumpTests/MinidumpParserTest.GetMiscInfo_no_stream (1139 of 1976)
PASS: lldb-unit :: UnwindAssembly/x86/./UnwindAssemblyx86Tests/Testx86AssemblyInspectionEngine.TestPushEAX (1140 of 1976)
PASS: lldb-api :: lang/c/step_over_no_deadlock/TestStepOverDoesntBlock.py (1141 of 1976)
PASS: lldb-api :: lang/cpp/member-and-local-vars-with-same-name/TestMembersAndLocalsWithSameName.py (1142 of 1976)
PASS: lldb-unit :: Editline/./EditlineTests/EditlineTestFixture.EditlineReceivesMultiLineText (1143 of 1976)
PASS: lldb-api :: tools/lldb-vscode/stackTrace/TestVSCode_stackTrace.py (1144 of 1976)
PASS: lldb-api :: functionalities/tail_call_frames/thread_step_out_or_return/TestSteppingOutWithArtificialFrames.py (1145 of 1976)
PASS: lldb-api :: functionalities/data-formatter/data-formatter-objc/TestDataFormatterObjCExpr.py (1146 of 1976)
PASS: lldb-api :: commands/expression/import-std-module/queue/TestQueueFromStdModule.py (1147 of 1976)
UNSUPPORTED: lldb-api :: tools/lldb-server/libraries-svr4/TestGdbRemoteLibrariesSvr4Support.py (1148 of 1976)
PASS: lldb-unit :: Language/CPlusPlus/./LanguageCPlusPlusTests/CPlusPlusLanguage.ExtractContextAndIdentifier (1149 of 1976)
PASS: lldb-unit :: Utility/./UtilityTests/StringExtractorTest.GetHexU8_Underflow2 (1150 of 1976)
PASS: lldb-api :: lang/objc/foundation/TestObjCMethods2.py (1151 of 1976)
PASS: lldb-unit :: Utility/./UtilityTests/StringListTest.InsertStringAtIndexMove (1152 of 1976)
PASS: lldb-shell :: BuildScript/modes.test (1153 of 1976)
UNSUPPORTED: lldb-api :: functionalities/darwin_log/filter/exact_match/subsystem/TestDarwinLogFilterMatchSubsystem.py (1154 of 1976)
PASS: lldb-unit :: Expression/./ExpressionTests/DiagnosticManagerTest.GetStringNoDiags (1155 of 1976)
PASS: lldb-api :: functionalities/data-formatter/parray/TestPrintArray.py (1156 of 1976)
PASS: lldb-api :: lang/objc/unicode-string/TestUnicodeString.py (1157 of 1976)
PASS: lldb-api :: functionalities/breakpoint/cpp_exception/TestCPPExceptionBreakpoint.py (1158 of 1976)
PASS: lldb-unit :: Language/Highlighting/./HighlighterTests/HighlighterTest.FallbackHighlighter (1159 of 1976)
PASS: lldb-unit :: Utility/./UtilityTests/DataExtractorTest.GetCStrAtNullOffset (1160 of 1976)
PASS: lldb-unit :: UnwindAssembly/x86/./UnwindAssemblyx86Tests/Testx86AssemblyInspectionEngine.Test64bitFramelessSmallStackFrame (1161 of 1976)
PASS: lldb-shell :: SymbolFile/DWARF/debug-names-compressed.cpp (1162 of 1976)
PASS: lldb-unit :: Utility/./UtilityTests/StreamTest.AddressRange (1163 of 1976)
PASS: lldb-unit :: ScriptInterpreter/Python/./ScriptInterpreterPythonTests/PythonDataObjectsTest.TestPythonTupleInitializerList2 (1164 of 1976)
UNSUPPORTED: lldb-shell :: Watchpoint/netbsd-nouserdbregs.test (1165 of 1976)
PASS: lldb-shell :: Commands/command-breakpoint-col.test (1166 of 1976)
UNSUPPORTED: lldb-shell :: Register/x86-64-ymm16-read.test (1167 of 1976)
PASS: lldb-shell :: ObjectFile/ELF/PT_LOAD-overlap.yaml (1168 of 1976)
PASS: lldb-api :: lang/objc/objc-builtin-types/TestObjCBuiltinTypes.py (1169 of 1976)
UNSUPPORTED: lldb-api :: functionalities/data-formatter/data-formatter-stl/libstdcpp/list/TestDataFormatterStdList.py (1170 of 1976)
PASS: lldb-unit :: Utility/./UtilityTests/UriParserTest.Minimal (1171 of 1976)
PASS: lldb-api :: commands/process/launch/TestProcessLaunch.py (1172 of 1976)
PASS: lldb-api :: lang/c/set_values/TestSetValues.py (1173 of 1976)
PASS: lldb-api :: lang/cpp/class-template-parameter-pack/TestClassTemplateParameterPack.py (1174 of 1976)
PASS: lldb-unit :: Utility/./UtilityTests/StringListTest.DefaultConstructor (1175 of 1976)
PASS: lldb-unit :: Process/gdb-remote/./ProcessGdbRemoteTests/GDBRemoteCommunicationTest.ReadPacket_checksum (1176 of 1976)
PASS: lldb-unit :: Utility/./UtilityTests/StringExtractorTest.DecodeHexU8_Underflow (1177 of 1976)
PASS: lldb-unit :: debugserver/./debugserverTests/RNBSocket.LoopBackConnectIPv6 (1178 of 1976)
UNSUPPORTED: lldb-api :: tools/lldb-vscode/completions/TestVSCode_completions.py (1179 of 1976)
PASS: lldb-unit :: Symbol/./SymbolTests/TestTypeSystemClang.TestGetBasicTypeFromName (1180 of 1976)
UNSUPPORTED: lldb-api :: lang/cpp/static_members/TestCPPStaticMembers.py (1181 of 1976)
PASS: lldb-unit :: Utility/./UtilityTests/BinaryStreamTest.PutULEB128FiveBytes (1182 of 1976)
PASS: lldb-unit :: Utility/./UtilityTests/ScalarTest.ExtractBitfield (1183 of 1976)
PASS: lldb-shell :: SymbolFile/NativePDB/globals-fundamental.cpp (1184 of 1976)
PASS: lldb-unit :: Utility/./UtilityTests/Flags.AllClear (1185 of 1976)
PASS: lldb-api :: functionalities/breakpoint/cpp/TestCPPBreakpointLocations.py (1186 of 1976)
PASS: lldb-unit :: Utility/./UtilityTests/ArgsTest.ReplaceArgumentAtIndexEqual (1187 of 1976)
PASS: lldb-unit :: Utility/./UtilityTests/DataExtractorTest.GetCStrAtEnd (1188 of 1976)
PASS: lldb-unit :: Utility/./UtilityTests/StreamTest.PutHex16ByteOrderLittle (1189 of 1976)
PASS: lldb-unit :: Utility/./UtilityTests/CompletionRequest.TestCompletionOwnership (1190 of 1976)
UNSUPPORTED: lldb-api :: linux/add-symbols/TestTargetSymbolsAddCommand.py (1191 of 1976)
PASS: lldb-unit :: Utility/./UtilityTests/Flags.Reset (1192 of 1976)
PASS: lldb-unit :: Process/minidump/./LLDBMinidumpTests/MinidumpParserTest.GetMiscInfoWindows (1193 of 1976)
PASS: lldb-api :: functionalities/reproducers/attach/TestReproducerAttach.py (1194 of 1976)
PASS: lldb-api :: functionalities/thread/crash_during_step/TestCrashDuringStep.py (1195 of 1976)
PASS: lldb-api :: tools/lldb-server/TestGdbRemoteThreadsInStopReply.py (1196 of 1976)
PASS: lldb-unit :: SymbolFile/DWARF/./SymbolFileDWARFTests/SymbolFileDWARFTests.TestAbilitiesForDWARF (1197 of 1976)
PASS: lldb-api :: types/TestDoubleTypesExpr.py (1198 of 1976)
PASS: lldb-unit :: ObjectFile/PECOFF/./ObjectFilePECOFFTests/PECallFrameInfoTest.Chained_eh (1199 of 1976)
PASS: lldb-api :: commands/frame/diagnose/dereference-function-return/TestDiagnoseDereferenceFunctionReturn.py (1200 of 1976)
PASS: lldb-api :: functionalities/data-formatter/data-formatter-python-synth/TestDataFormatterPythonSynth.py (1201 of 1976)
PASS: lldb-api :: functionalities/data-formatter/data-formatter-stl/libcxx/function/TestLibCxxFunction.py (1202 of 1976)
PASS: lldb-unit :: UnwindAssembly/x86/./UnwindAssemblyx86Tests/Testx86AssemblyInspectionEngine.TestStackRealignMSVC_i386 (1203 of 1976)
PASS: lldb-unit :: Utility/./UtilityTests/StringListTest.GetMaxStringLengthIncreasingSize (1204 of 1976)
PASS: lldb-api :: python_api/lldbutil/frame/TestFrameUtils.py (1205 of 1976)
PASS: lldb-api :: commands/expression/entry-bp/TestExprEntryBP.py (1206 of 1976)
PASS: lldb-api :: linux/builtin_trap/TestBuiltinTrap.py (1207 of 1976)
PASS: lldb-unit :: Utility/./UtilityTests/StringListTest.AppendStringCString (1208 of 1976)
PASS: lldb-api :: lang/cpp/exceptions/TestCPPExceptionBreakpoints.py (1209 of 1976)
PASS: lldb-api :: functionalities/data-formatter/data-formatter-stl/libcxx/multiset/TestDataFormatterLibcxxMultiSet.py (1210 of 1976)
PASS: lldb-api :: macosx/nslog/TestDarwinNSLogOutput.py (1211 of 1976)
PASS: lldb-shell :: ObjectFile/Breakpad/sections-trailing-func.test (1212 of 1976)
PASS: lldb-api :: functionalities/step-avoids-no-debug/TestStepNoDebug.py (1213 of 1976)
PASS: lldb-unit :: Language/Highlighting/./HighlighterTests/HighlighterTest.ClangStringLiterals (1214 of 1976)
PASS: lldb-shell :: Reproducer/TestDump.test (1215 of 1976)
PASS: lldb-unit :: Process/gdb-remote/./ProcessGdbRemoteTests/GDBRemoteCommunicationClientTest.SendGetTraceConfigPacket (1216 of 1976)
PASS: lldb-unit :: ScriptInterpreter/Python/./ScriptInterpreterPythonTests/PythonDataObjectsTest.TestCallable (1217 of 1976)
PASS: lldb-api :: commands/expression/anonymous-struct/TestCallUserAnonTypedef.py (1218 of 1976)
PASS: lldb-api :: commands/add-dsym/uuid/TestAddDsymCommand.py (1219 of 1976)
PASS: lldb-unit :: Utility/./UtilityTests/BinaryStreamTest.PutULEB128FourBytes (1220 of 1976)
PASS: lldb-shell :: SymbolFile/Breakpad/line-table-mixed-path-styles.test (1221 of 1976)
PASS: lldb-unit :: Utility/./UtilityTests/StringLexerTest.Peek (1222 of 1976)
PASS: lldb-api :: lang/c/strings/TestCStrings.py (1223 of 1976)
PASS: lldb-unit :: Utility/./UtilityTests/StringExtractorTest.GetHexBytesAvail_FullString (1224 of 1976)
PASS: lldb-unit :: UnwindAssembly/x86/./UnwindAssemblyx86Tests/Testx86AssemblyInspectionEngine.TestPushRBP (1225 of 1976)
PASS: lldb-api :: functionalities/data-formatter/data-formatter-objc/TestDataFormatterObjCPlain.py (1226 of 1976)
PASS: lldb-unit :: Target/./TargetTests/StackFrameRecognizerTest.NullModuleRegex (1227 of 1976)
PASS: lldb-api :: commands/expression/import-std-module/list/TestListFromStdModule.py (1228 of 1976)
PASS: lldb-unit :: Utility/./UtilityTests/VMRange.ContainsAddr (1229 of 1976)
PASS: lldb-api :: commands/frame/diagnose/complicated-expression/TestComplicatedExpression.py (1230 of 1976)
PASS: lldb-api :: functionalities/plugins/python_os_plugin/TestPythonOSPlugin.py (1231 of 1976)
PASS: lldb-unit :: Utility/./UtilityTests/ArgsTest.EscapeLLDBCommandArgument (1232 of 1976)
UNSUPPORTED: lldb-api :: commands/watchpoints/hello_watchlocation/TestWatchLocation.py (1233 of 1976)
PASS: lldb-api :: lang/cpp/stl/TestStdCXXDisassembly.py (1234 of 1976)
PASS: lldb-unit :: Host/./HostTests/ProcessLaunchInfoTest.Constructor (1235 of 1976)
PASS: lldb-api :: commands/expression/rdar42038760/TestScalarURem.py (1236 of 1976)
PASS: lldb-api :: functionalities/breakpoint/move_nearest/TestMoveNearest.py (1237 of 1976)
PASS: lldb-unit :: Utility/./UtilityTests/OptionsWithRawTest.SingleWhitespaceInput (1238 of 1976)
PASS: lldb-api :: lang/cpp/std-function-step-into-callable/TestStdFunctionStepIntoCallable.py (1239 of 1976)
PASS: lldb-unit :: Utility/./UtilityTests/ArgsTest.BareSingleQuote (1240 of 1976)
PASS: lldb-shell :: Process/TestEnvironment.test (1241 of 1976)
PASS: lldb-unit :: Target/./TargetTests/ExecutionContextTest.GetByteOrderTarget (1242 of 1976)
PASS: lldb-api :: lang/cpp/namespace/TestNamespace.py (1243 of 1976)
UNSUPPORTED: lldb-api :: functionalities/breakpoint/breakpoint_callback_command_source/TestBreakpointCallbackCommandSource.py (1244 of 1976)
PASS: lldb-unit :: Language/Highlighting/./HighlighterTests/HighlighterTest.ClangOperators (1245 of 1976)
PASS: lldb-shell :: VSCode/TestOptions.test (1246 of 1976)
PASS: lldb-unit :: Signals/./SignalsTests/UnixSignalsTest.VersionChange (1247 of 1976)
UNSUPPORTED: lldb-shell :: Unwind/eh-frame-small-fde.test (1248 of 1976)
PASS: lldb-unit :: SymbolFile/NativePDB/./SymbolFileNativePDBTests/PDBFPOProgramToDWARFExpressionTests.MultipleDependentAssignments (1249 of 1976)
PASS: lldb-api :: python_api/watchpoint/TestWatchpointIter.py (1250 of 1976)
PASS: lldb-unit :: Utility/./UtilityTests/StringLexerTest.NextIfList (1251 of 1976)
PASS: lldb-shell :: ObjectFile/ELF/PT_LOAD-empty.yaml (1252 of 1976)
PASS: lldb-api :: lang/c/blocks/TestBlocks.py (1253 of 1976)
PASS: lldb-unit :: Utility/./UtilityTests/StringListTest.JoinMultiCharSeparator (1254 of 1976)
PASS: lldb-api :: functionalities/signal/handle-abrt/TestHandleAbort.py (1255 of 1976)
PASS: lldb-api :: functionalities/data-formatter/data-formatter-stl/libcxx/vbool/TestDataFormatterLibcxxVBool.py (1256 of 1976)
PASS: lldb-unit :: Process/gdb-remote/./ProcessGdbRemoteTests/GDBRemoteClientBaseTest.SendPacketAndReceiveResponseWithOutputSupport (1257 of 1976)
UNSUPPORTED: lldb-api :: functionalities/darwin_log/filter/regex/activity-chain/TestDarwinLogFilterRegexActivityChain.py (1258 of 1976)
UNSUPPORTED: lldb-api :: functionalities/tty/TestTerminal.py (1259 of 1976)
PASS: lldb-api :: tools/lldb-server/TestLldbGdbServer.py (1260 of 1976)
PASS: lldb-api :: lang/objc/modules-incomplete/TestIncompleteModules.py (1261 of 1976)
PASS: lldb-unit :: Utility/./UtilityTests/StringListTest.LongestCommonPrefixDuplicateElement (1262 of 1976)
PASS: lldb-unit :: UnwindAssembly/x86/./UnwindAssemblyx86Tests/Testx86AssemblyInspectionEngine.Test32bitFramelessBigStackFrame (1263 of 1976)
PASS: lldb-api :: lang/cpp/unique-types/TestUniqueTypes.py (1264 of 1976)
PASS: lldb-unit :: Utility/./UtilityTests/StreamTest.AddressSize (1265 of 1976)
PASS: lldb-api :: python_api/interpreter/TestRunCommandInterpreterAPI.py (1266 of 1976)
PASS: lldb-api :: tools/lldb-server/TestGdbRemoteProcessInfo.py (1267 of 1976)
PASS: lldb-unit :: Utility/./UtilityTests/BinaryStreamTest.PutULEB128Zero (1268 of 1976)
UNSUPPORTED: lldb-api :: functionalities/tsan/global_location/TestTsanGlobalLocation.py (1269 of 1976)
PASS: lldb-unit :: Host/./HostTests/SocketTest.TCPGetAddress (1270 of 1976)
PASS: lldb-unit :: Utility/./UtilityTests/FileSpecTest.GetPath (1271 of 1976)
PASS: lldb-api :: functionalities/recursion/TestValueObjectRecursion.py (1272 of 1976)
UNSUPPORTED: lldb-api :: functionalities/data-formatter/data-formatter-stl/libstdcpp/vector/TestDataFormatterStdVector.py (1273 of 1976)
PASS: lldb-unit :: Utility/./UtilityTests/RegisterValueTest.GetSet8 (1274 of 1976)
UNSUPPORTED: lldb-api :: functionalities/ubsan/basic/TestUbsanBasic.py (1275 of 1976)
PASS: lldb-api :: functionalities/tail_call_frames/ambiguous_tail_call_seq2/TestAmbiguousTailCallSeq2.py (1276 of 1976)
PASS: lldb-unit :: Expression/./ExpressionTests/DiagnosticManagerTest.PutStringMultiple (1277 of 1976)
PASS: lldb-shell :: ObjectFile/PECOFF/basic-info-arm64.yaml (1278 of 1976)
PASS: lldb-api :: commands/watchpoints/multiple_hits/TestMultipleHits.py (1279 of 1976)
PASS: lldb-api :: macosx/function-starts/TestFunctionStarts.py (1280 of 1976)
UNSUPPORTED: lldb-api :: functionalities/darwin_log/filter/regex/subsystem/TestDarwinLogFilterRegexSubsystem.py (1281 of 1976)
PASS: lldb-unit :: Host/./HostTests/NativeProcessProtocolTest.ReadCStringFromMemory_MaxSize (1282 of 1976)
PASS: lldb-unit :: Utility/./UtilityTests/StreamTest.PutPtr (1283 of 1976)
PASS: lldb-shell :: ObjectFile/MachO/lc_build_version.yaml (1284 of 1976)
PASS: lldb-api :: commands/expression/rdar44436068/Test128BitsInteger.py (1285 of 1976)
PASS: lldb-unit :: UnwindAssembly/x86/./UnwindAssemblyx86Tests/Testx86AssemblyInspectionEngine.TestPushESI (1286 of 1976)
PASS: lldb-api :: functionalities/thread/concurrent_events/TestConcurrentManyWatchpoints.py (1287 of 1976)
PASS: lldb-unit :: ObjectFile/Breakpad/./ObjectFileBreakpadTests/Record.classify (1288 of 1976)
PASS: lldb-shell :: SymbolFile/DWARF/dwarf5-atomic.s (1289 of 1976)
PASS: lldb-api :: commands/watchpoints/watchpoint_events/TestWatchpointEvents.py (1290 of 1976)
PASS: lldb-unit :: Utility/./UtilityTests/ArgsTest.StringListConstructor (1291 of 1976)
PASS: lldb-shell :: Breakpoint/jitbp_elf.test (1292 of 1976)
PASS: lldb-api :: commands/expression/xvalue/TestXValuePrinting.py (1293 of 1976)
PASS: lldb-unit :: Utility/./UtilityTests/Flags.AllSet (1294 of 1976)
PASS: lldb-api :: lang/cpp/modules-import/TestCXXModulesImport.py (1295 of 1976)
PASS: lldb-unit :: UnwindAssembly/x86/./UnwindAssemblyx86Tests/Testx86AssemblyInspectionEngine.TestPushEBP (1296 of 1976)
PASS: lldb-api :: functionalities/thread/exit_during_break/TestExitDuringBreak.py (1297 of 1976)
PASS: lldb-unit :: Symbol/./SymbolTests/LineEntryTest.GetSameLineContiguousAddressRangeOneInline (1298 of 1976)
PASS: lldb-api :: commands/expression/invalid-args/TestInvalidArgsExpression.py (1299 of 1976)
PASS: lldb-unit :: Process/gdb-remote/./ProcessGdbRemoteTests/GDBRemoteCommunicationClientTest.GetMemoryRegionInfoInvalidResponse (1300 of 1976)
XFAIL: lldb-shell :: Register/x86-mm-xmm-write.test (1301 of 1976)
PASS: lldb-api :: commands/command/invalid-args/TestInvalidArgsCommand.py (1302 of 1976)
PASS: lldb-unit :: debugserver/./debugserverTests/RNBSocket.LoopBackListenIPv4 (1303 of 1976)
PASS: lldb-api :: commands/expression/options/TestExprOptions.py (1304 of 1976)
PASS: lldb-unit :: Process/minidump/./LLDBMinidumpTests/MinidumpParserTest.GetLinuxProcStatus (1305 of 1976)
PASS: lldb-api :: python_api/value/change_values/TestChangeValueAPI.py (1306 of 1976)
PASS: lldb-unit :: Utility/./UtilityTests/TimerTest.CategoryTimesStats (1307 of 1976)
UNSUPPORTED: lldb-shell :: BuildScript/toolchain-msvc.test (1308 of 1976)
PASS: lldb-api :: commands/disassemble/basic/TestDisassembleBreakpoint.py (1309 of 1976)
PASS: lldb-api :: functionalities/data-formatter/data-formatter-ptr-to-array/TestPtrToArrayFormatting.py (1310 of 1976)
PASS: lldb-api :: lang/objcxx/class-name-clash/TestNameClash.py (1311 of 1976)
PASS: lldb-unit :: Utility/./UtilityTests/StringListTest.LongestCommonPrefixSingleElement (1312 of 1976)
PASS: lldb-shell :: ObjectFile/ELF/compressed-sections.yaml (1313 of 1976)
PASS: lldb-shell :: ObjectFile/wasm/embedded-debug-sections.yaml (1314 of 1976)
PASS: lldb-unit :: Utility/./UtilityTests/StreamTest.PutCString (1315 of 1976)
PASS: lldb-unit :: Utility/./UtilityTests/ScalarTest.ComparisonFloat (1316 of 1976)
PASS: lldb-api :: lang/objc/objc-property/TestObjCProperty.py (1317 of 1976)
PASS: lldb-unit :: Utility/./UtilityTests/StreamTest.PutChar (1318 of 1976)
PASS: lldb-unit :: Utility/./UtilityTests/UriParserTest.MinimalPortPath (1319 of 1976)
PASS: lldb-api :: lang/cpp/dynamic-value-same-basename/TestDynamicValueSameBase.py (1320 of 1976)
PASS: lldb-api :: python_api/watchpoint/TestSetWatchpoint.py (1321 of 1976)
PASS: lldb-api :: functionalities/data-formatter/user-format-vs-summary/TestUserFormatVsSummary.py (1322 of 1976)
PASS: lldb-shell :: SymbolFile/DWARF/array-sizes.s (1323 of 1976)
PASS: lldb-unit :: Utility/./UtilityTests/FileSpecTest.RemoveLastPathComponent (1324 of 1976)
PASS: lldb-api :: functionalities/data-formatter/data-formatter-cpp/TestDataFormatterCpp.py (1325 of 1976)
UNSUPPORTED: lldb-api :: functionalities/ubsan/user-expression/TestUbsanUserExpression.py (1326 of 1976)
PASS: lldb-api :: functionalities/target_var/TestTargetVar.py (1327 of 1976)
PASS: lldb-api :: tools/lldb-vscode/launch/TestVSCode_launch.py (1328 of 1976)
PASS: lldb-api :: lang/cpp/breakpoint_in_member_func_w_non_primitive_params/TestBreakpointInMemberFuncWNonPrimitiveParams.py (1329 of 1976)
PASS: lldb-api :: python_api/symbol-context/TestSymbolContext.py (1330 of 1976)
PASS: lldb-unit :: Utility/./UtilityTests/StringExtractorTest.GetHexBytesAvail (1331 of 1976)
PASS: lldb-unit :: Utility/./UtilityTests/CompletionRequest.DuplicateFilteringWithComments (1332 of 1976)
PASS: lldb-unit :: Symbol/./SymbolTests/SymbolsTest.LocateExecutableSymbolFileForUnknownExecutableAndMissingSymbolFile (1333 of 1976)
PASS: lldb-shell :: SymbolFile/DWARF/dir-separator-posix.s (1334 of 1976)
PASS: lldb-unit :: ScriptInterpreter/Python/./ScriptInterpreterPythonTests/PythonDataObjectsTest.TestPythonCallableInvoke (1335 of 1976)
PASS: lldb-api :: commands/watchpoints/watchpoint_commands/TestWatchpointCommands.py (1336 of 1976)
PASS: lldb-unit :: ObjectFile/Breakpad/./ObjectFileBreakpadTests/LineRecord.parse (1337 of 1976)
UNSUPPORTED: lldb-api :: functionalities/darwin_log/source/debug/TestDarwinLogSourceDebug.py (1338 of 1976)
PASS: lldb-unit :: Symbol/./SymbolTests/PostfixExpression.ParseFPOProgram (1339 of 1976)
PASS: lldb-shell :: SymbolFile/DWARF/dwp-separate-debug-file.cpp (1340 of 1976)
PASS: lldb-shell :: SymbolFile/DWARF/clang-ast-from-dwarf-objc-property.m (1341 of 1976)
PASS: lldb-shell :: ObjectFile/Breakpad/uuid-matching-mac.test (1342 of 1976)
PASS: lldb-unit :: Utility/./UtilityTests/BinaryStreamTest.PutULEB128OneByte (1343 of 1976)
PASS: lldb-api :: commands/target/stop-hooks/TestStopHooks.py (1344 of 1976)
PASS: lldb-api :: lang/cpp/virtual-overload/TestVirtualOverload.py (1345 of 1976)
PASS: lldb-unit :: Expression/./ExpressionTests/DiagnosticManagerTest.AppendMessageNoDiag (1346 of 1976)
PASS: lldb-unit :: Utility/./UtilityTests/UriParserTest.LongPath (1347 of 1976)
PASS: lldb-api :: sanity/TestModuleCacheSanity.py (1348 of 1976)
PASS: lldb-api :: lang/objc/modules-app-update/TestClangModulesAppUpdate.py (1349 of 1976)
PASS: lldb-api :: functionalities/data-formatter/format-propagation/TestFormatPropagation.py (1350 of 1976)
PASS: lldb-shell :: BuildScript/script-args.test (1351 of 1976)
PASS: lldb-unit :: Utility/./UtilityTests/ScalarTest.SetValueFromCString (1352 of 1976)
PASS: lldb-api :: functionalities/tail_call_frames/cross_object/TestCrossObjectTailCalls.py (1353 of 1976)
PASS: lldb-unit :: ScriptInterpreter/Python/./ScriptInterpreterPythonTests/PythonDataObjectsTest.TestExceptions (1354 of 1976)
UNSUPPORTED: lldb-api :: functionalities/data-formatter/data-formatter-stl/libstdcpp/map/TestDataFormatterStdMap.py (1355 of 1976)
PASS: lldb-unit :: Target/./TargetTests/MCBasedABI.MapRegisterName (1356 of 1976)
PASS: lldb-shell :: Reproducer/TestReuseDirectory.test (1357 of 1976)
PASS: lldb-unit :: Utility/./UtilityTests/StreamTest.PutHex16ByteOrderBig (1358 of 1976)
UNSUPPORTED: lldb-api :: commands/expression/multiline-navigation/TestMultilineNavigation.py (1359 of 1976)
PASS: lldb-api :: functionalities/non-overlapping-index-variable-i/TestIndexVariable.py (1360 of 1976)
PASS: lldb-unit :: Utility/./UtilityTests/BinaryStreamTest.PutULEB128SevenBytes (1361 of 1976)
PASS: lldb-shell :: SymbolFile/DWARF/debug-line-basic.s (1362 of 1976)
PASS: lldb-unit :: ScriptInterpreter/Python/./ScriptInterpreterPythonTests/PythonDataObjectsTest.TestPythonIntegerToStructuredInteger (1363 of 1976)
PASS: lldb-unit :: ScriptInterpreter/Python/./ScriptInterpreterPythonTests/PythonDataObjectsTest.TestPythonBytes (1364 of 1976)
PASS: lldb-api :: functionalities/data-formatter/data-formatter-stl/libcxx/multimap/TestDataFormatterLibccMultiMap.py (1365 of 1976)
PASS: lldb-api :: commands/watchpoints/watchpoint_size/TestWatchpointSizes.py (1366 of 1976)
PASS: lldb-unit :: Utility/./UtilityTests/OptionsWithRawTest.ArgsButNoLeadingDash (1367 of 1976)
PASS: lldb-unit :: Utility/./UtilityTests/StringListTest.GetMaxStringLengthDecreasingSize (1368 of 1976)
PASS: lldb-api :: lang/cpp/static_methods/TestCPPStaticMethods.py (1369 of 1976)
PASS: lldb-unit :: Utility/./UtilityTests/StringListTest.ShiftCString (1370 of 1976)
PASS: lldb-shell :: Minidump/Windows/broken-unwind.test (1371 of 1976)
UNSUPPORTED: lldb-shell :: ScriptInterpreter/Lua/nested_sessions.test (1372 of 1976)
PASS: lldb-api :: lang/cpp/incomplete-types/TestCppIncompleteTypes.py (1373 of 1976)
PASS: lldb-unit :: Utility/./UtilityTests/OptionsWithRawTest.EmptyArgsOnlySuffix (1374 of 1976)
PASS: lldb-api :: functionalities/data-formatter/boolreference/TestFormattersBoolRefPtr.py (1375 of 1976)
PASS: lldb-api :: commands/expression/import-std-module/list-dbg-info-content/TestDbgInfoContentListFromStdModule.py (1376 of 1976)
UNSUPPORTED: lldb-shell :: SymbolFile/PDB/function-nested-block.test (1377 of 1976)
PASS: lldb-shell :: SymbolFile/DWARF/win-i386-line-table.s (1378 of 1976)
PASS: lldb-api :: macosx/version_zero/TestGetVersionZeroVersion.py (1379 of 1976)
UNSUPPORTED: lldb-api :: functionalities/tsan/multiple/TestTsanMultiple.py (1380 of 1976)
PASS: lldb-unit :: Utility/./UtilityTests/BroadcasterTest.EventTypeHasListeners (1381 of 1976)
PASS: lldb-api :: functionalities/data-formatter/data-formatter-objc/cmtime/TestDataFormatterCMTime.py (1382 of 1976)
PASS: lldb-api :: commands/expression/import_builtin_fileid/TestImportBuiltinFileID.py (1383 of 1976)
PASS: lldb-api :: functionalities/history/TestHistoryRecall.py (1384 of 1976)
PASS: lldb-unit :: Symbol/./SymbolTests/TestClangASTImporter.ImportInvalidType (1385 of 1976)
PASS: lldb-unit :: Host/./HostTests/FileSystemTest.EnumerateDirectory (1386 of 1976)
UNSUPPORTED: lldb-api :: iohandler/completion/TestIOHandlerCompletion.py (1387 of 1976)
PASS: lldb-api :: functionalities/dead-strip/TestDeadStrip.py (1388 of 1976)
PASS: lldb-api :: commands/platform/basic/TestPlatformCommand.py (1389 of 1976)
PASS: lldb-api :: commands/expression/ignore-artificial-constructors/TestIgnoreArtificialConstructors.py (1390 of 1976)
PASS: lldb-unit :: ScriptInterpreter/Python/./ScriptInterpreterPythonTests/PythonDataObjectsTest.TestDictionaryResolutionWithDot (1391 of 1976)
PASS: lldb-api :: functionalities/data-formatter/data-formatter-stl/libcxx/queue/TestDataFormatterLibcxxQueue.py (1392 of 1976)
PASS: lldb-shell :: SymbolFile/DWARF/DW_OP_piece-smaller-than-struct.s (1393 of 1976)
UNSUPPORTED: lldb-shell :: Register/x86-gp-read.test (1394 of 1976)
PASS: lldb-unit :: Utility/./UtilityTests/UUIDTest.RelationalOperators (1395 of 1976)
PASS: lldb-unit :: Host/./HostTests/MainLoopTest.TerminatesImmediately (1396 of 1976)
PASS: lldb-unit :: ScriptInterpreter/Python/./ScriptInterpreterPythonTests/PythonDataObjectsTest.TestGlobalNameResolutionNoDot (1397 of 1976)
PASS: lldb-shell :: SymbolFile/NativePDB/function-types-calling-conv.cpp (1398 of 1976)
PASS: lldb-unit :: Expression/./ExpressionTests/DiagnosticManagerTest.AppendMessageSubsequentDiags (1399 of 1976)
PASS: lldb-api :: lang/cpp/limit-debug-info/TestWithLimitDebugInfo.py (1400 of 1976)
PASS: lldb-api :: functionalities/data-formatter/synthcapping/TestSyntheticCapping.py (1401 of 1976)
UNSUPPORTED: lldb-api :: benchmarks/continue/TestBenchmarkContinue.py (1402 of 1976)
PASS: lldb-shell :: SymbolFile/DWARF/debug_ranges.s (1403 of 1976)
PASS: lldb-unit :: Utility/./UtilityTests/StreamTeeTest.AppendStream (1404 of 1976)
PASS: lldb-unit :: Utility/./UtilityTests/OptionsWithRawTest.UnterminatedQuote (1405 of 1976)
PASS: lldb-unit :: Breakpoint/./LLDBBreakpointTests/BreakpointIDTest.StringIsBreakpointName (1406 of 1976)
PASS: lldb-unit :: Utility/./UtilityTests/FileSpecTest.IsRelative (1407 of 1976)
PASS: lldb-api :: lang/cpp/stl/TestSTL.py (1408 of 1976)
PASS: lldb-api :: commands/expression/regression-access-function-template-in-record/TestRegressionAccessFunctionTemplateInRecord.py (1409 of 1976)
PASS: lldb-api :: functionalities/thread/concurrent_events/TestConcurrentTwoWatchpointThreads.py (1410 of 1976)
PASS: lldb-unit :: Process/gdb-remote/./ProcessGdbRemoteTests/GDBRemoteClientBaseTest.SendContinueAndWait (1411 of 1976)
PASS: lldb-unit :: ScriptInterpreter/Python/./ScriptInterpreterPythonTests/PythonDataObjectsTest.TestGlobalNameResolutionWithDot (1412 of 1976)
PASS: lldb-shell :: SymbolFile/NativePDB/source-list.cpp (1413 of 1976)
PASS: lldb-api :: functionalities/data-formatter/poarray/TestPrintObjectArray.py (1414 of 1976)
PASS: lldb-unit :: Process/minidump/./LLDBMinidumpTests/RegisterContextMinidump.CheckRegisterContextMinidump_ARM (1415 of 1976)
PASS: lldb-shell :: SymbolFile/NativePDB/break-by-line.cpp (1416 of 1976)
PASS: lldb-shell :: ObjectFile/ELF/section-types.yaml (1417 of 1976)
PASS: lldb-unit :: Utility/./UtilityTests/ConstStringTest.CompareConstString (1418 of 1976)
PASS: lldb-unit :: Utility/./UtilityTests/StringListTest.AppendListCStringArrayEmpty (1419 of 1976)
PASS: lldb-unit :: Language/CPlusPlus/./LanguageCPlusPlusTests/CPlusPlusLanguage.CPlusPlusNameParser (1420 of 1976)
PASS: lldb-api :: api/multithreaded/TestMultithreaded.py (1421 of 1976)
PASS: lldb-api :: functionalities/breakpoint/breakpoint_names/TestBreakpointNames.py (1422 of 1976)
PASS: lldb-api :: functionalities/memory/cache/TestMemoryCache.py (1423 of 1976)
PASS: lldb-shell :: SymbolFile/DWARF/find-method.cpp (1424 of 1976)
PASS: lldb-unit :: Process/gdb-remote/./ProcessGdbRemoteTests/GDBRemoteClientBaseTest.SendContinueAndInterrupt (1425 of 1976)
PASS: lldb-unit :: Language/Highlighting/./HighlighterTests/HighlighterTest.ClangCursorPosEndOfLine (1426 of 1976)
UNSUPPORTED: lldb-api :: tools/lldb-server/signal-filtering/TestGdbRemote_QPassSignals.py (1427 of 1976)
PASS: lldb-unit :: Utility/./UtilityTests/ArchSpecTest.Compatibility (1428 of 1976)
PASS: lldb-unit :: Utility/./UtilityTests/FileSpecTest.EqualDotsPosix (1429 of 1976)
PASS: lldb-api :: lang/c/local_types/TestUseClosestType.py (1430 of 1976)
PASS: lldb-shell :: SymbolFile/DWARF/debug_ranges_and_rnglists.test (1431 of 1976)
PASS: lldb-unit :: Host/./HostTests/NativeProcessProtocolTest.SetBreakpointFailWrite (1432 of 1976)
PASS: lldb-unit :: Utility/./UtilityTests/NameMatchesTest.RegularExpression (1433 of 1976)
UNSUPPORTED: lldb-api :: functionalities/thread/state/TestThreadStates.py (1434 of 1976)
PASS: lldb-api :: lang/cpp/llvm-style/TestLLVMStyle.py (1435 of 1976)
PASS: lldb-unit :: Platform/./LLDBPlatformTests/PlatformDarwinTest.FindComponentInPath (1436 of 1976)
PASS: lldb-api :: macosx/add-dsym/TestAddDsymMidExecutionCommand.py (1437 of 1976)
PASS: lldb-unit :: Utility/./UtilityTests/StringExtractorTest.GetU32BigEndian (1438 of 1976)
PASS: lldb-shell :: SymbolFile/DWARF/compilercontext.ll (1439 of 1976)
PASS: lldb-api :: python_api/sblaunchinfo/TestSBLaunchInfo.py (1440 of 1976)
PASS: lldb-shell :: ObjectFile/ELF/netbsd-exec-8.99.30-amd64.yaml (1441 of 1976)
PASS: lldb-unit :: Language/Highlighting/./HighlighterTests/HighlighterTest.ClangTrailingBackslashBeforeNewline (1442 of 1976)
PASS: lldb-api :: commands/expression/import-std-module/weak_ptr/TestWeakPtrFromStdModule.py (1443 of 1976)
PASS: lldb-unit :: Process/gdb-remote/./ProcessGdbRemoteTests/GDBRemoteClientBaseTest.SendContinueAndAsyncSignal (1444 of 1976)
PASS: lldb-shell :: Breakpoint/implicit_const_form_support.test (1445 of 1976)
PASS: lldb-unit :: ScriptInterpreter/Python/./ScriptInterpreterPythonTests/PythonDataObjectsTest.TestPythonDictionaryToStructuredDictionary (1446 of 1976)
PASS: lldb-api :: lang/objc/modules/TestObjCModules.py (1447 of 1976)
UNSUPPORTED: lldb-shell :: ScriptInterpreter/Lua/breakpoint_callback.test (1448 of 1976)
PASS: lldb-unit :: Utility/./UtilityTests/StringListTest.SplitIntoLines (1449 of 1976)
PASS: lldb-api :: functionalities/breakpoint/comp_dir_symlink/TestCompDirSymLink.py (1450 of 1976)
PASS: lldb-unit :: Symbol/./SymbolTests/TestClangASTImporter.MetadataPropagationAfterCopying (1451 of 1976)
UNSUPPORTED: lldb-shell :: SymbolFile/NativePDB/ast-functions-msvc.cpp (1452 of 1976)
PASS: lldb-api :: functionalities/gdb_remote_client/TestIOSSimulator.py (1453 of 1976)
PASS: lldb-api :: commands/expression/import-std-module/vector-bool/TestVectorBoolFromStdModule.py (1454 of 1976)
PASS: lldb-api :: commands/expression/import-std-module/shared_ptr/TestSharedPtrFromStdModule.py (1455 of 1976)
UNSUPPORTED: lldb-api :: commands/register/register/intel_xtended_registers/mpx_bound_violation/TestBoundViolation.py (1456 of 1976)
PASS: lldb-shell :: SymbolFile/DWARF/forward-declarations.s (1457 of 1976)
PASS: lldb-api :: functionalities/show_location/TestShowLocationDwarf5.py (1458 of 1976)
PASS: lldb-api :: functionalities/breakpoint/global_constructor/TestBreakpointInGlobalConstructor.py (1459 of 1976)
UNSUPPORTED: lldb-api :: functionalities/data-formatter/data-formatter-stl/libstdcpp/string/TestDataFormatterStdString.py (1460 of 1976)
PASS: lldb-api :: python_api/function_symbol/TestDisasmAPI.py (1461 of 1976)
PASS: lldb-api :: python_api/default-constructor/TestDefaultConstructorForAPIObjects.py (1462 of 1976)
PASS: lldb-api :: lang/cpp/call-function/TestCallCPPFunction.py (1463 of 1976)
PASS: lldb-unit :: ObjectFile/Breakpad/./ObjectFileBreakpadTests/StackWinRecord.parse (1464 of 1976)
PASS: lldb-unit :: Utility/./UtilityTests/ConstStringTest.CompareStringRef (1465 of 1976)
PASS: lldb-api :: commands/platform/basic/TestPlatformPython.py (1466 of 1976)
PASS: lldb-api :: functionalities/thread/thread_exit/TestThreadExit.py (1467 of 1976)
PASS: lldb-unit :: Utility/./UtilityTests/ReproducerTest.SetReplay (1468 of 1976)
PASS: lldb-unit :: Expression/./ExpressionTests/CppModuleConfigurationTest.UnrelatedLibrary (1469 of 1976)
PASS: lldb-unit :: Process/minidump/./LLDBMinidumpTests/MinidumpParserTest.GetMemoryRegionInfoFromMemory64List (1470 of 1976)
PASS: lldb-unit :: Utility/./UtilityTests/StringExtractorTest.GetNameColonValueSuccess (1471 of 1976)
PASS: lldb-unit :: Expression/./ExpressionTests/CppModuleConfigurationTest.MissingLibCpp (1472 of 1976)
PASS: lldb-api :: lang/cpp/global_variables/TestCPPGlobalVariables.py (1473 of 1976)
PASS: lldb-unit :: Utility/./UtilityTests/StreamTest.PutRawBytesToBigEndian (1474 of 1976)
PASS: lldb-shell :: Driver/TestFile.test (1475 of 1976)
PASS: lldb-api :: functionalities/breakpoint/breakpoint_language/TestBreakpointLanguage.py (1476 of 1976)
PASS: lldb-api :: lang/c/function_types/TestFunctionTypes.py (1477 of 1976)
PASS: lldb-api :: functionalities/tail_call_frames/cross_dso/TestCrossDSOTailCalls.py (1478 of 1976)
PASS: lldb-unit :: Platform/./LLDBPlatformTests/PlatformDarwinTest.FindXcodeContentsDirectoryInPath (1479 of 1976)
PASS: lldb-api :: commands/version/TestVersion.py (1480 of 1976)
PASS: lldb-api :: functionalities/thread/concurrent_events/TestConcurrentTwoBreakpointsOneDelaySignal.py (1481 of 1976)
PASS: lldb-shell :: SymbolFile/Breakpad/unwind-via-raSearch.test (1482 of 1976)
PASS: lldb-api :: commands/expression/function_template_specialization_temp_args/TestFunctionTemplateSpecializationTempArgs.py (1483 of 1976)
PASS: lldb-shell :: SymbolFile/DWARF/debug_loc-aslr.s (1484 of 1976)
PASS: lldb-unit :: Host/./HostTests/FileSystemTest.FileAndDirectoryComponents (1485 of 1976)
PASS: lldb-api :: lang/objc/orderedset/TestOrderedSet.py (1486 of 1976)
PASS: lldb-unit :: ScriptInterpreter/Python/./ScriptInterpreterPythonTests/PythonDataObjectsTest.TestPythonListToStructuredList (1487 of 1976)
PASS: lldb-unit :: Utility/./UtilityTests/StreamTest.PutMaxHex64ByteOrderBig (1488 of 1976)
PASS: lldb-unit :: Utility/./UtilityTests/AnsiTerminal.Incomplete (1489 of 1976)
PASS: lldb-unit :: Symbol/./SymbolTests/TestTypeSystemClang.TestGetBasicTypeFromEnum (1490 of 1976)
PASS: lldb-unit :: Utility/./UtilityTests/StreamTeeTest.CopyConstructor (1491 of 1976)
PASS: lldb-api :: macosx/universal/TestUniversal.py (1492 of 1976)
PASS: lldb-unit :: Utility/./UtilityTests/StringExtractorTest.GetHexU8_InvalidHex (1493 of 1976)
PASS: lldb-api :: macosx/order/TestOrderFile.py (1494 of 1976)
PASS: lldb-unit :: Utility/./UtilityTests/StreamTeeTest.Constructor1Stream (1495 of 1976)
PASS: lldb-shell :: SymbolFile/DWARF/dwarf5-index-is-used.cpp (1496 of 1976)
PASS: lldb-unit :: ScriptInterpreter/Python/./ScriptInterpreterPythonTests/PythonDataObjectsTest.TestPythonDictionaryManipulation (1497 of 1976)
UNSUPPORTED: lldb-api :: lang/objc/objc-dynamic-value/TestObjCDynamicValue.py (1498 of 1976)
UNSUPPORTED: lldb-api :: functionalities/thread/concurrent_events/TestConcurrentManySignals.py (1499 of 1976)
PASS: lldb-unit :: Core/./LLDBCoreTests/MangledTest.EmptyForInvalidName (1500 of 1976)
PASS: lldb-shell :: Reproducer/TestRelativePath.test (1501 of 1976)
PASS: lldb-unit :: Utility/./UtilityTests/StreamTest.PutNHex8 (1502 of 1976)
PASS: lldb-api :: functionalities/data-formatter/type_summary_list_arg/TestTypeSummaryListArg.py (1503 of 1976)
PASS: lldb-shell :: SymbolFile/NativePDB/tag-types.cpp (1504 of 1976)
PASS: lldb-api :: commands/expression/dollar-in-variable/TestDollarInVariable.py (1505 of 1976)
PASS: lldb-api :: commands/expression/import-std-module/stack/TestStackFromStdModule.py (1506 of 1976)
PASS: lldb-unit :: Utility/./UtilityTests/UUIDTest.StringConverion (1507 of 1976)
PASS: lldb-shell :: ScriptInterpreter/Python/crashlog.test (1508 of 1976)
PASS: lldb-unit :: Utility/./UtilityTests/FileSpecTest.Match (1509 of 1976)
PASS: lldb-unit :: Utility/./UtilityTests/RangeTest.Clear (1510 of 1976)
PASS: lldb-unit :: Utility/./UtilityTests/Flags.Clear (1511 of 1976)
PASS: lldb-api :: commands/expression/import-std-module/vector/TestVectorFromStdModule.py (1512 of 1976)
PASS: lldb-api :: python_api/symbol-context/two-files/TestSymbolContextTwoFiles.py (1513 of 1976)
PASS: lldb-unit :: Interpreter/./InterpreterTests/CompletionTest.DirCompletionUsername (1514 of 1976)
PASS: lldb-unit :: Utility/./UtilityTests/BinaryStreamTest.PutULEB128One (1515 of 1976)
PASS: lldb-unit :: Symbol/./SymbolTests/TestTypeSystemClang.TestNotDeletingUserCopyCstrDueToMoveCStr (1516 of 1976)
PASS: lldb-unit :: Host/./HostTests/ConnectionFileDescriptorTest.TCPGetURIv4 (1517 of 1976)
PASS: lldb-unit :: Expression/./ExpressionTests/DWARFExpression.DW_OP_pick (1518 of 1976)
PASS: lldb-unit :: Symbol/./SymbolTests/TestTypeSystemClang.TemplateArguments (1519 of 1976)
PASS: lldb-unit :: Utility/./UtilityTests/StreamTest.PutCStringWithStringRef (1520 of 1976)
PASS: lldb-api :: lang/c/stepping/TestThreadStepping.py (1521 of 1976)
PASS: lldb-api :: functionalities/data-formatter/data-formatter-proper-plurals/TestFormattersOneIsSingular.py (1522 of 1976)
PASS: lldb-unit :: Utility/./UtilityTests/VASprintfTest.EncodingError (1523 of 1976)
PASS: lldb-unit :: Utility/./UtilityTests/NameMatchesTest.Ignore (1524 of 1976)
PASS: lldb-api :: lang/objc/forward-decl/TestForwardDecl.py (1525 of 1976)
UNSUPPORTED: lldb-api :: functionalities/unwind/standard/TestStandardUnwind.py (1526 of 1976)
PASS: lldb-unit :: Process/gdb-remote/./ProcessGdbRemoteTests/GDBRemoteCommunicationClientTest.GetModulesInfo (1527 of 1976)
PASS: lldb-unit :: ScriptInterpreter/Python/./ScriptInterpreterPythonTests/PythonDataObjectsTest.TestRun (1528 of 1976)
PASS: lldb-shell :: ObjectFile/PECOFF/basic-info.yaml (1529 of 1976)
PASS: lldb-api :: commands/expression/argument_passing_restrictions/TestArgumentPassingRestrictions.py (1530 of 1976)
PASS: lldb-unit :: ObjectFile/Breakpad/./ObjectFileBreakpadTests/PublicRecord.parse (1531 of 1976)
PASS: lldb-api :: functionalities/tail_call_frames/disambiguate_tail_call_seq/TestDisambiguateTailCallSeq.py (1532 of 1976)
PASS: lldb-api :: commands/expression/save_jit_objects/TestSaveJITObjects.py (1533 of 1976)
PASS: lldb-unit :: Utility/./UtilityTests/RangeTest.ContainsEndInclusive (1534 of 1976)
PASS: lldb-api :: functionalities/data-formatter/data-formatter-caching/TestDataFormatterCaching.py (1535 of 1976)
PASS: lldb-api :: functionalities/data-formatter/type_summary_list_script/TestTypeSummaryListScript.py (1536 of 1976)
PASS: lldb-unit :: Utility/./UtilityTests/UriParserTest.BracketedHostnameWithPortIPv4 (1537 of 1976)
PASS: lldb-api :: commands/expression/context-object-objc/TestContextObjectObjc.py (1538 of 1976)
PASS: lldb-api :: commands/help/TestHelp.py (1539 of 1976)
PASS: lldb-unit :: Host/./HostTests/SocketTest.UDPConnect (1540 of 1976)
UNSUPPORTED: lldb-api :: commands/expression/multiline-completion/TestMultilineCompletion.py (1541 of 1976)
PASS: lldb-unit :: Utility/./UtilityTests/RangeDataVector.FindEntryThatContains_Overlap (1542 of 1976)
PASS: lldb-api :: tools/lldb-server/TestGdbRemoteKill.py (1543 of 1976)
PASS: lldb-shell :: Commands/command-source.test (1544 of 1976)
PASS: lldb-api :: commands/expression/char/TestExprsChar.py (1545 of 1976)
PASS: lldb-unit :: Process/gdb-remote/./ProcessGdbRemoteTests/GDBRemoteCommunicationClientTest.GetMemoryRegionInfo (1546 of 1976)
PASS: lldb-shell :: Unwind/trap_frame_sym_ctx.test (1547 of 1976)
PASS: lldb-api :: functionalities/unwind/noreturn/module-end/TestNoReturnModuleEnd.py (1548 of 1976)
PASS: lldb-api :: lang/cpp/nsimport/TestCppNsImport.py (1549 of 1976)
UNSUPPORTED: lldb-shell :: ScriptInterpreter/Lua/command_script_import.test (1550 of 1976)
PASS: lldb-shell :: Quit/TestQuitExitCode30.test (1551 of 1976)
PASS: lldb-unit :: Target/./TargetTests/ExecutionContextTest.GetByteOrder (1552 of 1976)
UNSUPPORTED: lldb-api :: functionalities/darwin_log/source/info/TestDarwinLogSourceInfo.py (1553 of 1976)
PASS: lldb-unit :: Utility/./UtilityTests/ConstStringTest.YAML (1554 of 1976)
PASS: lldb-api :: lang/c/tls_globals/TestTlsGlobals.py (1555 of 1976)
PASS: lldb-api :: functionalities/data-formatter/data-formatter-stl/libcxx/optional/TestDataFormatterLibcxxOptional.py (1556 of 1976)
PASS: lldb-unit :: Utility/./UtilityTests/FileSpecTest.FileAndDirectoryComponents (1557 of 1976)
PASS: lldb-shell :: Reproducer/TestFileRepro.test (1558 of 1976)
PASS: lldb-unit :: Symbol/./SymbolTests/Type.GetTypeScopeAndBasename (1559 of 1976)
PASS: lldb-unit :: Expression/./ExpressionTests/ClangExpressionDeclMapTest.TestPersistentDeclLookup (1560 of 1976)
PASS: lldb-unit :: SymbolFile/NativePDB/./SymbolFileNativePDBTests/PDBFPOProgramToDWARFExpressionTests.UnresolvedRegisterAssignmentReference (1561 of 1976)
PASS: lldb-unit :: UnwindAssembly/x86/./UnwindAssemblyx86Tests/Testx86AssemblyInspectionEngine.TestAddRSP (1562 of 1976)
UNSUPPORTED: lldb-shell :: Breakpoint/ppc64-localentry.test (1563 of 1976)
PASS: lldb-unit :: Utility/./UtilityTests/OptionsWithRawTest.SingleWordSuffix (1564 of 1976)
PASS: lldb-api :: lang/objc/objc-static-method-stripped/TestObjCStaticMethodStripped.py (1565 of 1976)
PASS: lldb-api :: python_api/sbenvironment/TestSBEnvironment.py (1566 of 1976)
PASS: lldb-api :: lang/mixed/TestMixedLanguages.py (1567 of 1976)
PASS: lldb-api :: functionalities/gdb_remote_client/TestRegDefinitionInParts.py (1568 of 1976)
PASS: lldb-unit :: Host/./HostTests/ConnectionFileDescriptorTest.TCPGetURIv6 (1569 of 1976)
PASS: lldb-api :: tools/lldb-vscode/breakpoint/TestVSCode_setFunctionBreakpoints.py (1570 of 1976)
PASS: lldb-shell :: ObjectFile/PECOFF/export-dllfunc.yaml (1571 of 1976)
PASS: lldb-unit :: ObjectFile/Breakpad/./ObjectFileBreakpadTests/StackCFIRecord.parse (1572 of 1976)
PASS: lldb-shell :: Commands/command-regex-unalias.test (1573 of 1976)
PASS: lldb-api :: tools/lldb-server/register-reading/TestGdbRemoteGPacket.py (1574 of 1976)
UNSUPPORTED: lldb-api :: commands/watchpoints/variable_out_of_scope/TestWatchedVarHitWhenInScope.py (1575 of 1976)
UNSUPPORTED: lldb-shell :: ExecControl/StopHook/stop-hook-threads.test (1576 of 1976)
PASS: lldb-unit :: Utility/./UtilityTests/StreamTest.PutRawBytesToMixedEndian (1577 of 1976)
PASS: lldb-api :: commands/expression/call-function/TestCallBuiltinFunction.py (1578 of 1976)
PASS: lldb-shell :: Breakpoint/dummy-target.test (1579 of 1976)
PASS: lldb-unit :: Expression/./ExpressionTests/DWARFExpression.DW_OP_piece (1580 of 1976)
PASS: lldb-shell :: Settings/TestSettingsWrite.test (1581 of 1976)
PASS: lldb-shell :: Minidump/no-process-id.yaml (1582 of 1976)
PASS: lldb-api :: types/TestLongTypes.py (1583 of 1976)
PASS: lldb-api :: commands/expression/ir-interpreter/TestIRInterpreter.py (1584 of 1976)
PASS: lldb-shell :: Register/x86-64-read.test (1585 of 1976)
PASS: lldb-shell :: Driver/TestSingleQuote.test (1586 of 1976)
PASS: lldb-unit :: Utility/./UtilityTests/RangeTest.Copy (1587 of 1976)
PASS: lldb-unit :: Utility/./UtilityTests/StreamTest.AddressEmptyPrefix (1588 of 1976)
PASS: lldb-api :: functionalities/breakpoint/scripted_bkpt/TestScriptedResolver.py (1589 of 1976)
PASS: lldb-unit :: Utility/./UtilityTests/RangeTest.DoesIntersect (1590 of 1976)
PASS: lldb-unit :: Utility/./UtilityTests/StreamTest.AddressRangeEmptyRange (1591 of 1976)
PASS: lldb-unit :: Utility/./UtilityTests/StringLexerTest.Next (1592 of 1976)
PASS: lldb-unit :: Utility/./UtilityTests/ConstStringTest.FromMidOfBufferStringRef (1593 of 1976)
PASS: lldb-api :: functionalities/deleted-executable/TestDeletedExecutable.py (1594 of 1976)
PASS: lldb-api :: lang/objc/objc-stepping/TestObjCStepping.py (1595 of 1976)
PASS: lldb-unit :: SymbolFile/DWARF/./SymbolFileDWARFTests/SymbolFileDWARFTests.TestAbbrevOrder1Start1 (1596 of 1976)
PASS: lldb-unit :: SymbolFile/NativePDB/./SymbolFileNativePDBTests/PDBFPOProgramToDWARFExpressionTests.UnknownOp (1597 of 1976)
PASS: lldb-api :: functionalities/tail_call_frames/ambiguous_tail_call_seq1/TestAmbiguousTailCallSeq1.py (1598 of 1976)
PASS: lldb-shell :: Settings/TestFrameFormatColor.test (1599 of 1976)
UNSUPPORTED: lldb-shell :: Process/Windows/exception_access_violation.cpp (1600 of 1976)
UNSUPPORTED: lldb-shell :: Register/x86-ymm-write.test (1601 of 1976)
PASS: lldb-unit :: Utility/./UtilityTests/FileSpecTest.GuessPathStyle (1602 of 1976)
PASS: lldb-api :: lang/cpp/gmodules/TestWithModuleDebugging.py (1603 of 1976)
PASS: lldb-unit :: Utility/./UtilityTests/SerializationRountripTest.SerializeDeserializeCStringArray (1604 of 1976)
PASS: lldb-shell :: SymbolFile/DWARF/debug_rnglists-dwo.s (1605 of 1976)
UNSUPPORTED: lldb-api :: functionalities/signal/handle-segv/TestHandleSegv.py (1606 of 1976)
PASS: lldb-api :: functionalities/data-formatter/data-formatter-stl/libcxx/variant/TestDataFormatterLibcxxVariant.py (1607 of 1976)
PASS: lldb-api :: commands/expression/namespace_local_var_same_name_cpp_and_c/TestNamespaceLocalVarSameNameCppAndC.py (1608 of 1976)
PASS: lldb-api :: types/TestIntegerType.py (1609 of 1976)
PASS: lldb-unit :: Utility/./UtilityTests/StringListTest.LongestCommonPrefix (1610 of 1976)
PASS: lldb-api :: functionalities/data-formatter/refpointer-recursion/TestDataFormatterRefPtrRecursion.py (1611 of 1976)
PASS: lldb-unit :: Process/minidump/./LLDBMinidumpTests/MinidumpParserTest.GetPid (1612 of 1976)
PASS: lldb-unit :: ScriptInterpreter/Python/./ScriptInterpreterPythonTests/PythonDataObjectsTest.TestObjectAttributes (1613 of 1976)
PASS: lldb-unit :: UnwindAssembly/x86/./UnwindAssemblyx86Tests/Testx86AssemblyInspectionEngine.TestMovRSPtoRBP (1614 of 1976)
PASS: lldb-unit :: Utility/./UtilityTests/StringListTest.AppendStringStdString (1615 of 1976)
UNSUPPORTED: lldb-api :: functionalities/data-formatter/data-formatter-stl/libstdcpp/smart_ptr/TestDataFormatterStdSmartPtr.py (1616 of 1976)
XFAIL: lldb-shell :: SymbolFile/DWARF/find-type-in-function.cpp (1617 of 1976)
PASS: lldb-shell :: ObjectFile/ELF/base-address.yaml (1618 of 1976)
PASS: lldb-api :: functionalities/completion/TestCompletion.py (1619 of 1976)
PASS: lldb-unit :: UnwindAssembly/x86/./UnwindAssemblyx86Tests/Testx86AssemblyInspectionEngine.TestSimple64bitFrameFunction (1620 of 1976)
PASS: lldb-unit :: Utility/./UtilityTests/TimerTest.CategoryTimes (1621 of 1976)
PASS: lldb-shell :: ObjectFile/PECOFF/sections-names.yaml (1622 of 1976)
PASS: lldb-unit :: Utility/./UtilityTests/BinaryStreamTest.PutULEB128EightBytes (1623 of 1976)
PASS: lldb-api :: commands/expression/unwind_expression/TestUnwindExpression.py (1624 of 1976)
PASS: lldb-api :: functionalities/thread/concurrent_events/TestConcurrentBreakpointDelayBreakpointOneSignal.py (1625 of 1976)
PASS: lldb-unit :: Utility/./UtilityTests/ArgsTest.GetArgumentArrayRef (1626 of 1976)
PASS: lldb-unit :: UnwindAssembly/x86/./UnwindAssemblyx86Tests/Testx86AssemblyInspectionEngine.TestPopEBP (1627 of 1976)
PASS: lldb-api :: commands/expression/call-function/TestCallStdStringFunction.py (1628 of 1976)
PASS: lldb-unit :: Utility/./UtilityTests/StringListTest.JoinEmpty (1629 of 1976)
PASS: lldb-shell :: SymbolFile/DWARF/dwo-type-in-main-file.s (1630 of 1976)
PASS: lldb-unit :: UnwindAssembly/x86/./UnwindAssemblyx86Tests/Testx86AssemblyInspectionEngine.TestReturnDetect (1631 of 1976)
PASS: lldb-api :: python_api/function_symbol/TestSymbolAPI.py (1632 of 1976)
PASS: lldb-unit :: Utility/./UtilityTests/StreamTest.AddressPrefix (1633 of 1976)
PASS: lldb-unit :: Utility/./UtilityTests/ArgsTest.ReplaceArgumentAtIndexOutOfRange (1634 of 1976)
PASS: lldb-unit :: Utility/./UtilityTests/ArchSpecTest.YAML (1635 of 1976)
UNSUPPORTED: lldb-shell :: BuildScript/toolchain-clang-cl.test (1636 of 1976)
PASS: lldb-api :: functionalities/thread/step_until/TestStepUntil.py (1637 of 1976)
PASS: lldb-unit :: SymbolFile/NativePDB/./SymbolFileNativePDBTests/PDBFPOProgramToDWARFExpressionTests.UnresolvedRegisterReference (1638 of 1976)
PASS: lldb-unit :: Utility/./UtilityTests/ArgsTest.GetQuotedCommandString (1639 of 1976)
PASS: lldb-api :: functionalities/breakpoint/serialize/TestBreakpointSerialization.py (1640 of 1976)
PASS: lldb-api :: python_api/process/io/TestProcessIO.py (1641 of 1976)
PASS: lldb-unit :: Utility/./UtilityTests/UserIDResolver.GetUserName (1642 of 1976)
PASS: lldb-api :: lang/c/register_variables/TestRegisterVariables.py (1643 of 1976)
PASS: lldb-shell :: Reproducer/TestCrash.test (1644 of 1976)
PASS: lldb-unit :: Utility/./UtilityTests/BroadcasterTest.BroadcastEvent (1645 of 1976)
PASS: lldb-unit :: Host/./HostTests/FileSystemTest.MakeAbsolute (1646 of 1976)
PASS: lldb-api :: functionalities/signal/raise/TestRaise.py (1647 of 1976)
PASS: lldb-unit :: Utility/./UtilityTests/StringListTest.InsertStringAtIndexStart (1648 of 1976)
PASS: lldb-unit :: ScriptInterpreter/Python/./ScriptInterpreterPythonTests/PythonDataObjectsTest.TestPythonTupleToStructuredList (1649 of 1976)
PASS: lldb-unit :: Symbol/./SymbolTests/DWARFCallFrameInfoTest.Basic_eh (1650 of 1976)
PASS: lldb-shell :: ObjectFile/ELF/section-addresses.yaml (1651 of 1976)
PASS: lldb-unit :: Utility/./UtilityTests/BinaryStreamTest.PutSLEB128SevenBytes (1652 of 1976)
PASS: lldb-unit :: Utility/./UtilityTests/StreamTest.ShiftOperatorPtr (1653 of 1976)
PASS: lldb-api :: commands/expression/ir-interpreter-phi-nodes/TestIRInterpreterPHINodes.py (1654 of 1976)
PASS: lldb-api :: api/command-return-object/TestSBCommandReturnObject.py (1655 of 1976)
PASS: lldb-unit :: Utility/./UtilityTests/StreamTest.ChangingByteOrder (1656 of 1976)
PASS: lldb-unit :: Utility/./UtilityTests/StringListTest.LongestCommonPrefixNoPrefix (1657 of 1976)
PASS: lldb-api :: lang/objc/objc-baseclass-sbtype/TestObjCBaseClassSBType.py (1658 of 1976)
PASS: lldb-unit :: ScriptInterpreter/Python/./ScriptInterpreterPythonTests/PythonDataObjectsTest.TestTypeNameResolutionNoDot (1659 of 1976)
PASS: lldb-unit :: Utility/./UtilityTests/StringExtractorTest.GetHexBytesAvail_Underflow (1660 of 1976)
PASS: lldb-api :: commands/expression/unicode-in-variable/TestUnicodeInVariable.py (1661 of 1976)
PASS: lldb-unit :: Symbol/./SymbolTests/TestClangASTImporter.CopyTypeTagDecl (1662 of 1976)
PASS: lldb-api :: macosx/queues/TestQueues.py (1663 of 1976)
PASS: lldb-unit :: SymbolFile/DWARF/./SymbolFileDWARFTests/SymbolFileDWARFTests.TestAbbrevNullAttrValidForm (1664 of 1976)
PASS: lldb-shell :: Driver/LocalLLDBInit.test (1665 of 1976)
PASS: lldb-unit :: Utility/./UtilityTests/SerializationRountripTest.SerializeDeserializeCStringArrayNullptrElem (1666 of 1976)
PASS: lldb-api :: lang/c/find_struct_type/TestFindStructTypes.py (1667 of 1976)
PASS: lldb-api :: lang/objc/objc-optimized/TestObjcOptimized.py (1668 of 1976)
PASS: lldb-shell :: Driver/TestCommands.test (1669 of 1976)
UNSUPPORTED: lldb-shell :: Register/x86-zmm-write.test (1670 of 1976)
PASS: lldb-api :: functionalities/data-formatter/cstring-utf8-summary/TestCstringUnicode.py (1671 of 1976)
PASS: lldb-api :: lang/cpp/class_types/TestClassTypes.py (1672 of 1976)
PASS: lldb-api :: functionalities/breakpoint/debugbreak/TestDebugBreak.py (1673 of 1976)
PASS: lldb-api :: commands/watchpoints/multiple_threads/TestWatchpointMultipleThreads.py (1674 of 1976)
PASS: lldb-unit :: Utility/./UtilityTests/StreamTest.PutSLEB128 (1675 of 1976)
PASS: lldb-unit :: Utility/./UtilityTests/VMRange.CollectionContains (1676 of 1976)
PASS: lldb-unit :: SymbolFile/NativePDB/./SymbolFileNativePDBTests/PDBFPOProgramToDWARFExpressionTests.DependencyChain (1677 of 1976)
PASS: lldb-unit :: UnwindAssembly/x86/./UnwindAssemblyx86Tests/Testx86AssemblyInspectionEngine.TestPopRBX (1678 of 1976)
PASS: lldb-unit :: Symbol/./SymbolTests/TestTypeSystemClang.TestGetEnumIntegerTypeBasicTypes (1679 of 1976)
PASS: lldb-unit :: Utility/./UtilityTests/UriParserTest.PortOverflow (1680 of 1976)
PASS: lldb-unit :: Host/./HostTests/HostInfoTest.GetAugmentedArchSpec (1681 of 1976)
UNSUPPORTED: lldb-shell :: Reproducer/TestLuaImport.test (1682 of 1976)
PASS: lldb-unit :: Host/./HostTests/SocketTest.DomainListenConnectAccept (1683 of 1976)
PASS: lldb-api :: lang/cpp/overloaded-functions/TestOverloadedFunctions.py (1684 of 1976)
PASS: lldb-shell :: SymbolFile/DWARF/find-basic-function.cpp (1685 of 1976)
PASS: lldb-shell :: ObjectFile/PECOFF/invalid-export-table.yaml (1686 of 1976)
PASS: lldb-unit :: ScriptInterpreter/Python/./ScriptInterpreterPythonTests/PythonDataObjectsTest.TestModuleNameResolutionNoDot (1687 of 1976)
PASS: lldb-api :: macosx/thread_suspend/TestInternalThreadSuspension.py (1688 of 1976)
PASS: lldb-unit :: Host/./HostTests/Host.GetEnvironment (1689 of 1976)
PASS: lldb-api :: functionalities/gdb_remote_client/TestStopPCs.py (1690 of 1976)
PASS: lldb-api :: functionalities/lazy-loading/TestLazyLoading.py (1691 of 1976)
PASS: lldb-api :: functionalities/thread/concurrent_events/TestConcurrentDelayWatchBreak.py (1692 of 1976)
PASS: lldb-unit :: Symbol/./SymbolTests/TestClangASTImporter.CompleteFwdDeclWithOtherOrigin (1693 of 1976)
PASS: lldb-api :: functionalities/gdb_remote_client/TestGDBRemoteLoad.py (1694 of 1976)
PASS: lldb-unit :: Language/CPlusPlus/./LanguageCPlusPlusTests/CPlusPlusLanguage.FindAlternateFunctionManglings (1695 of 1976)
PASS: lldb-unit :: Editline/./EditlineTests/EditlineTestFixture.EditlineReceivesSingleLineText (1696 of 1976)
PASS: lldb-unit :: Utility/./UtilityTests/LogChannelEnabledTest.LLDB_LOG_ERROR (1697 of 1976)
UNSUPPORTED: lldb-api :: commands/expression/call-restarts/TestCallThatRestarts.py (1698 of 1976)
PASS: lldb-unit :: Target/./TargetTests/ModuleCacheTest.GetAndPutStrangeHostname (1699 of 1976)
PASS: lldb-api :: functionalities/data-formatter/data-formatter-stl/libcxx/forward_list/TestDataFormatterLibcxxForwardList.py (1700 of 1976)
PASS: lldb-api :: commands/process/attach/attach_denied/TestAttachDenied.py (1701 of 1976)
UNSUPPORTED: lldb-shell :: SymbolFile/NativePDB/local-variables.cpp (1702 of 1976)
UNSUPPORTED: lldb-shell :: ObjectFile/ELF/minidebuginfo-no-lzma.yaml (1703 of 1976)
PASS: lldb-api :: functionalities/breakpoint/breakpoint_command/TestRegexpBreakCommand.py (1704 of 1976)
PASS: lldb-unit :: Utility/./UtilityTests/EnvironmentTest.EnvpConversion (1705 of 1976)
UNSUPPORTED: lldb-api :: functionalities/tsan/thread_leak/TestTsanThreadLeak.py (1706 of 1976)
PASS: lldb-shell :: Expr/TestIRMemoryMap.test (1707 of 1976)
PASS: lldb-api :: lang/objc/objc-new-syntax/TestObjCNewSyntaxDictionary.py (1708 of 1976)
PASS: lldb-api :: lang/objc/foundation/TestSymbolTable.py (1709 of 1976)
PASS: lldb-unit :: ScriptInterpreter/Python/./ScriptInterpreterPythonTests/PythonDataObjectsTest.TestOwnedReferences (1710 of 1976)
PASS: lldb-api :: functionalities/postmortem/mach-core/TestMachCore.py (1711 of 1976)
PASS: lldb-unit :: Utility/./UtilityTests/ScalarTest.CastOperations (1712 of 1976)
PASS: lldb-shell :: ObjectFile/ELF/PT_LOAD-overlap-PT_INTERP.yaml (1713 of 1976)
PASS: lldb-unit :: Utility/./UtilityTests/FileSpecTest.AppendPathComponent (1714 of 1976)
PASS: lldb-api :: api/multiple-targets/TestMultipleTargets.py (1715 of 1976)
PASS: lldb-api :: commands/expression/context-object/TestContextObject.py (1716 of 1976)
PASS: lldb-unit :: Utility/./UtilityTests/ScalarTest.RightShiftOperator (1717 of 1976)
PASS: lldb-unit :: Utility/./UtilityTests/StringExtractorTest.GetHexBytes_Partial (1718 of 1976)
PASS: lldb-api :: commands/watchpoints/watchpoint_commands/condition/TestWatchpointConditionCmd.py (1719 of 1976)
PASS: lldb-api :: functionalities/data-formatter/setvaluefromcstring/TestSetValueFromCString.py (1720 of 1976)
PASS: lldb-shell :: ObjectFile/ELF/aarch64-relocations.yaml (1721 of 1976)
PASS: lldb-unit :: Language/Highlighting/./HighlighterTests/HighlighterTest.ClangComments (1722 of 1976)
PASS: lldb-shell :: SymbolFile/DWARF/inline-function-address.ll (1723 of 1976)
PASS: lldb-unit :: Host/./HostTests/SocketAddressTest.Set (1724 of 1976)
PASS: lldb-unit :: Utility/./UtilityTests/StringExtractorTest.GetU64BigEndian (1725 of 1976)
PASS: lldb-api :: lang/cpp/virtual-functions/TestCppVirtualFunctions.py (1726 of 1976)
PASS: lldb-api :: lang/c/shared_lib_stripped_symbols/TestSharedLibStrippedSymbols.py (1727 of 1976)
PASS: lldb-shell :: ObjectFile/ELF/basic-info.yaml (1728 of 1976)
PASS: lldb-api :: functionalities/breakpoint/consecutive_breakpoints/TestConsecutiveBreakpoints.py (1729 of 1976)
PASS: lldb-api :: commands/expression/codegen-crash-typedefdecl-not-in_declcontext/TestCodegenCrashTypedefDeclNotInDeclContext.py (1730 of 1976)
PASS: lldb-unit :: Process/gdb-remote/./ProcessGdbRemoteTests/GDBRemoteCommunicationServerTest.SendErrorResponse_Status (1731 of 1976)
PASS: lldb-unit :: Expression/./ExpressionTests/CppModuleConfigurationTest.AmbiguousLibCpp (1732 of 1976)
PASS: lldb-unit :: Utility/./UtilityTests/CompletionRequest.TryCompleteCurrentArgGood (1733 of 1976)
UNSUPPORTED: lldb-api :: functionalities/breakpoint/breakpoint_in_delayslot/TestAvoidBreakpointInDelaySlot.py (1734 of 1976)
UNSUPPORTED: lldb-api :: functionalities/thread/create_during_step/TestCreateDuringStep.py (1735 of 1976)
PASS: lldb-unit :: Utility/./UtilityTests/StringLexerTest.HasAtLeast (1736 of 1976)
PASS: lldb-unit :: Signals/./SignalsTests/UnixSignalsTest.Iteration (1737 of 1976)
PASS: lldb-api :: lang/objc/objc-static-method/TestObjCStaticMethod.py (1738 of 1976)
PASS: lldb-api :: macosx/DBGSourcePathRemapping/TestDSYMSourcePathRemapping.py (1739 of 1976)
PASS: lldb-api :: commands/expression/import-std-module/forward_list/TestForwardListFromStdModule.py (1740 of 1976)
PASS: lldb-api :: lang/cpp/namespace_definitions/TestNamespaceDefinitions.py (1741 of 1976)
PASS: lldb-unit :: Interpreter/./InterpreterTests/CompletionTest.FileCompletionAbsolute (1742 of 1976)
PASS: lldb-api :: commands/watchpoints/step_over_watchpoint/TestStepOverWatchpoint.py (1743 of 1976)
PASS: lldb-api :: functionalities/data-formatter/data-formatter-synthval/TestDataFormatterSynthVal.py (1744 of 1976)
UNSUPPORTED: lldb-api :: functionalities/process_save_core/TestProcessSaveCore.py (1745 of 1976)
PASS: lldb-unit :: Utility/./UtilityTests/ProcessInfoTest.Constructor (1746 of 1976)
PASS: lldb-shell :: SymbolFile/DWARF/dir-separator-no-comp-dir.s (1747 of 1976)
PASS: lldb-api :: functionalities/postmortem/wow64_minidump/TestWow64MiniDump.py (1748 of 1976)
PASS: lldb-unit :: Process/gdb-remote/./ProcessGdbRemoteTests/GDBRemoteCommunicationServerTest.SendErrorResponse_StringError (1749 of 1976)
PASS: lldb-unit :: Utility/./UtilityTests/StringExtractorTest.InitEmpty (1750 of 1976)
PASS: lldb-unit :: Utility/./UtilityTests/StringExtractorTest.DecodeHexU8_Exact (1751 of 1976)
PASS: lldb-unit :: Signals/./SignalsTests/UnixSignalsTest.GetFilteredSignals (1752 of 1976)
PASS: lldb-api :: lang/c/vla/TestVLA.py (1753 of 1976)
UNSUPPORTED: lldb-shell :: SymbolFile/PDB/vbases.test (1754 of 1976)
PASS: lldb-api :: lang/cpp/class_types/TestClassTypesDisassembly.py (1755 of 1976)
PASS: lldb-unit :: Utility/./UtilityTests/LogTest.LLDB_LOG_nullptr (1756 of 1976)
PASS: lldb-unit :: Utility/./UtilityTests/VMRange.Reset (1757 of 1976)
PASS: lldb-shell :: Register/x86-64-gp-read.test (1758 of 1976)
PASS: lldb-shell :: SymbolFile/DWARF/debug-types-dwo-cross-reference.cpp (1759 of 1976)
PASS: lldb-unit :: Utility/./UtilityTests/StructuredDataTest.StringDump (1760 of 1976)
PASS: lldb-api :: commands/expression/two-files/TestObjCTypeQueryFromOtherCompileUnit.py (1761 of 1976)
PASS: lldb-unit :: Utility/./UtilityTests/UriParserTest.SchemeHostSeparator (1762 of 1976)
PASS: lldb-api :: functionalities/thread/concurrent_events/TestConcurrentCrashWithBreak.py (1763 of 1976)
PASS: lldb-unit :: Utility/./UtilityTests/OptionsWithRawTest.EmptySuffixSingleWhitespace (1764 of 1976)
PASS: lldb-unit :: Host/./HostTests/FileSystemTest.Readable (1765 of 1976)
PASS: lldb-unit :: Utility/./UtilityTests/LogChannelEnabledTest.LogThread (1766 of 1976)
PASS: lldb-unit :: Process/gdb-remote/./ProcessGdbRemoteTests/GDBRemoteCommunicationClientTest.GetModulesInfo_UUID20 (1767 of 1976)
UNSUPPORTED: lldb-shell :: Register/x86-64-gp-write.test (1768 of 1976)
PASS: lldb-unit :: Utility/./UtilityTests/ProcessInstanceInfo.DumpTable_invalidUID (1769 of 1976)
PASS: lldb-unit :: Utility/./UtilityTests/VASprintfTest.NoBufferResize (1770 of 1976)
PASS: lldb-shell :: SymbolFile/DWARF/debug-types-missing-signature.test (1771 of 1976)
PASS: lldb-api :: functionalities/thread/concurrent_events/TestConcurrentTwoBreakpointThreads.py (1772 of 1976)
PASS: lldb-unit :: Utility/./UtilityTests/ScalarTest.Promotion (1773 of 1976)
PASS: lldb-unit :: Host/./HostTests/NativeProcessProtocolTest.ReadCStringFromMemory (1774 of 1976)
PASS: lldb-shell :: ObjectFile/ELF/netbsd-core-amd64.test (1775 of 1976)
PASS: lldb-unit :: Language/Highlighting/./HighlighterTests/HighlighterTest.ClangTrailingBackslashWithWhitespace (1776 of 1976)
PASS: lldb-api :: functionalities/memory/find/TestMemoryFind.py (1777 of 1976)
PASS: lldb-unit :: Utility/./UtilityTests/SerializationRountripTest.SerializeDeserializePodReferences (1778 of 1976)
PASS: lldb-unit :: Utility/./UtilityTests/StreamTest.AddressPrefixAndSuffix (1779 of 1976)
PASS: lldb-unit :: Process/minidump/./LLDBMinidumpTests/MinidumpParserTest.GetThreadContext_x86_32 (1780 of 1976)
PASS: lldb-shell :: Quit/TestQuitExitCode-30.test (1781 of 1976)
PASS: lldb-api :: commands/expression/vector_of_enums/TestVectorOfEnums.py (1782 of 1976)
PASS: lldb-api :: lang/objc/objc-runtime-ivars/TestRuntimeIvars.py (1783 of 1976)
PASS: lldb-api :: commands/expression/no-deadlock/TestExprDoesntBlock.py (1784 of 1976)
PASS: lldb-unit :: Utility/./UtilityTests/StructuredDataTest.ParseJSONFromFile (1785 of 1976)
PASS: lldb-api :: functionalities/return-value/TestReturnValue.py (1786 of 1976)
PASS: lldb-api :: functionalities/breakpoint/step_over_breakpoint/TestStepOverBreakpoint.py (1787 of 1976)
PASS: lldb-api :: tools/lldb-server/TestGdbRemoteHostInfo.py (1788 of 1976)
PASS: lldb-api :: lang/objc/objc-dyn-sbtype/TestObjCDynamicSBType.py (1789 of 1976)
PASS: lldb-api :: commands/target/create-deps/TestTargetCreateDeps.py (1790 of 1976)
PASS: lldb-unit :: Host/./HostTests/NativeProcessProtocolTest.ReadCStringFromMemory_CrossPageBoundary (1791 of 1976)
PASS: lldb-unit :: Language/Highlighting/./HighlighterTests/HighlighterTest.ClangPreserveNewLine (1792 of 1976)
FAIL: lldb-api :: functionalities/ptr_refs/TestPtrRefs.py (1793 of 1976)
******************** TEST 'lldb-api :: functionalities/ptr_refs/TestPtrRefs.py' FAILED ********************
Script:
--
/usr/local/bin/python /Users/buildslave/jenkins/workspace/lldb-cmake-sanitized/llvm-project/lldb/test/API/dotest.py --arch x86_64 -s /Users/buildslave/jenkins/workspace/lldb-cmake-sanitized/lldb-build/lldb-test-traces -S nm -u CXXFLAGS -u CFLAGS --codesign-identity lldb_codesign --server /Users/buildslave/jenkins/workspace/lldb-cmake-sanitized/lldb-build/./bin/debugserver --arch x86_64 --build-dir /Users/buildslave/jenkins/workspace/lldb-cmake-sanitized/lldb-build/lldb-test-build.noindex -s=/Users/buildslave/jenkins/workspace/lldb-cmake-sanitized/test/logs -t --env TERM=vt100 --env LLVM_LIBS_DIR=/Users/buildslave/jenkins/workspace/lldb-cmake-sanitized/lldb-build/./lib --inferior-env ASAN_OPTIONS=detect_stack_use_after_return=1 --inferior-env DYLD_INSERT_LIBRARIES=/Users/buildslave/jenkins/workspace/lldb-cmake-sanitized/host-compiler/lib/clang/11.0.0/lib/darwin/libclang_rt.asan_osx_dynamic.dylib --build-dir /Users/buildslave/jenkins/workspace/lldb-cmake-sanitized/lldb-build/lldb-test-build.noindex --lldb-module-cache-dir /Users/buildslave/jenkins/workspace/lldb-cmake-sanitized/lldb-build/lldb-test-build.noindex/module-cache-lldb/lldb-api --clang-module-cache-dir /Users/buildslave/jenkins/workspace/lldb-cmake-sanitized/lldb-build/lldb-test-build.noindex/module-cache-clang/lldb-api --executable /Users/buildslave/jenkins/workspace/lldb-cmake-sanitized/lldb-build/./bin/lldb --compiler /Users/buildslave/jenkins/workspace/lldb-cmake-sanitized/lldb-build/./bin/clang --dsymutil /Users/buildslave/jenkins/workspace/lldb-cmake-sanitized/lldb-build/./bin/dsymutil --filecheck /Users/buildslave/jenkins/workspace/lldb-cmake-sanitized/lldb-build/./bin/FileCheck --lldb-libs-dir /Users/buildslave/jenkins/workspace/lldb-cmake-sanitized/lldb-build/./lib /Users/buildslave/jenkins/workspace/lldb-cmake-sanitized/llvm-project/lldb/test/API/functionalities/ptr_refs -p TestPtrRefs.py
--
Exit Code: 1

Hide Details

Command Output (stdout): -- lldb version 11.0.99 clang revision 43a95a543fbb1ed4b3903e88ce291444d4970f5a llvm revision 43a95a543fbb1ed4b3903e88ce291444d4970f5a "crashlog" and "save_crashlog" command installed, use the "--help" option for detailed help "malloc_info", "ptr_refs", "cstr_refs", "find_variable", and "objc_refs" commands have been installed, use the "--help" options on these commands for detailed help. LLDB library dir: /Users/buildslave/jenkins/workspace/lldb-cmake-sanitized/lldb-build/bin LLDB import library dir: /Users/buildslave/jenkins/workspace/lldb-cmake-sanitized/lldb-build/./lib libstdcxx tests will not be run because: Don't know how to build with libstdcxx on macosx Skipping following debug info categories: ['dwo'] 0x00007ffeed802478: stack in frame #0 of thread #1: tid 0x4ab73d in variable at 0x7ffeed802478: (const char *) my_ptr = 0x00006020000000b0 "hello" 0x00007ffeed802410: stack (red zone)

Hide Details

-- Command Output (stderr): -- error: 'ptr_refs' is not a valid command. error: 'ptr_refs' is not a valid command.

Hide Details

Session logs for test failures/errors/unexpected successes will go into directory '/Users/buildslave/jenkins/workspace/lldb-cmake-sanitized/test/logs' Command invoked: /Users/buildslave/jenkins/workspace/lldb-cmake-sanitized/llvm-project/lldb/test/API/dotest.py --arch x86_64 -s /Users/buildslave/jenkins/workspace/lldb-cmake-sanitized/lldb-build/lldb-test-traces -S nm -u CXXFLAGS -u CFLAGS --codesign-identity lldb_codesign --server /Users/buildslave/jenkins/workspace/lldb-cmake-sanitized/lldb-build/./bin/debugserver --arch x86_64 --build-dir /Users/buildslave/jenkins/workspace/lldb-cmake-sanitized/lldb-build/lldb-test-build.noindex -s=/Users/buildslave/jenkins/workspace/lldb-cmake-sanitized/test/logs -t --env TERM=vt100 --env LLVM_LIBS_DIR=/Users/buildslave/jenkins/workspace/lldb-cmake-sanitized/lldb-build/./lib --inferior-env ASAN_OPTIONS=detect_stack_use_after_return=1 --inferior-env DYLD_INSERT_LIBRARIES=/Users/buildslave/jenkins/workspace/lldb-cmake-sanitized/host-compiler/lib/clang/11.0.0/lib/darwin/libclang_rt.asan_osx_dynamic.dylib --build-dir /Users/buildslave/jenkins/workspace/lldb-cmake-sanitized/lldb-build/lldb-test-build.noindex --lldb-module-cache-dir /Users/buildslave/jenkins/workspace/lldb-cmake-sanitized/lldb-build/lldb-test-build.noindex/module-cache-lldb/lldb-api --clang-module-cache-dir /Users/buildslave/jenkins/workspace/lldb-cmake-sanitized/lldb-build/lldb-test-build.noindex/module-cache-clang/lldb-api --executable /Users/buildslave/jenkins/workspace/lldb-cmake-sanitized/lldb-build/./bin/lldb --compiler /Users/buildslave/jenkins/workspace/lldb-cmake-sanitized/lldb-build/./bin/clang --dsymutil /Users/buildslave/jenkins/workspace/lldb-cmake-sanitized/lldb-build/./bin/dsymutil --filecheck /Users/buildslave/jenkins/workspace/lldb-cmake-sanitized/lldb-build/./bin/FileCheck --lldb-libs-dir /Users/buildslave/jenkins/workspace/lldb-cmake-sanitized/lldb-build/./lib /Users/buildslave/jenkins/workspace/lldb-cmake-sanitized/llvm-project/lldb/test/API/functionalities/ptr_refs -p TestPtrRefs.py Change dir to: /Users/buildslave/jenkins/workspace/lldb-cmake-sanitized/llvm-project/lldb/test/API/functionalities/ptr_refs runCmd: settings clear -all output:

Hide Details

runCmd: settings set symbols.enable-external-lookup false output:

Hide Details

runCmd: settings set target.auto-apply-fixits false output:

Hide Details

runCmd: settings set plugin.process.gdb-remote.packet-timeout 60 output:

Hide Details

runCmd: settings set symbols.clang-modules-cache-path "/Users/buildslave/jenkins/workspace/lldb-cmake-sanitized/lldb-build/lldb-test-build.noindex/module-cache-lldb/lldb-api" output:

Hide Details

runCmd: settings set use-color false output:

Hide Details

runCmd: setting set target.prefer-dynamic-value no-dynamic-values output:

Hide Details

runCmd: settings set target.env-vars ASAN_OPTIONS=detect_stack_use_after_return=1 DYLD_INSERT_LIBRARIES=/Users/buildslave/jenkins/workspace/lldb-cmake-sanitized/host-compiler/lib/clang/11.0.0/lib/darwin/libclang_rt.asan_osx_dynamic.dylib output:

Hide Details

runCmd: script import lldb.macosx.heap output: "crashlog" and "save_crashlog" command installed, use the "--help" option for detailed help "malloc_info", "ptr_refs", "cstr_refs", "find_variable", and "objc_refs" commands have been installed, use the "--help" options on these commands for detailed help.

Hide Details

Hide Details

runCmd: ptr_refs my_ptr output: 0x00007ffeed802478: stack in frame #0 of thread #1: tid 0x4ab73d in variable at 0x7ffeed802478: (const char *) my_ptr = 0x00006020000000b0 "hello" 0x00007ffeed802410: stack (red zone)

Hide Details

Hide Details

Expecting sub string: malloc Not matched

Hide Details

FAIL: LLDB (/Users/buildslave/jenkins/workspace/lldb-cmake-sanitized/lldb-build/bin/clang-11-x86_64) :: test_ptr_refs_dsym (TestPtrRefs.TestPtrRefs) <bound method SBProcess.Kill of <lldb.SBProcess; proxy of <Swig Object of type 'lldb::SBProcess *' at 0x11d7c28a0> >>: success

Hide Details

runCmd: settings clear -all output:

Hide Details

runCmd: settings set symbols.enable-external-lookup false output:

Hide Details

runCmd: settings set target.auto-apply-fixits false output:

Hide Details

runCmd: settings set plugin.process.gdb-remote.packet-timeout 60 output:

Hide Details

runCmd: settings set symbols.clang-modules-cache-path "/Users/buildslave/jenkins/workspace/lldb-cmake-sanitized/lldb-build/lldb-test-build.noindex/module-cache-lldb/lldb-api" output:

Hide Details

runCmd: settings set use-color false output:

Hide Details

runCmd: setting set target.prefer-dynamic-value no-dynamic-values output:

Hide Details

runCmd: settings set target.env-vars ASAN_OPTIONS=detect_stack_use_after_return=1 DYLD_INSERT_LIBRARIES=/Users/buildslave/jenkins/workspace/lldb-cmake-sanitized/host-compiler/lib/clang/11.0.0/lib/darwin/libclang_rt.asan_osx_dynamic.dylib output:

Hide Details

runCmd: script import lldb.macosx.heap output:

Hide Details

runCmd: ptr_refs my_ptr runCmd failed! error: 'ptr_refs' is not a valid command.

Hide Details

Hide Details

XFAIL: LLDB (/Users/buildslave/jenkins/workspace/lldb-cmake-sanitized/lldb-build/bin/clang-11-x86_64) :: test_ptr_refs_dwarf (TestPtrRefs.TestPtrRefs) <bound method SBProcess.Kill of <lldb.SBProcess; proxy of <Swig Object of type 'lldb::SBProcess *' at 0x1064de990> >>: success

Hide Details

UNSUPPORTED: LLDB (/Users/buildslave/jenkins/workspace/lldb-cmake-sanitized/lldb-build/bin/clang-11-x86_64) :: test_ptr_refs_dwo (TestPtrRefs.TestPtrRefs) (test case does not fall in any category of interest for this run) runCmd: settings clear -all output:

Hide Details

runCmd: settings set symbols.enable-external-lookup false output:

Hide Details

runCmd: settings set target.auto-apply-fixits false output:

Hide Details

runCmd: settings set plugin.process.gdb-remote.packet-timeout 60 output:

Hide Details

runCmd: settings set symbols.clang-modules-cache-path "/Users/buildslave/jenkins/workspace/lldb-cmake-sanitized/lldb-build/lldb-test-build.noindex/module-cache-lldb/lldb-api" output:

Hide Details

runCmd: settings set use-color false output:

Hide Details

runCmd: setting set target.prefer-dynamic-value no-dynamic-values output:

Hide Details

runCmd: settings set target.env-vars ASAN_OPTIONS=detect_stack_use_after_return=1 DYLD_INSERT_LIBRARIES=/Users/buildslave/jenkins/workspace/lldb-cmake-sanitized/host-compiler/lib/clang/11.0.0/lib/darwin/libclang_rt.asan_osx_dynamic.dylib output:

Hide Details

runCmd: script import lldb.macosx.heap output:

Hide Details

runCmd: ptr_refs my_ptr runCmd failed! error: 'ptr_refs' is not a valid command.

Hide Details

Hide Details

XFAIL: LLDB (/Users/buildslave/jenkins/workspace/lldb-cmake-sanitized/lldb-build/bin/clang-11-x86_64) :: test_ptr_refs_gmodules (TestPtrRefs.TestPtrRefs) <bound method SBProcess.Kill of <lldb.SBProcess; proxy of <Swig Object of type 'lldb::SBProcess *' at 0x11d7c21e0> >>: success

Hide Details

Restore dir to: /Users/buildslave/jenkins/workspace/lldb-cmake-sanitized/lldb-build/tools/lldb/test ====================================================================== FAIL: test_ptr_refs_dsym (TestPtrRefs.TestPtrRefs) Test format string functionality. ---------------------------------------------------------------------- Traceback (most recent call last): File "/Users/buildslave/jenkins/workspace/lldb-cmake-sanitized/llvm-project/lldb/packages/Python/lldbsuite/test/lldbtest.py", line 1751, in test_method return attrvalue(self) File "/Users/buildslave/jenkins/workspace/lldb-cmake-sanitized/llvm-project/lldb/packages/Python/lldbsuite/test/decorators.py", line 110, in wrapper func(*args, **kwargs) File "/Users/buildslave/jenkins/workspace/lldb-cmake-sanitized/llvm-project/lldb/test/API/functionalities/ptr_refs/TestPtrRefs.py", line 47, in test_ptr_refs self.expect("ptr_refs my_ptr", substrs=["malloc", "stack"]) File "/Users/buildslave/jenkins/workspace/lldb-cmake-sanitized/llvm-project/lldb/packages/Python/lldbsuite/test/lldbtest.py", line 2391, in expect if msg else EXP_MSG(str, output, exe)) AssertionError: False is not True : 'ptr_refs my_ptr' returns expected result, got '0x00007ffeed802478: stack in frame #0 of thread #1: tid 0x4ab73d in variable at 0x7ffeed802478: (const char *) my_ptr = 0x00006020000000b0 "hello" 0x00007ffeed802410: stack (red zone)' Config=x86_64-/Users/buildslave/jenkins/workspace/lldb-cmake-sanitized/lldb-build/bin/clang-11 ---------------------------------------------------------------------- Ran 4 tests in 9.133s

Hide Details

RESULT: FAILED (0 passes, 1 failures, 0 errors, 1 skipped, 2 expected failures, 0 unexpected successes)

Hide Details

--

Hide Details

******************** UNSUPPORTED: lldb-api :: functionalities/darwin_log/filter/exact_match/activity-chain/TestDarwinLogFilterMatchActivityChain.py (1794 of 1976) UNSUPPORTED: lldb-api :: functionalities/asan/TestMemoryHistory.py (1795 of 1976) PASS: lldb-unit :: Utility/./UtilityTests/UriParserTest.BracketedHostnameWithColon (1796 of 1976) PASS: lldb-unit :: Symbol/./SymbolTests/TestClangASTImporter.CanImportInvalidType (1797 of 1976) PASS: lldb-api :: types/TestDoubleTypes.py (1798 of 1976) PASS: lldb-unit :: Symbol/./SymbolTests/TestTypeSystemClang.TestGetTypeClassNested (1799 of 1976) UNSUPPORTED: lldb-api :: functionalities/tsan/thread_numbers/TestTsanThreadNumbers.py (1800 of 1976) PASS: lldb-unit :: Utility/./UtilityTests/UriParserTest.BracketedHostname (1801 of 1976) PASS: lldb-api :: commands/command/script/import/TestImport.py (1802 of 1976) UNSUPPORTED: lldb-shell :: SymbolFile/PDB/function-level-linking.test (1803 of 1976) PASS: lldb-unit :: Utility/./UtilityTests/Flags.AnySet (1804 of 1976) PASS: lldb-api :: functionalities/gdb_remote_client/TestNoGPacketSupported.py (1805 of 1976) UNSUPPORTED: lldb-shell :: SymbolFile/PDB/ast-restore.test (1806 of 1976) PASS: lldb-unit :: Language/Highlighting/./HighlighterTests/HighlighterTest.ClangCursorPosInOtherToken (1807 of 1976) PASS: lldb-shell :: SymbolFile/Breakpad/line-table-missing-file.test (1808 of 1976) PASS: lldb-unit :: Host/./HostTests/File.GetStreamFromDescriptor (1809 of 1976) PASS: lldb-shell :: SymbolFile/NativePDB/function-types-classes.cpp (1810 of 1976) PASS: lldb-unit :: Utility/./UtilityTests/StringListTest.AppendListCStringArray (1811 of 1976) PASS: lldb-shell :: Settings/TestModuleCacheSanity.test (1812 of 1976) PASS: lldb-unit :: Host/./HostTests/SocketTest.UDPGetConnectURI (1813 of 1976) PASS: lldb-api :: commands/breakpoint/command/list/TestBreakpointCommandList.py (1814 of 1976) UNSUPPORTED: lldb-shell :: SymbolFile/target-symbols-add-unwind.test (1815 of 1976) UNSUPPORTED: lldb-shell :: Register/aarch64-gp-read.test (1816 of 1976) PASS: lldb-shell :: SymbolFile/DWARF/split-dwarf-inlining.cpp (1817 of 1976) PASS: lldb-api :: lang/objc/objc-struct-return/TestObjCStructReturn.py (1818 of 1976) PASS: lldb-unit :: Utility/./UtilityTests/StringListTest.JoinThree (1819 of 1976) PASS: lldb-api :: functionalities/gdb_remote_client/TestTargetXMLArch.py (1820 of 1976) UNSUPPORTED: lldb-shell :: ScriptInterpreter/Lua/persistent_state.test (1821 of 1976) PASS: lldb-unit :: Expression/./ExpressionTests/CppModuleConfigurationTest.AmbiguousCLib (1822 of 1976) PASS: lldb-api :: lang/objc/foundation/TestObjectDescriptionAPI.py (1823 of 1976) PASS: lldb-shell :: Watchpoint/SetErrorCases.test (1824 of 1976) UNSUPPORTED: lldb-shell :: SymbolFile/PDB/pointers.test (1825 of 1976) PASS: lldb-api :: macosx/safe-to-func-call/TestSafeFuncCalls.py (1826 of 1976) PASS: lldb-shell :: SymbolFile/DWARF/debug_loc_and_loclists.s (1827 of 1976) PASS: lldb-api :: lang/cpp/offsetof/TestOffsetofCpp.py (1828 of 1976) PASS: lldb-unit :: Utility/./UtilityTests/DataExtractorTest.UncommonAddressSize (1829 of 1976) PASS: lldb-shell :: ObjectFile/MachO/symtab.yaml (1830 of 1976) PASS: lldb-api :: functionalities/backticks/TestBackticksWithoutATarget.py (1831 of 1976) PASS: lldb-api :: lang/c/anonymous/TestAnonymous.py (1832 of 1976) PASS: lldb-unit :: Host/./HostTests/SocketTest.DecodeHostAndPort (1833 of 1976) PASS: lldb-unit :: Utility/./UtilityTests/BinaryStreamTest.PutSLEB128EightBytes (1834 of 1976) PASS: lldb-api :: functionalities/data-formatter/data-formatter-objc/TestDataFormatterObjCKVO.py (1835 of 1976) PASS: lldb-api :: commands/watchpoints/watchpoint_set_command/TestWatchLocationWithWatchSet.py (1836 of 1976) UNSUPPORTED: lldb-shell :: Register/x86-64-xmm16-read.test (1837 of 1976) UNSUPPORTED: lldb-shell :: Register/arm-fp-read.test (1838 of 1976) PASS: lldb-shell :: SymbolFile/DWARF/DW_AT_low_pc-addrx.s (1839 of 1976) PASS: lldb-api :: python_api/debugger/TestDebuggerAPI.py (1840 of 1976) PASS: lldb-api :: lang/cpp/namespace/TestNamespaceLookup.py (1841 of 1976) PASS: lldb-shell :: ObjectFile/ELF/avr-basic-info.yaml (1842 of 1976) PASS: lldb-unit :: Process/gdb-remote/./ProcessGdbRemoteTests/GDBRemoteCommunicationClientTest.SendStartTracePacket (1843 of 1976) PASS: lldb-api :: functionalities/thread/exit_during_step/TestExitDuringStep.py (1844 of 1976) PASS: lldb-shell :: Settings/TestDisableColor.test (1845 of 1976) PASS: lldb-api :: lang/cpp/frame-var-anon-unions/TestFrameVariableAnonymousUnions.py (1846 of 1976) PASS: lldb-unit :: Utility/./UtilityTests/DataExtractorTest.GetMaxU64_unchecked (1847 of 1976) PASS: lldb-api :: functionalities/postmortem/minidump/TestMiniDump.py (1848 of 1976) PASS: lldb-api :: lang/c/const_variables/TestConstVariables.py (1849 of 1976) PASS: lldb-unit :: Language/Highlighting/./HighlighterTests/HighlighterTest.ClangTrailingBackslashMissingNewLine (1850 of 1976) PASS: lldb-api :: terminal/TestSTTYBeforeAndAfter.py (1851 of 1976) PASS: lldb-unit :: Utility/./UtilityTests/DataExtractorTest.GetMaxU64 (1852 of 1976) PASS: lldb-unit :: ObjectFile/Breakpad/./ObjectFileBreakpadTests/FuncRecord.parse (1853 of 1976) PASS: lldb-shell :: Quit/TestQuitExitCodeHexA.test (1854 of 1976) PASS: lldb-unit :: Utility/./UtilityTests/StringExtractorTest.GetHexU8_Underflow2_NoEof (1855 of 1976) PASS: lldb-unit :: Utility/./UtilityTests/RegularExpression.Valid (1856 of 1976) PASS: lldb-shell :: Driver/TestRepl.test (1857 of 1976) PASS: lldb-unit :: UnwindAssembly/x86/./UnwindAssemblyx86Tests/Testx86AssemblyInspectionEngine.TestPushRBPWithREX (1858 of 1976) PASS: lldb-unit :: ObjectFile/ELF/./ObjectFileELFTests/ObjectFileELFTest.GetSymtab_NoSymEntryPointArmThumbAddressClass (1859 of 1976) PASS: lldb-unit :: Utility/./UtilityTests/AnsiTerminal.Unknown (1860 of 1976) PASS: lldb-shell :: Driver/TestNoUseColor.test (1861 of 1976) PASS: lldb-api :: commands/expression/import-std-module/deque-dbg-info-content/TestDbgInfoContentDequeFromStdModule.py (1862 of 1976) PASS: lldb-shell :: Minidump/memory-region.yaml (1863 of 1976) PASS: lldb-api :: commands/expression/top-level/TestTopLevelExprs.py (1864 of 1976) PASS: lldb-shell :: ObjectFile/wasm/stripped-debug-sections.yaml (1865 of 1976) UNSUPPORTED: lldb-api :: commands/gui/basic/TestGuiBasic.py (1866 of 1976) PASS: lldb-api :: functionalities/data-formatter/data-formatter-stl/libcxx/unique_ptr/TestDataFormatterLibcxxUniquePtr.py (1867 of 1976) PASS: lldb-api :: functionalities/data-formatter/data-formatter-enum-format/TestDataFormatterEnumFormat.py (1868 of 1976) PASS: lldb-api :: functionalities/thread/concurrent_events/TestConcurrentDelaySignalWatch.py (1869 of 1976) PASS: lldb-api :: functionalities/thread/concurrent_events/TestConcurrentManyBreakpoints.py (1870 of 1976) PASS: lldb-api :: functionalities/data-formatter/varscript_formatting/TestDataFormatterVarScriptFormatting.py (1871 of 1976) PASS: lldb-unit :: Utility/./UtilityTests/VMRange.Ordering (1872 of 1976) PASS: lldb-unit :: Process/minidump/./LLDBMinidumpTests/MinidumpParserTest.GetMemoryRegionInfoLinuxMaps (1873 of 1976) PASS: lldb-unit :: Expression/./ExpressionTests/CppModuleConfigurationTest.MissingUsrInclude (1874 of 1976) PASS: lldb-api :: commands/expression/deleting-implicit-copy-constructor/TestDeletingImplicitCopyConstructor.py (1875 of 1976) PASS: lldb-unit :: Utility/./UtilityTests/FileSpecTest.PrependPathComponent (1876 of 1976) PASS: lldb-api :: commands/command/history/TestCommandHistory.py (1877 of 1976) PASS: lldb-api :: macosx/find-app-in-bundle/TestFindAppInBundle.py (1878 of 1976) PASS: lldb-api :: functionalities/gdb_remote_client/TestPlatformClient.py (1879 of 1976) UNSUPPORTED: lldb-api :: benchmarks/libcxxmap/TestBenchmarkLibcxxMap.py (1880 of 1976) PASS: lldb-api :: commands/frame/diagnose/local-variable/TestLocalVariable.py (1881 of 1976) PASS: lldb-shell :: SymbolFile/DWARF/split-dwarf-multiple-cu.ll (1882 of 1976) PASS: lldb-unit :: Utility/./UtilityTests/RangeTest.ContainsRange (1883 of 1976) PASS: lldb-unit :: Utility/./UtilityTests/ArgsTest.TestUnknownEscape (1884 of 1976) PASS: lldb-unit :: Utility/./UtilityTests/UUIDTest.SetFromStringRef (1885 of 1976) PASS: lldb-unit :: Expression/./ExpressionTests/DiagnosticManagerTest.PutString (1886 of 1976) PASS: lldb-unit :: Utility/./UtilityTests/UserIDResolver.GetGroupName (1887 of 1976) PASS: lldb-unit :: Utility/./UtilityTests/AnsiTerminal.KnownPrefix (1888 of 1976) PASS: lldb-api :: lang/objc/foundation/TestObjCMethodsNSArray.py (1889 of 1976) PASS: lldb-unit :: Utility/./UtilityTests/StringExtractorTest.GetHexBytes_OddPair2 (1890 of 1976) PASS: lldb-unit :: Utility/./UtilityTests/DataExtractorTest.GetCStrEmpty (1891 of 1976) UNSUPPORTED: lldb-api :: python_api/disassemble-raw-data/TestDisassemble_VST1_64.py (1892 of 1976) PASS: lldb-api :: commands/watchpoints/watchpoint_disable/TestWatchpointDisable.py (1893 of 1976) PASS: lldb-api :: commands/process/attach/TestProcessAttach.py (1894 of 1976) PASS: lldb-api :: commands/frame/select/TestFrameSelect.py (1895 of 1976) PASS: lldb-api :: lang/objc/modules-hash-mismatch/TestClangModulesHashMismatch.py (1896 of 1976) PASS: lldb-api :: types/TestFloatTypes.py (1897 of 1976) PASS: lldb-api :: commands/reproducer/invalid-args/TestInvalidArgsReproducer.py (1898 of 1976) PASS: lldb-unit :: Utility/./UtilityTests/TimeoutTest.Format (1899 of 1976) PASS: lldb-shell :: Quit/TestQuitExitCodeTooManyArgs.test (1900 of 1976) PASS: lldb-unit :: SymbolFile/NativePDB/./SymbolFileNativePDBTests/PDBFPOProgramToDWARFExpressionTests.UnresolvedCyclicRegisterAssignmentReference (1901 of 1976) PASS: lldb-unit :: Language/Highlighting/./HighlighterTests/HighlighterTest.ClangCommas (1902 of 1976) PASS: lldb-unit :: Symbol/./SymbolTests/TestClangASTImporter.RecordLayout (1903 of 1976) PASS: lldb-api :: python_api/disassemble-raw-data/TestDisassembleRawData.py (1904 of 1976) PASS: lldb-unit :: UnwindAssembly/x86/./UnwindAssemblyx86Tests/Testx86AssemblyInspectionEngine.TestPushEDI (1905 of 1976) PASS: lldb-unit :: Utility/./UtilityTests/ArchSpecTest.TestSetTriple (1906 of 1976) PASS: lldb-unit :: Utility/./UtilityTests/ArgsTest.TestAppendArg (1907 of 1976) PASS: lldb-api :: functionalities/data-formatter/compactvectors/TestCompactVectors.py (1908 of 1976) PASS: lldb-api :: commands/expression/persistent_variables/TestPersistentVariables.py (1909 of 1976) PASS: lldb-unit :: UnwindAssembly/x86/./UnwindAssemblyx86Tests/Testx86AssemblyInspectionEngine.TestPopRBPWithREX (1910 of 1976) PASS: lldb-api :: commands/expression/po_verbosity/TestPoVerbosity.py (1911 of 1976) PASS: lldb-shell :: Breakpoint/debug_rnglistx_rlex.test (1912 of 1976) PASS: lldb-api :: lang/objc/print-obj/TestPrintObj.py (1913 of 1976) PASS: lldb-api :: functionalities/data-formatter/data-formatter-synth/TestDataFormatterSynth.py (1914 of 1976) PASS: lldb-unit :: Target/./TargetTests/ModuleCacheTest.GetAndPut (1915 of 1976) PASS: lldb-api :: commands/expression/calculator_mode/TestCalculatorMode.py (1916 of 1976) PASS: lldb-api :: tools/lldb-server/inferior-crash/TestGdbRemoteAbort.py (1917 of 1976) PASS: lldb-api :: commands/platform/process/list/TestProcessList.py (1918 of 1976) PASS: lldb-api :: functionalities/data-formatter/data-formatter-objc/nsstring/TestDataFormatterNSString.py (1919 of 1976) PASS: lldb-unit :: Utility/./UtilityTests/StringLexerTest.PutBack (1920 of 1976) PASS: lldb-unit :: Utility/./UtilityTests/OptionsWithRawTest.MultiWordSuffix (1921 of 1976) PASS: lldb-api :: functionalities/breakpoint/breakpoint_by_line_and_column/TestBreakpointByLineAndColumn.py (1922 of 1976) PASS: lldb-api :: commands/statistics/basic/TestStats.py (1923 of 1976) PASS: lldb-unit :: Utility/./UtilityTests/StreamTest.PutBytesAsRawHex8ToLittleEndian (1924 of 1976) PASS: lldb-unit :: Utility/./UtilityTests/StreamTeeTest.Flush (1925 of 1976) PASS: lldb-api :: lang/c/conflicting-symbol/TestConflictingSymbol.py (1926 of 1976) PASS: lldb-api :: functionalities/thread/concurrent_events/TestConcurrentDelayedCrashWithBreakpointWatchpoint.py (1927 of 1976) UNSUPPORTED: lldb-api :: commands/target/auto-install-main-executable/TestAutoInstallMainExecutable.py (1928 of 1976) UNSUPPORTED: lldb-shell :: SymbolFile/PDB/udt-layout.test (1929 of 1976) PASS: lldb-unit :: Utility/./UtilityTests/StringExtractorTest.GetHexU8_Exact_NoEof (1930 of 1976) PASS: lldb-api :: lang/c/offsetof/TestOffsetof.py (1931 of 1976) UNSUPPORTED: lldb-api :: lang/cpp/printf/TestPrintf.py (1932 of 1976) PASS: lldb-api :: source-manager/TestSourceManager.py (1933 of 1976) PASS: lldb-api :: python_api/watchpoint/TestWatchpointIgnoreCount.py (1934 of 1976) PASS: lldb-unit :: Process/gdb-remote/./ProcessGdbRemoteTests/GDBRemoteCommunicationClientTest.SendGetMetaDataPacket (1935 of 1976) PASS: lldb-unit :: Process/gdb-remote/./ProcessGdbRemoteTests/GDBRemoteCommunicationClientTest.SendStopTracePacket (1936 of 1976) PASS: lldb-api :: lang/cpp/function_refs/TestFunctionRefs.py (1937 of 1976) PASS: lldb-shell :: Reproducer/Functionalities/TestExpressionEvaluation.test (1938 of 1976) UNSUPPORTED: lldb-shell :: ScriptInterpreter/Lua/bindings.test (1939 of 1976) PASS: lldb-shell :: ObjectFile/ELF/section-types-edgecases.yaml (1940 of 1976) PASS: lldb-shell :: Commands/command-script-import.test (1941 of 1976) PASS: lldb-api :: commands/expression/completion-in-lambda-and-unnamed-class/TestCompletionInLambdaAndUnnamedClass.py (1942 of 1976) UNSUPPORTED: lldb-api :: iohandler/unicode/TestUnicode.py (1943 of 1976) PASS: lldb-unit :: UnwindAssembly/x86/./UnwindAssemblyx86Tests/Testx86AssemblyInspectionEngine.TestPushEBX (1944 of 1976) PASS: lldb-unit :: Utility/./UtilityTests/TimeoutTest.Construction (1945 of 1976) PASS: lldb-unit :: Utility/./UtilityTests/StringListTest.GetMaxStringLengthEmpty (1946 of 1976) UNSUPPORTED: lldb-api :: lang/cpp/function-template-parameter-pack/TestFunctionTemplateParameterPack.py (1947 of 1976) UNSUPPORTED: lldb-api :: functionalities/thread/thread_specific_break_plus_condition/TestThreadSpecificBpPlusCondition.py (1948 of 1976) PASS: lldb-unit :: UnwindAssembly/x86/./UnwindAssemblyx86Tests/Testx86AssemblyInspectionEngine.TestPushR13 (1949 of 1976) PASS: lldb-unit :: Utility/./UtilityTests/UriParserTest.SchemeHostSeparator4 (1950 of 1976) PASS: lldb-unit :: Utility/./UtilityTests/ListenerTest.GetEventImmediate (1951 of 1976) PASS: lldb-api :: tools/lldb-server/TestGdbRemote_qThreadStopInfo.py (1952 of 1976) PASS: lldb-api :: tools/lldb-server/TestGdbRemoteExitCode.py (1953 of 1976) PASS: lldb-shell :: SymbolFile/DWARF/find-basic-namespace.cpp (1954 of 1976) PASS: lldb-shell :: SymbolFile/Breakpad/line-table.test (1955 of 1976) PASS: lldb-unit :: Utility/./UtilityTests/RecordReplayTest.InstrumentedBarPtr (1956 of 1976) PASS: lldb-api :: functionalities/thread/concurrent_events/TestConcurrentSignalWatchBreak.py (1957 of 1976) PASS: lldb-unit :: Symbol/./SymbolTests/TestTypeSystemClang.TestUnifyAccessSpecifiers (1958 of 1976) PASS: lldb-api :: python_api/module_section/TestModuleAndSection.py (1959 of 1976) PASS: lldb-api :: functionalities/thread/concurrent_events/TestConcurrentWatchBreakDelay.py (1960 of 1976) PASS: lldb-shell :: Expr/TestMultilineExpr.test (1961 of 1976) PASS: lldb-unit :: Utility/./UtilityTests/RangeTest.ContainsAddrInvalid (1962 of 1976) PASS: lldb-api :: functionalities/thread/concurrent_events/TestConcurrentTwoBreakpointsOneWatchpoint.py (1963 of 1976) PASS: lldb-unit :: Utility/./UtilityTests/ListenerTest.GetEventWait (1964 of 1976) PASS: lldb-api :: commands/expression/inline-namespace/TestInlineNamespace.py (1965 of 1976) UNSUPPORTED: lldb-api :: arm/breakpoint-it/TestBreakpointIt.py (1966 of 1976) UNSUPPORTED: lldb-api :: tools/lldb-server/TestGdbRemoteAuxvSupport.py (1967 of 1976) PASS: lldb-api :: functionalities/data-formatter/dump_dynamic/TestDumpDynamic.py (1968 of 1976) PASS: lldb-unit :: Core/./LLDBCoreTests/MangledTest.ResultForValidName (1969 of 1976) PASS: lldb-shell :: Quit/TestQuitExitCode0.test (1970 of 1976) PASS: lldb-shell :: SymbolFile/DWARF/DW_OP_piece-struct.s (1971 of 1976) PASS: lldb-shell :: Breakpoint/debug_rnglist_rlestartend.test (1972 of 1976) PASS: lldb-shell :: SymbolFile/Breakpad/line-table-edgecases.test (1973 of 1976) PASS: lldb-api :: functionalities/thread/concurrent_events/TestConcurrentTwoWatchpointsOneSignal.py (1974 of 1976) PASS: lldb-api :: lang/c/bitfields/TestBitfields.py (1975 of 1976) PASS: lldb-api :: functionalities/inline-stepping/TestInlineStepping.py (1976 of 1976)

Hide Details

Testing Time: 4358.94s ******************** Failing Tests (3): lldb-api :: python_api/thread/TestThreadAPI.py lldb-api :: lang/objc/ptr_refs/TestPtrRefsObjC.py lldb-api :: functionalities/ptr_refs/TestPtrRefs.py

Hide Details

Hide Details

Slowest Tests: -------------------------------------------------------------------------- 91.67s: lldb-api :: functionalities/gdb_remote_client/TestWasm.py 93.46s: lldb-api :: types/TestLongTypes.py 95.51s: lldb-api :: commands/settings/TestSettings.py 113.43s: lldb-api :: lang/objc/objc-new-syntax/TestObjCNewSyntaxDictionary.py 113.50s: lldb-api :: lang/objc/foundation/TestObjCMethodsString.py 113.84s: lldb-api :: lang/objc/foundation/TestObjCMethodsNSError.py 114.58s: lldb-api :: lang/objc/objc-new-syntax/TestObjCNewSyntaxArray.py 119.70s: lldb-api :: python_api/exprpath_synthetic/TestExprPathSynthetic.py 120.63s: lldb-api :: tools/lldb-server/TestGdbRemote_qThreadStopInfo.py 136.17s: lldb-api :: lang/objc/exceptions/TestObjCExceptions.py 138.65s: lldb-api :: lang/objc/real-definition/TestRealDefinition.py 151.53s: lldb-api :: lang/objc/objc-new-syntax/TestObjCNewSyntaxLiteral.py 154.34s: lldb-api :: types/TestLongTypesExpr.py 164.64s: lldb-api :: lang/cpp/namespace/TestNamespaceLookup.py 215.06s: lldb-api :: lang/objc/foundation/TestObjCMethods.py 240.18s: lldb-api :: lang/objc/hidden-ivars/TestHiddenIvars.py 248.72s: lldb-api :: tools/lldb-server/TestGdbRemoteThreadsInStopReply.py 256.37s: lldb-api :: api/multithreaded/TestMultithreaded.py 272.06s: lldb-api :: lang/cpp/enum_types/TestCPP11EnumTypes.py 365.51s: lldb-api :: tools/lldb-server/TestLldbGdbServer.py

Hide Details

Tests Times: -------------------------------------------------------------------------- [ Range ] :: [ Percentage ] :: [ Count ] -------------------------------------------------------------------------- [ 0s, 20s) :: [********************************** ] :: [1724/1976] [ 20s, 40s) :: [** ] :: [ 120/1976] [ 40s, 60s) :: [* ] :: [ 79/1976] [ 60s, 80s) :: [ ] :: [ 27/1976] [ 80s,100s) :: [ ] :: [ 9/1976] [100s,120s) :: [ ] :: [ 4/1976] [120s,140s) :: [ ] :: [ 2/1976] [140s,160s) :: [ ] :: [ 3/1976] [160s,180s) :: [ ] :: [ 2/1976] [180s,200s) :: [ ] :: [ 0/1976] [200s,220s) :: [ ] :: [ 0/1976] [220s,240s) :: [ ] :: [ 1/1976] [240s,260s) :: [ ] :: [ 2/1976] [260s,280s) :: [ ] :: [ 1/1976] [280s,300s) :: [ ] :: [ 1/1976] [300s,320s) :: [ ] :: [ 0/1976] [320s,340s) :: [ ] :: [ 0/1976] [340s,360s) :: [ ] :: [ 0/1976] [360s,380s) :: [ ] :: [ 1/1976] Expected Passes : 1800 Expected Failures : 6 Unsupported Tests : 167 Unexpected Failures: 3 FAILED: tools/lldb/test/CMakeFiles/check-lldb-lit cd /Users/buildslave/jenkins/workspace/lldb-cmake-sanitized/lldb-build/tools/lldb/test && /usr/local/bin/python /Users/buildslave/jenkins/workspace/lldb-cmake-sanitized/lldb-build/./bin/llvm-lit -v --time-tests --shuffle --xunit-xml-output=/Users/buildslave/jenkins/workspace/lldb-cmake-sanitized/test/results.xml -v -j 4 --timeout 1200 /Users/buildslave/jenkins/workspace/lldb-cmake-sanitized/lldb-build/tools/lldb/test ninja: build stopped: subcommand failed. Command failed: Command '['/usr/bin/env', 'TERM=vt100', '/usr/local/bin/ninja', '-v', 'check-lldb']' returned non-zero exit status 1. Command: ['/usr/bin/env', 'TERM=vt100', '/usr/local/bin/ninja', '-v', 'check-lldb'] [Pipeline] } [Pipeline] // timeout [Pipeline] } [Pipeline] // stage [Pipeline] stage [Pipeline] { (Declarative: Post Actions) [Pipeline] scanForIssues [Clang (LLVM based)] Sleeping for 5 seconds due to JENKINS-32191... [Clang (LLVM based)] Parsing console log (workspace: '/Users/buildslave/jenkins/workspace/lldb-cmake-sanitized') [Clang (LLVM based)] Successfully parsed console log [Clang (LLVM based)] -> found 4 issues (skipped 0 duplicates) [Clang (LLVM based)] Post processing issues on 'green-dragon-23' with source code encoding 'UTF-8' [Clang (LLVM based)] Creating SCM blamer to obtain author and commit information for affected files [Clang (LLVM based)] Creating SCM miner to obtain statistics for affected repository files [Clang (LLVM based)] Resolving file names for all issues in source directory '/Users/buildslave/jenkins/workspace/lldb-cmake-sanitized' [Clang (LLVM based)] -> resolved paths in source directory (3 found, 0 not found) [Clang (LLVM based)] Resolving module names from module definitions (build.xml, pom.xml, or Manifest.mf files) [Clang (LLVM based)] -> resolved module names for 4 issues [Clang (LLVM based)] Resolving package names (or namespaces) by parsing the affected files [Clang (LLVM based)] -> resolved package names of 3 affected files [Clang (LLVM based)] No filter has been set, publishing all 4 issues [Clang (LLVM based)] Creating fingerprints for all affected code blocks to track issues over different builds [Clang (LLVM based)] -> created fingerprints for 4 issues (skipped 0 issues) [Clang (LLVM based)] Copying affected files to Jenkins' build folder '/Users/Shared/Jenkins/Home/jobs/lldb-cmake-sanitized/builds/1156/files-with-issues' [Clang (LLVM based)] -> 3 copied, 0 not in workspace, 0 not-found, 0 with I/O error [Pipeline] junit Recording test results [Pipeline] } [Pipeline] // stage [Pipeline] } [Pipeline] // withEnv [Pipeline] } [Pipeline] // node [Pipeline] End of Pipeline ERROR: script returned exit code 1 Finished: FAILURE