FailedConsole Output

Skipping 8,456 KB.. Full Log
itized/lldb-build/lldb-test-build.noindex/module-cache-clang/lldb-api --executable /Users/buildslave/jenkins/workspace/lldb-cmake-sanitized/lldb-build/./bin/lldb --compiler /Users/buildslave/jenkins/workspace/lldb-cmake-sanitized/lldb-build/./bin/clang --dsymutil /Users/buildslave/jenkins/workspace/lldb-cmake-sanitized/lldb-build/./bin/dsymutil --filecheck /Users/buildslave/jenkins/workspace/lldb-cmake-sanitized/lldb-build/./bin/FileCheck --lldb-libs-dir /Users/buildslave/jenkins/workspace/lldb-cmake-sanitized/lldb-build/./lib /Users/buildslave/jenkins/workspace/lldb-cmake-sanitized/llvm-project/lldb/test/API/lang/objc/ptr_refs -p TestPtrRefsObjC.py
Change dir to: /Users/buildslave/jenkins/workspace/lldb-cmake-sanitized/llvm-project/lldb/test/API/lang/objc/ptr_refs
runCmd: settings clear -all
output: 

Hide Details

runCmd: settings set symbols.enable-external-lookup false output:

Hide Details

runCmd: settings set target.auto-apply-fixits false output:

Hide Details

runCmd: settings set plugin.process.gdb-remote.packet-timeout 60 output:

Hide Details

runCmd: settings set symbols.clang-modules-cache-path "/Users/buildslave/jenkins/workspace/lldb-cmake-sanitized/lldb-build/lldb-test-build.noindex/module-cache-lldb/lldb-api" output:

Hide Details

runCmd: settings set use-color false output:

Hide Details

runCmd: setting set target.prefer-dynamic-value no-dynamic-values output:

Hide Details

runCmd: settings set target.env-vars ASAN_OPTIONS=detect_stack_use_after_return=1 DYLD_INSERT_LIBRARIES=/Users/buildslave/jenkins/workspace/lldb-cmake-sanitized/host-compiler/lib/clang/11.0.0/lib/darwin/libclang_rt.asan_osx_dynamic.dylib output:

Hide Details

runCmd: script import lldb.macosx.heap output: "crashlog" and "save_crashlog" command installed, use the "--help" option for detailed help "malloc_info", "ptr_refs", "cstr_refs", "find_variable", and "objc_refs" commands have been installed, use the "--help" options on these commands for detailed help.

Hide Details

Hide Details

runCmd: ptr_refs self output: 0x00007ffedfcf4468: stack in frame #0 of thread #1: tid 0xb1eb22 in variable at 0x7ffedfcf4468: (MyClass *) self = 0x00006020000000d0 0x00007ffedfcf43e0: stack (red zone)

Hide Details

Hide Details

Expecting sub string: malloc Not matched

Hide Details

FAIL: LLDB (/Users/buildslave/jenkins/workspace/lldb-cmake-sanitized/lldb-build/bin/clang-11-x86_64) :: test_ptr_refs_dsym (TestPtrRefsObjC.TestPtrRefsObjC) <bound method SBProcess.Kill of <lldb.SBProcess; proxy of <Swig Object of type 'lldb::SBProcess *' at 0x10c5bf8a0> >>: success

Hide Details

runCmd: settings clear -all output:

Hide Details

runCmd: settings set symbols.enable-external-lookup false output:

Hide Details

runCmd: settings set target.auto-apply-fixits false output:

Hide Details

runCmd: settings set plugin.process.gdb-remote.packet-timeout 60 output:

Hide Details

runCmd: settings set symbols.clang-modules-cache-path "/Users/buildslave/jenkins/workspace/lldb-cmake-sanitized/lldb-build/lldb-test-build.noindex/module-cache-lldb/lldb-api" output:

Hide Details

runCmd: settings set use-color false output:

Hide Details

runCmd: setting set target.prefer-dynamic-value no-dynamic-values output:

Hide Details

runCmd: settings set target.env-vars ASAN_OPTIONS=detect_stack_use_after_return=1 DYLD_INSERT_LIBRARIES=/Users/buildslave/jenkins/workspace/lldb-cmake-sanitized/host-compiler/lib/clang/11.0.0/lib/darwin/libclang_rt.asan_osx_dynamic.dylib output:

Hide Details

runCmd: script import lldb.macosx.heap output:

Hide Details

runCmd: ptr_refs self runCmd failed! error: 'ptr_refs' is not a valid command.

Hide Details

Hide Details

XFAIL: LLDB (/Users/buildslave/jenkins/workspace/lldb-cmake-sanitized/lldb-build/bin/clang-11-x86_64) :: test_ptr_refs_dwarf (TestPtrRefsObjC.TestPtrRefsObjC) <bound method SBProcess.Kill of <lldb.SBProcess; proxy of <Swig Object of type 'lldb::SBProcess *' at 0x10b9c0990> >>: success

Hide Details

UNSUPPORTED: LLDB (/Users/buildslave/jenkins/workspace/lldb-cmake-sanitized/lldb-build/bin/clang-11-x86_64) :: test_ptr_refs_dwo (TestPtrRefsObjC.TestPtrRefsObjC) (test case does not fall in any category of interest for this run) runCmd: settings clear -all output:

Hide Details

runCmd: settings set symbols.enable-external-lookup false output:

Hide Details

runCmd: settings set target.auto-apply-fixits false output:

Hide Details

runCmd: settings set plugin.process.gdb-remote.packet-timeout 60 output:

Hide Details

runCmd: settings set symbols.clang-modules-cache-path "/Users/buildslave/jenkins/workspace/lldb-cmake-sanitized/lldb-build/lldb-test-build.noindex/module-cache-lldb/lldb-api" output:

Hide Details

runCmd: settings set use-color false output:

Hide Details

runCmd: setting set target.prefer-dynamic-value no-dynamic-values output:

Hide Details

runCmd: settings set target.env-vars ASAN_OPTIONS=detect_stack_use_after_return=1 DYLD_INSERT_LIBRARIES=/Users/buildslave/jenkins/workspace/lldb-cmake-sanitized/host-compiler/lib/clang/11.0.0/lib/darwin/libclang_rt.asan_osx_dynamic.dylib output:

Hide Details

runCmd: script import lldb.macosx.heap output:

Hide Details

runCmd: ptr_refs self runCmd failed! error: 'ptr_refs' is not a valid command.

Hide Details

Hide Details

XFAIL: LLDB (/Users/buildslave/jenkins/workspace/lldb-cmake-sanitized/lldb-build/bin/clang-11-x86_64) :: test_ptr_refs_gmodules (TestPtrRefsObjC.TestPtrRefsObjC) <bound method SBProcess.Kill of <lldb.SBProcess; proxy of <Swig Object of type 'lldb::SBProcess *' at 0x10c5bf1e0> >>: success

Hide Details

Restore dir to: /Users/buildslave/jenkins/workspace/lldb-cmake-sanitized/lldb-build/tools/lldb/test ====================================================================== FAIL: test_ptr_refs_dsym (TestPtrRefsObjC.TestPtrRefsObjC) Test the ptr_refs tool on Darwin with Objective-C ---------------------------------------------------------------------- Traceback (most recent call last): File "/Users/buildslave/jenkins/workspace/lldb-cmake-sanitized/llvm-project/lldb/packages/Python/lldbsuite/test/lldbtest.py", line 1751, in test_method return attrvalue(self) File "/Users/buildslave/jenkins/workspace/lldb-cmake-sanitized/llvm-project/lldb/packages/Python/lldbsuite/test/decorators.py", line 110, in wrapper func(*args, **kwargs) File "/Users/buildslave/jenkins/workspace/lldb-cmake-sanitized/llvm-project/lldb/test/API/lang/objc/ptr_refs/TestPtrRefsObjC.py", line 47, in test_ptr_refs self.expect("ptr_refs self", substrs=["malloc", "stack"]) File "/Users/buildslave/jenkins/workspace/lldb-cmake-sanitized/llvm-project/lldb/packages/Python/lldbsuite/test/lldbtest.py", line 2391, in expect if msg else EXP_MSG(str, output, exe)) AssertionError: False is not True : 'ptr_refs self' returns expected result, got '0x00007ffedfcf4468: stack in frame #0 of thread #1: tid 0xb1eb22 in variable at 0x7ffedfcf4468: (MyClass *) self = 0x00006020000000d0 0x00007ffedfcf43e0: stack (red zone)' Config=x86_64-/Users/buildslave/jenkins/workspace/lldb-cmake-sanitized/lldb-build/bin/clang-11 ---------------------------------------------------------------------- Ran 4 tests in 23.278s

Hide Details

RESULT: FAILED (0 passes, 1 failures, 0 errors, 1 skipped, 2 expected failures, 0 unexpected successes)

Hide Details

--

Hide Details

******************** PASS: lldb-api :: commands/expression/context-object-objc/TestContextObjectObjc.py (617 of 1977) PASS: lldb-api :: functionalities/recursion/TestValueObjectRecursion.py (618 of 1977) PASS: lldb-api :: source-manager/TestSourceManager.py (619 of 1977) UNSUPPORTED: lldb-api :: functionalities/darwin_log/filter/regex/activity-chain/TestDarwinLogFilterRegexActivityChain.py (620 of 1977) PASS: lldb-api :: lang/objc/objc-baseclass-sbtype/TestObjCBaseClassSBType.py (621 of 1977) PASS: lldb-unit :: Expression/./ExpressionTests/DiagnosticManagerTest.GetStringNoDiags (622 of 1977) PASS: lldb-unit :: Process/minidump/./LLDBMinidumpTests/MinidumpParserTest.InvalidMinidump (623 of 1977) PASS: lldb-unit :: Symbol/./SymbolTests/TestTypeSystemClang.TestNotDeletingUserCopyCstrDueToMoveCStr (624 of 1977) PASS: lldb-unit :: Utility/./UtilityTests/StringExtractorTest.GetHexBytes_FullString (625 of 1977) PASS: lldb-api :: commands/log/basic/TestLogging.py (626 of 1977) UNSUPPORTED: lldb-shell :: Expr/TestIRMemoryMapWindows.test (627 of 1977) PASS: lldb-unit :: Utility/./UtilityTests/StringExtractorTest.GetU32BigEndian (628 of 1977) UNSUPPORTED: lldb-api :: functionalities/thread/concurrent_events/TestConcurrentManySignals.py (629 of 1977) PASS: lldb-api :: functionalities/postmortem/minidump/TestMiniDump.py (630 of 1977) PASS: lldb-unit :: Utility/./UtilityTests/RecordReplayTest.InstrumentedFoo (631 of 1977) PASS: lldb-unit :: Utility/./UtilityTests/DataExtractorTest.GetCStrEmpty (632 of 1977) PASS: lldb-api :: commands/expression/import-std-module/forward_list-dbg-info-content/TestDbgInfoContentForwardListFromStdModule.py (633 of 1977) PASS: lldb-unit :: SymbolFile/DWARF/./SymbolFileDWARFTests/SymbolFileDWARFTests.TestAbbrevOutOfOrder (634 of 1977) PASS: lldb-unit :: Process/minidump/./LLDBMinidumpTests/RegisterContextMinidump.ConvertMinidumpContext_x86_64 (635 of 1977) PASS: lldb-unit :: Utility/./UtilityTests/StreamTest.Indent (636 of 1977) PASS: lldb-api :: commands/expression/pr35310/TestExprsBug35310.py (637 of 1977) PASS: lldb-api :: functionalities/optimized_code/TestNoASanExceptionAfterEvalOP_piece.py (638 of 1977) PASS: lldb-shell :: SymbolFile/DWARF/debug-types-basic.test (639 of 1977) PASS: lldb-unit :: Utility/./UtilityTests/ArgsTest.TestOverwriteArgs (640 of 1977) PASS: lldb-api :: tools/lldb-server/TestGdbRemoteAttach.py (641 of 1977) PASS: lldb-api :: commands/expression/two-files/TestObjCTypeQueryFromOtherCompileUnit.py (642 of 1977) UNSUPPORTED: lldb-api :: functionalities/process_save_core/TestProcessSaveCore.py (643 of 1977) PASS: lldb-shell :: ObjectFile/PECOFF/sections-names.yaml (644 of 1977) PASS: lldb-unit :: SymbolFile/DWARF/./SymbolFileDWARFTests/SymbolFileDWARFTests.TestAbbrevOrder1Start1 (645 of 1977) PASS: lldb-api :: functionalities/target-new-solib-notifications/TestModuleLoadedNotifys.py (646 of 1977) PASS: lldb-api :: functionalities/dead-strip/TestDeadStrip.py (647 of 1977) UNSUPPORTED: lldb-shell :: Reproducer/TestLuaImport.test (648 of 1977) PASS: lldb-unit :: Process/gdb-remote/./ProcessGdbRemoteTests/GDBRemoteClientBaseTest.SendContinueAndLateInterrupt (649 of 1977) PASS: lldb-shell :: SymbolFile/DWARF/debug-line-basic.s (650 of 1977) PASS: lldb-api :: lang/objc/objc-class-method/TestObjCClassMethod.py (651 of 1977) PASS: lldb-unit :: Symbol/./SymbolTests/TestClangASTImporter.DeportTypeTagDecl (652 of 1977) PASS: lldb-api :: functionalities/data-formatter/varscript_formatting/TestDataFormatterVarScriptFormatting.py (653 of 1977) UNSUPPORTED: lldb-shell :: Register/x86-ymm-write.test (654 of 1977) PASS: lldb-api :: functionalities/data-formatter/data-formatter-stl/libcxx/forward_list/TestDataFormatterLibcxxForwardList.py (655 of 1977) PASS: lldb-unit :: Expression/./ExpressionTests/CppModuleConfigurationTest.UnrelatedLibrary (656 of 1977) PASS: lldb-unit :: Utility/./UtilityTests/VMRange.Ordering (657 of 1977) PASS: lldb-unit :: Utility/./UtilityTests/BinaryStreamTest.PutULEB128OneByte (658 of 1977) PASS: lldb-unit :: Utility/./UtilityTests/ConstStringTest.NullAndEmptyStates (659 of 1977) PASS: lldb-unit :: ScriptInterpreter/Python/./ScriptInterpreterPythonTests/PythonDataObjectsTest.TestModuleNameResolutionNoDot (660 of 1977) PASS: lldb-unit :: ScriptInterpreter/Python/./ScriptInterpreterPythonTests/PythonDataObjectsTest.TestBorrowedReferences (661 of 1977) PASS: lldb-unit :: Utility/./UtilityTests/StreamTest.SetIndentLevel (662 of 1977) PASS: lldb-unit :: Utility/./UtilityTests/FileSpecTest.FormatFileSpec (663 of 1977) PASS: lldb-api :: lang/c/stepping/TestThreadStepping.py (664 of 1977) PASS: lldb-unit :: Process/gdb-remote/./ProcessGdbRemoteTests/GDBRemoteCommunicationClientTest.WriteRegister (665 of 1977) PASS: lldb-api :: commands/platform/basic/TestPlatformPython.py (666 of 1977) PASS: lldb-unit :: Utility/./UtilityTests/VMRange.ContainsAddr (667 of 1977) PASS: lldb-api :: lang/cpp/const_this/TestConstThis.py (668 of 1977) PASS: lldb-unit :: Utility/./UtilityTests/OptionsWithRawTest.TerminatedQuote (669 of 1977) UNSUPPORTED: lldb-api :: functionalities/data-formatter/data-formatter-stl/libstdcpp/unique_ptr/TestDataFormatterStdUniquePtr.py (670 of 1977) PASS: lldb-unit :: Utility/./UtilityTests/VMRange.CollectionContains (671 of 1977) PASS: lldb-shell :: SymbolFile/DWARF/debug-types-dwo-cross-reference.cpp (672 of 1977) PASS: lldb-unit :: Utility/./UtilityTests/SubsystemRAIITest.SubsystemWithErrorSuccess (673 of 1977) PASS: lldb-shell :: SymbolFile/DWARF/debug-names-compressed.cpp (674 of 1977) PASS: lldb-api :: functionalities/tail_call_frames/unambiguous_sequence/TestUnambiguousTailCalls.py (675 of 1977) PASS: lldb-shell :: SymbolFile/DWARF/dwo-type-in-main-file.s (676 of 1977) PASS: lldb-unit :: Host/./HostTests/SocketTest.UDPConnect (677 of 1977) PASS: lldb-shell :: SymbolFile/symbol-binding.test (678 of 1977) PASS: lldb-shell :: Commands/command-regex-unalias.test (679 of 1977) PASS: lldb-unit :: Utility/./UtilityTests/BinaryStreamTest.PutULEB128FiveBytes (680 of 1977) PASS: lldb-unit :: Utility/./UtilityTests/ArchSpecTest.MergeFromMachOUnknown (681 of 1977) PASS: lldb-api :: types/TestFloatTypes.py (682 of 1977) PASS: lldb-api :: functionalities/thread/concurrent_events/TestConcurrentDelayedCrashWithBreakpointWatchpoint.py (683 of 1977) UNSUPPORTED: lldb-shell :: SymbolFile/PDB/type-quals.test (684 of 1977) PASS: lldb-unit :: Host/./HostTests/NativeProcessProtocolTest.SetBreakpointFailVerify (685 of 1977) PASS: lldb-api :: commands/expression/persistent_variables/TestPersistentVariables.py (686 of 1977) PASS: lldb-unit :: Utility/./UtilityTests/UriParserTest.BracketedHostnameWithPortIPv6 (687 of 1977) PASS: lldb-unit :: UnwindAssembly/x86/./UnwindAssemblyx86Tests/Testx86AssemblyInspectionEngine.TestPushEBP (688 of 1977) XFAIL: lldb-shell :: Register/x86-64-ymm-write.test (689 of 1977) PASS: lldb-unit :: Utility/./UtilityTests/EnvironmentTest.EnvpConversion (690 of 1977) PASS: lldb-unit :: Utility/./UtilityTests/RangeTest.Clear (691 of 1977) PASS: lldb-unit :: Utility/./UtilityTests/ArchSpecTest.TestParseMachCPUDashSubtypeTripleExtra (692 of 1977) PASS: lldb-unit :: Utility/./UtilityTests/StringListTest.DefaultConstructor (693 of 1977) PASS: lldb-unit :: UnwindAssembly/x86/./UnwindAssemblyx86Tests/Testx86AssemblyInspectionEngine.TestPushRBP (694 of 1977) UNSUPPORTED: lldb-api :: benchmarks/expression/TestExpressionCmd.py (695 of 1977) PASS: lldb-shell :: Reproducer/Functionalities/TestDataFormatter.test (696 of 1977) PASS: lldb-api :: functionalities/data-formatter/stringprinter/TestStringPrinter.py (697 of 1977) PASS: lldb-unit :: ScriptInterpreter/Python/./ScriptInterpreterPythonTests/PythonDataObjectsTest.TestGlobalNameResolutionWithDot (698 of 1977) PASS: lldb-unit :: Utility/./UtilityTests/BinaryStreamTest.PutSLEB128ThreeBytes (699 of 1977) PASS: lldb-unit :: Language/Highlighting/./HighlighterTests/HighlighterTest.ClangCursorPosEndOfLine (700 of 1977) PASS: lldb-api :: sanity/TestSettingSkipping.py (701 of 1977) PASS: lldb-unit :: Utility/./UtilityTests/BinaryStreamTest.PutSLEB128SixBytes (702 of 1977) PASS: lldb-unit :: Utility/./UtilityTests/StringExtractorTest.GetHexBytesAvail (703 of 1977) PASS: lldb-unit :: ScriptInterpreter/Python/./ScriptInterpreterPythonTests/PythonDataObjectsTest.TestCallable (704 of 1977) PASS: lldb-shell :: Breakpoint/debug_rnglistx_rlex.test (705 of 1977) PASS: lldb-unit :: Breakpoint/./LLDBBreakpointTests/BreakpointIDTest.StringIsBreakpointName (706 of 1977) PASS: lldb-api :: functionalities/avoids-fd-leak/TestFdLeak.py (707 of 1977) PASS: lldb-shell :: SymbolFile/DWARF/dwarf5-atomic.s (708 of 1977) PASS: lldb-unit :: Utility/./UtilityTests/RegularExpression.Empty (709 of 1977) PASS: lldb-unit :: Utility/./UtilityTests/StringExtractorTest.GetNameColonValueNoSemicolon (710 of 1977) PASS: lldb-api :: commands/expression/import-std-module/queue/TestQueueFromStdModule.py (711 of 1977) PASS: lldb-unit :: ObjectFile/Breakpad/./ObjectFileBreakpadTests/Record.classify (712 of 1977) PASS: lldb-api :: commands/expression/import-std-module/basic/TestImportStdModule.py (713 of 1977) PASS: lldb-api :: python_api/watchpoint/TestWatchpointIgnoreCount.py (714 of 1977) PASS: lldb-unit :: Utility/./UtilityTests/ScalarTest.Equality (715 of 1977) PASS: lldb-api :: commands/command/script/import/rdar-12586188/TestRdar12586188.py (716 of 1977) PASS: lldb-shell :: SymbolFile/DWARF/debug-types-address-ranges.s (717 of 1977) UNSUPPORTED: lldb-shell :: Register/x86-64-gp-write.test (718 of 1977) PASS: lldb-unit :: Utility/./UtilityTests/TimerTest.CategoryTimesStats (719 of 1977) PASS: lldb-unit :: Utility/./UtilityTests/IndexToObjectTest.ObjectForIndex (720 of 1977) PASS: lldb-unit :: Utility/./UtilityTests/ArgsTest.TestArgv (721 of 1977) UNSUPPORTED: lldb-shell :: Register/arm-fp-read.test (722 of 1977) PASS: lldb-unit :: Utility/./UtilityTests/NameMatchesTest.RegularExpression (723 of 1977) PASS: lldb-api :: commands/expression/namespace_local_var_same_name_cpp_and_c/TestNamespaceLocalVarSameNameCppAndC.py (724 of 1977) PASS: lldb-api :: functionalities/thread/concurrent_events/TestConcurrentSignalDelayBreak.py (725 of 1977) PASS: lldb-unit :: Utility/./UtilityTests/ConstStringTest.YAML (726 of 1977) PASS: lldb-api :: commands/process/attach-resume/TestAttachResume.py (727 of 1977) PASS: lldb-unit :: Host/./HostTests/FileSystemTest.Exists (728 of 1977) PASS: lldb-api :: functionalities/unwind/noreturn/module-end/TestNoReturnModuleEnd.py (729 of 1977) UNSUPPORTED: lldb-api :: commands/expression/call-restarts/TestCallThatRestarts.py (730 of 1977) PASS: lldb-unit :: Target/./TargetTests/MCBasedABI.MapRegisterName (731 of 1977) PASS: lldb-api :: lang/c/tls_globals/TestTlsGlobals.py (732 of 1977) PASS: lldb-api :: lang/objc/modules-inline-functions/TestModulesInlineFunctions.py (733 of 1977) PASS: lldb-shell :: ObjectFile/PECOFF/dep-modules.yaml (734 of 1977) PASS: lldb-api :: python_api/type/TestTypeList.py (735 of 1977) PASS: lldb-unit :: UnwindAssembly/x86/./UnwindAssemblyx86Tests/Testx86AssemblyInspectionEngine.TestAddESP (736 of 1977) PASS: lldb-api :: functionalities/unwind/zeroth_frame/TestZerothFrame.py (737 of 1977) UNSUPPORTED: lldb-shell :: Watchpoint/netbsd-nouserdbregs.test (738 of 1977) PASS: lldb-unit :: Interpreter/./InterpreterTests/CompletionTest.DirCompletionAbsolute (739 of 1977) PASS: lldb-api :: python_api/sbtype_typeclass/TestSBTypeTypeClass.py (740 of 1977) PASS: lldb-api :: python_api/lldbutil/frame/TestFrameUtils.py (741 of 1977) PASS: lldb-unit :: Utility/./UtilityTests/StringLexerTest.NextIfList (742 of 1977) PASS: lldb-shell :: SymbolFile/DWARF/anon_class_w_and_wo_export_symbols.ll (743 of 1977) FAIL: lldb-api :: functionalities/ptr_refs/TestPtrRefs.py (744 of 1977) ******************** TEST 'lldb-api :: functionalities/ptr_refs/TestPtrRefs.py' FAILED ******************** Script: -- /usr/local/bin/python /Users/buildslave/jenkins/workspace/lldb-cmake-sanitized/llvm-project/lldb/test/API/dotest.py --arch x86_64 -s /Users/buildslave/jenkins/workspace/lldb-cmake-sanitized/lldb-build/lldb-test-traces -S nm -u CXXFLAGS -u CFLAGS --codesign-identity lldb_codesign --server /Users/buildslave/jenkins/workspace/lldb-cmake-sanitized/lldb-build/./bin/debugserver --arch x86_64 --build-dir /Users/buildslave/jenkins/workspace/lldb-cmake-sanitized/lldb-build/lldb-test-build.noindex -s=/Users/buildslave/jenkins/workspace/lldb-cmake-sanitized/test/logs -t --env TERM=vt100 --env LLVM_LIBS_DIR=/Users/buildslave/jenkins/workspace/lldb-cmake-sanitized/lldb-build/./lib --inferior-env ASAN_OPTIONS=detect_stack_use_after_return=1 --inferior-env DYLD_INSERT_LIBRARIES=/Users/buildslave/jenkins/workspace/lldb-cmake-sanitized/host-compiler/lib/clang/11.0.0/lib/darwin/libclang_rt.asan_osx_dynamic.dylib --build-dir /Users/buildslave/jenkins/workspace/lldb-cmake-sanitized/lldb-build/lldb-test-build.noindex --lldb-module-cache-dir /Users/buildslave/jenkins/workspace/lldb-cmake-sanitized/lldb-build/lldb-test-build.noindex/module-cache-lldb/lldb-api --clang-module-cache-dir /Users/buildslave/jenkins/workspace/lldb-cmake-sanitized/lldb-build/lldb-test-build.noindex/module-cache-clang/lldb-api --executable /Users/buildslave/jenkins/workspace/lldb-cmake-sanitized/lldb-build/./bin/lldb --compiler /Users/buildslave/jenkins/workspace/lldb-cmake-sanitized/lldb-build/./bin/clang --dsymutil /Users/buildslave/jenkins/workspace/lldb-cmake-sanitized/lldb-build/./bin/dsymutil --filecheck /Users/buildslave/jenkins/workspace/lldb-cmake-sanitized/lldb-build/./bin/FileCheck --lldb-libs-dir /Users/buildslave/jenkins/workspace/lldb-cmake-sanitized/lldb-build/./lib /Users/buildslave/jenkins/workspace/lldb-cmake-sanitized/llvm-project/lldb/test/API/functionalities/ptr_refs -p TestPtrRefs.py -- Exit Code: 1

Hide Details

Command Output (stdout): -- lldb version 11.0.99 clang revision c0aa97b632761b658e1bc35ca15119629b2cff0e llvm revision c0aa97b632761b658e1bc35ca15119629b2cff0e "crashlog" and "save_crashlog" command installed, use the "--help" option for detailed help "malloc_info", "ptr_refs", "cstr_refs", "find_variable", and "objc_refs" commands have been installed, use the "--help" options on these commands for detailed help. LLDB library dir: /Users/buildslave/jenkins/workspace/lldb-cmake-sanitized/lldb-build/bin LLDB import library dir: /Users/buildslave/jenkins/workspace/lldb-cmake-sanitized/lldb-build/./lib libstdcxx tests will not be run because: Don't know how to build with libstdcxx on macosx Skipping following debug info categories: ['dwo'] 0x00007ffee9691478: stack in frame #0 of thread #1: tid 0xb219e1 in variable at 0x7ffee9691478: (const char *) my_ptr = 0x00006020000000b0 "hello" 0x00007ffee9691410: stack (red zone)

Hide Details

-- Command Output (stderr): -- error: 'ptr_refs' is not a valid command. error: 'ptr_refs' is not a valid command.

Hide Details

Session logs for test failures/errors/unexpected successes will go into directory '/Users/buildslave/jenkins/workspace/lldb-cmake-sanitized/test/logs' Command invoked: /Users/buildslave/jenkins/workspace/lldb-cmake-sanitized/llvm-project/lldb/test/API/dotest.py --arch x86_64 -s /Users/buildslave/jenkins/workspace/lldb-cmake-sanitized/lldb-build/lldb-test-traces -S nm -u CXXFLAGS -u CFLAGS --codesign-identity lldb_codesign --server /Users/buildslave/jenkins/workspace/lldb-cmake-sanitized/lldb-build/./bin/debugserver --arch x86_64 --build-dir /Users/buildslave/jenkins/workspace/lldb-cmake-sanitized/lldb-build/lldb-test-build.noindex -s=/Users/buildslave/jenkins/workspace/lldb-cmake-sanitized/test/logs -t --env TERM=vt100 --env LLVM_LIBS_DIR=/Users/buildslave/jenkins/workspace/lldb-cmake-sanitized/lldb-build/./lib --inferior-env ASAN_OPTIONS=detect_stack_use_after_return=1 --inferior-env DYLD_INSERT_LIBRARIES=/Users/buildslave/jenkins/workspace/lldb-cmake-sanitized/host-compiler/lib/clang/11.0.0/lib/darwin/libclang_rt.asan_osx_dynamic.dylib --build-dir /Users/buildslave/jenkins/workspace/lldb-cmake-sanitized/lldb-build/lldb-test-build.noindex --lldb-module-cache-dir /Users/buildslave/jenkins/workspace/lldb-cmake-sanitized/lldb-build/lldb-test-build.noindex/module-cache-lldb/lldb-api --clang-module-cache-dir /Users/buildslave/jenkins/workspace/lldb-cmake-sanitized/lldb-build/lldb-test-build.noindex/module-cache-clang/lldb-api --executable /Users/buildslave/jenkins/workspace/lldb-cmake-sanitized/lldb-build/./bin/lldb --compiler /Users/buildslave/jenkins/workspace/lldb-cmake-sanitized/lldb-build/./bin/clang --dsymutil /Users/buildslave/jenkins/workspace/lldb-cmake-sanitized/lldb-build/./bin/dsymutil --filecheck /Users/buildslave/jenkins/workspace/lldb-cmake-sanitized/lldb-build/./bin/FileCheck --lldb-libs-dir /Users/buildslave/jenkins/workspace/lldb-cmake-sanitized/lldb-build/./lib /Users/buildslave/jenkins/workspace/lldb-cmake-sanitized/llvm-project/lldb/test/API/functionalities/ptr_refs -p TestPtrRefs.py Change dir to: /Users/buildslave/jenkins/workspace/lldb-cmake-sanitized/llvm-project/lldb/test/API/functionalities/ptr_refs runCmd: settings clear -all output:

Hide Details

runCmd: settings set symbols.enable-external-lookup false output:

Hide Details

runCmd: settings set target.auto-apply-fixits false output:

Hide Details

runCmd: settings set plugin.process.gdb-remote.packet-timeout 60 output:

Hide Details

runCmd: settings set symbols.clang-modules-cache-path "/Users/buildslave/jenkins/workspace/lldb-cmake-sanitized/lldb-build/lldb-test-build.noindex/module-cache-lldb/lldb-api" output:

Hide Details

runCmd: settings set use-color false output:

Hide Details

runCmd: setting set target.prefer-dynamic-value no-dynamic-values output:

Hide Details

runCmd: settings set target.env-vars ASAN_OPTIONS=detect_stack_use_after_return=1 DYLD_INSERT_LIBRARIES=/Users/buildslave/jenkins/workspace/lldb-cmake-sanitized/host-compiler/lib/clang/11.0.0/lib/darwin/libclang_rt.asan_osx_dynamic.dylib output:

Hide Details

runCmd: script import lldb.macosx.heap output: "crashlog" and "save_crashlog" command installed, use the "--help" option for detailed help "malloc_info", "ptr_refs", "cstr_refs", "find_variable", and "objc_refs" commands have been installed, use the "--help" options on these commands for detailed help.

Hide Details

Hide Details

runCmd: ptr_refs my_ptr output: 0x00007ffee9691478: stack in frame #0 of thread #1: tid 0xb219e1 in variable at 0x7ffee9691478: (const char *) my_ptr = 0x00006020000000b0 "hello" 0x00007ffee9691410: stack (red zone)

Hide Details

Hide Details

Expecting sub string: malloc Not matched

Hide Details

FAIL: LLDB (/Users/buildslave/jenkins/workspace/lldb-cmake-sanitized/lldb-build/bin/clang-11-x86_64) :: test_ptr_refs_dsym (TestPtrRefs.TestPtrRefs) <bound method SBProcess.Kill of <lldb.SBProcess; proxy of <Swig Object of type 'lldb::SBProcess *' at 0x10db288a0> >>: success

Hide Details

runCmd: settings clear -all output:

Hide Details

runCmd: settings set symbols.enable-external-lookup false output:

Hide Details

runCmd: settings set target.auto-apply-fixits false output:

Hide Details

runCmd: settings set plugin.process.gdb-remote.packet-timeout 60 output:

Hide Details

runCmd: settings set symbols.clang-modules-cache-path "/Users/buildslave/jenkins/workspace/lldb-cmake-sanitized/lldb-build/lldb-test-build.noindex/module-cache-lldb/lldb-api" output:

Hide Details

runCmd: settings set use-color false output:

Hide Details

runCmd: setting set target.prefer-dynamic-value no-dynamic-values output:

Hide Details

runCmd: settings set target.env-vars ASAN_OPTIONS=detect_stack_use_after_return=1 DYLD_INSERT_LIBRARIES=/Users/buildslave/jenkins/workspace/lldb-cmake-sanitized/host-compiler/lib/clang/11.0.0/lib/darwin/libclang_rt.asan_osx_dynamic.dylib output:

Hide Details

runCmd: script import lldb.macosx.heap output:

Hide Details

runCmd: ptr_refs my_ptr runCmd failed! error: 'ptr_refs' is not a valid command.

Hide Details

Hide Details

XFAIL: LLDB (/Users/buildslave/jenkins/workspace/lldb-cmake-sanitized/lldb-build/bin/clang-11-x86_64) :: test_ptr_refs_dwarf (TestPtrRefs.TestPtrRefs) <bound method SBProcess.Kill of <lldb.SBProcess; proxy of <Swig Object of type 'lldb::SBProcess *' at 0x10cf28990> >>: success

Hide Details

UNSUPPORTED: LLDB (/Users/buildslave/jenkins/workspace/lldb-cmake-sanitized/lldb-build/bin/clang-11-x86_64) :: test_ptr_refs_dwo (TestPtrRefs.TestPtrRefs) (test case does not fall in any category of interest for this run) runCmd: settings clear -all output:

Hide Details

runCmd: settings set symbols.enable-external-lookup false output:

Hide Details

runCmd: settings set target.auto-apply-fixits false output:

Hide Details

runCmd: settings set plugin.process.gdb-remote.packet-timeout 60 output:

Hide Details

runCmd: settings set symbols.clang-modules-cache-path "/Users/buildslave/jenkins/workspace/lldb-cmake-sanitized/lldb-build/lldb-test-build.noindex/module-cache-lldb/lldb-api" output:

Hide Details

runCmd: settings set use-color false output:

Hide Details

runCmd: setting set target.prefer-dynamic-value no-dynamic-values output:

Hide Details

runCmd: settings set target.env-vars ASAN_OPTIONS=detect_stack_use_after_return=1 DYLD_INSERT_LIBRARIES=/Users/buildslave/jenkins/workspace/lldb-cmake-sanitized/host-compiler/lib/clang/11.0.0/lib/darwin/libclang_rt.asan_osx_dynamic.dylib output:

Hide Details

runCmd: script import lldb.macosx.heap output:

Hide Details

runCmd: ptr_refs my_ptr runCmd failed! error: 'ptr_refs' is not a valid command.

Hide Details

Hide Details

XFAIL: LLDB (/Users/buildslave/jenkins/workspace/lldb-cmake-sanitized/lldb-build/bin/clang-11-x86_64) :: test_ptr_refs_gmodules (TestPtrRefs.TestPtrRefs) <bound method SBProcess.Kill of <lldb.SBProcess; proxy of <Swig Object of type 'lldb::SBProcess *' at 0x10db281e0> >>: success

Hide Details

Restore dir to: /Users/buildslave/jenkins/workspace/lldb-cmake-sanitized/lldb-build/tools/lldb/test ====================================================================== FAIL: test_ptr_refs_dsym (TestPtrRefs.TestPtrRefs) Test format string functionality. ---------------------------------------------------------------------- Traceback (most recent call last): File "/Users/buildslave/jenkins/workspace/lldb-cmake-sanitized/llvm-project/lldb/packages/Python/lldbsuite/test/lldbtest.py", line 1751, in test_method return attrvalue(self) File "/Users/buildslave/jenkins/workspace/lldb-cmake-sanitized/llvm-project/lldb/packages/Python/lldbsuite/test/decorators.py", line 110, in wrapper func(*args, **kwargs) File "/Users/buildslave/jenkins/workspace/lldb-cmake-sanitized/llvm-project/lldb/test/API/functionalities/ptr_refs/TestPtrRefs.py", line 47, in test_ptr_refs self.expect("ptr_refs my_ptr", substrs=["malloc", "stack"]) File "/Users/buildslave/jenkins/workspace/lldb-cmake-sanitized/llvm-project/lldb/packages/Python/lldbsuite/test/lldbtest.py", line 2391, in expect if msg else EXP_MSG(str, output, exe)) AssertionError: False is not True : 'ptr_refs my_ptr' returns expected result, got '0x00007ffee9691478: stack in frame #0 of thread #1: tid 0xb219e1 in variable at 0x7ffee9691478: (const char *) my_ptr = 0x00006020000000b0 "hello" 0x00007ffee9691410: stack (red zone)' Config=x86_64-/Users/buildslave/jenkins/workspace/lldb-cmake-sanitized/lldb-build/bin/clang-11 ---------------------------------------------------------------------- Ran 4 tests in 8.861s

Hide Details

RESULT: FAILED (0 passes, 1 failures, 0 errors, 1 skipped, 2 expected failures, 0 unexpected successes)

Hide Details

--

Hide Details

******************** PASS: lldb-unit :: Host/./HostTests/MainLoopTest.UnmonitoredSignal (745 of 1977) PASS: lldb-unit :: Process/gdb-remote/./ProcessGdbRemoteTests/GDBRemoteClientBaseTest.SendPacketAndReceiveResponseWithOutputSupport (746 of 1977) PASS: lldb-api :: tools/lldb-server/inferior-crash/TestGdbRemoteSegFault.py (747 of 1977) PASS: lldb-shell :: SymbolFile/DWARF/debug_line-relative_path.s (748 of 1977) PASS: lldb-shell :: ObjectFile/PECOFF/basic-info-arm.yaml (749 of 1977) PASS: lldb-api :: lang/c/find_struct_type/TestFindStructTypes.py (750 of 1977) PASS: lldb-api :: functionalities/multiword-commands/TestMultiWordCommands.py (751 of 1977) PASS: lldb-unit :: SymbolFile/NativePDB/./SymbolFileNativePDBTests/PDBFPOProgramToDWARFExpressionTests.UnresolvedRegisterReference (752 of 1977) PASS: lldb-api :: functionalities/testid/TestTestId.py (753 of 1977) PASS: lldb-shell :: Driver/LocalLLDBInit.test (754 of 1977) PASS: lldb-unit :: Host/./HostTests/SocketTest.DomainListenConnectAccept (755 of 1977) PASS: lldb-shell :: Commands/command-regex-delete.test (756 of 1977) PASS: lldb-api :: commands/expression/persistent_types/TestPersistentTypes.py (757 of 1977) PASS: lldb-api :: commands/expression/top-level/TestTopLevelExprs.py (758 of 1977) PASS: lldb-api :: functionalities/fat_archives/TestFatArchives.py (759 of 1977) PASS: lldb-shell :: Driver/TestConvenienceVariables.test (760 of 1977) PASS: lldb-api :: functionalities/data-formatter/data-formatter-objc/nsindexpath/TestDataFormatterNSIndexPath.py (761 of 1977) PASS: lldb-api :: commands/frame/diagnose/bad-reference/TestBadReference.py (762 of 1977) PASS: lldb-unit :: Utility/./UtilityTests/VMRange.Reset (763 of 1977) PASS: lldb-unit :: Utility/./UtilityTests/ArchSpecTest.TestSetTriple (764 of 1977) PASS: lldb-shell :: ObjectFile/ELF/aarch64-relocations.yaml (765 of 1977) PASS: lldb-unit :: Utility/./UtilityTests/ProcessInstanceInfoList.Yaml (766 of 1977) PASS: lldb-unit :: Utility/./UtilityTests/AnsiTerminal.Unknown (767 of 1977) PASS: lldb-api :: functionalities/data-formatter/nssetsynth/TestNSSetSynthetic.py (768 of 1977) PASS: lldb-unit :: Utility/./UtilityTests/ProcessInstanceInfo.Dump (769 of 1977) PASS: lldb-api :: lang/c/strings/TestCStrings.py (770 of 1977) PASS: lldb-unit :: Utility/./UtilityTests/SerializationRountripTest.SerializeDeserializeCStringNull (771 of 1977) PASS: lldb-api :: macosx/load-kext/TestLoadKext.py (772 of 1977) PASS: lldb-api :: types/TestShortType.py (773 of 1977) UNSUPPORTED: lldb-api :: commands/gui/basic/TestGuiBasic.py (774 of 1977) UNSUPPORTED: lldb-api :: functionalities/darwin_log/filter/exact_match/activity-chain/TestDarwinLogFilterMatchActivityChain.py (775 of 1977) PASS: lldb-api :: commands/frame/language/TestGuessLanguage.py (776 of 1977) PASS: lldb-unit :: Utility/./UtilityTests/DataExtractorTest.UncommonAddressSize (777 of 1977) PASS: lldb-api :: functionalities/tail_call_frames/disambiguate_call_site/TestDisambiguateCallSite.py (778 of 1977) PASS: lldb-api :: lang/objc/modules-update/TestClangModulesUpdate.py (779 of 1977) PASS: lldb-unit :: Process/gdb-remote/./ProcessGdbRemoteTests/GDBRemoteClientBaseTest.SendContinueAndInterrupt (780 of 1977) PASS: lldb-unit :: Utility/./UtilityTests/StringExtractorTest.GetHexU8_Underflow2 (781 of 1977) PASS: lldb-unit :: Symbol/./SymbolTests/TestClangASTImporter.ImportInvalidType (782 of 1977) PASS: lldb-api :: functionalities/breakpoint/breakpoint_names/TestBreakpointNames.py (783 of 1977) PASS: lldb-unit :: Utility/./UtilityTests/RangeTest.SlideZero (784 of 1977) PASS: lldb-shell :: Driver/TestCommands.test (785 of 1977) PASS: lldb-shell :: Unwind/eh-frame-dwarf-unwind.test (786 of 1977) PASS: lldb-unit :: Symbol/./SymbolTests/SymbolsTest.TerminateLocateExecutableSymbolFileForUnknownExecutableAndUnknownSymbolFile (787 of 1977) PASS: lldb-unit :: Host/./HostTests/MainLoopTest.ReadObject (788 of 1977) PASS: lldb-api :: lang/cpp/namespace_definitions/TestNamespaceDefinitions.py (789 of 1977) PASS: lldb-api :: functionalities/plugins/command_plugin/TestPluginCommands.py (790 of 1977) PASS: lldb-api :: lang/c/register_variables/TestRegisterVariables.py (791 of 1977) PASS: lldb-unit :: Utility/./UtilityTests/FileSpecTest.Yaml (792 of 1977) PASS: lldb-unit :: Utility/./UtilityTests/UriParserTest.BracketedHostname (793 of 1977) UNSUPPORTED: lldb-shell :: BuildScript/toolchain-clang-cl.test (794 of 1977) PASS: lldb-shell :: Settings/TestLineMarkerColor.test (795 of 1977) PASS: lldb-unit :: Utility/./UtilityTests/UserIDResolver.GetUserName (796 of 1977) PASS: lldb-unit :: Process/minidump/./LLDBMinidumpTests/MinidumpParserTest.GetThreadContext_x86_32 (797 of 1977) PASS: lldb-shell :: SymbolFile/DWARF/parallel-indexing-stress.s (798 of 1977) PASS: lldb-unit :: Utility/./UtilityTests/BinaryStreamTest.PutULEB128Zero (799 of 1977) PASS: lldb-api :: python_api/watchpoint/TestSetWatchpoint.py (800 of 1977) PASS: lldb-api :: functionalities/conditional_break/TestConditionalBreak.py (801 of 1977) PASS: lldb-unit :: Interpreter/./InterpreterTests/OptionArgParserTest.toBoolean (802 of 1977) PASS: lldb-api :: functionalities/data-formatter/data-formatter-stl/libcxx/set/TestDataFormatterLibcxxSet.py (803 of 1977) PASS: lldb-unit :: Language/Highlighting/./HighlighterTests/HighlighterTest.ClangCursorPosAfterOtherToken (804 of 1977) PASS: lldb-unit :: Utility/./UtilityTests/TildeExpressionResolver.ResolveFullPath (805 of 1977) PASS: lldb-shell :: Process/TestEnvironment.test (806 of 1977) PASS: lldb-unit :: Utility/./UtilityTests/StringExtractorTest.GetHexBytesAvail_Partial (807 of 1977) UNSUPPORTED: lldb-shell :: ScriptInterpreter/Lua/bindings.test (808 of 1977) PASS: lldb-unit :: Core/./LLDBCoreTests/MangledTest.NameIndexes_FindFunctionSymbols (809 of 1977) PASS: lldb-shell :: Breakpoint/dummy-target.test (810 of 1977) UNSUPPORTED: lldb-shell :: SymbolFile/target-symbols-add-unwind.test (811 of 1977) PASS: lldb-api :: functionalities/thread/concurrent_events/TestConcurrentNWatchNBreak.py (812 of 1977) PASS: lldb-unit :: Expression/./ExpressionTests/DiagnosticManagerTest.AppendMessageNoDiag (813 of 1977) PASS: lldb-unit :: Utility/./UtilityTests/RangeTest.ContainsEndInclusive (814 of 1977) PASS: lldb-unit :: Utility/./UtilityTests/BinaryStreamTest.PutSLEB128One (815 of 1977) PASS: lldb-api :: types/TestDoubleTypesExpr.py (816 of 1977) UNSUPPORTED: lldb-shell :: Register/x86-zmm-write.test (817 of 1977) PASS: lldb-api :: commands/apropos/with-process/TestAproposWithProcess.py (818 of 1977) PASS: lldb-unit :: Utility/./UtilityTests/StringListTest.InsertStringAtIndexMove (819 of 1977) PASS: lldb-unit :: Process/gdb-remote/./ProcessGdbRemoteTests/GDBRemoteCommunicationTest.ReadPacket_checksum (820 of 1977) PASS: lldb-api :: commands/command/source/TestCommandSource.py (821 of 1977) PASS: lldb-unit :: Utility/./UtilityTests/StringExtractorTest.GetHexBytes_OddPair2 (822 of 1977) PASS: lldb-unit :: Utility/./UtilityTests/StringExtractorTest.GetHexBytesAvail_OddPair2 (823 of 1977) PASS: lldb-unit :: Symbol/./SymbolTests/TestTypeSystemClang.TestConvertAccessTypeToAccessSpecifier (824 of 1977) PASS: lldb-api :: commands/frame/diagnose/local-variable/TestLocalVariable.py (825 of 1977) PASS: lldb-api :: functionalities/breakpoint/breakpoint_hit_count/TestBreakpointHitCount.py (826 of 1977) UNSUPPORTED: lldb-api :: functionalities/tsan/cpp_global_location/TestTsanCPPGlobalLocation.py (827 of 1977) UNSUPPORTED: lldb-api :: functionalities/darwin_log/filter/regex/activity/TestDarwinLogFilterRegexActivity.py (828 of 1977) PASS: lldb-unit :: Expression/./ExpressionTests/CppModuleConfigurationTest.Linux (829 of 1977) PASS: lldb-api :: python_api/objc_type/TestObjCType.py (830 of 1977) PASS: lldb-api :: functionalities/breakpoint/cpp_exception/TestCPPExceptionBreakpoint.py (831 of 1977) PASS: lldb-api :: functionalities/data-formatter/data-formatter-objc/TestDataFormatterObjCKVO.py (832 of 1977) PASS: lldb-api :: lang/objc/objc_direct-methods/TestObjCDirectMethods.py (833 of 1977) PASS: lldb-api :: commands/expression/ignore-artificial-constructors/TestIgnoreArtificialConstructors.py (834 of 1977) PASS: lldb-api :: functionalities/mtc/simple/TestMTCSimple.py (835 of 1977) PASS: lldb-unit :: Utility/./UtilityTests/SubsystemRAIITest.SubsystemWithErrorFailure (836 of 1977) PASS: lldb-unit :: Utility/./UtilityTests/UriParserTest.Empty (837 of 1977) PASS: lldb-api :: functionalities/gdb_remote_client/TestRegDefinitionInParts.py (838 of 1977) PASS: lldb-shell :: ObjectFile/ELF/section-types-edgecases.yaml (839 of 1977) UNSUPPORTED: lldb-api :: functionalities/breakpoint/breakpoint_callback_command_source/TestBreakpointCallbackCommandSource.py (840 of 1977) PASS: lldb-unit :: Utility/./UtilityTests/ArgsTest.GetQuotedCommandString (841 of 1977) PASS: lldb-unit :: ScriptInterpreter/Python/./ScriptInterpreterPythonTests/PythonDataObjectsTest.TestResetting (842 of 1977) PASS: lldb-unit :: ObjectFile/PECOFF/./ObjectFilePECOFFTests/PECallFrameInfoTest.Basic_eh (843 of 1977) PASS: lldb-unit :: Utility/./UtilityTests/StreamTest.PutHex8 (844 of 1977) PASS: lldb-api :: commands/expression/expr-in-syscall/TestExpressionInSyscall.py (845 of 1977) PASS: lldb-unit :: ObjectFile/ELF/./ObjectFileELFTests/ObjectFileELFTest.SectionsResolveConsistently (846 of 1977) PASS: lldb-unit :: Utility/./UtilityTests/OptionsWithRawTest.EmptySuffixSingleWhitespace (847 of 1977) PASS: lldb-api :: functionalities/data-formatter/data-formatter-objc/TestDataFormatterObjCNSError.py (848 of 1977) PASS: lldb-unit :: Symbol/./SymbolTests/PostfixExpression.ParseFPOProgram (849 of 1977) PASS: lldb-api :: lang/cpp/function_refs/TestFunctionRefs.py (850 of 1977) PASS: lldb-api :: lang/objcxx/objcxx-ivar-vector/TestIvarVector.py (851 of 1977) PASS: lldb-unit :: Utility/./UtilityTests/StringListTest.JoinNonSpace (852 of 1977) PASS: lldb-api :: lang/cpp/thread_local/TestThreadLocal.py (853 of 1977) PASS: lldb-api :: functionalities/history/TestHistoryRecall.py (854 of 1977) PASS: lldb-api :: macosx/nslog/TestDarwinNSLogOutput.py (855 of 1977) PASS: lldb-api :: functionalities/value_md5_crash/TestValueMD5Crash.py (856 of 1977) PASS: lldb-api :: commands/expression/xvalue/TestXValuePrinting.py (857 of 1977) PASS: lldb-unit :: Utility/./UtilityTests/UriParserTest.LongPath (858 of 1977) PASS: lldb-api :: commands/expression/radar_9673664/TestExprHelpExamples.py (859 of 1977) PASS: lldb-api :: lang/objc/foundation/TestObjCMethodsNSArray.py (860 of 1977) PASS: lldb-api :: commands/expression/char/TestExprsChar.py (861 of 1977) PASS: lldb-api :: functionalities/memory-region/TestMemoryRegion.py (862 of 1977) PASS: lldb-shell :: SymbolFile/DWARF/debug_loc_and_loclists.s (863 of 1977) PASS: lldb-api :: functionalities/gdb_remote_client/TestRestartBug.py (864 of 1977) UNSUPPORTED: lldb-shell :: Register/arm-gp-read.test (865 of 1977) UNSUPPORTED: lldb-shell :: SymbolFile/DWARF/debug-types-expressions.test (866 of 1977) PASS: lldb-shell :: SymbolFile/Breakpad/unwind-via-stack-cfi.test (867 of 1977) PASS: lldb-unit :: Utility/./UtilityTests/LogTest.Register (868 of 1977) PASS: lldb-api :: macosx/thread_suspend/TestInternalThreadSuspension.py (869 of 1977) PASS: lldb-api :: terminal/TestSTTYBeforeAndAfter.py (870 of 1977) PASS: lldb-unit :: ScriptInterpreter/Python/./ScriptInterpreterPythonTests/PythonDataObjectsTest.TestPythonBytes (871 of 1977) PASS: lldb-unit :: Utility/./UtilityTests/TimeoutTest.Construction (872 of 1977) PASS: lldb-unit :: UnwindAssembly/x86/./UnwindAssemblyx86Tests/Testx86AssemblyInspectionEngine.TestSimplei386ugmented (873 of 1977) PASS: lldb-api :: lang/cpp/enum_types/TestCPP11EnumTypes.py (874 of 1977) PASS: lldb-unit :: UnwindAssembly/x86/./UnwindAssemblyx86Tests/Testx86AssemblyInspectionEngine.TestSimple64bitFrameFunction (875 of 1977) PASS: lldb-unit :: Symbol/./SymbolTests/TestClangASTImporter.CompleteFwdDeclWithOtherOrigin (876 of 1977) PASS: lldb-unit :: Utility/./UtilityTests/StringListTest.JoinEmpty (877 of 1977) PASS: lldb-api :: python_api/exprpath_synthetic/TestExprPathSynthetic.py (878 of 1977) PASS: lldb-shell :: Reproducer/TestCaptureEnvOverride.test (879 of 1977) PASS: lldb-unit :: Utility/./UtilityTests/StreamTeeTest.Assignment (880 of 1977) PASS: lldb-api :: functionalities/data-formatter/data-formatter-stl/libcxx/list/TestDataFormatterLibcxxList.py (881 of 1977) PASS: lldb-unit :: Utility/./UtilityTests/UUIDTest.StringConverion (882 of 1977) PASS: lldb-api :: tools/lldb-vscode/breakpoint/TestVSCode_setExceptionBreakpoints.py (883 of 1977) PASS: lldb-api :: lang/cpp/bitfields/TestCppBitfields.py (884 of 1977) PASS: lldb-api :: lang/objc/blocks/TestObjCIvarsInBlocks.py (885 of 1977) PASS: lldb-unit :: Utility/./UtilityTests/UriParserTest.SchemeHostSeparator3 (886 of 1977) UNSUPPORTED: lldb-api :: iohandler/completion/TestIOHandlerCompletion.py (887 of 1977) PASS: lldb-api :: lang/cpp/limit-debug-info/TestWithLimitDebugInfo.py (888 of 1977) PASS: lldb-shell :: SymbolFile/DWARF/dwarf5-partial-index.cpp (889 of 1977) PASS: lldb-api :: api/listeners/TestListener.py (890 of 1977) PASS: lldb-api :: lang/cpp/static_methods/TestCPPStaticMethods.py (891 of 1977) PASS: lldb-unit :: Utility/./UtilityTests/StringExtractorTest.GetHexBytesAvail_OddPair (892 of 1977) PASS: lldb-shell :: ObjectFile/ELF/base-address.yaml (893 of 1977) UNSUPPORTED: lldb-api :: commands/register/register/intel_xtended_registers/TestMPXRegisters.py (894 of 1977) PASS: lldb-api :: commands/disassemble/basic/TestDisassembleBreakpoint.py (895 of 1977) PASS: lldb-unit :: Host/./HostTests/NativeProcessProtocolTest.SetBreakpointFailWrite (896 of 1977) PASS: lldb-unit :: Core/./LLDBCoreTests/UniqueCStringMap.NoDefaultConstructor (897 of 1977) PASS: lldb-api :: functionalities/postmortem/wow64_minidump/TestWow64MiniDump.py (898 of 1977) PASS: lldb-shell :: Quit/TestQuitExitCodeImplicit0.test (899 of 1977) PASS: lldb-unit :: Process/minidump/./LLDBMinidumpTests/MinidumpParserTest.GetMemoryRegionInfoFromMemory64List (900 of 1977) PASS: lldb-api :: functionalities/data-formatter/setvaluefromcstring/TestSetValueFromCString.py (901 of 1977) PASS: lldb-unit :: Utility/./UtilityTests/StreamTest.PutCharNull (902 of 1977) PASS: lldb-api :: functionalities/thread/create_after_attach/TestCreateAfterAttach.py (903 of 1977) PASS: lldb-api :: functionalities/breakpoint/comp_dir_symlink/TestCompDirSymLink.py (904 of 1977) PASS: lldb-shell :: Settings/TestSettingsSet.test (905 of 1977) UNSUPPORTED: lldb-api :: functionalities/thread/multi_break/TestMultipleBreakpoints.py (906 of 1977) PASS: lldb-unit :: Host/./HostTests/Host.WaitStatusFormat (907 of 1977) PASS: lldb-api :: types/TestRecursiveTypes.py (908 of 1977) PASS: lldb-unit :: Utility/./UtilityTests/RegularExpression.Match (909 of 1977) PASS: lldb-unit :: SymbolFile/NativePDB/./SymbolFileNativePDBTests/PDBFPOProgramToDWARFExpressionTests.InvalidOpUnary (910 of 1977) PASS: lldb-shell :: SymbolFile/DWARF/find-basic-namespace.cpp (911 of 1977) PASS: lldb-api :: functionalities/data-formatter/synthupdate/TestSyntheticFilterRecompute.py (912 of 1977) PASS: lldb-api :: macosx/profile_vrs_detach/TestDetachVrsProfile.py (913 of 1977) PASS: lldb-unit :: Utility/./UtilityTests/FileSpecTest.EqualDotsPosixRoot (914 of 1977) PASS: lldb-unit :: Language/Highlighting/./HighlighterTests/HighlighterTest.Colons (915 of 1977) PASS: lldb-unit :: Expression/./ExpressionTests/CppModuleConfigurationTest.AmbiguousLibCpp (916 of 1977) PASS: lldb-api :: commands/expression/cast_int_to_anonymous_enum/TestCastIntToAnonymousEnum.py (917 of 1977) PASS: lldb-api :: lang/objc/modules/TestObjCModules.py (918 of 1977) PASS: lldb-unit :: Utility/./UtilityTests/StreamTest.PutRawBytesToBigEndian (919 of 1977) PASS: lldb-api :: lang/c/unicode/TestUnicodeSymbols.py (920 of 1977) PASS: lldb-unit :: Utility/./UtilityTests/VMRange.Comparison (921 of 1977) PASS: lldb-api :: commands/frame/diagnose/dereference-function-return/TestDiagnoseDereferenceFunctionReturn.py (922 of 1977) PASS: lldb-shell :: SymbolFile/Breakpad/unwind-via-stack-win.test (923 of 1977) PASS: lldb-unit :: Utility/./UtilityTests/StreamTest.PutRawBytesToMixedEndian (924 of 1977) PASS: lldb-unit :: Utility/./UtilityTests/StringLexerTest.Peek (925 of 1977) PASS: lldb-unit :: Interpreter/./InterpreterTests/CompletionTest.FileCompletionAbsolute (926 of 1977) PASS: lldb-api :: functionalities/load_unload/TestLoadUnload.py (927 of 1977) PASS: lldb-api :: python_api/sblaunchinfo/TestSBLaunchInfo.py (928 of 1977) PASS: lldb-unit :: ScriptInterpreter/Python/./ScriptInterpreterPythonTests/PythonDataObjectsTest.TestRun (929 of 1977) PASS: lldb-unit :: Utility/./UtilityTests/StringListTest.ForRangeEmpty (930 of 1977) PASS: lldb-unit :: Utility/./UtilityTests/LogChannelEnabledTest.LLDB_LOG_ERROR (931 of 1977) PASS: lldb-api :: arm/emulation/TestEmulations.py (932 of 1977) PASS: lldb-unit :: Utility/./UtilityTests/UriParserTest.BracketedHostnamePort (933 of 1977) PASS: lldb-unit :: Utility/./UtilityTests/LogChannelEnabledTest.LogThread (934 of 1977) PASS: lldb-unit :: Utility/./UtilityTests/StreamTest.PutSLEB128 (935 of 1977) PASS: lldb-unit :: Host/./HostTests/SocketTest.TCPGetAddress (936 of 1977) PASS: lldb-unit :: Utility/./UtilityTests/ScalarTest.GetBytes (937 of 1977) PASS: lldb-api :: functionalities/thread/backtrace_limit/TestBacktraceLimit.py (938 of 1977) PASS: lldb-api :: functionalities/source-map/TestTargetSourceMap.py (939 of 1977) PASS: lldb-shell :: Commands/command-disassemble.s (940 of 1977) PASS: lldb-unit :: Utility/./UtilityTests/ArgsTest.TestUnknownEscape (941 of 1977) PASS: lldb-unit :: ScriptInterpreter/Python/./ScriptInterpreterPythonTests/PythonDataObjectsTest.TestPythonTupleInitializerList (942 of 1977) PASS: lldb-api :: functionalities/data-formatter/data-formatter-ptr-to-array/TestPtrToArrayFormatting.py (943 of 1977) PASS: lldb-api :: functionalities/data-formatter/data-formatter-stl/libcxx/function/TestLibCxxFunction.py (944 of 1977) PASS: lldb-unit :: SymbolFile/NativePDB/./SymbolFileNativePDBTests/PDBFPOProgramToDWARFExpressionTests.MissingTargetRegister (945 of 1977) PASS: lldb-unit :: Utility/./UtilityTests/StringListTest.InsertStringAtIndexStdString (946 of 1977) PASS: lldb-unit :: Utility/./UtilityTests/StreamTeeTest.Write (947 of 1977) PASS: lldb-unit :: Process/gdb-remote/./ProcessGdbRemoteTests/GDBRemoteClientBaseTest.SendContinueDelegateInterface (948 of 1977) UNSUPPORTED: lldb-api :: iohandler/unicode/TestUnicode.py (949 of 1977) PASS: lldb-shell :: Quit/TestQuitExitCodeHexA.test (950 of 1977) PASS: lldb-api :: functionalities/thread/concurrent_events/TestConcurrentCrashWithBreak.py (951 of 1977) PASS: lldb-shell :: ObjectFile/wasm/unified-debug-sections.yaml (952 of 1977) PASS: lldb-unit :: UnwindAssembly/x86/./UnwindAssemblyx86Tests/Testx86AssemblyInspectionEngine.TestPushImm (953 of 1977) PASS: lldb-unit :: Process/gdb-remote/./ProcessGdbRemoteTests/GDBRemoteCommunicationClientTest.GetModulesInfoInvalidResponse (954 of 1977) PASS: lldb-api :: lang/objc/modules-cache/TestClangModulesCache.py (955 of 1977) PASS: lldb-unit :: Utility/./UtilityTests/OptionsWithRawTest.EmptyInput (956 of 1977) UNSUPPORTED: lldb-api :: functionalities/asan/TestReportData.py (957 of 1977) PASS: lldb-api :: functionalities/postmortem/elf-core/TestLinuxCore.py (958 of 1977) PASS: lldb-shell :: ObjectFile/ELF/netbsd-core-amd64.test (959 of 1977) PASS: lldb-unit :: Host/./HostTests/SocketTest.TCPGetConnectURI (960 of 1977) UNSUPPORTED: lldb-api :: commands/expression/multiline-completion/TestMultilineCompletion.py (961 of 1977) PASS: lldb-unit :: Utility/./UtilityTests/BroadcasterTest.BroadcastEvent (962 of 1977) PASS: lldb-api :: functionalities/breakpoint/breakpoint_options/TestBreakpointOptions.py (963 of 1977) UNSUPPORTED: lldb-api :: functionalities/data-formatter/data-formatter-stl/libstdcpp/tuple/TestDataFormatterStdTuple.py (964 of 1977) PASS: lldb-api :: functionalities/gdb_remote_client/TestWriteMemory.py (965 of 1977) PASS: lldb-unit :: Utility/./UtilityTests/StringListTest.Clear (966 of 1977) PASS: lldb-unit :: UnwindAssembly/x86/./UnwindAssemblyx86Tests/Testx86AssemblyInspectionEngine.TestSubESP (967 of 1977) PASS: lldb-api :: functionalities/postmortem/minidump-new/TestMiniDumpUUID.py (968 of 1977) PASS: lldb-api :: types/TestLongTypesExpr.py (969 of 1977) PASS: lldb-unit :: Symbol/./SymbolTests/TestTypeSystemClang.TestGetEnumIntegerTypeUnexpectedType (970 of 1977) PASS: lldb-unit :: UnwindAssembly/x86/./UnwindAssemblyx86Tests/Testx86AssemblyInspectionEngine.TestDisassemblyMidFunctionEpilogues (971 of 1977) PASS: lldb-api :: lang/cpp/operators/TestCppOperators.py (972 of 1977) PASS: lldb-shell :: SymbolFile/DWARF/debug_rnglists.s (973 of 1977) PASS: lldb-api :: commands/add-dsym/uuid/TestAddDsymCommand.py (974 of 1977) PASS: lldb-unit :: Process/gdb-remote/./ProcessGdbRemoteTests/GDBRemoteClientBaseTest.SendContinueAndInterrupt2PacketBug (975 of 1977) PASS: lldb-unit :: SymbolFile/NativePDB/./SymbolFileNativePDBTests/PDBFPOProgramToDWARFExpressionTests.UnresolvedRegisterAssignmentReference (976 of 1977) PASS: lldb-api :: functionalities/data-formatter/data-formatter-objc/TestDataFormatterObjCExpr.py (977 of 1977) UNSUPPORTED: lldb-api :: functionalities/darwin_log/filter/exact_match/subsystem/TestDarwinLogFilterMatchSubsystem.py (978 of 1977) PASS: lldb-unit :: Utility/./UtilityTests/StringListTest.InsertStringAtIndexEnd (979 of 1977) PASS: lldb-api :: functionalities/breakpoint/dummy_target_breakpoints/TestBreakpointsWithNoTargets.py (980 of 1977) PASS: lldb-unit :: Utility/./UtilityTests/StreamTest.PutCStringWithStringRef (981 of 1977) PASS: lldb-shell :: SymbolFile/NativePDB/ast-methods.cpp (982 of 1977) PASS: lldb-api :: commands/expression/save_jit_objects/TestSaveJITObjects.py (983 of 1977) PASS: lldb-shell :: SymbolFile/DWARF/DW_OP_piece-smaller-than-struct.s (984 of 1977) PASS: lldb-api :: api/command-return-object/TestSBCommandReturnObject.py (985 of 1977) PASS: lldb-api :: functionalities/abbreviation/TestCommonShortSpellings.py (986 of 1977) PASS: lldb-shell :: SymbolFile/DWARF/debug-types-missing-signature.test (987 of 1977) PASS: lldb-api :: lang/objc/objc-optimized/TestObjcOptimized.py (988 of 1977) PASS: lldb-api :: lang/cpp/modules-import/TestCXXModulesImport.py (989 of 1977) PASS: lldb-unit :: Host/./HostTests/SocketTest.TCPListen0GetPort (990 of 1977) PASS: lldb-api :: lang/objc/objc-new-syntax/TestObjCNewSyntaxDictionary.py (991 of 1977) PASS: lldb-unit :: Host/./HostTests/HostInfoTest.GetHostname (992 of 1977) PASS: lldb-unit :: Language/Highlighting/./HighlighterTests/HighlighterTest.DefaultHighlighter (993 of 1977) PASS: lldb-unit :: Utility/./UtilityTests/StringExtractorTest.GetHexU8_Exact_NoEof (994 of 1977) PASS: lldb-unit :: Utility/./UtilityTests/FileSpecTest.AppendPathComponent (995 of 1977) PASS: lldb-api :: commands/platform/process/list/TestProcessList.py (996 of 1977) PASS: lldb-unit :: Utility/./UtilityTests/GeneratorTest.Create (997 of 1977) PASS: lldb-unit :: Utility/./UtilityTests/CompletionRequest.TryCompleteCurrentArgGood (998 of 1977) PASS: lldb-unit :: Symbol/./SymbolTests/PostfixExpression.ToDWARF (999 of 1977) PASS: lldb-unit :: Language/Highlighting/./HighlighterTests/HighlighterTest.ClangCommas (1000 of 1977) PASS: lldb-api :: lang/c/global_variables/TestGlobalVariables.py (1001 of 1977) PASS: lldb-unit :: Utility/./UtilityTests/RangeTest.ContainsEndInclusiveInvalid (1002 of 1977) PASS: lldb-api :: commands/watchpoints/watchpoint_commands/TestWatchpointCommands.py (1003 of 1977) PASS: lldb-api :: commands/expression/unwind_expression/TestUnwindExpression.py (1004 of 1977) PASS: lldb-api :: functionalities/data-formatter/data-formatter-stl/libcxx/vector/TestDataFormatterLibcxxVector.py (1005 of 1977) PASS: lldb-unit :: Utility/./UtilityTests/SerializationRountripTest.SerializeDeserializeObjectReference (1006 of 1977) PASS: lldb-unit :: Process/minidump/./LLDBMinidumpTests/MinidumpParserTest.GetThreadContext_x86_64 (1007 of 1977) PASS: lldb-api :: functionalities/data-formatter/data-formatter-objc/TestDataFormatterObjCNSURL.py (1008 of 1977) PASS: lldb-api :: lang/objc/objc-dyn-sbtype/TestObjCDynamicSBType.py (1009 of 1977) PASS: lldb-shell :: ObjectFile/PECOFF/symbol.yaml (1010 of 1977) PASS: lldb-api :: functionalities/thread/concurrent_events/TestConcurrentManyCrash.py (1011 of 1977) PASS: lldb-unit :: Utility/./UtilityTests/DataExtractorTest.GetBitfield (1012 of 1977) PASS: lldb-api :: lang/cpp/overloaded-functions/TestOverloadedFunctions.py (1013 of 1977) PASS: lldb-api :: functionalities/data-formatter/data-formatter-script/TestDataFormatterScript.py (1014 of 1977) PASS: lldb-api :: lang/c/bitfields/TestBitfields.py (1015 of 1977) PASS: lldb-api :: lang/objc/objc-stepping/TestObjCStepping.py (1016 of 1977) UNSUPPORTED: lldb-shell :: Breakpoint/case-insensitive.test (1017 of 1977) PASS: lldb-api :: functionalities/thread/jump/TestThreadJump.py (1018 of 1977) PASS: lldb-api :: lang/cpp/dynamic-value/TestCppValueCast.py (1019 of 1977) UNSUPPORTED: lldb-api :: linux/add-symbols/TestTargetSymbolsAddCommand.py (1020 of 1977) PASS: lldb-unit :: Interpreter/./InterpreterTests/OptionArgParserTest.toChar (1021 of 1977) PASS: lldb-shell :: Quit/TestQuitExitCodeTooManyArgs.test (1022 of 1977) PASS: lldb-unit :: Symbol/./SymbolTests/SymbolsTest.LocateExecutableSymbolFileForUnknownExecutableAndMissingSymbolFile (1023 of 1977) PASS: lldb-unit :: UnwindAssembly/x86/./UnwindAssemblyx86Tests/Testx86AssemblyInspectionEngine.TestStackRealign8BitDisp_i386 (1024 of 1977) PASS: lldb-unit :: debugserver/./debugserverTests/RNBSocket.LoopBackConnectIPv6 (1025 of 1977) PASS: lldb-unit :: UnwindAssembly/x86/./UnwindAssemblyx86Tests/Testx86AssemblyInspectionEngine.TestSimple32bitFrameFunction (1026 of 1977) PASS: lldb-api :: lang/objcxx/hide-runtime-values/TestObjCXXHideRuntimeValues.py (1027 of 1977) PASS: lldb-unit :: Utility/./UtilityTests/RangeTest.ContainsAddr (1028 of 1977) PASS: lldb-api :: lang/objc/objc-ivar-protocols/TestIvarProtocols.py (1029 of 1977) PASS: lldb-api :: functionalities/data-formatter/data-formatter-stl/libcxx/list/loop/TestDataFormatterLibcxxListLoop.py (1030 of 1977) PASS: lldb-api :: python_api/file_handle/TestFileHandle.py (1031 of 1977) PASS: lldb-unit :: ObjectFile/ELF/./ObjectFileELFTests/ObjectFileELFTest.GetSymtab_NoSymEntryPointArmThumbAddressClass (1032 of 1977) PASS: lldb-unit :: Utility/./UtilityTests/StringListTest.AppendStringStdString (1033 of 1977) PASS: lldb-api :: lang/cpp/constructors/TestCppConstructors.py (1034 of 1977) UNSUPPORTED: lldb-api :: functionalities/longjmp/TestLongjmp.py (1035 of 1977) PASS: lldb-unit :: Utility/./UtilityTests/AnsiTerminal.AtStart (1036 of 1977) UNSUPPORTED: lldb-api :: functionalities/unwind/ehframe/TestEhFrameUnwind.py (1037 of 1977) PASS: lldb-api :: lang/objc/foundation/TestSymbolTable.py (1038 of 1977) PASS: lldb-unit :: Language/Highlighting/./HighlighterTests/HighlighterTest.DefaultHighlighterWithCursor (1039 of 1977) PASS: lldb-unit :: UnwindAssembly/x86/./UnwindAssemblyx86Tests/Testx86AssemblyInspectionEngine.TestLEAVE (1040 of 1977) PASS: lldb-api :: macosx/universal/TestUniversal.py (1041 of 1977) PASS: lldb-unit :: Utility/./UtilityTests/StreamTeeTest.SetStreamAtIndexOverwrite (1042 of 1977) PASS: lldb-unit :: ScriptInterpreter/Python/./ScriptInterpreterPythonTests/PythonDataObjectsTest.TestExtractingUInt64ThroughStructuredData (1043 of 1977) PASS: lldb-api :: python_api/value/empty_class/TestValueAPIEmptyClass.py (1044 of 1977) PASS: lldb-shell :: SymbolFile/DWARF/dwarf5_locations.s (1045 of 1977) PASS: lldb-shell :: Expr/TestTypeOfDeclTypeExpr.test (1046 of 1977) PASS: lldb-unit :: Expression/./ExpressionTests/DiagnosticManagerTest.AppendMessageAttachToLastDiag (1047 of 1977) PASS: lldb-shell :: SymbolFile/NativePDB/nested-types.cpp (1048 of 1977) PASS: lldb-api :: functionalities/breakpoint/breakpoint_command/TestBreakpointCommandsFromPython.py (1049 of 1977) PASS: lldb-unit :: Process/minidump/./LLDBMinidumpTests/RegisterContextMinidump.CheckRegisterContextMinidump_ARM (1050 of 1977) PASS: lldb-api :: commands/expression/timeout/TestCallWithTimeout.py (1051 of 1977) PASS: lldb-api :: functionalities/thread/concurrent_events/TestConcurrentDelayedCrashWithBreakpointSignal.py (1052 of 1977) PASS: lldb-api :: api/log/TestAPILog.py (1053 of 1977) PASS: lldb-api :: functionalities/data-formatter/data-formatter-stl/libcxx/multiset/TestDataFormatterLibcxxMultiSet.py (1054 of 1977) UNSUPPORTED: lldb-api :: functionalities/tsan/multiple/TestTsanMultiple.py (1055 of 1977) PASS: lldb-api :: commands/expression/result_numbering/TestResultNumbering.py (1056 of 1977) UNSUPPORTED: lldb-shell :: Minidump/Windows/arm-fp-unwind.test (1057 of 1977) PASS: lldb-unit :: Process/gdb-remote/./ProcessGdbRemoteTests/GDBRemoteCommunicationClientTest.SendStartTracePacket (1058 of 1977) PASS: lldb-api :: functionalities/data-formatter/data-formatter-proper-plurals/TestFormattersOneIsSingular.py (1059 of 1977) PASS: lldb-unit :: Expression/./ExpressionTests/CppModuleConfigurationTest.UnknownLibCppFile (1060 of 1977) PASS: lldb-unit :: Utility/./UtilityTests/StreamTest.PutPtr (1061 of 1977) UNSUPPORTED: lldb-api :: commands/register/register/intel_xtended_registers/mpx_bound_violation/TestBoundViolation.py (1062 of 1977) PASS: lldb-api :: lang/objc/global_ptrs/TestGlobalObjects.py (1063 of 1977) UNSUPPORTED: lldb-api :: benchmarks/startup/TestStartupDelays.py (1064 of 1977) PASS: lldb-api :: functionalities/breakpoint/address_breakpoints/TestBadAddressBreakpoints.py (1065 of 1977) PASS: lldb-api :: functionalities/tail_call_frames/inlining_and_tail_calls/TestInliningAndTailCalls.py (1066 of 1977) PASS: lldb-unit :: Symbol/./SymbolTests/TestTypeSystemClang.TestGetTypeClassDeclType (1067 of 1977) PASS: lldb-unit :: Signals/./SignalsTests/UnixSignalsTest.GetFilteredSignals (1068 of 1977) PASS: lldb-unit :: Process/gdb-remote/./ProcessGdbRemoteTests/GDBRemoteCommunicationClientTest.TestPacketSpeedJSON (1069 of 1977) PASS: lldb-api :: functionalities/data-formatter/vector-types/TestVectorTypesFormatting.py (1070 of 1977) PASS: lldb-unit :: Utility/./UtilityTests/ArgsTest.TestSingleQuotedArgWithSpace (1071 of 1977) PASS: lldb-shell :: Reproducer/TestDriverOptions.test (1072 of 1977) PASS: lldb-unit :: ScriptInterpreter/Python/./ScriptInterpreterPythonTests/PythonDataObjectsTest.TestPythonIntegerToStructuredInteger (1073 of 1977) PASS: lldb-api :: lang/cpp/chained-calls/TestCppChainedCalls.py (1074 of 1977) PASS: lldb-unit :: Process/minidump/./LLDBMinidumpTests/MinidumpParserTest.GetMemory (1075 of 1977) UNSUPPORTED: lldb-shell :: SymbolFile/PDB/udt-layout.test (1076 of 1977) PASS: lldb-api :: lang/c/inlines/TestRedefinitionsInInlines.py (1077 of 1977) PASS: lldb-api :: python_api/symbol-context/two-files/TestSymbolContextTwoFiles.py (1078 of 1977) PASS: lldb-unit :: Utility/./UtilityTests/StreamTest.PutStringAsRawHex8 (1079 of 1977) PASS: lldb-api :: commands/expression/completion-crash-incomplete-record/TestCompletionCrashIncompleteRecord.py (1080 of 1977) PASS: lldb-api :: functionalities/breakpoint/require_hw_breakpoints/TestRequireHWBreakpoints.py (1081 of 1977) PASS: lldb-shell :: SymbolFile/DWARF/dwp.s (1082 of 1977) PASS: lldb-shell :: ObjectFile/Breakpad/sections.test (1083 of 1977) PASS: lldb-unit :: Utility/./UtilityTests/FileSpecTest.GuessPathStyle (1084 of 1977) PASS: lldb-unit :: Utility/./UtilityTests/ArgsTest.ReplaceArgumentAtIndexOutOfRange (1085 of 1977) PASS: lldb-api :: functionalities/show_location/TestShowLocationDwarf5.py (1086 of 1977) PASS: lldb-unit :: Process/minidump/./LLDBMinidumpTests/MinidumpParserTest.GetMemoryRegionInfoFromMemoryList (1087 of 1977) PASS: lldb-unit :: ScriptInterpreter/Python/./ScriptInterpreterPythonTests/PythonDataObjectsTest.TestPythonFile (1088 of 1977) PASS: lldb-unit :: Platform/./LLDBPlatformTests/PlatformDarwinTest.TestParseVersionBuildDir (1089 of 1977) PASS: lldb-unit :: UnwindAssembly/x86/./UnwindAssemblyx86Tests/Testx86AssemblyInspectionEngine.TestPushExtended (1090 of 1977) PASS: lldb-shell :: SymbolFile/NativePDB/function-types-classes.cpp (1091 of 1977) UNSUPPORTED: lldb-api :: benchmarks/continue/TestBenchmarkContinue.py (1092 of 1977) PASS: lldb-api :: tools/lldb-server/TestAppleSimulatorOSType.py (1093 of 1977) PASS: lldb-api :: commands/watchpoints/watchpoint_disable/TestWatchpointDisable.py (1094 of 1977) PASS: lldb-api :: commands/expression/call-function/TestCallStdStringFunction.py (1095 of 1977) PASS: lldb-unit :: Symbol/./SymbolTests/LineEntryTest.GetSameLineContiguousAddressRangeOneInline (1096 of 1977) PASS: lldb-api :: commands/frame/diagnose/dereference-argument/TestDiagnoseDereferenceArgument.py (1097 of 1977) PASS: lldb-api :: functionalities/gdb_remote_client/TestGDBRemoteClient.py (1098 of 1977) PASS: lldb-unit :: Utility/./UtilityTests/ArchSpecTest.YAML (1099 of 1977) PASS: lldb-api :: macosx/thread-names/TestInterruptThreadNames.py (1100 of 1977) PASS: lldb-unit :: Utility/./UtilityTests/RangeTest.Slide (1101 of 1977) PASS: lldb-api :: functionalities/tail_call_frames/sbapi_support/TestTailCallFrameSBAPI.py (1102 of 1977) PASS: lldb-api :: functionalities/data-formatter/nsarraysynth/TestNSArraySynthetic.py (1103 of 1977) UNSUPPORTED: lldb-api :: python_api/disassemble-raw-data/TestDisassemble_VST1_64.py (1104 of 1977) PASS: lldb-unit :: Process/minidump/./LLDBMinidumpTests/MinidumpParserTest.GetExceptionStream (1105 of 1977) PASS: lldb-api :: functionalities/abbreviation/TestAbbreviations.py (1106 of 1977) PASS: lldb-api :: commands/expression/import-std-module/sysroot/TestStdModuleSysroot.py (1107 of 1977) PASS: lldb-api :: lang/c/forward/TestForwardDeclaration.py (1108 of 1977) PASS: lldb-unit :: UnwindAssembly/x86/./UnwindAssemblyx86Tests/Testx86AssemblyInspectionEngine.TestPushEDI (1109 of 1977) PASS: lldb-api :: commands/expression/radar_9531204/TestPrintfAfterUp.py (1110 of 1977) PASS: lldb-unit :: Process/minidump/./LLDBMinidumpTests/MinidumpParserTest.FindMemoryRange (1111 of 1977) PASS: lldb-api :: commands/expression/import-std-module/list/TestListFromStdModule.py (1112 of 1977) PASS: lldb-unit :: Symbol/./SymbolTests/TestTypeSystemClang.TestGetTypeClassNested (1113 of 1977) PASS: lldb-api :: functionalities/data-formatter/data-formatter-caching/TestDataFormatterCaching.py (1114 of 1977) PASS: lldb-unit :: Utility/./UtilityTests/SerializationRountripTest.SerializeDeserializePodReferences (1115 of 1977) PASS: lldb-api :: functionalities/non-overlapping-index-variable-i/TestIndexVariable.py (1116 of 1977) UNSUPPORTED: lldb-shell :: SymbolFile/NativePDB/local-variables.cpp (1117 of 1977) PASS: lldb-unit :: UnwindAssembly/x86/./UnwindAssemblyx86Tests/Testx86AssemblyInspectionEngine.TestPushR13 (1118 of 1977) PASS: lldb-api :: commands/expression/call-function/TestCallStopAndContinue.py (1119 of 1977) PASS: lldb-api :: functionalities/thread/concurrent_events/TestConcurrentTwoWatchpointsOneBreakpoint.py (1120 of 1977) PASS: lldb-api :: lang/cpp/global_operators/TestCppGlobalOperators.py (1121 of 1977) PASS: lldb-api :: lang/cpp/dynamic-value-same-basename/TestDynamicValueSameBase.py (1122 of 1977) UNSUPPORTED: lldb-api :: functionalities/darwin_log/basic/TestDarwinLogBasic.py (1123 of 1977) UNSUPPORTED: lldb-shell :: ObjectFile/PECOFF/disassemble-thumb.yaml (1124 of 1977) PASS: lldb-api :: functionalities/set-data/TestSetData.py (1125 of 1977) PASS: lldb-api :: functionalities/reproducers/attach/TestReproducerAttach.py (1126 of 1977) PASS: lldb-unit :: UnwindAssembly/x86/./UnwindAssemblyx86Tests/Testx86AssemblyInspectionEngine.TestPopR13 (1127 of 1977) PASS: lldb-shell :: ObjectFile/ELF/basic-info.yaml (1128 of 1977) XFAIL: lldb-shell :: SymbolFile/DWARF/find-type-in-function.cpp (1129 of 1977) PASS: lldb-unit :: Utility/./UtilityTests/RangeTest.ClearWithStarAddress (1130 of 1977) PASS: lldb-api :: lang/objc/foundation/TestObjectDescriptionAPI.py (1131 of 1977) PASS: lldb-unit :: Utility/./UtilityTests/AnsiTerminal.Incomplete (1132 of 1977) PASS: lldb-api :: lang/objc/objc-property/TestObjCProperty.py (1133 of 1977) PASS: lldb-unit :: Utility/./UtilityTests/StringExtractorTest.GetHexU8_Underflow (1134 of 1977) PASS: lldb-unit :: UnwindAssembly/x86/./UnwindAssemblyx86Tests/Testx86AssemblyInspectionEngine.Testi386IgnoredRegisters (1135 of 1977) PASS: lldb-shell :: SymbolFile/DWARF/dwarf5-index-is-used.cpp (1136 of 1977) PASS: lldb-shell :: Reproducer/TestVersionCheck.test (1137 of 1977) PASS: lldb-api :: commands/expression/dollar-in-variable/TestDollarInVariable.py (1138 of 1977) UNSUPPORTED: lldb-api :: commands/watchpoints/variable_out_of_scope/TestWatchedVarHitWhenInScope.py (1139 of 1977) PASS: lldb-api :: lang/cpp/dynamic-value/TestDynamicValue.py (1140 of 1977) PASS: lldb-shell :: Settings/TestDisableColor.test (1141 of 1977) PASS: lldb-api :: functionalities/archives/TestBSDArchives.py (1142 of 1977) PASS: lldb-unit :: ScriptInterpreter/Python/./ScriptInterpreterPythonTests/PythonDataObjectsTest.TestPythonInteger (1143 of 1977) PASS: lldb-unit :: Utility/./UtilityTests/TimerTest.CategoryTimesNested (1144 of 1977) XFAIL: lldb-shell :: Register/x86-mm-xmm-read.test (1145 of 1977) PASS: lldb-api :: python_api/target/TestTargetAPI.py (1146 of 1977) PASS: lldb-unit :: Utility/./UtilityTests/StringListTest.SplitIntoLinesSingleTrailingCR (1147 of 1977) PASS: lldb-api :: commands/frame/var/TestFrameVar.py (1148 of 1977) PASS: lldb-unit :: Host/./HostTests/TaskPoolTest.AddTask (1149 of 1977) PASS: lldb-api :: commands/expression/import-std-module/shared_ptr-dbg-info-content/TestSharedPtrDbgInfoContentFromStdModule.py (1150 of 1977) PASS: lldb-api :: lang/objc/objc-new-syntax/TestObjCNewSyntaxLiteral.py (1151 of 1977) PASS: lldb-unit :: Utility/./UtilityTests/StateTest.Formatv (1152 of 1977) PASS: lldb-unit :: Utility/./UtilityTests/VMRange.ContainsRange (1153 of 1977) PASS: lldb-api :: python_api/class_members/TestSBTypeClassMembers.py (1154 of 1977) PASS: lldb-unit :: Utility/./UtilityTests/DataExtractorTest.GetCStr (1155 of 1977) PASS: lldb-api :: lang/c/struct_types/TestStructTypes.py (1156 of 1977) PASS: lldb-unit :: Utility/./UtilityTests/RangeTest.Equal (1157 of 1977) PASS: lldb-unit :: ScriptInterpreter/Python/./ScriptInterpreterPythonTests/PythonDataObjectsTest.TestPythonStringToStr (1158 of 1977) PASS: lldb-api :: lang/objc/orderedset/TestOrderedSet.py (1159 of 1977) UNSUPPORTED: lldb-shell :: ScriptInterpreter/Lua/convenience_variables.test (1160 of 1977) PASS: lldb-unit :: Utility/./UtilityTests/StringListTest.ShiftStdString (1161 of 1977) PASS: lldb-api :: lang/cpp/signed_types/TestSignedTypes.py (1162 of 1977) PASS: lldb-unit :: Utility/./UtilityTests/StringListTest.JoinSingle (1163 of 1977) PASS: lldb-unit :: UnwindAssembly/x86/./UnwindAssemblyx86Tests/Testx86AssemblyInspectionEngine.TestMovRSPtoRBP (1164 of 1977) PASS: lldb-unit :: Utility/./UtilityTests/StructuredDataTest.StringDump (1165 of 1977) PASS: lldb-api :: commands/expression/import-std-module/unique_ptr/TestUniquePtrFromStdModule.py (1166 of 1977) PASS: lldb-api :: lang/objc/objc-struct-return/TestObjCStructReturn.py (1167 of 1977) PASS: lldb-api :: functionalities/data-formatter/data-formatter-named-summaries/TestDataFormatterNamedSummaries.py (1168 of 1977) PASS: lldb-api :: functionalities/thread/concurrent_events/TestConcurrentWatchBreak.py (1169 of 1977) PASS: lldb-unit :: SymbolFile/DWARF/./SymbolFileDWARFTests/SymbolFileDWARFTests.ParseArangesNonzeroSegmentSize (1170 of 1977) PASS: lldb-api :: tools/lldb-vscode/breakpoint-events/TestVSCode_breakpointEvents.py (1171 of 1977) UNSUPPORTED: lldb-shell :: Register/x86-64-zmm-write.test (1172 of 1977) PASS: lldb-shell :: Minidump/Windows/Sigsegv/sigsegv.test (1173 of 1977) PASS: lldb-api :: tools/lldb-server/TestGdbRemote_vCont.py (1174 of 1977) PASS: lldb-api :: python_api/sbstructureddata/TestStructuredDataAPI.py (1175 of 1977) PASS: lldb-shell :: ObjectFile/wasm/stripped-debug-sections.yaml (1176 of 1977) PASS: lldb-api :: python_api/interpreter/TestCommandInterpreterAPI.py (1177 of 1977) PASS: lldb-api :: commands/expression/issue_11588/Test11588.py (1178 of 1977) PASS: lldb-unit :: Utility/./UtilityTests/LogChannelTest.EnableOptions (1179 of 1977) PASS: lldb-api :: functionalities/tail_call_frames/ambiguous_tail_call_seq2/TestAmbiguousTailCallSeq2.py (1180 of 1977) PASS: lldb-api :: lang/objcxx/cxx-bridged-po/TestObjCXXBridgedPO.py (1181 of 1977) PASS: lldb-shell :: SymbolFile/DWARF/debug_ranges.s (1182 of 1977) PASS: lldb-unit :: Utility/./UtilityTests/NameMatchesTest.Contains (1183 of 1977) PASS: lldb-shell :: Unwind/trap_frame_sym_ctx.test (1184 of 1977) PASS: lldb-unit :: Utility/./UtilityTests/UriParserTest.TypicalPortPathIPv6 (1185 of 1977) PASS: lldb-api :: functionalities/data-formatter/data-formatter-synthval/TestDataFormatterSynthVal.py (1186 of 1977) PASS: lldb-unit :: Utility/./UtilityTests/ScalarTest.Division (1187 of 1977) PASS: lldb-api :: python_api/signals/TestSignalsAPI.py (1188 of 1977) PASS: lldb-unit :: Utility/./UtilityTests/EventTest.DumpEventDataBytes (1189 of 1977) PASS: lldb-unit :: Utility/./UtilityTests/StringListTest.InsertStringAtIndexOutOfBounds (1190 of 1977) PASS: lldb-api :: lang/objc/ivar-IMP/TestObjCiVarIMP.py (1191 of 1977) PASS: lldb-unit :: Process/minidump/./LLDBMinidumpTests/RegisterContextMinidump.ConvertMinidumpContext_x86_32 (1192 of 1977) PASS: lldb-unit :: Utility/./UtilityTests/StringListTest.Assignment (1193 of 1977) PASS: lldb-unit :: Utility/./UtilityTests/StreamTest.AddressSize (1194 of 1977) PASS: lldb-unit :: Utility/./UtilityTests/StringListTest.LongestCommonPrefixEmpty (1195 of 1977) PASS: lldb-unit :: UnwindAssembly/x86/./UnwindAssemblyx86Tests/Testx86AssemblyInspectionEngine.TestPushEBX (1196 of 1977) PASS: lldb-shell :: ObjectFile/ELF/section-overlap.yaml (1197 of 1977) PASS: lldb-api :: functionalities/plugins/python_os_plugin/TestPythonOSPlugin.py (1198 of 1977) PASS: lldb-api :: lang/c/shared_lib_stripped_symbols/TestSharedLibStrippedSymbols.py (1199 of 1977) PASS: lldb-api :: macosx/version_zero/TestGetVersionZeroVersion.py (1200 of 1977) PASS: lldb-shell :: ObjectFile/ELF/minidebuginfo-corrupt-xz.yaml (1201 of 1977) PASS: lldb-unit :: Utility/./UtilityTests/LogChannelTest.List (1202 of 1977) PASS: lldb-unit :: Utility/./UtilityTests/StringLexerTest.PutBack (1203 of 1977) PASS: lldb-api :: python_api/debugger/TestDebuggerAPI.py (1204 of 1977) PASS: lldb-shell :: Driver/TestFile.test (1205 of 1977) PASS: lldb-api :: tools/lldb-server/TestGdbRemoteThreadsInStopReply.py (1206 of 1977) PASS: lldb-api :: commands/expression/import-std-module/vector/TestVectorFromStdModule.py (1207 of 1977) PASS: lldb-unit :: debugserver/./debugserverTests/RNBSocket.LoopBackListenIPv4 (1208 of 1977) PASS: lldb-api :: types/TestIntegerTypeExpr.py (1209 of 1977) UNSUPPORTED: lldb-api :: functionalities/data-formatter/data-formatter-stl/libstdcpp/list/TestDataFormatterStdList.py (1210 of 1977) PASS: lldb-api :: commands/watchpoints/watchpoint_set_command/TestWatchLocationWithWatchSet.py (1211 of 1977) PASS: lldb-unit :: Utility/./UtilityTests/ListenerTest.GetEventWait (1212 of 1977) PASS: lldb-api :: functionalities/data-formatter/hexcaps/TestDataFormatterHexCaps.py (1213 of 1977) UNSUPPORTED: lldb-shell :: Unwind/eh-frame-small-fde.test (1214 of 1977) PASS: lldb-unit :: Utility/./UtilityTests/StreamTeeTest.DefaultConstructor (1215 of 1977) PASS: lldb-unit :: Utility/./UtilityTests/RangeDataVector.FindEntryThatContains (1216 of 1977) PASS: lldb-api :: commands/help/TestHelp.py (1217 of 1977) PASS: lldb-api :: commands/log/invalid-args/TestInvalidArgsLog.py (1218 of 1977) PASS: lldb-api :: python_api/sbvalue_const_addrof/TestSBValueConstAddrOf.py (1219 of 1977) PASS: lldb-api :: lang/c/enum_types/TestEnumTypes.py (1220 of 1977) PASS: lldb-unit :: ScriptInterpreter/Python/./ScriptInterpreterPythonTests/PythonDataObjectsTest.TestTypeNameResolutionNoDot (1221 of 1977) PASS: lldb-api :: functionalities/thread/concurrent_events/TestConcurrentWatchpointWithDelayWatchpointThreads.py (1222 of 1977) PASS: lldb-unit :: ObjectFile/Breakpad/./ObjectFileBreakpadTests/LineRecord.parse (1223 of 1977) PASS: lldb-api :: macosx/order/TestOrderFile.py (1224 of 1977) PASS: lldb-unit :: Language/Highlighting/./HighlighterTests/HighlighterTest.Keywords (1225 of 1977) PASS: lldb-api :: commands/platform/basic/TestPlatformCommand.py (1226 of 1977) PASS: lldb-api :: functionalities/data-formatter/language_category_updates/TestDataFormatterLanguageCategoryUpdates.py (1227 of 1977) PASS: lldb-unit :: Utility/./UtilityTests/StringExtractorTest.GetHexU8_Exact (1228 of 1977) PASS: lldb-api :: tools/lldb-server/TestGdbRemoteExitCode.py (1229 of 1977) PASS: lldb-api :: functionalities/thread/concurrent_events/TestConcurrentManyWatchpoints.py (1230 of 1977) PASS: lldb-shell :: SymbolFile/DWARF/dir-separator-windows.s (1231 of 1977) PASS: lldb-shell :: Quit/TestQuitExitCode30.test (1232 of 1977) PASS: lldb-shell :: SymbolFile/DWARF/find-method-local-struct.cpp (1233 of 1977) PASS: lldb-unit :: Utility/./UtilityTests/LogChannelTest.Disable (1234 of 1977) PASS: lldb-unit :: Utility/./UtilityTests/StringLexerTest.HasAtLeast (1235 of 1977) PASS: lldb-unit :: Expression/./ExpressionTests/ClangExpressionDeclMapTest.TestPersistentDeclLookup (1236 of 1977) PASS: lldb-shell :: ScriptInterpreter/None/import_module.test (1237 of 1977) PASS: lldb-api :: lang/cpp/exceptions/TestCPPExceptionBreakpoints.py (1238 of 1977) PASS: lldb-api :: lang/cpp/function-qualifiers/TestCppFunctionQualifiers.py (1239 of 1977) PASS: lldb-api :: commands/expression/anonymous-struct/TestCallUserAnonTypedef.py (1240 of 1977) PASS: lldb-unit :: Target/./TargetTests/PathMappingListTest.RemapRoot (1241 of 1977) PASS: lldb-unit :: Expression/./ExpressionTests/ClangHostTest.MacOSX (1242 of 1977) PASS: lldb-api :: functionalities/thread/concurrent_events/TestConcurrentTwoWatchpointThreads.py (1243 of 1977) PASS: lldb-shell :: ObjectFile/PECOFF/uuid.yaml (1244 of 1977) PASS: lldb-api :: driver/batch_mode/TestBatchMode.py (1245 of 1977) PASS: lldb-unit :: Utility/./UtilityTests/StringLexerTest.NextIf (1246 of 1977) PASS: lldb-unit :: Host/./HostTests/NativeProcessProtocolTest.SetBreakpoint (1247 of 1977) PASS: lldb-unit :: Utility/./UtilityTests/StringListTest.AppendList (1248 of 1977) PASS: lldb-unit :: ObjectFile/Breakpad/./ObjectFileBreakpadTests/ModuleRecord.parse (1249 of 1977) PASS: lldb-api :: functionalities/gdb_remote_client/TestJLink6Armv7RegisterDefinition.py (1250 of 1977) PASS: lldb-unit :: UnwindAssembly/x86/./UnwindAssemblyx86Tests/Testx86AssemblyInspectionEngine.TestPushR14 (1251 of 1977) PASS: lldb-api :: functionalities/data-formatter/data-formatter-categories/TestDataFormatterCategories.py (1252 of 1977) PASS: lldb-api :: types/TestShortTypeExpr.py (1253 of 1977) PASS: lldb-api :: lang/cpp/namespace/TestNamespace.py (1254 of 1977) UNSUPPORTED: lldb-shell :: ScriptInterpreter/Lua/persistent_state.test (1255 of 1977) PASS: lldb-unit :: Utility/./UtilityTests/RangeTest.Constructor (1256 of 1977) PASS: lldb-api :: python_api/sbvalue_persist/TestSBValuePersist.py (1257 of 1977) PASS: lldb-api :: functionalities/thread/concurrent_events/TestConcurrentCrashWithSignal.py (1258 of 1977) PASS: lldb-api :: commands/expression/invalid-args/TestInvalidArgsExpression.py (1259 of 1977) PASS: lldb-unit :: ObjectFile/Breakpad/./ObjectFileBreakpadTests/FileRecord.parse (1260 of 1977) PASS: lldb-unit :: Utility/./UtilityTests/StreamTest.AddressSuffix (1261 of 1977) PASS: lldb-api :: commands/expression/regression-access-function-template-in-record/TestRegressionAccessFunctionTemplateInRecord.py (1262 of 1977) PASS: lldb-api :: lang/cpp/bool/TestCPPBool.py (1263 of 1977) UNSUPPORTED: lldb-api :: commands/watchpoints/multi_watchpoint_slots/TestWatchpointMultipleSlots.py (1264 of 1977) PASS: lldb-shell :: ObjectFile/Breakpad/uuid-matching-mac.test (1265 of 1977) PASS: lldb-api :: lang/cpp/gmodules-templates/TestGModules.py (1266 of 1977) PASS: lldb-api :: lang/cpp/covariant-return-types/TestCovariantReturnTypes.py (1267 of 1977) PASS: lldb-api :: functionalities/data-formatter/data-formatter-stl/libcxx/variant/TestDataFormatterLibcxxVariant.py (1268 of 1977) PASS: lldb-api :: functionalities/signal/TestSendSignal.py (1269 of 1977) PASS: lldb-api :: functionalities/thread/thread_exit/TestThreadExit.py (1270 of 1977) PASS: lldb-unit :: Utility/./UtilityTests/StreamTest.AddressRangeSize (1271 of 1977) PASS: lldb-unit :: Utility/./UtilityTests/RecordReplayTest.InstrumentedBarRef (1272 of 1977) PASS: lldb-api :: lang/cpp/char1632_t/TestChar1632T.py (1273 of 1977) PASS: lldb-unit :: Language/CPlusPlus/./LanguageCPlusPlusTests/CPlusPlusLanguage.MethodNameParsing (1274 of 1977) PASS: lldb-api :: functionalities/pre_run_dylibs/TestPreRunDylibs.py (1275 of 1977) PASS: lldb-unit :: SymbolFile/DWARF/./SymbolFileDWARFTests/SymbolFileDWARFTests.TestAbbrevInvalidNULLTag (1276 of 1977) PASS: lldb-api :: functionalities/data-formatter/data-formatter-stl/libcxx/map/TestDataFormatterLibccMap.py (1277 of 1977) PASS: lldb-shell :: ObjectFile/ELF/PT_LOAD-overlap-section.yaml (1278 of 1977) PASS: lldb-unit :: ObjectFile/ELF/./ObjectFileELFTests/ObjectFileELFTest.GetModuleSpecifications_EarlySectionHeaders (1279 of 1977) PASS: lldb-unit :: Utility/./UtilityTests/SubsystemRAIITest.NormalSubsystem (1280 of 1977) PASS: lldb-api :: types/TestDoubleTypes.py (1281 of 1977) PASS: lldb-api :: functionalities/wrong_commands/TestWrongCommands.py (1282 of 1977) PASS: lldb-unit :: Utility/./UtilityTests/StreamTest.PutCharWhitespace (1283 of 1977) PASS: lldb-api :: lang/objc/foundation/TestRuntimeTypes.py (1284 of 1977) PASS: lldb-unit :: Utility/./UtilityTests/StringExtractorTest.DecodeHexU8_Exact (1285 of 1977) PASS: lldb-api :: lang/cpp/unicode-literals/TestUnicodeLiterals.py (1286 of 1977) PASS: lldb-unit :: Utility/./UtilityTests/StringExtractorTest.GetNameColonValueNoColon (1287 of 1977) PASS: lldb-unit :: Utility/./UtilityTests/BinaryStreamTest.PutSLEB128Zero (1288 of 1977) PASS: lldb-unit :: Process/gdb-remote/./ProcessGdbRemoteTests/GDBRemoteCommunicationClientTest.GetModulesInfo (1289 of 1977) PASS: lldb-api :: lang/objc/objc-foundation-dictionary-empty/TestNSDictionary0.py (1290 of 1977) PASS: lldb-api :: commands/source/info/TestSourceInfo.py (1291 of 1977) PASS: lldb-unit :: Utility/./UtilityTests/StringExtractorTest.GetHexU8_Extra_NoEof (1292 of 1977) PASS: lldb-api :: commands/expression/radar_8638051/Test8638051.py (1293 of 1977) PASS: lldb-api :: functionalities/data-formatter/data-formatter-globals/TestDataFormatterGlobals.py (1294 of 1977) PASS: lldb-unit :: Utility/./UtilityTests/CompletionRequest.TestCompletionOwnership (1295 of 1977) PASS: lldb-api :: functionalities/gdb_remote_client/TestStopPCs.py (1296 of 1977) PASS: lldb-unit :: Utility/./UtilityTests/RangeTest.EqualInvalid (1297 of 1977) PASS: lldb-shell :: Minidump/Windows/find-module.test (1298 of 1977) PASS: lldb-shell :: Quit/TestQuitExitCode0.test (1299 of 1977) PASS: lldb-unit :: Language/CPlusPlus/./LanguageCPlusPlusTests/CPlusPlusLanguage.ExtractContextAndIdentifier (1300 of 1977) PASS: lldb-unit :: Symbol/./SymbolTests/TestTypeSystemClang.TemplateArguments (1301 of 1977) UNSUPPORTED: lldb-api :: functionalities/ubsan/basic/TestUbsanBasic.py (1302 of 1977) PASS: lldb-api :: lang/objc/objc-runtime-ivars/TestRuntimeIvars.py (1303 of 1977) UNSUPPORTED: lldb-api :: tools/lldb-vscode/completions/TestVSCode_completions.py (1304 of 1977) PASS: lldb-unit :: Symbol/./SymbolTests/TestClangASTImporter.MetadataPropagation (1305 of 1977) PASS: lldb-unit :: Symbol/./SymbolTests/TestClangASTImporter.CanImportInvalidType (1306 of 1977) PASS: lldb-api :: commands/expression/completion/TestExprCompletion.py (1307 of 1977) UNSUPPORTED: lldb-api :: functionalities/data-formatter/data-formatter-stl/libstdcpp/string/TestDataFormatterStdString.py (1308 of 1977) PASS: lldb-shell :: SymbolFile/DWARF/find-inline-method.s (1309 of 1977) PASS: lldb-unit :: UnwindAssembly/x86/./UnwindAssemblyx86Tests/Testx86AssemblyInspectionEngine.TestPushEDX (1310 of 1977) PASS: lldb-shell :: SymbolFile/DWARF/gnu-style-compression.cpp (1311 of 1977) PASS: lldb-api :: functionalities/postmortem/minidump-new/TestMiniDumpNew.py (1312 of 1977) PASS: lldb-api :: lang/c/shared_lib/TestSharedLib.py (1313 of 1977) PASS: lldb-api :: functionalities/postmortem/elf-core/thread_crash/TestLinuxCoreThreads.py (1314 of 1977) PASS: lldb-shell :: ObjectFile/ELF/PT_LOAD-overlap.yaml (1315 of 1977) PASS: lldb-unit :: Symbol/./SymbolTests/TestTypeSystemClang.TestDisplayNameEmpty (1316 of 1977) PASS: lldb-api :: commands/expression/import-std-module/stack/TestStackFromStdModule.py (1317 of 1977) PASS: lldb-shell :: Watchpoint/SetErrorCases.test (1318 of 1977) PASS: lldb-api :: functionalities/breakpoint/breakpoint_ids/TestBreakpointIDs.py (1319 of 1977) PASS: lldb-unit :: Process/gdb-remote/./ProcessGdbRemoteTests/GDBRemoteCommunicationClientTest.ReadRegister (1320 of 1977) PASS: lldb-unit :: DataFormatter/./LLDBFormatterTests/FormatManagerTests.CompatibleLangs (1321 of 1977) PASS: lldb-unit :: Language/Highlighting/./HighlighterTests/HighlighterTest.ClangIdentifiers (1322 of 1977) PASS: lldb-unit :: Utility/./UtilityTests/UriParserTest.BadPort2 (1323 of 1977) PASS: lldb-unit :: Utility/./UtilityTests/ScalarTest.ComparisonFloat (1324 of 1977) PASS: lldb-unit :: Utility/./UtilityTests/VMRange.IsValid (1325 of 1977) PASS: lldb-unit :: Utility/./UtilityTests/AnsiTerminal.Empty (1326 of 1977) PASS: lldb-unit :: SymbolFile/DWARF/./SymbolFileDWARFTests/SymbolFileDWARFTests.TestAbbrevMissingTerminator (1327 of 1977) PASS: lldb-shell :: SymbolFile/DWARF/find-basic-variable.cpp (1328 of 1977) PASS: lldb-shell :: SymbolFile/DWARF/find-qualified-variable.cpp (1329 of 1977) PASS: lldb-unit :: Utility/./UtilityTests/ScalarTest.SetValueFromCString (1330 of 1977) PASS: lldb-api :: functionalities/thread/concurrent_events/TestConcurrentTwoBreakpointsOneDelaySignal.py (1331 of 1977) PASS: lldb-api :: functionalities/breakpoint/breakpoint_locations/TestBreakpointLocations.py (1332 of 1977) PASS: lldb-api :: commands/target/stop-hooks/TestStopHooks.py (1333 of 1977) PASS: lldb-unit :: Process/gdb-remote/./ProcessGdbRemoteTests/GDBRemoteClientBaseTest.SendContinueAndWait (1334 of 1977) PASS: lldb-shell :: SymbolFile/DWARF/dwarf5-debug_line.s (1335 of 1977) PASS: lldb-unit :: Symbol/./SymbolTests/LineEntryTest.GetSameLineContiguousAddressRangeNoInlines (1336 of 1977) PASS: lldb-unit :: Utility/./UtilityTests/StringExtractorTest.GetHexU8_Extra (1337 of 1977) PASS: lldb-api :: lang/cpp/virtual-overload/TestVirtualOverload.py (1338 of 1977) PASS: lldb-unit :: Utility/./UtilityTests/BinaryStreamTest.PutULEB128One (1339 of 1977) PASS: lldb-api :: lang/objc/modules-incomplete/TestIncompleteModules.py (1340 of 1977) PASS: lldb-api :: commands/watchpoints/watchpoint_commands/command/TestWatchpointCommandPython.py (1341 of 1977) PASS: lldb-unit :: Utility/./UtilityTests/Flags.AllSet (1342 of 1977) UNSUPPORTED: lldb-api :: tools/lldb-server/thread-name/TestGdbRemoteThreadName.py (1343 of 1977) PASS: lldb-api :: functionalities/breakpoint/consecutive_breakpoints/TestConsecutiveBreakpoints.py (1344 of 1977) PASS: lldb-shell :: Driver/TestSingleQuote.test (1345 of 1977) PASS: lldb-unit :: UnwindAssembly/x86/./UnwindAssemblyx86Tests/Testx86AssemblyInspectionEngine.TestPushRBPWithREX (1346 of 1977) PASS: lldb-api :: lang/objc/real-definition/TestRealDefinition.py (1347 of 1977) PASS: lldb-unit :: Utility/./UtilityTests/StreamTest.AddressPrefix (1348 of 1977) PASS: lldb-unit :: Utility/./UtilityTests/ConstStringTest.UpdateMangledCounterpart (1349 of 1977) PASS: lldb-api :: commands/expression/static-initializers/TestStaticInitializers.py (1350 of 1977) PASS: lldb-unit :: Utility/./UtilityTests/FileSpecTest.FileAndDirectoryComponents (1351 of 1977) PASS: lldb-unit :: SymbolFile/NativePDB/./SymbolFileNativePDBTests/PDBFPOProgramToDWARFExpressionTests.UnsupportedRASearch (1352 of 1977) PASS: lldb-shell :: Settings/TestStopCommandSourceOnError.test (1353 of 1977) PASS: lldb-api :: lang/cpp/call-function/TestCallCPPFunction.py (1354 of 1977) PASS: lldb-shell :: Driver/TestProcessAttach.test (1355 of 1977) PASS: lldb-shell :: Driver/TestCore.test (1356 of 1977) PASS: lldb-shell :: Commands/command-script-import.test (1357 of 1977) PASS: lldb-unit :: SymbolFile/DWARF/./SymbolFileDWARFTests/SymbolFileDWARFTests.TestAbbrevOrder1Start5 (1358 of 1977) PASS: lldb-api :: python_api/frame/get-variables/TestGetVariables.py (1359 of 1977) PASS: lldb-api :: commands/expression/call-throws/TestCallThatThrows.py (1360 of 1977) PASS: lldb-unit :: Symbol/./SymbolTests/TestClangASTImporter.MetadataPropagationIndirectImport (1361 of 1977) PASS: lldb-unit :: Utility/./UtilityTests/ArgsTest.AppendArguments (1362 of 1977) PASS: lldb-unit :: Utility/./UtilityTests/StreamTeeTest.Constructor2Streams (1363 of 1977) PASS: lldb-unit :: Utility/./UtilityTests/StringListTest.PopBack (1364 of 1977) PASS: lldb-shell :: Reproducer/TestMultipleTargets.test (1365 of 1977) PASS: lldb-unit :: Utility/./UtilityTests/FileSpecTest.EqualDotsPosix (1366 of 1977) PASS: lldb-unit :: Utility/./UtilityTests/RangeTest.DoesAdjoinOrIntersect (1367 of 1977) PASS: lldb-unit :: Process/minidump/./LLDBMinidumpTests/MinidumpParserTest.GetArchitectureWindows (1368 of 1977) PASS: lldb-unit :: SymbolFile/NativePDB/./SymbolFileNativePDBTests/PDBFPOProgramToDWARFExpressionTests.DependencyChain (1369 of 1977) PASS: lldb-api :: lang/c/function_types/TestFunctionTypes.py (1370 of 1977) PASS: lldb-api :: functionalities/thread/concurrent_events/TestConcurrentWatchBreakDelay.py (1371 of 1977) PASS: lldb-unit :: SymbolFile/NativePDB/./SymbolFileNativePDBTests/PDBFPOProgramToDWARFExpressionTests.MultipleDependentAssignments (1372 of 1977) PASS: lldb-unit :: Process/gdb-remote/./ProcessGdbRemoteTests/GDBRemoteCommunicationClientTest.GetQOffsets (1373 of 1977) PASS: lldb-unit :: Process/gdb-remote/./ProcessGdbRemoteTests/GDBRemoteCommunicationClientTest.SyncThreadState (1374 of 1977) PASS: lldb-api :: commands/expression/call-function/TestCallBuiltinFunction.py (1375 of 1977) PASS: lldb-unit :: Utility/./UtilityTests/CompletionRequest.DuplicateFiltering (1376 of 1977) PASS: lldb-api :: lang/objc/direct-dispatch-step/TestObjCDirectDispatchStepping.py (1377 of 1977) PASS: lldb-unit :: Utility/./UtilityTests/RangeDataVector.FindEntryThatContains_Overlap (1378 of 1977) PASS: lldb-shell :: ScriptInterpreter/None/none.test (1379 of 1977) PASS: lldb-unit :: Host/./HostTests/FileActionTest.Open (1380 of 1977) PASS: lldb-api :: commands/reproducer/invalid-args/TestInvalidArgsReproducer.py (1381 of 1977) PASS: lldb-unit :: Process/minidump/./LLDBMinidumpTests/MinidumpParserTest.GetThreadContext_x86_32_wow64 (1382 of 1977) PASS: lldb-unit :: Utility/./UtilityTests/UriParserTest.SchemeHostSeparator4 (1383 of 1977) PASS: lldb-shell :: ObjectFile/ELF/PT_LOAD-overlap-PT_INTERP.yaml (1384 of 1977) PASS: lldb-api :: commands/frame/recognizer/TestFrameRecognizer.py (1385 of 1977) PASS: lldb-shell :: SymbolFile/DWARF/debug_ranges_and_rnglists.test (1386 of 1977) UNSUPPORTED: lldb-api :: tools/lldb-server/TestGdbRemoteModuleInfo.py (1387 of 1977) PASS: lldb-unit :: Symbol/./SymbolTests/TestTypeSystemClang.TestRecordHasFields (1388 of 1977) PASS: lldb-api :: python_api/name_lookup/TestNameLookup.py (1389 of 1977) PASS: lldb-api :: functionalities/data-formatter/data-formatter-smart-array/TestDataFormatterSmartArray.py (1390 of 1977) PASS: lldb-api :: macosx/find-dsym/deep-bundle/TestDeepBundle.py (1391 of 1977) PASS: lldb-shell :: ObjectFile/PECOFF/basic-info-arm64.yaml (1392 of 1977) PASS: lldb-api :: functionalities/process_group/TestChangeProcessGroup.py (1393 of 1977) PASS: lldb-unit :: Utility/./UtilityTests/DataExtractorTest.PeekData (1394 of 1977) PASS: lldb-unit :: SymbolFile/NativePDB/./SymbolFileNativePDBTests/PDBFPOProgramToDWARFExpressionTests.UnknownOp (1395 of 1977) PASS: lldb-unit :: Utility/./UtilityTests/OptionsWithRawTest.ArgsButNoDelimiter (1396 of 1977) PASS: lldb-api :: lang/c/blocks/TestBlocks.py (1397 of 1977) PASS: lldb-unit :: Language/Highlighting/./HighlighterTests/HighlighterTest.ClangSquareBrackets (1398 of 1977) PASS: lldb-api :: functionalities/breakpoint/debugbreak/TestDebugBreak.py (1399 of 1977) PASS: lldb-api :: lang/cpp/incomplete-types/TestCppIncompleteTypes.py (1400 of 1977) PASS: lldb-api :: commands/expression/vector_of_enums/TestVectorOfEnums.py (1401 of 1977) PASS: lldb-unit :: Process/gdb-remote/./ProcessGdbRemoteTests/GDBRemoteCommunicationClientTest.SendGetMetaDataPacket (1402 of 1977) PASS: lldb-api :: commands/quit/TestQuit.py (1403 of 1977) PASS: lldb-unit :: Utility/./UtilityTests/BinaryStreamTest.PutSLEB128FiveBytes (1404 of 1977) PASS: lldb-unit :: Utility/./UtilityTests/StreamTeeTest.SetStreamAtIndexOutOfBounds (1405 of 1977) PASS: lldb-api :: commands/gui/invalid-args/TestInvalidArgsGui.py (1406 of 1977) PASS: lldb-shell :: Breakpoint/case-sensitive.test (1407 of 1977) PASS: lldb-api :: lang/cpp/nested-class-other-compilation-unit/TestNestedClassWithParentInAnotherCU.py (1408 of 1977) PASS: lldb-api :: lang/cpp/unique-types/TestUniqueTypes.py (1409 of 1977) PASS: lldb-api :: functionalities/data-formatter/data-formatter-stl/libcxx/initializerlist/TestInitializerList.py (1410 of 1977) PASS: lldb-unit :: Utility/./UtilityTests/DataExtractorTest.GetMaxU64_unchecked (1411 of 1977) PASS: lldb-unit :: Utility/./UtilityTests/StreamTest.PutMaxHex64ByteOrderLittle (1412 of 1977) PASS: lldb-shell :: Driver/TestTarget.test (1413 of 1977) PASS: lldb-api :: lang/cpp/namespace/TestNamespaceLookup.py (1414 of 1977) PASS: lldb-unit :: Utility/./UtilityTests/RangeTest.NotEqualInvalid (1415 of 1977) PASS: lldb-api :: functionalities/breakpoint/breakpoint_conditions/TestBreakpointConditions.py (1416 of 1977) PASS: lldb-unit :: Utility/./UtilityTests/UriParserTest.BracketedHostnameWithPortIPv4 (1417 of 1977) PASS: lldb-unit :: Host/./HostTests/FileSystemTest.OpenErrno (1418 of 1977) PASS: lldb-shell :: SymbolFile/NativePDB/break-by-function.cpp (1419 of 1977) PASS: lldb-api :: commands/expression/argument_passing_restrictions/TestArgumentPassingRestrictions.py (1420 of 1977) PASS: lldb-unit :: Utility/./UtilityTests/StringLexerTest.Next (1421 of 1977) PASS: lldb-unit :: Host/./HostTests/ConnectionFileDescriptorTest.TCPGetURIv4 (1422 of 1977) PASS: lldb-api :: commands/breakpoint/command/list/TestBreakpointCommandList.py (1423 of 1977) PASS: lldb-unit :: Utility/./UtilityTests/StreamTest.PutNHex8 (1424 of 1977) PASS: lldb-unit :: ObjectFile/ELF/./ObjectFileELFTests/ObjectFileELFTest.GetSymtab_NoSymEntryPointArmAddressClass (1425 of 1977) PASS: lldb-unit :: Process/gdb-remote/./ProcessGdbRemoteTests/GDBRemoteCommunicationClientTest.SendGetTraceConfigPacket (1426 of 1977) PASS: lldb-unit :: SymbolFile/NativePDB/./SymbolFileNativePDBTests/PDBFPOProgramToDWARFExpressionTests.UnresolvedDependentCyclicRegisterAssignmentReference (1427 of 1977) PASS: lldb-api :: lang/objc/objc-new-syntax/TestObjCNewSyntaxArray.py (1428 of 1977) PASS: lldb-unit :: Utility/./UtilityTests/RangeTest.Union (1429 of 1977) PASS: lldb-shell :: ObjectFile/ELF/short-build-id.yaml (1430 of 1977) PASS: lldb-shell :: Commands/CommandScriptImmediateOutput/CommandScriptImmediateOutputConsole.test (1431 of 1977) PASS: lldb-unit :: Language/Highlighting/./HighlighterTests/HighlighterTest.ClangComments (1432 of 1977) PASS: lldb-unit :: Symbol/./SymbolTests/TestClangASTImporter.RecordLayout (1433 of 1977) PASS: lldb-unit :: Utility/./UtilityTests/BinaryStreamTest.PutULEB128ThreeBytes (1434 of 1977) PASS: lldb-api :: functionalities/data-formatter/data-formatter-cpp/TestDataFormatterCpp.py (1435 of 1977) PASS: lldb-shell :: ObjectFile/ELF/build-id-case.yaml (1436 of 1977) PASS: lldb-unit :: ScriptInterpreter/Python/./ScriptInterpreterPythonTests/PythonDataObjectsTest.TestPythonListToStructuredList (1437 of 1977) PASS: lldb-shell :: SymbolFile/DWARF/find-basic-type.cpp (1438 of 1977) PASS: lldb-api :: functionalities/float-display/TestFloatDisplay.py (1439 of 1977) PASS: lldb-shell :: ObjectFile/PECOFF/export-dllfunc.yaml (1440 of 1977) PASS: lldb-shell :: Minidump/no-process-id.yaml (1441 of 1977) PASS: lldb-shell :: Reproducer/TestWorkingDir.test (1442 of 1977) PASS: lldb-shell :: Commands/command-disassemble-process.yaml (1443 of 1977) PASS: lldb-api :: python_api/watchpoint/TestWatchpointIter.py (1444 of 1977) PASS: lldb-unit :: Utility/./UtilityTests/LogTest.LLDB_LOG_nullptr (1445 of 1977) PASS: lldb-shell :: ObjectFile/Breakpad/breakpad-identification.test (1446 of 1977) PASS: lldb-shell :: SymbolFile/DWARF/debug_loc.s (1447 of 1977) PASS: lldb-unit :: Utility/./UtilityTests/StreamTest.ShiftOperatorStrings (1448 of 1977) PASS: lldb-unit :: Target/./TargetTests/PathMappingListTest.AbsoluteTests (1449 of 1977) PASS: lldb-shell :: Quit/TestQuitExitCode-30.test (1450 of 1977) PASS: lldb-unit :: Utility/./UtilityTests/UriParserTest.TypicalPortPathIPv4 (1451 of 1977) PASS: lldb-unit :: Expression/./ExpressionTests/CppModuleConfigurationTest.MissingLibCpp (1452 of 1977) PASS: lldb-unit :: Utility/./UtilityTests/StatusTest.Formatv (1453 of 1977) UNSUPPORTED: lldb-shell :: ScriptInterpreter/Lua/lua.test (1454 of 1977) PASS: lldb-shell :: SymbolFile/DWARF/dir-separator-posix.s (1455 of 1977) PASS: lldb-api :: tools/lldb-server/inferior-crash/TestGdbRemoteAbort.py (1456 of 1977) PASS: lldb-unit :: Host/./HostTests/ConnectionFileDescriptorTest.TCPGetURIv6 (1457 of 1977) UNSUPPORTED: lldb-api :: functionalities/thread/thread_specific_break_plus_condition/TestThreadSpecificBpPlusCondition.py (1458 of 1977) PASS: lldb-unit :: Utility/./UtilityTests/FileSpecTest.Match (1459 of 1977) PASS: lldb-unit :: Utility/./UtilityTests/SerializationRountripTest.SerializeDeserializeCStringArrayNullptrElem (1460 of 1977) PASS: lldb-api :: functionalities/data-formatter/ptr_ref_typedef/TestPtrRef2Typedef.py (1461 of 1977) PASS: lldb-api :: functionalities/dynamic_value_child_count/TestDynamicValueChildCount.py (1462 of 1977) PASS: lldb-unit :: Utility/./UtilityTests/ProcessInstanceInfo.DumpTable_invalidUID (1463 of 1977) PASS: lldb-api :: lang/c/stepping/TestStepAndBreakpoints.py (1464 of 1977) PASS: lldb-api :: functionalities/breakpoint/cpp/TestCPPBreakpointLocations.py (1465 of 1977) PASS: lldb-api :: commands/target/basic/TestTargetCommand.py (1466 of 1977) UNSUPPORTED: lldb-shell :: Register/aarch64-gp-read.test (1467 of 1977) PASS: lldb-api :: api/multiple-targets/TestMultipleTargets.py (1468 of 1977) PASS: lldb-api :: functionalities/inline-stepping/TestInlineStepping.py (1469 of 1977) PASS: lldb-api :: lang/objc/objc-ivar-stripped/TestObjCIvarStripped.py (1470 of 1977) PASS: lldb-unit :: Target/./TargetTests/ModuleCacheTest.GetAndPutStrangeHostname (1471 of 1977) PASS: lldb-unit :: Utility/./UtilityTests/ConstStringTest.MangledCounterpart (1472 of 1977) PASS: lldb-api :: commands/target/create-deps/TestTargetCreateDeps.py (1473 of 1977) PASS: lldb-api :: commands/watchpoints/watchpoint_on_vectors/TestValueOfVectorVariable.py (1474 of 1977) PASS: lldb-unit :: Utility/./UtilityTests/VASprintfTest.NoBufferResize (1475 of 1977) PASS: lldb-unit :: Utility/./UtilityTests/AnsiTerminal.Twice (1476 of 1977) PASS: lldb-unit :: ScriptInterpreter/Python/./ScriptInterpreterPythonTests/PythonDataObjectsTest.TestPythonTupleInitializerList2 (1477 of 1977) PASS: lldb-unit :: Language/Highlighting/./HighlighterTests/HighlighterTest.DefaultHighlighterWithCursorOutOfBounds (1478 of 1977) UNSUPPORTED: lldb-shell :: Register/x86-64-ymm16-write.test (1479 of 1977) PASS: lldb-api :: python_api/interpreter/TestRunCommandInterpreterAPI.py (1480 of 1977) PASS: lldb-unit :: Utility/./UtilityTests/RangeTest.LessThanInvalid (1481 of 1977) PASS: lldb-unit :: SymbolFile/NativePDB/./SymbolFileNativePDBTests/PDBFPOProgramToDWARFExpressionTests.InvalidAssignmentMultiple (1482 of 1977) PASS: lldb-shell :: ScriptInterpreter/Python/crashlog.test (1483 of 1977) PASS: lldb-unit :: Host/./HostTests/ProcessLaunchInfoTest.Constructor (1484 of 1977) PASS: lldb-unit :: Process/minidump/./LLDBMinidumpTests/MinidumpParserTest.GetThreadsAndGetThreadContext (1485 of 1977) PASS: lldb-api :: commands/expression/import-std-module/list-dbg-info-content/TestDbgInfoContentListFromStdModule.py (1486 of 1977) PASS: lldb-api :: functionalities/data-formatter/data-formatter-disabling/TestDataFormatterDisabling.py (1487 of 1977) PASS: lldb-api :: commands/disassemble/basic/TestFrameDisassemble.py (1488 of 1977) PASS: lldb-api :: python_api/watchpoint/condition/TestWatchpointConditionAPI.py (1489 of 1977) PASS: lldb-api :: tools/lldb-vscode/step/TestVSCode_step.py (1490 of 1977) PASS: lldb-unit :: Language/Highlighting/./HighlighterTests/HighlighterTest.ClangCursorPos (1491 of 1977) PASS: lldb-unit :: Language/Highlighting/./HighlighterTests/HighlighterTest.ClangTrailingBackslashWithWhitespace (1492 of 1977) PASS: lldb-unit :: Host/./HostTests/Host.GetEnvironment (1493 of 1977) PASS: lldb-unit :: Utility/./UtilityTests/ListenerTest.GetEventImmediate (1494 of 1977) PASS: lldb-unit :: Host/./HostTests/SocketTest.TCPListen0ConnectAccept (1495 of 1977) PASS: lldb-unit :: Utility/./UtilityTests/UriParserTest.MinimalPortPath (1496 of 1977) UNSUPPORTED: lldb-shell :: SymbolFile/PDB/ast-restore.test (1497 of 1977) PASS: lldb-unit :: Host/./HostTests/HostInfoTest.GetAugmentedArchSpec (1498 of 1977) PASS: lldb-unit :: Utility/./UtilityTests/RecordReplayTest.InstrumentedFooSameThis (1499 of 1977) PASS: lldb-api :: lang/cpp/extern_c/TestExternCSymbols.py (1500 of 1977) PASS: lldb-unit :: Process/gdb-remote/./ProcessGdbRemoteTests/GDBRemoteCommunicationClientTest.SendSignalsToIgnore (1501 of 1977) PASS: lldb-unit :: Utility/./UtilityTests/UriParserTest.MinimalPath (1502 of 1977) PASS: lldb-api :: functionalities/data-formatter/data-formatter-objc/TestDataFormatterObjCNSBundle.py (1503 of 1977) PASS: lldb-shell :: ObjectFile/PECOFF/sections.yaml (1504 of 1977) PASS: lldb-unit :: UnwindAssembly/x86/./UnwindAssemblyx86Tests/Testx86AssemblyInspectionEngine.TestPushESI (1505 of 1977) PASS: lldb-api :: commands/expression/deleting-implicit-copy-constructor/TestDeletingImplicitCopyConstructor.py (1506 of 1977) UNSUPPORTED: lldb-shell :: SymbolFile/dissassemble-entry-point.s (1507 of 1977) PASS: lldb-api :: functionalities/data-formatter/data-formatter-stl/libcxx/multimap/TestDataFormatterLibccMultiMap.py (1508 of 1977) PASS: lldb-api :: functionalities/signal/handle-abrt/TestHandleAbort.py (1509 of 1977) PASS: lldb-unit :: Symbol/./SymbolTests/TestTypeSystemClang.TestGetEnumIntegerTypeBasicTypes (1510 of 1977) PASS: lldb-unit :: Utility/./UtilityTests/ArgsTest.EscapeLLDBCommandArgument (1511 of 1977) PASS: lldb-unit :: Utility/./UtilityTests/CompletionRequest.Constructor (1512 of 1977) PASS: lldb-api :: functionalities/data-formatter/data-formatter-stl/libcxx/queue/TestDataFormatterLibcxxQueue.py (1513 of 1977) PASS: lldb-api :: python_api/findvalue_duplist/TestSBFrameFindValue.py (1514 of 1977) PASS: lldb-unit :: Interpreter/./InterpreterTests/CompletionTest.DirCompletionUsername (1515 of 1977) PASS: lldb-unit :: Utility/./UtilityTests/SerializationRountripTest.SerializeDeserializeObjectPointer (1516 of 1977) UNSUPPORTED: lldb-api :: lang/objc/bitfield_ivars/TestBitfieldIvars.py (1517 of 1977) PASS: lldb-api :: commands/expression/import-std-module/vector-bool/TestVectorBoolFromStdModule.py (1518 of 1977) PASS: lldb-unit :: Symbol/./SymbolTests/TestTypeSystemClang.TestFunctionTemplateInRecordConstruction (1519 of 1977) PASS: lldb-unit :: UnwindAssembly/x86/./UnwindAssemblyx86Tests/Testx86AssemblyInspectionEngine.TestPush0 (1520 of 1977) PASS: lldb-unit :: Symbol/./SymbolTests/TestTypeSystemClang.TestFunctionTemplateConstruction (1521 of 1977) PASS: lldb-unit :: Symbol/./SymbolTests/DWARFCallFrameInfoTest.Basic_dwarf4 (1522 of 1977) PASS: lldb-unit :: Utility/./UtilityTests/RangeTest.ContainsRange (1523 of 1977) PASS: lldb-unit :: Platform/./LLDBPlatformTests/PlatformDarwinTest.FindXcodeContentsDirectoryInPath (1524 of 1977) PASS: lldb-api :: functionalities/data-formatter/parray/TestPrintArray.py (1525 of 1977) PASS: lldb-unit :: Language/Highlighting/./HighlighterTests/HighlighterTest.ClangEmptyInput (1526 of 1977) PASS: lldb-unit :: Target/./TargetTests/PathMappingListTest.RelativeTests (1527 of 1977) UNSUPPORTED: lldb-api :: functionalities/exec/TestExec.py (1528 of 1977) PASS: lldb-unit :: Core/./LLDBCoreTests/MangledTest.ResultForValidName (1529 of 1977) PASS: lldb-unit :: Utility/./UtilityTests/StringListTest.Join (1530 of 1977) PASS: lldb-unit :: Utility/./UtilityTests/StringExtractorTest.GetNameColonValueContainsColon (1531 of 1977) PASS: lldb-unit :: UnwindAssembly/x86/./UnwindAssemblyx86Tests/Testx86AssemblyInspectionEngine.TestStackRealignMSVC_i386 (1532 of 1977) PASS: lldb-shell :: Breakpoint/debug_rnglist_basic.test (1533 of 1977) PASS: lldb-unit :: Utility/./UtilityTests/StructuredDataTest.ParseJSONFromFile (1534 of 1977) PASS: lldb-shell :: ObjectFile/ELF/many-sections.s (1535 of 1977) PASS: lldb-api :: functionalities/inferior-assert/TestInferiorAssert.py (1536 of 1977) PASS: lldb-unit :: Utility/./UtilityTests/StreamTest.AddressEmptyPrefix (1537 of 1977) PASS: lldb-api :: python_api/process/TestProcessAPI.py (1538 of 1977) PASS: lldb-unit :: Utility/./UtilityTests/ArgsTest.ReplaceArgumentAtIndexEqual (1539 of 1977) PASS: lldb-api :: functionalities/lazy-loading/TestLazyLoading.py (1540 of 1977) PASS: lldb-api :: functionalities/thread/concurrent_events/TestConcurrentDelaySignalWatch.py (1541 of 1977) UNSUPPORTED: lldb-shell :: ScriptInterpreter/Lua/nested_sessions.test (1542 of 1977) PASS: lldb-unit :: Symbol/./SymbolTests/TestTypeSystemClang.TestGetBasicTypeFromName (1543 of 1977) PASS: lldb-unit :: Utility/./UtilityTests/Flags.GetBitSize (1544 of 1977) PASS: lldb-unit :: Utility/./UtilityTests/StreamTest.AddressNoSuffix (1545 of 1977) PASS: lldb-unit :: Utility/./UtilityTests/StringListTest.CopyList (1546 of 1977) PASS: lldb-api :: commands/expression/import_builtin_fileid/TestImportBuiltinFileID.py (1547 of 1977) PASS: lldb-unit :: Utility/./UtilityTests/FileSpecTest.PrependPathComponent (1548 of 1977) PASS: lldb-api :: functionalities/step-avoids-no-debug/TestStepNoDebug.py (1549 of 1977) UNSUPPORTED: lldb-shell :: Register/aarch64-fp-read.test (1550 of 1977) PASS: lldb-unit :: Utility/./UtilityTests/FileSpecTest.EqualSeparator (1551 of 1977) PASS: lldb-unit :: Language/Highlighting/./HighlighterTests/HighlighterTest.HighlighterSelectionType (1552 of 1977) PASS: lldb-api :: lang/objc/hidden-ivars/TestHiddenIvars.py (1553 of 1977) PASS: lldb-unit :: Symbol/./SymbolTests/TestTypeSystemClang.TestGetEnumIntegerTypeInvalid (1554 of 1977) PASS: lldb-api :: commands/frame/diagnose/dereference-this/TestDiagnoseDereferenceThis.py (1555 of 1977) PASS: lldb-api :: functionalities/breakpoint/serialize/TestBreakpointSerialization.py (1556 of 1977) PASS: lldb-unit :: Utility/./UtilityTests/VASprintfTest.EncodingError (1557 of 1977) PASS: lldb-api :: functionalities/data-formatter/data-formatter-stl/libstdcpp/unique_ptr/invalid/TestDataFormatterInvalidStdUniquePtr.py (1558 of 1977) PASS: lldb-unit :: Symbol/./SymbolTests/TestTypeSystemClang.TestIsClangType (1559 of 1977) PASS: lldb-shell :: Breakpoint/split-dwarf-5-addrbase.test (1560 of 1977) PASS: lldb-api :: functionalities/data-formatter/frameformat_smallstruct/TestFrameFormatSmallStruct.py (1561 of 1977) PASS: lldb-unit :: Process/minidump/./LLDBMinidumpTests/MinidumpParserTest.GetLinuxProcStatus_no_stream (1562 of 1977) PASS: lldb-shell :: SymbolFile/DWARF/find-variable-dwo.cpp (1563 of 1977) PASS: lldb-api :: functionalities/stats_api/TestStatisticsAPI.py (1564 of 1977) PASS: lldb-unit :: Utility/./UtilityTests/BinaryStreamTest.PutULEB128MaxValue (1565 of 1977) PASS: lldb-unit :: Utility/./UtilityTests/UUIDTest.Validity (1566 of 1977) PASS: lldb-api :: commands/settings/quoting/TestQuoting.py (1567 of 1977) PASS: lldb-api :: python_api/section/TestSectionAPI.py (1568 of 1977) PASS: lldb-unit :: Host/./HostTests/File.GetWaitableHandleFileno (1569 of 1977) PASS: lldb-shell :: Reproducer/Modules/TestModuleCXX.test (1570 of 1977) PASS: lldb-shell :: Driver/TestRepl.test (1571 of 1977) PASS: lldb-shell :: Register/x86-64-read.test (1572 of 1977) PASS: lldb-unit :: Utility/./UtilityTests/OptionsWithRawTest.EmptyArgsOnlySuffix (1573 of 1977) PASS: lldb-shell :: Heap/heap-cstr.test (1574 of 1977) UNSUPPORTED: lldb-shell :: SymbolFile/PDB/typedefs.test (1575 of 1977) PASS: lldb-unit :: SymbolFile/NativePDB/./SymbolFileNativePDBTests/PDBFPOProgramToDWARFExpressionTests.SingleAssignmentRegisterRef (1576 of 1977) PASS: lldb-shell :: Breakpoint/split-dwarf5-debug-stroffsets.test (1577 of 1977) PASS: lldb-unit :: Utility/./UtilityTests/UriParserTest.BadPort (1578 of 1977) PASS: lldb-api :: functionalities/postmortem/mach-core/TestMachCore.py (1579 of 1977) PASS: lldb-unit :: Utility/./UtilityTests/StreamTest.PutBytesAsRawHex8ToMixedEndian (1580 of 1977) PASS: lldb-shell :: Settings/TestFrameFormatColor.test (1581 of 1977) PASS: lldb-api :: functionalities/data-formatter/data-formatter-stl/libcxx/optional/TestDataFormatterLibcxxOptional.py (1582 of 1977) PASS: lldb-api :: python_api/lldbutil/iter/TestRegistersIterator.py (1583 of 1977) PASS: lldb-unit :: Expression/./ExpressionTests/CppModuleConfigurationTest.MissingUsrInclude (1584 of 1977) PASS: lldb-api :: lang/objc/radar-9691614/TestObjCMethodReturningBOOL.py (1585 of 1977) PASS: lldb-api :: functionalities/gdb_remote_client/TestThreadSelectionBug.py (1586 of 1977) PASS: lldb-shell :: ObjectFile/ELF/netbsd-exec-8.99.30-amd64.yaml (1587 of 1977) PASS: lldb-unit :: Utility/./UtilityTests/ArgsTest.ReplaceArgumentAtIndexShort (1588 of 1977) UNSUPPORTED: lldb-api :: benchmarks/libcxxmap/TestBenchmarkLibcxxMap.py (1589 of 1977) PASS: lldb-unit :: Host/./HostTests/FileSystemTest.FileAndDirectoryComponents (1590 of 1977) PASS: lldb-unit :: Utility/./UtilityTests/StreamTest.PutRawBytesToLittleEndian (1591 of 1977) PASS: lldb-unit :: Utility/./UtilityTests/OptionsWithRawTest.QuotedSuffix (1592 of 1977) UNSUPPORTED: lldb-shell :: SymbolFile/PDB/func-symbols.test (1593 of 1977) PASS: lldb-unit :: Utility/./UtilityTests/BinaryStreamTest.PutULEB128SevenBytes (1594 of 1977) PASS: lldb-api :: commands/expression/rdar42038760/TestScalarURem.py (1595 of 1977) PASS: lldb-unit :: Utility/./UtilityTests/StringExtractorTest.GetHexU8_Underflow_NoEof (1596 of 1977) PASS: lldb-api :: lang/cpp/char8_t/TestCxxChar8_t.py (1597 of 1977) PASS: lldb-unit :: Symbol/./SymbolTests/LineEntryTest.GetSameLineContiguousAddressRangeNestedInline (1598 of 1977) PASS: lldb-api :: tools/lldb-vscode/stackTrace/TestVSCode_stackTrace.py (1599 of 1977) PASS: lldb-unit :: Utility/./UtilityTests/UriParserTest.BracketedHostnameWithColon (1600 of 1977) PASS: lldb-unit :: Process/minidump/./LLDBMinidumpTests/MinidumpParserTest.GetPid (1601 of 1977) PASS: lldb-unit :: Expression/./ExpressionTests/CppModuleConfigurationTest.LinuxLocalLibCpp (1602 of 1977) PASS: lldb-api :: functionalities/data-formatter/data-formatter-stl/libcxx/string/TestDataFormatterLibcxxString.py (1603 of 1977) PASS: lldb-shell :: ObjectFile/ELF/section-addresses.yaml (1604 of 1977) PASS: lldb-unit :: ObjectFile/Breakpad/./ObjectFileBreakpadTests/StackCFIRecord.parse (1605 of 1977) PASS: lldb-api :: lang/cpp/member-and-local-vars-with-same-name/TestMembersAndLocalsWithSameName.py (1606 of 1977) PASS: lldb-api :: functionalities/data-formatter/data-formatter-objc/cmtime/TestDataFormatterCMTime.py (1607 of 1977) PASS: lldb-api :: lang/objc/unicode-string/TestUnicodeString.py (1608 of 1977) PASS: lldb-shell :: SymbolFile/DWARF/dwp-debug-types.s (1609 of 1977) PASS: lldb-unit :: Utility/./UtilityTests/StringListTest.JoinMultiCharSeparator (1610 of 1977) UNSUPPORTED: lldb-api :: linux/sepdebugsymlink/TestTargetSymbolsSepDebugSymlink.py (1611 of 1977) UNSUPPORTED: lldb-api :: commands/expression/completion-crash-invalid-iterator/TestInvalidIteratorCompletionCrash.py (1612 of 1977) PASS: lldb-api :: lang/cpp/template-function/TestTemplateFunctions.py (1613 of 1977) PASS: lldb-unit :: UnwindAssembly/x86/./UnwindAssemblyx86Tests/Testx86AssemblyInspectionEngine.Test64bitFramelessBigStackFrame (1614 of 1977) PASS: lldb-api :: commands/expression/completion-in-lambda-and-unnamed-class/TestCompletionInLambdaAndUnnamedClass.py (1615 of 1977) PASS: lldb-api :: functionalities/breakpoint/breakpoint_ignore_count/TestBreakpointIgnoreCount.py (1616 of 1977) PASS: lldb-api :: functionalities/deleted-executable/TestDeletedExecutable.py (1617 of 1977) PASS: lldb-shell :: Breakpoint/implicit_const_form_support.test (1618 of 1977) PASS: lldb-unit :: Utility/./UtilityTests/BinaryStreamTest.PutSLEB128NineBytes (1619 of 1977) PASS: lldb-api :: functionalities/thread/concurrent_events/TestConcurrentTwoBreakpointThreads.py (1620 of 1977) PASS: lldb-unit :: Utility/./UtilityTests/StringExtractorTest.GetHexBytes_OddPair (1621 of 1977) PASS: lldb-api :: types/TestCharType.py (1622 of 1977) PASS: lldb-api :: functionalities/data-formatter/data-formatter-skip-summary/TestDataFormatterSkipSummary.py (1623 of 1977) PASS: lldb-api :: python_api/module_section/TestModuleAndSection.py (1624 of 1977) PASS: lldb-api :: functionalities/thread/step_until/TestStepUntil.py (1625 of 1977) PASS: lldb-api :: functionalities/completion/TestCompletion.py (1626 of 1977) PASS: lldb-shell :: Breakpoint/jitbp_elf.test (1627 of 1977) PASS: lldb-unit :: Utility/./UtilityTests/StringListTest.AppendListCStringArrayEmpty (1628 of 1977) PASS: lldb-api :: python_api/lldbutil/TestSwigVersion.py (1629 of 1977) PASS: lldb-unit :: Utility/./UtilityTests/RangeTest.ContainsAddrInvalid (1630 of 1977) PASS: lldb-api :: macosx/indirect_symbol/TestIndirectSymbols.py (1631 of 1977) PASS: lldb-api :: commands/expression/call-function/TestCallUserDefinedFunction.py (1632 of 1977) PASS: lldb-api :: sanity/TestModuleCacheSanity.py (1633 of 1977) PASS: lldb-api :: commands/command/history/TestCommandHistory.py (1634 of 1977) PASS: lldb-unit :: Utility/./UtilityTests/FileSpecTest.IsRelative (1635 of 1977) UNSUPPORTED: lldb-shell :: Register/x86-64-xmm16-read.test (1636 of 1977) PASS: lldb-unit :: Utility/./UtilityTests/CompletionRequest.ShiftArguments (1637 of 1977) PASS: lldb-unit :: Utility/./UtilityTests/BinaryStreamTest.PutULEB128TwoBytes (1638 of 1977) PASS: lldb-unit :: Utility/./UtilityTests/LogChannelTest.Enable (1639 of 1977) PASS: lldb-unit :: Utility/./UtilityTests/StreamTeeTest.Flush (1640 of 1977) PASS: lldb-unit :: Utility/./UtilityTests/CompletionRequest.TryCompleteCurrentArgBad (1641 of 1977) PASS: lldb-unit :: Utility/./UtilityTests/StringListTest.ShiftMove (1642 of 1977) UNSUPPORTED: lldb-api :: functionalities/unwind/standard/TestStandardUnwind.py (1643 of 1977) PASS: lldb-unit :: Utility/./UtilityTests/RegularExpression.Valid (1644 of 1977) PASS: lldb-unit :: Host/./HostTests/FileSystemTest.Resolve (1645 of 1977) PASS: lldb-unit :: UnwindAssembly/x86/./UnwindAssemblyx86Tests/Testx86AssemblyInspectionEngine.TestPopRBX (1646 of 1977) PASS: lldb-api :: commands/expression/diagnostics/TestExprDiagnostics.py (1647 of 1977) PASS: lldb-unit :: UnwindAssembly/x86/./UnwindAssemblyx86Tests/Testx86AssemblyInspectionEngine.TestSubRSP (1648 of 1977) PASS: lldb-unit :: Utility/./UtilityTests/ArgsTest.StringListConstructor (1649 of 1977) PASS: lldb-api :: lang/c/modules/TestCModules.py (1650 of 1977) PASS: lldb-api :: functionalities/thread/concurrent_events/TestConcurrentWatchpointDelayWatchpointOneBreakpoint.py (1651 of 1977) PASS: lldb-api :: functionalities/data-formatter/type_summary_list_script/TestTypeSummaryListScript.py (1652 of 1977) PASS: lldb-unit :: ObjectFile/Breakpad/./ObjectFileBreakpadTests/FuncRecord.parse (1653 of 1977) PASS: lldb-api :: commands/command/script/import/TestImport.py (1654 of 1977) PASS: lldb-unit :: Process/minidump/./LLDBMinidumpTests/MinidumpParserTest.GetArchitecture (1655 of 1977) PASS: lldb-unit :: Language/Highlighting/./HighlighterTests/HighlighterTest.ClangOperators (1656 of 1977) PASS: lldb-unit :: Utility/./UtilityTests/DataExtractorTest.GetMaxU64 (1657 of 1977) PASS: lldb-unit :: Utility/./UtilityTests/RangeTest.SetRangeBase (1658 of 1977) PASS: lldb-unit :: Utility/./UtilityTests/UriParserTest.Minimal (1659 of 1977) PASS: lldb-unit :: Expression/./ExpressionTests/CppModuleConfigurationTest.Sysroot (1660 of 1977) PASS: lldb-shell :: SymbolFile/Breakpad/symtab.test (1661 of 1977) PASS: lldb-api :: commands/expression/inline-namespace/TestInlineNamespace.py (1662 of 1977) PASS: lldb-shell :: Minidump/fb-dump.test (1663 of 1977) PASS: lldb-api :: commands/expression/entry-bp/TestExprEntryBP.py (1664 of 1977) PASS: lldb-unit :: Process/minidump/./LLDBMinidumpTests/MinidumpParserTest.GetMiscInfo_no_stream (1665 of 1977) PASS: lldb-unit :: Utility/./UtilityTests/OptionsWithRawTest.LeadingSpaceArgs (1666 of 1977) PASS: lldb-api :: functionalities/breakpoint/source_regexp/TestSourceRegexBreakpoints.py (1667 of 1977) PASS: lldb-unit :: Utility/./UtilityTests/Predicate.WaitForValueEqualTo (1668 of 1977) XFAIL: lldb-shell :: Register/x86-64-write.test (1669 of 1977) PASS: lldb-api :: functionalities/thread/exit_during_break/TestExitDuringBreak.py (1670 of 1977) PASS: lldb-shell :: Expr/TestMultilineExpr.test (1671 of 1977) PASS: lldb-api :: functionalities/thread/concurrent_events/TestConcurrentBreakpointDelayBreakpointOneSignal.py (1672 of 1977) UNSUPPORTED: lldb-api :: lang/cpp/printf/TestPrintf.py (1673 of 1977) XFAIL: lldb-shell :: Register/x86-mm-xmm-write.test (1674 of 1977) PASS: lldb-unit :: Utility/./UtilityTests/StreamTest.AddressPrefixAndSuffix (1675 of 1977) PASS: lldb-api :: api/check_public_api_headers/TestPublicAPIHeaders.py (1676 of 1977) PASS: lldb-unit :: Utility/./UtilityTests/RegularExpression.Invalid (1677 of 1977) UNSUPPORTED: lldb-api :: functionalities/darwin_log/filter/exact_match/activity/TestDarwinLogFilterMatchActivity.py (1678 of 1977) PASS: lldb-unit :: Utility/./UtilityTests/ScalarTest.ExtractBitfield (1679 of 1977) PASS: lldb-unit :: Language/Highlighting/./HighlighterTests/HighlighterTest.ClangStringLiterals (1680 of 1977) PASS: lldb-api :: commands/command/nested_alias/TestNestedAlias.py (1681 of 1977) PASS: lldb-unit :: Utility/./UtilityTests/Flags.Test (1682 of 1977) PASS: lldb-unit :: Platform/./LLDBPlatformTests/PlatformDarwinTest.GetSDKNameForType (1683 of 1977) PASS: lldb-unit :: Utility/./UtilityTests/ConstStringTest.CompareConstString (1684 of 1977) PASS: lldb-unit :: UnwindAssembly/x86/./UnwindAssemblyx86Tests/Testx86AssemblyInspectionEngine.TestPopEBX (1685 of 1977) PASS: lldb-api :: commands/expression/weak_symbols/TestWeakSymbols.py (1686 of 1977) PASS: lldb-shell :: ObjectFile/Breakpad/discontiguous-sections.test (1687 of 1977) PASS: lldb-unit :: Utility/./UtilityTests/BinaryStreamTest.PutSLEB128SevenBytes (1688 of 1977) PASS: lldb-api :: functionalities/gdb_remote_client/TestqOffsets.py (1689 of 1977) PASS: lldb-api :: functionalities/data-formatter/poarray/TestPrintObjectArray.py (1690 of 1977) PASS: lldb-unit :: ScriptInterpreter/Python/./ScriptInterpreterPythonTests/PythonDataObjectsTest.TestPythonStringToStructuredString (1691 of 1977) PASS: lldb-api :: functionalities/data-formatter/data-formatter-enum-format/TestDataFormatterEnumFormat.py (1692 of 1977) PASS: lldb-shell :: SymbolFile/DWARF/clang-ast-from-dwarf-objc-property.m (1693 of 1977) PASS: lldb-api :: lang/cpp/class_types/TestClassTypesDisassembly.py (1694 of 1977) PASS: lldb-api :: python_api/function_symbol/TestSymbolAPI.py (1695 of 1977) PASS: lldb-unit :: Host/./HostTests/MainLoopTest.Signal (1696 of 1977) PASS: lldb-api :: macosx/dyld-trie-symbols/TestDyldTrieSymbols.py (1697 of 1977) PASS: lldb-api :: functionalities/data-formatter/data-formatter-objc/TestDataFormatterObjCNSData.py (1698 of 1977) PASS: lldb-shell :: SymbolFile/DWARF/split-dwarf-multiple-cu.ll (1699 of 1977) PASS: lldb-unit :: Target/./TargetTests/ExecutionContextTest.GetByteOrderTarget (1700 of 1977) PASS: lldb-api :: lang/cpp/frame-var-anon-unions/TestFrameVariableAnonymousUnions.py (1701 of 1977) PASS: lldb-unit :: Symbol/./SymbolTests/Type.CompilerContextPattern (1702 of 1977) PASS: lldb-api :: commands/watchpoints/watchpoint_commands/condition/TestWatchpointConditionCmd.py (1703 of 1977) PASS: lldb-api :: commands/watchpoints/watchpoint_commands/command/TestWatchpointCommandLLDB.py (1704 of 1977) PASS: lldb-api :: lang/cpp/class_types/TestClassTypes.py (1705 of 1977) PASS: lldb-api :: tools/lldb-vscode/launch/TestVSCode_launch.py (1706 of 1977) PASS: lldb-shell :: SymbolFile/DWARF/find-function-regex.cpp (1707 of 1977) PASS: lldb-api :: python_api/watchpoint/watchlocation/TestTargetWatchAddress.py (1708 of 1977) PASS: lldb-unit :: Symbol/./SymbolTests/TestClangASTImporter.CopyDeclTagDecl (1709 of 1977) PASS: lldb-shell :: SymbolFile/DWARF/deterministic-build.cpp (1710 of 1977) PASS: lldb-shell :: BuildScript/script-args.test (1711 of 1977) PASS: lldb-unit :: ObjectFile/Breakpad/./ObjectFileBreakpadTests/InfoRecord.parse (1712 of 1977) PASS: lldb-api :: commands/expression/function_template_specialization_temp_args/TestFunctionTemplateSpecializationTempArgs.py (1713 of 1977) PASS: lldb-unit :: Utility/./UtilityTests/StringListTest.GetMaxStringLengthEqualSize (1714 of 1977) PASS: lldb-unit :: UnwindAssembly/x86/./UnwindAssemblyx86Tests/Testx86AssemblyInspectionEngine.TestPushECX (1715 of 1977) PASS: lldb-shell :: Reproducer/Functionalities/TestImageList.test (1716 of 1977) PASS: lldb-unit :: Utility/./UtilityTests/StringLexerTest.AdvanceIf (1717 of 1977) PASS: lldb-unit :: ObjectFile/Breakpad/./ObjectFileBreakpadTests/StackWinRecord.parse (1718 of 1977) PASS: lldb-api :: functionalities/thread/crash_during_step/TestCrashDuringStep.py (1719 of 1977) PASS: lldb-shell :: Reproducer/Functionalities/TestStepping.test (1720 of 1977) PASS: lldb-unit :: Utility/./UtilityTests/StringExtractorTest.GetU64BigEndian (1721 of 1977) PASS: lldb-unit :: ScriptInterpreter/Python/./ScriptInterpreterPythonTests/PythonDataObjectsTest.TestOwnedReferences (1722 of 1977) PASS: lldb-unit :: Utility/./UtilityTests/StringListTest.SplitIntoLinesEmpty (1723 of 1977) PASS: lldb-api :: functionalities/thread/concurrent_events/TestConcurrentDelayWatchBreak.py (1724 of 1977) PASS: lldb-shell :: SymbolFile/DWARF/clang-ast-from-dwarf-unamed-and-anon-structs.cpp (1725 of 1977) PASS: lldb-api :: lang/c/step-target/TestStepTarget.py (1726 of 1977) PASS: lldb-api :: commands/settings/TestSettings.py (1727 of 1977) PASS: lldb-unit :: Utility/./UtilityTests/AnsiTerminal.KnownPrefix (1728 of 1977) PASS: lldb-shell :: SymbolFile/Breakpad/line-table-discontinuous-file-ids.test (1729 of 1977) PASS: lldb-shell :: SymbolFile/Breakpad/line-table.test (1730 of 1977) PASS: lldb-unit :: Symbol/./SymbolTests/TestTypeSystemClang.TestUnifyAccessSpecifiers (1731 of 1977) PASS: lldb-api :: lang/objc/forward-decl/TestForwardDecl.py (1732 of 1977) PASS: lldb-unit :: Language/CPlusPlus/./LanguageCPlusPlusTests/CPlusPlusLanguage.CPlusPlusNameParser (1733 of 1977) UNSUPPORTED: lldb-shell :: SymbolFile/NativePDB/stack_unwinding01.cpp (1734 of 1977) PASS: lldb-api :: lang/objc/rdar-10967107/TestRdar10967107.py (1735 of 1977) PASS: lldb-unit :: Process/minidump/./LLDBMinidumpTests/MinidumpParserTest.GetMiscInfoWindows (1736 of 1977) PASS: lldb-shell :: ObjectFile/ELF/section-permissions.yaml (1737 of 1977) PASS: lldb-unit :: Utility/./UtilityTests/OptionsWithRawTest.ArgsButNoLeadingDash (1738 of 1977) PASS: lldb-api :: commands/expression/persist_objc_pointeetype/TestPersistObjCPointeeType.py (1739 of 1977) PASS: lldb-unit :: Utility/./UtilityTests/NameMatchesTest.Equals (1740 of 1977) PASS: lldb-api :: lang/mixed/TestMixedLanguages.py (1741 of 1977) PASS: lldb-shell :: SymbolFile/DWARF/compilercontext.ll (1742 of 1977) PASS: lldb-api :: functionalities/tail_call_frames/cross_dso/TestCrossDSOTailCalls.py (1743 of 1977) PASS: lldb-api :: lang/objc/foundation/TestObjCMethods.py (1744 of 1977) PASS: lldb-api :: commands/expression/test/TestExprs2.py (1745 of 1977) UNSUPPORTED: lldb-shell :: Unwind/unwind-plan-dwarf-dump.test (1746 of 1977) PASS: lldb-unit :: Utility/./UtilityTests/StreamTest.AddressRangeEmptyRange (1747 of 1977) PASS: lldb-api :: functionalities/tail_call_frames/disambiguate_paths_to_common_sink/TestDisambiguatePathsToCommonSink.py (1748 of 1977) PASS: lldb-api :: functionalities/gdb_remote_client/TestTargetXMLArch.py (1749 of 1977) PASS: lldb-shell :: SymbolFile/DWARF/find-method.cpp (1750 of 1977) PASS: lldb-shell :: ObjectFile/PECOFF/section-types.yaml (1751 of 1977) PASS: lldb-api :: commands/expression/import-std-module/deque-basic/TestDequeFromStdModule.py (1752 of 1977) PASS: lldb-unit :: Utility/./UtilityTests/ProcessInstanceInfo.Yaml (1753 of 1977) PASS: lldb-unit :: Utility/./UtilityTests/Flags.IsClear (1754 of 1977) PASS: lldb-unit :: Process/minidump/./LLDBMinidumpTests/MinidumpParserTest.GetPidWow64 (1755 of 1977) PASS: lldb-api :: lang/cpp/symbols/TestSymbols.py (1756 of 1977) PASS: lldb-unit :: Process/gdb-remote/./ProcessGdbRemoteTests/GDBRemoteCommunicationClientTest.WriteRegisterNoSuffix (1757 of 1977) PASS: lldb-shell :: SymbolFile/DWARF/forward-declarations.s (1758 of 1977) PASS: lldb-unit :: tools/lldb-server/tests/./LLDBServerTests/TestBase.DebugserverEnv (1759 of 1977) PASS: lldb-shell :: SymbolFile/NativePDB/tag-types.cpp (1760 of 1977) PASS: lldb-unit :: Expression/./ExpressionTests/DiagnosticManagerTest.PutStringSeverities (1761 of 1977) PASS: lldb-unit :: Utility/./UtilityTests/StringListTest.AppendListCStringArray (1762 of 1977) PASS: lldb-shell :: Quit/TestQuitExitCodeHex0.test (1763 of 1977) PASS: lldb-unit :: Process/gdb-remote/./ProcessGdbRemoteTests/GDBRemoteCommunicationServerTest.SendErrorResponse_Status (1764 of 1977) PASS: lldb-unit :: Utility/./UtilityTests/StringExtractorTest.GetHexU8_Underflow2_NoEof (1765 of 1977) PASS: lldb-unit :: Utility/./UtilityTests/StringListTest.LongestCommonPrefixSingleElement (1766 of 1977) PASS: lldb-unit :: Utility/./UtilityTests/StringExtractorTest.DecodeHexU8_Underflow (1767 of 1977) UNSUPPORTED: lldb-api :: terminal/TestEditline.py (1768 of 1977) PASS: lldb-unit :: Utility/./UtilityTests/StringListTest.GetMaxStringLengthMixed (1769 of 1977) PASS: lldb-unit :: Utility/./UtilityTests/ReproducerTest.SetReplay (1770 of 1977) PASS: lldb-unit :: Utility/./UtilityTests/SerializationRountripTest.SerializeDeserializeCString (1771 of 1977) PASS: lldb-shell :: SymbolFile/NativePDB/ast-types.cpp (1772 of 1977) PASS: lldb-shell :: Expr/TestIRMemoryMap.test (1773 of 1977) PASS: lldb-unit :: Utility/./UtilityTests/StringExtractorTest.DecodeHexU8_InvalidHex (1774 of 1977) UNSUPPORTED: lldb-api :: tools/lldb-server/platform-process-connect/TestPlatformProcessConnect.py (1775 of 1977) PASS: lldb-shell :: Minidump/Windows/broken-unwind.test (1776 of 1977) PASS: lldb-unit :: debugserver/./debugserverTests/JSON.Parse (1777 of 1977) PASS: lldb-unit :: debugserver/./debugserverTests/RNBSocket.LoopBackConnectIPv4 (1778 of 1977) PASS: lldb-api :: lang/c/local_variables/TestLocalVariables.py (1779 of 1977) PASS: lldb-shell :: Register/x86-64-gp-read.test (1780 of 1977) PASS: lldb-api :: functionalities/inferior-crashing/TestInferiorCrashingStep.py (1781 of 1977) PASS: lldb-api :: functionalities/load_using_paths/TestLoadUsingPaths.py (1782 of 1977) PASS: lldb-unit :: Utility/./UtilityTests/RangeTest.LessThan (1783 of 1977) PASS: lldb-api :: functionalities/tail_call_frames/cross_object/TestCrossObjectTailCalls.py (1784 of 1977) PASS: lldb-api :: functionalities/breakpoint/scripted_bkpt/TestScriptedResolver.py (1785 of 1977) PASS: lldb-shell :: Host/TestCustomShell.test (1786 of 1977) PASS: lldb-unit :: Utility/./UtilityTests/Flags.Clear (1787 of 1977) PASS: lldb-api :: functionalities/data-formatter/pyobjsynthprovider/TestPyObjSynthProvider.py (1788 of 1977) PASS: lldb-unit :: Utility/./UtilityTests/ArchSpecTest.TripleComponentsWereSpecified (1789 of 1977) PASS: lldb-unit :: Utility/./UtilityTests/ProcessInstanceInfo.DumpTable (1790 of 1977) PASS: lldb-unit :: Interpreter/./InterpreterTests/OptionArgParserTest.toScriptLanguage (1791 of 1977) PASS: lldb-unit :: Expression/./ExpressionTests/CppModuleConfigurationTest.AmbiguousCLib (1792 of 1977) PASS: lldb-unit :: Utility/./UtilityTests/LogChannelEnabledTest.log_options (1793 of 1977) PASS: lldb-unit :: Host/./HostTests/FileSystemTest.GetPermissions (1794 of 1977) PASS: lldb-api :: functionalities/data-formatter/typedef_array/TestTypedefArray.py (1795 of 1977) PASS: lldb-api :: commands/expression/namespace_local_var_same_name_obj_c/TestNamespaceLocalVarSameNameObjC.py (1796 of 1977) PASS: lldb-unit :: Symbol/./SymbolTests/TestTypeSystemClang.TestDeletingImplicitCopyCstrDueToMoveCStr (1797 of 1977) PASS: lldb-unit :: Target/./TargetTests/MemoryRegionInfoTest.Formatv (1798 of 1977) PASS: lldb-unit :: UnwindAssembly/x86/./UnwindAssemblyx86Tests/Testx86AssemblyInspectionEngine.TestPopEDI (1799 of 1977) PASS: lldb-api :: functionalities/gdb_remote_client/TestIOSSimulator.py (1800 of 1977) PASS: lldb-shell :: SymbolFile/DWARF/childless-compile-unit.s (1801 of 1977) PASS: lldb-unit :: Utility/./UtilityTests/ArgsTest.DoubleQuotedItem (1802 of 1977) PASS: lldb-shell :: SymbolFile/NativePDB/globals-fundamental.cpp (1803 of 1977) PASS: lldb-unit :: Utility/./UtilityTests/UriParserTest.PortOverflow (1804 of 1977) UNSUPPORTED: lldb-api :: benchmarks/stepping/TestSteppingSpeed.py (1805 of 1977) PASS: lldb-shell :: Minidump/memory-region.yaml (1806 of 1977) PASS: lldb-unit :: Utility/./UtilityTests/ReproducerTest.SetCapture (1807 of 1977) PASS: lldb-api :: functionalities/step_scripted/TestStepScripted.py (1808 of 1977) PASS: lldb-api :: commands/frame/select/TestFrameSelect.py (1809 of 1977) PASS: lldb-unit :: Core/./LLDBCoreTests/StreamCallbackTest.Callback (1810 of 1977) PASS: lldb-shell :: Minidump/dump-all.test (1811 of 1977) PASS: lldb-unit :: Expression/./ExpressionTests/DiagnosticManagerTest.PutString (1812 of 1977) PASS: lldb-api :: commands/watchpoints/hello_watchpoint/TestMyFirstWatchpoint.py (1813 of 1977) PASS: lldb-api :: functionalities/tail_call_frames/thread_step_out_or_return/TestSteppingOutWithArtificialFrames.py (1814 of 1977) PASS: lldb-unit :: Process/gdb-remote/./ProcessGdbRemoteTests/GDBRemoteCommunicationClientTest.GetModulesInfo_UUID20 (1815 of 1977) PASS: lldb-unit :: Host/./HostTests/NativeProcessProtocolTest.ReadMemoryWithoutTrap (1816 of 1977) PASS: lldb-shell :: SymbolFile/NativePDB/globals-bss.cpp (1817 of 1977) PASS: lldb-unit :: Utility/./UtilityTests/BinaryStreamTest.PutSLEB128MaxValue (1818 of 1977) PASS: lldb-api :: functionalities/breakpoint/breakpoint_by_line_and_column/TestBreakpointByLineAndColumn.py (1819 of 1977) PASS: lldb-api :: commands/expression/ir-interpreter/TestIRInterpreter.py (1820 of 1977) PASS: lldb-api :: commands/expression/scoped_enums/TestScopedEnumType.py (1821 of 1977) PASS: lldb-unit :: Utility/./UtilityTests/ArgsTest.TestMultipleArgs (1822 of 1977) PASS: lldb-unit :: ScriptInterpreter/Python/./ScriptInterpreterPythonTests/PythonDataObjectsTest.TestObjectAttributes (1823 of 1977) PASS: lldb-shell :: ScriptInterpreter/Python/scripted_breakpoint.test (1824 of 1977) PASS: lldb-api :: functionalities/gdb_remote_client/TestNoWatchpointSupportInfo.py (1825 of 1977) PASS: lldb-shell :: Reproducer/TestFileRepro.test (1826 of 1977) PASS: lldb-api :: macosx/lc-note/kern-ver-str/TestKernVerStrLCNOTE.py (1827 of 1977) PASS: lldb-api :: functionalities/breakpoint/hardware_breakpoints/hardware_breakpoint_on_multiple_threads/TestHWBreakMultiThread.py (1828 of 1977) PASS: lldb-unit :: Utility/./UtilityTests/SerializationRountripTest.SerializeDeserializePod (1829 of 1977) PASS: lldb-unit :: Utility/./UtilityTests/TimeoutTest.Format (1830 of 1977) UNSUPPORTED: lldb-api :: arm/breakpoint-thumb-codesection/TestBreakpointThumbCodesection.py (1831 of 1977) UNSUPPORTED: lldb-api :: api/multiple-debuggers/TestMultipleDebuggers.py (1832 of 1977) PASS: lldb-api :: functionalities/thread/num_threads/TestNumThreads.py (1833 of 1977) PASS: lldb-api :: lang/objc/modules-hash-mismatch/TestClangModulesHashMismatch.py (1834 of 1977) PASS: lldb-unit :: Utility/./UtilityTests/RangeDataVector.FindEntryIndexesThatContain_Overlap (1835 of 1977) PASS: lldb-shell :: Settings/TestFrameFormatNoColor.test (1836 of 1977) PASS: lldb-api :: lang/c/step_over_no_deadlock/TestStepOverDoesntBlock.py (1837 of 1977) PASS: lldb-unit :: Utility/./UtilityTests/Flags.AnySet (1838 of 1977) UNSUPPORTED: lldb-api :: lang/cpp/function-template-parameter-pack/TestFunctionTemplateParameterPack.py (1839 of 1977) PASS: lldb-unit :: UnwindAssembly/x86/./UnwindAssemblyx86Tests/Testx86AssemblyInspectionEngine.TestPopR15 (1840 of 1977) PASS: lldb-unit :: Utility/./UtilityTests/CompletionRequest.TryCompleteCurrentArgMode (1841 of 1977) PASS: lldb-unit :: Symbol/./SymbolTests/PostfixExpression.ParseOneExpression (1842 of 1977) PASS: lldb-shell :: SymbolFile/NativePDB/break-by-line.cpp (1843 of 1977) PASS: lldb-unit :: Utility/./UtilityTests/ArgsTest.ReplaceArgumentAtIndexFarOutOfRange (1844 of 1977) PASS: lldb-shell :: Settings/TestDisassemblyFormat.test (1845 of 1977) PASS: lldb-unit :: Utility/./UtilityTests/RegisterValueTest.GetSet8 (1846 of 1977) PASS: lldb-shell :: SymbolFile/DWARF/debug_loc-aslr.s (1847 of 1977) PASS: lldb-api :: lang/c/array_types/TestArrayTypes.py (1848 of 1977) PASS: lldb-unit :: Host/./HostTests/NativeProcessProtocolTest.ReadCStringFromMemory (1849 of 1977) UNSUPPORTED: lldb-api :: lang/objc/foundation/TestFoundationDisassembly.py (1850 of 1977) PASS: lldb-api :: functionalities/data-formatter/ostypeformatting/TestFormattersOsType.py (1851 of 1977) PASS: lldb-unit :: Utility/./UtilityTests/DeserializerTest.HasData (1852 of 1977) PASS: lldb-unit :: Editline/./EditlineTests/EditlineTestFixture.EditlineReceivesSingleLineText (1853 of 1977) PASS: lldb-api :: linux/builtin_trap/TestBuiltinTrap.py (1854 of 1977) PASS: lldb-shell :: Settings/TestEchoCommands.test (1855 of 1977) UNSUPPORTED: lldb-api :: functionalities/thread/state/TestThreadStates.py (1856 of 1977) PASS: lldb-api :: macosx/queues/TestQueues.py (1857 of 1977) UNSUPPORTED: lldb-api :: functionalities/signal/handle-segv/TestHandleSegv.py (1858 of 1977) PASS: lldb-unit :: Utility/./UtilityTests/BroadcasterTest.EventTypeHasListeners (1859 of 1977) UNSUPPORTED: lldb-shell :: SymbolFile/PDB/variables.test (1860 of 1977) PASS: lldb-unit :: Utility/./UtilityTests/StringListTest.SetSize (1861 of 1977) PASS: lldb-unit :: Utility/./UtilityTests/DataExtractorTest.GetCStrAtEnd (1862 of 1977) PASS: lldb-unit :: Language/Highlighting/./HighlighterTests/HighlighterTest.ClangBraces (1863 of 1977) PASS: lldb-unit :: Utility/./UtilityTests/AnsiTerminal.WhiteSpace (1864 of 1977) PASS: lldb-unit :: Expression/./ExpressionTests/ClangHostTest.ComputeClangResourceDirectory (1865 of 1977) PASS: lldb-api :: python_api/default-constructor/TestDefaultConstructorForAPIObjects.py (1866 of 1977) PASS: lldb-api :: functionalities/data-formatter/data-formatter-stl/libcxx/unordered/TestDataFormatterUnordered.py (1867 of 1977) PASS: lldb-api :: macosx/find-dsym/bundle-with-dot-in-filename/TestBundleWithDotInFilename.py (1868 of 1977) PASS: lldb-unit :: Utility/./UtilityTests/BinaryStreamTest.PutULEB128NineBytes (1869 of 1977) PASS: lldb-shell :: Driver/TestNoUseColor.test (1870 of 1977) PASS: lldb-api :: commands/version/TestVersion.py (1871 of 1977) PASS: lldb-unit :: ScriptInterpreter/Python/./ScriptInterpreterPythonTests/PythonDataObjectsTest.TestPythonTupleToStructuredList (1872 of 1977) PASS: lldb-unit :: Process/gdb-remote/./ProcessGdbRemoteTests/GDBRemoteCommunicationClientTest.SaveRestoreRegistersNoSuffix (1873 of 1977) PASS: lldb-unit :: Process/minidump/./LLDBMinidumpTests/MinidumpParserTest.GetFilteredModuleList (1874 of 1977) PASS: lldb-unit :: Utility/./UtilityTests/ScalarTest.RightShiftOperator (1875 of 1977) PASS: lldb-api :: python_api/watchpoint/watchlocation/TestSetWatchlocation.py (1876 of 1977) UNSUPPORTED: lldb-shell :: SymbolFile/PDB/calling-conventions.test (1877 of 1977) PASS: lldb-unit :: SymbolFile/DWARF/./SymbolFileDWARFTests/DWARFASTParserClangTests.EnsureAllDIEsInDeclContextHaveBeenParsedParsesOnlyMatchingEntries (1878 of 1977) PASS: lldb-api :: lang/objc/foundation/TestConstStrings.py (1879 of 1977) PASS: lldb-shell :: Reproducer/TestGDBRemoteRepro.test (1880 of 1977) PASS: lldb-unit :: Utility/./UtilityTests/StreamTeeTest.Constructor1Stream (1881 of 1977) UNSUPPORTED: lldb-shell :: BuildScript/toolchain-msvc.test (1882 of 1977) PASS: lldb-unit :: Utility/./UtilityTests/ArgsTest.ReplaceArgumentAtIndexLonger (1883 of 1977) PASS: lldb-api :: functionalities/gdb_remote_client/TestRecognizeBreakpoint.py (1884 of 1977) PASS: lldb-api :: functionalities/data-formatter/nsdictionarysynth/TestNSDictionarySynthetic.py (1885 of 1977) PASS: lldb-unit :: UnwindAssembly/x86/./UnwindAssemblyx86Tests/Testx86AssemblyInspectionEngine.TestPopRBPWithREX (1886 of 1977) PASS: lldb-api :: macosx/find-app-in-bundle/TestFindAppInBundle.py (1887 of 1977) PASS: lldb-unit :: Expression/./ExpressionTests/DWARFExpression.DW_OP_convert (1888 of 1977) PASS: lldb-unit :: Utility/./UtilityTests/NameMatchesTest.StartsWith (1889 of 1977) XFAIL: lldb-shell :: Unwind/prefer-debug-over-eh-frame.test (1890 of 1977) PASS: lldb-api :: lang/cpp/this/TestCPPThis.py (1891 of 1977) PASS: lldb-api :: functionalities/breakpoint/move_nearest/TestMoveNearest.py (1892 of 1977) PASS: lldb-api :: commands/process/launch/TestProcessLaunch.py (1893 of 1977) PASS: lldb-unit :: Utility/./UtilityTests/StringExtractorTest.DecodeHexU8_InvalidHex2 (1894 of 1977) PASS: lldb-api :: lang/objc/foundation/TestObjCMethodsNSError.py (1895 of 1977) PASS: lldb-unit :: Utility/./UtilityTests/StreamTeeTest.CopyConstructor (1896 of 1977) PASS: lldb-unit :: Utility/./UtilityTests/AnsiTerminal.AtEnd (1897 of 1977) PASS: lldb-api :: lang/objc/modules-app-update/TestClangModulesAppUpdate.py (1898 of 1977) PASS: lldb-api :: functionalities/paths/TestPaths.py (1899 of 1977) PASS: lldb-api :: commands/expression/test/TestExprs.py (1900 of 1977) UNSUPPORTED: lldb-api :: linux/thread/create_during_instruction_step/TestCreateDuringInstructionStep.py (1901 of 1977) PASS: lldb-api :: lang/c/conflicting-symbol/TestConflictingSymbol.py (1902 of 1977) PASS: lldb-shell :: ObjectFile/PECOFF/basic-info.yaml (1903 of 1977) PASS: lldb-shell :: Reproducer/Functionalities/TestExpressionEvaluation.test (1904 of 1977) PASS: lldb-unit :: Symbol/./SymbolTests/TestClangASTImporter.DeportDeclTagDecl (1905 of 1977) PASS: lldb-api :: lang/cpp/template/TestTemplateArgs.py (1906 of 1977) PASS: lldb-unit :: Host/./HostTests/SocketTest.DecodeHostAndPort (1907 of 1977) PASS: lldb-unit :: Utility/./UtilityTests/DataExtractorTest.GetMaxS64 (1908 of 1977) UNSUPPORTED: lldb-api :: benchmarks/turnaround/TestCompileRunToBreakpointTurnaround.py (1909 of 1977) PASS: lldb-shell :: SymbolFile/Breakpad/unwind-via-stack-win-no-memory-info.yaml (1910 of 1977) PASS: lldb-unit :: Utility/./UtilityTests/StringListTest.RemoveBlankLines (1911 of 1977) PASS: lldb-unit :: Utility/./UtilityTests/VMRange.SetEndAddress (1912 of 1977) PASS: lldb-shell :: SymbolFile/DWARF/win-i386-line-table.s (1913 of 1977) PASS: lldb-unit :: UnwindAssembly/x86/./UnwindAssemblyx86Tests/Testx86AssemblyInspectionEngine.TestDisassemblyJunkBytes (1914 of 1977) PASS: lldb-api :: functionalities/thread/concurrent_events/TestConcurrentTwoBreakpointsOneSignal.py (1915 of 1977) PASS: lldb-api :: tools/lldb-server/TestGdbRemoteSingleStep.py (1916 of 1977) PASS: lldb-unit :: Utility/./UtilityTests/BinaryStreamTest.PutULEB128SixBytes (1917 of 1977) UNSUPPORTED: lldb-api :: functionalities/darwin_log/format/TestDarwinLogMessageFormat.py (1918 of 1977) PASS: lldb-shell :: SymbolFile/NativePDB/disassembly.cpp (1919 of 1977) PASS: lldb-api :: lang/c/local_types/TestUseClosestType.py (1920 of 1977) PASS: lldb-api :: lang/objc/objc-builtin-types/TestObjCBuiltinTypes.py (1921 of 1977) PASS: lldb-unit :: Symbol/./SymbolTests/DWARFCallFrameInfoTest.Basic_eh (1922 of 1977) PASS: lldb-unit :: Process/minidump/./LLDBMinidumpTests/MinidumpParserTest.GetLinuxProcStatus (1923 of 1977) PASS: lldb-unit :: ScriptInterpreter/Python/./ScriptInterpreterPythonTests/PythonDataObjectsTest.TestGlobalNameResolutionNoDot (1924 of 1977) PASS: lldb-shell :: SymbolFile/DWARF/apple-index-is-used.cpp (1925 of 1977) PASS: lldb-unit :: Utility/./UtilityTests/RangeTest.DoesIntersect (1926 of 1977) PASS: lldb-unit :: Expression/./ExpressionTests/DiagnosticManagerTest.FixedExpression (1927 of 1977) UNSUPPORTED: lldb-shell :: SymbolFile/PDB/function-level-linking.test (1928 of 1977) PASS: lldb-api :: functionalities/thread/backtrace_all/TestBacktraceAll.py (1929 of 1977) PASS: lldb-unit :: Utility/./UtilityTests/ArchSpecTest.MergeFrom (1930 of 1977) PASS: lldb-api :: lang/objc/foundation/TestObjCMethodsString.py (1931 of 1977) PASS: lldb-unit :: Utility/./UtilityTests/StringExtractorTest.GetHexU8_InvalidHex_NoEof (1932 of 1977) PASS: lldb-api :: commands/expression/ir-interpreter-phi-nodes/TestIRInterpreterPHINodes.py (1933 of 1977) UNSUPPORTED: lldb-api :: arm/breakpoint-it/TestBreakpointIt.py (1934 of 1977) PASS: lldb-api :: lang/cpp/multiple-inheritance/TestCppMultipleInheritance.py (1935 of 1977) PASS: lldb-unit :: Utility/./UtilityTests/NameMatchesTest.Ignore (1936 of 1977) PASS: lldb-api :: functionalities/postmortem/netbsd-core/TestNetBSDCore.py (1937 of 1977) PASS: lldb-unit :: Utility/./UtilityTests/VASprintfTest.BufferResize (1938 of 1977) PASS: lldb-unit :: Utility/./UtilityTests/StringExtractorTest.GetHexBytesAvail_Underflow (1939 of 1977) UNSUPPORTED: lldb-shell :: SymbolFile/NativePDB/typedefs.cpp (1940 of 1977) PASS: lldb-unit :: Expression/./ExpressionTests/DiagnosticManagerTest.PutStringMultiple (1941 of 1977) PASS: lldb-unit :: UnwindAssembly/x86/./UnwindAssemblyx86Tests/Testx86AssemblyInspectionEngine.TestStackRealign32BitDisp_x86_64 (1942 of 1977) PASS: lldb-shell :: Unwind/thread-step-out-ret-addr-check.test (1943 of 1977) PASS: lldb-unit :: Host/./HostTests/SocketTest.DomainGetConnectURI (1944 of 1977) PASS: lldb-api :: functionalities/return-value/TestReturnValue.py (1945 of 1977) PASS: lldb-shell :: ObjectFile/ELF/PT_TLS-overlap-PT_LOAD.yaml (1946 of 1977) UNSUPPORTED: lldb-api :: functionalities/ubsan/user-expression/TestUbsanUserExpression.py (1947 of 1977) PASS: lldb-shell :: BuildScript/toolchain-clang.test (1948 of 1977) PASS: lldb-unit :: Process/minidump/./LLDBMinidumpTests/MinidumpParserTest.GetPidWindows (1949 of 1977) PASS: lldb-unit :: Language/Highlighting/./HighlighterTests/HighlighterTest.HighlighterSelectionPath (1950 of 1977) PASS: lldb-api :: functionalities/breakpoint/breakpoint_set_restart/TestBreakpointSetRestart.py (1951 of 1977) PASS: lldb-unit :: Utility/./UtilityTests/ArgsTest.TestInsertArg (1952 of 1977) PASS: lldb-unit :: Utility/./UtilityTests/StreamTeeTest.AppendStream (1953 of 1977) PASS: lldb-shell :: SymbolFile/NativePDB/s_constant.cpp (1954 of 1977) PASS: lldb-api :: python_api/value_var_update/TestValueVarUpdate.py (1955 of 1977) PASS: lldb-api :: functionalities/thread/concurrent_events/TestConcurrentSignalWatch.py (1956 of 1977) PASS: lldb-unit :: Utility/./UtilityTests/RangeTest.DefaultConstructor (1957 of 1977) PASS: lldb-shell :: BuildScript/modes.test (1958 of 1977) PASS: lldb-shell :: Reproducer/TestCrash.test (1959 of 1977) PASS: lldb-api :: commands/expression/unicode-in-variable/TestUnicodeInVariable.py (1960 of 1977) PASS: lldb-unit :: Utility/./UtilityTests/StreamTest.PutHex16ByteOrderLittle (1961 of 1977) PASS: lldb-shell :: BuildScript/compiler-full-path.test (1962 of 1977) PASS: lldb-api :: functionalities/breakpoint/step_over_breakpoint/TestStepOverBreakpoint.py (1963 of 1977) PASS: lldb-api :: functionalities/breakpoint/inlined_breakpoints/TestInlinedBreakpoints.py (1964 of 1977) PASS: lldb-unit :: Expression/./ExpressionTests/DiagnosticManagerTest.GetStringMultiline (1965 of 1977) PASS: lldb-api :: types/TestLongTypes.py (1966 of 1977) PASS: lldb-shell :: Minidump/memory-region-from-module.yaml (1967 of 1977) PASS: lldb-api :: lang/c/const_variables/TestConstVariables.py (1968 of 1977) PASS: lldb-api :: lang/objc/self/TestObjCSelf.py (1969 of 1977) PASS: lldb-api :: commands/expression/dont_allow_jit/TestAllowJIT.py (1970 of 1977) PASS: lldb-unit :: Utility/./UtilityTests/ScalarTest.Promotion (1971 of 1977) PASS: lldb-shell :: Breakpoint/debug_addrx.test (1972 of 1977) PASS: lldb-unit :: Utility/./UtilityTests/ScalarTest.CastOperations (1973 of 1977) PASS: lldb-unit :: Host/./HostTests/TaskPoolTest.TaskMap (1974 of 1977) PASS: lldb-api :: functionalities/jitloader_gdb/TestJITLoaderGDB.py (1975 of 1977) PASS: lldb-api :: tools/lldb-server/TestGdbRemoteHostInfo.py (1976 of 1977) PASS: lldb-api :: functionalities/type_lookup/TestTypeLookup.py (1977 of 1977)

Hide Details

Testing Time: 4473.93s ******************** Failing Tests (3): lldb-api :: python_api/thread/TestThreadAPI.py lldb-api :: lang/objc/ptr_refs/TestPtrRefsObjC.py lldb-api :: functionalities/ptr_refs/TestPtrRefs.py

Hide Details

Hide Details

Slowest Tests: -------------------------------------------------------------------------- 95.01s: lldb-api :: commands/settings/TestSettings.py 100.32s: lldb-api :: types/TestLongTypes.py 108.55s: lldb-api :: lang/objcxx/class-name-clash/TestNameClash.py 108.64s: lldb-api :: python_api/lldbutil/iter/TestLLDBIterator.py 115.94s: lldb-api :: lang/objc/foundation/TestObjCMethodsNSError.py 120.94s: lldb-api :: tools/lldb-server/TestGdbRemote_qThreadStopInfo.py 121.43s: lldb-api :: lang/objc/foundation/TestObjCMethodsString.py 122.51s: lldb-api :: lang/objc/objc-new-syntax/TestObjCNewSyntaxArray.py 123.00s: lldb-api :: lang/objc/objc-new-syntax/TestObjCNewSyntaxDictionary.py 135.45s: lldb-api :: types/TestLongTypesExpr.py 144.69s: lldb-api :: lang/objc/exceptions/TestObjCExceptions.py 145.73s: lldb-api :: lang/objc/real-definition/TestRealDefinition.py 158.90s: lldb-api :: lang/objc/objc-new-syntax/TestObjCNewSyntaxLiteral.py 165.17s: lldb-api :: lang/cpp/namespace/TestNamespaceLookup.py 224.85s: lldb-api :: lang/objc/foundation/TestObjCMethods.py 228.81s: lldb-api :: lang/objc/hidden-ivars/TestHiddenIvars.py 248.41s: lldb-api :: tools/lldb-server/TestGdbRemoteThreadsInStopReply.py 261.38s: lldb-api :: api/multithreaded/TestMultithreaded.py 272.66s: lldb-api :: lang/cpp/enum_types/TestCPP11EnumTypes.py 365.22s: lldb-api :: tools/lldb-server/TestLldbGdbServer.py

Hide Details

Tests Times: -------------------------------------------------------------------------- [ Range ] :: [ Percentage ] :: [ Count ] -------------------------------------------------------------------------- [ 0s, 20s) :: [********************************** ] :: [1722/1977] [ 20s, 40s) :: [** ] :: [ 106/1977] [ 40s, 60s) :: [* ] :: [ 91/1977] [ 60s, 80s) :: [ ] :: [ 29/1977] [ 80s,100s) :: [ ] :: [ 10/1977] [100s,120s) :: [ ] :: [ 3/1977] [120s,140s) :: [ ] :: [ 5/1977] [140s,160s) :: [ ] :: [ 3/1977] [160s,180s) :: [ ] :: [ 2/1977] [180s,200s) :: [ ] :: [ 0/1977] [200s,220s) :: [ ] :: [ 0/1977] [220s,240s) :: [ ] :: [ 2/1977] [240s,260s) :: [ ] :: [ 1/1977] [260s,280s) :: [ ] :: [ 1/1977] [280s,300s) :: [ ] :: [ 1/1977] [300s,320s) :: [ ] :: [ 0/1977] [320s,340s) :: [ ] :: [ 0/1977] [340s,360s) :: [ ] :: [ 0/1977] [360s,380s) :: [ ] :: [ 1/1977] Expected Passes : 1801 Expected Failures : 6 Unsupported Tests : 167 Unexpected Failures: 3 FAILED: tools/lldb/test/CMakeFiles/check-lldb-lit cd /Users/buildslave/jenkins/workspace/lldb-cmake-sanitized/lldb-build/tools/lldb/test && /usr/local/bin/python /Users/buildslave/jenkins/workspace/lldb-cmake-sanitized/lldb-build/./bin/llvm-lit -v --time-tests --shuffle --xunit-xml-output=/Users/buildslave/jenkins/workspace/lldb-cmake-sanitized/test/results.xml -v -j 4 --timeout 1200 /Users/buildslave/jenkins/workspace/lldb-cmake-sanitized/lldb-build/tools/lldb/test ninja: build stopped: subcommand failed. Command failed: Command '['/usr/bin/env', 'TERM=vt100', '/usr/local/bin/ninja', '-v', 'check-lldb']' returned non-zero exit status 1. Command: ['/usr/bin/env', 'TERM=vt100', '/usr/local/bin/ninja', '-v', 'check-lldb'] [Pipeline] } [Pipeline] // timeout [Pipeline] } [Pipeline] // stage [Pipeline] stage [Pipeline] { (Declarative: Post Actions) [Pipeline] scanForIssues [Clang (LLVM based)] Sleeping for 5 seconds due to JENKINS-32191... [Clang (LLVM based)] Parsing console log (workspace: '/Users/buildslave/jenkins/workspace/lldb-cmake-sanitized') [Clang (LLVM based)] Successfully parsed console log [Clang (LLVM based)] -> found 5 issues (skipped 0 duplicates) [Clang (LLVM based)] Post processing issues on 'green-dragon-23' with source code encoding 'UTF-8' [Clang (LLVM based)] Creating SCM blamer to obtain author and commit information for affected files [Clang (LLVM based)] Creating SCM miner to obtain statistics for affected repository files [Clang (LLVM based)] Resolving file names for all issues in source directory '/Users/buildslave/jenkins/workspace/lldb-cmake-sanitized' [Clang (LLVM based)] -> resolved paths in source directory (4 found, 0 not found) [Clang (LLVM based)] Resolving module names from module definitions (build.xml, pom.xml, or Manifest.mf files) [Clang (LLVM based)] -> resolved module names for 5 issues [Clang (LLVM based)] Resolving package names (or namespaces) by parsing the affected files [Clang (LLVM based)] -> resolved package names of 4 affected files [Clang (LLVM based)] No filter has been set, publishing all 5 issues [Clang (LLVM based)] Creating fingerprints for all affected code blocks to track issues over different builds [Clang (LLVM based)] -> created fingerprints for 5 issues (skipped 0 issues) [Clang (LLVM based)] Copying affected files to Jenkins' build folder '/Users/Shared/Jenkins/Home/jobs/lldb-cmake-sanitized/builds/1160/files-with-issues' [Clang (LLVM based)] -> 4 copied, 0 not in workspace, 0 not-found, 0 with I/O error [Pipeline] junit Recording test results [Pipeline] } [Pipeline] // stage [Pipeline] } [Pipeline] // withEnv [Pipeline] } [Pipeline] // node [Pipeline] End of Pipeline ERROR: script returned exit code 1 Finished: FAILURE