FailedConsole Output

Skipping 164 KB.. Full Log
.cpp (673 of 1977)
PASS: lldb-api :: lang/cpp/char8_t/TestCxxChar8_t.py (674 of 1977)
UNSUPPORTED: lldb-api :: functionalities/process_save_core/TestProcessSaveCore.py (675 of 1977)
PASS: lldb-api :: functionalities/data-formatter/type_summary_list_script/TestTypeSummaryListScript.py (676 of 1977)
PASS: lldb-unit :: Language/Highlighting/./HighlighterTests/HighlighterTest.ClangComments (677 of 1977)
PASS: lldb-api :: python_api/sbstructureddata/TestStructuredDataAPI.py (678 of 1977)
PASS: lldb-shell :: ObjectFile/MachO/symtab.yaml (679 of 1977)
PASS: lldb-unit :: Utility/./UtilityTests/CompletionRequest.DuplicateFilteringWithComments (680 of 1977)
PASS: lldb-unit :: SymbolFile/NativePDB/./SymbolFileNativePDBTests/PDBFPOProgramToDWARFExpressionTests.InvalidOpBinary (681 of 1977)
PASS: lldb-unit :: Process/gdb-remote/./ProcessGdbRemoteTests/GDBRemoteCommunicationClientTest.WriteRegisterNoSuffix (682 of 1977)
PASS: lldb-api :: functionalities/data-formatter/data-formatter-stl/libcxx/set/TestDataFormatterLibcxxSet.py (683 of 1977)
PASS: lldb-api :: commands/expression/regression-access-function-template-in-record/TestRegressionAccessFunctionTemplateInRecord.py (684 of 1977)
PASS: lldb-api :: commands/expression/import-std-module/queue/TestQueueFromStdModule.py (685 of 1977)
PASS: lldb-api :: lang/cpp/rvalue-references/TestRvalueReferences.py (686 of 1977)
PASS: lldb-unit :: Symbol/./SymbolTests/TestTypeSystemClang.TestDeletingImplicitCopyCstrDueToMoveCStr (687 of 1977)
PASS: lldb-api :: lang/c/stepping/TestThreadStepping.py (688 of 1977)
PASS: lldb-unit :: Utility/./UtilityTests/StringListTest.GetSize (689 of 1977)
UNSUPPORTED: lldb-api :: functionalities/data-formatter/data-formatter-stl/libstdcpp/list/TestDataFormatterStdList.py (690 of 1977)
PASS: lldb-unit :: UnwindAssembly/x86/./UnwindAssemblyx86Tests/Testx86AssemblyInspectionEngine.Test64bitFramelessSmallStackFrame (691 of 1977)
PASS: lldb-unit :: UnwindAssembly/x86/./UnwindAssemblyx86Tests/Testx86AssemblyInspectionEngine.TestStackRealign32BitDisp_x86_64 (692 of 1977)
PASS: lldb-unit :: Utility/./UtilityTests/StringExtractorTest.GetHexU8_InvalidHex (693 of 1977)
PASS: lldb-api :: python_api/hello_world/TestHelloWorld.py (694 of 1977)
PASS: lldb-api :: commands/disassemble/basic/TestDisassembleBreakpoint.py (695 of 1977)
PASS: lldb-api :: lang/objc/objc-new-syntax/TestObjCNewSyntaxArray.py (696 of 1977)
PASS: lldb-unit :: Utility/./UtilityTests/OptionsWithRawTest.EmptyArgsOnlySuffix (697 of 1977)
PASS: lldb-api :: functionalities/tail_call_frames/thread_step_out_message/TestArtificialFrameStepOutMessage.py (698 of 1977)
PASS: lldb-api :: lang/cpp/covariant-return-types/TestCovariantReturnTypes.py (699 of 1977)
UNSUPPORTED: lldb-api :: functionalities/data-formatter/data-formatter-stl/libstdcpp/unique_ptr/TestDataFormatterStdUniquePtr.py (700 of 1977)
PASS: lldb-api :: lang/cpp/inlines/TestInlines.py (701 of 1977)
PASS: lldb-unit :: Utility/./UtilityTests/StringExtractorTest.GetHexBytes (702 of 1977)
PASS: lldb-api :: functionalities/deleted-executable/TestDeletedExecutable.py (703 of 1977)
PASS: lldb-api :: lang/cpp/gmodules-templates/TestGModules.py (704 of 1977)
PASS: lldb-api :: functionalities/tail_call_frames/cross_dso/TestCrossDSOTailCalls.py (705 of 1977)
PASS: lldb-shell :: ScriptInterpreter/None/none.test (706 of 1977)
PASS: lldb-unit :: Utility/./UtilityTests/FileSpecTest.IsRelative (707 of 1977)
PASS: lldb-unit :: Signals/./SignalsTests/UnixSignalsTest.VersionChange (708 of 1977)
PASS: lldb-shell :: SymbolFile/DWARF/gnu-style-compression.cpp (709 of 1977)
PASS: lldb-api :: functionalities/thread/concurrent_events/TestConcurrentTwoWatchpointThreads.py (710 of 1977)
PASS: lldb-unit :: ScriptInterpreter/Python/./ScriptInterpreterPythonTests/PythonDataObjectsTest.TestExceptions (711 of 1977)
UNSUPPORTED: lldb-api :: functionalities/longjmp/TestLongjmp.py (712 of 1977)
PASS: lldb-api :: functionalities/data-formatter/data-formatter-skip-summary/TestDataFormatterSkipSummary.py (713 of 1977)
PASS: lldb-shell :: Minidump/fb-dump.test (714 of 1977)
PASS: lldb-shell :: ScriptInterpreter/Python/scripted_breakpoint.test (715 of 1977)
PASS: lldb-shell :: Settings/TestDisableColor.test (716 of 1977)
PASS: lldb-api :: functionalities/data-formatter/data-formatter-named-summaries/TestDataFormatterNamedSummaries.py (717 of 1977)
PASS: lldb-api :: api/multithreaded/TestMultithreaded.py (718 of 1977)
PASS: lldb-unit :: Utility/./UtilityTests/LogChannelEnabledTest.LogThread (719 of 1977)
PASS: lldb-api :: macosx/lc-note/kern-ver-str/TestKernVerStrLCNOTE.py (720 of 1977)
PASS: lldb-unit :: Process/minidump/./LLDBMinidumpTests/MinidumpParserTest.GetArchitecture (721 of 1977)
PASS: lldb-unit :: Process/gdb-remote/./ProcessGdbRemoteTests/GDBRemoteCommunicationClientTest.SendGetMetaDataPacket (722 of 1977)
PASS: lldb-unit :: Process/minidump/./LLDBMinidumpTests/MinidumpParserTest.GetMiscInfo_no_stream (723 of 1977)
PASS: lldb-api :: lang/cpp/limit-debug-info/TestWithLimitDebugInfo.py (724 of 1977)
PASS: lldb-api :: functionalities/multidebugger_commands/TestMultipleDebuggersCommands.py (725 of 1977)
PASS: lldb-unit :: Utility/./UtilityTests/GeneratorTest.Create (726 of 1977)
PASS: lldb-api :: functionalities/breakpoint/inlined_breakpoints/TestInlinedBreakpoints.py (727 of 1977)
PASS: lldb-api :: functionalities/data-formatter/data-formatter-enum-format/TestDataFormatterEnumFormat.py (728 of 1977)
PASS: lldb-unit :: Utility/./UtilityTests/ProcessInstanceInfo.Yaml (729 of 1977)
PASS: lldb-unit :: Utility/./UtilityTests/StringListTest.SplitIntoLines (730 of 1977)
PASS: lldb-api :: functionalities/breakpoint/breakpoint_locations/TestBreakpointLocations.py (731 of 1977)
PASS: lldb-api :: functionalities/breakpoint/breakpoint_command/TestBreakpointCommandsFromPython.py (732 of 1977)
PASS: lldb-unit :: Language/Highlighting/./HighlighterTests/HighlighterTest.ClangTrailingBackslashWithWhitespace (733 of 1977)
PASS: lldb-api :: commands/expression/context-object/TestContextObject.py (734 of 1977)
PASS: lldb-api :: functionalities/data-formatter/data-formatter-globals/TestDataFormatterGlobals.py (735 of 1977)
PASS: lldb-unit :: Utility/./UtilityTests/ArchSpecTest.MergeFrom (736 of 1977)
PASS: lldb-unit :: Language/Highlighting/./HighlighterTests/HighlighterTest.ClangSquareBrackets (737 of 1977)
PASS: lldb-unit :: Language/Highlighting/./HighlighterTests/HighlighterTest.Keywords (738 of 1977)
PASS: lldb-api :: functionalities/data-formatter/user-format-vs-summary/TestUserFormatVsSummary.py (739 of 1977)
PASS: lldb-api :: commands/breakpoint/command/list/TestBreakpointCommandList.py (740 of 1977)
UNSUPPORTED: lldb-api :: functionalities/darwin_log/filter/regex/message/TestDarwinLogFilterRegexMessage.py (741 of 1977)
PASS: lldb-api :: python_api/name_lookup/TestNameLookup.py (742 of 1977)
PASS: lldb-unit :: Utility/./UtilityTests/ArgsTest.TestQuotedTrailingBackslash (743 of 1977)
PASS: lldb-shell :: Commands/command-disassemble.s (744 of 1977)
PASS: lldb-api :: tools/lldb-server/inferior-crash/TestGdbRemoteSegFault.py (745 of 1977)
PASS: lldb-shell :: Breakpoint/single-file-split-dwarf.test (746 of 1977)
UNSUPPORTED: lldb-api :: arm/breakpoint-it/TestBreakpointIt.py (747 of 1977)
PASS: lldb-shell :: Driver/TestSingleQuote.test (748 of 1977)
PASS: lldb-unit :: Utility/./UtilityTests/StreamTest.AddressNoSuffix (749 of 1977)
PASS: lldb-unit :: SymbolFile/NativePDB/./SymbolFileNativePDBTests/PDBFPOProgramToDWARFExpressionTests.UnresolvedRegisterAssignmentReference (750 of 1977)
PASS: lldb-api :: commands/expression/context-object-objc/TestContextObjectObjc.py (751 of 1977)
UNSUPPORTED: lldb-shell :: SymbolFile/PDB/ast-restore.test (752 of 1977)
PASS: lldb-unit :: Utility/./UtilityTests/CompletionRequest.TryCompleteCurrentArgBad (753 of 1977)
UNSUPPORTED: lldb-api :: benchmarks/expression/TestExpressionCmd.py (754 of 1977)
PASS: lldb-unit :: UnwindAssembly/x86/./UnwindAssemblyx86Tests/Testx86AssemblyInspectionEngine.TestSpillRegToStackViaMOVx86_64 (755 of 1977)
PASS: lldb-shell :: ObjectFile/ELF/section-addresses.yaml (756 of 1977)
PASS: lldb-unit :: Utility/./UtilityTests/ArchSpecTest.Compatibility (757 of 1977)
PASS: lldb-api :: types/TestShortTypeExpr.py (758 of 1977)
PASS: lldb-api :: lang/cpp/class-template-parameter-pack/TestClassTemplateParameterPack.py (759 of 1977)
PASS: lldb-unit :: Utility/./UtilityTests/ProcessInstanceInfo.DumpTable (760 of 1977)
PASS: lldb-unit :: Utility/./UtilityTests/ArgsTest.ReplaceArgumentAtIndexLonger (761 of 1977)
PASS: lldb-api :: functionalities/tail_call_frames/disambiguate_tail_call_seq/TestDisambiguateTailCallSeq.py (762 of 1977)
PASS: lldb-unit :: Utility/./UtilityTests/BinaryStreamTest.PutULEB128OneByte (763 of 1977)
PASS: lldb-api :: commands/settings/TestSettings.py (764 of 1977)
PASS: lldb-api :: commands/frame/select/TestFrameSelect.py (765 of 1977)
PASS: lldb-unit :: Utility/./UtilityTests/ArchSpecTest.TestSetTriple (766 of 1977)
PASS: lldb-api :: commands/expression/call-throws/TestCallThatThrows.py (767 of 1977)
PASS: lldb-unit :: Host/./HostTests/FileSystemTest.EnumerateDirectory (768 of 1977)
PASS: lldb-unit :: Utility/./UtilityTests/StringListTest.CopyListSingle (769 of 1977)
PASS: lldb-unit :: Utility/./UtilityTests/BinaryStreamTest.PutSLEB128Zero (770 of 1977)
PASS: lldb-api :: functionalities/inferior-crashing/recursive-inferior/TestRecursiveInferior.py (771 of 1977)
PASS: lldb-api :: python_api/objc_type/TestObjCType.py (772 of 1977)
PASS: lldb-shell :: ObjectFile/ELF/basic-info.yaml (773 of 1977)
PASS: lldb-api :: lang/objc/objc-stepping/TestObjCStepping.py (774 of 1977)
PASS: lldb-unit :: Utility/./UtilityTests/SerializationRountripTest.SerializeDeserializeObjectReference (775 of 1977)
PASS: lldb-unit :: Symbol/./SymbolTests/SymbolsTest.LocateExecutableSymbolFileForUnknownExecutableAndMissingSymbolFile (776 of 1977)
PASS: lldb-shell :: SymbolFile/DWARF/dwarf5-index-is-used.cpp (777 of 1977)
PASS: lldb-shell :: SymbolFile/Breakpad/unwind-via-stack-win-no-memory-info.yaml (778 of 1977)
PASS: lldb-api :: lang/objc/blocks/TestObjCIvarsInBlocks.py (779 of 1977)
PASS: lldb-api :: tools/lldb-vscode/breakpoint-events/TestVSCode_breakpointEvents.py (780 of 1977)
PASS: lldb-api :: functionalities/inferior-crashing/TestInferiorCrashingStep.py (781 of 1977)
PASS: lldb-api :: lang/objc/objc-builtin-types/TestObjCBuiltinTypes.py (782 of 1977)
PASS: lldb-shell :: Process/TestEnvironment.test (783 of 1977)
PASS: lldb-api :: tools/lldb-server/TestLldbGdbServer.py (784 of 1977)
PASS: lldb-shell :: BuildScript/compiler-full-path.test (785 of 1977)
UNSUPPORTED: lldb-shell :: Register/arm-fp-read.test (786 of 1977)
PASS: lldb-unit :: Symbol/./SymbolTests/PostfixExpression.ParseFPOProgram (787 of 1977)
PASS: lldb-unit :: Utility/./UtilityTests/RangeDataVector.CustomSort (788 of 1977)
UNSUPPORTED: lldb-shell :: SymbolFile/NativePDB/ast-functions-msvc.cpp (789 of 1977)
PASS: lldb-unit :: Utility/./UtilityTests/StringLexerTest.Next (790 of 1977)
PASS: lldb-unit :: Utility/./UtilityTests/ConstStringTest.CompareStringRef (791 of 1977)
PASS: lldb-unit :: Symbol/./SymbolTests/DWARFCallFrameInfoTest.Basic_dwarf3 (792 of 1977)
PASS: lldb-api :: commands/expression/import-std-module/forward_list/TestForwardListFromStdModule.py (793 of 1977)
PASS: lldb-api :: functionalities/value_md5_crash/TestValueMD5Crash.py (794 of 1977)
PASS: lldb-api :: commands/expression/char/TestExprsChar.py (795 of 1977)
PASS: lldb-unit :: Utility/./UtilityTests/StringListTest.AppendListCStringArrayEmpty (796 of 1977)
PASS: lldb-shell :: Quit/TestQuitExitCodeTooManyArgs.test (797 of 1977)
PASS: lldb-api :: tools/lldb-server/TestGdbRemote_vCont.py (798 of 1977)
PASS: lldb-api :: python_api/value/TestValueAPI.py (799 of 1977)
PASS: lldb-unit :: Utility/./UtilityTests/ScalarTest.ComparisonFloat (800 of 1977)
UNSUPPORTED: lldb-api :: tools/lldb-server/platform-process-connect/TestPlatformProcessConnect.py (801 of 1977)
PASS: lldb-unit :: Utility/./UtilityTests/ConstStringTest.NullAndEmptyStates (802 of 1977)
PASS: lldb-unit :: Utility/./UtilityTests/StreamTest.ChangingByteOrder (803 of 1977)
PASS: lldb-api :: commands/statistics/basic/TestStats.py (804 of 1977)
PASS: lldb-unit :: Utility/./UtilityTests/StringListTest.AppendStringMove (805 of 1977)
PASS: lldb-unit :: Utility/./UtilityTests/StringListTest.InsertStringAtIndexStdString (806 of 1977)
PASS: lldb-unit :: Utility/./UtilityTests/RangeTest.Union (807 of 1977)
PASS: lldb-unit :: Core/./LLDBCoreTests/MangledTest.NameIndexes_FindFunctionSymbols (808 of 1977)
PASS: lldb-unit :: SymbolFile/NativePDB/./SymbolFileNativePDBTests/PDBFPOProgramToDWARFExpressionTests.InvalidAssignmentMultiple (809 of 1977)
PASS: lldb-api :: functionalities/thread/concurrent_events/TestConcurrentCrashWithWatchpointBreakpointSignal.py (810 of 1977)
PASS: lldb-api :: lang/c/enum_types/TestEnumTypes.py (811 of 1977)
PASS: lldb-unit :: Process/minidump/./LLDBMinidumpTests/MinidumpParserTest.GetPidWindows (812 of 1977)
PASS: lldb-unit :: Utility/./UtilityTests/StreamTest.PutBytesAsRawHex8ToLittleEndian (813 of 1977)
PASS: lldb-unit :: Utility/./UtilityTests/OptionsWithRawTest.SingleWordSuffix (814 of 1977)
PASS: lldb-api :: lang/c/local_types/TestUseClosestType.py (815 of 1977)
PASS: lldb-api :: commands/expression/import-std-module/unique_ptr/TestUniquePtrFromStdModule.py (816 of 1977)
PASS: lldb-unit :: Utility/./UtilityTests/SerializationRountripTest.SerializeDeserializeCString (817 of 1977)
PASS: lldb-unit :: Utility/./UtilityTests/StringLexerTest.NextIf (818 of 1977)
PASS: lldb-unit :: Signals/./SignalsTests/UnixSignalsTest.GetInfo (819 of 1977)
PASS: lldb-unit :: UnwindAssembly/x86/./UnwindAssemblyx86Tests/Testx86AssemblyInspectionEngine.TestPushR12 (820 of 1977)
PASS: lldb-unit :: Utility/./UtilityTests/ArgsTest.StringListConstructor (821 of 1977)
PASS: lldb-unit :: Symbol/./SymbolTests/TestClangASTImporter.ImportInvalidType (822 of 1977)
PASS: lldb-api :: python_api/formatters/TestFormattersSBAPI.py (823 of 1977)
PASS: lldb-api :: lang/cpp/namespace/TestNamespace.py (824 of 1977)
PASS: lldb-unit :: Utility/./UtilityTests/RangeDataVector.FindEntryThatContains_Overlap (825 of 1977)
PASS: lldb-unit :: Utility/./UtilityTests/StringLexerTest.HasAtLeast (826 of 1977)
PASS: lldb-api :: commands/expression/scoped_enums/TestScopedEnumType.py (827 of 1977)
PASS: lldb-unit :: Utility/./UtilityTests/StreamTest.PutCString (828 of 1977)
PASS: lldb-unit :: Expression/./ExpressionTests/CppModuleConfigurationTest.IgnoreLibStdCpp (829 of 1977)
PASS: lldb-api :: functionalities/thread/backtrace_limit/TestBacktraceLimit.py (830 of 1977)
PASS: lldb-shell :: Reproducer/TestMultipleTargets.test (831 of 1977)
PASS: lldb-api :: functionalities/multiword-commands/TestMultiWordCommands.py (832 of 1977)
PASS: lldb-unit :: Utility/./UtilityTests/ArchSpecTest.TestParseMachCPUDashSubtypeTripleSimple (833 of 1977)
PASS: lldb-unit :: Utility/./UtilityTests/ListenerTest.GetEventImmediate (834 of 1977)
PASS: lldb-shell :: Breakpoint/dummy-target.test (835 of 1977)
UNSUPPORTED: lldb-api :: functionalities/data-formatter/data-formatter-stl/libstdcpp/smart_ptr/TestDataFormatterStdSmartPtr.py (836 of 1977)
PASS: lldb-shell :: Commands/command-thread-select.test (837 of 1977)
UNSUPPORTED: lldb-api :: functionalities/signal/handle-segv/TestHandleSegv.py (838 of 1977)
PASS: lldb-api :: commands/expression/import-std-module/shared_ptr/TestSharedPtrFromStdModule.py (839 of 1977)
PASS: lldb-unit :: Process/minidump/./LLDBMinidumpTests/MinidumpParserTest.GetMemoryRegionInfoFromMemoryList (840 of 1977)
PASS: lldb-api :: functionalities/thread/concurrent_events/TestConcurrentTwoBreakpointsOneWatchpoint.py (841 of 1977)
PASS: lldb-unit :: UnwindAssembly/x86/./UnwindAssemblyx86Tests/Testx86AssemblyInspectionEngine.TestSimplei386ugmented (842 of 1977)
PASS: lldb-shell :: Reproducer/Functionalities/TestStepping.test (843 of 1977)
PASS: lldb-api :: functionalities/breakpoint/cpp_exception/TestCPPExceptionBreakpoint.py (844 of 1977)
PASS: lldb-unit :: Core/./LLDBCoreTests/MangledTest.ResultForValidName (845 of 1977)
PASS: lldb-unit :: Utility/./UtilityTests/FileSpecTest.Equal (846 of 1977)
PASS: lldb-unit :: UnwindAssembly/x86/./UnwindAssemblyx86Tests/Testx86AssemblyInspectionEngine.TestSimple64bitFrameFunction (847 of 1977)
PASS: lldb-unit :: Utility/./UtilityTests/DataExtractorTest.GetCStrUnterminated (848 of 1977)
PASS: lldb-api :: sample_test/TestSampleInlineTest.py (849 of 1977)
PASS: lldb-unit :: Interpreter/./InterpreterTests/CompletionTest.FileCompletionAbsolute (850 of 1977)
PASS: lldb-shell :: ScriptInterpreter/Python/crashlog.test (851 of 1977)
PASS: lldb-api :: commands/process/launch-with-shellexpand/TestLaunchWithShellExpand.py (852 of 1977)
UNSUPPORTED: lldb-api :: android/platform/TestDefaultCacheLineSize.py (853 of 1977)
PASS: lldb-shell :: SymbolFile/DWARF/dir-separator-windows.s (854 of 1977)
PASS: lldb-api :: lang/cpp/std-function-step-into-callable/TestStdFunctionStepIntoCallable.py (855 of 1977)
PASS: lldb-api :: functionalities/data-formatter/data-formatter-proper-plurals/TestFormattersOneIsSingular.py (856 of 1977)
PASS: lldb-unit :: Utility/./UtilityTests/ConstStringTest.format_provider (857 of 1977)
PASS: lldb-unit :: tools/lldb-server/tests/./LLDBServerTests/TestBase.DebugserverEnv (858 of 1977)
PASS: lldb-unit :: Utility/./UtilityTests/ArgsTest.ReplaceArgumentAtIndexOutOfRange (859 of 1977)
PASS: lldb-unit :: Utility/./UtilityTests/StreamTest.AddressRangeInvalidRange (860 of 1977)
PASS: lldb-unit :: Utility/./UtilityTests/ConstStringTest.MangledCounterpart (861 of 1977)
PASS: lldb-unit :: Utility/./UtilityTests/BinaryStreamTest.PutULEB128TwoBytes (862 of 1977)
PASS: lldb-api :: commands/target/dump-symtab-demangle/TestDumpSymtabDemangle.py (863 of 1977)
PASS: lldb-api :: functionalities/breakpoint/auto_continue/TestBreakpointAutoContinue.py (864 of 1977)
UNSUPPORTED: lldb-api :: benchmarks/expression/TestRepeatedExprs.py (865 of 1977)
PASS: lldb-unit :: ObjectFile/ELF/./ObjectFileELFTests/ObjectFileELFTest.GetSymtab_NoSymEntryPointArmAddressClass (866 of 1977)
PASS: lldb-api :: lang/cpp/dynamic-value-same-basename/TestDynamicValueSameBase.py (867 of 1977)
PASS: lldb-unit :: Platform/./LLDBPlatformTests/PlatformDarwinTest.TestParseVersionBuildDir (868 of 1977)
PASS: lldb-unit :: Utility/./UtilityTests/StringListTest.Join (869 of 1977)
FAIL: lldb-api :: lang/objc/ptr_refs/TestPtrRefsObjC.py (870 of 1977)
******************** TEST 'lldb-api :: lang/objc/ptr_refs/TestPtrRefsObjC.py' FAILED ********************
Script:
--
/usr/local/bin/python /Users/buildslave/jenkins/workspace/lldb-cmake-sanitized/llvm-project/lldb/test/API/dotest.py --arch x86_64 -s /Users/buildslave/jenkins/workspace/lldb-cmake-sanitized/lldb-build/lldb-test-traces -S nm -u CXXFLAGS -u CFLAGS --codesign-identity lldb_codesign --server /Users/buildslave/jenkins/workspace/lldb-cmake-sanitized/lldb-build/./bin/debugserver --arch x86_64 --build-dir /Users/buildslave/jenkins/workspace/lldb-cmake-sanitized/lldb-build/lldb-test-build.noindex -s=/Users/buildslave/jenkins/workspace/lldb-cmake-sanitized/test/logs -t --env TERM=vt100 --env LLVM_LIBS_DIR=/Users/buildslave/jenkins/workspace/lldb-cmake-sanitized/lldb-build/./lib --inferior-env ASAN_OPTIONS=detect_stack_use_after_return=1 --inferior-env DYLD_INSERT_LIBRARIES=/Users/buildslave/jenkins/workspace/lldb-cmake-sanitized/host-compiler/lib/clang/11.0.0/lib/darwin/libclang_rt.asan_osx_dynamic.dylib --build-dir /Users/buildslave/jenkins/workspace/lldb-cmake-sanitized/lldb-build/lldb-test-build.noindex --lldb-module-cache-dir /Users/buildslave/jenkins/workspace/lldb-cmake-sanitized/lldb-build/lldb-test-build.noindex/module-cache-lldb/lldb-api --clang-module-cache-dir /Users/buildslave/jenkins/workspace/lldb-cmake-sanitized/lldb-build/lldb-test-build.noindex/module-cache-clang/lldb-api --executable /Users/buildslave/jenkins/workspace/lldb-cmake-sanitized/lldb-build/./bin/lldb --compiler /Users/buildslave/jenkins/workspace/lldb-cmake-sanitized/lldb-build/./bin/clang --dsymutil /Users/buildslave/jenkins/workspace/lldb-cmake-sanitized/lldb-build/./bin/dsymutil --filecheck /Users/buildslave/jenkins/workspace/lldb-cmake-sanitized/lldb-build/./bin/FileCheck --lldb-libs-dir /Users/buildslave/jenkins/workspace/lldb-cmake-sanitized/lldb-build/./lib /Users/buildslave/jenkins/workspace/lldb-cmake-sanitized/llvm-project/lldb/test/API/lang/objc/ptr_refs -p TestPtrRefsObjC.py
--
Exit Code: 1

Hide Details

Command Output (stdout): -- lldb version 11.0.99 clang revision c0aa97b632761b658e1bc35ca15119629b2cff0e llvm revision c0aa97b632761b658e1bc35ca15119629b2cff0e "crashlog" and "save_crashlog" command installed, use the "--help" option for detailed help "malloc_info", "ptr_refs", "cstr_refs", "find_variable", and "objc_refs" commands have been installed, use the "--help" options on these commands for detailed help. LLDB library dir: /Users/buildslave/jenkins/workspace/lldb-cmake-sanitized/lldb-build/bin LLDB import library dir: /Users/buildslave/jenkins/workspace/lldb-cmake-sanitized/lldb-build/./lib libstdcxx tests will not be run because: Don't know how to build with libstdcxx on macosx Skipping following debug info categories: ['dwo'] 0x00007ffee68b3468: stack in frame #0 of thread #1: tid 0xc89beb in variable at 0x7ffee68b3468: (MyClass *) self = 0x00006020000000d0 0x00007ffee68b33e0: stack (red zone)

Hide Details

-- Command Output (stderr): -- error: 'ptr_refs' is not a valid command. error: 'ptr_refs' is not a valid command.

Hide Details

Session logs for test failures/errors/unexpected successes will go into directory '/Users/buildslave/jenkins/workspace/lldb-cmake-sanitized/test/logs' Command invoked: /Users/buildslave/jenkins/workspace/lldb-cmake-sanitized/llvm-project/lldb/test/API/dotest.py --arch x86_64 -s /Users/buildslave/jenkins/workspace/lldb-cmake-sanitized/lldb-build/lldb-test-traces -S nm -u CXXFLAGS -u CFLAGS --codesign-identity lldb_codesign --server /Users/buildslave/jenkins/workspace/lldb-cmake-sanitized/lldb-build/./bin/debugserver --arch x86_64 --build-dir /Users/buildslave/jenkins/workspace/lldb-cmake-sanitized/lldb-build/lldb-test-build.noindex -s=/Users/buildslave/jenkins/workspace/lldb-cmake-sanitized/test/logs -t --env TERM=vt100 --env LLVM_LIBS_DIR=/Users/buildslave/jenkins/workspace/lldb-cmake-sanitized/lldb-build/./lib --inferior-env ASAN_OPTIONS=detect_stack_use_after_return=1 --inferior-env DYLD_INSERT_LIBRARIES=/Users/buildslave/jenkins/workspace/lldb-cmake-sanitized/host-compiler/lib/clang/11.0.0/lib/darwin/libclang_rt.asan_osx_dynamic.dylib --build-dir /Users/buildslave/jenkins/workspace/lldb-cmake-sanitized/lldb-build/lldb-test-build.noindex --lldb-module-cache-dir /Users/buildslave/jenkins/workspace/lldb-cmake-sanitized/lldb-build/lldb-test-build.noindex/module-cache-lldb/lldb-api --clang-module-cache-dir /Users/buildslave/jenkins/workspace/lldb-cmake-sanitized/lldb-build/lldb-test-build.noindex/module-cache-clang/lldb-api --executable /Users/buildslave/jenkins/workspace/lldb-cmake-sanitized/lldb-build/./bin/lldb --compiler /Users/buildslave/jenkins/workspace/lldb-cmake-sanitized/lldb-build/./bin/clang --dsymutil /Users/buildslave/jenkins/workspace/lldb-cmake-sanitized/lldb-build/./bin/dsymutil --filecheck /Users/buildslave/jenkins/workspace/lldb-cmake-sanitized/lldb-build/./bin/FileCheck --lldb-libs-dir /Users/buildslave/jenkins/workspace/lldb-cmake-sanitized/lldb-build/./lib /Users/buildslave/jenkins/workspace/lldb-cmake-sanitized/llvm-project/lldb/test/API/lang/objc/ptr_refs -p TestPtrRefsObjC.py Change dir to: /Users/buildslave/jenkins/workspace/lldb-cmake-sanitized/llvm-project/lldb/test/API/lang/objc/ptr_refs runCmd: settings clear -all output:

Hide Details

runCmd: settings set symbols.enable-external-lookup false output:

Hide Details

runCmd: settings set target.auto-apply-fixits false output:

Hide Details

runCmd: settings set plugin.process.gdb-remote.packet-timeout 60 output:

Hide Details

runCmd: settings set symbols.clang-modules-cache-path "/Users/buildslave/jenkins/workspace/lldb-cmake-sanitized/lldb-build/lldb-test-build.noindex/module-cache-lldb/lldb-api" output:

Hide Details

runCmd: settings set use-color false output:

Hide Details

runCmd: setting set target.prefer-dynamic-value no-dynamic-values output:

Hide Details

runCmd: settings set target.env-vars ASAN_OPTIONS=detect_stack_use_after_return=1 DYLD_INSERT_LIBRARIES=/Users/buildslave/jenkins/workspace/lldb-cmake-sanitized/host-compiler/lib/clang/11.0.0/lib/darwin/libclang_rt.asan_osx_dynamic.dylib output:

Hide Details

runCmd: script import lldb.macosx.heap output: "crashlog" and "save_crashlog" command installed, use the "--help" option for detailed help "malloc_info", "ptr_refs", "cstr_refs", "find_variable", and "objc_refs" commands have been installed, use the "--help" options on these commands for detailed help.

Hide Details

Hide Details

runCmd: ptr_refs self output: 0x00007ffee68b3468: stack in frame #0 of thread #1: tid 0xc89beb in variable at 0x7ffee68b3468: (MyClass *) self = 0x00006020000000d0 0x00007ffee68b33e0: stack (red zone)

Hide Details

Hide Details

Expecting sub string: malloc Not matched

Hide Details

FAIL: LLDB (/Users/buildslave/jenkins/workspace/lldb-cmake-sanitized/lldb-build/bin/clang-11-x86_64) :: test_ptr_refs_dsym (TestPtrRefsObjC.TestPtrRefsObjC) <bound method SBProcess.Kill of <lldb.SBProcess; proxy of <Swig Object of type 'lldb::SBProcess *' at 0x11f4ce8a0> >>: success

Hide Details

runCmd: settings clear -all output:

Hide Details

runCmd: settings set symbols.enable-external-lookup false output:

Hide Details

runCmd: settings set target.auto-apply-fixits false output:

Hide Details

runCmd: settings set plugin.process.gdb-remote.packet-timeout 60 output:

Hide Details

runCmd: settings set symbols.clang-modules-cache-path "/Users/buildslave/jenkins/workspace/lldb-cmake-sanitized/lldb-build/lldb-test-build.noindex/module-cache-lldb/lldb-api" output:

Hide Details

runCmd: settings set use-color false output:

Hide Details

runCmd: setting set target.prefer-dynamic-value no-dynamic-values output:

Hide Details

runCmd: settings set target.env-vars ASAN_OPTIONS=detect_stack_use_after_return=1 DYLD_INSERT_LIBRARIES=/Users/buildslave/jenkins/workspace/lldb-cmake-sanitized/host-compiler/lib/clang/11.0.0/lib/darwin/libclang_rt.asan_osx_dynamic.dylib output:

Hide Details

runCmd: script import lldb.macosx.heap output:

Hide Details

runCmd: ptr_refs self runCmd failed! error: 'ptr_refs' is not a valid command.

Hide Details

Hide Details

XFAIL: LLDB (/Users/buildslave/jenkins/workspace/lldb-cmake-sanitized/lldb-build/bin/clang-11-x86_64) :: test_ptr_refs_dwarf (TestPtrRefsObjC.TestPtrRefsObjC) <bound method SBProcess.Kill of <lldb.SBProcess; proxy of <Swig Object of type 'lldb::SBProcess *' at 0x108173990> >>: success

Hide Details

UNSUPPORTED: LLDB (/Users/buildslave/jenkins/workspace/lldb-cmake-sanitized/lldb-build/bin/clang-11-x86_64) :: test_ptr_refs_dwo (TestPtrRefsObjC.TestPtrRefsObjC) (test case does not fall in any category of interest for this run) runCmd: settings clear -all output:

Hide Details

runCmd: settings set symbols.enable-external-lookup false output:

Hide Details

runCmd: settings set target.auto-apply-fixits false output:

Hide Details

runCmd: settings set plugin.process.gdb-remote.packet-timeout 60 output:

Hide Details

runCmd: settings set symbols.clang-modules-cache-path "/Users/buildslave/jenkins/workspace/lldb-cmake-sanitized/lldb-build/lldb-test-build.noindex/module-cache-lldb/lldb-api" output:

Hide Details

runCmd: settings set use-color false output:

Hide Details

runCmd: setting set target.prefer-dynamic-value no-dynamic-values output:

Hide Details

runCmd: settings set target.env-vars ASAN_OPTIONS=detect_stack_use_after_return=1 DYLD_INSERT_LIBRARIES=/Users/buildslave/jenkins/workspace/lldb-cmake-sanitized/host-compiler/lib/clang/11.0.0/lib/darwin/libclang_rt.asan_osx_dynamic.dylib output:

Hide Details

runCmd: script import lldb.macosx.heap output:

Hide Details

runCmd: ptr_refs self runCmd failed! error: 'ptr_refs' is not a valid command.

Hide Details

Hide Details

XFAIL: LLDB (/Users/buildslave/jenkins/workspace/lldb-cmake-sanitized/lldb-build/bin/clang-11-x86_64) :: test_ptr_refs_gmodules (TestPtrRefsObjC.TestPtrRefsObjC) <bound method SBProcess.Kill of <lldb.SBProcess; proxy of <Swig Object of type 'lldb::SBProcess *' at 0x11f4ce1e0> >>: success

Hide Details

Restore dir to: /Users/buildslave/jenkins/workspace/lldb-cmake-sanitized/lldb-build/tools/lldb/test ====================================================================== FAIL: test_ptr_refs_dsym (TestPtrRefsObjC.TestPtrRefsObjC) Test the ptr_refs tool on Darwin with Objective-C ---------------------------------------------------------------------- Traceback (most recent call last): File "/Users/buildslave/jenkins/workspace/lldb-cmake-sanitized/llvm-project/lldb/packages/Python/lldbsuite/test/lldbtest.py", line 1751, in test_method return attrvalue(self) File "/Users/buildslave/jenkins/workspace/lldb-cmake-sanitized/llvm-project/lldb/packages/Python/lldbsuite/test/decorators.py", line 110, in wrapper func(*args, **kwargs) File "/Users/buildslave/jenkins/workspace/lldb-cmake-sanitized/llvm-project/lldb/test/API/lang/objc/ptr_refs/TestPtrRefsObjC.py", line 47, in test_ptr_refs self.expect("ptr_refs self", substrs=["malloc", "stack"]) File "/Users/buildslave/jenkins/workspace/lldb-cmake-sanitized/llvm-project/lldb/packages/Python/lldbsuite/test/lldbtest.py", line 2391, in expect if msg else EXP_MSG(str, output, exe)) AssertionError: False is not True : 'ptr_refs self' returns expected result, got '0x00007ffee68b3468: stack in frame #0 of thread #1: tid 0xc89beb in variable at 0x7ffee68b3468: (MyClass *) self = 0x00006020000000d0 0x00007ffee68b33e0: stack (red zone)' Config=x86_64-/Users/buildslave/jenkins/workspace/lldb-cmake-sanitized/lldb-build/bin/clang-11 ---------------------------------------------------------------------- Ran 4 tests in 22.925s

Hide Details

RESULT: FAILED (0 passes, 1 failures, 0 errors, 1 skipped, 2 expected failures, 0 unexpected successes)

Hide Details

--

Hide Details

******************** PASS: lldb-api :: functionalities/data-formatter/stringprinter/TestStringPrinter.py (871 of 1977) PASS: lldb-shell :: ObjectFile/wasm/stripped-debug-sections.yaml (872 of 1977) PASS: lldb-api :: functionalities/data-formatter/data-formatter-stl/libcxx/vector/TestDataFormatterLibcxxVector.py (873 of 1977) PASS: lldb-unit :: Language/Highlighting/./HighlighterTests/HighlighterTest.ClangIdentifiers (874 of 1977) PASS: lldb-api :: functionalities/data-formatter/data-formatter-stl/libcxx/unordered/TestDataFormatterUnordered.py (875 of 1977) PASS: lldb-unit :: Symbol/./SymbolTests/TestTypeSystemClang.TestBuiltinTypeForEncodingAndBitSize (876 of 1977) PASS: lldb-api :: commands/process/attach/TestProcessAttach.py (877 of 1977) PASS: lldb-unit :: UnwindAssembly/x86/./UnwindAssemblyx86Tests/Testx86AssemblyInspectionEngine.TestPushEBX (878 of 1977) PASS: lldb-shell :: Unwind/eh-frame-dwarf-unwind.test (879 of 1977) PASS: lldb-api :: commands/expression/save_jit_objects/TestSaveJITObjects.py (880 of 1977) PASS: lldb-shell :: SymbolFile/NativePDB/source-list.cpp (881 of 1977) PASS: lldb-unit :: Utility/./UtilityTests/BinaryStreamTest.PutULEB128FiveBytes (882 of 1977) PASS: lldb-unit :: Platform/./LLDBPlatformTests/PlatformDarwinTest.GetSDKNameForType (883 of 1977) PASS: lldb-shell :: SymbolFile/DWARF/debug-types-missing-signature.test (884 of 1977) PASS: lldb-api :: functionalities/gdb_remote_client/TestWriteMemory.py (885 of 1977) PASS: lldb-api :: functionalities/breakpoint/dummy_target_breakpoints/TestBreakpointsWithNoTargets.py (886 of 1977) PASS: lldb-api :: commands/expression/po_verbosity/TestPoVerbosity.py (887 of 1977) PASS: lldb-unit :: Language/Highlighting/./HighlighterTests/HighlighterTest.ClangEmptyInput (888 of 1977) PASS: lldb-api :: functionalities/data-formatter/data-formatter-synthval/TestDataFormatterSynthVal.py (889 of 1977) PASS: lldb-shell :: ObjectFile/PECOFF/basic-info-arm.yaml (890 of 1977) PASS: lldb-api :: commands/settings/quoting/TestQuoting.py (891 of 1977) PASS: lldb-api :: lang/objc/hidden-ivars/TestHiddenIvars.py (892 of 1977) PASS: lldb-api :: commands/expression/import-std-module/unique_ptr-dbg-info-content/TestUniquePtrDbgInfoContent.py (893 of 1977) PASS: lldb-unit :: SymbolFile/NativePDB/./SymbolFileNativePDBTests/PDBFPOProgramToDWARFExpressionTests.InvalidAssignmentSingle (894 of 1977) PASS: lldb-shell :: SymbolFile/DWARF/DW_OP_piece-struct.s (895 of 1977) PASS: lldb-api :: commands/expression/import-std-module/conflicts/TestStdModuleWithConflicts.py (896 of 1977) PASS: lldb-api :: python_api/sbvalue_persist/TestSBValuePersist.py (897 of 1977) UNSUPPORTED: lldb-api :: api/multiple-debuggers/TestMultipleDebuggers.py (898 of 1977) PASS: lldb-api :: functionalities/paths/TestPaths.py (899 of 1977) PASS: lldb-unit :: Process/gdb-remote/./ProcessGdbRemoteTests/GDBRemoteCommunicationClientTest.SendStartTracePacket (900 of 1977) PASS: lldb-api :: functionalities/data-formatter/data-formatter-stl/libcxx/variant/TestDataFormatterLibcxxVariant.py (901 of 1977) PASS: lldb-unit :: Language/Highlighting/./HighlighterTests/HighlighterTest.ClangOperators (902 of 1977) PASS: lldb-shell :: SymbolFile/NativePDB/global-classes.cpp (903 of 1977) PASS: lldb-api :: functionalities/data-formatter/array_typedef/TestArrayTypedef.py (904 of 1977) PASS: lldb-unit :: ScriptInterpreter/Python/./ScriptInterpreterPythonTests/PythonDataObjectsTest.TestBorrowedReferences (905 of 1977) PASS: lldb-api :: commands/expression/rdar44436068/Test128BitsInteger.py (906 of 1977) PASS: lldb-api :: commands/frame/diagnose/dereference-argument/TestDiagnoseDereferenceArgument.py (907 of 1977) PASS: lldb-api :: python_api/interpreter/TestCommandInterpreterAPI.py (908 of 1977) PASS: lldb-unit :: Expression/./ExpressionTests/DWARFExpression.DW_OP_pick (909 of 1977) PASS: lldb-shell :: SymbolFile/DWARF/debug-types-dwarf5.s (910 of 1977) UNSUPPORTED: lldb-api :: functionalities/darwin_log/filter/exact_match/activity/TestDarwinLogFilterMatchActivity.py (911 of 1977) PASS: lldb-shell :: ObjectFile/Breakpad/discontiguous-sections.test (912 of 1977) UNSUPPORTED: lldb-api :: lang/cpp/function-template-parameter-pack/TestFunctionTemplateParameterPack.py (913 of 1977) PASS: lldb-unit :: Utility/./UtilityTests/StreamTest.PutCharWhitespace (914 of 1977) PASS: lldb-unit :: Process/gdb-remote/./ProcessGdbRemoteTests/GDBRemoteCommunicationClientTest.GetModulesInfo (915 of 1977) PASS: lldb-api :: functionalities/thread/crash_during_step/TestCrashDuringStep.py (916 of 1977) PASS: lldb-shell :: Reproducer/TestDriverOptions.test (917 of 1977) PASS: lldb-unit :: Utility/./UtilityTests/StringListTest.JoinThree (918 of 1977) PASS: lldb-unit :: UnwindAssembly/x86/./UnwindAssemblyx86Tests/Testx86AssemblyInspectionEngine.TestSpArithx86_64Augmented (919 of 1977) PASS: lldb-unit :: Utility/./UtilityTests/StreamTeeTest.Constructor2Streams (920 of 1977) PASS: lldb-api :: functionalities/thread/concurrent_events/TestConcurrentTwoBreakpointsOneSignal.py (921 of 1977) PASS: lldb-unit :: Utility/./UtilityTests/UriParserTest.PortOverflow (922 of 1977) PASS: lldb-unit :: Utility/./UtilityTests/AnsiTerminal.KnownPrefix (923 of 1977) PASS: lldb-api :: commands/expression/timeout/TestCallWithTimeout.py (924 of 1977) PASS: lldb-unit :: Utility/./UtilityTests/RecordReplayTest.InstrumentedBarRef (925 of 1977) PASS: lldb-unit :: Language/Highlighting/./HighlighterTests/HighlighterTest.FallbackHighlighter (926 of 1977) PASS: lldb-shell :: SymbolFile/DWARF/dwarf5-debug_line.s (927 of 1977) PASS: lldb-unit :: Expression/./ExpressionTests/CppModuleConfigurationTest.UnrelatedLibrary (928 of 1977) PASS: lldb-unit :: ScriptInterpreter/Python/./ScriptInterpreterPythonTests/PythonDataObjectsTest.TestOwnedReferences (929 of 1977) PASS: lldb-unit :: Language/Highlighting/./HighlighterTests/HighlighterTest.DefaultHighlighter (930 of 1977) PASS: lldb-api :: functionalities/breakpoint/breakpoint_hit_count/TestBreakpointHitCount.py (931 of 1977) PASS: lldb-shell :: ExecControl/StopHook/stop-hook.test (932 of 1977) PASS: lldb-unit :: Utility/./UtilityTests/RangeDataVector.FindEntryThatContains (933 of 1977) PASS: lldb-api :: python_api/value/empty_class/TestValueAPIEmptyClass.py (934 of 1977) PASS: lldb-api :: functionalities/unwind/sigtramp/TestSigtrampUnwind.py (935 of 1977) PASS: lldb-api :: lang/objc/modules-hash-mismatch/TestClangModulesHashMismatch.py (936 of 1977) PASS: lldb-api :: functionalities/gdb_remote_client/TestGDBRemoteClient.py (937 of 1977) PASS: lldb-api :: lang/cpp/type_lookup/TestCppTypeLookup.py (938 of 1977) PASS: lldb-api :: commands/watchpoints/watchpoint_disable/TestWatchpointDisable.py (939 of 1977) PASS: lldb-unit :: Utility/./UtilityTests/ProcessInstanceInfoMatch.Name (940 of 1977) PASS: lldb-api :: lang/objcxx/objcxx-ivar-vector/TestIvarVector.py (941 of 1977) PASS: lldb-unit :: Symbol/./SymbolTests/Type.GetTypeScopeAndBasename (942 of 1977) PASS: lldb-unit :: Interpreter/./InterpreterTests/CompletionTest.DirCompletionUsername (943 of 1977) PASS: lldb-api :: functionalities/target_var/TestTargetVar.py (944 of 1977) PASS: lldb-api :: lang/c/set_values/TestSetValues.py (945 of 1977) PASS: lldb-unit :: Host/./HostTests/NativeProcessProtocolTest.ReadCStringFromMemory (946 of 1977) PASS: lldb-api :: lang/c/strings/TestCStrings.py (947 of 1977) PASS: lldb-api :: commands/watchpoints/watchpoint_on_vectors/TestValueOfVectorVariable.py (948 of 1977) PASS: lldb-unit :: Utility/./UtilityTests/StreamTest.PutHex32ByteOrderLittle (949 of 1977) PASS: lldb-api :: functionalities/tail_call_frames/disambiguate_call_site/TestDisambiguateCallSite.py (950 of 1977) PASS: lldb-unit :: Utility/./UtilityTests/SubsystemRAIITest.SubsystemWithErrorFailure (951 of 1977) UNSUPPORTED: lldb-api :: lang/cpp/static_members/TestCPPStaticMembers.py (952 of 1977) PASS: lldb-shell :: SymbolFile/Breakpad/symtab.test (953 of 1977) PASS: lldb-api :: functionalities/data-formatter/nssetsynth/TestNSSetSynthetic.py (954 of 1977) PASS: lldb-shell :: Minidump/disassemble-no-module.yaml (955 of 1977) PASS: lldb-api :: macosx/duplicate-archive-members/TestDuplicateMembers.py (956 of 1977) PASS: lldb-unit :: ScriptInterpreter/Python/./ScriptInterpreterPythonTests/PythonDataObjectsTest.TestPythonIntegerToStructuredInteger (957 of 1977) PASS: lldb-unit :: Utility/./UtilityTests/LogTest.LLDB_LOG_nullptr (958 of 1977) PASS: lldb-api :: functionalities/data-formatter/frameformat_smallstruct/TestFrameFormatSmallStruct.py (959 of 1977) PASS: lldb-api :: functionalities/plugins/command_plugin/TestPluginCommands.py (960 of 1977) PASS: lldb-api :: commands/reproducer/invalid-args/TestInvalidArgsReproducer.py (961 of 1977) UNSUPPORTED: lldb-api :: benchmarks/libcxxlist/TestBenchmarkLibcxxList.py (962 of 1977) PASS: lldb-unit :: Utility/./UtilityTests/UriParserTest.BracketedHostname (963 of 1977) PASS: lldb-shell :: Settings/TestLineMarkerColor.test (964 of 1977) PASS: lldb-unit :: ObjectFile/PECOFF/./ObjectFilePECOFFTests/PECallFrameInfoTest.Chained_eh (965 of 1977) PASS: lldb-unit :: Host/./HostTests/NativeProcessProtocolTest.SetBreakpointFailWrite (966 of 1977) PASS: lldb-api :: commands/expression/import-std-module/stack/TestStackFromStdModule.py (967 of 1977) PASS: lldb-shell :: SymbolFile/NativePDB/break-by-line.cpp (968 of 1977) PASS: lldb-unit :: Utility/./UtilityTests/StringExtractorTest.InitEmpty (969 of 1977) PASS: lldb-unit :: Host/./HostTests/NativeProcessProtocolTest.SetBreakpointFailVerify (970 of 1977) PASS: lldb-api :: functionalities/memory-region/TestMemoryRegion.py (971 of 1977) PASS: lldb-shell :: Minidump/Windows/Sigsegv/sigsegv.test (972 of 1977) PASS: lldb-unit :: UnwindAssembly/x86/./UnwindAssemblyx86Tests/Testx86AssemblyInspectionEngine.TestPushR14 (973 of 1977) PASS: lldb-unit :: ObjectFile/ELF/./ObjectFileELFTests/ObjectFileELFTest.GetModuleSpecifications_EarlySectionHeaders (974 of 1977) PASS: lldb-unit :: Utility/./UtilityTests/StringListTest.LongestCommonPrefixSingleElement (975 of 1977) UNSUPPORTED: lldb-shell :: Register/x86-64-xmm16-read.test (976 of 1977) PASS: lldb-api :: functionalities/data-formatter/data-formatter-ptr-to-array/TestPtrToArrayFormatting.py (977 of 1977) PASS: lldb-shell :: VSCode/TestOptions.test (978 of 1977) PASS: lldb-unit :: Host/./HostTests/SocketTest.DomainListenConnectAccept (979 of 1977) PASS: lldb-unit :: Process/gdb-remote/./ProcessGdbRemoteTests/GDBRemoteCommunicationClientTest.GetMemoryRegionInfo (980 of 1977) PASS: lldb-unit :: Language/Highlighting/./HighlighterTests/HighlighterTest.ClangCursorPosBeforeOtherToken (981 of 1977) PASS: lldb-api :: commands/watchpoints/watchpoint_set_command/TestWatchLocationWithWatchSet.py (982 of 1977) PASS: lldb-unit :: Utility/./UtilityTests/BinaryStreamTest.PutULEB128EightBytes (983 of 1977) PASS: lldb-api :: functionalities/non-overlapping-index-variable-i/TestIndexVariable.py (984 of 1977) PASS: lldb-shell :: ObjectFile/wasm/unified-debug-sections.yaml (985 of 1977) UNSUPPORTED: lldb-shell :: Process/Windows/exception_access_violation.cpp (986 of 1977) PASS: lldb-unit :: Expression/./ExpressionTests/ClangHostTest.ComputeClangResourceDirectory (987 of 1977) PASS: lldb-api :: commands/watchpoints/hello_watchpoint/TestMyFirstWatchpoint.py (988 of 1977) PASS: lldb-shell :: Driver/TestFile.test (989 of 1977) PASS: lldb-unit :: Utility/./UtilityTests/RangeTest.ContainsRangeStartingFromZero (990 of 1977) PASS: lldb-unit :: Symbol/./SymbolTests/TestTypeSystemClang.TestGetTypeClassTypeOfExpr (991 of 1977) UNSUPPORTED: lldb-api :: iohandler/completion/TestIOHandlerCompletion.py (992 of 1977) PASS: lldb-unit :: Symbol/./SymbolTests/TestClangASTImporter.MetadataPropagationAfterCopying (993 of 1977) PASS: lldb-unit :: Utility/./UtilityTests/OptionsWithRawTest.TerminatedQuote (994 of 1977) XFAIL: lldb-shell :: Register/x86-64-ymm-write.test (995 of 1977) PASS: lldb-unit :: Utility/./UtilityTests/StringExtractorTest.GetHexBytes_Partial (996 of 1977) UNSUPPORTED: lldb-shell :: Unwind/unwind-plan-dwarf-dump.test (997 of 1977) PASS: lldb-api :: lang/cpp/unsigned_types/TestUnsignedTypes.py (998 of 1977) PASS: lldb-api :: lang/cpp/unique-types/TestUniqueTypes.py (999 of 1977) PASS: lldb-unit :: Process/gdb-remote/./ProcessGdbRemoteTests/GDBRemoteClientBaseTest.SendContinueAndInterrupt2PacketBug (1000 of 1977) PASS: lldb-api :: commands/expression/persistent_variables/TestPersistentVariables.py (1001 of 1977) PASS: lldb-unit :: Utility/./UtilityTests/StringListTest.AppendList (1002 of 1977) PASS: lldb-api :: commands/disassemble/basic/TestFrameDisassemble.py (1003 of 1977) PASS: lldb-unit :: Utility/./UtilityTests/ConstStringTest.UpdateMangledCounterpart (1004 of 1977) PASS: lldb-api :: commands/expression/import-std-module/deque-dbg-info-content/TestDbgInfoContentDequeFromStdModule.py (1005 of 1977) PASS: lldb-api :: commands/watchpoints/step_over_watchpoint/TestStepOverWatchpoint.py (1006 of 1977) PASS: lldb-api :: commands/expression/argument_passing_restrictions/TestArgumentPassingRestrictions.py (1007 of 1977) PASS: lldb-unit :: UnwindAssembly/x86/./UnwindAssemblyx86Tests/Testx86AssemblyInspectionEngine.TestPushExtended (1008 of 1977) PASS: lldb-unit :: Process/gdb-remote/./ProcessGdbRemoteTests/GDBRemoteCommunicationClientTest.SendGetTraceConfigPacket (1009 of 1977) UNSUPPORTED: lldb-api :: functionalities/data-formatter/data-formatter-stl/libstdcpp/vbool/TestDataFormatterStdVBool.py (1010 of 1977) PASS: lldb-api :: lang/cpp/char1632_t/TestChar1632T.py (1011 of 1977) PASS: lldb-api :: commands/expression/entry-bp/TestExprEntryBP.py (1012 of 1977) PASS: lldb-shell :: SymbolFile/DWARF/dir-separator-no-comp-dir.s (1013 of 1977) PASS: lldb-api :: lang/cpp/chained-calls/TestCppChainedCalls.py (1014 of 1977) PASS: lldb-unit :: Utility/./UtilityTests/StringExtractorTest.GetHexU8_Underflow_NoEof (1015 of 1977) PASS: lldb-unit :: Target/./TargetTests/MemoryRegionInfoTest.Formatv (1016 of 1977) PASS: lldb-unit :: ObjectFile/Breakpad/./ObjectFileBreakpadTests/FileRecord.parse (1017 of 1977) PASS: lldb-unit :: ObjectFile/ELF/./ObjectFileELFTests/ObjectFileELFTest.GetSymtab_NoSymEntryPointArmThumbAddressClass (1018 of 1977) PASS: lldb-unit :: Utility/./UtilityTests/RegisterValueTest.GetSet8 (1019 of 1977) UNSUPPORTED: lldb-api :: functionalities/asan/TestMemoryHistory.py (1020 of 1977) PASS: lldb-unit :: Utility/./UtilityTests/StreamTeeTest.AppendStream (1021 of 1977) UNSUPPORTED: lldb-shell :: Breakpoint/case-insensitive.test (1022 of 1977) PASS: lldb-unit :: Utility/./UtilityTests/StringListTest.GetMaxStringLengthEmpty (1023 of 1977) PASS: lldb-unit :: Core/./LLDBCoreTests/RichManglingContextTest.Basic (1024 of 1977) PASS: lldb-unit :: Host/./HostTests/FileSystemTest.Resolve (1025 of 1977) PASS: lldb-api :: functionalities/data-formatter/type_summary_list_arg/TestTypeSummaryListArg.py (1026 of 1977) PASS: lldb-unit :: Host/./HostTests/SocketTest.UDPConnect (1027 of 1977) PASS: lldb-api :: functionalities/conditional_break/TestConditionalBreak.py (1028 of 1977) PASS: lldb-unit :: SymbolFile/NativePDB/./SymbolFileNativePDBTests/PDBFPOProgramToDWARFExpressionTests.MissingTargetRegister (1029 of 1977) PASS: lldb-unit :: Utility/./UtilityTests/Predicate.WaitForValueNotEqualTo (1030 of 1977) PASS: lldb-api :: functionalities/return-value/TestReturnValue.py (1031 of 1977) PASS: lldb-shell :: SymbolFile/DWARF/debug-line-basic.s (1032 of 1977) PASS: lldb-unit :: Language/Highlighting/./HighlighterTests/HighlighterTest.ClangPPDirectives (1033 of 1977) PASS: lldb-unit :: Utility/./UtilityTests/Flags.IsClear (1034 of 1977) PASS: lldb-unit :: ScriptInterpreter/Python/./ScriptInterpreterPythonTests/PythonDataObjectsTest.TestPythonListValueEquality (1035 of 1977) PASS: lldb-api :: commands/expression/vector_of_enums/TestVectorOfEnums.py (1036 of 1977) PASS: lldb-unit :: Utility/./UtilityTests/StringExtractorTest.GetHexBytesAvail_Underflow (1037 of 1977) PASS: lldb-api :: functionalities/avoids-fd-leak/TestFdLeak.py (1038 of 1977) PASS: lldb-shell :: Register/x86-64-ymm-read.test (1039 of 1977) UNSUPPORTED: lldb-api :: commands/expression/macros/TestMacros.py (1040 of 1977) PASS: lldb-api :: lang/c/stepping/TestStepAndBreakpoints.py (1041 of 1977) PASS: lldb-shell :: Driver/TestNoUseColor.test (1042 of 1977) PASS: lldb-unit :: Process/minidump/./LLDBMinidumpTests/MinidumpParserTest.GetMemoryRegionInfoLinuxMaps (1043 of 1977) PASS: lldb-api :: functionalities/gdb_remote_client/TestJLink6Armv7RegisterDefinition.py (1044 of 1977) PASS: lldb-api :: python_api/value/change_values/TestChangeValueAPI.py (1045 of 1977) PASS: lldb-unit :: Host/./HostTests/File.GetWaitableHandleFileno (1046 of 1977) UNSUPPORTED: lldb-api :: linux/thread/create_during_instruction_step/TestCreateDuringInstructionStep.py (1047 of 1977) PASS: lldb-api :: lang/c/bitfields/TestBitfields.py (1048 of 1977) PASS: lldb-api :: commands/add-dsym/uuid/TestAddDsymCommand.py (1049 of 1977) PASS: lldb-unit :: Utility/./UtilityTests/LogTest.Unregister (1050 of 1977) PASS: lldb-unit :: Utility/./UtilityTests/ArgsTest.ReplaceArgumentAtIndexShort (1051 of 1977) PASS: lldb-api :: tools/lldb-server/TestGdbRemoteHostInfo.py (1052 of 1977) PASS: lldb-api :: commands/command/delete/TestCommandDelete.py (1053 of 1977) PASS: lldb-unit :: UnwindAssembly/x86/./UnwindAssemblyx86Tests/Testx86AssemblyInspectionEngine.TestPushR13 (1054 of 1977) PASS: lldb-api :: lang/objc/radar-9691614/TestObjCMethodReturningBOOL.py (1055 of 1977) PASS: lldb-unit :: Symbol/./SymbolTests/TestTypeSystemClang.TestGetBasicTypeFromEnum (1056 of 1977) UNSUPPORTED: lldb-shell :: Register/x86-zmm-write.test (1057 of 1977) PASS: lldb-unit :: Utility/./UtilityTests/BinaryStreamTest.PutSLEB128ThreeBytes (1058 of 1977) PASS: lldb-unit :: Utility/./UtilityTests/StringListTest.ShiftCString (1059 of 1977) PASS: lldb-api :: lang/objc/foundation/TestObjCMethodsString.py (1060 of 1977) PASS: lldb-api :: commands/expression/ir-interpreter-phi-nodes/TestIRInterpreterPHINodes.py (1061 of 1977) PASS: lldb-api :: commands/watchpoints/multiple_hits/TestMultipleHits.py (1062 of 1977) PASS: lldb-unit :: Utility/./UtilityTests/NameMatchesTest.StartsWith (1063 of 1977) PASS: lldb-unit :: Process/minidump/./LLDBMinidumpTests/MinidumpParserTest.MinidumpModuleOrder (1064 of 1977) PASS: lldb-unit :: Utility/./UtilityTests/RangeTest.SizeTypes (1065 of 1977) UNSUPPORTED: lldb-shell :: Unwind/eh-frame-small-fde.test (1066 of 1977) PASS: lldb-unit :: Process/gdb-remote/./ProcessGdbRemoteTests/GDBRemoteCommunicationServerTest.SendErrorResponse_Status (1067 of 1977) PASS: lldb-unit :: Utility/./UtilityTests/NameMatchesTest.EndsWith (1068 of 1977) PASS: lldb-unit :: Process/gdb-remote/./ProcessGdbRemoteTests/GDBRemoteClientBaseTest.SendContinueDelegateStructuredDataReceipt (1069 of 1977) PASS: lldb-unit :: Utility/./UtilityTests/StringExtractorTest.DecodeHexU8_InvalidHex2 (1070 of 1977) UNSUPPORTED: lldb-api :: functionalities/thread/concurrent_events/TestConcurrentManySignals.py (1071 of 1977) PASS: lldb-unit :: Utility/./UtilityTests/StreamTest.AddressSuffix (1072 of 1977) PASS: lldb-unit :: Utility/./UtilityTests/StringListTest.InsertStringAtIndexMove (1073 of 1977) PASS: lldb-unit :: Process/minidump/./LLDBMinidumpTests/MinidumpParserTest.InvalidMinidump (1074 of 1977) PASS: lldb-unit :: UnwindAssembly/x86/./UnwindAssemblyx86Tests/Testx86AssemblyInspectionEngine.Testi386IgnoredRegisters (1075 of 1977) PASS: lldb-unit :: Host/./HostTests/SocketTest.DecodeHostAndPort (1076 of 1977) PASS: lldb-shell :: Reproducer/TestWorkingDir.test (1077 of 1977) PASS: lldb-shell :: SymbolFile/DWARF/debug-types-address-ranges.s (1078 of 1977) PASS: lldb-unit :: ScriptInterpreter/Python/./ScriptInterpreterPythonTests/PythonDataObjectsTest.TestPythonDictionaryToStructuredDictionary (1079 of 1977) PASS: lldb-unit :: Utility/./UtilityTests/ArgsTest.EscapeLLDBCommandArgument (1080 of 1977) PASS: lldb-api :: functionalities/data-formatter/data-formatter-python-synth/TestDataFormatterPythonSynth.py (1081 of 1977) PASS: lldb-api :: functionalities/data-formatter/data-formatter-stl/libcxx/atomic/TestLibCxxAtomic.py (1082 of 1977) PASS: lldb-api :: python_api/sbdata/TestSBData.py (1083 of 1977) PASS: lldb-shell :: Driver/TestConvenienceVariables.test (1084 of 1977) PASS: lldb-unit :: Expression/./ExpressionTests/CppModuleConfigurationTest.LibCppV2 (1085 of 1977) PASS: lldb-unit :: UnwindAssembly/x86/./UnwindAssemblyx86Tests/Testx86AssemblyInspectionEngine.TestPushRBP (1086 of 1977) PASS: lldb-api :: macosx/universal/TestUniversal.py (1087 of 1977) PASS: lldb-unit :: Process/gdb-remote/./ProcessGdbRemoteTests/GDBRemoteCommunicationClientTest.SyncThreadState (1088 of 1977) UNSUPPORTED: lldb-api :: functionalities/data-formatter/data-formatter-stl/libstdcpp/vector/TestDataFormatterStdVector.py (1089 of 1977) PASS: lldb-unit :: Utility/./UtilityTests/StreamTeeTest.SetStreamAtIndexOverwrite (1090 of 1977) PASS: lldb-shell :: SymbolFile/DWARF/DW_AT_loclists_base.s (1091 of 1977) PASS: lldb-api :: lang/c/step-target/TestStepTarget.py (1092 of 1977) PASS: lldb-api :: functionalities/breakpoint/move_nearest/TestMoveNearest.py (1093 of 1977) PASS: lldb-unit :: Utility/./UtilityTests/ArgsTest.DoubleQuotedItem (1094 of 1977) PASS: lldb-unit :: Utility/./UtilityTests/BroadcasterTest.EventTypeHasListeners (1095 of 1977) PASS: lldb-shell :: Commands/command-disassemble-process.yaml (1096 of 1977) PASS: lldb-api :: commands/register/register/register_command/TestRegisters.py (1097 of 1977) PASS: lldb-unit :: Utility/./UtilityTests/StreamTest.PutRawBytesToLittleEndian (1098 of 1977) PASS: lldb-unit :: Utility/./UtilityTests/RangeTest.Equal (1099 of 1977) PASS: lldb-api :: commands/expression/result_numbering/TestResultNumbering.py (1100 of 1977) PASS: lldb-api :: tools/lldb-vscode/launch/TestVSCode_launch.py (1101 of 1977) PASS: lldb-api :: tools/lldb-server/TestGdbRemoteThreadsInStopReply.py (1102 of 1977) PASS: lldb-unit :: Utility/./UtilityTests/StringLexerTest.GetUnlexed (1103 of 1977) PASS: lldb-unit :: Utility/./UtilityTests/OptionsWithRawTest.WhitespaceInput (1104 of 1977) PASS: lldb-api :: functionalities/thread/concurrent_events/TestConcurrentCrashWithBreak.py (1105 of 1977) PASS: lldb-api :: functionalities/thread/concurrent_events/TestConcurrentManyBreakpoints.py (1106 of 1977) UNSUPPORTED: lldb-api :: functionalities/data-formatter/data-formatter-stl/libstdcpp/iterator/TestDataFormatterStdIterator.py (1107 of 1977) PASS: lldb-api :: functionalities/thread/jump/TestThreadJump.py (1108 of 1977) PASS: lldb-unit :: Utility/./UtilityTests/StreamTeeTest.GetStreamAtIndexOutOfBoundsEmpty (1109 of 1977) PASS: lldb-unit :: Language/Highlighting/./HighlighterTests/HighlighterTest.HighlighterSelectionType (1110 of 1977) PASS: lldb-unit :: Expression/./ExpressionTests/DiagnosticManagerTest.FixedExpression (1111 of 1977) PASS: lldb-unit :: Utility/./UtilityTests/UriParserTest.BracketedHostnameWithPortIPv4 (1112 of 1977) PASS: lldb-api :: commands/watchpoints/watchpoint_commands/command/TestWatchpointCommandPython.py (1113 of 1977) UNSUPPORTED: lldb-api :: functionalities/tsan/basic/TestTsanBasic.py (1114 of 1977) PASS: lldb-api :: lang/cpp/wchar_t/TestCxxWCharT.py (1115 of 1977) PASS: lldb-unit :: Host/./HostTests/MainLoopTest.UnmonitoredSignal (1116 of 1977) PASS: lldb-unit :: Utility/./UtilityTests/RegularExpression.CopyAssignment (1117 of 1977) PASS: lldb-unit :: Host/./HostTests/SocketTest.TCPListen0GetPort (1118 of 1977) UNSUPPORTED: lldb-api :: benchmarks/startup/TestStartupDelays.py (1119 of 1977) PASS: lldb-unit :: UnwindAssembly/x86/./UnwindAssemblyx86Tests/Testx86AssemblyInspectionEngine.TestPopR15 (1120 of 1977) PASS: lldb-api :: functionalities/data-formatter/data-formatter-caching/TestDataFormatterCaching.py (1121 of 1977) PASS: lldb-unit :: Interpreter/./InterpreterTests/OptionArgParserTest.toChar (1122 of 1977) PASS: lldb-unit :: Utility/./UtilityTests/StringExtractorTest.GetHexBytes_FullString (1123 of 1977) PASS: lldb-api :: functionalities/rerun/TestRerun.py (1124 of 1977) PASS: lldb-api :: lang/objc/print-obj/TestPrintObj.py (1125 of 1977) PASS: lldb-api :: lang/cpp/bitfields/TestCppBitfields.py (1126 of 1977) PASS: lldb-shell :: Register/x86-64-read.test (1127 of 1977) PASS: lldb-unit :: Core/./LLDBCoreTests/StreamCallbackTest.Callback (1128 of 1977) PASS: lldb-unit :: Utility/./UtilityTests/TimerTest.CategoryTimesStats (1129 of 1977) PASS: lldb-unit :: Host/./HostTests/ConnectionFileDescriptorTest.TCPGetURIv4 (1130 of 1977) PASS: lldb-api :: functionalities/breakpoint/consecutive_breakpoints/TestConsecutiveBreakpoints.py (1131 of 1977) PASS: lldb-api :: python_api/get-value-32bit-int/TestGetValue32BitInt.py (1132 of 1977) PASS: lldb-unit :: Utility/./UtilityTests/BinaryStreamTest.PutSLEB128TwoBytes (1133 of 1977) PASS: lldb-api :: functionalities/inferior-crashing/TestInferiorCrashing.py (1134 of 1977) PASS: lldb-api :: functionalities/gdb_remote_client/TestRecognizeBreakpoint.py (1135 of 1977) PASS: lldb-unit :: SymbolFile/DWARF/./SymbolFileDWARFTests/SymbolFileDWARFTests.TestAbilitiesForDWARF (1136 of 1977) PASS: lldb-unit :: Utility/./UtilityTests/StringListTest.LongestCommonPrefixEmpty (1137 of 1977) UNSUPPORTED: lldb-shell :: SymbolFile/PDB/function-nested-block.test (1138 of 1977) PASS: lldb-api :: functionalities/postmortem/wow64_minidump/TestWow64MiniDump.py (1139 of 1977) PASS: lldb-shell :: SymbolFile/Breakpad/symtab-macho.test (1140 of 1977) PASS: lldb-api :: commands/apropos/with-process/TestAproposWithProcess.py (1141 of 1977) PASS: lldb-unit :: Utility/./UtilityTests/StringListTest.ForRangeEmpty (1142 of 1977) PASS: lldb-unit :: ScriptInterpreter/Python/./ScriptInterpreterPythonTests/PythonDataObjectsTest.TestPythonTupleInitializerList (1143 of 1977) PASS: lldb-unit :: Utility/./UtilityTests/VMRange.CollectionContains (1144 of 1977) PASS: lldb-api :: commands/expression/import-std-module/shared_ptr-dbg-info-content/TestSharedPtrDbgInfoContentFromStdModule.py (1145 of 1977) UNSUPPORTED: lldb-api :: iohandler/unicode/TestUnicode.py (1146 of 1977) PASS: lldb-api :: functionalities/archives/TestBSDArchives.py (1147 of 1977) PASS: lldb-api :: commands/expression/diagnostics/TestExprDiagnostics.py (1148 of 1977) PASS: lldb-unit :: Symbol/./SymbolTests/SymbolsTest.TerminateLocateExecutableSymbolFileForUnknownExecutableAndUnknownSymbolFile (1149 of 1977) PASS: lldb-api :: commands/frame/diagnose/bad-reference/TestBadReference.py (1150 of 1977) UNSUPPORTED: lldb-api :: functionalities/tty/TestTerminal.py (1151 of 1977) PASS: lldb-api :: lang/objc/single-entry-dictionary/TestObjCSingleEntryDictionary.py (1152 of 1977) PASS: lldb-api :: tools/lldb-server/TestGdbRemoteSingleStep.py (1153 of 1977) PASS: lldb-unit :: Language/CPlusPlus/./LanguageCPlusPlusTests/CPlusPlusLanguage.FindAlternateFunctionManglings (1154 of 1977) PASS: lldb-api :: functionalities/reproducers/attach/TestReproducerAttach.py (1155 of 1977) PASS: lldb-unit :: Host/./HostTests/Host.WaitStatusFormat (1156 of 1977) PASS: lldb-api :: functionalities/data-formatter/hexcaps/TestDataFormatterHexCaps.py (1157 of 1977) PASS: lldb-unit :: Host/./HostTests/FileSystemTest.GetPermissions (1158 of 1977) PASS: lldb-unit :: Host/./HostTests/TaskPoolTest.AddTask (1159 of 1977) PASS: lldb-shell :: SymbolFile/DWARF/dwp-separate-debug-file.cpp (1160 of 1977) UNSUPPORTED: lldb-api :: functionalities/tsan/thread_leak/TestTsanThreadLeak.py (1161 of 1977) PASS: lldb-unit :: Utility/./UtilityTests/StringListTest.GetMaxStringLengthDecreasingSize (1162 of 1977) PASS: lldb-unit :: Utility/./UtilityTests/ArgsTest.TestSingleQuotedArgWithSpace (1163 of 1977) PASS: lldb-unit :: Symbol/./SymbolTests/TestClangASTImporter.RecordLayout (1164 of 1977) PASS: lldb-shell :: ObjectFile/Breakpad/sections.test (1165 of 1977) PASS: lldb-api :: functionalities/data-formatter/data-formatter-objc/TestDataFormatterObjNSException.py (1166 of 1977) PASS: lldb-unit :: Utility/./UtilityTests/IndexToObjectTest.ObjectForIndex (1167 of 1977) PASS: lldb-unit :: Host/./HostTests/FileSystemTest.OpenErrno (1168 of 1977) PASS: lldb-api :: macosx/find-dsym/bundle-with-dot-in-filename/TestBundleWithDotInFilename.py (1169 of 1977) PASS: lldb-api :: functionalities/thread/concurrent_events/TestConcurrentSignalWatch.py (1170 of 1977) PASS: lldb-shell :: Settings/TestFrameFormatNoColor.test (1171 of 1977) PASS: lldb-api :: commands/frame/recognizer/TestFrameRecognizer.py (1172 of 1977) PASS: lldb-api :: commands/expression/test/TestExprs2.py (1173 of 1977) PASS: lldb-api :: functionalities/data-formatter/data-formatter-objc/TestDataFormatterObjCNSError.py (1174 of 1977) PASS: lldb-api :: commands/expression/completion-crash-incomplete-record/TestCompletionCrashIncompleteRecord.py (1175 of 1977) PASS: lldb-unit :: Utility/./UtilityTests/StringLexerTest.Peek (1176 of 1977) PASS: lldb-api :: functionalities/data-formatter/data-formatter-stl/libcxx/vbool/TestDataFormatterLibcxxVBool.py (1177 of 1977) PASS: lldb-shell :: SymbolFile/DWARF/dwarf5-atomic.s (1178 of 1977) PASS: lldb-unit :: SymbolFile/DWARF/./SymbolFileDWARFTests/SymbolFileDWARFTests.TestAbbrevOrder1Start5 (1179 of 1977) PASS: lldb-api :: commands/expression/invalid-args/TestInvalidArgsExpression.py (1180 of 1977) PASS: lldb-unit :: Symbol/./SymbolTests/LineEntryTest.GetSameLineContiguousAddressRangeNoInlines (1181 of 1977) PASS: lldb-unit :: Language/CPlusPlus/./LanguageCPlusPlusTests/CPlusPlusLanguage.ExtractContextAndIdentifier (1182 of 1977) PASS: lldb-unit :: Utility/./UtilityTests/StreamTest.PutHex16ByteOrderLittle (1183 of 1977) PASS: lldb-unit :: UnwindAssembly/x86/./UnwindAssemblyx86Tests/Testx86AssemblyInspectionEngine.TestPushEBP (1184 of 1977) PASS: lldb-unit :: Utility/./UtilityTests/SerializationRountripTest.SerializeDeserializeCStringNull (1185 of 1977) PASS: lldb-unit :: Utility/./UtilityTests/StringExtractorTest.DecodeHexU8_Underflow (1186 of 1977) PASS: lldb-api :: lang/objc/self/TestObjCSelf.py (1187 of 1977) PASS: lldb-api :: functionalities/thread/concurrent_events/TestConcurrentSignalDelayWatch.py (1188 of 1977) PASS: lldb-unit :: SymbolFile/NativePDB/./SymbolFileNativePDBTests/PDBFPOProgramToDWARFExpressionTests.MultipleIndependentAssignments (1189 of 1977) UNSUPPORTED: lldb-shell :: ScriptInterpreter/Lua/convenience_variables.test (1190 of 1977) PASS: lldb-unit :: Utility/./UtilityTests/RangeTest.EqualInvalid (1191 of 1977) PASS: lldb-api :: types/TestFloatTypes.py (1192 of 1977) PASS: lldb-unit :: Utility/./UtilityTests/StringExtractorTest.GetHexU8_Extra_NoEof (1193 of 1977) UNSUPPORTED: lldb-api :: commands/watchpoints/multi_watchpoint_slots/TestWatchpointMultipleSlots.py (1194 of 1977) PASS: lldb-shell :: Reproducer/TestPythonImport.test (1195 of 1977) PASS: lldb-api :: lang/cpp/nsimport/TestCppNsImport.py (1196 of 1977) PASS: lldb-unit :: ScriptInterpreter/Python/./ScriptInterpreterPythonTests/PythonDataObjectsTest.TestPythonIntegerToStr (1197 of 1977) PASS: lldb-shell :: ObjectFile/PECOFF/basic-info-arm64.yaml (1198 of 1977) PASS: lldb-unit :: Utility/./UtilityTests/UUIDTest.Validity (1199 of 1977) PASS: lldb-unit :: Process/gdb-remote/./ProcessGdbRemoteTests/GDBRemoteClientBaseTest.InterruptNoResponse (1200 of 1977) UNSUPPORTED: lldb-shell :: Register/x86-ymm-write.test (1201 of 1977) PASS: lldb-unit :: UnwindAssembly/x86/./UnwindAssemblyx86Tests/Testx86AssemblyInspectionEngine.TestLEAVE (1202 of 1977) PASS: lldb-api :: lang/c/modules/TestCModules.py (1203 of 1977) PASS: lldb-api :: functionalities/data-formatter/data-formatter-stl/libcxx/list/TestDataFormatterLibcxxList.py (1204 of 1977) PASS: lldb-shell :: ObjectFile/ELF/base-address.yaml (1205 of 1977) PASS: lldb-unit :: Utility/./UtilityTests/Flags.AllSet (1206 of 1977) PASS: lldb-unit :: Language/Highlighting/./HighlighterTests/HighlighterTest.ClangCursorPos (1207 of 1977) PASS: lldb-unit :: Utility/./UtilityTests/RangeTest.DefaultConstructor (1208 of 1977) UNSUPPORTED: lldb-api :: functionalities/ubsan/user-expression/TestUbsanUserExpression.py (1209 of 1977) PASS: lldb-unit :: Utility/./UtilityTests/ArgsTest.GetQuotedCommandString (1210 of 1977) PASS: lldb-shell :: SymbolFile/Breakpad/line-table-discontinuous-file-ids.test (1211 of 1977) PASS: lldb-api :: lang/objc/objc-struct-return/TestObjCStructReturn.py (1212 of 1977) PASS: lldb-unit :: Utility/./UtilityTests/RangeTest.ContainsEndInclusiveInvalid (1213 of 1977) PASS: lldb-unit :: Utility/./UtilityTests/DataExtractorTest.GetMaxU64_unchecked (1214 of 1977) PASS: lldb-unit :: Utility/./UtilityTests/LogChannelTest.EnableOptions (1215 of 1977) PASS: lldb-api :: commands/expression/import-std-module/vector/TestVectorFromStdModule.py (1216 of 1977) PASS: lldb-unit :: Utility/./UtilityTests/ArchSpecTest.TripleComponentsWereSpecified (1217 of 1977) PASS: lldb-api :: lang/objc/objc-class-method/TestObjCClassMethod.py (1218 of 1977) PASS: lldb-unit :: Utility/./UtilityTests/OptionsWithRawTest.WhitespaceSuffix (1219 of 1977) PASS: lldb-api :: commands/frame/diagnose/array/TestArray.py (1220 of 1977) PASS: lldb-unit :: Expression/./ExpressionTests/DiagnosticManagerTest.AddDiagnostic (1221 of 1977) PASS: lldb-unit :: debugserver/./debugserverTests/RNBSocket.LoopBackListenIPv6 (1222 of 1977) PASS: lldb-unit :: Utility/./UtilityTests/StringListTest.Assignment (1223 of 1977) PASS: lldb-api :: functionalities/set-data/TestSetData.py (1224 of 1977) UNSUPPORTED: lldb-shell :: ScriptInterpreter/Lua/nested_sessions.test (1225 of 1977) PASS: lldb-api :: lang/c/register_variables/TestRegisterVariables.py (1226 of 1977) PASS: lldb-unit :: Utility/./UtilityTests/RegularExpression.Match (1227 of 1977) PASS: lldb-api :: python_api/lldbutil/process/TestPrintStackTraces.py (1228 of 1977) PASS: lldb-api :: python_api/sbvalue_const_addrof/TestSBValueConstAddrOf.py (1229 of 1977) PASS: lldb-unit :: Utility/./UtilityTests/Flags.Test (1230 of 1977) PASS: lldb-api :: commands/expression/fixits/TestFixIts.py (1231 of 1977) PASS: lldb-unit :: Symbol/./SymbolTests/TestTypeSystemClang.TemplateArguments (1232 of 1977) PASS: lldb-unit :: Utility/./UtilityTests/StreamTeeTest.Assignment (1233 of 1977) PASS: lldb-api :: functionalities/data-formatter/nsdictionarysynth/TestNSDictionarySynthetic.py (1234 of 1977) PASS: lldb-api :: lang/cpp/this/TestCPPThis.py (1235 of 1977) PASS: lldb-api :: types/TestIntegerType.py (1236 of 1977) PASS: lldb-api :: commands/platform/basic/TestPlatformCommand.py (1237 of 1977) PASS: lldb-api :: tools/lldb-vscode/breakpoint/TestVSCode_setFunctionBreakpoints.py (1238 of 1977) PASS: lldb-unit :: Process/gdb-remote/./ProcessGdbRemoteTests/GDBRemoteCommunicationClientTest.GetQOffsets (1239 of 1977) PASS: lldb-unit :: Language/Highlighting/./HighlighterTests/HighlighterTest.DefaultHighlighterWithCursor (1240 of 1977) PASS: lldb-unit :: Utility/./UtilityTests/FileSpecTest.OperatorBool (1241 of 1977) PASS: lldb-unit :: Symbol/./SymbolTests/LineEntryTest.GetSameLineContiguousAddressRangeNestedInline (1242 of 1977) PASS: lldb-api :: api/log/TestAPILog.py (1243 of 1977) PASS: lldb-api :: functionalities/data-formatter/data-formatter-stl/libcxx/tuple/TestDataFormatterLibcxxTuple.py (1244 of 1977) PASS: lldb-api :: lang/c/find_struct_type/TestFindStructTypes.py (1245 of 1977) UNSUPPORTED: lldb-api :: tools/lldb-vscode/completions/TestVSCode_completions.py (1246 of 1977) PASS: lldb-unit :: Platform/./LLDBPlatformTests/PlatformDarwinTest.FindComponentInPath (1247 of 1977) PASS: lldb-unit :: Utility/./UtilityTests/UriParserTest.Minimal (1248 of 1977) PASS: lldb-unit :: Utility/./UtilityTests/ArgsTest.TestInsertArg (1249 of 1977) PASS: lldb-shell :: Reproducer/Modules/TestModuleCXX.test (1250 of 1977) PASS: lldb-shell :: ObjectFile/ELF/build-id-case.yaml (1251 of 1977) PASS: lldb-api :: lang/cpp/exceptions/TestCPPExceptionBreakpoints.py (1252 of 1977) PASS: lldb-api :: commands/expression/namespace_local_var_same_name_obj_c/TestNamespaceLocalVarSameNameObjC.py (1253 of 1977) PASS: lldb-api :: macosx/indirect_symbol/TestIndirectSymbols.py (1254 of 1977) PASS: lldb-api :: functionalities/signal/TestSendSignal.py (1255 of 1977) PASS: lldb-api :: functionalities/thread/concurrent_events/TestConcurrentDelaySignalBreak.py (1256 of 1977) PASS: lldb-unit :: Language/Highlighting/./HighlighterTests/HighlighterTest.ClangCursorPosEndOfLine (1257 of 1977) PASS: lldb-unit :: UnwindAssembly/x86/./UnwindAssemblyx86Tests/Testx86AssemblyInspectionEngine.TestPopESI (1258 of 1977) PASS: lldb-unit :: Utility/./UtilityTests/StructuredDataTest.StringDump (1259 of 1977) PASS: lldb-api :: lang/objc/objc-foundation-dictionary-empty/TestNSDictionary0.py (1260 of 1977) PASS: lldb-unit :: Utility/./UtilityTests/SerializationRountripTest.SerializeDeserializeCStringArrayNullptrElem (1261 of 1977) PASS: lldb-shell :: Reproducer/TestFileRepro.test (1262 of 1977) PASS: lldb-api :: functionalities/data-formatter/ostypeformatting/TestFormattersOsType.py (1263 of 1977) PASS: lldb-api :: macosx/safe-to-func-call/TestSafeFuncCalls.py (1264 of 1977) PASS: lldb-unit :: ScriptInterpreter/Python/./ScriptInterpreterPythonTests/PythonDataObjectsTest.TestPythonStringToStructuredString (1265 of 1977) PASS: lldb-api :: commands/command/script/TestCommandScript.py (1266 of 1977) PASS: lldb-unit :: Utility/./UtilityTests/DataExtractorTest.GetCStrAtEnd (1267 of 1977) PASS: lldb-unit :: Expression/./ExpressionTests/CppModuleConfigurationTest.AmbiguousLibCpp (1268 of 1977) PASS: lldb-api :: lang/c/shared_lib/TestSharedLib.py (1269 of 1977) PASS: lldb-unit :: Process/minidump/./LLDBMinidumpTests/MinidumpParserTest.GetMemoryRegionInfoFromMemory64List (1270 of 1977) PASS: lldb-unit :: ScriptInterpreter/Python/./ScriptInterpreterPythonTests/PythonDataObjectsTest.TestTypeNameResolutionNoDot (1271 of 1977) PASS: lldb-shell :: ObjectFile/ELF/PT_LOAD-overlap.yaml (1272 of 1977) PASS: lldb-unit :: Utility/./UtilityTests/BinaryStreamTest.PutULEB128NineBytes (1273 of 1977) PASS: lldb-api :: tools/lldb-vscode/step/TestVSCode_step.py (1274 of 1977) PASS: lldb-api :: lang/c/unicode/TestUnicodeSymbols.py (1275 of 1977) PASS: lldb-unit :: Utility/./UtilityTests/VASprintfTest.NoBufferResize (1276 of 1977) PASS: lldb-api :: commands/expression/ignore-artificial-constructors/TestIgnoreArtificialConstructors.py (1277 of 1977) PASS: lldb-unit :: Utility/./UtilityTests/ArgsTest.TestOverwriteArgs (1278 of 1977) PASS: lldb-unit :: Utility/./UtilityTests/OptionsWithRawTest.UnterminatedQuote (1279 of 1977) PASS: lldb-unit :: ObjectFile/PECOFF/./ObjectFilePECOFFTests/PECallFrameInfoTest.Basic_eh (1280 of 1977) PASS: lldb-unit :: Utility/./UtilityTests/DataExtractorTest.PeekData (1281 of 1977) PASS: lldb-api :: functionalities/recursion/TestValueObjectRecursion.py (1282 of 1977) PASS: lldb-api :: python_api/frame/TestFrames.py (1283 of 1977) PASS: lldb-unit :: Utility/./UtilityTests/OptionsWithRawTest.ArgsButNoDelimiter (1284 of 1977) UNSUPPORTED: lldb-shell :: SymbolFile/PDB/compilands.test (1285 of 1977) PASS: lldb-shell :: SymbolFile/DWARF/debug-types-line-tables.s (1286 of 1977) PASS: lldb-api :: commands/command/history/TestCommandHistory.py (1287 of 1977) PASS: lldb-api :: functionalities/data-formatter/synthupdate/TestSyntheticFilterRecompute.py (1288 of 1977) PASS: lldb-unit :: ScriptInterpreter/Python/./ScriptInterpreterPythonTests/PythonDataObjectsTest.TestPythonTupleSize (1289 of 1977) PASS: lldb-api :: commands/expression/import-std-module/empty-module/TestEmptyStdModule.py (1290 of 1977) PASS: lldb-api :: functionalities/data-formatter/compactvectors/TestCompactVectors.py (1291 of 1977) PASS: lldb-unit :: Utility/./UtilityTests/RangeDataVector.FindEntryIndexesThatContain (1292 of 1977) PASS: lldb-shell :: SymbolFile/DWARF/debug_ranges.s (1293 of 1977) PASS: lldb-api :: tools/lldb-vscode/breakpoint/TestVSCode_setBreakpoints.py (1294 of 1977) PASS: lldb-api :: functionalities/breakpoint/breakpoint_options/TestBreakpointOptions.py (1295 of 1977) PASS: lldb-unit :: Utility/./UtilityTests/StreamTeeTest.SetStreamAtIndexOutOfBounds (1296 of 1977) PASS: lldb-shell :: Reproducer/TestSynchronous.test (1297 of 1977) PASS: lldb-api :: lang/objc/objc-ivar-protocols/TestIvarProtocols.py (1298 of 1977) PASS: lldb-api :: functionalities/data-formatter/synthcapping/TestSyntheticCapping.py (1299 of 1977) PASS: lldb-unit :: ScriptInterpreter/Python/./ScriptInterpreterPythonTests/PythonDataObjectsTest.TestPythonBoolean (1300 of 1977) PASS: lldb-unit :: Process/gdb-remote/./ProcessGdbRemoteTests/GDBRemoteClientBaseTest.SendContinueAndWait (1301 of 1977) PASS: lldb-api :: commands/expression/call-function/TestCallUserDefinedFunction.py (1302 of 1977) PASS: lldb-unit :: Utility/./UtilityTests/VMRange.SetEndAddress (1303 of 1977) PASS: lldb-api :: functionalities/postmortem/elf-core/TestLinuxCore.py (1304 of 1977) PASS: lldb-unit :: Utility/./UtilityTests/LogChannelEnabledTest.LLDB_LOG_ERROR (1305 of 1977) PASS: lldb-unit :: Host/./HostTests/FileSystemTest.MakeAbsolute (1306 of 1977) PASS: lldb-unit :: Utility/./UtilityTests/StringListTest.CopyList (1307 of 1977) PASS: lldb-api :: lang/objc/foundation/TestRuntimeTypes.py (1308 of 1977) PASS: lldb-unit :: Utility/./UtilityTests/StringExtractorTest.GetNameColonValueNoSemicolon (1309 of 1977) PASS: lldb-api :: lang/objc/foundation/TestConstStrings.py (1310 of 1977) PASS: lldb-api :: functionalities/thread/concurrent_events/TestConcurrentTwoWatchpointsOneSignal.py (1311 of 1977) PASS: lldb-api :: lang/cpp/diamond/TestDiamond.py (1312 of 1977) PASS: lldb-api :: functionalities/data-formatter/data-formatter-stl/libcxx/initializerlist/TestInitializerList.py (1313 of 1977) PASS: lldb-shell :: SymbolFile/NativePDB/globals-fundamental.cpp (1314 of 1977) PASS: lldb-unit :: Utility/./UtilityTests/ArchSpecTest.OperatorBool (1315 of 1977) PASS: lldb-api :: lang/objc/objc-new-syntax/TestObjCNewSyntaxLiteral.py (1316 of 1977) PASS: lldb-unit :: Editline/./EditlineTests/EditlineTestFixture.EditlineReceivesMultiLineText (1317 of 1977) PASS: lldb-shell :: Breakpoint/jitbp_elf.test (1318 of 1977) UNSUPPORTED: lldb-shell :: BuildScript/toolchain-clang-cl.test (1319 of 1977) PASS: lldb-unit :: ScriptInterpreter/Python/./ScriptInterpreterPythonTests/PythonDataObjectsTest.TestPythonTupleValues (1320 of 1977) PASS: lldb-unit :: UnwindAssembly/x86/./UnwindAssemblyx86Tests/Testx86AssemblyInspectionEngine.Test64bitFramelessBigStackFrame (1321 of 1977) PASS: lldb-shell :: Settings/TestFrameFormatColor.test (1322 of 1977) PASS: lldb-api :: python_api/symbol-context/two-files/TestSymbolContextTwoFiles.py (1323 of 1977) PASS: lldb-unit :: Process/gdb-remote/./ProcessGdbRemoteTests/GDBRemoteCommunicationClientTest.SendStopTracePacket (1324 of 1977) PASS: lldb-api :: lang/cpp/global_variables/TestCPPGlobalVariables.py (1325 of 1977) PASS: lldb-unit :: Expression/./ExpressionTests/ClangHostTest.MacOSX (1326 of 1977) UNSUPPORTED: lldb-api :: linux/sepdebugsymlink/TestTargetSymbolsSepDebugSymlink.py (1327 of 1977) PASS: lldb-unit :: UnwindAssembly/x86/./UnwindAssemblyx86Tests/Testx86AssemblyInspectionEngine.TestPopR13 (1328 of 1977) PASS: lldb-api :: functionalities/data-formatter/data-formatter-synthtype/TestDataFormatterSynthType.py (1329 of 1977) PASS: lldb-api :: lang/cpp/member-and-local-vars-with-same-name/TestMembersAndLocalsWithSameName.py (1330 of 1977) PASS: lldb-shell :: SymbolFile/symbol-binding.test (1331 of 1977) PASS: lldb-unit :: Utility/./UtilityTests/BinaryStreamTest.PutSLEB128FourBytes (1332 of 1977) PASS: lldb-unit :: Symbol/./SymbolTests/TestTypeSystemClang.TestFunctionTemplateInRecordConstruction (1333 of 1977) PASS: lldb-unit :: Utility/./UtilityTests/UserIDResolver.GetUserName (1334 of 1977) PASS: lldb-api :: lang/cpp/function_refs/TestFunctionRefs.py (1335 of 1977) UNSUPPORTED: lldb-api :: functionalities/param_entry_vals/basic_entry_values_x86_64/TestBasicEntryValuesX86_64.py (1336 of 1977) PASS: lldb-api :: lang/objc/objc-static-method/TestObjCStaticMethod.py (1337 of 1977) PASS: lldb-unit :: Utility/./UtilityTests/StateTest.Formatv (1338 of 1977) PASS: lldb-shell :: SymbolFile/DWARF/debug_rnglists.s (1339 of 1977) PASS: lldb-api :: commands/expression/persistent_types/TestPersistentTypes.py (1340 of 1977) PASS: lldb-shell :: ObjectFile/ELF/section-permissions.yaml (1341 of 1977) PASS: lldb-api :: python_api/lldbutil/iter/TestLLDBIterator.py (1342 of 1977) PASS: lldb-api :: lang/c/vla/TestVLA.py (1343 of 1977) PASS: lldb-shell :: SymbolFile/NativePDB/disassembly.cpp (1344 of 1977) PASS: lldb-api :: commands/expression/import-std-module/deque-basic/TestDequeFromStdModule.py (1345 of 1977) PASS: lldb-api :: lang/cpp/class_static/TestStaticVariables.py (1346 of 1977) PASS: lldb-shell :: Recognizer/assert.test (1347 of 1977) UNSUPPORTED: lldb-api :: functionalities/tsan/global_location/TestTsanGlobalLocation.py (1348 of 1977) UNSUPPORTED: lldb-api :: functionalities/thread/multi_break/TestMultipleBreakpoints.py (1349 of 1977) PASS: lldb-unit :: Utility/./UtilityTests/UUIDTest.RelationalOperators (1350 of 1977) PASS: lldb-shell :: Reproducer/TestCrash.test (1351 of 1977) UNSUPPORTED: lldb-api :: functionalities/tsan/cpp_global_location/TestTsanCPPGlobalLocation.py (1352 of 1977) UNSUPPORTED: lldb-api :: functionalities/darwin_log/filter/regex/activity-chain/TestDarwinLogFilterRegexActivityChain.py (1353 of 1977) PASS: lldb-shell :: ObjectFile/ELF/section-overlap.yaml (1354 of 1977) PASS: lldb-unit :: Utility/./UtilityTests/StringExtractorTest.GetHexBytes_OddPair2 (1355 of 1977) PASS: lldb-api :: functionalities/breakpoint/cpp/TestCPPBreakpointLocations.py (1356 of 1977) PASS: lldb-api :: commands/platform/process/list/TestProcessList.py (1357 of 1977) PASS: lldb-api :: lang/cpp/lambdas/TestLambdas.py (1358 of 1977) UNSUPPORTED: lldb-api :: functionalities/thread/create_during_step/TestCreateDuringStep.py (1359 of 1977) PASS: lldb-api :: functionalities/postmortem/mach-core/TestMachCore.py (1360 of 1977) PASS: lldb-api :: python_api/class_members/TestSBTypeClassMembers.py (1361 of 1977) PASS: lldb-unit :: Utility/./UtilityTests/NameMatchesTest.RegularExpression (1362 of 1977) UNSUPPORTED: lldb-api :: tools/lldb-server/TestGdbRemote_vContThreads.py (1363 of 1977) PASS: lldb-unit :: Utility/./UtilityTests/VMRange.ContainsAddr (1364 of 1977) PASS: lldb-unit :: Utility/./UtilityTests/ProcessInstanceInfo.DumpTable_invalidUID (1365 of 1977) PASS: lldb-api :: commands/frame/diagnose/inheritance/TestDiagnoseInheritance.py (1366 of 1977) PASS: lldb-unit :: UnwindAssembly/x86/./UnwindAssemblyx86Tests/Testx86AssemblyInspectionEngine.TestStackRealignMSVC_i386 (1367 of 1977) PASS: lldb-unit :: Utility/./UtilityTests/DataExtractorTest.GetCStrAtNullOffset (1368 of 1977) PASS: lldb-shell :: Unwind/trap_frame_sym_ctx.test (1369 of 1977) PASS: lldb-unit :: Utility/./UtilityTests/StringExtractorTest.GetHexBytesAvail_OddPair (1370 of 1977) PASS: lldb-shell :: Unwind/thread-step-out-ret-addr-check.test (1371 of 1977) PASS: lldb-api :: functionalities/gdb_remote_client/TestTargetXMLArch.py (1372 of 1977) PASS: lldb-api :: lang/cpp/stl/TestSTL.py (1373 of 1977) PASS: lldb-unit :: Utility/./UtilityTests/FileSpecTest.CopyByAppendingPathComponent (1374 of 1977) PASS: lldb-shell :: Commands/command-source.test (1375 of 1977) PASS: lldb-unit :: ScriptInterpreter/Python/./ScriptInterpreterPythonTests/PythonDataObjectsTest.TestPythonListToStructuredList (1376 of 1977) PASS: lldb-shell :: SymbolFile/DWARF/find-inline-method.s (1377 of 1977) UNSUPPORTED: lldb-api :: functionalities/darwin_log/filter/regex/subsystem/TestDarwinLogFilterRegexSubsystem.py (1378 of 1977) UNSUPPORTED: lldb-api :: commands/register/register/intel_xtended_registers/mpx_offset_intersection/TestMPXOffsetIntersection.py (1379 of 1977) PASS: lldb-api :: functionalities/thread/concurrent_events/TestConcurrentDelayedCrashWithBreakpointWatchpoint.py (1380 of 1977) PASS: lldb-unit :: UnwindAssembly/x86/./UnwindAssemblyx86Tests/Testx86AssemblyInspectionEngine.TestReturnDetect (1381 of 1977) PASS: lldb-api :: commands/expression/unwind_expression/TestUnwindExpression.py (1382 of 1977) PASS: lldb-api :: commands/expression/namespace_local_var_same_name_cpp_and_c/TestNamespaceLocalVarSameNameCppAndC.py (1383 of 1977) UNSUPPORTED: lldb-api :: commands/expression/multiline-navigation/TestMultilineNavigation.py (1384 of 1977) PASS: lldb-api :: lang/cpp/multiple-inheritance/TestCppMultipleInheritance.py (1385 of 1977) PASS: lldb-api :: functionalities/data-formatter/vector-types/TestVectorTypesFormatting.py (1386 of 1977) PASS: lldb-api :: api/check_public_api_headers/TestPublicAPIHeaders.py (1387 of 1977) PASS: lldb-shell :: SymbolFile/NativePDB/function-types-classes.cpp (1388 of 1977) PASS: lldb-unit :: Utility/./UtilityTests/ArgsTest.TestTrailingBackslash (1389 of 1977) PASS: lldb-api :: functionalities/data-formatter/data-formatter-disabling/TestDataFormatterDisabling.py (1390 of 1977) PASS: lldb-unit :: Process/minidump/./LLDBMinidumpTests/MinidumpParserTest.GetMiscInfoWindows (1391 of 1977) PASS: lldb-unit :: Utility/./UtilityTests/StringListTest.CopyListEmpty (1392 of 1977) PASS: lldb-shell :: Reproducer/Functionalities/TestImageList.test (1393 of 1977) PASS: lldb-shell :: SymbolFile/DWARF/anon_class_w_and_wo_export_symbols.ll (1394 of 1977) PASS: lldb-api :: types/TestRecursiveTypes.py (1395 of 1977) PASS: lldb-api :: sanity/TestSettingSkipping.py (1396 of 1977) PASS: lldb-api :: lang/objc/forward-decl/TestForwardDecl.py (1397 of 1977) PASS: lldb-unit :: Breakpoint/./LLDBBreakpointTests/BreakpointIDTest.StringIsBreakpointName (1398 of 1977) PASS: lldb-api :: functionalities/data-formatter/dump_dynamic/TestDumpDynamic.py (1399 of 1977) PASS: lldb-unit :: Process/gdb-remote/./ProcessGdbRemoteTests/GDBRemoteClientBaseTest.SendContinueAndAsyncPacket (1400 of 1977) PASS: lldb-api :: functionalities/data-formatter/data-formatter-objc/nsindexpath/TestDataFormatterNSIndexPath.py (1401 of 1977) PASS: lldb-api :: commands/expression/radar_8638051/Test8638051.py (1402 of 1977) PASS: lldb-unit :: Core/./LLDBCoreTests/MangledTest.ResultForBlockInvocation (1403 of 1977) UNSUPPORTED: lldb-api :: commands/expression/call-restarts/TestCallThatRestarts.py (1404 of 1977) PASS: lldb-api :: terminal/TestSTTYBeforeAndAfter.py (1405 of 1977) PASS: lldb-shell :: SymbolFile/DWARF/dwp.s (1406 of 1977) PASS: lldb-unit :: Utility/./UtilityTests/StringExtractorTest.GetHexU8_InvalidHex_NoEof (1407 of 1977) PASS: lldb-unit :: Core/./LLDBCoreTests/MangledTest.EmptyForInvalidName (1408 of 1977) PASS: lldb-unit :: Utility/./UtilityTests/RegularExpression.Invalid (1409 of 1977) PASS: lldb-api :: functionalities/data-formatter/data-formatter-stl/libcxx/iterator/TestDataFormatterLibccIterator.py (1410 of 1977) PASS: lldb-unit :: Utility/./UtilityTests/BroadcasterTest.BroadcastEvent (1411 of 1977) PASS: lldb-unit :: Utility/./UtilityTests/ScalarTest.Division (1412 of 1977) PASS: lldb-unit :: ScriptInterpreter/Python/./ScriptInterpreterPythonTests/PythonDataObjectsTest.TestPythonDictionaryManipulation (1413 of 1977) PASS: lldb-api :: lang/objc/modules/TestObjCModules.py (1414 of 1977) PASS: lldb-unit :: Utility/./UtilityTests/VMRange.Clear (1415 of 1977) PASS: lldb-unit :: Utility/./UtilityTests/ReproducerTest.SetCapture (1416 of 1977) PASS: lldb-api :: commands/expression/radar_9531204/TestPrintfAfterUp.py (1417 of 1977) PASS: lldb-unit :: Target/./TargetTests/StackFrameRecognizerTest.NullModuleRegex (1418 of 1977) PASS: lldb-api :: functionalities/thread/thread_exit/TestThreadExit.py (1419 of 1977) PASS: lldb-unit :: Symbol/./SymbolTests/Type.CompilerContextPattern (1420 of 1977) PASS: lldb-unit :: Symbol/./SymbolTests/TestClangASTImporter.CompleteFwdDeclWithOtherOrigin (1421 of 1977) PASS: lldb-api :: lang/cpp/namespace/TestNamespaceLookup.py (1422 of 1977) PASS: lldb-shell :: Commands/command-backtrace.test (1423 of 1977) PASS: lldb-api :: commands/expression/import-std-module/weak_ptr/TestWeakPtrFromStdModule.py (1424 of 1977) PASS: lldb-api :: functionalities/memory/cache/TestMemoryCache.py (1425 of 1977) PASS: lldb-unit :: ScriptInterpreter/Python/./ScriptInterpreterPythonTests/PythonDataObjectsTest.TestGlobalNameResolutionNoDot (1426 of 1977) UNSUPPORTED: lldb-api :: functionalities/unwind/standard/TestStandardUnwind.py (1427 of 1977) PASS: lldb-unit :: tools/lldb-server/tests/./LLDBServerTests/StandardStartupTest.TestStopReplyContainsThreadPcs (1428 of 1977) PASS: lldb-api :: api/command-return-object/TestSBCommandReturnObject.py (1429 of 1977) PASS: lldb-unit :: Utility/./UtilityTests/RecordReplayTest.InstrumentedBarPtr (1430 of 1977) PASS: lldb-shell :: SymbolFile/DWARF/debug_rnglists-dwo.s (1431 of 1977) UNSUPPORTED: lldb-api :: functionalities/thread/break_after_join/TestBreakAfterJoin.py (1432 of 1977) PASS: lldb-unit :: Utility/./UtilityTests/StringListTest.ForRange (1433 of 1977) PASS: lldb-shell :: Reproducer/TestVersionCheck.test (1434 of 1977) PASS: lldb-api :: functionalities/breakpoint/breakpoint_names/TestBreakpointNames.py (1435 of 1977) PASS: lldb-unit :: debugserver/./debugserverTests/RNBSocket.LoopBackListenIPv4 (1436 of 1977) PASS: lldb-unit :: Process/minidump/./LLDBMinidumpTests/MinidumpParserTest.FindMemoryRangeWithFullMemoryMinidump (1437 of 1977) PASS: lldb-unit :: Utility/./UtilityTests/FileSpecTest.FormatFileSpec (1438 of 1977) PASS: lldb-shell :: Reproducer/Functionalities/TestDataFormatter.test (1439 of 1977) PASS: lldb-unit :: Host/./HostTests/MainLoopTest.DetectsEOF (1440 of 1977) PASS: lldb-unit :: Symbol/./SymbolTests/TestTypeSystemClang.TestGetTypeClassDeclType (1441 of 1977) PASS: lldb-api :: lang/objc/direct-dispatch-step/TestObjCDirectDispatchStepping.py (1442 of 1977) PASS: lldb-api :: commands/expression/import-std-module/no-std-module/TestMissingStdModule.py (1443 of 1977) PASS: lldb-unit :: UnwindAssembly/x86/./UnwindAssemblyx86Tests/Testx86AssemblyInspectionEngine.TestSpillRegToStackViaMOVi386 (1444 of 1977) PASS: lldb-unit :: Utility/./UtilityTests/VMRange.IsValid (1445 of 1977) PASS: lldb-unit :: Host/./HostTests/MainLoopTest.TerminatesImmediately (1446 of 1977) PASS: lldb-shell :: SymbolFile/DWARF/childless-compile-unit.s (1447 of 1977) UNSUPPORTED: lldb-api :: benchmarks/libcxxmap/TestBenchmarkLibcxxMap.py (1448 of 1977) PASS: lldb-unit :: Utility/./UtilityTests/LogChannelTest.Disable (1449 of 1977) PASS: lldb-shell :: SymbolFile/DWARF/array-sizes.s (1450 of 1977) PASS: lldb-unit :: Target/./TargetTests/ExecutionContextTest.GetByteOrderProcess (1451 of 1977) PASS: lldb-unit :: Utility/./UtilityTests/DataExtractorTest.GetBitfield (1452 of 1977) PASS: lldb-shell :: ObjectFile/ELF/PT_LOAD.yaml (1453 of 1977) PASS: lldb-unit :: Utility/./UtilityTests/UriParserTest.BadPort (1454 of 1977) PASS: lldb-unit :: Host/./HostTests/HostInfoTest.GetHostname (1455 of 1977) PASS: lldb-api :: python_api/frame/get-variables/TestGetVariables.py (1456 of 1977) UNSUPPORTED: lldb-shell :: Register/x86-gp-read.test (1457 of 1977) PASS: lldb-unit :: Process/gdb-remote/./ProcessGdbRemoteTests/GDBRemoteCommunicationClientTest.SendSignalsToIgnore (1458 of 1977) PASS: lldb-unit :: Utility/./UtilityTests/DeserializerTest.HasData (1459 of 1977) PASS: lldb-unit :: Language/Highlighting/./HighlighterTests/HighlighterTest.ClangBraces (1460 of 1977) PASS: lldb-api :: functionalities/data-formatter/data-formatter-stl/libcxx/multimap/TestDataFormatterLibccMultiMap.py (1461 of 1977) PASS: lldb-api :: commands/expression/codegen-crash-typedefdecl-not-in_declcontext/TestCodegenCrashTypedefDeclNotInDeclContext.py (1462 of 1977) PASS: lldb-unit :: Symbol/./SymbolTests/TestClangASTImporter.MetadataPropagationIndirectImport (1463 of 1977) PASS: lldb-unit :: UnwindAssembly/x86/./UnwindAssemblyx86Tests/Testx86AssemblyInspectionEngine.TestDisassemblyMidFunctionEpilogues (1464 of 1977) PASS: lldb-api :: commands/expression/call-function/TestCallBuiltinFunction.py (1465 of 1977) UNSUPPORTED: lldb-shell :: SymbolFile/PDB/class-layout.test (1466 of 1977) PASS: lldb-unit :: Process/gdb-remote/./ProcessGdbRemoteTests/GDBRemoteCommunicationServerTest.SendErrorResponse_ErrorList (1467 of 1977) PASS: lldb-unit :: Target/./TargetTests/ModuleCacheTest.GetAndPutUuidExists (1468 of 1977) PASS: lldb-api :: commands/quit/TestQuit.py (1469 of 1977) PASS: lldb-api :: lang/cpp/virtual-overload/TestVirtualOverload.py (1470 of 1977) PASS: lldb-unit :: Utility/./UtilityTests/UriParserTest.BracketedHostnamePort (1471 of 1977) PASS: lldb-api :: functionalities/data-formatter/language_category_updates/TestDataFormatterLanguageCategoryUpdates.py (1472 of 1977) PASS: lldb-api :: lang/c/anonymous/TestAnonymous.py (1473 of 1977) PASS: lldb-unit :: Utility/./UtilityTests/RangeTest.LessThan (1474 of 1977) PASS: lldb-unit :: Utility/./UtilityTests/SubsystemRAIITest.NormalSubsystem (1475 of 1977) PASS: lldb-unit :: Utility/./UtilityTests/TildeExpressionResolver.ResolveFullPath (1476 of 1977) PASS: lldb-unit :: ScriptInterpreter/Python/./ScriptInterpreterPythonTests/PythonDataObjectsTest.TestPythonTupleToStructuredList (1477 of 1977) PASS: lldb-unit :: Utility/./UtilityTests/StringExtractorTest.GetHexU8_Underflow2 (1478 of 1977) PASS: lldb-unit :: Expression/./ExpressionTests/DiagnosticManagerTest.GetStringBasic (1479 of 1977) PASS: lldb-unit :: Interpreter/./InterpreterTests/CompletionTest.DirCompletionAbsolute (1480 of 1977) PASS: lldb-unit :: Utility/./UtilityTests/StreamTest.PutSLEB128 (1481 of 1977) PASS: lldb-shell :: ObjectFile/PECOFF/section-types.yaml (1482 of 1977) PASS: lldb-unit :: Utility/./UtilityTests/LogChannelEnabledTest.LogGetLogThread (1483 of 1977) PASS: lldb-unit :: Utility/./UtilityTests/ProcessInfoTest.Constructor (1484 of 1977) PASS: lldb-api :: functionalities/backticks/TestBackticksWithoutATarget.py (1485 of 1977) PASS: lldb-shell :: Minidump/Windows/find-module.test (1486 of 1977) PASS: lldb-shell :: ObjectFile/MachO/subsections.yaml (1487 of 1977) PASS: lldb-unit :: Utility/./UtilityTests/BinaryStreamTest.PutULEB128FourBytes (1488 of 1977) PASS: lldb-unit :: Utility/./UtilityTests/UriParserTest.MinimalPath (1489 of 1977) PASS: lldb-unit :: Utility/./UtilityTests/RecordReplayTest.InstrumentedFooSameThis (1490 of 1977) PASS: lldb-unit :: SymbolFile/NativePDB/./SymbolFileNativePDBTests/PDBFPOProgramToDWARFExpressionTests.UnresolvedDependentCyclicRegisterAssignmentReference (1491 of 1977) PASS: lldb-api :: types/TestCharTypeExpr.py (1492 of 1977) PASS: lldb-api :: commands/frame/var-scope/TestFrameVariableScope.py (1493 of 1977) PASS: lldb-unit :: Utility/./UtilityTests/FileSpecTest.RemoveLastPathComponent (1494 of 1977) PASS: lldb-unit :: ObjectFile/Breakpad/./ObjectFileBreakpadTests/Record.classify (1495 of 1977) PASS: lldb-api :: functionalities/thread/concurrent_events/TestConcurrentWatchBreak.py (1496 of 1977) PASS: lldb-api :: lang/objc/objc-super/TestObjCSuper.py (1497 of 1977) PASS: lldb-api :: python_api/watchpoint/TestWatchpointIter.py (1498 of 1977) PASS: lldb-api :: lang/objc/modules-update/TestClangModulesUpdate.py (1499 of 1977) PASS: lldb-unit :: Host/./HostTests/SocketTest.DomainGetConnectURI (1500 of 1977) UNSUPPORTED: lldb-api :: functionalities/exec/TestExec.py (1501 of 1977) PASS: lldb-unit :: Symbol/./SymbolTests/PostfixExpression.ToDWARF (1502 of 1977) PASS: lldb-api :: functionalities/data-formatter/data-formatter-advanced/TestDataFormatterAdv.py (1503 of 1977) PASS: lldb-unit :: Utility/./UtilityTests/StringListTest.LongestCommonPrefixDuplicateElement (1504 of 1977) PASS: lldb-unit :: SymbolFile/DWARF/./SymbolFileDWARFTests/SymbolFileDWARFTests.TestAbbrevNullAttrValidForm (1505 of 1977) PASS: lldb-unit :: Target/./TargetTests/ModuleCacheTest.GetAndPut (1506 of 1977) PASS: lldb-unit :: Utility/./UtilityTests/StreamTest.AddressPrefixAndSuffix (1507 of 1977) PASS: lldb-shell :: ObjectFile/ELF/gnu-debuglink.yaml (1508 of 1977) PASS: lldb-unit :: Utility/./UtilityTests/StreamTest.PutCStringWithStringRef (1509 of 1977) PASS: lldb-api :: functionalities/data-formatter/data-formatter-categories/TestDataFormatterCategories.py (1510 of 1977) PASS: lldb-api :: commands/frame/diagnose/local-variable/TestLocalVariable.py (1511 of 1977) UNSUPPORTED: lldb-shell :: ExecControl/StopHook/stop-hook-threads.test (1512 of 1977) PASS: lldb-unit :: Process/minidump/./LLDBMinidumpTests/MinidumpParserTest.GetLinuxProcStatus (1513 of 1977) PASS: lldb-api :: functionalities/dead-strip/TestDeadStrip.py (1514 of 1977) PASS: lldb-api :: macosx/dyld-trie-symbols/TestDyldTrieSymbols.py (1515 of 1977) PASS: lldb-unit :: Utility/./UtilityTests/StreamTest.AddressRange (1516 of 1977) PASS: lldb-unit :: Process/minidump/./LLDBMinidumpTests/MinidumpParserTest.GetPidWow64 (1517 of 1977) PASS: lldb-api :: tools/lldb-server/TestGdbRemoteProcessInfo.py (1518 of 1977) PASS: lldb-api :: lang/cpp/symbols/TestSymbols.py (1519 of 1977) PASS: lldb-api :: functionalities/thread/concurrent_events/TestConcurrentDelaySignalWatch.py (1520 of 1977) PASS: lldb-api :: lang/objc/objc_direct-methods/TestObjCDirectMethods.py (1521 of 1977) PASS: lldb-unit :: Utility/./UtilityTests/RangeTest.ClearWithStarAddress (1522 of 1977) PASS: lldb-unit :: Utility/./UtilityTests/AnsiTerminal.WhiteSpace (1523 of 1977) PASS: lldb-api :: commands/expression/deleting-implicit-copy-constructor/TestDeletingImplicitCopyConstructor.py (1524 of 1977) PASS: lldb-unit :: Utility/./UtilityTests/StreamTest.PutHex64ByteOrderBig (1525 of 1977) PASS: lldb-api :: python_api/watchpoint/TestSetWatchpoint.py (1526 of 1977) PASS: lldb-api :: functionalities/data-formatter/data-formatter-stl/libcxx/forward_list/TestDataFormatterLibcxxForwardList.py (1527 of 1977) PASS: lldb-api :: macosx/find-dsym/deep-bundle/TestDeepBundle.py (1528 of 1977) PASS: lldb-api :: functionalities/data-formatter/setvaluefromcstring/TestSetValueFromCString.py (1529 of 1977) PASS: lldb-api :: functionalities/data-formatter/varscript_formatting/TestDataFormatterVarScriptFormatting.py (1530 of 1977) PASS: lldb-unit :: Utility/./UtilityTests/StringListTest.JoinMultiCharSeparator (1531 of 1977) PASS: lldb-unit :: Process/minidump/./LLDBMinidumpTests/MinidumpParserTest.GetThreadsAndGetThreadContext (1532 of 1977) PASS: lldb-unit :: Utility/./UtilityTests/ScalarTest.Promotion (1533 of 1977) PASS: lldb-api :: functionalities/data-formatter/data-formatter-objc/TestDataFormatterObjCCF.py (1534 of 1977) PASS: lldb-api :: functionalities/type_completion/TestTypeCompletion.py (1535 of 1977) UNSUPPORTED: lldb-shell :: ScriptInterpreter/Lua/lua.test (1536 of 1977) PASS: lldb-api :: functionalities/target-new-solib-notifications/TestModuleLoadedNotifys.py (1537 of 1977) PASS: lldb-unit :: Target/./TargetTests/ExecutionContextTest.GetByteOrderTarget (1538 of 1977) PASS: lldb-unit :: Language/CPlusPlus/./LanguageCPlusPlusTests/CPlusPlusLanguage.MethodNameParsing (1539 of 1977) PASS: lldb-unit :: Process/gdb-remote/./ProcessGdbRemoteTests/GDBRemoteCommunicationClientTest.SendGetDataPacket (1540 of 1977) PASS: lldb-unit :: Utility/./UtilityTests/NameMatchesTest.Contains (1541 of 1977) PASS: lldb-api :: commands/frame/language/TestGuessLanguage.py (1542 of 1977) PASS: lldb-unit :: SymbolFile/DWARF/./SymbolFileDWARFTests/SymbolFileDWARFTests.TestAbbrevInvalidNULLTag (1543 of 1977) UNSUPPORTED: lldb-api :: functionalities/asan/TestReportData.py (1544 of 1977) PASS: lldb-api :: macosx/order/TestOrderFile.py (1545 of 1977) PASS: lldb-shell :: Quit/TestQuitExitCodeHex0.test (1546 of 1977) PASS: lldb-unit :: Utility/./UtilityTests/RangeTest.NotEqual (1547 of 1977) PASS: lldb-api :: functionalities/signal/raise/TestRaise.py (1548 of 1977) PASS: lldb-api :: python_api/module_section/TestModuleAndSection.py (1549 of 1977) PASS: lldb-api :: commands/frame/var/TestFrameVar.py (1550 of 1977) PASS: lldb-shell :: BuildScript/modes.test (1551 of 1977) PASS: lldb-unit :: UnwindAssembly/x86/./UnwindAssemblyx86Tests/Testx86AssemblyInspectionEngine.TestPushECX (1552 of 1977) PASS: lldb-unit :: Symbol/./SymbolTests/TestTypeSystemClang.TestDisplayNameEmpty (1553 of 1977) UNSUPPORTED: lldb-api :: lang/cpp/printf/TestPrintf.py (1554 of 1977) PASS: lldb-shell :: Settings/TestDisassemblyFormat.test (1555 of 1977) PASS: lldb-unit :: UnwindAssembly/x86/./UnwindAssemblyx86Tests/Testx86AssemblyInspectionEngine.TestPopEBP (1556 of 1977) PASS: lldb-api :: python_api/frame/inlines/TestInlinedFrame.py (1557 of 1977) PASS: lldb-api :: driver/batch_mode/TestBatchMode.py (1558 of 1977) PASS: lldb-unit :: Expression/./ExpressionTests/DiagnosticManagerTest.AppendMessageNoDiag (1559 of 1977) PASS: lldb-unit :: Utility/./UtilityTests/ConstStringTest.YAML (1560 of 1977) PASS: lldb-unit :: Symbol/./SymbolTests/TestClangASTImporter.MetadataPropagation (1561 of 1977) PASS: lldb-unit :: Symbol/./SymbolTests/TestTypeSystemClang.TestConvertAccessTypeToAccessSpecifier (1562 of 1977) PASS: lldb-unit :: UnwindAssembly/x86/./UnwindAssemblyx86Tests/Testx86AssemblyInspectionEngine.TestPopEBX (1563 of 1977) PASS: lldb-unit :: SymbolFile/NativePDB/./SymbolFileNativePDBTests/PDBFPOProgramToDWARFExpressionTests.UnresolvedCyclicRegisterAssignmentReference (1564 of 1977) PASS: lldb-unit :: Utility/./UtilityTests/StreamTeeTest.GetStreamAtIndexOutOfBounds (1565 of 1977) PASS: lldb-unit :: Language/Highlighting/./HighlighterTests/HighlighterTest.ClangUnterminatedString (1566 of 1977) XFAIL: lldb-shell :: Register/x86-mm-xmm-write.test (1567 of 1977) PASS: lldb-shell :: SymbolFile/Breakpad/stack-cfi-parsing.test (1568 of 1977) PASS: lldb-shell :: Reproducer/TestCaptureEnvOverride.test (1569 of 1977) UNSUPPORTED: lldb-api :: python_api/event/TestEvents.py (1570 of 1977) PASS: lldb-api :: lang/objc/objc-property/TestObjCProperty.py (1571 of 1977) PASS: lldb-api :: functionalities/thread/thread_specific_break/TestThreadSpecificBreakpoint.py (1572 of 1977) PASS: lldb-unit :: UnwindAssembly/x86/./UnwindAssemblyx86Tests/Testx86AssemblyInspectionEngine.TestPopEDI (1573 of 1977) PASS: lldb-shell :: ScriptInterpreter/None/import_module.test (1574 of 1977) PASS: lldb-api :: commands/expression/options/TestExprOptions.py (1575 of 1977) PASS: lldb-api :: lang/cpp/signed_types/TestSignedTypes.py (1576 of 1977) PASS: lldb-unit :: Utility/./UtilityTests/ScalarTest.Comparison (1577 of 1977) UNSUPPORTED: lldb-api :: commands/expression/completion-crash-invalid-iterator/TestInvalidIteratorCompletionCrash.py (1578 of 1977) PASS: lldb-unit :: UnwindAssembly/x86/./UnwindAssemblyx86Tests/Testx86AssemblyInspectionEngine.TestAddESP (1579 of 1977) PASS: lldb-shell :: ObjectFile/PECOFF/export-dllfunc.yaml (1580 of 1977) PASS: lldb-unit :: Process/gdb-remote/./ProcessGdbRemoteTests/GDBRemoteClientBaseTest.SendContinueDelegateInterface (1581 of 1977) PASS: lldb-api :: functionalities/signal/handle-abrt/TestHandleAbort.py (1582 of 1977) PASS: lldb-unit :: Utility/./UtilityTests/BinaryStreamTest.PutSLEB128OneByte (1583 of 1977) PASS: lldb-api :: functionalities/breakpoint/global_constructor/TestBreakpointInGlobalConstructor.py (1584 of 1977) PASS: lldb-api :: lang/objc/modules-inline-functions/TestModulesInlineFunctions.py (1585 of 1977) PASS: lldb-shell :: Reproducer/Functionalities/TestExpressionEvaluation.test (1586 of 1977) PASS: lldb-shell :: ObjectFile/ELF/netbsd-core-amd64.test (1587 of 1977) PASS: lldb-shell :: Commands/CommandScriptImmediateOutput/CommandScriptImmediateOutputConsole.test (1588 of 1977) PASS: lldb-api :: functionalities/memory/read/TestMemoryRead.py (1589 of 1977) PASS: lldb-api :: functionalities/thread/num_threads/TestNumThreads.py (1590 of 1977) PASS: lldb-api :: python_api/process/TestProcessAPI.py (1591 of 1977) PASS: lldb-shell :: Driver/TestCommands.test (1592 of 1977) PASS: lldb-api :: macosx/function-starts/TestFunctionStarts.py (1593 of 1977) PASS: lldb-shell :: Reproducer/TestDump.test (1594 of 1977) PASS: lldb-shell :: ObjectFile/ELF/PT_LOAD-empty.yaml (1595 of 1977) UNSUPPORTED: lldb-api :: functionalities/data-formatter/data-formatter-stl/libstdcpp/tuple/TestDataFormatterStdTuple.py (1596 of 1977) PASS: lldb-api :: python_api/section/TestSectionAPI.py (1597 of 1977) PASS: lldb-unit :: Process/minidump/./LLDBMinidumpTests/MinidumpParserTest.GetThreadContext_x86_32 (1598 of 1977) PASS: lldb-api :: functionalities/thread/backtrace_all/TestBacktraceAll.py (1599 of 1977) PASS: lldb-api :: functionalities/breakpoint/breakpoint_conditions/TestBreakpointConditions.py (1600 of 1977) PASS: lldb-api :: lang/objc/objc-dyn-sbtype/TestObjCDynamicSBType.py (1601 of 1977) PASS: lldb-unit :: SymbolFile/NativePDB/./SymbolFileNativePDBTests/PDBFPOProgramToDWARFExpressionTests.MultipleDependentAssignments (1602 of 1977) PASS: lldb-unit :: Utility/./UtilityTests/StreamTest.PutMaxHex64ByteOrderBig (1603 of 1977) PASS: lldb-shell :: SymbolFile/DWARF/dir-separator-posix.s (1604 of 1977) PASS: lldb-api :: functionalities/dynamic_value_child_count/TestDynamicValueChildCount.py (1605 of 1977) PASS: lldb-unit :: Utility/./UtilityTests/Flags.AnyClear (1606 of 1977) PASS: lldb-unit :: Utility/./UtilityTests/BinaryStreamTest.PutSLEB128NineBytes (1607 of 1977) PASS: lldb-unit :: Utility/./UtilityTests/EnvironmentTest.EnvpConstruction (1608 of 1977) PASS: lldb-shell :: SymbolFile/DWARF/find-variable-dwo.cpp (1609 of 1977) PASS: lldb-shell :: SymbolFile/DWARF/clang-ast-from-dwarf-unamed-and-anon-structs.cpp (1610 of 1977) PASS: lldb-unit :: Utility/./UtilityTests/FileSpecTest.FileAndDirectoryComponents (1611 of 1977) PASS: lldb-api :: commands/version/TestVersion.py (1612 of 1977) PASS: lldb-api :: lang/cpp/const_this/TestConstThis.py (1613 of 1977) PASS: lldb-api :: lang/objc/variadic_methods/TestVariadicMethods.py (1614 of 1977) PASS: lldb-api :: functionalities/data-formatter/data-formatter-stl/libstdcpp/unique_ptr/invalid/TestDataFormatterInvalidStdUniquePtr.py (1615 of 1977) PASS: lldb-shell :: Breakpoint/debug_addrx.test (1616 of 1977) PASS: lldb-api :: python_api/lldbutil/frame/TestFrameUtils.py (1617 of 1977) PASS: lldb-api :: functionalities/gdb_remote_client/TestPlatformClient.py (1618 of 1977) PASS: lldb-api :: lang/objc/modules-non-objc-target/TestObjCModulesNonObjCTarget.py (1619 of 1977) PASS: lldb-unit :: SymbolFile/NativePDB/./SymbolFileNativePDBTests/PDBFPOProgramToDWARFExpressionTests.UnsupportedRASearch (1620 of 1977) PASS: lldb-api :: functionalities/postmortem/minidump-new/TestMiniDumpUUID.py (1621 of 1977) PASS: lldb-unit :: Utility/./UtilityTests/VASprintfTest.BufferResize (1622 of 1977) PASS: lldb-unit :: Utility/./UtilityTests/RegularExpression.Valid (1623 of 1977) PASS: lldb-unit :: Symbol/./SymbolTests/TestTypeSystemClang.TestUnifyAccessSpecifiers (1624 of 1977) UNSUPPORTED: lldb-shell :: SymbolFile/PDB/function-level-linking.test (1625 of 1977) PASS: lldb-shell :: SymbolFile/Breakpad/line-table-edgecases.test (1626 of 1977) PASS: lldb-unit :: Utility/./UtilityTests/RecordReplayTest.InstrumentedFoo (1627 of 1977) PASS: lldb-api :: functionalities/gdb_remote_client/TestIOSSimulator.py (1628 of 1977) PASS: lldb-api :: functionalities/gdb_remote_client/TestNoGPacketSupported.py (1629 of 1977) PASS: lldb-api :: python_api/breakpoint/TestBreakpointAPI.py (1630 of 1977) PASS: lldb-unit :: Utility/./UtilityTests/StreamTest.AddressEmptyPrefix (1631 of 1977) PASS: lldb-api :: tools/lldb-vscode/attach/TestVSCode_attach.py (1632 of 1977) PASS: lldb-api :: functionalities/postmortem/elf-core/gcore/TestGCore.py (1633 of 1977) PASS: lldb-shell :: Reproducer/TestGDBRemoteRepro.test (1634 of 1977) PASS: lldb-unit :: ScriptInterpreter/Python/./ScriptInterpreterPythonTests/PythonDataObjectsTest.TestModuleNameResolutionNoDot (1635 of 1977) UNSUPPORTED: lldb-shell :: SymbolFile/Breakpad/stack-cfi-arm.yaml (1636 of 1977) PASS: lldb-unit :: Utility/./UtilityTests/BinaryStreamTest.PutULEB128MaxValue (1637 of 1977) PASS: lldb-unit :: Host/./HostTests/NativeProcessProtocolTest.ReadCStringFromMemory_CrossPageBoundary (1638 of 1977) PASS: lldb-shell :: ObjectFile/MachO/lc_version_min.yaml (1639 of 1977) PASS: lldb-api :: python_api/watchpoint/watchlocation/TestSetWatchlocation.py (1640 of 1977) PASS: lldb-shell :: SymbolFile/DWARF/apple-index-is-used.cpp (1641 of 1977) PASS: lldb-unit :: Utility/./UtilityTests/RangeTest.SetRangeBase (1642 of 1977) UNSUPPORTED: lldb-api :: commands/target/auto-install-main-executable/TestAutoInstallMainExecutable.py (1643 of 1977) PASS: lldb-api :: commands/expression/completion-in-lambda-and-unnamed-class/TestCompletionInLambdaAndUnnamedClass.py (1644 of 1977) PASS: lldb-api :: commands/expression/issue_11588/Test11588.py (1645 of 1977) PASS: lldb-unit :: Utility/./UtilityTests/UriParserTest.SchemeHostSeparator4 (1646 of 1977) PASS: lldb-unit :: ScriptInterpreter/Python/./ScriptInterpreterPythonTests/PythonDataObjectsTest.TestPythonFile (1647 of 1977) PASS: lldb-shell :: SymbolFile/DWARF/split-dwarf-multiple-cu.ll (1648 of 1977) PASS: lldb-api :: functionalities/data-formatter/data-formatter-objc/TestDataFormatterObjCNSDate.py (1649 of 1977) PASS: lldb-api :: functionalities/thread/concurrent_events/TestConcurrentManyCrash.py (1650 of 1977) PASS: lldb-unit :: Utility/./UtilityTests/ConstStringTest.CompareConstString (1651 of 1977) PASS: lldb-api :: functionalities/type_lookup/TestTypeLookup.py (1652 of 1977) PASS: lldb-api :: commands/process/attach/attach_denied/TestAttachDenied.py (1653 of 1977) PASS: lldb-shell :: Minidump/memory-region-from-module.yaml (1654 of 1977) PASS: lldb-shell :: ObjectFile/ELF/PT_LOAD-overlap-section.yaml (1655 of 1977) PASS: lldb-unit :: Utility/./UtilityTests/StreamTest.PutHex8 (1656 of 1977) PASS: lldb-unit :: Process/minidump/./LLDBMinidumpTests/RegisterContextMinidump.CheckRegisterContextMinidump_ARM (1657 of 1977) PASS: lldb-unit :: UnwindAssembly/x86/./UnwindAssemblyx86Tests/Testx86AssemblyInspectionEngine.TestPopRBPWithREX (1658 of 1977) PASS: lldb-api :: commands/expression/no-deadlock/TestExprDoesntBlock.py (1659 of 1977) PASS: lldb-unit :: SymbolFile/NativePDB/./SymbolFileNativePDBTests/PDBFPOProgramToDWARFExpressionTests.SingleAssignmentRegisterRef (1660 of 1977) PASS: lldb-unit :: Utility/./UtilityTests/LogTest.Register (1661 of 1977) PASS: lldb-api :: functionalities/thread/concurrent_events/TestConcurrentDelayedCrashWithBreakpointSignal.py (1662 of 1977) PASS: lldb-unit :: Expression/./ExpressionTests/DiagnosticManagerTest.PutStringMultiple (1663 of 1977) PASS: lldb-unit :: Utility/./UtilityTests/SerializationRountripTest.SerializeDeserializePodReferences (1664 of 1977) PASS: lldb-unit :: Utility/./UtilityTests/StringListTest.LongestCommonPrefix (1665 of 1977) PASS: lldb-api :: python_api/disassemble-raw-data/TestDisassembleRawData.py (1666 of 1977) PASS: lldb-api :: lang/c/tls_globals/TestTlsGlobals.py (1667 of 1977) PASS: lldb-api :: tools/lldb-vscode/variables/TestVSCode_variables.py (1668 of 1977) PASS: lldb-unit :: Utility/./UtilityTests/UriParserTest.TypicalPortPathIPv4 (1669 of 1977) PASS: lldb-unit :: Utility/./UtilityTests/Flags.Reset (1670 of 1977) PASS: lldb-api :: python_api/findvalue_duplist/TestSBFrameFindValue.py (1671 of 1977) PASS: lldb-shell :: SymbolFile/DWARF/debug_ranges_and_rnglists.test (1672 of 1977) PASS: lldb-api :: lang/cpp/function-qualifiers/TestCppFunctionQualifiers.py (1673 of 1977) PASS: lldb-unit :: Signals/./SignalsTests/UnixSignalsTest.Iteration (1674 of 1977) PASS: lldb-unit :: Utility/./UtilityTests/RangeDataVector.FindEntryIndexesThatContain_Overlap (1675 of 1977) PASS: lldb-unit :: Utility/./UtilityTests/SharedCluster.ClusterManager (1676 of 1977) UNSUPPORTED: lldb-shell :: SymbolFile/DWARF/debug-types-expressions.test (1677 of 1977) PASS: lldb-api :: functionalities/breakpoint/require_hw_breakpoints/TestRequireHWBreakpoints.py (1678 of 1977) PASS: lldb-shell :: SymbolFile/DWARF/compilercontext.ll (1679 of 1977) UNSUPPORTED: lldb-shell :: Minidump/Windows/arm-fp-unwind.test (1680 of 1977) PASS: lldb-api :: types/TestLongTypesExpr.py (1681 of 1977) PASS: lldb-shell :: SymbolFile/DWARF/debug_ranges-missing-section.s (1682 of 1977) PASS: lldb-unit :: Utility/./UtilityTests/ConstStringTest.FromMidOfBufferStringRef (1683 of 1977) PASS: lldb-api :: api/multiple-targets/TestMultipleTargets.py (1684 of 1977) PASS: lldb-unit :: Utility/./UtilityTests/BinaryStreamTest.PutULEB128SevenBytes (1685 of 1977) PASS: lldb-unit :: UnwindAssembly/x86/./UnwindAssemblyx86Tests/Testx86AssemblyInspectionEngine.TestCALLNextInsn (1686 of 1977) PASS: lldb-unit :: Utility/./UtilityTests/StreamTest.PutBytesAsRawHex8ToBigEndian (1687 of 1977) PASS: lldb-unit :: Utility/./UtilityTests/StreamTest.PutChar (1688 of 1977) PASS: lldb-shell :: Commands/command-regex-delete.test (1689 of 1977) UNSUPPORTED: lldb-api :: functionalities/darwin_log/filter/regex/category/TestDarwinLogFilterRegexCategory.py (1690 of 1977) PASS: lldb-unit :: Process/gdb-remote/./ProcessGdbRemoteTests/GDBRemoteCommunicationClientTest.GetMemoryRegionInfoInvalidResponse (1691 of 1977) PASS: lldb-api :: functionalities/thread/concurrent_events/TestConcurrentCrashWithSignal.py (1692 of 1977) PASS: lldb-api :: functionalities/thread/concurrent_events/TestConcurrentManyWatchpoints.py (1693 of 1977) PASS: lldb-api :: functionalities/gdb_remote_client/TestRegDefinitionInParts.py (1694 of 1977) PASS: lldb-api :: lang/c/conflicting-symbol/TestConflictingSymbol.py (1695 of 1977) UNSUPPORTED: lldb-shell :: Register/x86-ymm-read.test (1696 of 1977) PASS: lldb-unit :: UnwindAssembly/x86/./UnwindAssemblyx86Tests/Testx86AssemblyInspectionEngine.TestPopRBX (1697 of 1977) PASS: lldb-unit :: Utility/./UtilityTests/BinaryStreamTest.PutULEB128SixBytes (1698 of 1977) PASS: lldb-api :: lang/objc/modules-cache/TestClangModulesCache.py (1699 of 1977) PASS: lldb-unit :: Host/./HostTests/SocketTest.UDPGetConnectURI (1700 of 1977) PASS: lldb-unit :: Utility/./UtilityTests/FileSpecTest.GetPath (1701 of 1977) PASS: lldb-unit :: Utility/./UtilityTests/TimeoutTest.Construction (1702 of 1977) PASS: lldb-unit :: Utility/./UtilityTests/StatusTest.Formatv (1703 of 1977) PASS: lldb-unit :: Host/./HostTests/SocketTest.TCPGetAddress (1704 of 1977) PASS: lldb-unit :: Utility/./UtilityTests/StringExtractorTest.GetHexU8_Exact (1705 of 1977) PASS: lldb-api :: functionalities/wrong_commands/TestWrongCommands.py (1706 of 1977) PASS: lldb-api :: functionalities/testid/TestTestId.py (1707 of 1977) PASS: lldb-api :: functionalities/breakpoint/breakpoint_set_restart/TestBreakpointSetRestart.py (1708 of 1977) UNSUPPORTED: lldb-shell :: Register/x86-64-xmm16-write.test (1709 of 1977) PASS: lldb-unit :: SymbolFile/DWARF/./SymbolFileDWARFTests/SymbolFileDWARFTests.TestAbbrevOrder1Start1 (1710 of 1977) PASS: lldb-unit :: Utility/./UtilityTests/StringExtractorTest.GetHexU8_Underflow (1711 of 1977) PASS: lldb-api :: commands/expression/pr35310/TestExprsBug35310.py (1712 of 1977) PASS: lldb-shell :: Reproducer/TestRelativePath.test (1713 of 1977) PASS: lldb-api :: commands/expression/test/TestExprs.py (1714 of 1977) PASS: lldb-api :: functionalities/thread/concurrent_events/TestConcurrentTwoBreakpointThreads.py (1715 of 1977) PASS: lldb-api :: lang/c/forward/TestForwardDeclaration.py (1716 of 1977) PASS: lldb-unit :: ScriptInterpreter/Python/./ScriptInterpreterPythonTests/PythonDataObjectsTest.TestPythonBytes (1717 of 1977) PASS: lldb-unit :: Utility/./UtilityTests/StreamTest.PutMaxHex64ByteOrderLittle (1718 of 1977) UNSUPPORTED: lldb-api :: functionalities/darwin_log/filter/exact_match/category/TestDarwinLogFilterMatchCategory.py (1719 of 1977) PASS: lldb-unit :: Utility/./UtilityTests/DataExtractorTest.GetCStr (1720 of 1977) PASS: lldb-unit :: Process/gdb-remote/./ProcessGdbRemoteTests/GDBRemoteClientBaseTest.SendPacketAndReceiveResponseWithOutputSupport (1721 of 1977) PASS: lldb-unit :: Utility/./UtilityTests/StreamTest.PutNHex8 (1722 of 1977) PASS: lldb-api :: tools/lldb-server/TestGdbRemote_qThreadStopInfo.py (1723 of 1977) PASS: lldb-api :: functionalities/data-formatter/format-propagation/TestFormatPropagation.py (1724 of 1977) PASS: lldb-shell :: SymbolFile/DWARF/find-basic-namespace.cpp (1725 of 1977) PASS: lldb-api :: functionalities/data-formatter/nsarraysynth/TestNSArraySynthetic.py (1726 of 1977) UNSUPPORTED: lldb-shell :: Register/x86-64-zmm-read.test (1727 of 1977) PASS: lldb-api :: functionalities/thread/step_until/TestStepUntil.py (1728 of 1977) PASS: lldb-unit :: Symbol/./SymbolTests/TestTypeSystemClang.TestGetTypeClassTypeOf (1729 of 1977) UNSUPPORTED: lldb-api :: benchmarks/continue/TestBenchmarkContinue.py (1730 of 1977) PASS: lldb-shell :: Driver/TestTarget.test (1731 of 1977) PASS: lldb-api :: lang/cpp/namespace_conflicts/TestNamespaceConflicts.py (1732 of 1977) PASS: lldb-shell :: ObjectFile/ELF/many-sections.s (1733 of 1977) PASS: lldb-api :: lang/c/function_types/TestFunctionTypes.py (1734 of 1977) PASS: lldb-api :: functionalities/data-formatter/data-formatter-objc/TestDataFormatterObjCNSData.py (1735 of 1977) PASS: lldb-api :: functionalities/float-display/TestFloatDisplay.py (1736 of 1977) UNSUPPORTED: lldb-api :: python_api/disassemble-raw-data/TestDisassemble_VST1_64.py (1737 of 1977) PASS: lldb-unit :: Utility/./UtilityTests/ArchSpecTest.TestParseMachCPUDashSubtypeTripleExtra (1738 of 1977) PASS: lldb-api :: commands/target/stop-hooks/TestStopHooks.py (1739 of 1977) PASS: lldb-shell :: SymbolFile/Breakpad/line-table.test (1740 of 1977) PASS: lldb-unit :: ScriptInterpreter/Python/./ScriptInterpreterPythonTests/PythonDataObjectsTest.TestGlobalNameResolutionWithDot (1741 of 1977) PASS: lldb-api :: lang/objc/modules-app-update/TestClangModulesAppUpdate.py (1742 of 1977) PASS: lldb-api :: functionalities/thread/concurrent_events/TestConcurrentTwoWatchpointsOneDelayBreakpoint.py (1743 of 1977) PASS: lldb-shell :: SymbolFile/DWARF/debug_loc-aslr.s (1744 of 1977) PASS: lldb-api :: functionalities/data-formatter/data-formatter-objc/TestDataFormatterObjCKVO.py (1745 of 1977) PASS: lldb-api :: functionalities/gdb_remote_client/TestNestedRegDefinitions.py (1746 of 1977) PASS: lldb-shell :: Breakpoint/debug_rnglist_rlestartend.test (1747 of 1977) PASS: lldb-shell :: SymbolFile/DWARF/find-qualified-variable.cpp (1748 of 1977) PASS: lldb-api :: lang/c/step_over_no_deadlock/TestStepOverDoesntBlock.py (1749 of 1977) PASS: lldb-unit :: Expression/./ExpressionTests/DiagnosticManagerTest.GetStringPreserveOrder (1750 of 1977) PASS: lldb-unit :: Target/./TargetTests/PathMappingListTest.RelativeTests (1751 of 1977) PASS: lldb-api :: lang/objc/foundation/TestSymbolTable.py (1752 of 1977) PASS: lldb-api :: macosx/load-kext/TestLoadKext.py (1753 of 1977) PASS: lldb-api :: functionalities/data-formatter/data-formatter-stl/libcxx/bitset/TestDataFormatterLibcxxBitset.py (1754 of 1977) PASS: lldb-unit :: Utility/./UtilityTests/SerializationRountripTest.SerializeDeserializePod (1755 of 1977) PASS: lldb-unit :: Language/Highlighting/./HighlighterTests/HighlighterTest.ClangScalarLiterals (1756 of 1977) PASS: lldb-unit :: Symbol/./SymbolTests/TestTypeSystemClang.TestGetEnumIntegerTypeUnexpectedType (1757 of 1977) PASS: lldb-api :: lang/cpp/llvm-style/TestLLVMStyle.py (1758 of 1977) PASS: lldb-api :: functionalities/thread/concurrent_events/TestConcurrentWatchBreakDelay.py (1759 of 1977) PASS: lldb-unit :: Utility/./UtilityTests/TimeoutTest.Format (1760 of 1977) PASS: lldb-shell :: ObjectFile/MachO/lc_build_version_notools.yaml (1761 of 1977) PASS: lldb-shell :: Host/TestCustomShell.test (1762 of 1977) PASS: lldb-unit :: Language/Highlighting/./HighlighterTests/HighlighterTest.Colons (1763 of 1977) UNSUPPORTED: lldb-api :: functionalities/darwin_log/format/TestDarwinLogMessageFormat.py (1764 of 1977) PASS: lldb-api :: lang/objc/objc++/TestObjCXX.py (1765 of 1977) PASS: lldb-shell :: SymbolFile/NativePDB/function-types-builtins.cpp (1766 of 1977) UNSUPPORTED: lldb-shell :: Register/x86-64-zmm-write.test (1767 of 1977) PASS: lldb-unit :: Utility/./UtilityTests/RangeTest.Clear (1768 of 1977) PASS: lldb-unit :: Host/./HostTests/SocketTest.TCPGetConnectURI (1769 of 1977) PASS: lldb-api :: functionalities/data-formatter/data-formatter-smart-array/TestDataFormatterSmartArray.py (1770 of 1977) PASS: lldb-unit :: UnwindAssembly/x86/./UnwindAssemblyx86Tests/Testx86AssemblyInspectionEngine.TestPushEDI (1771 of 1977) PASS: lldb-unit :: UnwindAssembly/x86/./UnwindAssemblyx86Tests/Testx86AssemblyInspectionEngine.TestAddRSP (1772 of 1977) PASS: lldb-api :: commands/expression/import_builtin_fileid/TestImportBuiltinFileID.py (1773 of 1977) PASS: lldb-shell :: SymbolFile/DWARF/DW_AT_low_pc-addrx.s (1774 of 1977) PASS: lldb-api :: python_api/sblaunchinfo/TestSBLaunchInfo.py (1775 of 1977) PASS: lldb-unit :: Core/./LLDBCoreTests/RichManglingContextTest.FromCxxMethodName (1776 of 1977) PASS: lldb-unit :: Utility/./UtilityTests/SubsystemRAIITest.SubsystemWithErrorSuccess (1777 of 1977) PASS: lldb-api :: functionalities/lazy-loading/TestLazyLoading.py (1778 of 1977) PASS: lldb-api :: commands/expression/import-std-module/list/TestListFromStdModule.py (1779 of 1977) PASS: lldb-unit :: Process/minidump/./LLDBMinidumpTests/MinidumpParserTest.GetExceptionStream (1780 of 1977) PASS: lldb-unit :: Utility/./UtilityTests/ScalarTest.Scalar_512 (1781 of 1977) UNSUPPORTED: lldb-shell :: BuildScript/toolchain-msvc.test (1782 of 1977) PASS: lldb-unit :: Process/minidump/./LLDBMinidumpTests/MinidumpParserTest.GetPid (1783 of 1977) PASS: lldb-unit :: ObjectFile/Breakpad/./ObjectFileBreakpadTests/ModuleRecord.parse (1784 of 1977) UNSUPPORTED: lldb-api :: commands/expression/multiline-completion/TestMultilineCompletion.py (1785 of 1977) PASS: lldb-api :: functionalities/completion/TestCompletion.py (1786 of 1977) UNSUPPORTED: lldb-api :: commands/watchpoints/hello_watchlocation/TestWatchLocation.py (1787 of 1977) PASS: lldb-unit :: Utility/./UtilityTests/SerializationRountripTest.SerializeDeserializeObjectPointer (1788 of 1977) PASS: lldb-api :: functionalities/data-formatter/data-formatter-stl/libcxx/map/TestDataFormatterLibccMap.py (1789 of 1977) UNSUPPORTED: lldb-shell :: SymbolFile/PDB/typedefs.test (1790 of 1977) PASS: lldb-unit :: Expression/./ExpressionTests/DiagnosticManagerTest.AppendMessageAttachToLastDiag (1791 of 1977) PASS: lldb-api :: python_api/lldbutil/iter/TestRegistersIterator.py (1792 of 1977) PASS: lldb-api :: commands/expression/import-std-module/weak_ptr-dbg-info-content/TestDbgInfoContentWeakPtrFromStdModule.py (1793 of 1977) PASS: lldb-unit :: Host/./HostTests/NativeProcessProtocolTest.SetBreakpointFailRead (1794 of 1977) PASS: lldb-api :: lang/cpp/enum_types/TestCPP11EnumTypes.py (1795 of 1977) PASS: lldb-unit :: Utility/./UtilityTests/UriParserTest.TypicalPortPathIPv6 (1796 of 1977) PASS: lldb-unit :: SymbolFile/DWARF/./SymbolFileDWARFTests/SymbolFileDWARFTests.ParseArangesNonzeroSegmentSize (1797 of 1977) PASS: lldb-api :: lang/objc/objc-ivar-stripped/TestObjCIvarStripped.py (1798 of 1977) PASS: lldb-api :: types/TestDoubleTypesExpr.py (1799 of 1977) UNSUPPORTED: lldb-shell :: Register/x86-zmm-read.test (1800 of 1977) PASS: lldb-api :: lang/cpp/static_methods/TestCPPStaticMethods.py (1801 of 1977) PASS: lldb-api :: functionalities/breakpoint/breakpoint_command/TestBreakpointCommand.py (1802 of 1977) PASS: lldb-unit :: Utility/./UtilityTests/Predicate.WaitForValueEqualTo (1803 of 1977) PASS: lldb-api :: lang/cpp/breakpoint-commands/TestCPPBreakpointCommands.py (1804 of 1977) PASS: lldb-unit :: Expression/./ExpressionTests/ClangExpressionDeclMapTest.TestUnknownIdentifierLookup (1805 of 1977) PASS: lldb-unit :: Platform/./LLDBPlatformTests/PlatformDarwinTest.FindXcodeContentsDirectoryInPath (1806 of 1977) PASS: lldb-api :: functionalities/thread/concurrent_events/TestConcurrentBreakpointsDelayedBreakpointOneWatchpoint.py (1807 of 1977) PASS: lldb-api :: types/TestIntegerTypeExpr.py (1808 of 1977) PASS: lldb-api :: lang/objc/objc-new-syntax/TestObjCNewSyntaxDictionary.py (1809 of 1977) PASS: lldb-unit :: ScriptInterpreter/Python/./ScriptInterpreterPythonTests/PythonDataObjectsTest.TestPythonListManipulation (1810 of 1977) PASS: lldb-shell :: Driver/TestProcessAttach.test (1811 of 1977) PASS: lldb-unit :: Utility/./UtilityTests/ListenerTest.GetEventWait (1812 of 1977) PASS: lldb-api :: functionalities/data-formatter/data-formatter-synth/TestDataFormatterSynth.py (1813 of 1977) PASS: lldb-api :: python_api/exprpath_synthetic/TestExprPathSynthetic.py (1814 of 1977) PASS: lldb-unit :: Utility/./UtilityTests/StringExtractorTest.GetHexBytes_OddPair (1815 of 1977) PASS: lldb-unit :: Process/minidump/./LLDBMinidumpTests/MinidumpParserTest.FindMemoryRange (1816 of 1977) PASS: lldb-api :: python_api/process/io/TestProcessIO.py (1817 of 1977) PASS: lldb-shell :: SymbolFile/Breakpad/unwind-via-stack-cfi.test (1818 of 1977) PASS: lldb-shell :: Breakpoint/split-dwarf5-debug-stroffsets.test (1819 of 1977) PASS: lldb-unit :: Expression/./ExpressionTests/CppModuleConfigurationTest.MissingLibCpp (1820 of 1977) PASS: lldb-unit :: Utility/./UtilityTests/SerializationRountripTest.SerializeDeserializeCStringArray (1821 of 1977) PASS: lldb-unit :: Utility/./UtilityTests/ArgsTest.BareSingleQuote (1822 of 1977) PASS: lldb-unit :: UnwindAssembly/x86/./UnwindAssemblyx86Tests/Testx86AssemblyInspectionEngine.TestSimplex86_64Augmented (1823 of 1977) PASS: lldb-unit :: Utility/./UtilityTests/StringExtractorTest.GetHexBytes_Underflow (1824 of 1977) PASS: lldb-unit :: Symbol/./SymbolTests/LineEntryTest.GetSameLineContiguousAddressRangeOneInline (1825 of 1977) PASS: lldb-api :: functionalities/data-formatter/data-formatter-objc/TestDataFormatterObjCNSContainer.py (1826 of 1977) PASS: lldb-api :: commands/target/create-no-such-arch/TestNoSuchArch.py (1827 of 1977) PASS: lldb-api :: functionalities/pre_run_dylibs/TestPreRunDylibs.py (1828 of 1977) PASS: lldb-api :: functionalities/breakpoint/comp_dir_symlink/TestCompDirSymLink.py (1829 of 1977) PASS: lldb-unit :: Utility/./UtilityTests/FileSpecTest.EqualDotsPosix (1830 of 1977) PASS: lldb-unit :: UnwindAssembly/x86/./UnwindAssemblyx86Tests/Testx86AssemblyInspectionEngine.TestPushRBX (1831 of 1977) UNSUPPORTED: lldb-api :: functionalities/darwin_log/filter/exact_match/activity-chain/TestDarwinLogFilterMatchActivityChain.py (1832 of 1977) PASS: lldb-api :: lang/cpp/extern_c/TestExternCSymbols.py (1833 of 1977) UNSUPPORTED: lldb-api :: functionalities/unwind/ehframe/TestEhFrameUnwind.py (1834 of 1977) PASS: lldb-api :: commands/expression/calculator_mode/TestCalculatorMode.py (1835 of 1977) PASS: lldb-unit :: Language/CPlusPlus/./LanguageCPlusPlusTests/CPlusPlusLanguage.CPlusPlusNameParser (1836 of 1977) PASS: lldb-unit :: Utility/./UtilityTests/RangeTest.SlideZero (1837 of 1977) PASS: lldb-shell :: Reproducer/TestDiscard.test (1838 of 1977) PASS: lldb-api :: functionalities/breakpoint/scripted_bkpt/TestScriptedResolver.py (1839 of 1977) PASS: lldb-unit :: SymbolFile/NativePDB/./SymbolFileNativePDBTests/PDBFPOProgramToDWARFExpressionTests.InvalidOpUnary (1840 of 1977) PASS: lldb-api :: functionalities/data-formatter/refpointer-recursion/TestDataFormatterRefPtrRecursion.py (1841 of 1977) PASS: lldb-unit :: Utility/./UtilityTests/UriParserTest.LongPath (1842 of 1977) PASS: lldb-api :: functionalities/step_scripted/TestStepScripted.py (1843 of 1977) PASS: lldb-unit :: Utility/./UtilityTests/OptionsWithRawTest.EmptySuffixSingleWhitespace (1844 of 1977) PASS: lldb-unit :: Utility/./UtilityTests/AnsiTerminal.Basic (1845 of 1977) PASS: lldb-unit :: Editline/./EditlineTests/EditlineTestFixture.EditlineReceivesSingleLineText (1846 of 1977) PASS: lldb-shell :: SymbolFile/DWARF/forward-declarations.s (1847 of 1977) UNSUPPORTED: lldb-api :: macosx/macabi/TestMacABImacOSFramework.py (1848 of 1977) UNSUPPORTED: lldb-api :: commands/watchpoints/variable_out_of_scope/TestWatchedVarHitWhenInScope.py (1849 of 1977) PASS: lldb-unit :: Utility/./UtilityTests/StringExtractorTest.GetU32BigEndian (1850 of 1977) UNSUPPORTED: lldb-shell :: ScriptInterpreter/Lua/command_script_import.test (1851 of 1977) PASS: lldb-unit :: ScriptInterpreter/Python/./ScriptInterpreterPythonTests/PythonDataObjectsTest.TestRun (1852 of 1977) PASS: lldb-api :: functionalities/data-formatter/ptr_ref_typedef/TestPtrRef2Typedef.py (1853 of 1977) PASS: lldb-api :: functionalities/abbreviation/TestCommonShortSpellings.py (1854 of 1977) PASS: lldb-api :: lang/objcxx/class-name-clash/TestNameClash.py (1855 of 1977) PASS: lldb-unit :: Process/gdb-remote/./ProcessGdbRemoteTests/GDBRemoteCommunicationClientTest.GetModulesInfoInvalidResponse (1856 of 1977) PASS: lldb-unit :: UnwindAssembly/x86/./UnwindAssemblyx86Tests/Testx86AssemblyInspectionEngine.TestPushImm (1857 of 1977) PASS: lldb-shell :: SymbolFile/DWARF/dwp-debug-types.s (1858 of 1977) PASS: lldb-api :: lang/cpp/dynamic-value/TestDynamicValue.py (1859 of 1977) UNSUPPORTED: lldb-shell :: Register/x86-64-ymm16-read.test (1860 of 1977) PASS: lldb-unit :: Core/./LLDBCoreTests/RichManglingContextTest.IPDRealloc (1861 of 1977) PASS: lldb-unit :: UnwindAssembly/x86/./UnwindAssemblyx86Tests/Testx86AssemblyInspectionEngine.TestSubRSP (1862 of 1977) PASS: lldb-api :: lang/cpp/template-function/TestTemplateFunctions.py (1863 of 1977) PASS: lldb-api :: tools/lldb-vscode/breakpoint/TestVSCode_setExceptionBreakpoints.py (1864 of 1977) UNSUPPORTED: lldb-shell :: ObjectFile/ELF/minidebuginfo-set-and-hit-breakpoint.test (1865 of 1977) PASS: lldb-api :: functionalities/data-formatter/cstring-utf8-summary/TestCstringUnicode.py (1866 of 1977) PASS: lldb-unit :: Symbol/./SymbolTests/TestTypeSystemClang.TestIsClangType (1867 of 1977) PASS: lldb-unit :: Symbol/./SymbolTests/TestClangASTImporter.CopyDeclTagDecl (1868 of 1977) PASS: lldb-api :: functionalities/thread/concurrent_events/TestConcurrentSignalNWatchNBreak.py (1869 of 1977) PASS: lldb-unit :: Utility/./UtilityTests/FileSpecTest.GuessPathStyle (1870 of 1977) PASS: lldb-unit :: Host/./HostTests/FileSystemTest.GetByteSize (1871 of 1977) PASS: lldb-api :: lang/c/blocks/TestBlocks.py (1872 of 1977) PASS: lldb-unit :: Process/gdb-remote/./ProcessGdbRemoteTests/GDBRemoteCommunicationClientTest.ReadRegister (1873 of 1977) PASS: lldb-api :: commands/expression/dollar-in-variable/TestDollarInVariable.py (1874 of 1977) PASS: lldb-api :: lang/c/array_types/TestArrayTypes.py (1875 of 1977) PASS: lldb-unit :: Expression/./ExpressionTests/DiagnosticManagerTest.HasFixits (1876 of 1977) PASS: lldb-unit :: Process/minidump/./LLDBMinidumpTests/MinidumpParserTest.GetThreadContext_x86_64 (1877 of 1977) PASS: lldb-unit :: Utility/./UtilityTests/AnsiTerminal.AtEnd (1878 of 1977) PASS: lldb-unit :: Process/gdb-remote/./ProcessGdbRemoteTests/GDBRemoteClientBaseTest.SendContinueAndLateInterrupt (1879 of 1977) PASS: lldb-unit :: Host/./HostTests/MainLoopTest.Signal (1880 of 1977) UNSUPPORTED: lldb-api :: functionalities/tsan/thread_numbers/TestTsanThreadNumbers.py (1881 of 1977) PASS: lldb-api :: functionalities/data-formatter/data-formatter-objc/TestDataFormatterObjCExpr.py (1882 of 1977) XFAIL: lldb-shell :: SymbolFile/DWARF/find-type-in-function.cpp (1883 of 1977) UNSUPPORTED: lldb-shell :: Register/x86-64-ymm16-write.test (1884 of 1977) UNSUPPORTED: lldb-api :: functionalities/darwin_log/basic/TestDarwinLogBasic.py (1885 of 1977) PASS: lldb-api :: functionalities/thread/concurrent_events/TestConcurrentSignalWatchBreak.py (1886 of 1977) PASS: lldb-shell :: SymbolFile/DWARF/inline-function-address-shared.test (1887 of 1977) PASS: lldb-unit :: Utility/./UtilityTests/StreamTeeTest.Flush (1888 of 1977) PASS: lldb-unit :: Utility/./UtilityTests/StringListTest.SplitIntoLinesSingleTrailingCR (1889 of 1977) PASS: lldb-api :: functionalities/data-formatter/summary-string-onfail/Test-rdar-9974002.py (1890 of 1977) PASS: lldb-api :: python_api/signals/TestSignalsAPI.py (1891 of 1977) PASS: lldb-unit :: Process/gdb-remote/./ProcessGdbRemoteTests/GDBRemoteCommunicationClientTest.TestPacketSpeedJSON (1892 of 1977) PASS: lldb-api :: functionalities/inline-stepping/TestInlineStepping.py (1893 of 1977) FAIL: lldb-api :: functionalities/ptr_refs/TestPtrRefs.py (1894 of 1977) ******************** TEST 'lldb-api :: functionalities/ptr_refs/TestPtrRefs.py' FAILED ******************** Script: -- /usr/local/bin/python /Users/buildslave/jenkins/workspace/lldb-cmake-sanitized/llvm-project/lldb/test/API/dotest.py --arch x86_64 -s /Users/buildslave/jenkins/workspace/lldb-cmake-sanitized/lldb-build/lldb-test-traces -S nm -u CXXFLAGS -u CFLAGS --codesign-identity lldb_codesign --server /Users/buildslave/jenkins/workspace/lldb-cmake-sanitized/lldb-build/./bin/debugserver --arch x86_64 --build-dir /Users/buildslave/jenkins/workspace/lldb-cmake-sanitized/lldb-build/lldb-test-build.noindex -s=/Users/buildslave/jenkins/workspace/lldb-cmake-sanitized/test/logs -t --env TERM=vt100 --env LLVM_LIBS_DIR=/Users/buildslave/jenkins/workspace/lldb-cmake-sanitized/lldb-build/./lib --inferior-env ASAN_OPTIONS=detect_stack_use_after_return=1 --inferior-env DYLD_INSERT_LIBRARIES=/Users/buildslave/jenkins/workspace/lldb-cmake-sanitized/host-compiler/lib/clang/11.0.0/lib/darwin/libclang_rt.asan_osx_dynamic.dylib --build-dir /Users/buildslave/jenkins/workspace/lldb-cmake-sanitized/lldb-build/lldb-test-build.noindex --lldb-module-cache-dir /Users/buildslave/jenkins/workspace/lldb-cmake-sanitized/lldb-build/lldb-test-build.noindex/module-cache-lldb/lldb-api --clang-module-cache-dir /Users/buildslave/jenkins/workspace/lldb-cmake-sanitized/lldb-build/lldb-test-build.noindex/module-cache-clang/lldb-api --executable /Users/buildslave/jenkins/workspace/lldb-cmake-sanitized/lldb-build/./bin/lldb --compiler /Users/buildslave/jenkins/workspace/lldb-cmake-sanitized/lldb-build/./bin/clang --dsymutil /Users/buildslave/jenkins/workspace/lldb-cmake-sanitized/lldb-build/./bin/dsymutil --filecheck /Users/buildslave/jenkins/workspace/lldb-cmake-sanitized/lldb-build/./bin/FileCheck --lldb-libs-dir /Users/buildslave/jenkins/workspace/lldb-cmake-sanitized/lldb-build/./lib /Users/buildslave/jenkins/workspace/lldb-cmake-sanitized/llvm-project/lldb/test/API/functionalities/ptr_refs -p TestPtrRefs.py -- Exit Code: 1

Hide Details

Command Output (stdout): -- lldb version 11.0.99 clang revision c0aa97b632761b658e1bc35ca15119629b2cff0e llvm revision c0aa97b632761b658e1bc35ca15119629b2cff0e "crashlog" and "save_crashlog" command installed, use the "--help" option for detailed help "malloc_info", "ptr_refs", "cstr_refs", "find_variable", and "objc_refs" commands have been installed, use the "--help" options on these commands for detailed help. LLDB library dir: /Users/buildslave/jenkins/workspace/lldb-cmake-sanitized/lldb-build/bin LLDB import library dir: /Users/buildslave/jenkins/workspace/lldb-cmake-sanitized/lldb-build/./lib libstdcxx tests will not be run because: Don't know how to build with libstdcxx on macosx Skipping following debug info categories: ['dwo'] 0x00007ffeee9a4478: stack in frame #0 of thread #1: tid 0xcacb04 in variable at 0x7ffeee9a4478: (const char *) my_ptr = 0x00006020000000b0 "hello" 0x00007ffeee9a4410: stack (red zone)

Hide Details

-- Command Output (stderr): -- error: 'ptr_refs' is not a valid command. error: 'ptr_refs' is not a valid command.

Hide Details

Session logs for test failures/errors/unexpected successes will go into directory '/Users/buildslave/jenkins/workspace/lldb-cmake-sanitized/test/logs' Command invoked: /Users/buildslave/jenkins/workspace/lldb-cmake-sanitized/llvm-project/lldb/test/API/dotest.py --arch x86_64 -s /Users/buildslave/jenkins/workspace/lldb-cmake-sanitized/lldb-build/lldb-test-traces -S nm -u CXXFLAGS -u CFLAGS --codesign-identity lldb_codesign --server /Users/buildslave/jenkins/workspace/lldb-cmake-sanitized/lldb-build/./bin/debugserver --arch x86_64 --build-dir /Users/buildslave/jenkins/workspace/lldb-cmake-sanitized/lldb-build/lldb-test-build.noindex -s=/Users/buildslave/jenkins/workspace/lldb-cmake-sanitized/test/logs -t --env TERM=vt100 --env LLVM_LIBS_DIR=/Users/buildslave/jenkins/workspace/lldb-cmake-sanitized/lldb-build/./lib --inferior-env ASAN_OPTIONS=detect_stack_use_after_return=1 --inferior-env DYLD_INSERT_LIBRARIES=/Users/buildslave/jenkins/workspace/lldb-cmake-sanitized/host-compiler/lib/clang/11.0.0/lib/darwin/libclang_rt.asan_osx_dynamic.dylib --build-dir /Users/buildslave/jenkins/workspace/lldb-cmake-sanitized/lldb-build/lldb-test-build.noindex --lldb-module-cache-dir /Users/buildslave/jenkins/workspace/lldb-cmake-sanitized/lldb-build/lldb-test-build.noindex/module-cache-lldb/lldb-api --clang-module-cache-dir /Users/buildslave/jenkins/workspace/lldb-cmake-sanitized/lldb-build/lldb-test-build.noindex/module-cache-clang/lldb-api --executable /Users/buildslave/jenkins/workspace/lldb-cmake-sanitized/lldb-build/./bin/lldb --compiler /Users/buildslave/jenkins/workspace/lldb-cmake-sanitized/lldb-build/./bin/clang --dsymutil /Users/buildslave/jenkins/workspace/lldb-cmake-sanitized/lldb-build/./bin/dsymutil --filecheck /Users/buildslave/jenkins/workspace/lldb-cmake-sanitized/lldb-build/./bin/FileCheck --lldb-libs-dir /Users/buildslave/jenkins/workspace/lldb-cmake-sanitized/lldb-build/./lib /Users/buildslave/jenkins/workspace/lldb-cmake-sanitized/llvm-project/lldb/test/API/functionalities/ptr_refs -p TestPtrRefs.py Change dir to: /Users/buildslave/jenkins/workspace/lldb-cmake-sanitized/llvm-project/lldb/test/API/functionalities/ptr_refs runCmd: settings clear -all output:

Hide Details

runCmd: settings set symbols.enable-external-lookup false output:

Hide Details

runCmd: settings set target.auto-apply-fixits false output:

Hide Details

runCmd: settings set plugin.process.gdb-remote.packet-timeout 60 output:

Hide Details

runCmd: settings set symbols.clang-modules-cache-path "/Users/buildslave/jenkins/workspace/lldb-cmake-sanitized/lldb-build/lldb-test-build.noindex/module-cache-lldb/lldb-api" output:

Hide Details

runCmd: settings set use-color false output:

Hide Details

runCmd: setting set target.prefer-dynamic-value no-dynamic-values output:

Hide Details

runCmd: settings set target.env-vars ASAN_OPTIONS=detect_stack_use_after_return=1 DYLD_INSERT_LIBRARIES=/Users/buildslave/jenkins/workspace/lldb-cmake-sanitized/host-compiler/lib/clang/11.0.0/lib/darwin/libclang_rt.asan_osx_dynamic.dylib output:

Hide Details

runCmd: script import lldb.macosx.heap output: "crashlog" and "save_crashlog" command installed, use the "--help" option for detailed help "malloc_info", "ptr_refs", "cstr_refs", "find_variable", and "objc_refs" commands have been installed, use the "--help" options on these commands for detailed help.

Hide Details

Hide Details

runCmd: ptr_refs my_ptr output: 0x00007ffeee9a4478: stack in frame #0 of thread #1: tid 0xcacb04 in variable at 0x7ffeee9a4478: (const char *) my_ptr = 0x00006020000000b0 "hello" 0x00007ffeee9a4410: stack (red zone)

Hide Details

Hide Details

Expecting sub string: malloc Not matched

Hide Details

FAIL: LLDB (/Users/buildslave/jenkins/workspace/lldb-cmake-sanitized/lldb-build/bin/clang-11-x86_64) :: test_ptr_refs_dsym (TestPtrRefs.TestPtrRefs) <bound method SBProcess.Kill of <lldb.SBProcess; proxy of <Swig Object of type 'lldb::SBProcess *' at 0x122c798a0> >>: success

Hide Details

runCmd: settings clear -all output:

Hide Details

runCmd: settings set symbols.enable-external-lookup false output:

Hide Details

runCmd: settings set target.auto-apply-fixits false output:

Hide Details

runCmd: settings set plugin.process.gdb-remote.packet-timeout 60 output:

Hide Details

runCmd: settings set symbols.clang-modules-cache-path "/Users/buildslave/jenkins/workspace/lldb-cmake-sanitized/lldb-build/lldb-test-build.noindex/module-cache-lldb/lldb-api" output:

Hide Details

runCmd: settings set use-color false output:

Hide Details

runCmd: setting set target.prefer-dynamic-value no-dynamic-values output:

Hide Details

runCmd: settings set target.env-vars ASAN_OPTIONS=detect_stack_use_after_return=1 DYLD_INSERT_LIBRARIES=/Users/buildslave/jenkins/workspace/lldb-cmake-sanitized/host-compiler/lib/clang/11.0.0/lib/darwin/libclang_rt.asan_osx_dynamic.dylib output:

Hide Details

runCmd: script import lldb.macosx.heap output:

Hide Details

runCmd: ptr_refs my_ptr runCmd failed! error: 'ptr_refs' is not a valid command.

Hide Details

Hide Details

XFAIL: LLDB (/Users/buildslave/jenkins/workspace/lldb-cmake-sanitized/lldb-build/bin/clang-11-x86_64) :: test_ptr_refs_dwarf (TestPtrRefs.TestPtrRefs) <bound method SBProcess.Kill of <lldb.SBProcess; proxy of <Swig Object of type 'lldb::SBProcess *' at 0x10b9ff990> >>: success

Hide Details

UNSUPPORTED: LLDB (/Users/buildslave/jenkins/workspace/lldb-cmake-sanitized/lldb-build/bin/clang-11-x86_64) :: test_ptr_refs_dwo (TestPtrRefs.TestPtrRefs) (test case does not fall in any category of interest for this run) runCmd: settings clear -all output:

Hide Details

runCmd: settings set symbols.enable-external-lookup false output:

Hide Details

runCmd: settings set target.auto-apply-fixits false output:

Hide Details

runCmd: settings set plugin.process.gdb-remote.packet-timeout 60 output:

Hide Details

runCmd: settings set symbols.clang-modules-cache-path "/Users/buildslave/jenkins/workspace/lldb-cmake-sanitized/lldb-build/lldb-test-build.noindex/module-cache-lldb/lldb-api" output:

Hide Details

runCmd: settings set use-color false output:

Hide Details

runCmd: setting set target.prefer-dynamic-value no-dynamic-values output:

Hide Details

runCmd: settings set target.env-vars ASAN_OPTIONS=detect_stack_use_after_return=1 DYLD_INSERT_LIBRARIES=/Users/buildslave/jenkins/workspace/lldb-cmake-sanitized/host-compiler/lib/clang/11.0.0/lib/darwin/libclang_rt.asan_osx_dynamic.dylib output:

Hide Details

runCmd: script import lldb.macosx.heap output:

Hide Details

runCmd: ptr_refs my_ptr runCmd failed! error: 'ptr_refs' is not a valid command.

Hide Details

Hide Details

XFAIL: LLDB (/Users/buildslave/jenkins/workspace/lldb-cmake-sanitized/lldb-build/bin/clang-11-x86_64) :: test_ptr_refs_gmodules (TestPtrRefs.TestPtrRefs) <bound method SBProcess.Kill of <lldb.SBProcess; proxy of <Swig Object of type 'lldb::SBProcess *' at 0x122c791e0> >>: success

Hide Details

Restore dir to: /Users/buildslave/jenkins/workspace/lldb-cmake-sanitized/lldb-build/tools/lldb/test ====================================================================== FAIL: test_ptr_refs_dsym (TestPtrRefs.TestPtrRefs) Test format string functionality. ---------------------------------------------------------------------- Traceback (most recent call last): File "/Users/buildslave/jenkins/workspace/lldb-cmake-sanitized/llvm-project/lldb/packages/Python/lldbsuite/test/lldbtest.py", line 1751, in test_method return attrvalue(self) File "/Users/buildslave/jenkins/workspace/lldb-cmake-sanitized/llvm-project/lldb/packages/Python/lldbsuite/test/decorators.py", line 110, in wrapper func(*args, **kwargs) File "/Users/buildslave/jenkins/workspace/lldb-cmake-sanitized/llvm-project/lldb/test/API/functionalities/ptr_refs/TestPtrRefs.py", line 47, in test_ptr_refs self.expect("ptr_refs my_ptr", substrs=["malloc", "stack"]) File "/Users/buildslave/jenkins/workspace/lldb-cmake-sanitized/llvm-project/lldb/packages/Python/lldbsuite/test/lldbtest.py", line 2391, in expect if msg else EXP_MSG(str, output, exe)) AssertionError: False is not True : 'ptr_refs my_ptr' returns expected result, got '0x00007ffeee9a4478: stack in frame #0 of thread #1: tid 0xcacb04 in variable at 0x7ffeee9a4478: (const char *) my_ptr = 0x00006020000000b0 "hello" 0x00007ffeee9a4410: stack (red zone)' Config=x86_64-/Users/buildslave/jenkins/workspace/lldb-cmake-sanitized/lldb-build/bin/clang-11 ---------------------------------------------------------------------- Ran 4 tests in 9.492s

Hide Details

RESULT: FAILED (0 passes, 1 failures, 0 errors, 1 skipped, 2 expected failures, 0 unexpected successes)

Hide Details

--

Hide Details

******************** PASS: lldb-shell :: ObjectFile/PECOFF/sections-names.yaml (1895 of 1977) PASS: lldb-shell :: ObjectFile/PECOFF/sections.yaml (1896 of 1977) PASS: lldb-unit :: Utility/./UtilityTests/ScalarTest.GetValue (1897 of 1977) PASS: lldb-unit :: Host/./HostTests/FileActionTest.Open (1898 of 1977) PASS: lldb-unit :: Utility/./UtilityTests/StringListTest.GetMaxStringLengthIncreasingSize (1899 of 1977) PASS: lldb-unit :: ScriptInterpreter/Python/./ScriptInterpreterPythonTests/PythonDataObjectsTest.TestPythonString (1900 of 1977) PASS: lldb-unit :: Utility/./UtilityTests/SerializationRountripTest.SerializeDeserializeCStringArrayNullptr (1901 of 1977) PASS: lldb-unit :: ScriptInterpreter/Python/./ScriptInterpreterPythonTests/PythonDataObjectsTest.TestCallable (1902 of 1977) PASS: lldb-shell :: SymbolFile/Breakpad/line-table-mixed-path-styles.test (1903 of 1977) PASS: lldb-shell :: SymbolFile/DWARF/win-i386-line-table.s (1904 of 1977) PASS: lldb-unit :: Utility/./UtilityTests/BinaryStreamTest.PutSLEB128EightBytes (1905 of 1977) PASS: lldb-unit :: ScriptInterpreter/Python/./ScriptInterpreterPythonTests/PythonDataObjectsTest.TestPythonStringToStr (1906 of 1977) PASS: lldb-unit :: Target/./TargetTests/PathMappingListTest.AbsoluteTests (1907 of 1977) PASS: lldb-unit :: Expression/./ExpressionTests/CppModuleConfigurationTest.LinuxLocalLibCpp (1908 of 1977) PASS: lldb-unit :: Symbol/./SymbolTests/TestClangASTImporter.DeportDeclTagDecl (1909 of 1977) PASS: lldb-unit :: Utility/./UtilityTests/BinaryStreamTest.PutSLEB128SixBytes (1910 of 1977) PASS: lldb-shell :: SymbolFile/DWARF/find-method-local-struct.cpp (1911 of 1977) XFAIL: lldb-shell :: Unwind/prefer-debug-over-eh-frame.test (1912 of 1977) PASS: lldb-api :: python_api/value/linked_list/TestValueAPILinkedList.py (1913 of 1977) PASS: lldb-api :: lang/cpp/constructors/TestCppConstructors.py (1914 of 1977) PASS: lldb-api :: functionalities/thread/concurrent_events/TestConcurrentWatchpointDelayWatchpointOneBreakpoint.py (1915 of 1977) PASS: lldb-api :: commands/expression/formatters/TestFormatters.py (1916 of 1977) PASS: lldb-api :: lang/cpp/unicode-literals/TestUnicodeLiterals.py (1917 of 1977) PASS: lldb-shell :: Breakpoint/debug_rnglistx_rlex.test (1918 of 1977) PASS: lldb-unit :: Expression/./ExpressionTests/DiagnosticManagerTest.PutStringSeverities (1919 of 1977) PASS: lldb-api :: python_api/value_var_update/TestValueVarUpdate.py (1920 of 1977) PASS: lldb-unit :: Utility/./UtilityTests/BinaryStreamTest.PutSLEB128FiveBytes (1921 of 1977) PASS: lldb-api :: lang/objc/objc-runtime-ivars/TestRuntimeIvars.py (1922 of 1977) PASS: lldb-api :: commands/process/launch/TestProcessLaunch.py (1923 of 1977) PASS: lldb-api :: types/TestDoubleTypes.py (1924 of 1977) PASS: lldb-unit :: UnwindAssembly/x86/./UnwindAssemblyx86Tests/Testx86AssemblyInspectionEngine.TestPush0 (1925 of 1977) PASS: lldb-unit :: Utility/./UtilityTests/StreamTest.Indent (1926 of 1977) PASS: lldb-unit :: Utility/./UtilityTests/StreamTest.AddressRangeEmptyRange (1927 of 1977) PASS: lldb-unit :: Symbol/./SymbolTests/TestTypeSystemClang.TestDisplayName (1928 of 1977) PASS: lldb-unit :: Utility/./UtilityTests/GeneratorTest.Get (1929 of 1977) UNSUPPORTED: lldb-api :: commands/register/register/intel_xtended_registers/TestMPXRegisters.py (1930 of 1977) PASS: lldb-shell :: ObjectFile/MachO/lc_build_version.yaml (1931 of 1977) PASS: lldb-api :: python_api/watchpoint/TestWatchpointIgnoreCount.py (1932 of 1977) PASS: lldb-unit :: Utility/./UtilityTests/CompletionRequest.ShiftArguments (1933 of 1977) UNSUPPORTED: lldb-shell :: SymbolFile/PDB/vbases.test (1934 of 1977) PASS: lldb-unit :: Symbol/./SymbolTests/DWARFCallFrameInfoTest.Basic_eh (1935 of 1977) PASS: lldb-unit :: Language/Highlighting/./HighlighterTests/HighlighterTest.HighlighterSelectionPath (1936 of 1977) PASS: lldb-api :: functionalities/data-formatter/data-formatter-stl/libcxx/list/loop/TestDataFormatterLibcxxListLoop.py (1937 of 1977) PASS: lldb-shell :: SymbolFile/DWARF/debug_line-relative_path.s (1938 of 1977) PASS: lldb-unit :: Utility/./UtilityTests/ArchSpecTest.MergeFromMachOUnknown (1939 of 1977) PASS: lldb-unit :: Utility/./UtilityTests/StringListTest.RemoveBlankLines (1940 of 1977) PASS: lldb-unit :: Utility/./UtilityTests/UUIDTest.SetFromStringRef (1941 of 1977) PASS: lldb-unit :: Utility/./UtilityTests/RangeTest.DoesIntersect (1942 of 1977) PASS: lldb-unit :: Utility/./UtilityTests/FileSpecTest.Yaml (1943 of 1977) PASS: lldb-api :: commands/expression/static-initializers/TestStaticInitializers.py (1944 of 1977) PASS: lldb-unit :: Utility/./UtilityTests/Flags.GetBitSize (1945 of 1977) PASS: lldb-unit :: Host/./HostTests/SocketTest.TCPListen0ConnectAccept (1946 of 1977) PASS: lldb-unit :: Utility/./UtilityTests/LogChannelTest.Enable (1947 of 1977) PASS: lldb-unit :: Utility/./UtilityTests/StreamTest.ShiftOperatorStrings (1948 of 1977) PASS: lldb-unit :: Utility/./UtilityTests/CompletionRequest.FakeLastArg (1949 of 1977) PASS: lldb-api :: commands/log/invalid-args/TestInvalidArgsLog.py (1950 of 1977) PASS: lldb-api :: functionalities/breakpoint/breakpoint_by_line_and_column/TestBreakpointByLineAndColumn.py (1951 of 1977) PASS: lldb-api :: functionalities/jitloader_gdb/TestJITLoaderGDB.py (1952 of 1977) PASS: lldb-unit :: Symbol/./SymbolTests/TestTypeSystemClang.TestNotDeletingUserCopyCstrDueToMoveCStr (1953 of 1977) PASS: lldb-unit :: debugserver/./debugserverTests/RNBSocket.LoopBackConnectIPv6 (1954 of 1977) PASS: lldb-api :: functionalities/inferior-changed/TestInferiorChanged.py (1955 of 1977) PASS: lldb-api :: lang/objc/foundation/TestObjCMethods2.py (1956 of 1977) PASS: lldb-shell :: ObjectFile/PECOFF/basic-info.yaml (1957 of 1977) PASS: lldb-shell :: Quit/TestQuitExitCodeNonInt.test (1958 of 1977) PASS: lldb-api :: python_api/interpreter/TestRunCommandInterpreterAPI.py (1959 of 1977) PASS: lldb-unit :: Utility/./UtilityTests/StringListTest.AppendListCStringArray (1960 of 1977) PASS: lldb-unit :: Process/minidump/./LLDBMinidumpTests/MinidumpParserTest.GetThreadContext_x86_32_wow64 (1961 of 1977) PASS: lldb-shell :: Commands/CommandScriptImmediateOutput/CommandScriptImmediateOutputFile.test (1962 of 1977) PASS: lldb-unit :: Utility/./UtilityTests/RangeTest.Slide (1963 of 1977) PASS: lldb-api :: functionalities/stats_api/TestStatisticsAPI.py (1964 of 1977) PASS: lldb-api :: lang/cpp/nested-class-other-compilation-unit/TestNestedClassWithParentInAnotherCU.py (1965 of 1977) PASS: lldb-api :: commands/apropos/basic/TestApropos.py (1966 of 1977) PASS: lldb-shell :: Commands/command-breakpoint-col.test (1967 of 1977) PASS: lldb-shell :: SymbolFile/Breakpad/unwind-via-raSearch.test (1968 of 1977) PASS: lldb-api :: lang/objc/orderedset/TestOrderedSet.py (1969 of 1977) PASS: lldb-unit :: Host/./HostTests/NativeProcessProtocolTest.SetBreakpoint (1970 of 1977) PASS: lldb-unit :: Expression/./ExpressionTests/DiagnosticManagerTest.GetStringMultiline (1971 of 1977) PASS: lldb-api :: functionalities/breakpoint/breakpoint_language/TestBreakpointLanguage.py (1972 of 1977) PASS: lldb-api :: lang/cpp/global_operators/TestCppGlobalOperators.py (1973 of 1977) PASS: lldb-unit :: Utility/./UtilityTests/ArgsTest.TestSingleArg (1974 of 1977) PASS: lldb-api :: lang/objcxx/hide-runtime-values/TestObjCXXHideRuntimeValues.py (1975 of 1977) UNSUPPORTED: lldb-api :: functionalities/gdb_remote_client/TestWasm.py (1976 of 1977) PASS: lldb-api :: types/TestLongTypes.py (1977 of 1977)

Hide Details

Testing Time: 4449.31s ******************** Failing Tests (3): lldb-api :: python_api/thread/TestThreadAPI.py lldb-api :: lang/objc/ptr_refs/TestPtrRefsObjC.py lldb-api :: functionalities/ptr_refs/TestPtrRefs.py

Hide Details

Hide Details

Slowest Tests: -------------------------------------------------------------------------- 91.69s: lldb-api :: lang/objc/conflicting-definition/TestConflictingDefinition.py 91.84s: lldb-api :: functionalities/gdb_remote_client/TestWasm.py 96.14s: lldb-api :: commands/settings/TestSettings.py 108.60s: lldb-api :: python_api/lldbutil/iter/TestLLDBIterator.py 114.02s: lldb-api :: lang/objc/foundation/TestObjCMethodsString.py 117.12s: lldb-api :: lang/objc/foundation/TestObjCMethodsNSError.py 121.31s: lldb-api :: tools/lldb-server/TestGdbRemote_qThreadStopInfo.py 121.52s: lldb-api :: lang/objc/objc-new-syntax/TestObjCNewSyntaxArray.py 122.60s: lldb-api :: lang/objc/objc-new-syntax/TestObjCNewSyntaxDictionary.py 133.26s: lldb-api :: types/TestLongTypesExpr.py 144.75s: lldb-api :: lang/objc/exceptions/TestObjCExceptions.py 145.28s: lldb-api :: lang/objc/real-definition/TestRealDefinition.py 161.70s: lldb-api :: lang/objc/objc-new-syntax/TestObjCNewSyntaxLiteral.py 162.70s: lldb-api :: lang/cpp/namespace/TestNamespaceLookup.py 226.38s: lldb-api :: lang/objc/foundation/TestObjCMethods.py 228.56s: lldb-api :: lang/objc/hidden-ivars/TestHiddenIvars.py 248.84s: lldb-api :: tools/lldb-server/TestGdbRemoteThreadsInStopReply.py 263.49s: lldb-api :: api/multithreaded/TestMultithreaded.py 272.54s: lldb-api :: lang/cpp/enum_types/TestCPP11EnumTypes.py 369.49s: lldb-api :: tools/lldb-server/TestLldbGdbServer.py

Hide Details

Tests Times: -------------------------------------------------------------------------- [ Range ] :: [ Percentage ] :: [ Count ] -------------------------------------------------------------------------- [ 0s, 20s) :: [********************************** ] :: [1727/1977] [ 20s, 40s) :: [** ] :: [ 104/1977] [ 40s, 60s) :: [* ] :: [ 89/1977] [ 60s, 80s) :: [ ] :: [ 30/1977] [ 80s,100s) :: [ ] :: [ 10/1977] [100s,120s) :: [ ] :: [ 2/1977] [120s,140s) :: [ ] :: [ 5/1977] [140s,160s) :: [ ] :: [ 2/1977] [160s,180s) :: [ ] :: [ 2/1977] [180s,200s) :: [ ] :: [ 0/1977] [200s,220s) :: [ ] :: [ 0/1977] [220s,240s) :: [ ] :: [ 2/1977] [240s,260s) :: [ ] :: [ 1/1977] [260s,280s) :: [ ] :: [ 1/1977] [280s,300s) :: [ ] :: [ 1/1977] [300s,320s) :: [ ] :: [ 0/1977] [320s,340s) :: [ ] :: [ 0/1977] [340s,360s) :: [ ] :: [ 0/1977] [360s,380s) :: [ ] :: [ 1/1977] Expected Passes : 1801 Expected Failures : 6 Unsupported Tests : 167 Unexpected Failures: 3 FAILED: tools/lldb/test/CMakeFiles/check-lldb-lit cd /Users/buildslave/jenkins/workspace/lldb-cmake-sanitized/lldb-build/tools/lldb/test && /usr/local/bin/python /Users/buildslave/jenkins/workspace/lldb-cmake-sanitized/lldb-build/./bin/llvm-lit -v --time-tests --shuffle --xunit-xml-output=/Users/buildslave/jenkins/workspace/lldb-cmake-sanitized/test/results.xml -v -j 4 --timeout 1200 /Users/buildslave/jenkins/workspace/lldb-cmake-sanitized/lldb-build/tools/lldb/test ninja: build stopped: subcommand failed. Command failed: Command '['/usr/bin/env', 'TERM=vt100', '/usr/local/bin/ninja', '-v', 'check-lldb']' returned non-zero exit status 1. Command: ['/usr/bin/env', 'TERM=vt100', '/usr/local/bin/ninja', '-v', 'check-lldb'] [Pipeline] } [Pipeline] // timeout [Pipeline] } [Pipeline] // stage [Pipeline] stage [Pipeline] { (Declarative: Post Actions) [Pipeline] scanForIssues [Clang (LLVM based)] Sleeping for 5 seconds due to JENKINS-32191... [Clang (LLVM based)] Parsing console log (workspace: '/Users/buildslave/jenkins/workspace/lldb-cmake-sanitized') [Clang (LLVM based)] Successfully parsed console log [Clang (LLVM based)] -> found 0 issues (skipped 0 duplicates) [Clang (LLVM based)] Skipping post processing [Clang (LLVM based)] No filter has been set, publishing all 0 issues [Pipeline] junit Recording test results [Pipeline] } [Pipeline] // stage [Pipeline] } [Pipeline] // withEnv [Pipeline] } [Pipeline] // node [Pipeline] End of Pipeline ERROR: script returned exit code 1 Finished: FAILURE