FailedConsole Output

Skipping 946 KB.. Full Log
tility/./UtilityTests/CompletionRequest.DuplicateFiltering (1104 of 1977)
PASS: lldb-unit :: Expression/./ExpressionTests/CppModuleConfigurationTest.LibCppV2 (1105 of 1977)
PASS: lldb-shell :: ObjectFile/PECOFF/sections-names.yaml (1106 of 1977)
PASS: lldb-api :: lang/objc/foundation/TestObjCMethodsNSError.py (1107 of 1977)
UNSUPPORTED: lldb-api :: benchmarks/turnaround/TestCompileRunToBreakpointTurnaround.py (1108 of 1977)
PASS: lldb-unit :: ScriptInterpreter/Python/./ScriptInterpreterPythonTests/PythonDataObjectsTest.TestCallable (1109 of 1977)
PASS: lldb-api :: lang/cpp/class_types/TestClassTypesDisassembly.py (1110 of 1977)
UNSUPPORTED: lldb-api :: lang/objc/bitfield_ivars/TestBitfieldIvars.py (1111 of 1977)
PASS: lldb-shell :: Commands/command-disassemble-process.yaml (1112 of 1977)
PASS: lldb-api :: tools/lldb-server/inferior-crash/TestGdbRemoteSegFault.py (1113 of 1977)
UNSUPPORTED: lldb-shell :: ObjectFile/ELF/minidebuginfo-set-and-hit-breakpoint.test (1114 of 1977)
PASS: lldb-api :: commands/expression/import-std-module/shared_ptr/TestSharedPtrFromStdModule.py (1115 of 1977)
PASS: lldb-api :: commands/expression/import-std-module/sysroot/TestStdModuleSysroot.py (1116 of 1977)
PASS: lldb-shell :: SymbolFile/DWARF/dwarf5_locations.s (1117 of 1977)
PASS: lldb-shell :: SymbolFile/DWARF/dwp.s (1118 of 1977)
UNSUPPORTED: lldb-shell :: ScriptInterpreter/Lua/independent_state.test (1119 of 1977)
PASS: lldb-unit :: Utility/./UtilityTests/AnsiTerminal.KnownPrefix (1120 of 1977)
PASS: lldb-api :: tools/lldb-server/TestGdbRemote_vCont.py (1121 of 1977)
PASS: lldb-api :: functionalities/unwind/sigtramp/TestSigtrampUnwind.py (1122 of 1977)
PASS: lldb-unit :: Host/./HostTests/NativeProcessProtocolTest.ReadCStringFromMemory_MaxSize (1123 of 1977)
PASS: lldb-unit :: Language/Highlighting/./HighlighterTests/HighlighterTest.Keywords (1124 of 1977)
PASS: lldb-unit :: Symbol/./SymbolTests/TestTypeSystemClang.TestGetEnumIntegerTypeBasicTypes (1125 of 1977)
PASS: lldb-unit :: Utility/./UtilityTests/StreamTest.PutCharNull (1126 of 1977)
PASS: lldb-unit :: Utility/./UtilityTests/RangeTest.ContainsAddrInvalid (1127 of 1977)
PASS: lldb-unit :: Utility/./UtilityTests/RangeTest.ContainsRangeStartingFromZero (1128 of 1977)
PASS: lldb-unit :: Target/./TargetTests/ModuleCacheTest.GetAndPutStrangeHostname (1129 of 1977)
PASS: lldb-shell :: Quit/TestQuitExitCodeImplicit0.test (1130 of 1977)
PASS: lldb-unit :: Process/minidump/./LLDBMinidumpTests/MinidumpParserTest.InvalidMinidump (1131 of 1977)
PASS: lldb-shell :: Driver/TestRepl.test (1132 of 1977)
PASS: lldb-unit :: ScriptInterpreter/Python/./ScriptInterpreterPythonTests/PythonDataObjectsTest.TestPythonCallableInvoke (1133 of 1977)
PASS: lldb-unit :: Utility/./UtilityTests/VMRange.Ordering (1134 of 1977)
PASS: lldb-api :: functionalities/thread/concurrent_events/TestConcurrentCrashWithBreak.py (1135 of 1977)
PASS: lldb-unit :: Language/Highlighting/./HighlighterTests/HighlighterTest.ClangStringLiterals (1136 of 1977)
PASS: lldb-api :: tools/lldb-server/commandline/TestStubSetSID.py (1137 of 1977)
PASS: lldb-api :: commands/expression/import-std-module/empty-module/TestEmptyStdModule.py (1138 of 1977)
PASS: lldb-api :: types/TestLongTypes.py (1139 of 1977)
PASS: lldb-api :: commands/disassemble/basic/TestFrameDisassemble.py (1140 of 1977)
PASS: lldb-unit :: Expression/./ExpressionTests/ClangHostTest.MacOSX (1141 of 1977)
UNSUPPORTED: lldb-api :: functionalities/tsan/thread_leak/TestTsanThreadLeak.py (1142 of 1977)
UNSUPPORTED: lldb-shell :: Expr/TestIRMemoryMapWindows.test (1143 of 1977)
PASS: lldb-unit :: Utility/./UtilityTests/StringExtractorTest.GetHexBytesAvail_Partial (1144 of 1977)
PASS: lldb-unit :: Expression/./ExpressionTests/ClangHostTest.ComputeClangResourceDirectory (1145 of 1977)
PASS: lldb-shell :: ObjectFile/MachO/subsections.yaml (1146 of 1977)
PASS: lldb-unit :: Symbol/./SymbolTests/Type.GetTypeScopeAndBasename (1147 of 1977)
PASS: lldb-unit :: Language/Highlighting/./HighlighterTests/HighlighterTest.ClangIdentifiers (1148 of 1977)
PASS: lldb-unit :: Host/./HostTests/FileSystemTest.Exists (1149 of 1977)
PASS: lldb-unit :: Utility/./UtilityTests/FileSpecTest.Match (1150 of 1977)
PASS: lldb-unit :: Host/./HostTests/Host.GetEnvironment (1151 of 1977)
PASS: lldb-api :: functionalities/thread/concurrent_events/TestConcurrentCrashWithWatchpointBreakpointSignal.py (1152 of 1977)
PASS: lldb-unit :: Utility/./UtilityTests/UriParserTest.SchemeHostSeparator4 (1153 of 1977)
PASS: lldb-api :: functionalities/data-formatter/data-formatter-caching/TestDataFormatterCaching.py (1154 of 1977)
PASS: lldb-api :: commands/command/delete/TestCommandDelete.py (1155 of 1977)
PASS: lldb-api :: functionalities/history/TestHistoryRecall.py (1156 of 1977)
PASS: lldb-shell :: ObjectFile/ELF/base-address.yaml (1157 of 1977)
PASS: lldb-api :: functionalities/data-formatter/data-formatter-stl/libcxx/forward_list/TestDataFormatterLibcxxForwardList.py (1158 of 1977)
PASS: lldb-unit :: Utility/./UtilityTests/StringExtractorTest.GetHexBytesAvail (1159 of 1977)
PASS: lldb-unit :: Utility/./UtilityTests/SubsystemRAIITest.NormalSubsystem (1160 of 1977)
PASS: lldb-shell :: SymbolFile/DWARF/debug-types-dwarf5.s (1161 of 1977)
PASS: lldb-unit :: UnwindAssembly/x86/./UnwindAssemblyx86Tests/Testx86AssemblyInspectionEngine.TestPushEBP (1162 of 1977)
PASS: lldb-shell :: Commands/command-disassemble.s (1163 of 1977)
PASS: lldb-unit :: ScriptInterpreter/Python/./ScriptInterpreterPythonTests/PythonDataObjectsTest.TestGlobalNameResolutionWithDot (1164 of 1977)
PASS: lldb-unit :: Platform/./LLDBPlatformTests/PlatformDarwinTest.GetSDKNameForType (1165 of 1977)
PASS: lldb-api :: functionalities/data-formatter/data-formatter-stl/libcxx/map/TestDataFormatterLibccMap.py (1166 of 1977)
PASS: lldb-unit :: Process/gdb-remote/./ProcessGdbRemoteTests/GDBRemoteCommunicationClientTest.SendGetTraceConfigPacket (1167 of 1977)
PASS: lldb-api :: functionalities/thread/crash_during_step/TestCrashDuringStep.py (1168 of 1977)
PASS: lldb-unit :: SymbolFile/DWARF/./SymbolFileDWARFTests/SymbolFileDWARFTests.TestAbbrevInvalidNULLTag (1169 of 1977)
PASS: lldb-unit :: UnwindAssembly/x86/./UnwindAssemblyx86Tests/Testx86AssemblyInspectionEngine.TestPush0 (1170 of 1977)
FAIL: lldb-api :: lang/objc/ptr_refs/TestPtrRefsObjC.py (1171 of 1977)
******************** TEST 'lldb-api :: lang/objc/ptr_refs/TestPtrRefsObjC.py' FAILED ********************
Script:
--
/usr/local/bin/python /Users/buildslave/jenkins/workspace/lldb-cmake-sanitized/llvm-project/lldb/test/API/dotest.py --arch x86_64 -s /Users/buildslave/jenkins/workspace/lldb-cmake-sanitized/lldb-build/lldb-test-traces -S nm -u CXXFLAGS -u CFLAGS --codesign-identity lldb_codesign --server /Users/buildslave/jenkins/workspace/lldb-cmake-sanitized/lldb-build/./bin/debugserver --arch x86_64 --build-dir /Users/buildslave/jenkins/workspace/lldb-cmake-sanitized/lldb-build/lldb-test-build.noindex -s=/Users/buildslave/jenkins/workspace/lldb-cmake-sanitized/test/logs -t --env TERM=vt100 --env LLVM_LIBS_DIR=/Users/buildslave/jenkins/workspace/lldb-cmake-sanitized/lldb-build/./lib --inferior-env ASAN_OPTIONS=detect_stack_use_after_return=1 --inferior-env DYLD_INSERT_LIBRARIES=/Users/buildslave/jenkins/workspace/lldb-cmake-sanitized/host-compiler/lib/clang/11.0.0/lib/darwin/libclang_rt.asan_osx_dynamic.dylib --build-dir /Users/buildslave/jenkins/workspace/lldb-cmake-sanitized/lldb-build/lldb-test-build.noindex --lldb-module-cache-dir /Users/buildslave/jenkins/workspace/lldb-cmake-sanitized/lldb-build/lldb-test-build.noindex/module-cache-lldb/lldb-api --clang-module-cache-dir /Users/buildslave/jenkins/workspace/lldb-cmake-sanitized/lldb-build/lldb-test-build.noindex/module-cache-clang/lldb-api --executable /Users/buildslave/jenkins/workspace/lldb-cmake-sanitized/lldb-build/./bin/lldb --compiler /Users/buildslave/jenkins/workspace/lldb-cmake-sanitized/lldb-build/./bin/clang --dsymutil /Users/buildslave/jenkins/workspace/lldb-cmake-sanitized/lldb-build/./bin/dsymutil --filecheck /Users/buildslave/jenkins/workspace/lldb-cmake-sanitized/lldb-build/./bin/FileCheck --lldb-libs-dir /Users/buildslave/jenkins/workspace/lldb-cmake-sanitized/lldb-build/./lib /Users/buildslave/jenkins/workspace/lldb-cmake-sanitized/llvm-project/lldb/test/API/lang/objc/ptr_refs -p TestPtrRefsObjC.py
--
Exit Code: 1

Hide Details

Command Output (stdout): -- lldb version 11.0.99 clang revision 4bf015c035e4e5b63c7222dfb15ff274a5ed905c llvm revision 4bf015c035e4e5b63c7222dfb15ff274a5ed905c "crashlog" and "save_crashlog" command installed, use the "--help" option for detailed help "malloc_info", "ptr_refs", "cstr_refs", "find_variable", and "objc_refs" commands have been installed, use the "--help" options on these commands for detailed help. LLDB library dir: /Users/buildslave/jenkins/workspace/lldb-cmake-sanitized/lldb-build/bin LLDB import library dir: /Users/buildslave/jenkins/workspace/lldb-cmake-sanitized/lldb-build/./lib libstdcxx tests will not be run because: Don't know how to build with libstdcxx on macosx Skipping following debug info categories: ['dwo'] 0x00007ffee5b36468: stack in frame #0 of thread #1: tid 0xdf3784 in variable at 0x7ffee5b36468: (MyClass *) self = 0x00006020000000d0 0x00007ffee5b363e0: stack (red zone)

Hide Details

-- Command Output (stderr): -- error: 'ptr_refs' is not a valid command. error: 'ptr_refs' is not a valid command.

Hide Details

Session logs for test failures/errors/unexpected successes will go into directory '/Users/buildslave/jenkins/workspace/lldb-cmake-sanitized/test/logs' Command invoked: /Users/buildslave/jenkins/workspace/lldb-cmake-sanitized/llvm-project/lldb/test/API/dotest.py --arch x86_64 -s /Users/buildslave/jenkins/workspace/lldb-cmake-sanitized/lldb-build/lldb-test-traces -S nm -u CXXFLAGS -u CFLAGS --codesign-identity lldb_codesign --server /Users/buildslave/jenkins/workspace/lldb-cmake-sanitized/lldb-build/./bin/debugserver --arch x86_64 --build-dir /Users/buildslave/jenkins/workspace/lldb-cmake-sanitized/lldb-build/lldb-test-build.noindex -s=/Users/buildslave/jenkins/workspace/lldb-cmake-sanitized/test/logs -t --env TERM=vt100 --env LLVM_LIBS_DIR=/Users/buildslave/jenkins/workspace/lldb-cmake-sanitized/lldb-build/./lib --inferior-env ASAN_OPTIONS=detect_stack_use_after_return=1 --inferior-env DYLD_INSERT_LIBRARIES=/Users/buildslave/jenkins/workspace/lldb-cmake-sanitized/host-compiler/lib/clang/11.0.0/lib/darwin/libclang_rt.asan_osx_dynamic.dylib --build-dir /Users/buildslave/jenkins/workspace/lldb-cmake-sanitized/lldb-build/lldb-test-build.noindex --lldb-module-cache-dir /Users/buildslave/jenkins/workspace/lldb-cmake-sanitized/lldb-build/lldb-test-build.noindex/module-cache-lldb/lldb-api --clang-module-cache-dir /Users/buildslave/jenkins/workspace/lldb-cmake-sanitized/lldb-build/lldb-test-build.noindex/module-cache-clang/lldb-api --executable /Users/buildslave/jenkins/workspace/lldb-cmake-sanitized/lldb-build/./bin/lldb --compiler /Users/buildslave/jenkins/workspace/lldb-cmake-sanitized/lldb-build/./bin/clang --dsymutil /Users/buildslave/jenkins/workspace/lldb-cmake-sanitized/lldb-build/./bin/dsymutil --filecheck /Users/buildslave/jenkins/workspace/lldb-cmake-sanitized/lldb-build/./bin/FileCheck --lldb-libs-dir /Users/buildslave/jenkins/workspace/lldb-cmake-sanitized/lldb-build/./lib /Users/buildslave/jenkins/workspace/lldb-cmake-sanitized/llvm-project/lldb/test/API/lang/objc/ptr_refs -p TestPtrRefsObjC.py Change dir to: /Users/buildslave/jenkins/workspace/lldb-cmake-sanitized/llvm-project/lldb/test/API/lang/objc/ptr_refs runCmd: settings clear -all output:

Hide Details

runCmd: settings set symbols.enable-external-lookup false output:

Hide Details

runCmd: settings set target.auto-apply-fixits false output:

Hide Details

runCmd: settings set plugin.process.gdb-remote.packet-timeout 60 output:

Hide Details

runCmd: settings set symbols.clang-modules-cache-path "/Users/buildslave/jenkins/workspace/lldb-cmake-sanitized/lldb-build/lldb-test-build.noindex/module-cache-lldb/lldb-api" output:

Hide Details

runCmd: settings set use-color false output:

Hide Details

runCmd: setting set target.prefer-dynamic-value no-dynamic-values output:

Hide Details

runCmd: settings set target.env-vars ASAN_OPTIONS=detect_stack_use_after_return=1 DYLD_INSERT_LIBRARIES=/Users/buildslave/jenkins/workspace/lldb-cmake-sanitized/host-compiler/lib/clang/11.0.0/lib/darwin/libclang_rt.asan_osx_dynamic.dylib output:

Hide Details

runCmd: script import lldb.macosx.heap output: "crashlog" and "save_crashlog" command installed, use the "--help" option for detailed help "malloc_info", "ptr_refs", "cstr_refs", "find_variable", and "objc_refs" commands have been installed, use the "--help" options on these commands for detailed help.

Hide Details

Hide Details

runCmd: ptr_refs self output: 0x00007ffee5b36468: stack in frame #0 of thread #1: tid 0xdf3784 in variable at 0x7ffee5b36468: (MyClass *) self = 0x00006020000000d0 0x00007ffee5b363e0: stack (red zone)

Hide Details

Hide Details

Expecting sub string: malloc Not matched

Hide Details

FAIL: LLDB (/Users/buildslave/jenkins/workspace/lldb-cmake-sanitized/lldb-build/bin/clang-11-x86_64) :: test_ptr_refs_dsym (TestPtrRefsObjC.TestPtrRefsObjC) <bound method SBProcess.Kill of <lldb.SBProcess; proxy of <Swig Object of type 'lldb::SBProcess *' at 0x1071648a0> >>: success

Hide Details

runCmd: settings clear -all output:

Hide Details

runCmd: settings set symbols.enable-external-lookup false output:

Hide Details

runCmd: settings set target.auto-apply-fixits false output:

Hide Details

runCmd: settings set plugin.process.gdb-remote.packet-timeout 60 output:

Hide Details

runCmd: settings set symbols.clang-modules-cache-path "/Users/buildslave/jenkins/workspace/lldb-cmake-sanitized/lldb-build/lldb-test-build.noindex/module-cache-lldb/lldb-api" output:

Hide Details

runCmd: settings set use-color false output:

Hide Details

runCmd: setting set target.prefer-dynamic-value no-dynamic-values output:

Hide Details

runCmd: settings set target.env-vars ASAN_OPTIONS=detect_stack_use_after_return=1 DYLD_INSERT_LIBRARIES=/Users/buildslave/jenkins/workspace/lldb-cmake-sanitized/host-compiler/lib/clang/11.0.0/lib/darwin/libclang_rt.asan_osx_dynamic.dylib output:

Hide Details

runCmd: script import lldb.macosx.heap output:

Hide Details

runCmd: ptr_refs self runCmd failed! error: 'ptr_refs' is not a valid command.

Hide Details

Hide Details

XFAIL: LLDB (/Users/buildslave/jenkins/workspace/lldb-cmake-sanitized/lldb-build/bin/clang-11-x86_64) :: test_ptr_refs_dwarf (TestPtrRefsObjC.TestPtrRefsObjC) <bound method SBProcess.Kill of <lldb.SBProcess; proxy of <Swig Object of type 'lldb::SBProcess *' at 0x106535990> >>: success

Hide Details

UNSUPPORTED: LLDB (/Users/buildslave/jenkins/workspace/lldb-cmake-sanitized/lldb-build/bin/clang-11-x86_64) :: test_ptr_refs_dwo (TestPtrRefsObjC.TestPtrRefsObjC) (test case does not fall in any category of interest for this run) runCmd: settings clear -all output:

Hide Details

runCmd: settings set symbols.enable-external-lookup false output:

Hide Details

runCmd: settings set target.auto-apply-fixits false output:

Hide Details

runCmd: settings set plugin.process.gdb-remote.packet-timeout 60 output:

Hide Details

runCmd: settings set symbols.clang-modules-cache-path "/Users/buildslave/jenkins/workspace/lldb-cmake-sanitized/lldb-build/lldb-test-build.noindex/module-cache-lldb/lldb-api" output:

Hide Details

runCmd: settings set use-color false output:

Hide Details

runCmd: setting set target.prefer-dynamic-value no-dynamic-values output:

Hide Details

runCmd: settings set target.env-vars ASAN_OPTIONS=detect_stack_use_after_return=1 DYLD_INSERT_LIBRARIES=/Users/buildslave/jenkins/workspace/lldb-cmake-sanitized/host-compiler/lib/clang/11.0.0/lib/darwin/libclang_rt.asan_osx_dynamic.dylib output:

Hide Details

runCmd: script import lldb.macosx.heap output:

Hide Details

runCmd: ptr_refs self runCmd failed! error: 'ptr_refs' is not a valid command.

Hide Details

Hide Details

XFAIL: LLDB (/Users/buildslave/jenkins/workspace/lldb-cmake-sanitized/lldb-build/bin/clang-11-x86_64) :: test_ptr_refs_gmodules (TestPtrRefsObjC.TestPtrRefsObjC) <bound method SBProcess.Kill of <lldb.SBProcess; proxy of <Swig Object of type 'lldb::SBProcess *' at 0x1071641e0> >>: success

Hide Details

Restore dir to: /Users/buildslave/jenkins/workspace/lldb-cmake-sanitized/lldb-build/tools/lldb/test ====================================================================== FAIL: test_ptr_refs_dsym (TestPtrRefsObjC.TestPtrRefsObjC) Test the ptr_refs tool on Darwin with Objective-C ---------------------------------------------------------------------- Traceback (most recent call last): File "/Users/buildslave/jenkins/workspace/lldb-cmake-sanitized/llvm-project/lldb/packages/Python/lldbsuite/test/lldbtest.py", line 1751, in test_method return attrvalue(self) File "/Users/buildslave/jenkins/workspace/lldb-cmake-sanitized/llvm-project/lldb/packages/Python/lldbsuite/test/decorators.py", line 110, in wrapper func(*args, **kwargs) File "/Users/buildslave/jenkins/workspace/lldb-cmake-sanitized/llvm-project/lldb/test/API/lang/objc/ptr_refs/TestPtrRefsObjC.py", line 47, in test_ptr_refs self.expect("ptr_refs self", substrs=["malloc", "stack"]) File "/Users/buildslave/jenkins/workspace/lldb-cmake-sanitized/llvm-project/lldb/packages/Python/lldbsuite/test/lldbtest.py", line 2391, in expect if msg else EXP_MSG(str, output, exe)) AssertionError: False is not True : 'ptr_refs self' returns expected result, got '0x00007ffee5b36468: stack in frame #0 of thread #1: tid 0xdf3784 in variable at 0x7ffee5b36468: (MyClass *) self = 0x00006020000000d0 0x00007ffee5b363e0: stack (red zone)' Config=x86_64-/Users/buildslave/jenkins/workspace/lldb-cmake-sanitized/lldb-build/bin/clang-11 ---------------------------------------------------------------------- Ran 4 tests in 23.306s

Hide Details

RESULT: FAILED (0 passes, 1 failures, 0 errors, 1 skipped, 2 expected failures, 0 unexpected successes)

Hide Details

--

Hide Details

******************** PASS: lldb-api :: commands/log/invalid-args/TestInvalidArgsLog.py (1172 of 1977) PASS: lldb-unit :: SymbolFile/DWARF/./SymbolFileDWARFTests/SymbolFileDWARFTests.TestAbbrevOutOfOrder (1173 of 1977) PASS: lldb-unit :: Core/./LLDBCoreTests/RichManglingContextTest.Basic (1174 of 1977) PASS: lldb-api :: commands/expression/dollar-in-variable/TestDollarInVariable.py (1175 of 1977) PASS: lldb-api :: macosx/find-dsym/deep-bundle/TestDeepBundle.py (1176 of 1977) PASS: lldb-unit :: Utility/./UtilityTests/UriParserTest.BadPort2 (1177 of 1977) PASS: lldb-api :: lang/c/vla/TestVLA.py (1178 of 1977) PASS: lldb-api :: lang/objc/print-obj/TestPrintObj.py (1179 of 1977) PASS: lldb-shell :: SymbolFile/DWARF/inline-function-address.ll (1180 of 1977) UNSUPPORTED: lldb-api :: functionalities/tsan/global_location/TestTsanGlobalLocation.py (1181 of 1977) PASS: lldb-unit :: Host/./HostTests/SocketTest.UDPGetConnectURI (1182 of 1977) PASS: lldb-api :: functionalities/data-formatter/data-formatter-skip-summary/TestDataFormatterSkipSummary.py (1183 of 1977) UNSUPPORTED: lldb-shell :: ScriptInterpreter/Lua/lua.test (1184 of 1977) PASS: lldb-shell :: Settings/TestEchoCommands.test (1185 of 1977) PASS: lldb-api :: functionalities/lazy-loading/TestLazyLoading.py (1186 of 1977) PASS: lldb-unit :: Utility/./UtilityTests/UUIDTest.RelationalOperators (1187 of 1977) PASS: lldb-unit :: Utility/./UtilityTests/StreamTeeTest.Write (1188 of 1977) PASS: lldb-unit :: Utility/./UtilityTests/NameMatchesTest.StartsWith (1189 of 1977) PASS: lldb-unit :: Utility/./UtilityTests/RangeTest.Equal (1190 of 1977) UNSUPPORTED: lldb-shell :: SymbolFile/NativePDB/typedefs.cpp (1191 of 1977) PASS: lldb-api :: functionalities/breakpoint/breakpoint_command/TestBreakpointCommand.py (1192 of 1977) UNSUPPORTED: lldb-shell :: SymbolFile/target-symbols-add-unwind.test (1193 of 1977) PASS: lldb-unit :: UnwindAssembly/x86/./UnwindAssemblyx86Tests/Testx86AssemblyInspectionEngine.TestReturnDetect (1194 of 1977) PASS: lldb-unit :: Utility/./UtilityTests/StreamTeeTest.SetStreamAtIndexOutOfBounds (1195 of 1977) PASS: lldb-api :: lang/cpp/covariant-return-types/TestCovariantReturnTypes.py (1196 of 1977) PASS: lldb-unit :: Utility/./UtilityTests/ArgsTest.ReplaceArgumentAtIndexEqual (1197 of 1977) PASS: lldb-unit :: UnwindAssembly/x86/./UnwindAssemblyx86Tests/Testx86AssemblyInspectionEngine.TestPushRBP (1198 of 1977) PASS: lldb-unit :: Host/./HostTests/NativeProcessProtocolTest.ReadCStringFromMemory_CrossPageBoundary (1199 of 1977) PASS: lldb-unit :: Utility/./UtilityTests/StringListTest.LongestCommonPrefix (1200 of 1977) PASS: lldb-unit :: Utility/./UtilityTests/StreamTeeTest.Flush (1201 of 1977) PASS: lldb-shell :: ObjectFile/MachO/lc_build_version_notools.yaml (1202 of 1977) UNSUPPORTED: lldb-shell :: ScriptInterpreter/Lua/watchpoint_callback.test (1203 of 1977) PASS: lldb-api :: functionalities/inferior-crashing/recursive-inferior/TestRecursiveInferior.py (1204 of 1977) PASS: lldb-unit :: UnwindAssembly/x86/./UnwindAssemblyx86Tests/Testx86AssemblyInspectionEngine.TestPushEBX (1205 of 1977) PASS: lldb-shell :: Settings/TestSettingsSet.test (1206 of 1977) PASS: lldb-unit :: Expression/./ExpressionTests/DiagnosticManagerTest.HasFixits (1207 of 1977) PASS: lldb-api :: lang/cpp/class_types/TestClassTypes.py (1208 of 1977) PASS: lldb-unit :: Symbol/./SymbolTests/TestTypeSystemClang.TestDisplayName (1209 of 1977) PASS: lldb-api :: lang/objc/forward-decl/TestForwardDecl.py (1210 of 1977) PASS: lldb-unit :: Utility/./UtilityTests/ScalarTest.ExtractBitfield (1211 of 1977) PASS: lldb-shell :: Reproducer/TestDiscard.test (1212 of 1977) PASS: lldb-api :: functionalities/gdb_remote_client/TestRestartBug.py (1213 of 1977) PASS: lldb-shell :: SymbolFile/DWARF/debug_loc_and_loclists.s (1214 of 1977) PASS: lldb-api :: lang/c/blocks/TestBlocks.py (1215 of 1977) PASS: lldb-unit :: Expression/./ExpressionTests/CppModuleConfigurationTest.IgnoreLibStdCpp (1216 of 1977) PASS: lldb-unit :: Utility/./UtilityTests/DataExtractorTest.GetCStrAtNullOffset (1217 of 1977) PASS: lldb-shell :: ObjectFile/ELF/PT_LOAD-overlap-PT_TLS.yaml (1218 of 1977) PASS: lldb-unit :: UnwindAssembly/x86/./UnwindAssemblyx86Tests/Testx86AssemblyInspectionEngine.TestPushECX (1219 of 1977) PASS: lldb-api :: commands/expression/persistent_types/TestPersistentTypes.py (1220 of 1977) PASS: lldb-api :: python_api/exprpath_synthetic/TestExprPathSynthetic.py (1221 of 1977) PASS: lldb-api :: functionalities/step-avoids-no-debug/TestStepNoDebug.py (1222 of 1977) PASS: lldb-unit :: Process/minidump/./LLDBMinidumpTests/MinidumpParserTest.GetMiscInfo_no_stream (1223 of 1977) UNSUPPORTED: lldb-api :: functionalities/data-formatter/data-formatter-stl/libstdcpp/smart_ptr/TestDataFormatterStdSmartPtr.py (1224 of 1977) PASS: lldb-shell :: ObjectFile/ELF/build-id-case.yaml (1225 of 1977) PASS: lldb-api :: functionalities/breakpoint/breakpoint_conditions/TestBreakpointConditions.py (1226 of 1977) PASS: lldb-api :: commands/expression/import-std-module/vector-of-vectors/TestVectorOfVectorsFromStdModule.py (1227 of 1977) PASS: lldb-unit :: Utility/./UtilityTests/AnsiTerminal.AtStart (1228 of 1977) PASS: lldb-shell :: SymbolFile/DWARF/forward-declarations.s (1229 of 1977) PASS: lldb-api :: lang/c/array_types/TestArrayTypes.py (1230 of 1977) PASS: lldb-unit :: Language/Highlighting/./HighlighterTests/HighlighterTest.ClangCursorOutOfBounds (1231 of 1977) PASS: lldb-api :: functionalities/data-formatter/boolreference/TestFormattersBoolRefPtr.py (1232 of 1977) PASS: lldb-api :: functionalities/process_group/TestChangeProcessGroup.py (1233 of 1977) PASS: lldb-unit :: Utility/./UtilityTests/EnvironmentTest.EnvpConstruction (1234 of 1977) PASS: lldb-unit :: Utility/./UtilityTests/BinaryStreamTest.PutSLEB128FiveBytes (1235 of 1977) PASS: lldb-api :: functionalities/postmortem/minidump/TestMiniDump.py (1236 of 1977) PASS: lldb-unit :: Utility/./UtilityTests/DataExtractorTest.GetCStr (1237 of 1977) PASS: lldb-unit :: Language/Highlighting/./HighlighterTests/HighlighterTest.ClangUnterminatedString (1238 of 1977) PASS: lldb-api :: functionalities/data-formatter/data-formatter-stl/libcxx/initializerlist/TestInitializerList.py (1239 of 1977) PASS: lldb-api :: functionalities/data-formatter/data-formatter-objc/TestDataFormatterObjCCF.py (1240 of 1977) PASS: lldb-shell :: ObjectFile/ELF/PT_LOAD-empty.yaml (1241 of 1977) PASS: lldb-shell :: Register/x86-64-gp-read.test (1242 of 1977) UNSUPPORTED: lldb-shell :: ScriptInterpreter/Lua/nested_sessions.test (1243 of 1977) PASS: lldb-unit :: UnwindAssembly/x86/./UnwindAssemblyx86Tests/Testx86AssemblyInspectionEngine.TestDisassemblyMidFunctionEpilogues (1244 of 1977) PASS: lldb-api :: commands/expression/two-files/TestObjCTypeQueryFromOtherCompileUnit.py (1245 of 1977) PASS: lldb-shell :: SymbolFile/DWARF/DW_AT_loclists_base.s (1246 of 1977) PASS: lldb-unit :: UnwindAssembly/x86/./UnwindAssemblyx86Tests/Testx86AssemblyInspectionEngine.Test32bitFramelessSmallStackFrame (1247 of 1977) PASS: lldb-unit :: Process/gdb-remote/./ProcessGdbRemoteTests/GDBRemoteCommunicationTest.ReadPacket_checksum (1248 of 1977) PASS: lldb-unit :: debugserver/./debugserverTests/RNBSocket.AnyListen (1249 of 1977) PASS: lldb-unit :: ObjectFile/PECOFF/./ObjectFilePECOFFTests/PECallFrameInfoTest.Basic_eh (1250 of 1977) PASS: lldb-api :: commands/expression/call-throws/TestCallThatThrows.py (1251 of 1977) PASS: lldb-api :: python_api/process/TestProcessAPI.py (1252 of 1977) PASS: lldb-api :: functionalities/unwind/noreturn/module-end/TestNoReturnModuleEnd.py (1253 of 1977) XFAIL: lldb-shell :: Register/x86-64-ymm-write.test (1254 of 1977) PASS: lldb-unit :: Utility/./UtilityTests/RangeDataVector.FindEntryIndexesThatContain_Overlap (1255 of 1977) PASS: lldb-api :: tools/lldb-server/TestGdbRemote_qThreadStopInfo.py (1256 of 1977) PASS: lldb-unit :: ObjectFile/Breakpad/./ObjectFileBreakpadTests/FileRecord.parse (1257 of 1977) PASS: lldb-api :: lang/c/step-target/TestStepTarget.py (1258 of 1977) PASS: lldb-api :: functionalities/data-formatter/data-formatter-objc/TestDataFormatterObjCNSBundle.py (1259 of 1977) PASS: lldb-unit :: Symbol/./SymbolTests/TestClangASTImporter.CopyDeclTagDecl (1260 of 1977) PASS: lldb-unit :: Utility/./UtilityTests/StringListTest.GetSize (1261 of 1977) PASS: lldb-api :: functionalities/data-formatter/data-formatter-objc/TestDataFormatterObjCNSContainer.py (1262 of 1977) PASS: lldb-api :: functionalities/paths/TestPaths.py (1263 of 1977) PASS: lldb-api :: lang/cpp/stl/TestSTL.py (1264 of 1977) UNSUPPORTED: lldb-api :: lang/objc/rdar-12408181/TestRdar12408181.py (1265 of 1977) UNSUPPORTED: lldb-shell :: Register/x86-zmm-write.test (1266 of 1977) PASS: lldb-unit :: Utility/./UtilityTests/ScalarTest.GetBytes (1267 of 1977) PASS: lldb-unit :: Utility/./UtilityTests/StringListTest.GetMaxStringLengthEqualSize (1268 of 1977) PASS: lldb-api :: macosx/thread-names/TestInterruptThreadNames.py (1269 of 1977) PASS: lldb-api :: functionalities/target-new-solib-notifications/TestModuleLoadedNotifys.py (1270 of 1977) PASS: lldb-unit :: Utility/./UtilityTests/RangeTest.NotEqual (1271 of 1977) PASS: lldb-unit :: Utility/./UtilityTests/StreamTest.ShiftOperatorStrings (1272 of 1977) PASS: lldb-unit :: Utility/./UtilityTests/SharedCluster.ClusterManager (1273 of 1977) PASS: lldb-unit :: Utility/./UtilityTests/StringExtractorTest.GetHexBytes_Partial (1274 of 1977) PASS: lldb-api :: functionalities/plugins/command_plugin/TestPluginCommands.py (1275 of 1977) PASS: lldb-shell :: ObjectFile/Breakpad/sections-trailing-func.test (1276 of 1977) PASS: lldb-api :: types/TestShortType.py (1277 of 1977) PASS: lldb-unit :: Utility/./UtilityTests/BroadcasterTest.BroadcastEvent (1278 of 1977) PASS: lldb-api :: commands/frame/diagnose/dereference-function-return/TestDiagnoseDereferenceFunctionReturn.py (1279 of 1977) PASS: lldb-api :: lang/cpp/diamond/TestDiamond.py (1280 of 1977) PASS: lldb-unit :: Utility/./UtilityTests/UriParserTest.BracketedHostnamePort (1281 of 1977) PASS: lldb-api :: functionalities/tail_call_frames/unambiguous_sequence/TestUnambiguousTailCalls.py (1282 of 1977) PASS: lldb-api :: lang/cpp/wchar_t/TestCxxWCharT.py (1283 of 1977) PASS: lldb-unit :: Utility/./UtilityTests/VASprintfTest.BufferResize (1284 of 1977) PASS: lldb-unit :: Utility/./UtilityTests/UUIDTest.Validity (1285 of 1977) PASS: lldb-unit :: UnwindAssembly/x86/./UnwindAssemblyx86Tests/Testx86AssemblyInspectionEngine.Test32BitOnlyInstruction (1286 of 1977) PASS: lldb-unit :: Language/Highlighting/./HighlighterTests/HighlighterTest.ClangSquareBrackets (1287 of 1977) PASS: lldb-unit :: Utility/./UtilityTests/StreamTest.ChangingByteOrder (1288 of 1977) PASS: lldb-unit :: Utility/./UtilityTests/BinaryStreamTest.PutULEB128ThreeBytes (1289 of 1977) PASS: lldb-shell :: SymbolFile/DWARF/dir-separator-no-comp-dir.s (1290 of 1977) PASS: lldb-unit :: ScriptInterpreter/Python/./ScriptInterpreterPythonTests/PythonDataObjectsTest.TestBorrowedReferences (1291 of 1977) PASS: lldb-shell :: SymbolFile/DWARF/deterministic-build.cpp (1292 of 1977) UNSUPPORTED: lldb-shell :: Register/x86-64-ymm16-read.test (1293 of 1977) PASS: lldb-shell :: SymbolFile/DWARF/find-basic-namespace.cpp (1294 of 1977) PASS: lldb-unit :: Utility/./UtilityTests/StreamTest.AddressEmptyPrefix (1295 of 1977) PASS: lldb-api :: tools/lldb-server/TestGdbRemoteHostInfo.py (1296 of 1977) PASS: lldb-api :: lang/objc/objc-new-syntax/TestObjCNewSyntaxArray.py (1297 of 1977) UNSUPPORTED: lldb-api :: benchmarks/libcxxmap/TestBenchmarkLibcxxMap.py (1298 of 1977) PASS: lldb-unit :: Utility/./UtilityTests/RangeTest.LessThan (1299 of 1977) PASS: lldb-unit :: UnwindAssembly/x86/./UnwindAssemblyx86Tests/Testx86AssemblyInspectionEngine.TestSpillRegToStackViaMOVx86_64 (1300 of 1977) PASS: lldb-unit :: Utility/./UtilityTests/Flags.AllClear (1301 of 1977) PASS: lldb-api :: lang/objc/objc-struct-return/TestObjCStructReturn.py (1302 of 1977) PASS: lldb-unit :: Utility/./UtilityTests/ArgsTest.TestSingleArgWithQuotedSpace (1303 of 1977) PASS: lldb-unit :: ScriptInterpreter/Python/./ScriptInterpreterPythonTests/PythonDataObjectsTest.TestDictionaryResolutionWithDot (1304 of 1977) PASS: lldb-unit :: SymbolFile/DWARF/./SymbolFileDWARFTests/DWARFASTParserClangTests.EnsureAllDIEsInDeclContextHaveBeenParsedParsesOnlyMatchingEntries (1305 of 1977) PASS: lldb-unit :: Expression/./ExpressionTests/DiagnosticManagerTest.PutStringSeverities (1306 of 1977) PASS: lldb-api :: functionalities/data-formatter/pyobjsynthprovider/TestPyObjSynthProvider.py (1307 of 1977) PASS: lldb-unit :: Symbol/./SymbolTests/TestClangASTImporter.ImportInvalidType (1308 of 1977) PASS: lldb-unit :: Utility/./UtilityTests/SerializationRountripTest.SerializeDeserializeCStringArrayNullptr (1309 of 1977) PASS: lldb-unit :: SymbolFile/NativePDB/./SymbolFileNativePDBTests/PDBFPOProgramToDWARFExpressionTests.DependencyChain (1310 of 1977) PASS: lldb-api :: commands/expression/unwind_expression/TestUnwindExpression.py (1311 of 1977) PASS: lldb-unit :: Language/Highlighting/./HighlighterTests/HighlighterTest.ClangCursorPosAfterOtherToken (1312 of 1977) PASS: lldb-api :: macosx/load-kext/TestLoadKext.py (1313 of 1977) PASS: lldb-unit :: Utility/./UtilityTests/DataExtractorTest.GetCStrAtEnd (1314 of 1977) UNSUPPORTED: lldb-api :: api/multiple-debuggers/TestMultipleDebuggers.py (1315 of 1977) PASS: lldb-shell :: SymbolFile/DWARF/split-dwarf-inlining.cpp (1316 of 1977) PASS: lldb-unit :: Utility/./UtilityTests/OptionsWithRawTest.MultiWordSuffix (1317 of 1977) UNSUPPORTED: lldb-shell :: SymbolFile/PDB/function-nested-block.test (1318 of 1977) PASS: lldb-api :: lang/objc/conflicting-definition/TestConflictingDefinition.py (1319 of 1977) PASS: lldb-unit :: Utility/./UtilityTests/StreamTest.AddressRange (1320 of 1977) PASS: lldb-api :: tools/lldb-server/TestGdbRemoteProcessInfo.py (1321 of 1977) PASS: lldb-api :: lang/objc/modules/TestObjCModules.py (1322 of 1977) PASS: lldb-api :: python_api/disassemble-raw-data/TestDisassembleRawData.py (1323 of 1977) PASS: lldb-unit :: Utility/./UtilityTests/StructuredDataTest.StringDump (1324 of 1977) PASS: lldb-api :: functionalities/data-formatter/type_summary_list_script/TestTypeSummaryListScript.py (1325 of 1977) PASS: lldb-api :: functionalities/data-formatter/data-formatter-proper-plurals/TestFormattersOneIsSingular.py (1326 of 1977) PASS: lldb-unit :: Process/gdb-remote/./ProcessGdbRemoteTests/GDBRemoteClientBaseTest.SendContinueAndAsyncPacket (1327 of 1977) PASS: lldb-shell :: ObjectFile/ELF/compressed-sections.yaml (1328 of 1977) UNSUPPORTED: lldb-api :: commands/gui/basic/TestGuiBasic.py (1329 of 1977) PASS: lldb-api :: lang/cpp/dynamic-value/TestCppValueCast.py (1330 of 1977) PASS: lldb-unit :: Host/./HostTests/NativeProcessProtocolTest.SetBreakpoint (1331 of 1977) PASS: lldb-unit :: UnwindAssembly/x86/./UnwindAssemblyx86Tests/Testx86AssemblyInspectionEngine.TestPopR12 (1332 of 1977) PASS: lldb-unit :: Process/minidump/./LLDBMinidumpTests/MinidumpParserTest.GetArchitecture (1333 of 1977) PASS: lldb-unit :: Utility/./UtilityTests/StringExtractorTest.GetHexBytes_Underflow (1334 of 1977) PASS: lldb-unit :: ScriptInterpreter/Python/./ScriptInterpreterPythonTests/PythonDataObjectsTest.TestPythonTupleValues (1335 of 1977) PASS: lldb-api :: commands/watchpoints/multiple_hits/TestMultipleHits.py (1336 of 1977) PASS: lldb-unit :: ScriptInterpreter/Python/./ScriptInterpreterPythonTests/PythonDataObjectsTest.TestTypeNameResolutionNoDot (1337 of 1977) PASS: lldb-api :: functionalities/gdb_remote_client/TestIOSSimulator.py (1338 of 1977) PASS: lldb-shell :: Reproducer/TestGDBRemoteRepro.test (1339 of 1977) PASS: lldb-api :: functionalities/data-formatter/synthupdate/TestSyntheticFilterRecompute.py (1340 of 1977) PASS: lldb-unit :: ObjectFile/ELF/./ObjectFileELFTests/ObjectFileELFTest.SectionsResolveConsistently (1341 of 1977) PASS: lldb-api :: functionalities/data-formatter/data-formatter-advanced/TestDataFormatterAdv.py (1342 of 1977) PASS: lldb-api :: commands/frame/select/TestFrameSelect.py (1343 of 1977) PASS: lldb-api :: tools/lldb-server/TestGdbRemoteExpeditedRegisters.py (1344 of 1977) PASS: lldb-unit :: Utility/./UtilityTests/StringListTest.InsertStringAtIndexEnd (1345 of 1977) PASS: lldb-unit :: ObjectFile/PECOFF/./ObjectFilePECOFFTests/PECallFrameInfoTest.Frame_reg_eh (1346 of 1977) PASS: lldb-api :: functionalities/thread/concurrent_events/TestConcurrentTwoWatchpointsOneSignal.py (1347 of 1977) PASS: lldb-api :: commands/expression/save_jit_objects/TestSaveJITObjects.py (1348 of 1977) PASS: lldb-api :: functionalities/non-overlapping-index-variable-i/TestIndexVariable.py (1349 of 1977) PASS: lldb-unit :: Host/./HostTests/ConnectionFileDescriptorTest.TCPGetURIv4 (1350 of 1977) PASS: lldb-unit :: Utility/./UtilityTests/BinaryStreamTest.PutULEB128FourBytes (1351 of 1977) PASS: lldb-api :: commands/expression/namespace_local_var_same_name_cpp_and_c/TestNamespaceLocalVarSameNameCppAndC.py (1352 of 1977) PASS: lldb-unit :: Utility/./UtilityTests/GeneratorTest.GetOrCreate (1353 of 1977) PASS: lldb-unit :: Utility/./UtilityTests/RangeTest.Copy (1354 of 1977) PASS: lldb-unit :: Utility/./UtilityTests/StringExtractorTest.GetHexU8_Exact_NoEof (1355 of 1977) PASS: lldb-api :: functionalities/tail_call_frames/ambiguous_tail_call_seq2/TestAmbiguousTailCallSeq2.py (1356 of 1977) PASS: lldb-shell :: Driver/TestNoUseColor.test (1357 of 1977) PASS: lldb-api :: functionalities/thread/concurrent_events/TestConcurrentManyWatchpoints.py (1358 of 1977) PASS: lldb-unit :: Utility/./UtilityTests/RangeTest.SetRangeBase (1359 of 1977) PASS: lldb-api :: lang/objc/objc-checker/TestObjCCheckers.py (1360 of 1977) PASS: lldb-api :: lang/cpp/lambdas/TestLambdas.py (1361 of 1977) PASS: lldb-api :: functionalities/data-formatter/data-formatter-stl/libcxx/tuple/TestDataFormatterLibcxxTuple.py (1362 of 1977) PASS: lldb-unit :: Utility/./UtilityTests/ScalarTest.Promotion (1363 of 1977) PASS: lldb-unit :: Language/Highlighting/./HighlighterTests/HighlighterTest.Colons (1364 of 1977) PASS: lldb-api :: terminal/TestSTTYBeforeAndAfter.py (1365 of 1977) PASS: lldb-unit :: SymbolFile/DWARF/./SymbolFileDWARFTests/SymbolFileDWARFTests.TestAbilitiesForDWARF (1366 of 1977) PASS: lldb-shell :: ObjectFile/PECOFF/sections.yaml (1367 of 1977) PASS: lldb-unit :: Language/Highlighting/./HighlighterTests/HighlighterTest.HighlighterSelectionPath (1368 of 1977) PASS: lldb-unit :: Utility/./UtilityTests/LogChannelEnabledTest.log_options (1369 of 1977) PASS: lldb-unit :: Symbol/./SymbolTests/TestTypeSystemClang.TestGetTypeClassTypeOfExpr (1370 of 1977) UNSUPPORTED: lldb-api :: benchmarks/libcxxlist/TestBenchmarkLibcxxList.py (1371 of 1977) PASS: lldb-unit :: Utility/./UtilityTests/Flags.Clear (1372 of 1977) PASS: lldb-unit :: Target/./TargetTests/ModuleCacheTest.GetAndPutUuidExists (1373 of 1977) PASS: lldb-api :: python_api/function_symbol/TestDisasmAPI.py (1374 of 1977) PASS: lldb-unit :: Utility/./UtilityTests/OptionsWithRawTest.WhitespaceInput (1375 of 1977) PASS: lldb-unit :: Language/Highlighting/./HighlighterTests/HighlighterTest.ClangCommas (1376 of 1977) XFAIL: lldb-shell :: SymbolFile/DWARF/find-type-in-function.cpp (1377 of 1977) PASS: lldb-shell :: Reproducer/Functionalities/TestDataFormatter.test (1378 of 1977) PASS: lldb-shell :: ObjectFile/wasm/unified-debug-sections.yaml (1379 of 1977) PASS: lldb-api :: functionalities/data-formatter/data-formatter-stl/libstdcpp/unique_ptr/invalid/TestDataFormatterInvalidStdUniquePtr.py (1380 of 1977) PASS: lldb-api :: python_api/watchpoint/TestSetWatchpoint.py (1381 of 1977) PASS: lldb-unit :: SymbolFile/NativePDB/./SymbolFileNativePDBTests/PDBFPOProgramToDWARFExpressionTests.MultipleDependentAssignments (1382 of 1977) UNSUPPORTED: lldb-shell :: SymbolFile/PDB/pointers.test (1383 of 1977) PASS: lldb-shell :: Quit/TestQuitExitCode-30.test (1384 of 1977) PASS: lldb-api :: functionalities/target_var/TestTargetVar.py (1385 of 1977) PASS: lldb-unit :: ScriptInterpreter/Python/./ScriptInterpreterPythonTests/PythonDataObjectsTest.TestPythonDictionaryValueEquality (1386 of 1977) PASS: lldb-api :: types/TestFloatTypesExpr.py (1387 of 1977) PASS: lldb-api :: functionalities/breakpoint/breakpoint_command/TestRegexpBreakCommand.py (1388 of 1977) PASS: lldb-unit :: Utility/./UtilityTests/Flags.AllSet (1389 of 1977) PASS: lldb-shell :: Commands/command-regex-unalias.test (1390 of 1977) UNSUPPORTED: lldb-api :: functionalities/darwin_log/filter/regex/activity-chain/TestDarwinLogFilterRegexActivityChain.py (1391 of 1977) PASS: lldb-shell :: SymbolFile/DWARF/DW_OP_piece-struct.s (1392 of 1977) PASS: lldb-unit :: Host/./HostTests/SocketTest.DomainGetConnectURI (1393 of 1977) PASS: lldb-api :: lang/cpp/char1632_t/TestChar1632T.py (1394 of 1977) PASS: lldb-unit :: UnwindAssembly/x86/./UnwindAssemblyx86Tests/Testx86AssemblyInspectionEngine.Test64bitFramelessBigStackFrame (1395 of 1977) PASS: lldb-unit :: Utility/./UtilityTests/ArchSpecTest.TestParseMachCPUDashSubtypeTripleSimple (1396 of 1977) PASS: lldb-api :: commands/watchpoints/watchpoint_commands/command/TestWatchpointCommandLLDB.py (1397 of 1977) PASS: lldb-unit :: Host/./HostTests/SocketTest.TCPListen0ConnectAccept (1398 of 1977) PASS: lldb-api :: lang/cpp/operator-overload/TestOperatorOverload.py (1399 of 1977) PASS: lldb-api :: functionalities/breakpoint/inlined_breakpoints/TestInlinedBreakpoints.py (1400 of 1977) PASS: lldb-unit :: UnwindAssembly/x86/./UnwindAssemblyx86Tests/Testx86AssemblyInspectionEngine.TestPopESI (1401 of 1977) PASS: lldb-api :: functionalities/breakpoint/address_breakpoints/TestAddressBreakpoints.py (1402 of 1977) PASS: lldb-api :: tools/lldb-vscode/variables/TestVSCode_variables.py (1403 of 1977) PASS: lldb-shell :: Reproducer/TestRelativePath.test (1404 of 1977) PASS: lldb-api :: functionalities/data-formatter/data-formatter-stl/libcxx/optional/TestDataFormatterLibcxxOptional.py (1405 of 1977) UNSUPPORTED: lldb-api :: functionalities/data-formatter/data-formatter-stl/libstdcpp/string/TestDataFormatterStdString.py (1406 of 1977) PASS: lldb-unit :: Utility/./UtilityTests/DataExtractorTest.GetMaxU64_unchecked (1407 of 1977) PASS: lldb-api :: functionalities/dead-strip/TestDeadStrip.py (1408 of 1977) UNSUPPORTED: lldb-api :: functionalities/darwin_log/filter/exact_match/activity/TestDarwinLogFilterMatchActivity.py (1409 of 1977) PASS: lldb-api :: functionalities/backticks/TestBackticksWithoutATarget.py (1410 of 1977) PASS: lldb-unit :: Symbol/./SymbolTests/PostfixExpression.ToDWARF (1411 of 1977) PASS: lldb-api :: functionalities/memory/find/TestMemoryFind.py (1412 of 1977) UNSUPPORTED: lldb-api :: functionalities/exec/TestExec.py (1413 of 1977) PASS: lldb-unit :: Utility/./UtilityTests/StreamTest.PutStringAsRawHex8 (1414 of 1977) PASS: lldb-unit :: Utility/./UtilityTests/StringListTest.ShiftCString (1415 of 1977) PASS: lldb-api :: functionalities/breakpoint/breakpoint_names/TestBreakpointNames.py (1416 of 1977) PASS: lldb-unit :: Host/./HostTests/FileSystemTest.MakeAbsolute (1417 of 1977) UNSUPPORTED: lldb-api :: commands/target/auto-install-main-executable/TestAutoInstallMainExecutable.py (1418 of 1977) PASS: lldb-unit :: Process/gdb-remote/./ProcessGdbRemoteTests/GDBRemoteCommunicationClientTest.GetMemoryRegionInfoInvalidResponse (1419 of 1977) PASS: lldb-unit :: SymbolFile/NativePDB/./SymbolFileNativePDBTests/PDBFPOProgramToDWARFExpressionTests.InvalidAssignmentMultiple (1420 of 1977) PASS: lldb-api :: functionalities/value_md5_crash/TestValueMD5Crash.py (1421 of 1977) PASS: lldb-unit :: Core/./LLDBCoreTests/UniqueCStringMap.NoDefaultConstructor (1422 of 1977) PASS: lldb-unit :: Utility/./UtilityTests/BinaryStreamTest.PutULEB128One (1423 of 1977) PASS: lldb-api :: macosx/find-app-in-bundle/TestFindAppInBundle.py (1424 of 1977) PASS: lldb-unit :: Utility/./UtilityTests/UriParserTest.BracketedHostname (1425 of 1977) PASS: lldb-api :: commands/expression/persistent_ptr_update/TestPersistentPtrUpdate.py (1426 of 1977) UNSUPPORTED: lldb-shell :: Process/Windows/exception_access_violation.cpp (1427 of 1977) PASS: lldb-unit :: Utility/./UtilityTests/StringExtractorTest.GetNameColonValueNoColon (1428 of 1977) PASS: lldb-unit :: ScriptInterpreter/Python/./ScriptInterpreterPythonTests/PythonDataObjectsTest.TestPythonStringToStr (1429 of 1977) PASS: lldb-shell :: SymbolFile/NativePDB/s_constant.cpp (1430 of 1977) PASS: lldb-unit :: Utility/./UtilityTests/StreamTest.AddressPrefixAndSuffix (1431 of 1977) PASS: lldb-unit :: debugserver/./debugserverTests/JSON.Parse (1432 of 1977) UNSUPPORTED: lldb-api :: functionalities/data-formatter/data-formatter-stl/libstdcpp/unique_ptr/TestDataFormatterStdUniquePtr.py (1433 of 1977) PASS: lldb-unit :: Expression/./ExpressionTests/DiagnosticManagerTest.GetStringNoDiags (1434 of 1977) PASS: lldb-api :: functionalities/plugins/python_os_plugin/TestPythonOSPlugin.py (1435 of 1977) PASS: lldb-api :: python_api/sblaunchinfo/TestSBLaunchInfo.py (1436 of 1977) PASS: lldb-api :: functionalities/data-formatter/data-formatter-stl/libcxx/string/TestDataFormatterLibcxxString.py (1437 of 1977) PASS: lldb-shell :: SymbolFile/DWARF/debug_ranges-missing-section.s (1438 of 1977) PASS: lldb-unit :: Utility/./UtilityTests/StreamTest.QuotedCString (1439 of 1977) PASS: lldb-api :: lang/objc/unicode-string/TestUnicodeString.py (1440 of 1977) PASS: lldb-api :: macosx/duplicate-archive-members/TestDuplicateMembers.py (1441 of 1977) PASS: lldb-unit :: Utility/./UtilityTests/ArgsTest.TestInsertArg (1442 of 1977) PASS: lldb-unit :: UnwindAssembly/x86/./UnwindAssemblyx86Tests/Testx86AssemblyInspectionEngine.TestStackRealign8BitDisp_i386 (1443 of 1977) PASS: lldb-api :: python_api/sbvalue_persist/TestSBValuePersist.py (1444 of 1977) PASS: lldb-shell :: SymbolFile/DWARF/anon_class_w_and_wo_export_symbols.ll (1445 of 1977) UNSUPPORTED: lldb-api :: commands/register/register/intel_xtended_registers/TestMPXRegisters.py (1446 of 1977) PASS: lldb-unit :: Utility/./UtilityTests/DataExtractorTest.GetCStrUnterminated (1447 of 1977) PASS: lldb-unit :: Breakpoint/./LLDBBreakpointTests/BreakpointIDTest.StringIsBreakpointName (1448 of 1977) PASS: lldb-api :: tools/lldb-server/inferior-crash/TestGdbRemoteAbort.py (1449 of 1977) PASS: lldb-api :: lang/cpp/unique-types/TestUniqueTypes.py (1450 of 1977) PASS: lldb-api :: functionalities/data-formatter/data-formatter-globals/TestDataFormatterGlobals.py (1451 of 1977) PASS: lldb-unit :: Utility/./UtilityTests/AnsiTerminal.Incomplete (1452 of 1977) PASS: lldb-api :: functionalities/postmortem/elf-core/thread_crash/TestLinuxCoreThreads.py (1453 of 1977) PASS: lldb-unit :: Utility/./UtilityTests/StreamTest.PutCStringWithStringRef (1454 of 1977) UNSUPPORTED: lldb-shell :: Register/x86-64-zmm-read.test (1455 of 1977) PASS: lldb-api :: commands/frame/diagnose/local-variable/TestLocalVariable.py (1456 of 1977) PASS: lldb-unit :: Language/Highlighting/./HighlighterTests/HighlighterTest.ClangBraces (1457 of 1977) PASS: lldb-unit :: Utility/./UtilityTests/ArgsTest.TestTrailingBackslash (1458 of 1977) PASS: lldb-unit :: UnwindAssembly/x86/./UnwindAssemblyx86Tests/Testx86AssemblyInspectionEngine.Testi386IgnoredRegisters (1459 of 1977) PASS: lldb-shell :: SymbolFile/DWARF/dwarf5-debug_line.s (1460 of 1977) PASS: lldb-api :: lang/objc/foundation/TestSymbolTable.py (1461 of 1977) PASS: lldb-unit :: Utility/./UtilityTests/StreamTest.AddressSize (1462 of 1977) PASS: lldb-api :: macosx/nslog/TestDarwinNSLogOutput.py (1463 of 1977) PASS: lldb-shell :: Minidump/memory-region-from-module.yaml (1464 of 1977) PASS: lldb-api :: tools/lldb-vscode/launch/TestVSCode_launch.py (1465 of 1977) PASS: lldb-api :: functionalities/data-formatter/user-format-vs-summary/TestUserFormatVsSummary.py (1466 of 1977) PASS: lldb-unit :: Target/./TargetTests/ModuleCacheTest.GetAndPut (1467 of 1977) PASS: lldb-unit :: Utility/./UtilityTests/StringExtractorTest.GetU64BigEndian (1468 of 1977) PASS: lldb-api :: functionalities/thread/concurrent_events/TestConcurrentSignalWatchBreak.py (1469 of 1977) UNSUPPORTED: lldb-shell :: ScriptInterpreter/Lua/command_script_import.test (1470 of 1977) PASS: lldb-api :: lang/objcxx/hide-runtime-values/TestObjCXXHideRuntimeValues.py (1471 of 1977) PASS: lldb-unit :: Host/./HostTests/ProcessLaunchInfoTest.Constructor (1472 of 1977) PASS: lldb-api :: functionalities/data-formatter/vector-types/TestVectorTypesFormatting.py (1473 of 1977) PASS: lldb-api :: commands/expression/codegen-crash-typedefdecl-not-in_declcontext/TestCodegenCrashTypedefDeclNotInDeclContext.py (1474 of 1977) PASS: lldb-api :: functionalities/thread/concurrent_events/TestConcurrentDelaySignalWatch.py (1475 of 1977) PASS: lldb-api :: macosx/profile_vrs_detach/TestDetachVrsProfile.py (1476 of 1977) UNSUPPORTED: lldb-api :: functionalities/data-formatter/data-formatter-stl/libstdcpp/vector/TestDataFormatterStdVector.py (1477 of 1977) PASS: lldb-unit :: Utility/./UtilityTests/StringExtractorTest.GetHexBytes (1478 of 1977) PASS: lldb-unit :: Expression/./ExpressionTests/CppModuleConfigurationTest.AmbiguousLibCpp (1479 of 1977) PASS: lldb-unit :: UnwindAssembly/x86/./UnwindAssemblyx86Tests/Testx86AssemblyInspectionEngine.TestCALLNextInsn (1480 of 1977) PASS: lldb-unit :: Utility/./UtilityTests/UriParserTest.SchemeHostSeparator2 (1481 of 1977) PASS: lldb-api :: functionalities/avoids-fd-leak/TestFdLeak.py (1482 of 1977) PASS: lldb-unit :: Symbol/./SymbolTests/TestTypeSystemClang.TestGetTypeClassTypeOf (1483 of 1977) PASS: lldb-api :: commands/expression/entry-bp/TestExprEntryBP.py (1484 of 1977) PASS: lldb-api :: lang/objc/self/TestObjCSelf.py (1485 of 1977) PASS: lldb-api :: functionalities/gdb_remote_client/TestNoGPacketSupported.py (1486 of 1977) PASS: lldb-api :: functionalities/breakpoint/breakpoint_locations/TestBreakpointLocations.py (1487 of 1977) PASS: lldb-api :: lang/c/register_variables/TestRegisterVariables.py (1488 of 1977) PASS: lldb-unit :: Utility/./UtilityTests/StreamTeeTest.AppendStream (1489 of 1977) UNSUPPORTED: lldb-api :: tools/lldb-server/libraries-svr4/TestGdbRemoteLibrariesSvr4Support.py (1490 of 1977) PASS: lldb-unit :: Utility/./UtilityTests/StringListTest.LongestCommonPrefixSingleElement (1491 of 1977) PASS: lldb-unit :: Expression/./ExpressionTests/CppModuleConfigurationTest.MissingLibCpp (1492 of 1977) PASS: lldb-shell :: SymbolFile/Breakpad/line-table.test (1493 of 1977) PASS: lldb-unit :: Utility/./UtilityTests/LogChannelTest.Enable (1494 of 1977) PASS: lldb-api :: functionalities/step_scripted/TestStepScripted.py (1495 of 1977) UNSUPPORTED: lldb-shell :: SymbolFile/NativePDB/local-variables.cpp (1496 of 1977) PASS: lldb-shell :: SymbolFile/DWARF/apple-index-is-used.cpp (1497 of 1977) PASS: lldb-unit :: Utility/./UtilityTests/VMRange.Reset (1498 of 1977) PASS: lldb-unit :: Utility/./UtilityTests/OptionsWithRawTest.WhitespaceSuffix (1499 of 1977) PASS: lldb-unit :: Host/./HostTests/ConnectionFileDescriptorTest.TCPGetURIv6 (1500 of 1977) UNSUPPORTED: lldb-api :: functionalities/darwin_log/filter/exact_match/subsystem/TestDarwinLogFilterMatchSubsystem.py (1501 of 1977) PASS: lldb-api :: python_api/file_handle/TestFileHandle.py (1502 of 1977) PASS: lldb-unit :: Utility/./UtilityTests/UriParserTest.MinimalPortPath (1503 of 1977) PASS: lldb-unit :: Utility/./UtilityTests/UriParserTest.BracketedHostnameWithPortIPv6 (1504 of 1977) PASS: lldb-api :: functionalities/breakpoint/objc/TestObjCBreakpoints.py (1505 of 1977) PASS: lldb-api :: functionalities/thread/concurrent_events/TestConcurrentSignalWatch.py (1506 of 1977) PASS: lldb-api :: macosx/add-dsym/TestAddDsymMidExecutionCommand.py (1507 of 1977) PASS: lldb-unit :: UnwindAssembly/x86/./UnwindAssemblyx86Tests/Testx86AssemblyInspectionEngine.TestPopRBP (1508 of 1977) UNSUPPORTED: lldb-api :: functionalities/data-formatter/data-formatter-stl/libstdcpp/iterator/TestDataFormatterStdIterator.py (1509 of 1977) PASS: lldb-api :: tools/lldb-server/TestGdbRemoteAttach.py (1510 of 1977) PASS: lldb-api :: functionalities/thread/create_after_attach/TestCreateAfterAttach.py (1511 of 1977) PASS: lldb-unit :: SymbolFile/NativePDB/./SymbolFileNativePDBTests/PDBFPOProgramToDWARFExpressionTests.UnresolvedDependentCyclicRegisterAssignmentReference (1512 of 1977) PASS: lldb-unit :: UnwindAssembly/x86/./UnwindAssemblyx86Tests/Testx86AssemblyInspectionEngine.TestPushEDX (1513 of 1977) PASS: lldb-unit :: Utility/./UtilityTests/Flags.Reset (1514 of 1977) PASS: lldb-api :: linux/builtin_trap/TestBuiltinTrap.py (1515 of 1977) PASS: lldb-api :: functionalities/data-formatter/data-formatter-enum-format/TestDataFormatterEnumFormat.py (1516 of 1977) PASS: lldb-unit :: Utility/./UtilityTests/CompletionRequest.TryCompleteCurrentArgMode (1517 of 1977) PASS: lldb-unit :: Utility/./UtilityTests/ProcessInstanceInfoList.Yaml (1518 of 1977) PASS: lldb-unit :: ScriptInterpreter/Python/./ScriptInterpreterPythonTests/PythonDataObjectsTest.TestObjectAttributes (1519 of 1977) PASS: lldb-api :: lang/objc/objc_direct-methods/TestObjCDirectMethods.py (1520 of 1977) PASS: lldb-shell :: Commands/command-script-import.test (1521 of 1977) PASS: lldb-unit :: Utility/./UtilityTests/FileSpecTest.Equal (1522 of 1977) PASS: lldb-api :: functionalities/data-formatter/data-formatter-stl/libcxx/list/TestDataFormatterLibcxxList.py (1523 of 1977) PASS: lldb-api :: commands/expression/pr35310/TestExprsBug35310.py (1524 of 1977) UNSUPPORTED: lldb-api :: tools/lldb-server/TestGdbRemote_vContThreads.py (1525 of 1977) PASS: lldb-api :: functionalities/data-formatter/ptr_ref_typedef/TestPtrRef2Typedef.py (1526 of 1977) PASS: lldb-unit :: Expression/./ExpressionTests/DWARFExpression.DW_OP_pick (1527 of 1977) UNSUPPORTED: lldb-api :: tools/lldb-server/signal-filtering/TestGdbRemote_QPassSignals.py (1528 of 1977) PASS: lldb-unit :: Target/./TargetTests/MCBasedABI.MapRegisterName (1529 of 1977) PASS: lldb-api :: lang/objc/global_ptrs/TestGlobalObjects.py (1530 of 1977) PASS: lldb-api :: commands/expression/class_template_specialization_empty_pack/TestClassTemplateSpecializationParametersHandling.py (1531 of 1977) PASS: lldb-api :: lang/objc/modules-update/TestClangModulesUpdate.py (1532 of 1977) PASS: lldb-api :: lang/c/unicode/TestUnicodeSymbols.py (1533 of 1977) PASS: lldb-api :: commands/expression/import-std-module/unique_ptr-dbg-info-content/TestUniquePtrDbgInfoContent.py (1534 of 1977) PASS: lldb-api :: functionalities/wrong_commands/TestWrongCommands.py (1535 of 1977) PASS: lldb-api :: tools/lldb-vscode/breakpoint-events/TestVSCode_breakpointEvents.py (1536 of 1977) PASS: lldb-api :: lang/objc/modules-cache/TestClangModulesCache.py (1537 of 1977) PASS: lldb-unit :: Utility/./UtilityTests/OptionsWithRawTest.TerminatedQuote (1538 of 1977) PASS: lldb-unit :: Process/gdb-remote/./ProcessGdbRemoteTests/GDBRemoteCommunicationClientTest.GetModulesInfoInvalidResponse (1539 of 1977) PASS: lldb-api :: lang/cpp/member-and-local-vars-with-same-name/TestMembersAndLocalsWithSameName.py (1540 of 1977) PASS: lldb-shell :: SymbolFile/DWARF/inline-function-address-shared.test (1541 of 1977) PASS: lldb-api :: functionalities/breakpoint/breakpoint_ignore_count/TestBreakpointIgnoreCount.py (1542 of 1977) PASS: lldb-shell :: Driver/TestFile.test (1543 of 1977) PASS: lldb-api :: lang/cpp/extern_c/TestExternCSymbols.py (1544 of 1977) PASS: lldb-unit :: Utility/./UtilityTests/ScalarTest.ComparisonFloat (1545 of 1977) PASS: lldb-api :: functionalities/breakpoint/dummy_target_breakpoints/TestBreakpointsWithNoTargets.py (1546 of 1977) PASS: lldb-unit :: Utility/./UtilityTests/BinaryStreamTest.PutSLEB128One (1547 of 1977) PASS: lldb-api :: commands/frame/diagnose/array/TestArray.py (1548 of 1977) PASS: lldb-api :: python_api/class_members/TestSBTypeClassMembers.py (1549 of 1977) PASS: lldb-unit :: ScriptInterpreter/Python/./ScriptInterpreterPythonTests/PythonDataObjectsTest.TestPythonTupleInitializerList2 (1550 of 1977) PASS: lldb-api :: commands/watchpoints/watchpoint_disable/TestWatchpointDisable.py (1551 of 1977) PASS: lldb-api :: commands/watchpoints/watchpoint_events/TestWatchpointEvents.py (1552 of 1977) PASS: lldb-shell :: Reproducer/TestMultipleTargets.test (1553 of 1977) PASS: lldb-unit :: Process/minidump/./LLDBMinidumpTests/RegisterContextMinidump.CheckRegisterContextMinidump_ARM (1554 of 1977) PASS: lldb-unit :: Utility/./UtilityTests/RangeTest.ContainsEndInclusive (1555 of 1977) PASS: lldb-unit :: UnwindAssembly/x86/./UnwindAssemblyx86Tests/Testx86AssemblyInspectionEngine.TestPopR13 (1556 of 1977) PASS: lldb-api :: lang/cpp/gmodules-templates/TestGModules.py (1557 of 1977) PASS: lldb-unit :: Process/minidump/./LLDBMinidumpTests/MinidumpParserTest.GetExceptionStream (1558 of 1977) UNSUPPORTED: lldb-api :: functionalities/breakpoint/breakpoint_callback_command_source/TestBreakpointCallbackCommandSource.py (1559 of 1977) PASS: lldb-unit :: Language/Highlighting/./HighlighterTests/HighlighterTest.ClangCursorPos (1560 of 1977) FAIL: lldb-api :: functionalities/ptr_refs/TestPtrRefs.py (1561 of 1977) ******************** TEST 'lldb-api :: functionalities/ptr_refs/TestPtrRefs.py' FAILED ******************** Script: -- /usr/local/bin/python /Users/buildslave/jenkins/workspace/lldb-cmake-sanitized/llvm-project/lldb/test/API/dotest.py --arch x86_64 -s /Users/buildslave/jenkins/workspace/lldb-cmake-sanitized/lldb-build/lldb-test-traces -S nm -u CXXFLAGS -u CFLAGS --codesign-identity lldb_codesign --server /Users/buildslave/jenkins/workspace/lldb-cmake-sanitized/lldb-build/./bin/debugserver --arch x86_64 --build-dir /Users/buildslave/jenkins/workspace/lldb-cmake-sanitized/lldb-build/lldb-test-build.noindex -s=/Users/buildslave/jenkins/workspace/lldb-cmake-sanitized/test/logs -t --env TERM=vt100 --env LLVM_LIBS_DIR=/Users/buildslave/jenkins/workspace/lldb-cmake-sanitized/lldb-build/./lib --inferior-env ASAN_OPTIONS=detect_stack_use_after_return=1 --inferior-env DYLD_INSERT_LIBRARIES=/Users/buildslave/jenkins/workspace/lldb-cmake-sanitized/host-compiler/lib/clang/11.0.0/lib/darwin/libclang_rt.asan_osx_dynamic.dylib --build-dir /Users/buildslave/jenkins/workspace/lldb-cmake-sanitized/lldb-build/lldb-test-build.noindex --lldb-module-cache-dir /Users/buildslave/jenkins/workspace/lldb-cmake-sanitized/lldb-build/lldb-test-build.noindex/module-cache-lldb/lldb-api --clang-module-cache-dir /Users/buildslave/jenkins/workspace/lldb-cmake-sanitized/lldb-build/lldb-test-build.noindex/module-cache-clang/lldb-api --executable /Users/buildslave/jenkins/workspace/lldb-cmake-sanitized/lldb-build/./bin/lldb --compiler /Users/buildslave/jenkins/workspace/lldb-cmake-sanitized/lldb-build/./bin/clang --dsymutil /Users/buildslave/jenkins/workspace/lldb-cmake-sanitized/lldb-build/./bin/dsymutil --filecheck /Users/buildslave/jenkins/workspace/lldb-cmake-sanitized/lldb-build/./bin/FileCheck --lldb-libs-dir /Users/buildslave/jenkins/workspace/lldb-cmake-sanitized/lldb-build/./lib /Users/buildslave/jenkins/workspace/lldb-cmake-sanitized/llvm-project/lldb/test/API/functionalities/ptr_refs -p TestPtrRefs.py -- Exit Code: 1

Hide Details

Command Output (stdout): -- lldb version 11.0.99 clang revision 4bf015c035e4e5b63c7222dfb15ff274a5ed905c llvm revision 4bf015c035e4e5b63c7222dfb15ff274a5ed905c "crashlog" and "save_crashlog" command installed, use the "--help" option for detailed help "malloc_info", "ptr_refs", "cstr_refs", "find_variable", and "objc_refs" commands have been installed, use the "--help" options on these commands for detailed help. LLDB library dir: /Users/buildslave/jenkins/workspace/lldb-cmake-sanitized/lldb-build/bin LLDB import library dir: /Users/buildslave/jenkins/workspace/lldb-cmake-sanitized/lldb-build/./lib libstdcxx tests will not be run because: Don't know how to build with libstdcxx on macosx Skipping following debug info categories: ['dwo'] 0x00007ffee9dbc478: stack in frame #0 of thread #1: tid 0xe0049a in variable at 0x7ffee9dbc478: (const char *) my_ptr = 0x00006020000000b0 "hello" 0x00007ffee9dbc410: stack (red zone)

Hide Details

-- Command Output (stderr): -- error: 'ptr_refs' is not a valid command. error: 'ptr_refs' is not a valid command.

Hide Details

Session logs for test failures/errors/unexpected successes will go into directory '/Users/buildslave/jenkins/workspace/lldb-cmake-sanitized/test/logs' Command invoked: /Users/buildslave/jenkins/workspace/lldb-cmake-sanitized/llvm-project/lldb/test/API/dotest.py --arch x86_64 -s /Users/buildslave/jenkins/workspace/lldb-cmake-sanitized/lldb-build/lldb-test-traces -S nm -u CXXFLAGS -u CFLAGS --codesign-identity lldb_codesign --server /Users/buildslave/jenkins/workspace/lldb-cmake-sanitized/lldb-build/./bin/debugserver --arch x86_64 --build-dir /Users/buildslave/jenkins/workspace/lldb-cmake-sanitized/lldb-build/lldb-test-build.noindex -s=/Users/buildslave/jenkins/workspace/lldb-cmake-sanitized/test/logs -t --env TERM=vt100 --env LLVM_LIBS_DIR=/Users/buildslave/jenkins/workspace/lldb-cmake-sanitized/lldb-build/./lib --inferior-env ASAN_OPTIONS=detect_stack_use_after_return=1 --inferior-env DYLD_INSERT_LIBRARIES=/Users/buildslave/jenkins/workspace/lldb-cmake-sanitized/host-compiler/lib/clang/11.0.0/lib/darwin/libclang_rt.asan_osx_dynamic.dylib --build-dir /Users/buildslave/jenkins/workspace/lldb-cmake-sanitized/lldb-build/lldb-test-build.noindex --lldb-module-cache-dir /Users/buildslave/jenkins/workspace/lldb-cmake-sanitized/lldb-build/lldb-test-build.noindex/module-cache-lldb/lldb-api --clang-module-cache-dir /Users/buildslave/jenkins/workspace/lldb-cmake-sanitized/lldb-build/lldb-test-build.noindex/module-cache-clang/lldb-api --executable /Users/buildslave/jenkins/workspace/lldb-cmake-sanitized/lldb-build/./bin/lldb --compiler /Users/buildslave/jenkins/workspace/lldb-cmake-sanitized/lldb-build/./bin/clang --dsymutil /Users/buildslave/jenkins/workspace/lldb-cmake-sanitized/lldb-build/./bin/dsymutil --filecheck /Users/buildslave/jenkins/workspace/lldb-cmake-sanitized/lldb-build/./bin/FileCheck --lldb-libs-dir /Users/buildslave/jenkins/workspace/lldb-cmake-sanitized/lldb-build/./lib /Users/buildslave/jenkins/workspace/lldb-cmake-sanitized/llvm-project/lldb/test/API/functionalities/ptr_refs -p TestPtrRefs.py Change dir to: /Users/buildslave/jenkins/workspace/lldb-cmake-sanitized/llvm-project/lldb/test/API/functionalities/ptr_refs runCmd: settings clear -all output:

Hide Details

runCmd: settings set symbols.enable-external-lookup false output:

Hide Details

runCmd: settings set target.auto-apply-fixits false output:

Hide Details

runCmd: settings set plugin.process.gdb-remote.packet-timeout 60 output:

Hide Details

runCmd: settings set symbols.clang-modules-cache-path "/Users/buildslave/jenkins/workspace/lldb-cmake-sanitized/lldb-build/lldb-test-build.noindex/module-cache-lldb/lldb-api" output:

Hide Details

runCmd: settings set use-color false output:

Hide Details

runCmd: setting set target.prefer-dynamic-value no-dynamic-values output:

Hide Details

runCmd: settings set target.env-vars ASAN_OPTIONS=detect_stack_use_after_return=1 DYLD_INSERT_LIBRARIES=/Users/buildslave/jenkins/workspace/lldb-cmake-sanitized/host-compiler/lib/clang/11.0.0/lib/darwin/libclang_rt.asan_osx_dynamic.dylib output:

Hide Details

runCmd: script import lldb.macosx.heap output: "crashlog" and "save_crashlog" command installed, use the "--help" option for detailed help "malloc_info", "ptr_refs", "cstr_refs", "find_variable", and "objc_refs" commands have been installed, use the "--help" options on these commands for detailed help.

Hide Details

Hide Details

runCmd: ptr_refs my_ptr output: 0x00007ffee9dbc478: stack in frame #0 of thread #1: tid 0xe0049a in variable at 0x7ffee9dbc478: (const char *) my_ptr = 0x00006020000000b0 "hello" 0x00007ffee9dbc410: stack (red zone)

Hide Details

Hide Details

Expecting sub string: malloc Not matched

Hide Details

FAIL: LLDB (/Users/buildslave/jenkins/workspace/lldb-cmake-sanitized/lldb-build/bin/clang-11-x86_64) :: test_ptr_refs_dsym (TestPtrRefs.TestPtrRefs) <bound method SBProcess.Kill of <lldb.SBProcess; proxy of <Swig Object of type 'lldb::SBProcess *' at 0x1089a38a0> >>: success

Hide Details

runCmd: settings clear -all output:

Hide Details

runCmd: settings set symbols.enable-external-lookup false output:

Hide Details

runCmd: settings set target.auto-apply-fixits false output:

Hide Details

runCmd: settings set plugin.process.gdb-remote.packet-timeout 60 output:

Hide Details

runCmd: settings set symbols.clang-modules-cache-path "/Users/buildslave/jenkins/workspace/lldb-cmake-sanitized/lldb-build/lldb-test-build.noindex/module-cache-lldb/lldb-api" output:

Hide Details

runCmd: settings set use-color false output:

Hide Details

runCmd: setting set target.prefer-dynamic-value no-dynamic-values output:

Hide Details

runCmd: settings set target.env-vars ASAN_OPTIONS=detect_stack_use_after_return=1 DYLD_INSERT_LIBRARIES=/Users/buildslave/jenkins/workspace/lldb-cmake-sanitized/host-compiler/lib/clang/11.0.0/lib/darwin/libclang_rt.asan_osx_dynamic.dylib output:

Hide Details

runCmd: script import lldb.macosx.heap output:

Hide Details

runCmd: ptr_refs my_ptr runCmd failed! error: 'ptr_refs' is not a valid command.

Hide Details

Hide Details

XFAIL: LLDB (/Users/buildslave/jenkins/workspace/lldb-cmake-sanitized/lldb-build/bin/clang-11-x86_64) :: test_ptr_refs_dwarf (TestPtrRefs.TestPtrRefs) <bound method SBProcess.Kill of <lldb.SBProcess; proxy of <Swig Object of type 'lldb::SBProcess *' at 0x107d75990> >>: success

Hide Details

UNSUPPORTED: LLDB (/Users/buildslave/jenkins/workspace/lldb-cmake-sanitized/lldb-build/bin/clang-11-x86_64) :: test_ptr_refs_dwo (TestPtrRefs.TestPtrRefs) (test case does not fall in any category of interest for this run) runCmd: settings clear -all output:

Hide Details

runCmd: settings set symbols.enable-external-lookup false output:

Hide Details

runCmd: settings set target.auto-apply-fixits false output:

Hide Details

runCmd: settings set plugin.process.gdb-remote.packet-timeout 60 output:

Hide Details

runCmd: settings set symbols.clang-modules-cache-path "/Users/buildslave/jenkins/workspace/lldb-cmake-sanitized/lldb-build/lldb-test-build.noindex/module-cache-lldb/lldb-api" output:

Hide Details

runCmd: settings set use-color false output:

Hide Details

runCmd: setting set target.prefer-dynamic-value no-dynamic-values output:

Hide Details

runCmd: settings set target.env-vars ASAN_OPTIONS=detect_stack_use_after_return=1 DYLD_INSERT_LIBRARIES=/Users/buildslave/jenkins/workspace/lldb-cmake-sanitized/host-compiler/lib/clang/11.0.0/lib/darwin/libclang_rt.asan_osx_dynamic.dylib output:

Hide Details

runCmd: script import lldb.macosx.heap output:

Hide Details

runCmd: ptr_refs my_ptr runCmd failed! error: 'ptr_refs' is not a valid command.

Hide Details

Hide Details

XFAIL: LLDB (/Users/buildslave/jenkins/workspace/lldb-cmake-sanitized/lldb-build/bin/clang-11-x86_64) :: test_ptr_refs_gmodules (TestPtrRefs.TestPtrRefs) <bound method SBProcess.Kill of <lldb.SBProcess; proxy of <Swig Object of type 'lldb::SBProcess *' at 0x1089a31e0> >>: success

Hide Details

Restore dir to: /Users/buildslave/jenkins/workspace/lldb-cmake-sanitized/lldb-build/tools/lldb/test ====================================================================== FAIL: test_ptr_refs_dsym (TestPtrRefs.TestPtrRefs) Test format string functionality. ---------------------------------------------------------------------- Traceback (most recent call last): File "/Users/buildslave/jenkins/workspace/lldb-cmake-sanitized/llvm-project/lldb/packages/Python/lldbsuite/test/lldbtest.py", line 1751, in test_method return attrvalue(self) File "/Users/buildslave/jenkins/workspace/lldb-cmake-sanitized/llvm-project/lldb/packages/Python/lldbsuite/test/decorators.py", line 110, in wrapper func(*args, **kwargs) File "/Users/buildslave/jenkins/workspace/lldb-cmake-sanitized/llvm-project/lldb/test/API/functionalities/ptr_refs/TestPtrRefs.py", line 47, in test_ptr_refs self.expect("ptr_refs my_ptr", substrs=["malloc", "stack"]) File "/Users/buildslave/jenkins/workspace/lldb-cmake-sanitized/llvm-project/lldb/packages/Python/lldbsuite/test/lldbtest.py", line 2391, in expect if msg else EXP_MSG(str, output, exe)) AssertionError: False is not True : 'ptr_refs my_ptr' returns expected result, got '0x00007ffee9dbc478: stack in frame #0 of thread #1: tid 0xe0049a in variable at 0x7ffee9dbc478: (const char *) my_ptr = 0x00006020000000b0 "hello" 0x00007ffee9dbc410: stack (red zone)' Config=x86_64-/Users/buildslave/jenkins/workspace/lldb-cmake-sanitized/lldb-build/bin/clang-11 ---------------------------------------------------------------------- Ran 4 tests in 8.145s

Hide Details

RESULT: FAILED (0 passes, 1 failures, 0 errors, 1 skipped, 2 expected failures, 0 unexpected successes)

Hide Details

--

Hide Details

******************** UNSUPPORTED: lldb-api :: functionalities/asan/TestMemoryHistory.py (1562 of 1977) PASS: lldb-unit :: Utility/./UtilityTests/StreamTest.PutChar (1563 of 1977) PASS: lldb-unit :: Utility/./UtilityTests/ScalarTest.Scalar_512 (1564 of 1977) PASS: lldb-shell :: SymbolFile/DWARF/DW_OP_piece-smaller-than-struct.s (1565 of 1977) UNSUPPORTED: lldb-api :: functionalities/thread/create_during_step/TestCreateDuringStep.py (1566 of 1977) PASS: lldb-unit :: Process/gdb-remote/./ProcessGdbRemoteTests/GDBRemoteClientBaseTest.SendContinueAndInterrupt2PacketBug (1567 of 1977) PASS: lldb-api :: commands/register/register/register_command/TestRegisters.py (1568 of 1977) PASS: lldb-api :: lang/cpp/rvalue-references/TestRvalueReferences.py (1569 of 1977) PASS: lldb-unit :: Utility/./UtilityTests/StreamTest.ShiftOperatorPtr (1570 of 1977) PASS: lldb-api :: lang/c/bitfields/TestBitfields.py (1571 of 1977) PASS: lldb-api :: functionalities/load_unload/TestLoadUnload.py (1572 of 1977) PASS: lldb-unit :: Target/./TargetTests/ExecutionContextTest.GetByteOrderTarget (1573 of 1977) PASS: lldb-api :: macosx/thread_suspend/TestInternalThreadSuspension.py (1574 of 1977) PASS: lldb-api :: lang/objc/objc-struct-argument/TestObjCStructArgument.py (1575 of 1977) PASS: lldb-unit :: Host/./HostTests/SocketTest.DomainListenConnectAccept (1576 of 1977) PASS: lldb-unit :: Utility/./UtilityTests/RangeTest.Constructor (1577 of 1977) PASS: lldb-api :: commands/frame/diagnose/dereference-this/TestDiagnoseDereferenceThis.py (1578 of 1977) PASS: lldb-unit :: Utility/./UtilityTests/ArgsTest.TestMultipleArgs (1579 of 1977) PASS: lldb-shell :: ObjectFile/ELF/gnu-debuglink.yaml (1580 of 1977) UNSUPPORTED: lldb-api :: arm/breakpoint-thumb-codesection/TestBreakpointThumbCodesection.py (1581 of 1977) PASS: lldb-unit :: Utility/./UtilityTests/DataExtractorTest.PeekData (1582 of 1977) PASS: lldb-api :: functionalities/source-map/TestTargetSourceMap.py (1583 of 1977) PASS: lldb-api :: commands/expression/deleting-implicit-copy-constructor/TestDeletingImplicitCopyConstructor.py (1584 of 1977) PASS: lldb-shell :: ObjectFile/ELF/netbsd-exec-8.99.30-amd64.yaml (1585 of 1977) PASS: lldb-api :: functionalities/data-formatter/data-formatter-objc/cmtime/TestDataFormatterCMTime.py (1586 of 1977) PASS: lldb-shell :: Settings/TestSettingsWrite.test (1587 of 1977) PASS: lldb-api :: lang/cpp/llvm-style/TestLLVMStyle.py (1588 of 1977) PASS: lldb-unit :: ScriptInterpreter/Python/./ScriptInterpreterPythonTests/PythonDataObjectsTest.TestPythonByteArray (1589 of 1977) PASS: lldb-unit :: UnwindAssembly/x86/./UnwindAssemblyx86Tests/Testx86AssemblyInspectionEngine.TestSubESP (1590 of 1977) PASS: lldb-unit :: Process/gdb-remote/./ProcessGdbRemoteTests/GDBRemoteCommunicationClientTest.GetQOffsets (1591 of 1977) PASS: lldb-unit :: Utility/./UtilityTests/StringExtractorTest.DecodeHexU8_Underflow2 (1592 of 1977) PASS: lldb-api :: python_api/value_var_update/TestValueVarUpdate.py (1593 of 1977) PASS: lldb-unit :: Utility/./UtilityTests/StreamTest.PutHex64ByteOrderLittle (1594 of 1977) PASS: lldb-unit :: Process/minidump/./LLDBMinidumpTests/MinidumpParserTest.FindMemoryRangeWithFullMemoryMinidump (1595 of 1977) PASS: lldb-shell :: ObjectFile/PECOFF/basic-info-arm.yaml (1596 of 1977) PASS: lldb-api :: tools/lldb-server/TestGdbRemoteThreadsInStopReply.py (1597 of 1977) UNSUPPORTED: lldb-api :: python_api/event/TestEvents.py (1598 of 1977) PASS: lldb-api :: commands/expression/argument_passing_restrictions/TestArgumentPassingRestrictions.py (1599 of 1977) UNSUPPORTED: lldb-api :: functionalities/darwin_log/basic/TestDarwinLogBasic.py (1600 of 1977) PASS: lldb-unit :: ScriptInterpreter/Python/./ScriptInterpreterPythonTests/PythonDataObjectsTest.TestOwnedReferences (1601 of 1977) PASS: lldb-api :: functionalities/thread/exit_during_break/TestExitDuringBreak.py (1602 of 1977) PASS: lldb-api :: functionalities/breakpoint/auto_continue/TestBreakpointAutoContinue.py (1603 of 1977) PASS: lldb-shell :: ObjectFile/PECOFF/symbol.yaml (1604 of 1977) PASS: lldb-unit :: Utility/./UtilityTests/BinaryStreamTest.PutULEB128OneByte (1605 of 1977) PASS: lldb-unit :: Utility/./UtilityTests/RangeTest.SizeTypes (1606 of 1977) PASS: lldb-api :: lang/objc/foundation/TestObjCMethods.py (1607 of 1977) PASS: lldb-unit :: Utility/./UtilityTests/StringExtractorTest.GetHexBytesAvail_FullString (1608 of 1977) PASS: lldb-shell :: SymbolFile/NativePDB/function-types-classes.cpp (1609 of 1977) PASS: lldb-api :: commands/expression/import-std-module/stack/TestStackFromStdModule.py (1610 of 1977) UNSUPPORTED: lldb-api :: functionalities/ubsan/basic/TestUbsanBasic.py (1611 of 1977) PASS: lldb-api :: tools/lldb-server/TestGdbRemoteRegisterState.py (1612 of 1977) UNSUPPORTED: lldb-api :: commands/expression/call-restarts/TestCallThatRestarts.py (1613 of 1977) PASS: lldb-shell :: ObjectFile/ELF/duplicate-section.yaml (1614 of 1977) PASS: lldb-unit :: Expression/./ExpressionTests/DiagnosticManagerTest.GetStringMultiline (1615 of 1977) PASS: lldb-api :: functionalities/data-formatter/nsarraysynth/TestNSArraySynthetic.py (1616 of 1977) PASS: lldb-unit :: ScriptInterpreter/Python/./ScriptInterpreterPythonTests/PythonDataObjectsTest.TestRun (1617 of 1977) PASS: lldb-shell :: SymbolFile/Breakpad/unwind-via-raSearch.test (1618 of 1977) PASS: lldb-api :: lang/objc/foundation/TestObjCMethods2.py (1619 of 1977) PASS: lldb-api :: python_api/sbtype_typeclass/TestSBTypeTypeClass.py (1620 of 1977) PASS: lldb-api :: commands/watchpoints/watchpoint_on_vectors/TestValueOfVectorVariable.py (1621 of 1977) PASS: lldb-unit :: Utility/./UtilityTests/ConstStringTest.YAML (1622 of 1977) PASS: lldb-unit :: Core/./LLDBCoreTests/MangledTest.NameIndexes_FindFunctionSymbols (1623 of 1977) PASS: lldb-api :: lang/cpp/class-template-parameter-pack/TestClassTemplateParameterPack.py (1624 of 1977) PASS: lldb-unit :: Utility/./UtilityTests/StringExtractorTest.GetHexU8_Extra (1625 of 1977) PASS: lldb-api :: api/log/TestAPILog.py (1626 of 1977) PASS: lldb-unit :: Utility/./UtilityTests/StringExtractorTest.GetU64LittleEndian (1627 of 1977) PASS: lldb-unit :: Host/./HostTests/NativeProcessProtocolTest.SetBreakpointFailRead (1628 of 1977) PASS: lldb-unit :: Utility/./UtilityTests/StringExtractorTest.DecodeHexU8_Extra (1629 of 1977) PASS: lldb-api :: functionalities/data-formatter/language_category_updates/TestDataFormatterLanguageCategoryUpdates.py (1630 of 1977) PASS: lldb-unit :: Host/./HostTests/FileSystemTest.Readable (1631 of 1977) PASS: lldb-unit :: UnwindAssembly/x86/./UnwindAssemblyx86Tests/Testx86AssemblyInspectionEngine.TestMovRSPtoRBP (1632 of 1977) PASS: lldb-api :: macosx/function-starts/TestFunctionStarts.py (1633 of 1977) PASS: lldb-api :: commands/expression/top-level/TestTopLevelExprs.py (1634 of 1977) PASS: lldb-unit :: Language/Highlighting/./HighlighterTests/HighlighterTest.ClangTrailingBackslashMissingNewLine (1635 of 1977) PASS: lldb-unit :: Utility/./UtilityTests/TimeoutTest.Format (1636 of 1977) PASS: lldb-unit :: Symbol/./SymbolTests/TestClangASTImporter.RecordLayout (1637 of 1977) PASS: lldb-unit :: Utility/./UtilityTests/LogTest.Register (1638 of 1977) PASS: lldb-api :: lang/objc/foundation/TestObjCMethodsString.py (1639 of 1977) PASS: lldb-api :: commands/apropos/with-process/TestAproposWithProcess.py (1640 of 1977) PASS: lldb-unit :: Utility/./UtilityTests/RecordReplayTest.InstrumentedBarRef (1641 of 1977) PASS: lldb-unit :: Utility/./UtilityTests/StringExtractorTest.DecodeHexU8_Underflow (1642 of 1977) PASS: lldb-api :: lang/c/const_variables/TestConstVariables.py (1643 of 1977) UNSUPPORTED: lldb-shell :: Register/x86-64-xmm16-write.test (1644 of 1977) PASS: lldb-api :: tools/lldb-server/TestGdbRemoteKill.py (1645 of 1977) PASS: lldb-unit :: ScriptInterpreter/Python/./ScriptInterpreterPythonTests/PythonDataObjectsTest.TestPythonDictionaryToStructuredDictionary (1646 of 1977) PASS: lldb-unit :: Utility/./UtilityTests/Flags.IsClear (1647 of 1977) PASS: lldb-unit :: Expression/./ExpressionTests/DiagnosticManagerTest.AppendMessageAttachToLastDiag (1648 of 1977) PASS: lldb-api :: tools/lldb-server/commandline/TestStubReverseConnect.py (1649 of 1977) PASS: lldb-api :: functionalities/breakpoint/breakpoint_language/TestBreakpointLanguage.py (1650 of 1977) PASS: lldb-api :: macosx/safe-to-func-call/TestSafeFuncCalls.py (1651 of 1977) UNSUPPORTED: lldb-shell :: SymbolFile/PDB/udt-layout.test (1652 of 1977) PASS: lldb-unit :: Utility/./UtilityTests/StatusTest.ErrorConversion (1653 of 1977) PASS: lldb-api :: functionalities/data-formatter/data-formatter-stl/libcxx/atomic/TestLibCxxAtomic.py (1654 of 1977) PASS: lldb-api :: commands/source/info/TestSourceInfo.py (1655 of 1977) PASS: lldb-unit :: Utility/./UtilityTests/EnvironmentTest.EnvpConversion (1656 of 1977) UNSUPPORTED: lldb-api :: functionalities/data-formatter/data-formatter-stl/libstdcpp/tuple/TestDataFormatterStdTuple.py (1657 of 1977) UNSUPPORTED: lldb-api :: commands/watchpoints/multi_watchpoint_slots/TestWatchpointMultipleSlots.py (1658 of 1977) PASS: lldb-unit :: Host/./HostTests/FileSystemTest.FileAndDirectoryComponents (1659 of 1977) PASS: lldb-unit :: Utility/./UtilityTests/SerializationRountripTest.SerializeDeserializeCStringArrayNullptrElem (1660 of 1977) PASS: lldb-api :: functionalities/thread/concurrent_events/TestConcurrentWatchpointDelayWatchpointOneBreakpoint.py (1661 of 1977) PASS: lldb-api :: functionalities/data-formatter/data-formatter-objc/nsindexpath/TestDataFormatterNSIndexPath.py (1662 of 1977) PASS: lldb-unit :: Utility/./UtilityTests/UriParserTest.Minimal (1663 of 1977) PASS: lldb-shell :: ObjectFile/ELF/section-types.yaml (1664 of 1977) PASS: lldb-api :: commands/expression/regression-access-function-template-in-record/TestRegressionAccessFunctionTemplateInRecord.py (1665 of 1977) PASS: lldb-unit :: Symbol/./SymbolTests/TestTypeSystemClang.TestGetTypeClassNested (1666 of 1977) PASS: lldb-api :: commands/target/dump-symtab-demangle/TestDumpSymtabDemangle.py (1667 of 1977) PASS: lldb-api :: tools/lldb-vscode/attach/TestVSCode_attach.py (1668 of 1977) PASS: lldb-unit :: UnwindAssembly/x86/./UnwindAssemblyx86Tests/Testx86AssemblyInspectionEngine.TestPopRBPWithREX (1669 of 1977) PASS: lldb-api :: functionalities/data-formatter/array_typedef/TestArrayTypedef.py (1670 of 1977) PASS: lldb-shell :: SymbolFile/DWARF/split-dwarf-multiple-cu.ll (1671 of 1977) PASS: lldb-shell :: ObjectFile/Breakpad/breakpad-identification.test (1672 of 1977) PASS: lldb-api :: macosx/indirect_symbol/TestIndirectSymbols.py (1673 of 1977) PASS: lldb-api :: lang/cpp/global_operators/TestCppGlobalOperators.py (1674 of 1977) PASS: lldb-unit :: Process/gdb-remote/./ProcessGdbRemoteTests/GDBRemoteCommunicationClientTest.SyncThreadState (1675 of 1977) PASS: lldb-api :: functionalities/inferior-crashing/recursive-inferior/TestRecursiveInferiorStep.py (1676 of 1977) PASS: lldb-unit :: Utility/./UtilityTests/RangeTest.EqualInvalid (1677 of 1977) PASS: lldb-api :: python_api/value/linked_list/TestValueAPILinkedList.py (1678 of 1977) PASS: lldb-unit :: ObjectFile/Breakpad/./ObjectFileBreakpadTests/StackCFIRecord.parse (1679 of 1977) PASS: lldb-shell :: Breakpoint/debug_rnglist_offset_pair.test (1680 of 1977) PASS: lldb-shell :: ObjectFile/PECOFF/basic-info-arm64.yaml (1681 of 1977) PASS: lldb-unit :: UnwindAssembly/x86/./UnwindAssemblyx86Tests/Testx86AssemblyInspectionEngine.TestStackRealignMSVC_i386 (1682 of 1977) PASS: lldb-api :: lang/objc/objc-stepping/TestObjCStepping.py (1683 of 1977) PASS: lldb-unit :: Utility/./UtilityTests/UriParserTest.SchemeHostSeparator3 (1684 of 1977) PASS: lldb-unit :: Utility/./UtilityTests/StreamTeeTest.GetStreamAtIndexOutOfBounds (1685 of 1977) PASS: lldb-shell :: SymbolFile/NativePDB/source-list.cpp (1686 of 1977) PASS: lldb-api :: functionalities/data-formatter/data-formatter-stl/libcxx/vector/TestDataFormatterLibcxxVector.py (1687 of 1977) PASS: lldb-api :: lang/cpp/inlines/TestInlines.py (1688 of 1977) UNSUPPORTED: lldb-shell :: Register/arm-gp-read.test (1689 of 1977) PASS: lldb-api :: functionalities/data-formatter/data-formatter-stl/libcxx/list/loop/TestDataFormatterLibcxxListLoop.py (1690 of 1977) UNSUPPORTED: lldb-shell :: Register/x86-64-zmm-write.test (1691 of 1977) PASS: lldb-api :: lang/c/forward/TestForwardDeclaration.py (1692 of 1977) PASS: lldb-api :: functionalities/thread/concurrent_events/TestConcurrentWatchBreak.py (1693 of 1977) PASS: lldb-api :: commands/platform/process/list/TestProcessList.py (1694 of 1977) PASS: lldb-api :: commands/expression/persistent_types/TestNestedPersistentTypes.py (1695 of 1977) PASS: lldb-unit :: Utility/./UtilityTests/FileSpecTest.EqualDotsWindows (1696 of 1977) PASS: lldb-unit :: Language/Highlighting/./HighlighterTests/HighlighterTest.DefaultHighlighterWithCursor (1697 of 1977) PASS: lldb-unit :: Expression/./ExpressionTests/DiagnosticManagerTest.GetStringPreserveOrder (1698 of 1977) UNSUPPORTED: lldb-shell :: SymbolFile/PDB/variables-locations.test (1699 of 1977) PASS: lldb-unit :: Utility/./UtilityTests/StringListTest.LongestCommonPrefixDuplicateElement (1700 of 1977) UNSUPPORTED: lldb-shell :: ScriptInterpreter/Lua/breakpoint_callback.test (1701 of 1977) PASS: lldb-api :: functionalities/data-formatter/data-formatter-objc/TestDataFormatterObjCPlain.py (1702 of 1977) PASS: lldb-api :: python_api/lldbutil/iter/TestLLDBIterator.py (1703 of 1977) PASS: lldb-unit :: Core/./LLDBCoreTests/MangledTest.ResultForBlockInvocation (1704 of 1977) PASS: lldb-unit :: Utility/./UtilityTests/NameMatchesTest.RegularExpression (1705 of 1977) PASS: lldb-api :: lang/objc/direct-dispatch-step/TestObjCDirectDispatchStepping.py (1706 of 1977) PASS: lldb-unit :: Utility/./UtilityTests/LogChannelEnabledTest.LogThread (1707 of 1977) UNSUPPORTED: lldb-shell :: Unwind/unwind-plan-dwarf-dump.test (1708 of 1977) PASS: lldb-shell :: ObjectFile/ELF/netbsd-core-amd64.test (1709 of 1977) PASS: lldb-unit :: UnwindAssembly/x86/./UnwindAssemblyx86Tests/Testx86AssemblyInspectionEngine.Test32bitFramelessBigStackFrame (1710 of 1977) PASS: lldb-api :: types/TestShortTypeExpr.py (1711 of 1977) PASS: lldb-api :: commands/expression/test/TestExprs.py (1712 of 1977) PASS: lldb-unit :: SymbolFile/NativePDB/./SymbolFileNativePDBTests/PDBFPOProgramToDWARFExpressionTests.InvalidAssignmentSingle (1713 of 1977) PASS: lldb-api :: functionalities/inferior-crashing/TestInferiorCrashingStep.py (1714 of 1977) UNSUPPORTED: lldb-api :: functionalities/darwin_log/filter/exact_match/activity-chain/TestDarwinLogFilterMatchActivityChain.py (1715 of 1977) PASS: lldb-unit :: Symbol/./SymbolTests/TestTypeSystemClang.TestDisplayNameEmpty (1716 of 1977) PASS: lldb-api :: types/TestFloatTypes.py (1717 of 1977) PASS: lldb-api :: commands/expression/options/TestExprOptions.py (1718 of 1977) PASS: lldb-unit :: Utility/./UtilityTests/ArgsTest.TestQuotedUnknownEscape (1719 of 1977) PASS: lldb-unit :: Utility/./UtilityTests/ArgsTest.TestArgv (1720 of 1977) PASS: lldb-api :: python_api/function_symbol/TestSymbolAPI.py (1721 of 1977) PASS: lldb-api :: lang/cpp/breakpoint_in_member_func_w_non_primitive_params/TestBreakpointInMemberFuncWNonPrimitiveParams.py (1722 of 1977) PASS: lldb-api :: functionalities/signal/handle-abrt/TestHandleAbort.py (1723 of 1977) PASS: lldb-unit :: Utility/./UtilityTests/OptionsWithRawTest.EmptyInput (1724 of 1977) PASS: lldb-shell :: ObjectFile/wasm/stripped-debug-sections.yaml (1725 of 1977) PASS: lldb-api :: sample_test/TestSampleTest.py (1726 of 1977) PASS: lldb-shell :: Reproducer/TestPythonImport.test (1727 of 1977) PASS: lldb-api :: commands/target/stop-hooks/TestStopHooks.py (1728 of 1977) PASS: lldb-api :: lang/cpp/unsigned_types/TestUnsignedTypes.py (1729 of 1977) PASS: lldb-unit :: Utility/./UtilityTests/StreamTest.PutRawBytesToLittleEndian (1730 of 1977) UNSUPPORTED: lldb-api :: benchmarks/expression/TestExpressionCmd.py (1731 of 1977) PASS: lldb-unit :: Utility/./UtilityTests/BinaryStreamTest.PutSLEB128ThreeBytes (1732 of 1977) PASS: lldb-shell :: SymbolFile/DWARF/debug_aranges-empty-section.s (1733 of 1977) UNSUPPORTED: lldb-api :: tools/lldb-server/TestGdbRemoteAuxvSupport.py (1734 of 1977) PASS: lldb-unit :: Utility/./UtilityTests/StringListTest.SplitIntoLinesSingleTrailingCR (1735 of 1977) PASS: lldb-api :: commands/expression/no-deadlock/TestExprDoesntBlock.py (1736 of 1977) PASS: lldb-api :: functionalities/gdb_remote_client/TestGDBRemoteLoad.py (1737 of 1977) PASS: lldb-api :: lang/cpp/const_this/TestConstThis.py (1738 of 1977) PASS: lldb-unit :: Utility/./UtilityTests/DataExtractorTest.GetMaxS64 (1739 of 1977) PASS: lldb-api :: lang/c/set_values/TestSetValues.py (1740 of 1977) PASS: lldb-unit :: Utility/./UtilityTests/StringExtractorTest.GetHexBytes_FullString (1741 of 1977) UNSUPPORTED: lldb-api :: benchmarks/startup/TestStartupDelays.py (1742 of 1977) PASS: lldb-unit :: Utility/./UtilityTests/ProcessInstanceInfo.Dump (1743 of 1977) PASS: lldb-unit :: Symbol/./SymbolTests/TestTypeSystemClang.TestIsClangType (1744 of 1977) PASS: lldb-api :: types/TestCharTypeExpr.py (1745 of 1977) PASS: lldb-api :: commands/expression/import-std-module/unique_ptr/TestUniquePtrFromStdModule.py (1746 of 1977) PASS: lldb-unit :: Utility/./UtilityTests/FileSpecTest.OperatorBool (1747 of 1977) PASS: lldb-shell :: SymbolFile/DWARF/dir-separator-windows.s (1748 of 1977) PASS: lldb-unit :: Utility/./UtilityTests/VMRange.ContainsRange (1749 of 1977) PASS: lldb-unit :: Utility/./UtilityTests/StringExtractorTest.GetHexBytes_OddPair (1750 of 1977) PASS: lldb-api :: commands/add-dsym/uuid/TestAddDsymCommand.py (1751 of 1977) PASS: lldb-api :: functionalities/thread/concurrent_events/TestConcurrentDelaySignalBreak.py (1752 of 1977) PASS: lldb-shell :: SymbolFile/symbol-binding.test (1753 of 1977) PASS: lldb-shell :: SymbolFile/DWARF/dir-separator-no-comp-dir-relative-name.s (1754 of 1977) PASS: lldb-unit :: Utility/./UtilityTests/ProcessInfoTest.Constructor (1755 of 1977) PASS: lldb-unit :: Utility/./UtilityTests/StringLexerTest.GetUnlexed (1756 of 1977) PASS: lldb-api :: lang/c/offsetof/TestOffsetof.py (1757 of 1977) PASS: lldb-unit :: debugserver/./debugserverTests/RNBSocket.LoopBackListenIPv6 (1758 of 1977) PASS: lldb-api :: functionalities/process_crash_info/TestProcessCrashInfo.py (1759 of 1977) PASS: lldb-shell :: Settings/TestDisassemblyFormat.test (1760 of 1977) PASS: lldb-unit :: Utility/./UtilityTests/RegisterValueTest.GetSet8 (1761 of 1977) PASS: lldb-unit :: Utility/./UtilityTests/StreamTest.PutMaxHex64ByteOrderLittle (1762 of 1977) PASS: lldb-unit :: Host/./HostTests/File.GetStreamFromDescriptor (1763 of 1977) UNSUPPORTED: lldb-api :: functionalities/param_entry_vals/basic_entry_values_x86_64/TestBasicEntryValuesX86_64.py (1764 of 1977) UNSUPPORTED: lldb-shell :: SymbolFile/dissassemble-entry-point.s (1765 of 1977) UNSUPPORTED: lldb-shell :: Register/x86-64-xmm16-read.test (1766 of 1977) PASS: lldb-api :: lang/cpp/class_static/TestStaticVariables.py (1767 of 1977) PASS: lldb-api :: functionalities/breakpoint/cpp/TestCPPBreakpointLocations.py (1768 of 1977) PASS: lldb-unit :: Utility/./UtilityTests/TildeExpressionResolver.ResolveFullPath (1769 of 1977) PASS: lldb-unit :: ScriptInterpreter/Python/./ScriptInterpreterPythonTests/PythonDataObjectsTest.TestModuleNameResolutionNoDot (1770 of 1977) UNSUPPORTED: lldb-shell :: SymbolFile/PDB/ast-restore.test (1771 of 1977) PASS: lldb-api :: functionalities/data-formatter/data-formatter-stl/libcxx/multimap/TestDataFormatterLibccMultiMap.py (1772 of 1977) UNSUPPORTED: lldb-shell :: ScriptInterpreter/Lua/bindings.test (1773 of 1977) PASS: lldb-unit :: Utility/./UtilityTests/BinaryStreamTest.PutSLEB128OneByte (1774 of 1977) PASS: lldb-unit :: Utility/./UtilityTests/ArgsTest.DoubleQuotedItem (1775 of 1977) UNSUPPORTED: lldb-api :: lang/objc/foundation/TestFoundationDisassembly.py (1776 of 1977) PASS: lldb-api :: types/TestDoubleTypes.py (1777 of 1977) PASS: lldb-api :: functionalities/breakpoint/breakpoint_options/TestBreakpointOptions.py (1778 of 1977) PASS: lldb-unit :: Utility/./UtilityTests/AnsiTerminal.AtEnd (1779 of 1977) PASS: lldb-api :: commands/expression/dont_allow_jit/TestAllowJIT.py (1780 of 1977) PASS: lldb-unit :: Process/minidump/./LLDBMinidumpTests/MinidumpParserTest.GetMemoryRegionInfo (1781 of 1977) PASS: lldb-unit :: Utility/./UtilityTests/CompletionRequest.FakeLastArg (1782 of 1977) PASS: lldb-api :: commands/disassemble/basic/TestDisassembleBreakpoint.py (1783 of 1977) PASS: lldb-unit :: Core/./LLDBCoreTests/MangledTest.ResultForValidName (1784 of 1977) PASS: lldb-unit :: Process/gdb-remote/./ProcessGdbRemoteTests/GDBRemoteCommunicationClientTest.WriteRegister (1785 of 1977) PASS: lldb-shell :: Reproducer/Functionalities/TestExpressionEvaluation.test (1786 of 1977) PASS: lldb-api :: lang/objc/objc-foundation-dictionary-empty/TestNSDictionary0.py (1787 of 1977) PASS: lldb-shell :: Commands/CommandScriptImmediateOutput/CommandScriptImmediateOutputFile.test (1788 of 1977) UNSUPPORTED: lldb-api :: terminal/TestEditline.py (1789 of 1977) PASS: lldb-api :: sanity/TestModuleCacheSanity.py (1790 of 1977) PASS: lldb-unit :: Utility/./UtilityTests/Flags.AnySet (1791 of 1977) PASS: lldb-api :: commands/expression/issue_11588/Test11588.py (1792 of 1977) PASS: lldb-api :: lang/c/find_struct_type/TestFindStructTypes.py (1793 of 1977) PASS: lldb-unit :: Process/gdb-remote/./ProcessGdbRemoteTests/GDBRemoteClientBaseTest.SendContinueDelegateStructuredDataReceipt (1794 of 1977) PASS: lldb-unit :: UnwindAssembly/x86/./UnwindAssemblyx86Tests/Testx86AssemblyInspectionEngine.TestSimple64bitFrameFunction (1795 of 1977) PASS: lldb-api :: python_api/frame/TestFrames.py (1796 of 1977) PASS: lldb-api :: lang/cpp/thread_local/TestThreadLocal.py (1797 of 1977) UNSUPPORTED: lldb-api :: android/platform/TestDefaultCacheLineSize.py (1798 of 1977) PASS: lldb-unit :: Utility/./UtilityTests/StreamTeeTest.SetStreamAtIndexOverwrite (1799 of 1977) PASS: lldb-unit :: Utility/./UtilityTests/ConstStringTest.UpdateMangledCounterpart (1800 of 1977) PASS: lldb-unit :: Interpreter/./InterpreterTests/OptionArgParserTest.toBoolean (1801 of 1977) PASS: lldb-api :: functionalities/thread/step_until/TestStepUntil.py (1802 of 1977) PASS: lldb-api :: functionalities/data-formatter/data-formatter-stl/libcxx/iterator/TestDataFormatterLibccIterator.py (1803 of 1977) UNSUPPORTED: lldb-shell :: Register/x86-64-gp-write.test (1804 of 1977) PASS: lldb-unit :: Symbol/./SymbolTests/LineEntryTest.GetSameLineContiguousAddressRangeNestedInline (1805 of 1977) PASS: lldb-api :: functionalities/inferior-crashing/TestInferiorCrashing.py (1806 of 1977) PASS: lldb-unit :: Core/./LLDBCoreTests/StreamCallbackTest.Callback (1807 of 1977) PASS: lldb-api :: commands/command/source/TestCommandSource.py (1808 of 1977) PASS: lldb-api :: functionalities/thread/concurrent_events/TestConcurrentDelayedCrashWithBreakpointWatchpoint.py (1809 of 1977) PASS: lldb-unit :: Utility/./UtilityTests/StringListTest.PopBack (1810 of 1977) PASS: lldb-unit :: Utility/./UtilityTests/StringExtractorTest.GetHexBytesAvail_OddPair2 (1811 of 1977) PASS: lldb-unit :: Signals/./SignalsTests/UnixSignalsTest.GetFilteredSignals (1812 of 1977) PASS: lldb-unit :: Utility/./UtilityTests/StringListTest.SplitIntoLines (1813 of 1977) PASS: lldb-unit :: UnwindAssembly/x86/./UnwindAssemblyx86Tests/Testx86AssemblyInspectionEngine.TestPushR15 (1814 of 1977) PASS: lldb-api :: commands/expression/ir-interpreter/TestIRInterpreter.py (1815 of 1977) PASS: lldb-api :: macosx/lc-note/kern-ver-str/TestKernVerStrLCNOTE.py (1816 of 1977) PASS: lldb-shell :: Minidump/Windows/find-module.test (1817 of 1977) UNSUPPORTED: lldb-shell :: ObjectFile/ELF/minidebuginfo-no-lzma.yaml (1818 of 1977) PASS: lldb-api :: functionalities/inline-stepping/TestInlineStepping.py (1819 of 1977) PASS: lldb-unit :: Core/./LLDBCoreTests/RichManglingContextTest.FromCxxMethodName (1820 of 1977) PASS: lldb-unit :: Process/minidump/./LLDBMinidumpTests/MinidumpParserTest.MinidumpDuplicateModuleMinAddress (1821 of 1977) PASS: lldb-unit :: Process/minidump/./LLDBMinidumpTests/RegisterContextMinidump.ConvertMinidumpContext_x86_32 (1822 of 1977) UNSUPPORTED: lldb-api :: functionalities/unwind/ehframe/TestEhFrameUnwind.py (1823 of 1977) PASS: lldb-unit :: Utility/./UtilityTests/StringListTest.AppendStringMove (1824 of 1977) PASS: lldb-unit :: Utility/./UtilityTests/StringExtractorTest.GetHexU8_Extra_NoEof (1825 of 1977) PASS: lldb-unit :: Symbol/./SymbolTests/TestClangASTImporter.CompleteFwdDeclWithOtherOrigin (1826 of 1977) PASS: lldb-unit :: Utility/./UtilityTests/CompletionRequest.TestCompletionOwnership (1827 of 1977) PASS: lldb-unit :: Utility/./UtilityTests/TimerTest.CategoryTimesStats (1828 of 1977) PASS: lldb-api :: python_api/interpreter/TestRunCommandInterpreterAPI.py (1829 of 1977) PASS: lldb-unit :: Utility/./UtilityTests/StringListTest.SetSize (1830 of 1977) PASS: lldb-api :: functionalities/data-formatter/setvaluefromcstring/TestSetValueFromCString.py (1831 of 1977) PASS: lldb-unit :: Utility/./UtilityTests/ScalarTest.RightShiftOperator (1832 of 1977) PASS: lldb-shell :: Expr/TestIRMemoryMap.test (1833 of 1977) UNSUPPORTED: lldb-api :: commands/expression/multiline-completion/TestMultilineCompletion.py (1834 of 1977) UNSUPPORTED: lldb-api :: functionalities/asan/TestReportData.py (1835 of 1977) PASS: lldb-api :: python_api/interpreter/TestCommandInterpreterAPI.py (1836 of 1977) PASS: lldb-unit :: ScriptInterpreter/Python/./ScriptInterpreterPythonTests/PythonDataObjectsTest.TestPythonDictionaryManipulation (1837 of 1977) FAIL: lldb-api :: python_api/thread/TestThreadAPI.py (1838 of 1977) ******************** TEST 'lldb-api :: python_api/thread/TestThreadAPI.py' FAILED ******************** Script: -- /usr/local/bin/python /Users/buildslave/jenkins/workspace/lldb-cmake-sanitized/llvm-project/lldb/test/API/dotest.py --arch x86_64 -s /Users/buildslave/jenkins/workspace/lldb-cmake-sanitized/lldb-build/lldb-test-traces -S nm -u CXXFLAGS -u CFLAGS --codesign-identity lldb_codesign --server /Users/buildslave/jenkins/workspace/lldb-cmake-sanitized/lldb-build/./bin/debugserver --arch x86_64 --build-dir /Users/buildslave/jenkins/workspace/lldb-cmake-sanitized/lldb-build/lldb-test-build.noindex -s=/Users/buildslave/jenkins/workspace/lldb-cmake-sanitized/test/logs -t --env TERM=vt100 --env LLVM_LIBS_DIR=/Users/buildslave/jenkins/workspace/lldb-cmake-sanitized/lldb-build/./lib --inferior-env ASAN_OPTIONS=detect_stack_use_after_return=1 --inferior-env DYLD_INSERT_LIBRARIES=/Users/buildslave/jenkins/workspace/lldb-cmake-sanitized/host-compiler/lib/clang/11.0.0/lib/darwin/libclang_rt.asan_osx_dynamic.dylib --build-dir /Users/buildslave/jenkins/workspace/lldb-cmake-sanitized/lldb-build/lldb-test-build.noindex --lldb-module-cache-dir /Users/buildslave/jenkins/workspace/lldb-cmake-sanitized/lldb-build/lldb-test-build.noindex/module-cache-lldb/lldb-api --clang-module-cache-dir /Users/buildslave/jenkins/workspace/lldb-cmake-sanitized/lldb-build/lldb-test-build.noindex/module-cache-clang/lldb-api --executable /Users/buildslave/jenkins/workspace/lldb-cmake-sanitized/lldb-build/./bin/lldb --compiler /Users/buildslave/jenkins/workspace/lldb-cmake-sanitized/lldb-build/./bin/clang --dsymutil /Users/buildslave/jenkins/workspace/lldb-cmake-sanitized/lldb-build/./bin/dsymutil --filecheck /Users/buildslave/jenkins/workspace/lldb-cmake-sanitized/lldb-build/./bin/FileCheck --lldb-libs-dir /Users/buildslave/jenkins/workspace/lldb-cmake-sanitized/lldb-build/./lib /Users/buildslave/jenkins/workspace/lldb-cmake-sanitized/llvm-project/lldb/test/API/python_api/thread -p TestThreadAPI.py -- Exit Code: 1

Hide Details

Command Output (stdout): -- lldb version 11.0.99 clang revision 4bf015c035e4e5b63c7222dfb15ff274a5ed905c llvm revision 4bf015c035e4e5b63c7222dfb15ff274a5ed905c LLDB library dir: /Users/buildslave/jenkins/workspace/lldb-cmake-sanitized/lldb-build/bin LLDB import library dir: /Users/buildslave/jenkins/workspace/lldb-cmake-sanitized/lldb-build/./lib libstdcxx tests will not be run because: Don't know how to build with libstdcxx on macosx Skipping following debug info categories: ['dwo'] start addr: 0x108e0de66 end addr: 0x108e0de70 start addr: 0x10c537e66 end addr: 0x10c537e70 start addr: 0x10e1dae66 end addr: 0x10e1dae70

Hide Details

-- Command Output (stderr): --

Hide Details

Session logs for test failures/errors/unexpected successes will go into directory '/Users/buildslave/jenkins/workspace/lldb-cmake-sanitized/test/logs' Command invoked: /Users/buildslave/jenkins/workspace/lldb-cmake-sanitized/llvm-project/lldb/test/API/dotest.py --arch x86_64 -s /Users/buildslave/jenkins/workspace/lldb-cmake-sanitized/lldb-build/lldb-test-traces -S nm -u CXXFLAGS -u CFLAGS --codesign-identity lldb_codesign --server /Users/buildslave/jenkins/workspace/lldb-cmake-sanitized/lldb-build/./bin/debugserver --arch x86_64 --build-dir /Users/buildslave/jenkins/workspace/lldb-cmake-sanitized/lldb-build/lldb-test-build.noindex -s=/Users/buildslave/jenkins/workspace/lldb-cmake-sanitized/test/logs -t --env TERM=vt100 --env LLVM_LIBS_DIR=/Users/buildslave/jenkins/workspace/lldb-cmake-sanitized/lldb-build/./lib --inferior-env ASAN_OPTIONS=detect_stack_use_after_return=1 --inferior-env DYLD_INSERT_LIBRARIES=/Users/buildslave/jenkins/workspace/lldb-cmake-sanitized/host-compiler/lib/clang/11.0.0/lib/darwin/libclang_rt.asan_osx_dynamic.dylib --build-dir /Users/buildslave/jenkins/workspace/lldb-cmake-sanitized/lldb-build/lldb-test-build.noindex --lldb-module-cache-dir /Users/buildslave/jenkins/workspace/lldb-cmake-sanitized/lldb-build/lldb-test-build.noindex/module-cache-lldb/lldb-api --clang-module-cache-dir /Users/buildslave/jenkins/workspace/lldb-cmake-sanitized/lldb-build/lldb-test-build.noindex/module-cache-clang/lldb-api --executable /Users/buildslave/jenkins/workspace/lldb-cmake-sanitized/lldb-build/./bin/lldb --compiler /Users/buildslave/jenkins/workspace/lldb-cmake-sanitized/lldb-build/./bin/clang --dsymutil /Users/buildslave/jenkins/workspace/lldb-cmake-sanitized/lldb-build/./bin/dsymutil --filecheck /Users/buildslave/jenkins/workspace/lldb-cmake-sanitized/lldb-build/./bin/FileCheck --lldb-libs-dir /Users/buildslave/jenkins/workspace/lldb-cmake-sanitized/lldb-build/./lib /Users/buildslave/jenkins/workspace/lldb-cmake-sanitized/llvm-project/lldb/test/API/python_api/thread -p TestThreadAPI.py Change dir to: /Users/buildslave/jenkins/workspace/lldb-cmake-sanitized/llvm-project/lldb/test/API/python_api/thread runCmd: settings clear -all output:

Hide Details

runCmd: settings set symbols.enable-external-lookup false output:

Hide Details

runCmd: settings set target.auto-apply-fixits false output:

Hide Details

runCmd: settings set plugin.process.gdb-remote.packet-timeout 60 output:

Hide Details

runCmd: settings set symbols.clang-modules-cache-path "/Users/buildslave/jenkins/workspace/lldb-cmake-sanitized/lldb-build/lldb-test-build.noindex/module-cache-lldb/lldb-api" output:

Hide Details

runCmd: settings set use-color false output:

Hide Details

runCmd: setting set target.prefer-dynamic-value no-dynamic-values output:

Hide Details

runCmd: settings set target.env-vars ASAN_OPTIONS=detect_stack_use_after_return=1 DYLD_INSERT_LIBRARIES=/Users/buildslave/jenkins/workspace/lldb-cmake-sanitized/host-compiler/lib/clang/11.0.0/lib/darwin/libclang_rt.asan_osx_dynamic.dylib output:

Hide Details

runCmd: breakpoint list output: Current breakpoints: 1: file = 'main.cpp', line = 17, exact_match = 0, locations = 1 1.1: where = a.out`main + 115 at main.cpp:17:5, address = a.out[0x0000000100000f53], unresolved, hit count = 0

Hide Details

Hide Details

Hide Details

runCmd: process status output: Process 28913 stopped * thread #1, queue = 'com.apple.main-thread', stop reason = breakpoint 1.1 frame #0: 0x0000000109688f53 a.out`main(argc=1, argv=0x00007ffee65774c8) at main.cpp:17:5 14 15 printf("after the loop: my_char='%c'\n", my_char); // 'my_char' should print out as 'x'. 16 -> 17 return 0; // Set break point at this line and check variable 'my_char'. ^ 18 }

Hide Details

Hide Details

<bound method SBProcess.Kill of <lldb.SBProcess; proxy of <Swig Object of type 'lldb::SBProcess *' at 0x11dc98ab0> >>: success

Hide Details

PASS: LLDB (/Users/buildslave/jenkins/workspace/lldb-cmake-sanitized/lldb-build/bin/clang-11-x86_64) :: test_get_process_dsym (TestThreadAPI.ThreadAPITestCase) runCmd: settings clear -all output:

Hide Details

runCmd: settings set symbols.enable-external-lookup false output:

Hide Details

runCmd: settings set target.auto-apply-fixits false output:

Hide Details

runCmd: settings set plugin.process.gdb-remote.packet-timeout 60 output:

Hide Details

runCmd: settings set symbols.clang-modules-cache-path "/Users/buildslave/jenkins/workspace/lldb-cmake-sanitized/lldb-build/lldb-test-build.noindex/module-cache-lldb/lldb-api" output:

Hide Details

runCmd: settings set use-color false output:

Hide Details

runCmd: setting set target.prefer-dynamic-value no-dynamic-values output:

Hide Details

runCmd: settings set target.env-vars ASAN_OPTIONS=detect_stack_use_after_return=1 DYLD_INSERT_LIBRARIES=/Users/buildslave/jenkins/workspace/lldb-cmake-sanitized/host-compiler/lib/clang/11.0.0/lib/darwin/libclang_rt.asan_osx_dynamic.dylib output:

Hide Details

runCmd: breakpoint list output: Current breakpoints: 1: file = 'main.cpp', line = 17, exact_match = 0, locations = 1 1.1: where = a.out`main + 115 at main.cpp:17:5, address = a.out[0x0000000100000f53], unresolved, hit count = 0

Hide Details

Hide Details

Hide Details

runCmd: process status output: Process 29032 stopped * thread #1, queue = 'com.apple.main-thread', stop reason = breakpoint 1.1 frame #0: 0x00000001078b6f53 a.out`main(argc=1, argv=0x00007ffee8349498) at main.cpp:17:5 14 15 printf("after the loop: my_char='%c'\n", my_char); // 'my_char' should print out as 'x'. 16 -> 17 return 0; // Set break point at this line and check variable 'my_char'. ^ 18 }

Hide Details

Hide Details

<bound method SBProcess.Kill of <lldb.SBProcess; proxy of <Swig Object of type 'lldb::SBProcess *' at 0x1069cd990> >>: success

Hide Details

PASS: LLDB (/Users/buildslave/jenkins/workspace/lldb-cmake-sanitized/lldb-build/bin/clang-11-x86_64) :: test_get_process_dwarf (TestThreadAPI.ThreadAPITestCase) UNSUPPORTED: LLDB (/Users/buildslave/jenkins/workspace/lldb-cmake-sanitized/lldb-build/bin/clang-11-x86_64) :: test_get_process_dwo (TestThreadAPI.ThreadAPITestCase) (test case does not fall in any category of interest for this run) runCmd: settings clear -all output:

Hide Details

runCmd: settings set symbols.enable-external-lookup false output:

Hide Details

runCmd: settings set target.auto-apply-fixits false output:

Hide Details

runCmd: settings set plugin.process.gdb-remote.packet-timeout 60 output:

Hide Details

runCmd: settings set symbols.clang-modules-cache-path "/Users/buildslave/jenkins/workspace/lldb-cmake-sanitized/lldb-build/lldb-test-build.noindex/module-cache-lldb/lldb-api" output:

Hide Details

runCmd: settings set use-color false output:

Hide Details

runCmd: setting set target.prefer-dynamic-value no-dynamic-values output:

Hide Details

runCmd: settings set target.env-vars ASAN_OPTIONS=detect_stack_use_after_return=1 DYLD_INSERT_LIBRARIES=/Users/buildslave/jenkins/workspace/lldb-cmake-sanitized/host-compiler/lib/clang/11.0.0/lib/darwin/libclang_rt.asan_osx_dynamic.dylib output:

Hide Details

runCmd: breakpoint list output: Current breakpoints: 1: file = 'main.cpp', line = 17, exact_match = 0, locations = 1 1.1: where = a.out`main + 115 at main.cpp:17:5, address = a.out[0x0000000100000f53], unresolved, hit count = 0

Hide Details

Hide Details

Hide Details

runCmd: process status output: Process 29145 stopped * thread #1, queue = 'com.apple.main-thread', stop reason = breakpoint 1.1 frame #0: 0x0000000103761f53 a.out`main(argc=1, argv=0x00007ffeec49e498) at main.cpp:17:5 14 15 printf("after the loop: my_char='%c'\n", my_char); // 'my_char' should print out as 'x'. 16 -> 17 return 0; // Set break point at this line and check variable 'my_char'. ^ 18 }

Hide Details

Hide Details

<bound method SBProcess.Kill of <lldb.SBProcess; proxy of <Swig Object of type 'lldb::SBProcess *' at 0x11dc988d0> >>: success

Hide Details

PASS: LLDB (/Users/buildslave/jenkins/workspace/lldb-cmake-sanitized/lldb-build/bin/clang-11-x86_64) :: test_get_process_gmodules (TestThreadAPI.ThreadAPITestCase) runCmd: settings clear -all output:

Hide Details

runCmd: settings set symbols.enable-external-lookup false output:

Hide Details

runCmd: settings set target.auto-apply-fixits false output:

Hide Details

runCmd: settings set plugin.process.gdb-remote.packet-timeout 60 output:

Hide Details

runCmd: settings set symbols.clang-modules-cache-path "/Users/buildslave/jenkins/workspace/lldb-cmake-sanitized/lldb-build/lldb-test-build.noindex/module-cache-lldb/lldb-api" output:

Hide Details

runCmd: settings set use-color false output:

Hide Details

runCmd: setting set target.prefer-dynamic-value no-dynamic-values output:

Hide Details

runCmd: settings set target.env-vars ASAN_OPTIONS=detect_stack_use_after_return=1 DYLD_INSERT_LIBRARIES=/Users/buildslave/jenkins/workspace/lldb-cmake-sanitized/host-compiler/lib/clang/11.0.0/lib/darwin/libclang_rt.asan_osx_dynamic.dylib output:

Hide Details

<bound method SBProcess.Kill of <lldb.SBProcess; proxy of <Swig Object of type 'lldb::SBProcess *' at 0x1069cd960> >>: success

Hide Details

PASS: LLDB (/Users/buildslave/jenkins/workspace/lldb-cmake-sanitized/lldb-build/bin/clang-11-x86_64) :: test_get_stop_description_dsym (TestThreadAPI.ThreadAPITestCase) runCmd: settings clear -all output:

Hide Details

runCmd: settings set symbols.enable-external-lookup false output:

Hide Details

runCmd: settings set target.auto-apply-fixits false output:

Hide Details

runCmd: settings set plugin.process.gdb-remote.packet-timeout 60 output:

Hide Details

runCmd: settings set symbols.clang-modules-cache-path "/Users/buildslave/jenkins/workspace/lldb-cmake-sanitized/lldb-build/lldb-test-build.noindex/module-cache-lldb/lldb-api" output:

Hide Details

runCmd: settings set use-color false output:

Hide Details

runCmd: setting set target.prefer-dynamic-value no-dynamic-values output:

Hide Details

runCmd: settings set target.env-vars ASAN_OPTIONS=detect_stack_use_after_return=1 DYLD_INSERT_LIBRARIES=/Users/buildslave/jenkins/workspace/lldb-cmake-sanitized/host-compiler/lib/clang/11.0.0/lib/darwin/libclang_rt.asan_osx_dynamic.dylib output:

Hide Details

<bound method SBProcess.Kill of <lldb.SBProcess; proxy of <Swig Object of type 'lldb::SBProcess *' at 0x11d6b32d0> >>: success

Hide Details

PASS: LLDB (/Users/buildslave/jenkins/workspace/lldb-cmake-sanitized/lldb-build/bin/clang-11-x86_64) :: test_get_stop_description_dwarf (TestThreadAPI.ThreadAPITestCase) UNSUPPORTED: LLDB (/Users/buildslave/jenkins/workspace/lldb-cmake-sanitized/lldb-build/bin/clang-11-x86_64) :: test_get_stop_description_dwo (TestThreadAPI.ThreadAPITestCase) (test case does not fall in any category of interest for this run) runCmd: settings clear -all output:

Hide Details

runCmd: settings set symbols.enable-external-lookup false output:

Hide Details

runCmd: settings set target.auto-apply-fixits false output:

Hide Details

runCmd: settings set plugin.process.gdb-remote.packet-timeout 60 output:

Hide Details

runCmd: settings set symbols.clang-modules-cache-path "/Users/buildslave/jenkins/workspace/lldb-cmake-sanitized/lldb-build/lldb-test-build.noindex/module-cache-lldb/lldb-api" output:

Hide Details

runCmd: settings set use-color false output:

Hide Details

runCmd: setting set target.prefer-dynamic-value no-dynamic-values output:

Hide Details

runCmd: settings set target.env-vars ASAN_OPTIONS=detect_stack_use_after_return=1 DYLD_INSERT_LIBRARIES=/Users/buildslave/jenkins/workspace/lldb-cmake-sanitized/host-compiler/lib/clang/11.0.0/lib/darwin/libclang_rt.asan_osx_dynamic.dylib output:

Hide Details

<bound method SBProcess.Kill of <lldb.SBProcess; proxy of <Swig Object of type 'lldb::SBProcess *' at 0x1069cd990> >>: success

Hide Details

PASS: LLDB (/Users/buildslave/jenkins/workspace/lldb-cmake-sanitized/lldb-build/bin/clang-11-x86_64) :: test_get_stop_description_gmodules (TestThreadAPI.ThreadAPITestCase) runCmd: settings clear -all output:

Hide Details

runCmd: settings set symbols.enable-external-lookup false output:

Hide Details

runCmd: settings set target.auto-apply-fixits false output:

Hide Details

runCmd: settings set plugin.process.gdb-remote.packet-timeout 60 output:

Hide Details

runCmd: settings set symbols.clang-modules-cache-path "/Users/buildslave/jenkins/workspace/lldb-cmake-sanitized/lldb-build/lldb-test-build.noindex/module-cache-lldb/lldb-api" output:

Hide Details

runCmd: settings set use-color false output:

Hide Details

runCmd: setting set target.prefer-dynamic-value no-dynamic-values output:

Hide Details

runCmd: settings set target.env-vars ASAN_OPTIONS=detect_stack_use_after_return=1 DYLD_INSERT_LIBRARIES=/Users/buildslave/jenkins/workspace/lldb-cmake-sanitized/host-compiler/lib/clang/11.0.0/lib/darwin/libclang_rt.asan_osx_dynamic.dylib output:

Hide Details

runCmd: breakpoint list output: Current breakpoints: 1: file = 'main2.cpp', line = 21, exact_match = 0, locations = 1 1.1: where = test_run_to_address_dsym`b(int) + 22 at main2.cpp:21:17, address = test_run_to_address_dsym[0x0000000100000e66], unresolved, hit count = 0

Hide Details

Hide Details

Hide Details

runCmd: thread backtrace output: * thread #1, queue = 'com.apple.main-thread', stop reason = breakpoint 1.1 * frame #0: 0x0000000108e0de66 test_run_to_address_dsym`b(val=1) at main2.cpp:21:17 frame #1: 0x0000000108e0de0d test_run_to_address_dsym`a(val=1) at main2.cpp:11:16 frame #2: 0x0000000108e0dee0 test_run_to_address_dsym`main(argc=1, argv=0x00007ffee6df2470) at main2.cpp:36:14 frame #3: 0x00007fff742d5085 libdyld.dylib`start + 1

Hide Details

Hide Details

runCmd: breakpoint list output: Current breakpoints: 1: file = 'main2.cpp', line = 21, exact_match = 0, locations = 1 Options: disabled 1.1: where = test_run_to_address_dsym`b(int) + 22 at main2.cpp:21:17, address = 0x0000000108e0de66, unresolved, hit count = 1

Hide Details

Hide Details

Hide Details

runCmd: thread backtrace output: * thread #1, queue = 'com.apple.main-thread', stop reason = step over * frame #0: 0x0000000108e0de9d test_run_to_address_dsym`b(val=1) at main2.cpp:26:12 frame #1: 0x0000000108e0de0d test_run_to_address_dsym`a(val=1) at main2.cpp:11:16 frame #2: 0x0000000108e0dee0 test_run_to_address_dsym`main(argc=1, argv=0x00007ffee6df2470) at main2.cpp:36:14 frame #3: 0x00007fff742d5085 libdyld.dylib`start + 1

Hide Details

Hide Details

runCmd: process status output: Process 29631 stopped * thread #1, queue = 'com.apple.main-thread', stop reason = run to address: 0x0000000108e0de66 frame #0: 0x0000000108e0de66 test_run_to_address_dsym`b(val=2) at main2.cpp:21:17 18 int b(int val) 19 { 20 int rc = c(val); -> 21 void *ptr = malloc(1024); // thread step-out of malloc into function b. ^ 22 if (!ptr) 23 return -1; 24 else

Hide Details

Hide Details

<bound method SBProcess.Kill of <lldb.SBProcess; proxy of <Swig Object of type 'lldb::SBProcess *' at 0x11d4b3de0> >>: success

Hide Details

PASS: LLDB (/Users/buildslave/jenkins/workspace/lldb-cmake-sanitized/lldb-build/bin/clang-11-x86_64) :: test_run_to_address_dsym (TestThreadAPI.ThreadAPITestCase) runCmd: settings clear -all output:

Hide Details

runCmd: settings set symbols.enable-external-lookup false output:

Hide Details

runCmd: settings set target.auto-apply-fixits false output:

Hide Details

runCmd: settings set plugin.process.gdb-remote.packet-timeout 60 output:

Hide Details

runCmd: settings set symbols.clang-modules-cache-path "/Users/buildslave/jenkins/workspace/lldb-cmake-sanitized/lldb-build/lldb-test-build.noindex/module-cache-lldb/lldb-api" output:

Hide Details

runCmd: settings set use-color false output:

Hide Details

runCmd: setting set target.prefer-dynamic-value no-dynamic-values output:

Hide Details

runCmd: settings set target.env-vars ASAN_OPTIONS=detect_stack_use_after_return=1 DYLD_INSERT_LIBRARIES=/Users/buildslave/jenkins/workspace/lldb-cmake-sanitized/host-compiler/lib/clang/11.0.0/lib/darwin/libclang_rt.asan_osx_dynamic.dylib output:

Hide Details

runCmd: breakpoint list output: Current breakpoints: 1: file = 'main2.cpp', line = 21, exact_match = 0, locations = 1 1.1: where = test_run_to_address_dwarf`b(int) + 22 at main2.cpp:21:17, address = test_run_to_address_dwarf[0x0000000100000e66], unresolved, hit count = 0

Hide Details

Hide Details

Hide Details

runCmd: thread backtrace output: * thread #1, queue = 'com.apple.main-thread', stop reason = breakpoint 1.1 * frame #0: 0x000000010c537e66 test_run_to_address_dwarf`b(val=1) at main2.cpp:21:17 frame #1: 0x000000010c537e0d test_run_to_address_dwarf`a(val=1) at main2.cpp:11:16 frame #2: 0x000000010c537ee0 test_run_to_address_dwarf`main(argc=1, argv=0x00007ffee36c8470) at main2.cpp:36:14 frame #3: 0x00007fff742d5085 libdyld.dylib`start + 1

Hide Details

Hide Details

runCmd: breakpoint list output: Current breakpoints: 1: file = 'main2.cpp', line = 21, exact_match = 0, locations = 1 Options: disabled 1.1: where = test_run_to_address_dwarf`b(int) + 22 at main2.cpp:21:17, address = 0x000000010c537e66, unresolved, hit count = 1

Hide Details

Hide Details

Hide Details

runCmd: thread backtrace output: * thread #1, queue = 'com.apple.main-thread', stop reason = step over * frame #0: 0x000000010c537e9d test_run_to_address_dwarf`b(val=1) at main2.cpp:26:12 frame #1: 0x000000010c537e0d test_run_to_address_dwarf`a(val=1) at main2.cpp:11:16 frame #2: 0x000000010c537ee0 test_run_to_address_dwarf`main(argc=1, argv=0x00007ffee36c8470) at main2.cpp:36:14 frame #3: 0x00007fff742d5085 libdyld.dylib`start + 1

Hide Details

Hide Details

runCmd: process status output: Process 29732 stopped * thread #1, queue = 'com.apple.main-thread', stop reason = run to address: 0x000000010c537e66 frame #0: 0x000000010c537e66 test_run_to_address_dwarf`b(val=2) at main2.cpp:21:17 18 int b(int val) 19 { 20 int rc = c(val); -> 21 void *ptr = malloc(1024); // thread step-out of malloc into function b. ^ 22 if (!ptr) 23 return -1; 24 else

Hide Details

Hide Details

<bound method SBProcess.Kill of <lldb.SBProcess; proxy of <Swig Object of type 'lldb::SBProcess *' at 0x1069cd960> >>: success

Hide Details

PASS: LLDB (/Users/buildslave/jenkins/workspace/lldb-cmake-sanitized/lldb-build/bin/clang-11-x86_64) :: test_run_to_address_dwarf (TestThreadAPI.ThreadAPITestCase) UNSUPPORTED: LLDB (/Users/buildslave/jenkins/workspace/lldb-cmake-sanitized/lldb-build/bin/clang-11-x86_64) :: test_run_to_address_dwo (TestThreadAPI.ThreadAPITestCase) (test case does not fall in any category of interest for this run) runCmd: settings clear -all output:

Hide Details

runCmd: settings set symbols.enable-external-lookup false output:

Hide Details

runCmd: settings set target.auto-apply-fixits false output:

Hide Details

runCmd: settings set plugin.process.gdb-remote.packet-timeout 60 output:

Hide Details

runCmd: settings set symbols.clang-modules-cache-path "/Users/buildslave/jenkins/workspace/lldb-cmake-sanitized/lldb-build/lldb-test-build.noindex/module-cache-lldb/lldb-api" output:

Hide Details

runCmd: settings set use-color false output:

Hide Details

runCmd: setting set target.prefer-dynamic-value no-dynamic-values output:

Hide Details

runCmd: settings set target.env-vars ASAN_OPTIONS=detect_stack_use_after_return=1 DYLD_INSERT_LIBRARIES=/Users/buildslave/jenkins/workspace/lldb-cmake-sanitized/host-compiler/lib/clang/11.0.0/lib/darwin/libclang_rt.asan_osx_dynamic.dylib output:

Hide Details

runCmd: breakpoint list output: Current breakpoints: 1: file = 'main2.cpp', line = 21, exact_match = 0, locations = 1 1.1: where = test_run_to_address_gmodules`b(int) + 22 at main2.cpp:21:17, address = test_run_to_address_gmodules[0x0000000100000e66], unresolved, hit count = 0

Hide Details

Hide Details

Hide Details

runCmd: thread backtrace output: * thread #1, queue = 'com.apple.main-thread', stop reason = breakpoint 1.1 * frame #0: 0x000000010e1dae66 test_run_to_address_gmodules`b(val=1) at main2.cpp:21:17 frame #1: 0x000000010e1dae0d test_run_to_address_gmodules`a(val=1) at main2.cpp:11:16 frame #2: 0x000000010e1daee0 test_run_to_address_gmodules`main(argc=1, argv=0x00007ffee1a25460) at main2.cpp:36:14 frame #3: 0x00007fff742d5085 libdyld.dylib`start + 1

Hide Details

Hide Details

runCmd: breakpoint list output: Current breakpoints: 1: file = 'main2.cpp', line = 21, exact_match = 0, locations = 1 Options: disabled 1.1: where = test_run_to_address_gmodules`b(int) + 22 at main2.cpp:21:17, address = 0x000000010e1dae66, unresolved, hit count = 1

Hide Details

Hide Details

Hide Details

runCmd: thread backtrace output: * thread #1, queue = 'com.apple.main-thread', stop reason = step over * frame #0: 0x000000010e1dae9d test_run_to_address_gmodules`b(val=1) at main2.cpp:26:12 frame #1: 0x000000010e1dae0d test_run_to_address_gmodules`a(val=1) at main2.cpp:11:16 frame #2: 0x000000010e1daee0 test_run_to_address_gmodules`main(argc=1, argv=0x00007ffee1a25460) at main2.cpp:36:14 frame #3: 0x00007fff742d5085 libdyld.dylib`start + 1

Hide Details

Hide Details

runCmd: process status output: Process 29864 stopped * thread #1, queue = 'com.apple.main-thread', stop reason = run to address: 0x000000010e1dae66 frame #0: 0x000000010e1dae66 test_run_to_address_gmodules`b(val=2) at main2.cpp:21:17 18 int b(int val) 19 { 20 int rc = c(val); -> 21 void *ptr = malloc(1024); // thread step-out of malloc into function b. ^ 22 if (!ptr) 23 return -1; 24 else

Hide Details

Hide Details

<bound method SBProcess.Kill of <lldb.SBProcess; proxy of <Swig Object of type 'lldb::SBProcess *' at 0x11d6b32d0> >>: success

Hide Details

PASS: LLDB (/Users/buildslave/jenkins/workspace/lldb-cmake-sanitized/lldb-build/bin/clang-11-x86_64) :: test_run_to_address_gmodules (TestThreadAPI.ThreadAPITestCase) runCmd: settings clear -all output:

Hide Details

runCmd: settings set symbols.enable-external-lookup false output:

Hide Details

runCmd: settings set target.auto-apply-fixits false output:

Hide Details

runCmd: settings set plugin.process.gdb-remote.packet-timeout 60 output:

Hide Details

runCmd: settings set symbols.clang-modules-cache-path "/Users/buildslave/jenkins/workspace/lldb-cmake-sanitized/lldb-build/lldb-test-build.noindex/module-cache-lldb/lldb-api" output:

Hide Details

runCmd: settings set use-color false output:

Hide Details

runCmd: setting set target.prefer-dynamic-value no-dynamic-values output:

Hide Details

runCmd: settings set target.env-vars ASAN_OPTIONS=detect_stack_use_after_return=1 DYLD_INSERT_LIBRARIES=/Users/buildslave/jenkins/workspace/lldb-cmake-sanitized/host-compiler/lib/clang/11.0.0/lib/darwin/libclang_rt.asan_osx_dynamic.dylib output:

Hide Details

FAIL: LLDB (/Users/buildslave/jenkins/workspace/lldb-cmake-sanitized/lldb-build/bin/clang-11-x86_64) :: test_step_out_of_malloc_into_function_b_dsym (TestThreadAPI.ThreadAPITestCase) <bound method SBProcess.Kill of <lldb.SBProcess; proxy of <Swig Object of type 'lldb::SBProcess *' at 0x1069cd990> >>: success

Hide Details

runCmd: settings clear -all output:

Hide Details

runCmd: settings set symbols.enable-external-lookup false output:

Hide Details

runCmd: settings set target.auto-apply-fixits false output:

Hide Details

runCmd: settings set plugin.process.gdb-remote.packet-timeout 60 output:

Hide Details

runCmd: settings set symbols.clang-modules-cache-path "/Users/buildslave/jenkins/workspace/lldb-cmake-sanitized/lldb-build/lldb-test-build.noindex/module-cache-lldb/lldb-api" output:

Hide Details

runCmd: settings set use-color false output:

Hide Details

runCmd: setting set target.prefer-dynamic-value no-dynamic-values output:

Hide Details

runCmd: settings set target.env-vars ASAN_OPTIONS=detect_stack_use_after_return=1 DYLD_INSERT_LIBRARIES=/Users/buildslave/jenkins/workspace/lldb-cmake-sanitized/host-compiler/lib/clang/11.0.0/lib/darwin/libclang_rt.asan_osx_dynamic.dylib output:

Hide Details

FAIL: LLDB (/Users/buildslave/jenkins/workspace/lldb-cmake-sanitized/lldb-build/bin/clang-11-x86_64) :: test_step_out_of_malloc_into_function_b_dwarf (TestThreadAPI.ThreadAPITestCase) <bound method SBProcess.Kill of <lldb.SBProcess; proxy of <Swig Object of type 'lldb::SBProcess *' at 0x11d4b3de0> >>: success

Hide Details

UNSUPPORTED: LLDB (/Users/buildslave/jenkins/workspace/lldb-cmake-sanitized/lldb-build/bin/clang-11-x86_64) :: test_step_out_of_malloc_into_function_b_dwo (TestThreadAPI.ThreadAPITestCase) (test case does not fall in any category of interest for this run) runCmd: settings clear -all output:

Hide Details

runCmd: settings set symbols.enable-external-lookup false output:

Hide Details

runCmd: settings set target.auto-apply-fixits false output:

Hide Details

runCmd: settings set plugin.process.gdb-remote.packet-timeout 60 output:

Hide Details

runCmd: settings set symbols.clang-modules-cache-path "/Users/buildslave/jenkins/workspace/lldb-cmake-sanitized/lldb-build/lldb-test-build.noindex/module-cache-lldb/lldb-api" output:

Hide Details

runCmd: settings set use-color false output:

Hide Details

runCmd: setting set target.prefer-dynamic-value no-dynamic-values output:

Hide Details

runCmd: settings set target.env-vars ASAN_OPTIONS=detect_stack_use_after_return=1 DYLD_INSERT_LIBRARIES=/Users/buildslave/jenkins/workspace/lldb-cmake-sanitized/host-compiler/lib/clang/11.0.0/lib/darwin/libclang_rt.asan_osx_dynamic.dylib output:

Hide Details

FAIL: LLDB (/Users/buildslave/jenkins/workspace/lldb-cmake-sanitized/lldb-build/bin/clang-11-x86_64) :: test_step_out_of_malloc_into_function_b_gmodules (TestThreadAPI.ThreadAPITestCase) <bound method SBProcess.Kill of <lldb.SBProcess; proxy of <Swig Object of type 'lldb::SBProcess *' at 0x1069cd990> >>: success

Hide Details

runCmd: settings clear -all output:

Hide Details

runCmd: settings set symbols.enable-external-lookup false output:

Hide Details

runCmd: settings set target.auto-apply-fixits false output:

Hide Details

runCmd: settings set plugin.process.gdb-remote.packet-timeout 60 output:

Hide Details

runCmd: settings set symbols.clang-modules-cache-path "/Users/buildslave/jenkins/workspace/lldb-cmake-sanitized/lldb-build/lldb-test-build.noindex/module-cache-lldb/lldb-api" output:

Hide Details

runCmd: settings set use-color false output:

Hide Details

runCmd: setting set target.prefer-dynamic-value no-dynamic-values output:

Hide Details

runCmd: settings set target.env-vars ASAN_OPTIONS=detect_stack_use_after_return=1 DYLD_INSERT_LIBRARIES=/Users/buildslave/jenkins/workspace/lldb-cmake-sanitized/host-compiler/lib/clang/11.0.0/lib/darwin/libclang_rt.asan_osx_dynamic.dylib output:

Hide Details

runCmd: breakpoint list output: Current breakpoints: 1: file = 'main2.cpp', line = 21, exact_match = 0, locations = 1 1.1: where = test_step_over_3_times_dsym`b(int) + 22 at main2.cpp:21:17, address = test_step_over_3_times_dsym[0x0000000100000e66], unresolved, hit count = 0

Hide Details

Hide Details

Hide Details

runCmd: thread backtrace output: * thread #1, queue = 'com.apple.main-thread', stop reason = breakpoint 1.1 * frame #0: 0x000000010069de66 test_step_over_3_times_dsym`b(val=1) at main2.cpp:21:17 frame #1: 0x000000010069de0d test_step_over_3_times_dsym`a(val=1) at main2.cpp:11:16 frame #2: 0x000000010069dee0 test_step_over_3_times_dsym`main(argc=1, argv=0x00007ffeef562468) at main2.cpp:36:14 frame #3: 0x00007fff742d5085 libdyld.dylib`start + 1 frame #4: 0x00007fff742d5085 libdyld.dylib`start + 1

Hide Details

Hide Details

runCmd: thread backtrace output: * thread #1, queue = 'com.apple.main-thread', stop reason = step over * frame #0: 0x000000010069de9d test_step_over_3_times_dsym`b(val=1) at main2.cpp:26:12 frame #1: 0x000000010069de0d test_step_over_3_times_dsym`a(val=1) at main2.cpp:11:16 frame #2: 0x000000010069dee0 test_step_over_3_times_dsym`main(argc=1, argv=0x00007ffeef562468) at main2.cpp:36:14 frame #3: 0x00007fff742d5085 libdyld.dylib`start + 1 frame #4: 0x00007fff742d5085 libdyld.dylib`start + 1

Hide Details

Hide Details

<bound method SBProcess.Kill of <lldb.SBProcess; proxy of <Swig Object of type 'lldb::SBProcess *' at 0x11d4b3de0> >>: success

Hide Details

PASS: LLDB (/Users/buildslave/jenkins/workspace/lldb-cmake-sanitized/lldb-build/bin/clang-11-x86_64) :: test_step_over_3_times_dsym (TestThreadAPI.ThreadAPITestCase) runCmd: settings clear -all output:

Hide Details

runCmd: settings set symbols.enable-external-lookup false output:

Hide Details

runCmd: settings set target.auto-apply-fixits false output:

Hide Details

runCmd: settings set plugin.process.gdb-remote.packet-timeout 60 output:

Hide Details

runCmd: settings set symbols.clang-modules-cache-path "/Users/buildslave/jenkins/workspace/lldb-cmake-sanitized/lldb-build/lldb-test-build.noindex/module-cache-lldb/lldb-api" output:

Hide Details

runCmd: settings set use-color false output:

Hide Details

runCmd: setting set target.prefer-dynamic-value no-dynamic-values output:

Hide Details

runCmd: settings set target.env-vars ASAN_OPTIONS=detect_stack_use_after_return=1 DYLD_INSERT_LIBRARIES=/Users/buildslave/jenkins/workspace/lldb-cmake-sanitized/host-compiler/lib/clang/11.0.0/lib/darwin/libclang_rt.asan_osx_dynamic.dylib output:

Hide Details

runCmd: breakpoint list output: Current breakpoints: 1: file = 'main2.cpp', line = 21, exact_match = 0, locations = 1 1.1: where = test_step_over_3_times_dwarf`b(int) + 22 at main2.cpp:21:17, address = test_step_over_3_times_dwarf[0x0000000100000e66], unresolved, hit count = 0

Hide Details

Hide Details

Hide Details

runCmd: thread backtrace output: * thread #1, queue = 'com.apple.main-thread', stop reason = breakpoint 1.1 * frame #0: 0x000000010cdfbe66 test_step_over_3_times_dwarf`b(val=1) at main2.cpp:21:17 frame #1: 0x000000010cdfbe0d test_step_over_3_times_dwarf`a(val=1) at main2.cpp:11:16 frame #2: 0x000000010cdfbee0 test_step_over_3_times_dwarf`main(argc=1, argv=0x00007ffee2e04460) at main2.cpp:36:14 frame #3: 0x00007fff742d5085 libdyld.dylib`start + 1

Hide Details

Hide Details

runCmd: thread backtrace output: * thread #1, queue = 'com.apple.main-thread', stop reason = step over * frame #0: 0x000000010cdfbe9d test_step_over_3_times_dwarf`b(val=1) at main2.cpp:26:12 frame #1: 0x000000010cdfbe0d test_step_over_3_times_dwarf`a(val=1) at main2.cpp:11:16 frame #2: 0x000000010cdfbee0 test_step_over_3_times_dwarf`main(argc=1, argv=0x00007ffee2e04460) at main2.cpp:36:14 frame #3: 0x00007fff742d5085 libdyld.dylib`start + 1

Hide Details

Hide Details

<bound method SBProcess.Kill of <lldb.SBProcess; proxy of <Swig Object of type 'lldb::SBProcess *' at 0x1069cd990> >>: success

Hide Details

PASS: LLDB (/Users/buildslave/jenkins/workspace/lldb-cmake-sanitized/lldb-build/bin/clang-11-x86_64) :: test_step_over_3_times_dwarf (TestThreadAPI.ThreadAPITestCase) UNSUPPORTED: LLDB (/Users/buildslave/jenkins/workspace/lldb-cmake-sanitized/lldb-build/bin/clang-11-x86_64) :: test_step_over_3_times_dwo (TestThreadAPI.ThreadAPITestCase) (test case does not fall in any category of interest for this run) runCmd: settings clear -all output:

Hide Details

runCmd: settings set symbols.enable-external-lookup false output:

Hide Details

runCmd: settings set target.auto-apply-fixits false output:

Hide Details

runCmd: settings set plugin.process.gdb-remote.packet-timeout 60 output:

Hide Details

runCmd: settings set symbols.clang-modules-cache-path "/Users/buildslave/jenkins/workspace/lldb-cmake-sanitized/lldb-build/lldb-test-build.noindex/module-cache-lldb/lldb-api" output:

Hide Details

runCmd: settings set use-color false output:

Hide Details

runCmd: setting set target.prefer-dynamic-value no-dynamic-values output:

Hide Details

runCmd: settings set target.env-vars ASAN_OPTIONS=detect_stack_use_after_return=1 DYLD_INSERT_LIBRARIES=/Users/buildslave/jenkins/workspace/lldb-cmake-sanitized/host-compiler/lib/clang/11.0.0/lib/darwin/libclang_rt.asan_osx_dynamic.dylib output:

Hide Details

runCmd: breakpoint list output: Current breakpoints: 1: file = 'main2.cpp', line = 21, exact_match = 0, locations = 1 1.1: where = test_step_over_3_times_gmodules`b(int) + 22 at main2.cpp:21:17, address = test_step_over_3_times_gmodules[0x0000000100000e66], unresolved, hit count = 0

Hide Details

Hide Details

Hide Details

runCmd: thread backtrace output: * thread #1, queue = 'com.apple.main-thread', stop reason = breakpoint 1.1 * frame #0: 0x0000000106f95e66 test_step_over_3_times_gmodules`b(val=1) at main2.cpp:21:17 frame #1: 0x0000000106f95e0d test_step_over_3_times_gmodules`a(val=1) at main2.cpp:11:16 frame #2: 0x0000000106f95ee0 test_step_over_3_times_gmodules`main(argc=1, argv=0x00007ffee8c6a458) at main2.cpp:36:14 frame #3: 0x00007fff742d5085 libdyld.dylib`start + 1 frame #4: 0x00007fff742d5085 libdyld.dylib`start + 1

Hide Details

Hide Details

runCmd: thread backtrace output: * thread #1, queue = 'com.apple.main-thread', stop reason = step over * frame #0: 0x0000000106f95e9d test_step_over_3_times_gmodules`b(val=1) at main2.cpp:26:12 frame #1: 0x0000000106f95e0d test_step_over_3_times_gmodules`a(val=1) at main2.cpp:11:16 frame #2: 0x0000000106f95ee0 test_step_over_3_times_gmodules`main(argc=1, argv=0x00007ffee8c6a458) at main2.cpp:36:14 frame #3: 0x00007fff742d5085 libdyld.dylib`start + 1 frame #4: 0x00007fff742d5085 libdyld.dylib`start + 1

Hide Details

Hide Details

<bound method SBProcess.Kill of <lldb.SBProcess; proxy of <Swig Object of type 'lldb::SBProcess *' at 0x11d6b32d0> >>: success

Hide Details

PASS: LLDB (/Users/buildslave/jenkins/workspace/lldb-cmake-sanitized/lldb-build/bin/clang-11-x86_64) :: test_step_over_3_times_gmodules (TestThreadAPI.ThreadAPITestCase) Restore dir to: /Users/buildslave/jenkins/workspace/lldb-cmake-sanitized/lldb-build/tools/lldb/test ====================================================================== ERROR: test_step_out_of_malloc_into_function_b_dsym (TestThreadAPI.ThreadAPITestCase) Test Python SBThread.StepOut() API to step out of a malloc call where the call site is at function b(). ---------------------------------------------------------------------- Traceback (most recent call last): File "/Users/buildslave/jenkins/workspace/lldb-cmake-sanitized/llvm-project/lldb/packages/Python/lldbsuite/test/lldbtest.py", line 1751, in test_method return attrvalue(self) File "/Users/buildslave/jenkins/workspace/lldb-cmake-sanitized/llvm-project/lldb/packages/Python/lldbsuite/test/decorators.py", line 110, in wrapper func(*args, **kwargs) File "/Users/buildslave/jenkins/workspace/lldb-cmake-sanitized/llvm-project/lldb/packages/Python/lldbsuite/test/decorators.py", line 110, in wrapper func(*args, **kwargs) File "/Users/buildslave/jenkins/workspace/lldb-cmake-sanitized/llvm-project/lldb/packages/Python/lldbsuite/test/decorators.py", line 110, in wrapper func(*args, **kwargs) File "/Users/buildslave/jenkins/workspace/lldb-cmake-sanitized/llvm-project/lldb/test/API/python_api/thread/TestThreadAPI.py", line 50, in test_step_out_of_malloc_into_function_b self.step_out_of_malloc_into_function_b(self.exe_name) File "/Users/buildslave/jenkins/workspace/lldb-cmake-sanitized/llvm-project/lldb/test/API/python_api/thread/TestThreadAPI.py", line 157, in step_out_of_malloc_into_function_b thread.IsValid(), AttributeError: 'NoneType' object has no attribute 'IsValid' Config=x86_64-/Users/buildslave/jenkins/workspace/lldb-cmake-sanitized/lldb-build/bin/clang-11 ====================================================================== ERROR: test_step_out_of_malloc_into_function_b_dwarf (TestThreadAPI.ThreadAPITestCase) Test Python SBThread.StepOut() API to step out of a malloc call where the call site is at function b(). ---------------------------------------------------------------------- Traceback (most recent call last): File "/Users/buildslave/jenkins/workspace/lldb-cmake-sanitized/llvm-project/lldb/packages/Python/lldbsuite/test/lldbtest.py", line 1751, in test_method return attrvalue(self) File "/Users/buildslave/jenkins/workspace/lldb-cmake-sanitized/llvm-project/lldb/packages/Python/lldbsuite/test/decorators.py", line 110, in wrapper func(*args, **kwargs) File "/Users/buildslave/jenkins/workspace/lldb-cmake-sanitized/llvm-project/lldb/packages/Python/lldbsuite/test/decorators.py", line 110, in wrapper func(*args, **kwargs) File "/Users/buildslave/jenkins/workspace/lldb-cmake-sanitized/llvm-project/lldb/packages/Python/lldbsuite/test/decorators.py", line 110, in wrapper func(*args, **kwargs) File "/Users/buildslave/jenkins/workspace/lldb-cmake-sanitized/llvm-project/lldb/test/API/python_api/thread/TestThreadAPI.py", line 50, in test_step_out_of_malloc_into_function_b self.step_out_of_malloc_into_function_b(self.exe_name) File "/Users/buildslave/jenkins/workspace/lldb-cmake-sanitized/llvm-project/lldb/test/API/python_api/thread/TestThreadAPI.py", line 157, in step_out_of_malloc_into_function_b thread.IsValid(), AttributeError: 'NoneType' object has no attribute 'IsValid' Config=x86_64-/Users/buildslave/jenkins/workspace/lldb-cmake-sanitized/lldb-build/bin/clang-11 ====================================================================== ERROR: test_step_out_of_malloc_into_function_b_gmodules (TestThreadAPI.ThreadAPITestCase) Test Python SBThread.StepOut() API to step out of a malloc call where the call site is at function b(). ---------------------------------------------------------------------- Traceback (most recent call last): File "/Users/buildslave/jenkins/workspace/lldb-cmake-sanitized/llvm-project/lldb/packages/Python/lldbsuite/test/lldbtest.py", line 1751, in test_method return attrvalue(self) File "/Users/buildslave/jenkins/workspace/lldb-cmake-sanitized/llvm-project/lldb/packages/Python/lldbsuite/test/decorators.py", line 110, in wrapper func(*args, **kwargs) File "/Users/buildslave/jenkins/workspace/lldb-cmake-sanitized/llvm-project/lldb/packages/Python/lldbsuite/test/decorators.py", line 110, in wrapper func(*args, **kwargs) File "/Users/buildslave/jenkins/workspace/lldb-cmake-sanitized/llvm-project/lldb/packages/Python/lldbsuite/test/decorators.py", line 110, in wrapper func(*args, **kwargs) File "/Users/buildslave/jenkins/workspace/lldb-cmake-sanitized/llvm-project/lldb/test/API/python_api/thread/TestThreadAPI.py", line 50, in test_step_out_of_malloc_into_function_b self.step_out_of_malloc_into_function_b(self.exe_name) File "/Users/buildslave/jenkins/workspace/lldb-cmake-sanitized/llvm-project/lldb/test/API/python_api/thread/TestThreadAPI.py", line 157, in step_out_of_malloc_into_function_b thread.IsValid(), AttributeError: 'NoneType' object has no attribute 'IsValid' Config=x86_64-/Users/buildslave/jenkins/workspace/lldb-cmake-sanitized/lldb-build/bin/clang-11 ---------------------------------------------------------------------- Ran 20 tests in 41.472s

Hide Details

RESULT: FAILED (12 passes, 0 failures, 3 errors, 5 skipped, 0 expected failures, 0 unexpected successes)

Hide Details

--

Hide Details

******************** PASS: lldb-api :: api/command-return-object/TestSBCommandReturnObject.py (1839 of 1977) PASS: lldb-unit :: Process/gdb-remote/./ProcessGdbRemoteTests/GDBRemoteCommunicationClientTest.WriteRegisterNoSuffix (1840 of 1977) PASS: lldb-shell :: SymbolFile/DWARF/clang-ast-from-dwarf-objc-property.m (1841 of 1977) PASS: lldb-api :: tools/lldb-server/TestGdbRemoteSingleStep.py (1842 of 1977) PASS: lldb-api :: functionalities/thread/concurrent_events/TestConcurrentTwoWatchpointsOneDelayBreakpoint.py (1843 of 1977) PASS: lldb-shell :: SymbolFile/DWARF/dwo-type-in-main-file.s (1844 of 1977) PASS: lldb-unit :: ScriptInterpreter/Python/./ScriptInterpreterPythonTests/PythonDataObjectsTest.TestPythonTupleSize (1845 of 1977) PASS: lldb-unit :: Utility/./UtilityTests/StringExtractorTest.GetNameColonValueSuccess (1846 of 1977) PASS: lldb-unit :: Language/Highlighting/./HighlighterTests/HighlighterTest.ClangOperators (1847 of 1977) PASS: lldb-shell :: Minidump/disassemble-no-module.yaml (1848 of 1977) PASS: lldb-unit :: Utility/./UtilityTests/RangeTest.NotEqualInvalid (1849 of 1977) PASS: lldb-api :: functionalities/data-formatter/data-formatter-stl/libcxx/function/TestLibCxxFunction.py (1850 of 1977) UNSUPPORTED: lldb-api :: functionalities/unwind/standard/TestStandardUnwind.py (1851 of 1977) PASS: lldb-api :: functionalities/breakpoint/breakpoint_set_restart/TestBreakpointSetRestart.py (1852 of 1977) PASS: lldb-unit :: Utility/./UtilityTests/RangeTest.Union (1853 of 1977) UNSUPPORTED: lldb-api :: commands/register/register/intel_xtended_registers/mpx_offset_intersection/TestMPXOffsetIntersection.py (1854 of 1977) PASS: lldb-unit :: Process/gdb-remote/./ProcessGdbRemoteTests/GDBRemoteCommunicationClientTest.GetModulesInfo_UUID20 (1855 of 1977) PASS: lldb-shell :: SymbolFile/DWARF/find-basic-function.cpp (1856 of 1977) PASS: lldb-unit :: Symbol/./SymbolTests/TestTypeSystemClang.TestRecordHasFields (1857 of 1977) PASS: lldb-unit :: Utility/./UtilityTests/RangeTest.ClearWithStarAddress (1858 of 1977) PASS: lldb-unit :: Utility/./UtilityTests/ScalarTest.GetValue (1859 of 1977) PASS: lldb-unit :: Utility/./UtilityTests/ListenerTest.GetEventWait (1860 of 1977) PASS: lldb-unit :: Utility/./UtilityTests/RangeTest.DoesIntersect (1861 of 1977) PASS: lldb-unit :: UnwindAssembly/x86/./UnwindAssemblyx86Tests/Testx86AssemblyInspectionEngine.TestPushExtended (1862 of 1977) UNSUPPORTED: lldb-api :: commands/watchpoints/variable_out_of_scope/TestWatchedVarHitWhenInScope.py (1863 of 1977) PASS: lldb-unit :: Process/gdb-remote/./ProcessGdbRemoteTests/GDBRemoteClientBaseTest.SendContinueAndLateInterrupt (1864 of 1977) PASS: lldb-api :: api/multiple-targets/TestMultipleTargets.py (1865 of 1977) PASS: lldb-unit :: UnwindAssembly/x86/./UnwindAssemblyx86Tests/Testx86AssemblyInspectionEngine.TestPushESI (1866 of 1977) PASS: lldb-api :: functionalities/breakpoint/move_nearest/TestMoveNearest.py (1867 of 1977) UNSUPPORTED: lldb-api :: lang/objc/objc-dynamic-value/TestObjCDynamicValue.py (1868 of 1977) PASS: lldb-api :: lang/c/anonymous/TestAnonymous.py (1869 of 1977) PASS: lldb-unit :: Process/gdb-remote/./ProcessGdbRemoteTests/GDBRemoteCommunicationServerTest.SendErrorResponse_Status (1870 of 1977) PASS: lldb-unit :: Utility/./UtilityTests/StringExtractorTest.GetHexU8_InvalidHex (1871 of 1977) PASS: lldb-api :: functionalities/thread/thread_specific_break/TestThreadSpecificBreakpoint.py (1872 of 1977) PASS: lldb-unit :: Expression/./ExpressionTests/CppModuleConfigurationTest.Sysroot (1873 of 1977) PASS: lldb-unit :: Signals/./SignalsTests/UnixSignalsTest.GetInfo (1874 of 1977) PASS: lldb-unit :: Process/gdb-remote/./ProcessGdbRemoteTests/GDBRemoteCommunicationClientTest.GetModulesInfo (1875 of 1977) PASS: lldb-api :: python_api/watchpoint/TestWatchpointIgnoreCount.py (1876 of 1977) PASS: lldb-api :: commands/apropos/basic/TestApropos.py (1877 of 1977) PASS: lldb-unit :: Host/./HostTests/HostInfoTest.GetAugmentedArchSpec (1878 of 1977) PASS: lldb-api :: commands/watchpoints/watchpoint_size/TestWatchpointSizes.py (1879 of 1977) PASS: lldb-unit :: Utility/./UtilityTests/TimerTest.CategoryTimes (1880 of 1977) PASS: lldb-shell :: Breakpoint/dummy-target.test (1881 of 1977) PASS: lldb-api :: functionalities/thread/concurrent_events/TestConcurrentDelayWatchBreak.py (1882 of 1977) PASS: lldb-api :: lang/cpp/constructors/TestCppConstructors.py (1883 of 1977) PASS: lldb-api :: lang/cpp/namespace_conflicts/TestNamespaceConflicts.py (1884 of 1977) PASS: lldb-api :: commands/process/launch-with-shellexpand/TestLaunchWithShellExpand.py (1885 of 1977) UNSUPPORTED: lldb-shell :: SymbolFile/DWARF/debug-types-expressions.test (1886 of 1977) PASS: lldb-api :: lang/c/stepping/TestStepAndBreakpoints.py (1887 of 1977) PASS: lldb-unit :: Utility/./UtilityTests/StringExtractorTest.DecodeHexU8_Exact (1888 of 1977) PASS: lldb-unit :: Utility/./UtilityTests/UriParserTest.BracketedHostnameWithColon (1889 of 1977) PASS: lldb-unit :: Utility/./UtilityTests/BinaryStreamTest.PutULEB128NineBytes (1890 of 1977) PASS: lldb-api :: commands/expression/static-initializers/TestStaticInitializers.py (1891 of 1977) PASS: lldb-unit :: Utility/./UtilityTests/BroadcasterTest.EventTypeHasListeners (1892 of 1977) PASS: lldb-unit :: Host/./HostTests/SocketTest.TCPGetAddress (1893 of 1977) UNSUPPORTED: lldb-api :: functionalities/signal/handle-segv/TestHandleSegv.py (1894 of 1977) UNSUPPORTED: lldb-api :: commands/watchpoints/hello_watchlocation/TestWatchLocation.py (1895 of 1977) PASS: lldb-api :: functionalities/inferior-changed/TestInferiorChanged.py (1896 of 1977) PASS: lldb-shell :: Reproducer/TestSynchronous.test (1897 of 1977) UNSUPPORTED: lldb-api :: tools/lldb-vscode/completions/TestVSCode_completions.py (1898 of 1977) PASS: lldb-unit :: Utility/./UtilityTests/LogTest.LLDB_LOG_nullptr (1899 of 1977) PASS: lldb-unit :: Utility/./UtilityTests/ArgsTest.GetQuotedCommandString (1900 of 1977) PASS: lldb-api :: commands/expression/expr-in-syscall/TestExpressionInSyscall.py (1901 of 1977) PASS: lldb-unit :: Language/CPlusPlus/./LanguageCPlusPlusTests/CPlusPlusLanguage.MethodNameParsing (1902 of 1977) PASS: lldb-unit :: Process/minidump/./LLDBMinidumpTests/MinidumpParserTest.GetLinuxProcStatus_no_stream (1903 of 1977) PASS: lldb-api :: python_api/hello_world/TestHelloWorld.py (1904 of 1977) PASS: lldb-unit :: Process/minidump/./LLDBMinidumpTests/MinidumpParserTest.GetThreadContext_x86_64 (1905 of 1977) UNSUPPORTED: lldb-shell :: Breakpoint/case-insensitive.test (1906 of 1977) PASS: lldb-api :: commands/expression/import-std-module/queue/TestQueueFromStdModule.py (1907 of 1977) PASS: lldb-unit :: Utility/./UtilityTests/RegularExpression.CopyAssignment (1908 of 1977) PASS: lldb-unit :: Utility/./UtilityTests/StringListTest.RemoveBlankLines (1909 of 1977) PASS: lldb-api :: tools/lldb-vscode/breakpoint/TestVSCode_setExceptionBreakpoints.py (1910 of 1977) PASS: lldb-unit :: Utility/./UtilityTests/BinaryStreamTest.PutULEB128TwoBytes (1911 of 1977) PASS: lldb-api :: functionalities/data-formatter/data-formatter-synthtype/TestDataFormatterSynthType.py (1912 of 1977) PASS: lldb-unit :: ScriptInterpreter/Python/./ScriptInterpreterPythonTests/PythonDataObjectsTest.TestExceptions (1913 of 1977) PASS: lldb-api :: types/TestIntegerTypeExpr.py (1914 of 1977) PASS: lldb-api :: types/TestDoubleTypesExpr.py (1915 of 1977) PASS: lldb-api :: commands/expression/test/TestExprs2.py (1916 of 1977) PASS: lldb-unit :: Process/minidump/./LLDBMinidumpTests/MinidumpParserTest.GetMemoryRegionInfoFromMemory64List (1917 of 1977) PASS: lldb-api :: lang/c/unions/TestUnionMembers.py (1918 of 1977) PASS: lldb-unit :: Utility/./UtilityTests/StringListTest.InsertStringAtIndexMove (1919 of 1977) PASS: lldb-unit :: Utility/./UtilityTests/RecordReplayTest.InstrumentedFooSameThis (1920 of 1977) PASS: lldb-shell :: Watchpoint/SetErrorCases.test (1921 of 1977) PASS: lldb-shell :: Breakpoint/single-file-split-dwarf.test (1922 of 1977) PASS: lldb-shell :: Expr/TestMultilineExpr.test (1923 of 1977) PASS: lldb-unit :: Process/minidump/./LLDBMinidumpTests/MinidumpParserTest.GetMemoryRegionInfoFromMemoryList (1924 of 1977) PASS: lldb-unit :: Utility/./UtilityTests/StringListTest.LongestCommonPrefixNoPrefix (1925 of 1977) PASS: lldb-api :: lang/objc/variadic_methods/TestVariadicMethods.py (1926 of 1977) PASS: lldb-api :: commands/expression/import-std-module/deque-dbg-info-content/TestDbgInfoContentDequeFromStdModule.py (1927 of 1977) PASS: lldb-api :: commands/expression/import-std-module/vector/TestVectorFromStdModule.py (1928 of 1977) PASS: lldb-api :: commands/expression/diagnostics/TestExprDiagnostics.py (1929 of 1977) PASS: lldb-api :: functionalities/thread/concurrent_events/TestConcurrentWatchpointWithDelayWatchpointThreads.py (1930 of 1977) PASS: lldb-shell :: ObjectFile/PECOFF/invalid-export-table.yaml (1931 of 1977) PASS: lldb-unit :: Utility/./UtilityTests/ProcessInstanceInfoMatch.Name (1932 of 1977) PASS: lldb-unit :: Utility/./UtilityTests/ConstStringTest.format_provider (1933 of 1977) PASS: lldb-unit :: Utility/./UtilityTests/StringListTest.JoinNonSpace (1934 of 1977) PASS: lldb-unit :: Utility/./UtilityTests/BinaryStreamTest.PutULEB128SevenBytes (1935 of 1977) PASS: lldb-api :: commands/reproducer/invalid-args/TestInvalidArgsReproducer.py (1936 of 1977) PASS: lldb-shell :: SymbolFile/DWARF/debug_rnglists.s (1937 of 1977) UNSUPPORTED: lldb-api :: functionalities/data-formatter/data-formatter-stl/libstdcpp/list/TestDataFormatterStdList.py (1938 of 1977) PASS: lldb-api :: commands/target/create-no-such-arch/TestNoSuchArch.py (1939 of 1977) UNSUPPORTED: lldb-api :: functionalities/data-formatter/data-formatter-stl/libstdcpp/map/TestDataFormatterStdMap.py (1940 of 1977) PASS: lldb-api :: lang/cpp/nested-class-other-compilation-unit/TestNestedClassWithParentInAnotherCU.py (1941 of 1977) PASS: lldb-unit :: UnwindAssembly/x86/./UnwindAssemblyx86Tests/Testx86AssemblyInspectionEngine.TestPopR15 (1942 of 1977) PASS: lldb-api :: tools/lldb-vscode/stackTrace/TestVSCode_stackTrace.py (1943 of 1977) PASS: lldb-unit :: Utility/./UtilityTests/SerializationRountripTest.SerializeDeserializePodReferences (1944 of 1977) PASS: lldb-shell :: SymbolFile/DWARF/debug_ranges_and_rnglists.test (1945 of 1977) PASS: lldb-unit :: ObjectFile/PECOFF/./ObjectFilePECOFFTests/PECallFrameInfoTest.Chained_eh (1946 of 1977) PASS: lldb-api :: macosx/find-dsym/bundle-with-dot-in-filename/TestBundleWithDotInFilename.py (1947 of 1977) PASS: lldb-unit :: Process/gdb-remote/./ProcessGdbRemoteTests/GDBRemoteClientBaseTest.SendContinueAndAsyncSignal (1948 of 1977) PASS: lldb-unit :: debugserver/./debugserverTests/RNBSocket.LoopBackConnectIPv6 (1949 of 1977) UNSUPPORTED: lldb-shell :: Unwind/eh-frame-small-fde.test (1950 of 1977) PASS: lldb-api :: commands/frame/diagnose/virtual-method-call/TestDiagnoseDereferenceVirtualMethodCall.py (1951 of 1977) PASS: lldb-shell :: Settings/TestModuleCacheSanity.test (1952 of 1977) PASS: lldb-unit :: Utility/./UtilityTests/RangeTest.ContainsEndInclusiveInvalid (1953 of 1977) PASS: lldb-unit :: ScriptInterpreter/Python/./ScriptInterpreterPythonTests/PythonDataObjectsTest.TestPythonTupleInitializerList (1954 of 1977) PASS: lldb-api :: python_api/module_section/TestModuleAndSection.py (1955 of 1977) PASS: lldb-api :: commands/frame/diagnose/bad-reference/TestBadReference.py (1956 of 1977) PASS: lldb-unit :: Interpreter/./InterpreterTests/CompletionTest.DirCompletionUsername (1957 of 1977) UNSUPPORTED: lldb-api :: benchmarks/continue/TestBenchmarkContinue.py (1958 of 1977) UNSUPPORTED: lldb-api :: functionalities/tsan/cpp_global_location/TestTsanCPPGlobalLocation.py (1959 of 1977) PASS: lldb-unit :: Target/./TargetTests/ExecutionContextTest.GetByteOrder (1960 of 1977) PASS: lldb-unit :: SymbolFile/NativePDB/./SymbolFileNativePDBTests/PDBFPOProgramToDWARFExpressionTests.UnknownOp (1961 of 1977) PASS: lldb-unit :: Language/Highlighting/./HighlighterTests/HighlighterTest.ClangScalarLiterals (1962 of 1977) PASS: lldb-unit :: Expression/./ExpressionTests/CppModuleConfigurationTest.Linux (1963 of 1977) PASS: lldb-unit :: Utility/./UtilityTests/RangeDataVector.FindEntryThatContains_Overlap (1964 of 1977) UNSUPPORTED: lldb-api :: functionalities/darwin_log/filter/exact_match/message/TestDarwinLogFilterMatchMessage.py (1965 of 1977) PASS: lldb-unit :: UnwindAssembly/x86/./UnwindAssemblyx86Tests/Testx86AssemblyInspectionEngine.TestPushR14 (1966 of 1977) PASS: lldb-unit :: UnwindAssembly/x86/./UnwindAssemblyx86Tests/Testx86AssemblyInspectionEngine.TestAddESP (1967 of 1977) PASS: lldb-unit :: Expression/./ExpressionTests/DiagnosticManagerTest.AddDiagnostic (1968 of 1977) PASS: lldb-shell :: Reproducer/TestCaptureEnvOverride.test (1969 of 1977) PASS: lldb-unit :: Utility/./UtilityTests/ArgsTest.TestQuotedTrailingBackslash (1970 of 1977) PASS: lldb-unit :: Utility/./UtilityTests/UUIDTest.StringConverion (1971 of 1977) PASS: lldb-api :: commands/expression/persist_objc_pointeetype/TestPersistObjCPointeeType.py (1972 of 1977) PASS: lldb-unit :: Host/./HostTests/SocketTest.UDPConnect (1973 of 1977) PASS: lldb-api :: python_api/section/TestSectionAPI.py (1974 of 1977) PASS: lldb-api :: lang/objc/objc-runtime-ivars/TestRuntimeIvars.py (1975 of 1977) PASS: lldb-api :: lang/objc/objc-static-method/TestObjCStaticMethod.py (1976 of 1977) PASS: lldb-api :: lang/objc/foundation/TestConstStrings.py (1977 of 1977)

Hide Details

Testing Time: 4463.64s ******************** Failing Tests (3): lldb-api :: lang/objc/ptr_refs/TestPtrRefsObjC.py lldb-api :: functionalities/ptr_refs/TestPtrRefs.py lldb-api :: python_api/thread/TestThreadAPI.py

Hide Details

Hide Details

Slowest Tests: -------------------------------------------------------------------------- 96.12s: lldb-api :: types/TestLongTypes.py 96.83s: lldb-api :: commands/settings/TestSettings.py 103.06s: lldb-api :: lang/objcxx/objcxx-ivar-vector/TestIvarVector.py 105.24s: lldb-api :: lang/objc/blocks/TestObjCIvarsInBlocks.py 117.82s: lldb-api :: lang/objc/foundation/TestObjCMethodsString.py 118.80s: lldb-api :: lang/objc/foundation/TestObjCMethodsNSError.py 120.45s: lldb-api :: tools/lldb-server/TestGdbRemote_qThreadStopInfo.py 122.18s: lldb-api :: lang/objc/objc-new-syntax/TestObjCNewSyntaxArray.py 122.77s: lldb-api :: lang/objc/objc-new-syntax/TestObjCNewSyntaxDictionary.py 130.16s: lldb-api :: types/TestLongTypesExpr.py 145.13s: lldb-api :: lang/objc/real-definition/TestRealDefinition.py 146.98s: lldb-api :: lang/objc/exceptions/TestObjCExceptions.py 159.07s: lldb-api :: lang/objc/objc-new-syntax/TestObjCNewSyntaxLiteral.py 163.58s: lldb-api :: lang/cpp/namespace/TestNamespaceLookup.py 219.09s: lldb-api :: lang/objc/foundation/TestObjCMethods.py 251.23s: lldb-api :: tools/lldb-server/TestGdbRemoteThreadsInStopReply.py 252.13s: lldb-api :: lang/objc/hidden-ivars/TestHiddenIvars.py 263.94s: lldb-api :: api/multithreaded/TestMultithreaded.py 273.54s: lldb-api :: lang/cpp/enum_types/TestCPP11EnumTypes.py 369.81s: lldb-api :: tools/lldb-server/TestLldbGdbServer.py

Hide Details

Tests Times: -------------------------------------------------------------------------- [ Range ] :: [ Percentage ] :: [ Count ] -------------------------------------------------------------------------- [ 0s, 20s) :: [********************************** ] :: [1723/1977] [ 20s, 40s) :: [** ] :: [ 104/1977] [ 40s, 60s) :: [* ] :: [ 96/1977] [ 60s, 80s) :: [ ] :: [ 27/1977] [ 80s,100s) :: [ ] :: [ 9/1977] [100s,120s) :: [ ] :: [ 2/1977] [120s,140s) :: [ ] :: [ 6/1977] [140s,160s) :: [ ] :: [ 2/1977] [160s,180s) :: [ ] :: [ 2/1977] [180s,200s) :: [ ] :: [ 0/1977] [200s,220s) :: [ ] :: [ 0/1977] [220s,240s) :: [ ] :: [ 1/1977] [240s,260s) :: [ ] :: [ 2/1977] [260s,280s) :: [ ] :: [ 1/1977] [280s,300s) :: [ ] :: [ 1/1977] [300s,320s) :: [ ] :: [ 0/1977] [320s,340s) :: [ ] :: [ 0/1977] [340s,360s) :: [ ] :: [ 0/1977] [360s,380s) :: [ ] :: [ 1/1977] Expected Passes : 1801 Expected Failures : 6 Unsupported Tests : 167 Unexpected Failures: 3 FAILED: tools/lldb/test/CMakeFiles/check-lldb-lit cd /Users/buildslave/jenkins/workspace/lldb-cmake-sanitized/lldb-build/tools/lldb/test && /usr/local/bin/python /Users/buildslave/jenkins/workspace/lldb-cmake-sanitized/lldb-build/./bin/llvm-lit -v --time-tests --shuffle --xunit-xml-output=/Users/buildslave/jenkins/workspace/lldb-cmake-sanitized/test/results.xml -v -j 4 --timeout 1200 /Users/buildslave/jenkins/workspace/lldb-cmake-sanitized/lldb-build/tools/lldb/test ninja: build stopped: subcommand failed. Command failed: Command '['/usr/bin/env', 'TERM=vt100', '/usr/local/bin/ninja', '-v', 'check-lldb']' returned non-zero exit status 1. Command: ['/usr/bin/env', 'TERM=vt100', '/usr/local/bin/ninja', '-v', 'check-lldb'] [Pipeline] } [Pipeline] // timeout [Pipeline] } [Pipeline] // stage [Pipeline] stage [Pipeline] { (Declarative: Post Actions) [Pipeline] scanForIssues [Clang (LLVM based)] Sleeping for 5 seconds due to JENKINS-32191... [Clang (LLVM based)] Parsing console log (workspace: '/Users/buildslave/jenkins/workspace/lldb-cmake-sanitized') [Clang (LLVM based)] Successfully parsed console log [Clang (LLVM based)] -> found 0 issues (skipped 0 duplicates) [Clang (LLVM based)] Skipping post processing [Clang (LLVM based)] No filter has been set, publishing all 0 issues [Pipeline] junit Recording test results [Pipeline] } [Pipeline] // stage [Pipeline] } [Pipeline] // withEnv [Pipeline] } [Pipeline] // node [Pipeline] End of Pipeline ERROR: script returned exit code 1 Finished: FAILURE