FailedConsole Output

Skipping 8,442 KB.. Full Log
se) (test case does not fall in any category of interest for this run) 
runCmd: settings clear -all
output: 

Hide Details

runCmd: settings set symbols.enable-external-lookup false output:

Hide Details

runCmd: settings set target.auto-apply-fixits false output:

Hide Details

runCmd: settings set plugin.process.gdb-remote.packet-timeout 60 output:

Hide Details

runCmd: settings set symbols.clang-modules-cache-path "/Users/buildslave/jenkins/workspace/lldb-cmake-sanitized/lldb-build/lldb-test-build.noindex/module-cache-lldb/lldb-api" output:

Hide Details

runCmd: settings set use-color false output:

Hide Details

runCmd: setting set target.prefer-dynamic-value no-dynamic-values output:

Hide Details

runCmd: settings set target.env-vars ASAN_OPTIONS=detect_stack_use_after_return=1 DYLD_INSERT_LIBRARIES=/Users/buildslave/jenkins/workspace/lldb-cmake-sanitized/host-compiler/lib/clang/11.0.0/lib/darwin/libclang_rt.asan_osx_dynamic.dylib output:

Hide Details

runCmd: breakpoint list output: Current breakpoints: 1: file = 'main2.cpp', line = 21, exact_match = 0, locations = 1 1.1: where = test_step_over_3_times_gmodules`b(int) + 22 at main2.cpp:21:17, address = test_step_over_3_times_gmodules[0x0000000100000e66], unresolved, hit count = 0

Hide Details

Hide Details

Hide Details

runCmd: thread backtrace output: * thread #1, queue = 'com.apple.main-thread', stop reason = breakpoint 1.1 * frame #0: 0x0000000104cb2e66 test_step_over_3_times_gmodules`b(val=1) at main2.cpp:21:17 frame #1: 0x0000000104cb2e0d test_step_over_3_times_gmodules`a(val=1) at main2.cpp:11:16 frame #2: 0x0000000104cb2ee0 test_step_over_3_times_gmodules`main(argc=1, argv=0x00007ffeeaf4d458) at main2.cpp:36:14 frame #3: 0x00007fff742d5085 libdyld.dylib`start + 1 frame #4: 0x00007fff742d5085 libdyld.dylib`start + 1

Hide Details

Hide Details

runCmd: thread backtrace output: * thread #1, queue = 'com.apple.main-thread', stop reason = step over * frame #0: 0x0000000104cb2e9d test_step_over_3_times_gmodules`b(val=1) at main2.cpp:26:12 frame #1: 0x0000000104cb2e0d test_step_over_3_times_gmodules`a(val=1) at main2.cpp:11:16 frame #2: 0x0000000104cb2ee0 test_step_over_3_times_gmodules`main(argc=1, argv=0x00007ffeeaf4d458) at main2.cpp:36:14 frame #3: 0x00007fff742d5085 libdyld.dylib`start + 1 frame #4: 0x00007fff742d5085 libdyld.dylib`start + 1

Hide Details

Hide Details

<bound method SBProcess.Kill of <lldb.SBProcess; proxy of <Swig Object of type 'lldb::SBProcess *' at 0x10ba36db0> >>: success

Hide Details

PASS: LLDB (/Users/buildslave/jenkins/workspace/lldb-cmake-sanitized/lldb-build/bin/clang-11-x86_64) :: test_step_over_3_times_gmodules (TestThreadAPI.ThreadAPITestCase) Restore dir to: /Users/buildslave/jenkins/workspace/lldb-cmake-sanitized/lldb-build/tools/lldb/test ====================================================================== ERROR: test_step_out_of_malloc_into_function_b_dsym (TestThreadAPI.ThreadAPITestCase) Test Python SBThread.StepOut() API to step out of a malloc call where the call site is at function b(). ---------------------------------------------------------------------- Traceback (most recent call last): File "/Users/buildslave/jenkins/workspace/lldb-cmake-sanitized/llvm-project/lldb/packages/Python/lldbsuite/test/lldbtest.py", line 1751, in test_method return attrvalue(self) File "/Users/buildslave/jenkins/workspace/lldb-cmake-sanitized/llvm-project/lldb/packages/Python/lldbsuite/test/decorators.py", line 110, in wrapper func(*args, **kwargs) File "/Users/buildslave/jenkins/workspace/lldb-cmake-sanitized/llvm-project/lldb/packages/Python/lldbsuite/test/decorators.py", line 110, in wrapper func(*args, **kwargs) File "/Users/buildslave/jenkins/workspace/lldb-cmake-sanitized/llvm-project/lldb/packages/Python/lldbsuite/test/decorators.py", line 110, in wrapper func(*args, **kwargs) File "/Users/buildslave/jenkins/workspace/lldb-cmake-sanitized/llvm-project/lldb/test/API/python_api/thread/TestThreadAPI.py", line 50, in test_step_out_of_malloc_into_function_b self.step_out_of_malloc_into_function_b(self.exe_name) File "/Users/buildslave/jenkins/workspace/lldb-cmake-sanitized/llvm-project/lldb/test/API/python_api/thread/TestThreadAPI.py", line 157, in step_out_of_malloc_into_function_b thread.IsValid(), AttributeError: 'NoneType' object has no attribute 'IsValid' Config=x86_64-/Users/buildslave/jenkins/workspace/lldb-cmake-sanitized/lldb-build/bin/clang-11 ====================================================================== ERROR: test_step_out_of_malloc_into_function_b_dwarf (TestThreadAPI.ThreadAPITestCase) Test Python SBThread.StepOut() API to step out of a malloc call where the call site is at function b(). ---------------------------------------------------------------------- Traceback (most recent call last): File "/Users/buildslave/jenkins/workspace/lldb-cmake-sanitized/llvm-project/lldb/packages/Python/lldbsuite/test/lldbtest.py", line 1751, in test_method return attrvalue(self) File "/Users/buildslave/jenkins/workspace/lldb-cmake-sanitized/llvm-project/lldb/packages/Python/lldbsuite/test/decorators.py", line 110, in wrapper func(*args, **kwargs) File "/Users/buildslave/jenkins/workspace/lldb-cmake-sanitized/llvm-project/lldb/packages/Python/lldbsuite/test/decorators.py", line 110, in wrapper func(*args, **kwargs) File "/Users/buildslave/jenkins/workspace/lldb-cmake-sanitized/llvm-project/lldb/packages/Python/lldbsuite/test/decorators.py", line 110, in wrapper func(*args, **kwargs) File "/Users/buildslave/jenkins/workspace/lldb-cmake-sanitized/llvm-project/lldb/test/API/python_api/thread/TestThreadAPI.py", line 50, in test_step_out_of_malloc_into_function_b self.step_out_of_malloc_into_function_b(self.exe_name) File "/Users/buildslave/jenkins/workspace/lldb-cmake-sanitized/llvm-project/lldb/test/API/python_api/thread/TestThreadAPI.py", line 157, in step_out_of_malloc_into_function_b thread.IsValid(), AttributeError: 'NoneType' object has no attribute 'IsValid' Config=x86_64-/Users/buildslave/jenkins/workspace/lldb-cmake-sanitized/lldb-build/bin/clang-11 ====================================================================== ERROR: test_step_out_of_malloc_into_function_b_gmodules (TestThreadAPI.ThreadAPITestCase) Test Python SBThread.StepOut() API to step out of a malloc call where the call site is at function b(). ---------------------------------------------------------------------- Traceback (most recent call last): File "/Users/buildslave/jenkins/workspace/lldb-cmake-sanitized/llvm-project/lldb/packages/Python/lldbsuite/test/lldbtest.py", line 1751, in test_method return attrvalue(self) File "/Users/buildslave/jenkins/workspace/lldb-cmake-sanitized/llvm-project/lldb/packages/Python/lldbsuite/test/decorators.py", line 110, in wrapper func(*args, **kwargs) File "/Users/buildslave/jenkins/workspace/lldb-cmake-sanitized/llvm-project/lldb/packages/Python/lldbsuite/test/decorators.py", line 110, in wrapper func(*args, **kwargs) File "/Users/buildslave/jenkins/workspace/lldb-cmake-sanitized/llvm-project/lldb/packages/Python/lldbsuite/test/decorators.py", line 110, in wrapper func(*args, **kwargs) File "/Users/buildslave/jenkins/workspace/lldb-cmake-sanitized/llvm-project/lldb/test/API/python_api/thread/TestThreadAPI.py", line 50, in test_step_out_of_malloc_into_function_b self.step_out_of_malloc_into_function_b(self.exe_name) File "/Users/buildslave/jenkins/workspace/lldb-cmake-sanitized/llvm-project/lldb/test/API/python_api/thread/TestThreadAPI.py", line 157, in step_out_of_malloc_into_function_b thread.IsValid(), AttributeError: 'NoneType' object has no attribute 'IsValid' Config=x86_64-/Users/buildslave/jenkins/workspace/lldb-cmake-sanitized/lldb-build/bin/clang-11 ---------------------------------------------------------------------- Ran 20 tests in 42.923s

Hide Details

RESULT: FAILED (12 passes, 0 failures, 3 errors, 5 skipped, 0 expected failures, 0 unexpected successes)

Hide Details

--

Hide Details

******************** PASS: lldb-shell :: SymbolFile/Breakpad/line-table-discontinuous-file-ids.test (644 of 1977) PASS: lldb-unit :: debugserver/./debugserverTests/RNBSocket.LoopBackListenIPv4 (645 of 1977) PASS: lldb-unit :: Utility/./UtilityTests/StringListTest.AppendList (646 of 1977) PASS: lldb-shell :: ObjectFile/wasm/stripped-debug-sections.yaml (647 of 1977) PASS: lldb-unit :: UnwindAssembly/x86/./UnwindAssemblyx86Tests/Testx86AssemblyInspectionEngine.Test32BitOnlyInstruction (648 of 1977) PASS: lldb-unit :: UnwindAssembly/x86/./UnwindAssemblyx86Tests/Testx86AssemblyInspectionEngine.TestDisassemblyJunkBytes (649 of 1977) PASS: lldb-api :: commands/disassemble/basic/TestDisassembleBreakpoint.py (650 of 1977) PASS: lldb-unit :: Utility/./UtilityTests/BroadcasterTest.EventTypeHasListeners (651 of 1977) PASS: lldb-api :: functionalities/data-formatter/typedef_array/TestTypedefArray.py (652 of 1977) PASS: lldb-unit :: Utility/./UtilityTests/UriParserTest.BracketedHostnamePort (653 of 1977) PASS: lldb-unit :: Utility/./UtilityTests/StreamTest.PutStringAsRawHex8 (654 of 1977) PASS: lldb-api :: commands/frame/var-scope/TestFrameVariableScope.py (655 of 1977) PASS: lldb-api :: functionalities/thread/concurrent_events/TestConcurrentWatchBreakDelay.py (656 of 1977) PASS: lldb-api :: commands/expression/call-function/TestCallStopAndContinue.py (657 of 1977) PASS: lldb-unit :: Process/gdb-remote/./ProcessGdbRemoteTests/GDBRemoteCommunicationClientTest.WriteRegisterNoSuffix (658 of 1977) PASS: lldb-unit :: Utility/./UtilityTests/OptionsWithRawTest.EmptySuffix (659 of 1977) PASS: lldb-api :: python_api/sbstructureddata/TestStructuredDataAPI.py (660 of 1977) PASS: lldb-api :: commands/expression/anonymous-struct/TestCallUserAnonTypedef.py (661 of 1977) XFAIL: lldb-shell :: Unwind/prefer-debug-over-eh-frame.test (662 of 1977) PASS: lldb-unit :: Utility/./UtilityTests/RangeTest.SlideZero (663 of 1977) UNSUPPORTED: lldb-api :: functionalities/asan/TestMemoryHistory.py (664 of 1977) UNSUPPORTED: lldb-shell :: Register/arm-gp-read.test (665 of 1977) PASS: lldb-unit :: Utility/./UtilityTests/RangeTest.Copy (666 of 1977) PASS: lldb-unit :: Expression/./ExpressionTests/DiagnosticManagerTest.FixedExpression (667 of 1977) PASS: lldb-api :: functionalities/thread/concurrent_events/TestConcurrentBreakpointsDelayedBreakpointOneWatchpoint.py (668 of 1977) PASS: lldb-unit :: Utility/./UtilityTests/OptionsWithRawTest.SingleWordSuffix (669 of 1977) PASS: lldb-api :: commands/watchpoints/step_over_watchpoint/TestStepOverWatchpoint.py (670 of 1977) PASS: lldb-unit :: UnwindAssembly/x86/./UnwindAssemblyx86Tests/Testx86AssemblyInspectionEngine.TestPushExtended (671 of 1977) PASS: lldb-api :: lang/cpp/function_refs/TestFunctionRefs.py (672 of 1977) PASS: lldb-unit :: Utility/./UtilityTests/RegularExpression.Empty (673 of 1977) PASS: lldb-shell :: SymbolFile/DWARF/debug_ranges-missing-section.s (674 of 1977) PASS: lldb-api :: lang/c/local_types/TestUseClosestType.py (675 of 1977) PASS: lldb-api :: functionalities/set-data/TestSetData.py (676 of 1977) PASS: lldb-unit :: Utility/./UtilityTests/FileSpecTest.Equal (677 of 1977) PASS: lldb-api :: lang/cpp/operators/TestCppOperators.py (678 of 1977) PASS: lldb-api :: lang/objc/rdar-10967107/TestRdar10967107.py (679 of 1977) PASS: lldb-unit :: ObjectFile/PECOFF/./ObjectFilePECOFFTests/PECallFrameInfoTest.Chained_eh (680 of 1977) PASS: lldb-api :: lang/cpp/lambdas/TestLambdas.py (681 of 1977) PASS: lldb-unit :: Utility/./UtilityTests/StringListTest.SplitIntoLines (682 of 1977) UNSUPPORTED: lldb-api :: functionalities/data-formatter/data-formatter-stl/libstdcpp/vbool/TestDataFormatterStdVBool.py (683 of 1977) PASS: lldb-api :: functionalities/inferior-changed/TestInferiorChanged.py (684 of 1977) UNSUPPORTED: lldb-api :: functionalities/process_save_core/TestProcessSaveCore.py (685 of 1977) PASS: lldb-shell :: BuildScript/modes.test (686 of 1977) PASS: lldb-unit :: Utility/./UtilityTests/UriParserTest.MinimalPortPath (687 of 1977) PASS: lldb-api :: commands/watchpoints/watchpoint_commands/command/TestWatchpointCommandLLDB.py (688 of 1977) PASS: lldb-api :: commands/expression/deleting-implicit-copy-constructor/TestDeletingImplicitCopyConstructor.py (689 of 1977) PASS: lldb-unit :: Core/./LLDBCoreTests/MangledTest.NameIndexes_FindFunctionSymbols (690 of 1977) PASS: lldb-api :: functionalities/gdb_remote_client/TestNoGPacketSupported.py (691 of 1977) PASS: lldb-shell :: ObjectFile/ELF/short-build-id.yaml (692 of 1977) PASS: lldb-unit :: Utility/./UtilityTests/StringListTest.ShiftStdString (693 of 1977) PASS: lldb-shell :: SymbolFile/DWARF/inline-function-address-shared.test (694 of 1977) PASS: lldb-api :: python_api/watchpoint/TestWatchpointIter.py (695 of 1977) PASS: lldb-shell :: SymbolFile/DWARF/find-method.cpp (696 of 1977) PASS: lldb-api :: functionalities/data-formatter/data-formatter-objc/TestDataFormatterObjCNSBundle.py (697 of 1977) PASS: lldb-shell :: SymbolFile/DWARF/split-dwarf-multiple-cu.ll (698 of 1977) PASS: lldb-api :: lang/cpp/namespace_conflicts/TestNamespaceConflicts.py (699 of 1977) PASS: lldb-shell :: SymbolFile/DWARF/DW_AT_low_pc-addrx.s (700 of 1977) PASS: lldb-shell :: BuildScript/toolchain-clang.test (701 of 1977) PASS: lldb-shell :: SymbolFile/DWARF/find-basic-type.cpp (702 of 1977) PASS: lldb-shell :: SymbolFile/Breakpad/stack-cfi-parsing.test (703 of 1977) PASS: lldb-unit :: Utility/./UtilityTests/StreamTeeTest.Constructor1Stream (704 of 1977) PASS: lldb-api :: functionalities/data-formatter/compactvectors/TestCompactVectors.py (705 of 1977) PASS: lldb-api :: commands/statistics/basic/TestStats.py (706 of 1977) PASS: lldb-api :: functionalities/rerun/TestRerun.py (707 of 1977) XFAIL: lldb-shell :: Register/x86-mm-xmm-write.test (708 of 1977) PASS: lldb-api :: commands/platform/basic/TestPlatformCommand.py (709 of 1977) PASS: lldb-unit :: Utility/./UtilityTests/UserIDResolver.GetGroupName (710 of 1977) PASS: lldb-shell :: Breakpoint/split-dwarf5-debug-stroffsets.test (711 of 1977) PASS: lldb-api :: lang/cpp/breakpoint_in_member_func_w_non_primitive_params/TestBreakpointInMemberFuncWNonPrimitiveParams.py (712 of 1977) PASS: lldb-unit :: Utility/./UtilityTests/FileSpecTest.GetPath (713 of 1977) PASS: lldb-unit :: SymbolFile/NativePDB/./SymbolFileNativePDBTests/PDBFPOProgramToDWARFExpressionTests.UnsupportedRASearch (714 of 1977) PASS: lldb-api :: commands/expression/import-std-module/sysroot/TestStdModuleSysroot.py (715 of 1977) PASS: lldb-unit :: Utility/./UtilityTests/StringExtractorTest.GetHexBytesAvail_FullString (716 of 1977) PASS: lldb-unit :: UnwindAssembly/x86/./UnwindAssemblyx86Tests/Testx86AssemblyInspectionEngine.TestSpArithx86_64Augmented (717 of 1977) PASS: lldb-unit :: Utility/./UtilityTests/DataExtractorTest.GetBitfield (718 of 1977) PASS: lldb-unit :: ScriptInterpreter/Python/./ScriptInterpreterPythonTests/PythonDataObjectsTest.TestExceptions (719 of 1977) PASS: lldb-api :: functionalities/thread/exit_during_step/TestExitDuringStep.py (720 of 1977) PASS: lldb-unit :: Utility/./UtilityTests/StringListTest.JoinSingle (721 of 1977) PASS: lldb-unit :: Utility/./UtilityTests/OptionsWithRawTest.TerminatedQuote (722 of 1977) PASS: lldb-unit :: Utility/./UtilityTests/StreamTest.PutBytesAsRawHex8ToMixedEndian (723 of 1977) PASS: lldb-api :: lang/c/step-target/TestStepTarget.py (724 of 1977) PASS: lldb-api :: functionalities/var_path/TestVarPath.py (725 of 1977) PASS: lldb-shell :: ObjectFile/PECOFF/sections.yaml (726 of 1977) PASS: lldb-api :: functionalities/step_scripted/TestStepScripted.py (727 of 1977) PASS: lldb-api :: lang/c/shared_lib/TestSharedLib.py (728 of 1977) PASS: lldb-unit :: Host/./HostTests/Host.WaitStatusFormat (729 of 1977) PASS: lldb-api :: lang/cpp/frame-var-anon-unions/TestFrameVariableAnonymousUnions.py (730 of 1977) PASS: lldb-unit :: Utility/./UtilityTests/BinaryStreamTest.PutSLEB128OneByte (731 of 1977) PASS: lldb-shell :: Commands/CommandScriptImmediateOutput/CommandScriptImmediateOutputFile.test (732 of 1977) PASS: lldb-unit :: Utility/./UtilityTests/StringExtractorTest.GetHexBytesAvail_OddPair2 (733 of 1977) PASS: lldb-unit :: Utility/./UtilityTests/StringListTest.AppendListCStringArrayEmpty (734 of 1977) PASS: lldb-unit :: SymbolFile/DWARF/./SymbolFileDWARFTests/SymbolFileDWARFTests.TestAbbrevValidAttrNullForm (735 of 1977) PASS: lldb-api :: python_api/exprpath_synthetic/TestExprPathSynthetic.py (736 of 1977) PASS: lldb-unit :: Utility/./UtilityTests/NameMatchesTest.EndsWith (737 of 1977) PASS: lldb-unit :: Utility/./UtilityTests/StringExtractorTest.GetHexBytesAvail (738 of 1977) PASS: lldb-unit :: ScriptInterpreter/Python/./ScriptInterpreterPythonTests/PythonDataObjectsTest.TestGlobalNameResolutionNoDot (739 of 1977) PASS: lldb-api :: commands/expression/xvalue/TestXValuePrinting.py (740 of 1977) PASS: lldb-api :: lang/objc/objc-class-method/TestObjCClassMethod.py (741 of 1977) PASS: lldb-unit :: Utility/./UtilityTests/StringListTest.LongestCommonPrefixDuplicateElement (742 of 1977) PASS: lldb-api :: functionalities/memory/read/TestMemoryRead.py (743 of 1977) PASS: lldb-shell :: Breakpoint/dummy-target.test (744 of 1977) PASS: lldb-unit :: Utility/./UtilityTests/ScalarTest.ComparisonFloat (745 of 1977) PASS: lldb-unit :: Utility/./UtilityTests/StringExtractorTest.GetU64LittleEndian (746 of 1977) PASS: lldb-shell :: SymbolFile/NativePDB/globals-fundamental.cpp (747 of 1977) PASS: lldb-unit :: Host/./HostTests/SocketTest.UDPConnect (748 of 1977) PASS: lldb-shell :: Minidump/Windows/find-module.test (749 of 1977) PASS: lldb-api :: functionalities/breakpoint/cpp_exception/TestCPPExceptionBreakpoint.py (750 of 1977) PASS: lldb-unit :: ObjectFile/Breakpad/./ObjectFileBreakpadTests/InfoRecord.parse (751 of 1977) PASS: lldb-unit :: Utility/./UtilityTests/StreamTest.AddressSuffix (752 of 1977) PASS: lldb-unit :: Process/minidump/./LLDBMinidumpTests/RegisterContextMinidump.ConvertMinidumpContext_x86_64 (753 of 1977) PASS: lldb-api :: functionalities/multiword-commands/TestMultiWordCommands.py (754 of 1977) PASS: lldb-unit :: Utility/./UtilityTests/FileSpecTest.FileAndDirectoryComponents (755 of 1977) PASS: lldb-shell :: ObjectFile/MachO/lc_version_min.yaml (756 of 1977) PASS: lldb-shell :: SymbolFile/DWARF/debug_loclists-dwo.s (757 of 1977) PASS: lldb-unit :: Host/./HostTests/File.GetStreamFromDescriptor (758 of 1977) PASS: lldb-api :: lang/c/find_struct_type/TestFindStructTypes.py (759 of 1977) PASS: lldb-unit :: Utility/./UtilityTests/RangeTest.ContainsAddrInvalid (760 of 1977) PASS: lldb-unit :: Expression/./ExpressionTests/DWARFExpression.DW_OP_convert (761 of 1977) PASS: lldb-unit :: Utility/./UtilityTests/StringExtractorTest.GetHexBytes_Partial (762 of 1977) PASS: lldb-api :: lang/mixed/TestMixedLanguages.py (763 of 1977) PASS: lldb-shell :: ObjectFile/Breakpad/uuid-matching-mac.test (764 of 1977) PASS: lldb-unit :: Utility/./UtilityTests/StreamTeeTest.Assignment (765 of 1977) PASS: lldb-unit :: UnwindAssembly/x86/./UnwindAssemblyx86Tests/Testx86AssemblyInspectionEngine.TestPushESI (766 of 1977) PASS: lldb-api :: functionalities/data-formatter/var-in-aggregate-misuse/TestVarInAggregateMisuse.py (767 of 1977) PASS: lldb-unit :: Utility/./UtilityTests/VMRange.Ordering (768 of 1977) PASS: lldb-api :: functionalities/gdb_remote_client/TestRestartBug.py (769 of 1977) PASS: lldb-unit :: Utility/./UtilityTests/ProcessInstanceInfo.Dump (770 of 1977) PASS: lldb-unit :: Utility/./UtilityTests/StringExtractorTest.DecodeHexU8_Underflow2 (771 of 1977) PASS: lldb-unit :: Utility/./UtilityTests/SerializationRountripTest.SerializeDeserializePodReferences (772 of 1977) UNSUPPORTED: lldb-shell :: Register/aarch64-fp-read.test (773 of 1977) UNSUPPORTED: lldb-api :: functionalities/exec/TestExec.py (774 of 1977) PASS: lldb-unit :: ObjectFile/Breakpad/./ObjectFileBreakpadTests/LineRecord.parse (775 of 1977) PASS: lldb-unit :: Symbol/./SymbolTests/TestTypeSystemClang.TestRemoveFastQualifiers (776 of 1977) PASS: lldb-unit :: Utility/./UtilityTests/SerializationRountripTest.SerializeDeserializeCStringNull (777 of 1977) PASS: lldb-api :: functionalities/breakpoint/breakpoint_command/TestBreakpointCommand.py (778 of 1977) PASS: lldb-api :: functionalities/breakpoint/inlined_breakpoints/TestInlinedBreakpoints.py (779 of 1977) PASS: lldb-api :: lang/c/shared_lib_stripped_symbols/TestSharedLibStrippedSymbols.py (780 of 1977) PASS: lldb-api :: functionalities/data-formatter/data-formatter-synthtype/TestDataFormatterSynthType.py (781 of 1977) PASS: lldb-api :: commands/expression/save_jit_objects/TestSaveJITObjects.py (782 of 1977) UNSUPPORTED: lldb-api :: linux/mix-dwo-and-regular-objects/TestMixedDwarfBinary.py (783 of 1977) PASS: lldb-shell :: SymbolFile/DWARF/dwarf5-index-is-used.cpp (784 of 1977) PASS: lldb-unit :: Host/./HostTests/FileSystemTest.GetByteSize (785 of 1977) PASS: lldb-api :: functionalities/postmortem/minidump-new/TestMiniDumpNew.py (786 of 1977) UNSUPPORTED: lldb-shell :: Register/x86-64-ymm16-read.test (787 of 1977) PASS: lldb-api :: functionalities/data-formatter/setvaluefromcstring/TestSetValueFromCString.py (788 of 1977) UNSUPPORTED: lldb-shell :: Register/x86-gp-read.test (789 of 1977) PASS: lldb-unit :: Symbol/./SymbolTests/TestTypeSystemClang.TestUnifyAccessSpecifiers (790 of 1977) UNSUPPORTED: lldb-shell :: SymbolFile/PDB/udt-layout.test (791 of 1977) PASS: lldb-api :: lang/objc/modules-inline-functions/TestModulesInlineFunctions.py (792 of 1977) UNSUPPORTED: lldb-shell :: Register/aarch64-gp-read.test (793 of 1977) PASS: lldb-unit :: Signals/./SignalsTests/UnixSignalsTest.Iteration (794 of 1977) PASS: lldb-api :: lang/objc/objc-stepping/TestObjCStepping.py (795 of 1977) PASS: lldb-unit :: Utility/./UtilityTests/RangeDataVector.CustomSort (796 of 1977) PASS: lldb-unit :: Utility/./UtilityTests/CompletionRequest.ShiftArguments (797 of 1977) PASS: lldb-unit :: Utility/./UtilityTests/FileSpecTest.EqualDotsWindows (798 of 1977) PASS: lldb-api :: functionalities/thread/concurrent_events/TestConcurrentTwoBreakpointsOneWatchpoint.py (799 of 1977) PASS: lldb-api :: functionalities/memory/cache/TestMemoryCache.py (800 of 1977) PASS: lldb-unit :: Utility/./UtilityTests/StreamTest.AddressRangeInvalidRange (801 of 1977) XFAIL: lldb-shell :: Register/x86-64-write.test (802 of 1977) PASS: lldb-unit :: Language/Highlighting/./HighlighterTests/HighlighterTest.ClangCursorPosEndOfLine (803 of 1977) PASS: lldb-unit :: Signals/./SignalsTests/UnixSignalsTest.GetFilteredSignals (804 of 1977) UNSUPPORTED: lldb-api :: iohandler/unicode/TestUnicode.py (805 of 1977) PASS: lldb-unit :: Utility/./UtilityTests/StringLexerTest.NextIf (806 of 1977) UNSUPPORTED: lldb-shell :: Register/x86-gp-write.test (807 of 1977) PASS: lldb-unit :: Utility/./UtilityTests/RangeDataVector.FindEntryThatContains_Overlap (808 of 1977) PASS: lldb-shell :: Reproducer/TestFileRepro.test (809 of 1977) PASS: lldb-api :: commands/target/stop-hooks/TestStopHooks.py (810 of 1977) PASS: lldb-unit :: Utility/./UtilityTests/ProcessInstanceInfoList.Yaml (811 of 1977) PASS: lldb-api :: types/TestFloatTypesExpr.py (812 of 1977) PASS: lldb-api :: lang/cpp/dynamic-value/TestCppValueCast.py (813 of 1977) UNSUPPORTED: lldb-api :: commands/watchpoints/variable_out_of_scope/TestWatchedVarHitWhenInScope.py (814 of 1977) PASS: lldb-unit :: Core/./LLDBCoreTests/MangledTest.ResultForBlockInvocation (815 of 1977) PASS: lldb-unit :: UnwindAssembly/x86/./UnwindAssemblyx86Tests/Testx86AssemblyInspectionEngine.TestPopRBPWithREX (816 of 1977) UNSUPPORTED: lldb-api :: tools/lldb-server/platform-process-connect/TestPlatformProcessConnect.py (817 of 1977) PASS: lldb-api :: functionalities/data-formatter/data-formatter-globals/TestDataFormatterGlobals.py (818 of 1977) PASS: lldb-unit :: Utility/./UtilityTests/AnsiTerminal.Basic (819 of 1977) PASS: lldb-unit :: Utility/./UtilityTests/ArgsTest.TestTrailingBackslash (820 of 1977) PASS: lldb-api :: macosx/find-app-in-bundle/TestFindAppInBundle.py (821 of 1977) PASS: lldb-api :: commands/expression/cast_int_to_anonymous_enum/TestCastIntToAnonymousEnum.py (822 of 1977) PASS: lldb-unit :: Process/gdb-remote/./ProcessGdbRemoteTests/GDBRemoteClientBaseTest.InterruptNoResponse (823 of 1977) PASS: lldb-unit :: Language/Highlighting/./HighlighterTests/HighlighterTest.DefaultHighlighter (824 of 1977) PASS: lldb-unit :: Utility/./UtilityTests/StreamTest.PutBytesAsRawHex8ToLittleEndian (825 of 1977) PASS: lldb-api :: lang/cpp/enum_types/TestCPP11EnumTypes.py (826 of 1977) PASS: lldb-unit :: Process/minidump/./LLDBMinidumpTests/MinidumpParserTest.GetMemory (827 of 1977) PASS: lldb-api :: types/TestCharTypeExpr.py (828 of 1977) PASS: lldb-api :: functionalities/mtc/simple/TestMTCSimple.py (829 of 1977) PASS: lldb-api :: tools/lldb-server/TestGdbRemoteProcessInfo.py (830 of 1977) PASS: lldb-unit :: Utility/./UtilityTests/DataExtractorTest.GetMaxU64 (831 of 1977) PASS: lldb-unit :: Utility/./UtilityTests/NameMatchesTest.Ignore (832 of 1977) PASS: lldb-shell :: Unwind/trap_frame_sym_ctx.test (833 of 1977) PASS: lldb-api :: tools/lldb-server/TestGdbRemoteKill.py (834 of 1977) PASS: lldb-unit :: Utility/./UtilityTests/AnsiTerminal.Empty (835 of 1977) PASS: lldb-unit :: Utility/./UtilityTests/CompletionRequest.TryCompleteCurrentArgMode (836 of 1977) PASS: lldb-api :: functionalities/breakpoint/breakpoint_ignore_count/TestBreakpointIgnoreCount.py (837 of 1977) PASS: lldb-api :: functionalities/data-formatter/data-formatter-objc/TestDataFormatterObjCNSDate.py (838 of 1977) PASS: lldb-shell :: SymbolFile/DWARF/debug_rnglists.s (839 of 1977) PASS: lldb-api :: functionalities/breakpoint/source_regexp/TestSourceRegexBreakpoints.py (840 of 1977) PASS: lldb-unit :: Utility/./UtilityTests/StringListTest.PopBack (841 of 1977) XFAIL: lldb-shell :: Register/x86-64-ymm-write.test (842 of 1977) PASS: lldb-api :: functionalities/thread/thread_exit/TestThreadExit.py (843 of 1977) PASS: lldb-api :: commands/disassemble/basic/TestFrameDisassemble.py (844 of 1977) PASS: lldb-shell :: Reproducer/TestDiscard.test (845 of 1977) PASS: lldb-unit :: Utility/./UtilityTests/Predicate.WaitForValueNotEqualTo (846 of 1977) PASS: lldb-shell :: SymbolFile/NativePDB/source-list.cpp (847 of 1977) PASS: lldb-api :: functionalities/data-formatter/format-propagation/TestFormatPropagation.py (848 of 1977) UNSUPPORTED: lldb-api :: lang/objc/foundation/TestFoundationDisassembly.py (849 of 1977) PASS: lldb-unit :: Utility/./UtilityTests/StringListTest.SetSize (850 of 1977) PASS: lldb-api :: arm/emulation/TestEmulations.py (851 of 1977) PASS: lldb-api :: commands/frame/diagnose/dereference-argument/TestDiagnoseDereferenceArgument.py (852 of 1977) PASS: lldb-api :: functionalities/data-formatter/nsdictionarysynth/TestNSDictionarySynthetic.py (853 of 1977) PASS: lldb-api :: commands/expression/import-std-module/weak_ptr/TestWeakPtrFromStdModule.py (854 of 1977) PASS: lldb-unit :: Utility/./UtilityTests/StringListTest.InsertStringAtIndexMove (855 of 1977) PASS: lldb-unit :: Language/Highlighting/./HighlighterTests/HighlighterTest.ClangIdentifiers (856 of 1977) PASS: lldb-unit :: SymbolFile/DWARF/./SymbolFileDWARFTests/SymbolFileDWARFTests.TestAbbrevOrder1Start5 (857 of 1977) PASS: lldb-unit :: Platform/./LLDBPlatformTests/PlatformDarwinTest.FindXcodeContentsDirectoryInPath (858 of 1977) PASS: lldb-unit :: Language/Highlighting/./HighlighterTests/HighlighterTest.ClangPPDirectives (859 of 1977) PASS: lldb-api :: commands/settings/TestSettings.py (860 of 1977) PASS: lldb-api :: functionalities/inferior-crashing/TestInferiorCrashingStep.py (861 of 1977) PASS: lldb-api :: functionalities/breakpoint/address_breakpoints/TestAddressBreakpoints.py (862 of 1977) PASS: lldb-unit :: Utility/./UtilityTests/UserIDResolver.GetUserName (863 of 1977) PASS: lldb-unit :: Utility/./UtilityTests/StreamTeeTest.DefaultConstructor (864 of 1977) PASS: lldb-shell :: SymbolFile/DWARF/deterministic-build.cpp (865 of 1977) PASS: lldb-api :: lang/c/blocks/TestBlocks.py (866 of 1977) PASS: lldb-unit :: UnwindAssembly/x86/./UnwindAssemblyx86Tests/Testx86AssemblyInspectionEngine.TestPushR12 (867 of 1977) PASS: lldb-shell :: Reproducer/TestCaptureEnvOverride.test (868 of 1977) PASS: lldb-api :: lang/c/stepping/TestStepAndBreakpoints.py (869 of 1977) PASS: lldb-unit :: UnwindAssembly/x86/./UnwindAssemblyx86Tests/Testx86AssemblyInspectionEngine.TestPopR13 (870 of 1977) PASS: lldb-unit :: Utility/./UtilityTests/AnsiTerminal.AtEnd (871 of 1977) PASS: lldb-unit :: Language/Highlighting/./HighlighterTests/HighlighterTest.ClangCursorPosInOtherToken (872 of 1977) PASS: lldb-shell :: Commands/command-backtrace.test (873 of 1977) PASS: lldb-api :: functionalities/gdb_remote_client/TestStopPCs.py (874 of 1977) PASS: lldb-shell :: SymbolFile/DWARF/debug-line-basic.s (875 of 1977) PASS: lldb-api :: functionalities/tail_call_frames/thread_step_out_or_return/TestSteppingOutWithArtificialFrames.py (876 of 1977) PASS: lldb-unit :: Host/./HostTests/MainLoopTest.TerminatesImmediately (877 of 1977) PASS: lldb-unit :: Utility/./UtilityTests/UUIDTest.StringConverion (878 of 1977) PASS: lldb-api :: commands/frame/diagnose/dereference-this/TestDiagnoseDereferenceThis.py (879 of 1977) PASS: lldb-api :: python_api/class_members/TestSBTypeClassMembers.py (880 of 1977) PASS: lldb-api :: sample_test/TestSampleTest.py (881 of 1977) UNSUPPORTED: lldb-shell :: SymbolFile/NativePDB/local-variables.cpp (882 of 1977) PASS: lldb-api :: lang/c/global_variables/TestGlobalVariables.py (883 of 1977) PASS: lldb-unit :: Symbol/./SymbolTests/TestClangASTImporter.CopyDeclTagDecl (884 of 1977) PASS: lldb-shell :: SymbolFile/Breakpad/unwind-via-stack-cfi.test (885 of 1977) PASS: lldb-unit :: Utility/./UtilityTests/StringListTest.SplitIntoLinesEmpty (886 of 1977) UNSUPPORTED: lldb-api :: lang/objc/rdar-12408181/TestRdar12408181.py (887 of 1977) PASS: lldb-unit :: ScriptInterpreter/Python/./ScriptInterpreterPythonTests/PythonDataObjectsTest.TestPythonBytes (888 of 1977) PASS: lldb-shell :: SymbolFile/DWARF/parallel-indexing-stress.s (889 of 1977) PASS: lldb-unit :: Utility/./UtilityTests/ScalarTest.Promotion (890 of 1977) PASS: lldb-unit :: Utility/./UtilityTests/SerializationRountripTest.SerializeDeserializeCStringArray (891 of 1977) PASS: lldb-unit :: Utility/./UtilityTests/StringExtractorTest.GetHexU8_Underflow2_NoEof (892 of 1977) PASS: lldb-unit :: Utility/./UtilityTests/ConstStringTest.CompareConstString (893 of 1977) PASS: lldb-api :: functionalities/backticks/TestBackticksWithoutATarget.py (894 of 1977) PASS: lldb-shell :: Driver/TestTarget.test (895 of 1977) PASS: lldb-api :: functionalities/breakpoint/breakpoint_command/TestRegexpBreakCommand.py (896 of 1977) PASS: lldb-unit :: ObjectFile/Breakpad/./ObjectFileBreakpadTests/StackCFIRecord.parse (897 of 1977) PASS: lldb-unit :: Language/Highlighting/./HighlighterTests/HighlighterTest.ClangEmptyInput (898 of 1977) PASS: lldb-unit :: Utility/./UtilityTests/RecordReplayTest.InstrumentedFoo (899 of 1977) PASS: lldb-shell :: Reproducer/Modules/TestModuleCXX.test (900 of 1977) PASS: lldb-api :: commands/add-dsym/uuid/TestAddDsymCommand.py (901 of 1977) PASS: lldb-api :: lang/objc/objc-ivar-protocols/TestIvarProtocols.py (902 of 1977) PASS: lldb-shell :: Settings/TestLineMarkerColor.test (903 of 1977) PASS: lldb-api :: tools/lldb-server/TestAppleSimulatorOSType.py (904 of 1977) PASS: lldb-unit :: Utility/./UtilityTests/StringExtractorTest.DecodeHexU8_Underflow (905 of 1977) PASS: lldb-api :: functionalities/data-formatter/data-formatter-proper-plurals/TestFormattersOneIsSingular.py (906 of 1977) PASS: lldb-api :: macosx/find-dsym/deep-bundle/TestDeepBundle.py (907 of 1977) PASS: lldb-unit :: debugserver/./debugserverTests/RNBSocket.LoopBackConnectIPv6 (908 of 1977) PASS: lldb-api :: lang/cpp/unicode-literals/TestUnicodeLiterals.py (909 of 1977) PASS: lldb-unit :: Utility/./UtilityTests/RangeTest.Union (910 of 1977) PASS: lldb-api :: functionalities/data-formatter/data-formatter-objc/TestDataFormatterObjCNSContainer.py (911 of 1977) PASS: lldb-unit :: ScriptInterpreter/Python/./ScriptInterpreterPythonTests/PythonDataObjectsTest.TestPythonTupleInitializerList2 (912 of 1977) PASS: lldb-unit :: Utility/./UtilityTests/TildeExpressionResolver.ResolveFullPath (913 of 1977) PASS: lldb-api :: types/TestRecursiveTypes.py (914 of 1977) PASS: lldb-api :: lang/cpp/gmodules/TestWithModuleDebugging.py (915 of 1977) PASS: lldb-api :: commands/expression/completion-in-lambda-and-unnamed-class/TestCompletionInLambdaAndUnnamedClass.py (916 of 1977) PASS: lldb-unit :: Symbol/./SymbolTests/TestTypeSystemClang.TestBuiltinTypeForEncodingAndBitSize (917 of 1977) PASS: lldb-api :: python_api/watchpoint/TestSetWatchpoint.py (918 of 1977) UNSUPPORTED: lldb-api :: functionalities/ubsan/basic/TestUbsanBasic.py (919 of 1977) PASS: lldb-shell :: SymbolFile/NativePDB/s_constant.cpp (920 of 1977) PASS: lldb-api :: lang/objcxx/class-name-clash/TestNameClash.py (921 of 1977) PASS: lldb-unit :: Utility/./UtilityTests/StringLexerTest.PutBack (922 of 1977) PASS: lldb-unit :: Expression/./ExpressionTests/ClangHostTest.MacOSX (923 of 1977) PASS: lldb-unit :: Utility/./UtilityTests/AnsiTerminal.Incomplete (924 of 1977) PASS: lldb-api :: functionalities/postmortem/wow64_minidump/TestWow64MiniDump.py (925 of 1977) PASS: lldb-unit :: Utility/./UtilityTests/ArchSpecTest.YAML (926 of 1977) PASS: lldb-api :: python_api/debugger/TestDebuggerAPI.py (927 of 1977) UNSUPPORTED: lldb-api :: functionalities/breakpoint/breakpoint_callback_command_source/TestBreakpointCallbackCommandSource.py (928 of 1977) PASS: lldb-unit :: Utility/./UtilityTests/StringListTest.JoinEmpty (929 of 1977) PASS: lldb-unit :: ObjectFile/ELF/./ObjectFileELFTests/ObjectFileELFTest.GetSymtab_NoSymEntryPointArmThumbAddressClass (930 of 1977) PASS: lldb-unit :: Utility/./UtilityTests/StreamTeeTest.GetStreamAtIndexOutOfBoundsEmpty (931 of 1977) UNSUPPORTED: lldb-api :: benchmarks/libcxxlist/TestBenchmarkLibcxxList.py (932 of 1977) UNSUPPORTED: lldb-api :: iohandler/completion/TestIOHandlerCompletion.py (933 of 1977) PASS: lldb-unit :: Utility/./UtilityTests/StreamTest.SetIndentLevel (934 of 1977) PASS: lldb-unit :: Process/minidump/./LLDBMinidumpTests/MinidumpParserTest.GetThreadContext_x86_32 (935 of 1977) PASS: lldb-unit :: Utility/./UtilityTests/UriParserTest.BadPort (936 of 1977) PASS: lldb-shell :: SymbolFile/DWARF/debug-names-compressed.cpp (937 of 1977) PASS: lldb-api :: commands/expression/test/TestExprs.py (938 of 1977) UNSUPPORTED: lldb-api :: functionalities/data-formatter/data-formatter-stl/libstdcpp/iterator/TestDataFormatterStdIterator.py (939 of 1977) PASS: lldb-unit :: Interpreter/./InterpreterTests/CompletionTest.DirCompletionUsername (940 of 1977) PASS: lldb-unit :: Process/gdb-remote/./ProcessGdbRemoteTests/GDBRemoteClientBaseTest.SendContinueAndInterrupt2PacketBug (941 of 1977) PASS: lldb-unit :: Utility/./UtilityTests/StringExtractorTest.GetHexBytes_OddPair2 (942 of 1977) PASS: lldb-shell :: Commands/command-thread-select.test (943 of 1977) PASS: lldb-unit :: SymbolFile/NativePDB/./SymbolFileNativePDBTests/PDBFPOProgramToDWARFExpressionTests.UnknownOp (944 of 1977) PASS: lldb-shell :: SymbolFile/NativePDB/tag-types.cpp (945 of 1977) PASS: lldb-api :: functionalities/data-formatter/data-formatter-stl/libcxx/bitset/TestDataFormatterLibcxxBitset.py (946 of 1977) PASS: lldb-api :: lang/cpp/namespace/TestNamespace.py (947 of 1977) PASS: lldb-unit :: Utility/./UtilityTests/ListenerTest.GetEventWait (948 of 1977) PASS: lldb-shell :: SymbolFile/DWARF/find-qualified-variable.cpp (949 of 1977) PASS: lldb-api :: functionalities/data-formatter/data-formatter-categories/TestDataFormatterCategories.py (950 of 1977) PASS: lldb-api :: functionalities/thread/concurrent_events/TestConcurrentDelaySignalWatch.py (951 of 1977) PASS: lldb-api :: functionalities/unwind/noreturn/TestNoreturnUnwind.py (952 of 1977) PASS: lldb-api :: commands/expression/issue_11588/Test11588.py (953 of 1977) PASS: lldb-api :: functionalities/inferior-assert/TestInferiorAssert.py (954 of 1977) PASS: lldb-api :: functionalities/thread/concurrent_events/TestConcurrentManyWatchpoints.py (955 of 1977) PASS: lldb-unit :: Utility/./UtilityTests/TimerTest.CategoryTimes2 (956 of 1977) PASS: lldb-unit :: Language/Highlighting/./HighlighterTests/HighlighterTest.ClangComments (957 of 1977) PASS: lldb-unit :: Host/./HostTests/FileSystemTest.Resolve (958 of 1977) PASS: lldb-api :: functionalities/source-map/TestTargetSourceMap.py (959 of 1977) PASS: lldb-unit :: Utility/./UtilityTests/UriParserTest.SchemeHostSeparator2 (960 of 1977) PASS: lldb-unit :: Utility/./UtilityTests/ProcessInstanceInfo.Yaml (961 of 1977) PASS: lldb-unit :: Utility/./UtilityTests/StreamTest.AddressPrefixAndSuffix (962 of 1977) PASS: lldb-api :: lang/cpp/global_variables/TestCPPGlobalVariables.py (963 of 1977) PASS: lldb-shell :: Reproducer/TestDriverOptions.test (964 of 1977) UNSUPPORTED: lldb-api :: functionalities/darwin_log/filter/exact_match/subsystem/TestDarwinLogFilterMatchSubsystem.py (965 of 1977) PASS: lldb-api :: functionalities/tail_call_frames/thread_step_out_message/TestArtificialFrameStepOutMessage.py (966 of 1977) PASS: lldb-api :: commands/watchpoints/watchpoint_commands/condition/TestWatchpointConditionCmd.py (967 of 1977) PASS: lldb-unit :: Utility/./UtilityTests/Predicate.WaitForValueEqualTo (968 of 1977) PASS: lldb-api :: functionalities/breakpoint/breakpoint_hit_count/TestBreakpointHitCount.py (969 of 1977) PASS: lldb-shell :: Reproducer/TestDump.test (970 of 1977) UNSUPPORTED: lldb-shell :: SymbolFile/PDB/variables.test (971 of 1977) PASS: lldb-unit :: Utility/./UtilityTests/ArgsTest.TestOverwriteArgs (972 of 1977) PASS: lldb-api :: lang/c/register_variables/TestRegisterVariables.py (973 of 1977) PASS: lldb-unit :: Utility/./UtilityTests/StringListTest.ForRangeEmpty (974 of 1977) PASS: lldb-unit :: Process/minidump/./LLDBMinidumpTests/MinidumpParserTest.GetArchitecture (975 of 1977) PASS: lldb-unit :: Language/Highlighting/./HighlighterTests/HighlighterTest.ClangTrailingBackslashMissingNewLine (976 of 1977) PASS: lldb-unit :: Utility/./UtilityTests/UriParserTest.SchemeHostSeparator4 (977 of 1977) PASS: lldb-api :: lang/cpp/const_this/TestConstThis.py (978 of 1977) PASS: lldb-unit :: Utility/./UtilityTests/StringExtractorTest.GetHexU8_Underflow_NoEof (979 of 1977) PASS: lldb-api :: functionalities/unwind/noreturn/module-end/TestNoReturnModuleEnd.py (980 of 1977) UNSUPPORTED: lldb-shell :: SymbolFile/PDB/ast-restore.test (981 of 1977) PASS: lldb-api :: types/TestShortType.py (982 of 1977) PASS: lldb-api :: commands/expression/call-function/TestCallBuiltinFunction.py (983 of 1977) PASS: lldb-unit :: Expression/./ExpressionTests/DiagnosticManagerTest.AddDiagnostic (984 of 1977) PASS: lldb-api :: functionalities/data-formatter/vector-types/TestVectorTypesFormatting.py (985 of 1977) PASS: lldb-unit :: UnwindAssembly/x86/./UnwindAssemblyx86Tests/Testx86AssemblyInspectionEngine.TestMovRSPtoRBP (986 of 1977) PASS: lldb-unit :: Utility/./UtilityTests/RangeTest.ContainsRangeStartingFromZero (987 of 1977) PASS: lldb-unit :: debugserver/./debugserverTests/RNBSocket.AnyListen (988 of 1977) PASS: lldb-shell :: Reproducer/TestMultipleTargets.test (989 of 1977) PASS: lldb-shell :: SymbolFile/DWARF/dir-separator-no-comp-dir.s (990 of 1977) PASS: lldb-unit :: Symbol/./SymbolTests/TestTypeSystemClang.TestGetTypeClassTypeOfExpr (991 of 1977) PASS: lldb-unit :: Utility/./UtilityTests/StringExtractorTest.GetHexU8_Extra_NoEof (992 of 1977) PASS: lldb-api :: lang/c/function_types/TestFunctionTypes.py (993 of 1977) PASS: lldb-api :: commands/expression/argument_passing_restrictions/TestArgumentPassingRestrictions.py (994 of 1977) PASS: lldb-unit :: Expression/./ExpressionTests/DiagnosticManagerTest.AppendMessageAttachToLastDiag (995 of 1977) PASS: lldb-api :: lang/cpp/accelerator-table/TestCPPAccelerator.py (996 of 1977) PASS: lldb-unit :: Utility/./UtilityTests/StreamTest.PutHex16ByteOrderBig (997 of 1977) PASS: lldb-unit :: Utility/./UtilityTests/StringListTest.GetMaxStringLengthEmpty (998 of 1977) PASS: lldb-shell :: Quit/TestQuitExitCode30.test (999 of 1977) PASS: lldb-shell :: ObjectFile/PECOFF/basic-info.yaml (1000 of 1977) PASS: lldb-unit :: Process/minidump/./LLDBMinidumpTests/MinidumpParserTest.GetFilteredModuleList (1001 of 1977) PASS: lldb-unit :: debugserver/./debugserverTests/RNBSocket.LoopBackConnectIPv4 (1002 of 1977) PASS: lldb-shell :: ObjectFile/ELF/minidebuginfo-corrupt-xz.yaml (1003 of 1977) PASS: lldb-api :: python_api/frame/TestFrames.py (1004 of 1977) PASS: lldb-unit :: Language/Highlighting/./HighlighterTests/HighlighterTest.ClangCursorOutOfBounds (1005 of 1977) PASS: lldb-shell :: SymbolFile/Breakpad/line-table-mixed-path-styles.test (1006 of 1977) PASS: lldb-api :: types/TestLongTypesExpr.py (1007 of 1977) PASS: lldb-shell :: Settings/TestFrameFormatNoColor.test (1008 of 1977) PASS: lldb-unit :: Utility/./UtilityTests/StringExtractorTest.DecodeHexU8_InvalidHex2 (1009 of 1977) PASS: lldb-unit :: Utility/./UtilityTests/BinaryStreamTest.PutSLEB128SevenBytes (1010 of 1977) PASS: lldb-api :: lang/c/offsetof/TestOffsetof.py (1011 of 1977) PASS: lldb-unit :: Host/./HostTests/HostInfoTest.GetHostname (1012 of 1977) PASS: lldb-api :: lang/objc/rdar-11355592/TestRdar11355592.py (1013 of 1977) PASS: lldb-api :: functionalities/unwind/sigtramp/TestSigtrampUnwind.py (1014 of 1977) UNSUPPORTED: lldb-shell :: ObjectFile/ELF/minidebuginfo-set-and-hit-breakpoint.test (1015 of 1977) PASS: lldb-api :: functionalities/data-formatter/language_category_updates/TestDataFormatterLanguageCategoryUpdates.py (1016 of 1977) PASS: lldb-unit :: UnwindAssembly/x86/./UnwindAssemblyx86Tests/Testx86AssemblyInspectionEngine.TestPopRBX (1017 of 1977) PASS: lldb-api :: functionalities/type_completion/TestTypeCompletion.py (1018 of 1977) PASS: lldb-unit :: Utility/./UtilityTests/StringListTest.LongestCommonPrefixEmpty (1019 of 1977) PASS: lldb-unit :: Target/./TargetTests/ExecutionContextTest.GetByteOrder (1020 of 1977) PASS: lldb-shell :: BuildScript/compiler-full-path.test (1021 of 1977) PASS: lldb-unit :: Process/minidump/./LLDBMinidumpTests/MinidumpParserTest.GetThreadsAndGetThreadContext (1022 of 1977) PASS: lldb-unit :: ScriptInterpreter/Python/./ScriptInterpreterPythonTests/PythonDataObjectsTest.TestPythonListValueEquality (1023 of 1977) PASS: lldb-unit :: Target/./TargetTests/PathMappingListTest.RemapRoot (1024 of 1977) PASS: lldb-unit :: Language/Highlighting/./HighlighterTests/HighlighterTest.ClangTrailingBackslashBeforeNewline (1025 of 1977) PASS: lldb-api :: functionalities/thread/concurrent_events/TestConcurrentCrashWithWatchpointBreakpointSignal.py (1026 of 1977) PASS: lldb-api :: commands/frame/recognizer/TestFrameRecognizer.py (1027 of 1977) UNSUPPORTED: lldb-api :: commands/expression/completion-crash-invalid-iterator/TestInvalidIteratorCompletionCrash.py (1028 of 1977) PASS: lldb-unit :: Language/CPlusPlus/./LanguageCPlusPlusTests/CPlusPlusLanguage.ExtractContextAndIdentifier (1029 of 1977) PASS: lldb-api :: lang/objc/objc-property/TestObjCProperty.py (1030 of 1977) PASS: lldb-api :: lang/cpp/member-and-local-vars-with-same-name/TestMembersAndLocalsWithSameName.py (1031 of 1977) PASS: lldb-api :: lang/cpp/thread_local/TestThreadLocal.py (1032 of 1977) PASS: lldb-api :: tools/lldb-vscode/breakpoint/TestVSCode_setExceptionBreakpoints.py (1033 of 1977) PASS: lldb-api :: functionalities/data-formatter/data-formatter-synthval/TestDataFormatterSynthVal.py (1034 of 1977) PASS: lldb-unit :: UnwindAssembly/x86/./UnwindAssemblyx86Tests/Testx86AssemblyInspectionEngine.TestPushImm (1035 of 1977) PASS: lldb-api :: commands/frame/select/TestFrameSelect.py (1036 of 1977) PASS: lldb-unit :: Core/./LLDBCoreTests/StreamCallbackTest.Callback (1037 of 1977) PASS: lldb-unit :: Utility/./UtilityTests/StringListTest.GetMaxStringLengthIncreasingSize (1038 of 1977) PASS: lldb-unit :: Utility/./UtilityTests/GeneratorTest.Create (1039 of 1977) PASS: lldb-api :: functionalities/target-new-solib-notifications/TestModuleLoadedNotifys.py (1040 of 1977) PASS: lldb-unit :: Host/./HostTests/FileSystemTest.GetPermissions (1041 of 1977) UNSUPPORTED: lldb-shell :: Register/x86-64-zmm-write.test (1042 of 1977) PASS: lldb-api :: lang/cpp/constructors/TestCppConstructors.py (1043 of 1977) PASS: lldb-unit :: Process/minidump/./LLDBMinidumpTests/MinidumpParserTest.FindMemoryRangeWithFullMemoryMinidump (1044 of 1977) PASS: lldb-shell :: SymbolFile/DWARF/clang-ast-from-dwarf-objc-property.m (1045 of 1977) PASS: lldb-unit :: Utility/./UtilityTests/StreamTest.PutHex8 (1046 of 1977) UNSUPPORTED: lldb-api :: commands/watchpoints/multi_watchpoint_slots/TestWatchpointMultipleSlots.py (1047 of 1977) UNSUPPORTED: lldb-shell :: SymbolFile/dissassemble-entry-point.s (1048 of 1977) PASS: lldb-api :: functionalities/breakpoint/breakpoint_options/TestBreakpointOptions.py (1049 of 1977) PASS: lldb-api :: commands/frame/diagnose/bad-reference/TestBadReference.py (1050 of 1977) PASS: lldb-shell :: SymbolFile/DWARF/debug-types-basic.test (1051 of 1977) PASS: lldb-api :: commands/command/script/TestCommandScript.py (1052 of 1977) PASS: lldb-api :: commands/frame/diagnose/virtual-method-call/TestDiagnoseDereferenceVirtualMethodCall.py (1053 of 1977) PASS: lldb-api :: lang/objc/objc-ivar-stripped/TestObjCIvarStripped.py (1054 of 1977) PASS: lldb-unit :: Process/gdb-remote/./ProcessGdbRemoteTests/GDBRemoteCommunicationClientTest.SendGetTraceConfigPacket (1055 of 1977) PASS: lldb-api :: api/command-return-object/TestSBCommandReturnObject.py (1056 of 1977) PASS: lldb-unit :: Utility/./UtilityTests/UUIDTest.Validity (1057 of 1977) PASS: lldb-shell :: SymbolFile/DWARF/dwarf5-debug_line.s (1058 of 1977) PASS: lldb-unit :: UnwindAssembly/x86/./UnwindAssemblyx86Tests/Testx86AssemblyInspectionEngine.TestStackRealign32BitDisp_x86_64 (1059 of 1977) PASS: lldb-shell :: SymbolFile/DWARF/debug_loc.s (1060 of 1977) PASS: lldb-api :: lang/cpp/nsimport/TestCppNsImport.py (1061 of 1977) PASS: lldb-unit :: Target/./TargetTests/MCBasedABI.MapRegisterName (1062 of 1977) PASS: lldb-api :: functionalities/thread/concurrent_events/TestConcurrentCrashWithSignal.py (1063 of 1977) PASS: lldb-api :: functionalities/data-formatter/data-formatter-stl/libcxx/unique_ptr/TestDataFormatterLibcxxUniquePtr.py (1064 of 1977) PASS: lldb-unit :: ScriptInterpreter/Python/./ScriptInterpreterPythonTests/PythonDataObjectsTest.TestTypeNameResolutionNoDot (1065 of 1977) PASS: lldb-api :: lang/cpp/class_types/TestClassTypes.py (1066 of 1977) PASS: lldb-unit :: Utility/./UtilityTests/FileSpecTest.OperatorBool (1067 of 1977) PASS: lldb-api :: lang/objc/foundation/TestConstStrings.py (1068 of 1977) PASS: lldb-unit :: Utility/./UtilityTests/StreamTest.AddressRangeSize (1069 of 1977) PASS: lldb-shell :: SymbolFile/Breakpad/unwind-via-raSearch.test (1070 of 1977) PASS: lldb-shell :: ObjectFile/ELF/section-overlap.yaml (1071 of 1977) PASS: lldb-unit :: Utility/./UtilityTests/BinaryStreamTest.PutULEB128One (1072 of 1977) PASS: lldb-unit :: Process/gdb-remote/./ProcessGdbRemoteTests/GDBRemoteCommunicationTest.ReadPacket_checksum (1073 of 1977) PASS: lldb-unit :: Host/./HostTests/TaskPoolTest.TaskMap (1074 of 1977) UNSUPPORTED: lldb-api :: functionalities/thread/thread_specific_break_plus_condition/TestThreadSpecificBpPlusCondition.py (1075 of 1977) PASS: lldb-unit :: Utility/./UtilityTests/RangeTest.ContainsEndInclusive (1076 of 1977) UNSUPPORTED: lldb-api :: python_api/event/TestEvents.py (1077 of 1977) PASS: lldb-shell :: ScriptInterpreter/Python/crashlog.test (1078 of 1977) PASS: lldb-shell :: SymbolFile/NativePDB/break-by-function.cpp (1079 of 1977) PASS: lldb-api :: functionalities/breakpoint/scripted_bkpt/TestScriptedResolver.py (1080 of 1977) UNSUPPORTED: lldb-api :: benchmarks/expression/TestExpressionCmd.py (1081 of 1977) PASS: lldb-api :: lang/c/struct_types/TestStructTypes.py (1082 of 1977) PASS: lldb-api :: commands/process/attach/TestProcessAttach.py (1083 of 1977) PASS: lldb-api :: functionalities/tail_call_frames/ambiguous_tail_call_seq1/TestAmbiguousTailCallSeq1.py (1084 of 1977) PASS: lldb-api :: types/TestIntegerType.py (1085 of 1977) PASS: lldb-api :: commands/expression/weak_symbols/TestWeakSymbols.py (1086 of 1977) PASS: lldb-unit :: Expression/./ExpressionTests/DiagnosticManagerTest.GetStringPreserveOrder (1087 of 1977) PASS: lldb-api :: python_api/lldbutil/iter/TestLLDBIterator.py (1088 of 1977) UNSUPPORTED: lldb-shell :: Register/x86-zmm-write.test (1089 of 1977) PASS: lldb-unit :: ObjectFile/PECOFF/./ObjectFilePECOFFTests/PECallFrameInfoTest.Frame_reg_eh (1090 of 1977) PASS: lldb-api :: functionalities/data-formatter/data-formatter-disabling/TestDataFormatterDisabling.py (1091 of 1977) PASS: lldb-unit :: Utility/./UtilityTests/ConstStringTest.format_provider (1092 of 1977) PASS: lldb-api :: python_api/watchpoint/condition/TestWatchpointConditionAPI.py (1093 of 1977) PASS: lldb-unit :: Host/./HostTests/NativeProcessProtocolTest.SetBreakpoint (1094 of 1977) PASS: lldb-shell :: SymbolFile/DWARF/debug_aranges-empty-section.s (1095 of 1977) UNSUPPORTED: lldb-api :: functionalities/data-formatter/data-formatter-stl/libstdcpp/smart_ptr/TestDataFormatterStdSmartPtr.py (1096 of 1977) PASS: lldb-shell :: SymbolFile/Breakpad/line-table-edgecases.test (1097 of 1977) PASS: lldb-unit :: Utility/./UtilityTests/ArgsTest.TestInsertArg (1098 of 1977) PASS: lldb-api :: functionalities/breakpoint/breakpoint_conditions/TestBreakpointConditions.py (1099 of 1977) PASS: lldb-api :: functionalities/postmortem/netbsd-core/TestNetBSDCore.py (1100 of 1977) PASS: lldb-unit :: Utility/./UtilityTests/ConstStringTest.MangledCounterpart (1101 of 1977) PASS: lldb-unit :: Utility/./UtilityTests/StreamTest.PutHex32ByteOrderBig (1102 of 1977) PASS: lldb-unit :: Host/./HostTests/NativeProcessProtocolTest.ReadCStringFromMemory (1103 of 1977) PASS: lldb-api :: python_api/symbol-context/two-files/TestSymbolContextTwoFiles.py (1104 of 1977) PASS: lldb-api :: python_api/lldbutil/frame/TestFrameUtils.py (1105 of 1977) PASS: lldb-unit :: Utility/./UtilityTests/LogChannelEnabledTest.LLDB_LOG_ERROR (1106 of 1977) PASS: lldb-unit :: Utility/./UtilityTests/SerializationRountripTest.SerializeDeserializeObjectReference (1107 of 1977) PASS: lldb-api :: lang/objc/objc-struct-return/TestObjCStructReturn.py (1108 of 1977) PASS: lldb-api :: commands/watchpoints/watchpoint_events/TestWatchpointEvents.py (1109 of 1977) UNSUPPORTED: lldb-api :: lang/c/typedef/Testtypedef.py (1110 of 1977) PASS: lldb-unit :: Utility/./UtilityTests/BinaryStreamTest.PutULEB128OneByte (1111 of 1977) PASS: lldb-api :: python_api/process/read-mem-cstring/TestReadMemCString.py (1112 of 1977) PASS: lldb-unit :: Utility/./UtilityTests/VMRange.ContainsRange (1113 of 1977) PASS: lldb-unit :: Utility/./UtilityTests/FileSpecTest.EqualDotsPosixRoot (1114 of 1977) UNSUPPORTED: lldb-api :: python_api/disassemble-raw-data/TestDisassemble_VST1_64.py (1115 of 1977) PASS: lldb-api :: lang/objc/foundation/TestObjCMethodsNSError.py (1116 of 1977) PASS: lldb-api :: commands/expression/import-std-module/shared_ptr-dbg-info-content/TestSharedPtrDbgInfoContentFromStdModule.py (1117 of 1977) UNSUPPORTED: lldb-shell :: Unwind/eh-frame-small-fde.test (1118 of 1977) PASS: lldb-api :: types/TestFloatTypes.py (1119 of 1977) PASS: lldb-unit :: ObjectFile/Breakpad/./ObjectFileBreakpadTests/PublicRecord.parse (1120 of 1977) PASS: lldb-shell :: Reproducer/TestWorkingDir.test (1121 of 1977) PASS: lldb-unit :: Utility/./UtilityTests/ProcessInstanceInfo.DumpTable_invalidUID (1122 of 1977) PASS: lldb-unit :: Utility/./UtilityTests/StringLexerTest.HasAtLeast (1123 of 1977) UNSUPPORTED: lldb-shell :: SymbolFile/PDB/compilands.test (1124 of 1977) PASS: lldb-unit :: Utility/./UtilityTests/RangeTest.Clear (1125 of 1977) PASS: lldb-api :: commands/frame/diagnose/array/TestArray.py (1126 of 1977) PASS: lldb-shell :: ObjectFile/PECOFF/basic-info-arm64.yaml (1127 of 1977) PASS: lldb-unit :: ScriptInterpreter/Python/./ScriptInterpreterPythonTests/PythonDataObjectsTest.TestModuleNameResolutionNoDot (1128 of 1977) PASS: lldb-shell :: SymbolFile/DWARF/debug-types-dwo-cross-reference.cpp (1129 of 1977) PASS: lldb-unit :: SymbolFile/NativePDB/./SymbolFileNativePDBTests/PDBFPOProgramToDWARFExpressionTests.MissingTargetRegister (1130 of 1977) PASS: lldb-api :: tools/lldb-vscode/variables/TestVSCode_variables.py (1131 of 1977) PASS: lldb-shell :: SymbolFile/DWARF/clang-ast-from-dwarf-unamed-and-anon-structs.cpp (1132 of 1977) PASS: lldb-api :: functionalities/breakpoint/breakpoint_command/TestBreakpointCommandsFromPython.py (1133 of 1977) PASS: lldb-shell :: Breakpoint/single-file-split-dwarf.test (1134 of 1977) PASS: lldb-api :: functionalities/data-formatter/nsarraysynth/TestNSArraySynthetic.py (1135 of 1977) PASS: lldb-api :: macosx/indirect_symbol/TestIndirectSymbols.py (1136 of 1977) PASS: lldb-api :: functionalities/data-formatter/user-format-vs-summary/TestUserFormatVsSummary.py (1137 of 1977) PASS: lldb-unit :: Utility/./UtilityTests/ArgsTest.ReplaceArgumentAtIndexShort (1138 of 1977) PASS: lldb-api :: functionalities/jitloader_gdb/TestJITLoaderGDB.py (1139 of 1977) PASS: lldb-unit :: Host/./HostTests/FileSystemTest.MakeAbsolute (1140 of 1977) PASS: lldb-unit :: Host/./HostTests/SocketAddressTest.GetAddressInfo (1141 of 1977) PASS: lldb-unit :: tools/lldb-server/tests/./LLDBServerTests/StandardStartupTest.TestStopReplyContainsThreadPcs (1142 of 1977) UNSUPPORTED: lldb-shell :: BuildScript/toolchain-clang-cl.test (1143 of 1977) PASS: lldb-unit :: Utility/./UtilityTests/OptionsWithRawTest.ArgsButNoLeadingDash (1144 of 1977) PASS: lldb-shell :: Register/x86-64-read.test (1145 of 1977) PASS: lldb-unit :: UnwindAssembly/x86/./UnwindAssemblyx86Tests/Testx86AssemblyInspectionEngine.TestReturnDetect (1146 of 1977) PASS: lldb-api :: functionalities/postmortem/minidump/TestMiniDump.py (1147 of 1977) PASS: lldb-unit :: Utility/./UtilityTests/StreamTest.PutCharWhitespace (1148 of 1977) PASS: lldb-unit :: Expression/./ExpressionTests/DiagnosticManagerTest.GetStringSeverityLabels (1149 of 1977) PASS: lldb-unit :: Utility/./UtilityTests/UriParserTest.MinimalPort (1150 of 1977) UNSUPPORTED: lldb-api :: functionalities/thread/state/TestThreadStates.py (1151 of 1977) PASS: lldb-unit :: Utility/./UtilityTests/RangeTest.ClearWithStarAddress (1152 of 1977) PASS: lldb-unit :: UnwindAssembly/x86/./UnwindAssemblyx86Tests/Testx86AssemblyInspectionEngine.TestAddESP (1153 of 1977) PASS: lldb-unit :: SymbolFile/DWARF/./SymbolFileDWARFTests/DWARFASTParserClangTests.EnsureAllDIEsInDeclContextHaveBeenParsedParsesOnlyMatchingEntries (1154 of 1977) UNSUPPORTED: lldb-api :: functionalities/tsan/thread_numbers/TestTsanThreadNumbers.py (1155 of 1977) PASS: lldb-shell :: Commands/command-breakpoint-col.test (1156 of 1977) PASS: lldb-unit :: Process/minidump/./LLDBMinidumpTests/MinidumpParserTest.GetMiscInfoWindows (1157 of 1977) PASS: lldb-unit :: ScriptInterpreter/Python/./ScriptInterpreterPythonTests/PythonDataObjectsTest.TestPythonCallableCheck (1158 of 1977) PASS: lldb-unit :: Utility/./UtilityTests/RangeTest.DoesAdjoinOrIntersect (1159 of 1977) PASS: lldb-api :: functionalities/non-overlapping-index-variable-i/TestIndexVariable.py (1160 of 1977) PASS: lldb-shell :: Breakpoint/debug_addrx.test (1161 of 1977) PASS: lldb-unit :: UnwindAssembly/x86/./UnwindAssemblyx86Tests/Testx86AssemblyInspectionEngine.TestPopEBP (1162 of 1977) PASS: lldb-api :: lang/c/local_variables/TestLocalVariables.py (1163 of 1977) PASS: lldb-api :: lang/cpp/stl/TestStdCXXDisassembly.py (1164 of 1977) PASS: lldb-unit :: Utility/./UtilityTests/AnsiTerminal.WhiteSpace (1165 of 1977) PASS: lldb-unit :: Utility/./UtilityTests/RangeTest.Equal (1166 of 1977) PASS: lldb-unit :: Expression/./ExpressionTests/DiagnosticManagerTest.PutString (1167 of 1977) PASS: lldb-shell :: SymbolFile/DWARF/dwp-debug-types.s (1168 of 1977) PASS: lldb-unit :: Utility/./UtilityTests/LogTest.Unregister (1169 of 1977) PASS: lldb-unit :: Symbol/./SymbolTests/TestTypeSystemClang.TestGetBasicTypeFromName (1170 of 1977) PASS: lldb-api :: python_api/type/TestTypeList.py (1171 of 1977) PASS: lldb-api :: functionalities/value_md5_crash/TestValueMD5Crash.py (1172 of 1977) PASS: lldb-api :: tools/lldb-vscode/attach/TestVSCode_attach.py (1173 of 1977) PASS: lldb-api :: lang/cpp/chained-calls/TestCppChainedCalls.py (1174 of 1977) PASS: lldb-api :: functionalities/postmortem/elf-core/TestLinuxCore.py (1175 of 1977) PASS: lldb-api :: functionalities/signal/raise/TestRaise.py (1176 of 1977) PASS: lldb-unit :: Language/Highlighting/./HighlighterTests/HighlighterTest.ClangOperators (1177 of 1977) PASS: lldb-unit :: ScriptInterpreter/Python/./ScriptInterpreterPythonTests/PythonDataObjectsTest.TestPythonTupleValues (1178 of 1977) PASS: lldb-unit :: Utility/./UtilityTests/UriParserTest.LongPath (1179 of 1977) UNSUPPORTED: lldb-api :: macosx/macabi/TestMacABImacOSFramework.py (1180 of 1977) PASS: lldb-unit :: Host/./HostTests/SocketTest.TCPListen0GetPort (1181 of 1977) PASS: lldb-unit :: Utility/./UtilityTests/ScalarTest.CastOperations (1182 of 1977) PASS: lldb-shell :: SymbolFile/DWARF/debug_rnglists-dwo.s (1183 of 1977) PASS: lldb-unit :: Utility/./UtilityTests/StringExtractorTest.GetNameColonValueNoColon (1184 of 1977) PASS: lldb-unit :: Host/./HostTests/SocketTest.TCPGetAddress (1185 of 1977) PASS: lldb-unit :: Utility/./UtilityTests/StreamTeeTest.CopyConstructor (1186 of 1977) PASS: lldb-unit :: Utility/./UtilityTests/StringLexerTest.Next (1187 of 1977) PASS: lldb-unit :: Utility/./UtilityTests/StringExtractorTest.DecodeHexU8_Exact (1188 of 1977) PASS: lldb-api :: functionalities/thread/concurrent_events/TestConcurrentDelayWatchBreak.py (1189 of 1977) PASS: lldb-unit :: Utility/./UtilityTests/StreamTest.ShiftOperatorStrings (1190 of 1977) PASS: lldb-unit :: Utility/./UtilityTests/ArgsTest.ReplaceArgumentAtIndexLonger (1191 of 1977) PASS: lldb-unit :: Utility/./UtilityTests/StringListTest.AppendListCStringArray (1192 of 1977) PASS: lldb-shell :: ObjectFile/ELF/minidebuginfo-find-symbols.yaml (1193 of 1977) PASS: lldb-unit :: Process/gdb-remote/./ProcessGdbRemoteTests/GDBRemoteClientBaseTest.SendContinueDelegateStructuredDataReceipt (1194 of 1977) UNSUPPORTED: lldb-shell :: SymbolFile/NativePDB/stack_unwinding01.cpp (1195 of 1977) PASS: lldb-api :: lang/cpp/class_static/TestStaticVariables.py (1196 of 1977) PASS: lldb-shell :: ObjectFile/ELF/section-permissions.yaml (1197 of 1977) PASS: lldb-api :: python_api/sbtype_typeclass/TestSBTypeTypeClass.py (1198 of 1977) PASS: lldb-unit :: Utility/./UtilityTests/CompletionRequest.FakeLastArg (1199 of 1977) PASS: lldb-api :: functionalities/gdb_remote_client/TestGDBRemoteLoad.py (1200 of 1977) PASS: lldb-unit :: ScriptInterpreter/Python/./ScriptInterpreterPythonTests/PythonDataObjectsTest.TestInstanceNameResolutionNoDot (1201 of 1977) PASS: lldb-unit :: UnwindAssembly/x86/./UnwindAssemblyx86Tests/Testx86AssemblyInspectionEngine.TestPush0 (1202 of 1977) PASS: lldb-unit :: ObjectFile/Breakpad/./ObjectFileBreakpadTests/FuncRecord.parse (1203 of 1977) PASS: lldb-unit :: Language/CPlusPlus/./LanguageCPlusPlusTests/CPlusPlusLanguage.FindAlternateFunctionManglings (1204 of 1977) PASS: lldb-shell :: Commands/command-source.test (1205 of 1977) PASS: lldb-api :: tools/lldb-vscode/breakpoint/TestVSCode_setBreakpoints.py (1206 of 1977) UNSUPPORTED: lldb-api :: linux/sepdebugsymlink/TestTargetSymbolsSepDebugSymlink.py (1207 of 1977) PASS: lldb-unit :: Utility/./UtilityTests/FileSpecTest.CopyByAppendingPathComponent (1208 of 1977) UNSUPPORTED: lldb-api :: functionalities/data-formatter/data-formatter-stl/libstdcpp/unique_ptr/TestDataFormatterStdUniquePtr.py (1209 of 1977) PASS: lldb-api :: commands/expression/unwind_expression/TestUnwindExpression.py (1210 of 1977) PASS: lldb-unit :: Target/./TargetTests/ModuleCacheTest.GetAndPutUuidExists (1211 of 1977) PASS: lldb-api :: commands/expression/import-std-module/empty-module/TestEmptyStdModule.py (1212 of 1977) PASS: lldb-unit :: Utility/./UtilityTests/ArchSpecTest.MergeFrom (1213 of 1977) PASS: lldb-unit :: Utility/./UtilityTests/StreamTest.PutBytesAsRawHex8ToBigEndian (1214 of 1977) PASS: lldb-api :: python_api/sbvalue_persist/TestSBValuePersist.py (1215 of 1977) PASS: lldb-unit :: Host/./HostTests/FileSystemTest.Exists (1216 of 1977) PASS: lldb-api :: functionalities/thread/crash_during_step/TestCrashDuringStep.py (1217 of 1977) PASS: lldb-api :: python_api/interpreter/TestCommandInterpreterAPI.py (1218 of 1977) PASS: lldb-unit :: Utility/./UtilityTests/FileSpecTest.AppendPathComponent (1219 of 1977) PASS: lldb-api :: lang/cpp/unique-types/TestUniqueTypes.py (1220 of 1977) PASS: lldb-shell :: ObjectFile/ELF/base-address.yaml (1221 of 1977) PASS: lldb-shell :: ObjectFile/PECOFF/symbol.yaml (1222 of 1977) PASS: lldb-unit :: Utility/./UtilityTests/RangeTest.Slide (1223 of 1977) PASS: lldb-unit :: Utility/./UtilityTests/RecordReplayTest.InstrumentedBar (1224 of 1977) PASS: lldb-unit :: Utility/./UtilityTests/RegularExpression.CopyAssignment (1225 of 1977) PASS: lldb-unit :: tools/lldb-server/tests/./LLDBServerTests/TestBase.LaunchModePreservesEnvironment (1226 of 1977) PASS: lldb-unit :: Utility/./UtilityTests/NameMatchesTest.StartsWith (1227 of 1977) PASS: lldb-unit :: Utility/./UtilityTests/ReproducerTest.SetReplay (1228 of 1977) PASS: lldb-shell :: SymbolFile/DWARF/split-dwarf-inlining.cpp (1229 of 1977) PASS: lldb-unit :: Process/gdb-remote/./ProcessGdbRemoteTests/GDBRemoteClientBaseTest.SendContinueAndAsyncSignal (1230 of 1977) PASS: lldb-api :: functionalities/multidebugger_commands/TestMultipleDebuggersCommands.py (1231 of 1977) PASS: lldb-unit :: Utility/./UtilityTests/AnsiTerminal.Twice (1232 of 1977) PASS: lldb-shell :: SymbolFile/DWARF/find-variable-dwo.cpp (1233 of 1977) PASS: lldb-unit :: Utility/./UtilityTests/VMRange.Reset (1234 of 1977) PASS: lldb-api :: commands/process/launch/TestProcessLaunch.py (1235 of 1977) PASS: lldb-shell :: ObjectFile/PECOFF/basic-info-arm.yaml (1236 of 1977) PASS: lldb-unit :: Expression/./ExpressionTests/CppModuleConfigurationTest.IgnoreLibStdCpp (1237 of 1977) PASS: lldb-shell :: SymbolFile/NativePDB/function-types-classes.cpp (1238 of 1977) PASS: lldb-unit :: Host/./HostTests/NativeProcessProtocolTest.ReadCStringFromMemory_MaxSize (1239 of 1977) PASS: lldb-api :: functionalities/data-formatter/data-formatter-python-synth/TestDataFormatterPythonSynth.py (1240 of 1977) UNSUPPORTED: lldb-api :: commands/gui/basic/TestGuiBasic.py (1241 of 1977) PASS: lldb-api :: commands/frame/diagnose/inheritance/TestDiagnoseInheritance.py (1242 of 1977) PASS: lldb-api :: functionalities/data-formatter/data-formatter-enum-format/TestDataFormatterEnumFormat.py (1243 of 1977) PASS: lldb-unit :: Utility/./UtilityTests/StreamTest.ChangingByteOrder (1244 of 1977) PASS: lldb-api :: lang/cpp/this/TestCPPThis.py (1245 of 1977) PASS: lldb-unit :: Expression/./ExpressionTests/CppModuleConfigurationTest.LinuxLocalLibCpp (1246 of 1977) PASS: lldb-api :: commands/command/history/TestCommandHistory.py (1247 of 1977) PASS: lldb-unit :: ScriptInterpreter/Python/./ScriptInterpreterPythonTests/PythonDataObjectsTest.TestPythonTupleToStructuredList (1248 of 1977) PASS: lldb-unit :: Utility/./UtilityTests/DataExtractorTest.GetCStrAtEnd (1249 of 1977) UNSUPPORTED: lldb-shell :: Unwind/unwind-plan-dwarf-dump.test (1250 of 1977) PASS: lldb-unit :: Utility/./UtilityTests/StringListTest.LongestCommonPrefixSingleElement (1251 of 1977) PASS: lldb-shell :: SymbolFile/DWARF/find-basic-variable.cpp (1252 of 1977) PASS: lldb-api :: functionalities/gdb_remote_client/TestIOSSimulator.py (1253 of 1977) PASS: lldb-unit :: Utility/./UtilityTests/ArchSpecTest.MergeFromMachOUnknown (1254 of 1977) PASS: lldb-api :: lang/objc/conflicting-definition/TestConflictingDefinition.py (1255 of 1977) PASS: lldb-api :: types/TestDoubleTypesExpr.py (1256 of 1977) PASS: lldb-unit :: Utility/./UtilityTests/VMRange.CollectionContains (1257 of 1977) UNSUPPORTED: lldb-shell :: SymbolFile/target-symbols-add-unwind.test (1258 of 1977) PASS: lldb-api :: commands/expression/result_numbering/TestResultNumbering.py (1259 of 1977) PASS: lldb-unit :: UnwindAssembly/x86/./UnwindAssemblyx86Tests/Testx86AssemblyInspectionEngine.TestSimplei386ugmented (1260 of 1977) PASS: lldb-unit :: Language/Highlighting/./HighlighterTests/HighlighterTest.DefaultHighlighterWithCursorOutOfBounds (1261 of 1977) UNSUPPORTED: lldb-api :: tools/lldb-vscode/completions/TestVSCode_completions.py (1262 of 1977) UNSUPPORTED: lldb-shell :: Breakpoint/ppc64-localentry.test (1263 of 1977) PASS: lldb-api :: functionalities/postmortem/elf-core/gcore/TestGCore.py (1264 of 1977) PASS: lldb-unit :: Utility/./UtilityTests/ArchSpecTest.OperatorBool (1265 of 1977) PASS: lldb-api :: commands/expression/function_template_specialization_temp_args/TestFunctionTemplateSpecializationTempArgs.py (1266 of 1977) PASS: lldb-api :: commands/expression/static-initializers/TestStaticInitializers.py (1267 of 1977) UNSUPPORTED: lldb-api :: lang/cpp/static_members/TestCPPStaticMembers.py (1268 of 1977) PASS: lldb-api :: lang/objc/modules-auto-import/TestModulesAutoImport.py (1269 of 1977) PASS: lldb-shell :: Reproducer/Functionalities/TestStepping.test (1270 of 1977) PASS: lldb-unit :: Process/gdb-remote/./ProcessGdbRemoteTests/GDBRemoteCommunicationClientTest.GetMemoryRegionInfoInvalidResponse (1271 of 1977) PASS: lldb-api :: functionalities/data-formatter/data-formatter-smart-array/TestDataFormatterSmartArray.py (1272 of 1977) PASS: lldb-shell :: SymbolFile/DWARF/dir-separator-posix.s (1273 of 1977) PASS: lldb-api :: functionalities/data-formatter/data-formatter-objc/TestDataFormatterObjCNSError.py (1274 of 1977) PASS: lldb-unit :: Utility/./UtilityTests/FileSpecTest.Yaml (1275 of 1977) UNSUPPORTED: lldb-shell :: Register/arm-fp-read.test (1276 of 1977) PASS: lldb-unit :: Utility/./UtilityTests/TimerTest.CategoryTimesStats (1277 of 1977) PASS: lldb-api :: python_api/formatters/TestFormattersSBAPI.py (1278 of 1977) PASS: lldb-unit :: Utility/./UtilityTests/DataExtractorTest.GetMaxU64_unchecked (1279 of 1977) PASS: lldb-unit :: Process/gdb-remote/./ProcessGdbRemoteTests/GDBRemoteClientBaseTest.SendContinueAndAsyncPacket (1280 of 1977) PASS: lldb-unit :: Utility/./UtilityTests/RangeTest.ContainsEndInclusiveInvalid (1281 of 1977) UNSUPPORTED: lldb-api :: benchmarks/startup/TestStartupDelays.py (1282 of 1977) PASS: lldb-api :: commands/expression/inline-namespace/TestInlineNamespace.py (1283 of 1977) PASS: lldb-api :: commands/expression/import-std-module/vector/TestVectorFromStdModule.py (1284 of 1977) PASS: lldb-unit :: Utility/./UtilityTests/BinaryStreamTest.PutSLEB128EightBytes (1285 of 1977) PASS: lldb-unit :: Target/./TargetTests/ModuleCacheTest.GetAndPut (1286 of 1977) PASS: lldb-unit :: UnwindAssembly/x86/./UnwindAssemblyx86Tests/Testx86AssemblyInspectionEngine.TestPushRBP (1287 of 1977) PASS: lldb-api :: functionalities/thread/concurrent_events/TestConcurrentCrashWithBreak.py (1288 of 1977) PASS: lldb-api :: macosx/DBGSourcePathRemapping/TestDSYMSourcePathRemapping.py (1289 of 1977) PASS: lldb-api :: commands/command/delete/TestCommandDelete.py (1290 of 1977) PASS: lldb-api :: lang/cpp/char8_t/TestCxxChar8_t.py (1291 of 1977) PASS: lldb-api :: functionalities/postmortem/mach-core/TestMachCore.py (1292 of 1977) PASS: lldb-unit :: Host/./HostTests/ProcessLaunchInfoTest.Constructor (1293 of 1977) PASS: lldb-api :: functionalities/thread/concurrent_events/TestConcurrentTwoBreakpointsOneSignal.py (1294 of 1977) UNSUPPORTED: lldb-api :: commands/register/register/intel_xtended_registers/mpx_offset_intersection/TestMPXOffsetIntersection.py (1295 of 1977) PASS: lldb-api :: lang/cpp/signed_types/TestSignedTypes.py (1296 of 1977) PASS: lldb-unit :: Target/./TargetTests/PathMappingListTest.AbsoluteTests (1297 of 1977) PASS: lldb-api :: commands/target/create-deps/TestTargetCreateDeps.py (1298 of 1977) PASS: lldb-unit :: Symbol/./SymbolTests/TestTypeSystemClang.TestGetTypeClassTypeOf (1299 of 1977) PASS: lldb-unit :: Expression/./ExpressionTests/CppModuleConfigurationTest.Sysroot (1300 of 1977) PASS: lldb-api :: api/multithreaded/TestMultithreaded.py (1301 of 1977) PASS: lldb-api :: commands/expression/import-std-module/no-std-module/TestMissingStdModule.py (1302 of 1977) PASS: lldb-api :: commands/log/invalid-args/TestInvalidArgsLog.py (1303 of 1977) PASS: lldb-unit :: Utility/./UtilityTests/ArchSpecTest.TestParseMachCPUDashSubtypeTripleSimple (1304 of 1977) PASS: lldb-shell :: Settings/TestFrameFormatMangling.test (1305 of 1977) PASS: lldb-api :: functionalities/postmortem/minidump-new/TestMiniDumpUUID.py (1306 of 1977) PASS: lldb-unit :: Core/./LLDBCoreTests/RichManglingContextTest.IPDRealloc (1307 of 1977) PASS: lldb-unit :: ObjectFile/Breakpad/./ObjectFileBreakpadTests/Record.classify (1308 of 1977) PASS: lldb-unit :: Utility/./UtilityTests/SharedCluster.ClusterManager (1309 of 1977) PASS: lldb-api :: functionalities/signal/handle-abrt/TestHandleAbort.py (1310 of 1977) PASS: lldb-api :: commands/process/attach-resume/TestAttachResume.py (1311 of 1977) PASS: lldb-api :: linux/builtin_trap/TestBuiltinTrap.py (1312 of 1977) PASS: lldb-api :: tools/lldb-vscode/breakpoint-events/TestVSCode_breakpointEvents.py (1313 of 1977) PASS: lldb-shell :: Driver/TestProcessAttach.test (1314 of 1977) PASS: lldb-shell :: SymbolFile/DWARF/debug-types-signature-loop.s (1315 of 1977) PASS: lldb-unit :: SymbolFile/NativePDB/./SymbolFileNativePDBTests/PDBFPOProgramToDWARFExpressionTests.DependencyChain (1316 of 1977) PASS: lldb-api :: functionalities/data-formatter/ostypeformatting/TestFormattersOsType.py (1317 of 1977) PASS: lldb-unit :: Utility/./UtilityTests/DataExtractorTest.GetCStr (1318 of 1977) UNSUPPORTED: lldb-api :: functionalities/thread/multi_break/TestMultipleBreakpoints.py (1319 of 1977) PASS: lldb-unit :: Utility/./UtilityTests/RangeTest.SetRangeBase (1320 of 1977) PASS: lldb-api :: functionalities/inline-stepping/TestInlineStepping.py (1321 of 1977) PASS: lldb-shell :: Settings/TestDisassemblyFormat.test (1322 of 1977) PASS: lldb-unit :: Utility/./UtilityTests/StreamTest.PutCStringWithStringRef (1323 of 1977) PASS: lldb-unit :: Utility/./UtilityTests/UriParserTest.BracketedHostnameWithPortIPv4 (1324 of 1977) PASS: lldb-api :: lang/c/set_values/TestSetValues.py (1325 of 1977) PASS: lldb-unit :: ObjectFile/PECOFF/./ObjectFilePECOFFTests/PECallFrameInfoTest.Basic_eh (1326 of 1977) PASS: lldb-unit :: Process/gdb-remote/./ProcessGdbRemoteTests/GDBRemoteCommunicationServerTest.SendErrorResponse_StringError (1327 of 1977) PASS: lldb-shell :: Quit/TestQuitExitCodeHex0.test (1328 of 1977) FAIL: lldb-api :: functionalities/ptr_refs/TestPtrRefs.py (1329 of 1977) ******************** TEST 'lldb-api :: functionalities/ptr_refs/TestPtrRefs.py' FAILED ******************** Script: -- /usr/local/bin/python /Users/buildslave/jenkins/workspace/lldb-cmake-sanitized/llvm-project/lldb/test/API/dotest.py --arch x86_64 -s /Users/buildslave/jenkins/workspace/lldb-cmake-sanitized/lldb-build/lldb-test-traces -S nm -u CXXFLAGS -u CFLAGS --codesign-identity lldb_codesign --server /Users/buildslave/jenkins/workspace/lldb-cmake-sanitized/lldb-build/./bin/debugserver --arch x86_64 --build-dir /Users/buildslave/jenkins/workspace/lldb-cmake-sanitized/lldb-build/lldb-test-build.noindex -s=/Users/buildslave/jenkins/workspace/lldb-cmake-sanitized/test/logs -t --env TERM=vt100 --env LLVM_LIBS_DIR=/Users/buildslave/jenkins/workspace/lldb-cmake-sanitized/lldb-build/./lib --inferior-env ASAN_OPTIONS=detect_stack_use_after_return=1 --inferior-env DYLD_INSERT_LIBRARIES=/Users/buildslave/jenkins/workspace/lldb-cmake-sanitized/host-compiler/lib/clang/11.0.0/lib/darwin/libclang_rt.asan_osx_dynamic.dylib --build-dir /Users/buildslave/jenkins/workspace/lldb-cmake-sanitized/lldb-build/lldb-test-build.noindex --lldb-module-cache-dir /Users/buildslave/jenkins/workspace/lldb-cmake-sanitized/lldb-build/lldb-test-build.noindex/module-cache-lldb/lldb-api --clang-module-cache-dir /Users/buildslave/jenkins/workspace/lldb-cmake-sanitized/lldb-build/lldb-test-build.noindex/module-cache-clang/lldb-api --executable /Users/buildslave/jenkins/workspace/lldb-cmake-sanitized/lldb-build/./bin/lldb --compiler /Users/buildslave/jenkins/workspace/lldb-cmake-sanitized/lldb-build/./bin/clang --dsymutil /Users/buildslave/jenkins/workspace/lldb-cmake-sanitized/lldb-build/./bin/dsymutil --filecheck /Users/buildslave/jenkins/workspace/lldb-cmake-sanitized/lldb-build/./bin/FileCheck --lldb-libs-dir /Users/buildslave/jenkins/workspace/lldb-cmake-sanitized/lldb-build/./lib /Users/buildslave/jenkins/workspace/lldb-cmake-sanitized/llvm-project/lldb/test/API/functionalities/ptr_refs -p TestPtrRefs.py -- Exit Code: 1

Hide Details

Command Output (stdout): -- lldb version 11.0.99 clang revision 49d00824bbbb8945b92c0f592c6951a881a6242f llvm revision 49d00824bbbb8945b92c0f592c6951a881a6242f "crashlog" and "save_crashlog" command installed, use the "--help" option for detailed help "malloc_info", "ptr_refs", "cstr_refs", "find_variable", and "objc_refs" commands have been installed, use the "--help" options on these commands for detailed help. LLDB library dir: /Users/buildslave/jenkins/workspace/lldb-cmake-sanitized/lldb-build/bin LLDB import library dir: /Users/buildslave/jenkins/workspace/lldb-cmake-sanitized/lldb-build/./lib libstdcxx tests will not be run because: Don't know how to build with libstdcxx on macosx Skipping following debug info categories: ['dwo'] 0x00007ffee8c90478: stack in frame #0 of thread #1: tid 0x10d19cd in variable at 0x7ffee8c90478: (const char *) my_ptr = 0x00006020000000b0 "hello" 0x00007ffee8c90410: stack (red zone)

Hide Details

-- Command Output (stderr): -- error: 'ptr_refs' is not a valid command. error: 'ptr_refs' is not a valid command.

Hide Details

Session logs for test failures/errors/unexpected successes will go into directory '/Users/buildslave/jenkins/workspace/lldb-cmake-sanitized/test/logs' Command invoked: /Users/buildslave/jenkins/workspace/lldb-cmake-sanitized/llvm-project/lldb/test/API/dotest.py --arch x86_64 -s /Users/buildslave/jenkins/workspace/lldb-cmake-sanitized/lldb-build/lldb-test-traces -S nm -u CXXFLAGS -u CFLAGS --codesign-identity lldb_codesign --server /Users/buildslave/jenkins/workspace/lldb-cmake-sanitized/lldb-build/./bin/debugserver --arch x86_64 --build-dir /Users/buildslave/jenkins/workspace/lldb-cmake-sanitized/lldb-build/lldb-test-build.noindex -s=/Users/buildslave/jenkins/workspace/lldb-cmake-sanitized/test/logs -t --env TERM=vt100 --env LLVM_LIBS_DIR=/Users/buildslave/jenkins/workspace/lldb-cmake-sanitized/lldb-build/./lib --inferior-env ASAN_OPTIONS=detect_stack_use_after_return=1 --inferior-env DYLD_INSERT_LIBRARIES=/Users/buildslave/jenkins/workspace/lldb-cmake-sanitized/host-compiler/lib/clang/11.0.0/lib/darwin/libclang_rt.asan_osx_dynamic.dylib --build-dir /Users/buildslave/jenkins/workspace/lldb-cmake-sanitized/lldb-build/lldb-test-build.noindex --lldb-module-cache-dir /Users/buildslave/jenkins/workspace/lldb-cmake-sanitized/lldb-build/lldb-test-build.noindex/module-cache-lldb/lldb-api --clang-module-cache-dir /Users/buildslave/jenkins/workspace/lldb-cmake-sanitized/lldb-build/lldb-test-build.noindex/module-cache-clang/lldb-api --executable /Users/buildslave/jenkins/workspace/lldb-cmake-sanitized/lldb-build/./bin/lldb --compiler /Users/buildslave/jenkins/workspace/lldb-cmake-sanitized/lldb-build/./bin/clang --dsymutil /Users/buildslave/jenkins/workspace/lldb-cmake-sanitized/lldb-build/./bin/dsymutil --filecheck /Users/buildslave/jenkins/workspace/lldb-cmake-sanitized/lldb-build/./bin/FileCheck --lldb-libs-dir /Users/buildslave/jenkins/workspace/lldb-cmake-sanitized/lldb-build/./lib /Users/buildslave/jenkins/workspace/lldb-cmake-sanitized/llvm-project/lldb/test/API/functionalities/ptr_refs -p TestPtrRefs.py Change dir to: /Users/buildslave/jenkins/workspace/lldb-cmake-sanitized/llvm-project/lldb/test/API/functionalities/ptr_refs runCmd: settings clear -all output:

Hide Details

runCmd: settings set symbols.enable-external-lookup false output:

Hide Details

runCmd: settings set target.auto-apply-fixits false output:

Hide Details

runCmd: settings set plugin.process.gdb-remote.packet-timeout 60 output:

Hide Details

runCmd: settings set symbols.clang-modules-cache-path "/Users/buildslave/jenkins/workspace/lldb-cmake-sanitized/lldb-build/lldb-test-build.noindex/module-cache-lldb/lldb-api" output:

Hide Details

runCmd: settings set use-color false output:

Hide Details

runCmd: setting set target.prefer-dynamic-value no-dynamic-values output:

Hide Details

runCmd: settings set target.env-vars ASAN_OPTIONS=detect_stack_use_after_return=1 DYLD_INSERT_LIBRARIES=/Users/buildslave/jenkins/workspace/lldb-cmake-sanitized/host-compiler/lib/clang/11.0.0/lib/darwin/libclang_rt.asan_osx_dynamic.dylib output:

Hide Details

runCmd: script import lldb.macosx.heap output: "crashlog" and "save_crashlog" command installed, use the "--help" option for detailed help "malloc_info", "ptr_refs", "cstr_refs", "find_variable", and "objc_refs" commands have been installed, use the "--help" options on these commands for detailed help.

Hide Details

Hide Details

runCmd: ptr_refs my_ptr output: 0x00007ffee8c90478: stack in frame #0 of thread #1: tid 0x10d19cd in variable at 0x7ffee8c90478: (const char *) my_ptr = 0x00006020000000b0 "hello" 0x00007ffee8c90410: stack (red zone)

Hide Details

Hide Details

Expecting sub string: malloc Not matched

Hide Details

FAIL: LLDB (/Users/buildslave/jenkins/workspace/lldb-cmake-sanitized/lldb-build/bin/clang-11-x86_64) :: test_ptr_refs_dsym (TestPtrRefs.TestPtrRefs) <bound method SBProcess.Kill of <lldb.SBProcess; proxy of <Swig Object of type 'lldb::SBProcess *' at 0x1113098a0> >>: success

Hide Details

runCmd: settings clear -all output:

Hide Details

runCmd: settings set symbols.enable-external-lookup false output:

Hide Details

runCmd: settings set target.auto-apply-fixits false output:

Hide Details

runCmd: settings set plugin.process.gdb-remote.packet-timeout 60 output:

Hide Details

runCmd: settings set symbols.clang-modules-cache-path "/Users/buildslave/jenkins/workspace/lldb-cmake-sanitized/lldb-build/lldb-test-build.noindex/module-cache-lldb/lldb-api" output:

Hide Details

runCmd: settings set use-color false output:

Hide Details

runCmd: setting set target.prefer-dynamic-value no-dynamic-values output:

Hide Details

runCmd: settings set target.env-vars ASAN_OPTIONS=detect_stack_use_after_return=1 DYLD_INSERT_LIBRARIES=/Users/buildslave/jenkins/workspace/lldb-cmake-sanitized/host-compiler/lib/clang/11.0.0/lib/darwin/libclang_rt.asan_osx_dynamic.dylib output:

Hide Details

runCmd: script import lldb.macosx.heap output:

Hide Details

runCmd: ptr_refs my_ptr runCmd failed! error: 'ptr_refs' is not a valid command.

Hide Details

Hide Details

XFAIL: LLDB (/Users/buildslave/jenkins/workspace/lldb-cmake-sanitized/lldb-build/bin/clang-11-x86_64) :: test_ptr_refs_dwarf (TestPtrRefs.TestPtrRefs) <bound method SBProcess.Kill of <lldb.SBProcess; proxy of <Swig Object of type 'lldb::SBProcess *' at 0x110708990> >>: success

Hide Details

UNSUPPORTED: LLDB (/Users/buildslave/jenkins/workspace/lldb-cmake-sanitized/lldb-build/bin/clang-11-x86_64) :: test_ptr_refs_dwo (TestPtrRefs.TestPtrRefs) (test case does not fall in any category of interest for this run) runCmd: settings clear -all output:

Hide Details

runCmd: settings set symbols.enable-external-lookup false output:

Hide Details

runCmd: settings set target.auto-apply-fixits false output:

Hide Details

runCmd: settings set plugin.process.gdb-remote.packet-timeout 60 output:

Hide Details

runCmd: settings set symbols.clang-modules-cache-path "/Users/buildslave/jenkins/workspace/lldb-cmake-sanitized/lldb-build/lldb-test-build.noindex/module-cache-lldb/lldb-api" output:

Hide Details

runCmd: settings set use-color false output:

Hide Details

runCmd: setting set target.prefer-dynamic-value no-dynamic-values output:

Hide Details

runCmd: settings set target.env-vars ASAN_OPTIONS=detect_stack_use_after_return=1 DYLD_INSERT_LIBRARIES=/Users/buildslave/jenkins/workspace/lldb-cmake-sanitized/host-compiler/lib/clang/11.0.0/lib/darwin/libclang_rt.asan_osx_dynamic.dylib output:

Hide Details

runCmd: script import lldb.macosx.heap output:

Hide Details

runCmd: ptr_refs my_ptr runCmd failed! error: 'ptr_refs' is not a valid command.

Hide Details

Hide Details

XFAIL: LLDB (/Users/buildslave/jenkins/workspace/lldb-cmake-sanitized/lldb-build/bin/clang-11-x86_64) :: test_ptr_refs_gmodules (TestPtrRefs.TestPtrRefs) <bound method SBProcess.Kill of <lldb.SBProcess; proxy of <Swig Object of type 'lldb::SBProcess *' at 0x1113091e0> >>: success

Hide Details

Restore dir to: /Users/buildslave/jenkins/workspace/lldb-cmake-sanitized/lldb-build/tools/lldb/test ====================================================================== FAIL: test_ptr_refs_dsym (TestPtrRefs.TestPtrRefs) Test format string functionality. ---------------------------------------------------------------------- Traceback (most recent call last): File "/Users/buildslave/jenkins/workspace/lldb-cmake-sanitized/llvm-project/lldb/packages/Python/lldbsuite/test/lldbtest.py", line 1751, in test_method return attrvalue(self) File "/Users/buildslave/jenkins/workspace/lldb-cmake-sanitized/llvm-project/lldb/packages/Python/lldbsuite/test/decorators.py", line 110, in wrapper func(*args, **kwargs) File "/Users/buildslave/jenkins/workspace/lldb-cmake-sanitized/llvm-project/lldb/test/API/functionalities/ptr_refs/TestPtrRefs.py", line 47, in test_ptr_refs self.expect("ptr_refs my_ptr", substrs=["malloc", "stack"]) File "/Users/buildslave/jenkins/workspace/lldb-cmake-sanitized/llvm-project/lldb/packages/Python/lldbsuite/test/lldbtest.py", line 2391, in expect if msg else EXP_MSG(str, output, exe)) AssertionError: False is not True : 'ptr_refs my_ptr' returns expected result, got '0x00007ffee8c90478: stack in frame #0 of thread #1: tid 0x10d19cd in variable at 0x7ffee8c90478: (const char *) my_ptr = 0x00006020000000b0 "hello" 0x00007ffee8c90410: stack (red zone)' Config=x86_64-/Users/buildslave/jenkins/workspace/lldb-cmake-sanitized/lldb-build/bin/clang-11 ---------------------------------------------------------------------- Ran 4 tests in 8.632s

Hide Details

RESULT: FAILED (0 passes, 1 failures, 0 errors, 1 skipped, 2 expected failures, 0 unexpected successes)

Hide Details

--

Hide Details

******************** PASS: lldb-api :: commands/expression/import-std-module/shared_ptr/TestSharedPtrFromStdModule.py (1330 of 1977) PASS: lldb-shell :: ScriptInterpreter/Python/scripted_breakpoint.test (1331 of 1977) UNSUPPORTED: lldb-api :: linux/thread/create_during_instruction_step/TestCreateDuringInstructionStep.py (1332 of 1977) PASS: lldb-unit :: Host/./HostTests/SocketTest.UDPGetConnectURI (1333 of 1977) PASS: lldb-unit :: UnwindAssembly/x86/./UnwindAssemblyx86Tests/Testx86AssemblyInspectionEngine.TestSimple64bitFrameFunction (1334 of 1977) PASS: lldb-api :: python_api/value/TestValueAPI.py (1335 of 1977) PASS: lldb-shell :: SymbolFile/DWARF/dir-separator-windows.s (1336 of 1977) PASS: lldb-shell :: SymbolFile/Breakpad/line-table.test (1337 of 1977) PASS: lldb-unit :: Utility/./UtilityTests/AnsiTerminal.AtStart (1338 of 1977) PASS: lldb-api :: functionalities/data-formatter/data-formatter-objc/TestDataFormatterObjCKVO.py (1339 of 1977) UNSUPPORTED: lldb-api :: functionalities/darwin_log/source/info/TestDarwinLogSourceInfo.py (1340 of 1977) PASS: lldb-unit :: Process/gdb-remote/./ProcessGdbRemoteTests/GDBRemoteCommunicationClientTest.GetModulesInfo_UUID20 (1341 of 1977) PASS: lldb-shell :: ObjectFile/ELF/PT_LOAD-overlap-PT_INTERP.yaml (1342 of 1977) UNSUPPORTED: lldb-api :: functionalities/breakpoint/breakpoint_in_delayslot/TestAvoidBreakpointInDelaySlot.py (1343 of 1977) PASS: lldb-unit :: Utility/./UtilityTests/VMRange.SetEndAddress (1344 of 1977) PASS: lldb-unit :: Utility/./UtilityTests/UriParserTest.PortOverflow (1345 of 1977) UNSUPPORTED: lldb-api :: commands/expression/call-restarts/TestCallThatRestarts.py (1346 of 1977) PASS: lldb-unit :: Host/./HostTests/SocketAddressTest.Set (1347 of 1977) UNSUPPORTED: lldb-shell :: SymbolFile/PDB/typedefs.test (1348 of 1977) PASS: lldb-unit :: Host/./HostTests/SocketTest.TCPListen0ConnectAccept (1349 of 1977) PASS: lldb-unit :: Process/gdb-remote/./ProcessGdbRemoteTests/GDBRemoteClientBaseTest.SendContinueAndInterrupt (1350 of 1977) PASS: lldb-api :: python_api/process/TestProcessAPI.py (1351 of 1977) PASS: lldb-shell :: ObjectFile/ELF/PT_LOAD.yaml (1352 of 1977) PASS: lldb-unit :: Expression/./ExpressionTests/ClangExpressionDeclMapTest.TestPersistentDeclLookup (1353 of 1977) PASS: lldb-unit :: Host/./HostTests/FileSystemTest.Readable (1354 of 1977) PASS: lldb-unit :: Utility/./UtilityTests/DataExtractorTest.PeekData (1355 of 1977) PASS: lldb-shell :: SymbolFile/DWARF/childless-compile-unit.s (1356 of 1977) PASS: lldb-shell :: ObjectFile/Breakpad/breakpad-identification.test (1357 of 1977) PASS: lldb-unit :: UnwindAssembly/x86/./UnwindAssemblyx86Tests/Testx86AssemblyInspectionEngine.TestStackRealign8BitDisp_i386 (1358 of 1977) PASS: lldb-api :: functionalities/data-formatter/data-formatter-ptr-to-array/TestPtrToArrayFormatting.py (1359 of 1977) PASS: lldb-unit :: Utility/./UtilityTests/StringExtractorTest.GetNameColonValueContainsColon (1360 of 1977) UNSUPPORTED: lldb-shell :: SymbolFile/PDB/type-quals.test (1361 of 1977) PASS: lldb-api :: python_api/signals/TestSignalsAPI.py (1362 of 1977) PASS: lldb-unit :: Utility/./UtilityTests/UriParserTest.TypicalPortPathIPv6 (1363 of 1977) PASS: lldb-unit :: Utility/./UtilityTests/OptionsWithRawTest.ArgsButNoDelimiter (1364 of 1977) UNSUPPORTED: lldb-api :: tools/lldb-server/TestGdbRemoteAuxvSupport.py (1365 of 1977) PASS: lldb-unit :: Utility/./UtilityTests/StringListTest.AppendStringCString (1366 of 1977) PASS: lldb-shell :: Settings/TestModuleCacheSanity.test (1367 of 1977) PASS: lldb-unit :: Process/minidump/./LLDBMinidumpTests/MinidumpParserTest.GetLinuxProcStatus (1368 of 1977) PASS: lldb-unit :: Utility/./UtilityTests/RegisterValueTest.GetSet8 (1369 of 1977) PASS: lldb-unit :: SymbolFile/NativePDB/./SymbolFileNativePDBTests/PDBFPOProgramToDWARFExpressionTests.UnresolvedCyclicRegisterAssignmentReference (1370 of 1977) PASS: lldb-unit :: Language/CPlusPlus/./LanguageCPlusPlusTests/CPlusPlusLanguage.CPlusPlusNameParser (1371 of 1977) PASS: lldb-unit :: Expression/./ExpressionTests/CppModuleConfigurationTest.Linux (1372 of 1977) PASS: lldb-unit :: Utility/./UtilityTests/StringExtractorTest.DecodeHexU8_InvalidHex (1373 of 1977) PASS: lldb-unit :: Utility/./UtilityTests/BinaryStreamTest.PutULEB128MaxValue (1374 of 1977) PASS: lldb-unit :: Utility/./UtilityTests/RangeTest.NotEqualInvalid (1375 of 1977) PASS: lldb-shell :: Host/TestCustomShell.test (1376 of 1977) PASS: lldb-unit :: Utility/./UtilityTests/FileSpecTest.GuessPathStyle (1377 of 1977) PASS: lldb-api :: lang/cpp/llvm-style/TestLLVMStyle.py (1378 of 1977) PASS: lldb-api :: lang/cpp/gmodules-templates/TestGModules.py (1379 of 1977) PASS: lldb-api :: lang/c/inlines/TestRedefinitionsInInlines.py (1380 of 1977) PASS: lldb-unit :: Utility/./UtilityTests/SerializationRountripTest.SerializeDeserializeCStringArrayNullptr (1381 of 1977) UNSUPPORTED: lldb-shell :: Breakpoint/case-insensitive.test (1382 of 1977) UNSUPPORTED: lldb-api :: tools/lldb-server/TestGdbRemoteModuleInfo.py (1383 of 1977) PASS: lldb-shell :: Driver/LocalLLDBInit.test (1384 of 1977) PASS: lldb-shell :: Breakpoint/split-dwarf-5-addrbase.test (1385 of 1977) PASS: lldb-api :: lang/objc/objc-struct-argument/TestObjCStructArgument.py (1386 of 1977) PASS: lldb-unit :: UnwindAssembly/x86/./UnwindAssemblyx86Tests/Testx86AssemblyInspectionEngine.TestSimple32bitFrameFunction (1387 of 1977) PASS: lldb-shell :: SymbolFile/NativePDB/function-types-calling-conv.cpp (1388 of 1977) PASS: lldb-api :: lang/objc/objc-optimized/TestObjcOptimized.py (1389 of 1977) PASS: lldb-unit :: Interpreter/./InterpreterTests/CompletionTest.FileCompletionAbsolute (1390 of 1977) PASS: lldb-api :: functionalities/thread/create_after_attach/TestCreateAfterAttach.py (1391 of 1977) PASS: lldb-unit :: Utility/./UtilityTests/UriParserTest.SchemeHostSeparator (1392 of 1977) PASS: lldb-api :: functionalities/thread/concurrent_events/TestConcurrentTwoWatchpointsOneBreakpoint.py (1393 of 1977) PASS: lldb-api :: functionalities/abbreviation/TestCommonShortSpellings.py (1394 of 1977) PASS: lldb-unit :: Utility/./UtilityTests/OptionsWithRawTest.EmptySuffixSingleWhitespace (1395 of 1977) PASS: lldb-api :: commands/frame/diagnose/local-variable/TestLocalVariable.py (1396 of 1977) PASS: lldb-unit :: Utility/./UtilityTests/LogChannelTest.Disable (1397 of 1977) PASS: lldb-unit :: ScriptInterpreter/Python/./ScriptInterpreterPythonTests/PythonDataObjectsTest.TestObjectAttributes (1398 of 1977) PASS: lldb-unit :: SymbolFile/DWARF/./SymbolFileDWARFTests/SymbolFileDWARFTests.TestAbbrevOutOfOrder (1399 of 1977) PASS: lldb-api :: lang/objc/foundation/TestRuntimeTypes.py (1400 of 1977) PASS: lldb-unit :: Utility/./UtilityTests/CompletionRequest.Constructor (1401 of 1977) PASS: lldb-shell :: Reproducer/Functionalities/TestExpressionEvaluation.test (1402 of 1977) PASS: lldb-api :: functionalities/data-formatter/data-formatter-objc/TestDataFormatterObjCExpr.py (1403 of 1977) PASS: lldb-api :: functionalities/breakpoint/breakpoint_language/TestBreakpointLanguage.py (1404 of 1977) PASS: lldb-unit :: Utility/./UtilityTests/FileSpecTest.IsRelative (1405 of 1977) PASS: lldb-api :: functionalities/data-formatter/data-formatter-synth/TestDataFormatterSynth.py (1406 of 1977) PASS: lldb-api :: functionalities/thread/concurrent_events/TestConcurrentDelaySignalBreak.py (1407 of 1977) PASS: lldb-unit :: Utility/./UtilityTests/ConstStringTest.FromMidOfBufferStringRef (1408 of 1977) PASS: lldb-unit :: Expression/./ExpressionTests/DiagnosticManagerTest.HasFixits (1409 of 1977) PASS: lldb-unit :: UnwindAssembly/x86/./UnwindAssemblyx86Tests/Testx86AssemblyInspectionEngine.TestPushR15 (1410 of 1977) PASS: lldb-api :: lang/c/anonymous/TestAnonymous.py (1411 of 1977) UNSUPPORTED: lldb-shell :: SymbolFile/PDB/func-symbols.test (1412 of 1977) PASS: lldb-unit :: Expression/./ExpressionTests/DiagnosticManagerTest.PutStringMultiple (1413 of 1977) UNSUPPORTED: lldb-shell :: ScriptInterpreter/Lua/lua.test (1414 of 1977) UNSUPPORTED: lldb-api :: benchmarks/expression/TestRepeatedExprs.py (1415 of 1977) PASS: lldb-api :: functionalities/data-formatter/type_summary_list_arg/TestTypeSummaryListArg.py (1416 of 1977) PASS: lldb-shell :: ObjectFile/MachO/lc_build_version_notools.yaml (1417 of 1977) PASS: lldb-shell :: ObjectFile/PECOFF/uuid.yaml (1418 of 1977) PASS: lldb-api :: functionalities/gdb_remote_client/TestGDBRemoteClient.py (1419 of 1977) PASS: lldb-api :: lang/objc/foundation/TestObjCMethods2.py (1420 of 1977) PASS: lldb-unit :: Utility/./UtilityTests/Flags.GetBitSize (1421 of 1977) PASS: lldb-unit :: Utility/./UtilityTests/StreamTeeTest.Flush (1422 of 1977) PASS: lldb-unit :: ScriptInterpreter/Python/./ScriptInterpreterPythonTests/PythonDataObjectsTest.TestCallable (1423 of 1977) PASS: lldb-shell :: ScriptInterpreter/None/none.test (1424 of 1977) PASS: lldb-unit :: Utility/./UtilityTests/StringListTest.Join (1425 of 1977) PASS: lldb-api :: macosx/lc-note/kern-ver-str/TestKernVerStrLCNOTE.py (1426 of 1977) PASS: lldb-api :: functionalities/step-avoids-no-debug/TestStepNoDebug.py (1427 of 1977) PASS: lldb-unit :: Symbol/./SymbolTests/TestClangASTImporter.RecordLayout (1428 of 1977) UNSUPPORTED: lldb-shell :: Reproducer/TestLuaImport.test (1429 of 1977) PASS: lldb-api :: lang/cpp/breakpoint-commands/TestCPPBreakpointCommands.py (1430 of 1977) PASS: lldb-shell :: ObjectFile/wasm/basic.yaml (1431 of 1977) PASS: lldb-unit :: Symbol/./SymbolTests/TestTypeSystemClang.TestDeletingImplicitCopyCstrDueToMoveCStr (1432 of 1977) PASS: lldb-api :: commands/expression/import-std-module/weak_ptr-dbg-info-content/TestDbgInfoContentWeakPtrFromStdModule.py (1433 of 1977) PASS: lldb-api :: lang/objc/variadic_methods/TestVariadicMethods.py (1434 of 1977) PASS: lldb-api :: commands/expression/namespace_local_var_same_name_obj_c/TestNamespaceLocalVarSameNameObjC.py (1435 of 1977) PASS: lldb-unit :: Language/Highlighting/./HighlighterTests/HighlighterTest.ClangStringLiterals (1436 of 1977) PASS: lldb-api :: lang/cpp/extern_c/TestExternCSymbols.py (1437 of 1977) PASS: lldb-unit :: UnwindAssembly/x86/./UnwindAssemblyx86Tests/Testx86AssemblyInspectionEngine.Test64bitFramelessBigStackFrame (1438 of 1977) PASS: lldb-shell :: ExecControl/StopHook/stop-hook.test (1439 of 1977) PASS: lldb-api :: functionalities/thread/concurrent_events/TestConcurrentDelayedCrashWithBreakpointSignal.py (1440 of 1977) PASS: lldb-api :: lang/objc/objc-new-syntax/TestObjCNewSyntaxArray.py (1441 of 1977) PASS: lldb-unit :: Utility/./UtilityTests/StringListTest.Assignment (1442 of 1977) PASS: lldb-api :: lang/cpp/multiple-inheritance/TestCppMultipleInheritance.py (1443 of 1977) PASS: lldb-api :: lang/cpp/class-template-parameter-pack/TestClassTemplateParameterPack.py (1444 of 1977) PASS: lldb-unit :: Utility/./UtilityTests/StringListTest.InsertStringAtIndexOutOfBounds (1445 of 1977) PASS: lldb-unit :: Process/minidump/./LLDBMinidumpTests/MinidumpParserTest.GetExceptionStream (1446 of 1977) PASS: lldb-unit :: Symbol/./SymbolTests/TestClangASTImporter.MetadataPropagationIndirectImport (1447 of 1977) PASS: lldb-unit :: Process/minidump/./LLDBMinidumpTests/MinidumpParserTest.FindMemoryRange (1448 of 1977) PASS: lldb-unit :: Platform/./LLDBPlatformTests/PlatformDarwinTest.TestParseVersionBuildDir (1449 of 1977) PASS: lldb-api :: lang/objc/objc-foundation-dictionary-empty/TestNSDictionary0.py (1450 of 1977) PASS: lldb-api :: python_api/sblaunchinfo/TestSBLaunchInfo.py (1451 of 1977) PASS: lldb-unit :: Utility/./UtilityTests/StringListTest.JoinMultiCharSeparator (1452 of 1977) PASS: lldb-api :: commands/expression/diagnostics/TestExprDiagnostics.py (1453 of 1977) PASS: lldb-unit :: Utility/./UtilityTests/BinaryStreamTest.PutULEB128EightBytes (1454 of 1977) PASS: lldb-unit :: ScriptInterpreter/Python/./ScriptInterpreterPythonTests/PythonDataObjectsTest.TestBorrowedReferences (1455 of 1977) PASS: lldb-unit :: Expression/./ExpressionTests/DWARFExpression.DW_OP_pick (1456 of 1977) PASS: lldb-unit :: Process/gdb-remote/./ProcessGdbRemoteTests/GDBRemoteCommunicationServerTest.SendErrorResponse_ErrorNumber (1457 of 1977) PASS: lldb-api :: commands/target/create-no-such-arch/TestNoSuchArch.py (1458 of 1977) PASS: lldb-unit :: Utility/./UtilityTests/ArchSpecTest.Compatibility (1459 of 1977) PASS: lldb-unit :: Language/Highlighting/./HighlighterTests/HighlighterTest.ClangUnterminatedString (1460 of 1977) PASS: lldb-unit :: Editline/./EditlineTests/EditlineTestFixture.EditlineReceivesMultiLineText (1461 of 1977) PASS: lldb-api :: commands/expression/context-object-objc/TestContextObjectObjc.py (1462 of 1977) PASS: lldb-api :: functionalities/show_location/TestShowLocationDwarf5.py (1463 of 1977) PASS: lldb-shell :: Recognizer/assert.test (1464 of 1977) PASS: lldb-api :: functionalities/data-formatter/data-formatter-stl/libcxx/vbool/TestDataFormatterLibcxxVBool.py (1465 of 1977) UNSUPPORTED: lldb-api :: benchmarks/continue/TestBenchmarkContinue.py (1466 of 1977) PASS: lldb-shell :: Breakpoint/implicit_const_form_support.test (1467 of 1977) PASS: lldb-api :: lang/objc/modules-incomplete/TestIncompleteModules.py (1468 of 1977) PASS: lldb-api :: commands/expression/expr-in-syscall/TestExpressionInSyscall.py (1469 of 1977) PASS: lldb-shell :: SymbolFile/DWARF/debug_ranges_and_rnglists.test (1470 of 1977) PASS: lldb-api :: lang/objc/modules/TestObjCModules.py (1471 of 1977) UNSUPPORTED: lldb-api :: functionalities/darwin_log/filter/regex/activity-chain/TestDarwinLogFilterRegexActivityChain.py (1472 of 1977) UNSUPPORTED: lldb-shell :: ScriptInterpreter/Lua/persistent_state.test (1473 of 1977) PASS: lldb-unit :: Interpreter/./InterpreterTests/OptionArgParserTest.toBoolean (1474 of 1977) PASS: lldb-api :: functionalities/optimized_code/TestNoASanExceptionAfterEvalOP_piece.py (1475 of 1977) PASS: lldb-unit :: Utility/./UtilityTests/BinaryStreamTest.PutULEB128FiveBytes (1476 of 1977) PASS: lldb-shell :: SymbolFile/Breakpad/unwind-via-stack-win.test (1477 of 1977) PASS: lldb-shell :: ObjectFile/ELF/PT_LOAD-empty.yaml (1478 of 1977) PASS: lldb-unit :: Host/./HostTests/NativeProcessProtocolTest.ReadCStringFromMemory_CrossPageBoundary (1479 of 1977) PASS: lldb-api :: functionalities/data-formatter/pyobjsynthprovider/TestPyObjSynthProvider.py (1480 of 1977) PASS: lldb-unit :: Target/./TargetTests/ExecutionContextTest.GetByteOrderProcess (1481 of 1977) PASS: lldb-unit :: Utility/./UtilityTests/StreamTest.PutHex32ByteOrderLittle (1482 of 1977) PASS: lldb-unit :: SymbolFile/NativePDB/./SymbolFileNativePDBTests/PDBFPOProgramToDWARFExpressionTests.UnresolvedDependentCyclicRegisterAssignmentReference (1483 of 1977) PASS: lldb-api :: functionalities/history/TestHistoryRecall.py (1484 of 1977) PASS: lldb-shell :: SymbolFile/DWARF/dwarf5_locations.s (1485 of 1977) PASS: lldb-api :: functionalities/data-formatter/data-formatter-stl/libcxx/optional/TestDataFormatterLibcxxOptional.py (1486 of 1977) PASS: lldb-api :: lang/objc/real-definition/TestRealDefinition.py (1487 of 1977) PASS: lldb-api :: functionalities/gdb_remote_client/TestPlatformClient.py (1488 of 1977) PASS: lldb-api :: functionalities/thread/step_out/TestThreadStepOut.py (1489 of 1977) PASS: lldb-api :: lang/c/tls_globals/TestTlsGlobals.py (1490 of 1977) PASS: lldb-unit :: Utility/./UtilityTests/UriParserTest.Empty (1491 of 1977) PASS: lldb-unit :: debugserver/./debugserverTests/RNBSocket.LoopBackListenIPv6 (1492 of 1977) PASS: lldb-unit :: Utility/./UtilityTests/RangeTest.DefaultConstructor (1493 of 1977) PASS: lldb-api :: types/TestCharType.py (1494 of 1977) PASS: lldb-unit :: UnwindAssembly/x86/./UnwindAssemblyx86Tests/Testx86AssemblyInspectionEngine.TestLEAVE (1495 of 1977) PASS: lldb-unit :: Utility/./UtilityTests/StringExtractorTest.GetNameColonValueSuccess (1496 of 1977) PASS: lldb-api :: lang/cpp/static_methods/TestCPPStaticMethods.py (1497 of 1977) PASS: lldb-api :: commands/expression/import-std-module/deque-dbg-info-content/TestDbgInfoContentDequeFromStdModule.py (1498 of 1977) PASS: lldb-unit :: Utility/./UtilityTests/ArgsTest.StringListConstructor (1499 of 1977) PASS: lldb-api :: functionalities/data-formatter/data-formatter-stl/libcxx/unordered/TestDataFormatterUnordered.py (1500 of 1977) PASS: lldb-unit :: Utility/./UtilityTests/SubsystemRAIITest.NormalSubsystem (1501 of 1977) PASS: lldb-api :: functionalities/thread/concurrent_events/TestConcurrentWatchpointDelayWatchpointOneBreakpoint.py (1502 of 1977) PASS: lldb-unit :: Utility/./UtilityTests/LogChannelEnabledTest.LogGetLogThread (1503 of 1977) PASS: lldb-api :: functionalities/testid/TestTestId.py (1504 of 1977) PASS: lldb-shell :: SymbolFile/DWARF/debug-types-dwarf5.s (1505 of 1977) PASS: lldb-unit :: Utility/./UtilityTests/StringListTest.AppendStringStdString (1506 of 1977) PASS: lldb-unit :: Core/./LLDBCoreTests/MangledTest.EmptyForInvalidName (1507 of 1977) PASS: lldb-shell :: SymbolFile/NativePDB/ast-methods.cpp (1508 of 1977) PASS: lldb-unit :: Utility/./UtilityTests/Flags.AnySet (1509 of 1977) PASS: lldb-api :: commands/expression/po_verbosity/TestPoVerbosity.py (1510 of 1977) PASS: lldb-unit :: Utility/./UtilityTests/RangeTest.NotEqual (1511 of 1977) PASS: lldb-unit :: ScriptInterpreter/Python/./ScriptInterpreterPythonTests/PythonDataObjectsTest.TestPythonStringToStr (1512 of 1977) PASS: lldb-unit :: ScriptInterpreter/Python/./ScriptInterpreterPythonTests/PythonDataObjectsTest.TestPythonListToStructuredList (1513 of 1977) PASS: lldb-unit :: Utility/./UtilityTests/StructuredDataTest.ParseJSONFromFile (1514 of 1977) PASS: lldb-unit :: Host/./HostTests/HostInfoTest.GetAugmentedArchSpec (1515 of 1977) PASS: lldb-shell :: Commands/CommandScriptImmediateOutput/CommandScriptImmediateOutputConsole.test (1516 of 1977) PASS: lldb-unit :: Utility/./UtilityTests/StringListTest.LongestCommonPrefix (1517 of 1977) UNSUPPORTED: lldb-shell :: SymbolFile/PDB/calling-conventions.test (1518 of 1977) UNSUPPORTED: lldb-api :: functionalities/darwin_log/filter/regex/message/TestDarwinLogFilterRegexMessage.py (1519 of 1977) PASS: lldb-api :: commands/expression/import_builtin_fileid/TestImportBuiltinFileID.py (1520 of 1977) PASS: lldb-unit :: Target/./TargetTests/ExecutionContextTest.GetByteOrderTarget (1521 of 1977) PASS: lldb-unit :: SymbolFile/DWARF/./SymbolFileDWARFTests/SymbolFileDWARFTests.TestAbbrevInvalidNULLTag (1522 of 1977) PASS: lldb-api :: commands/expression/import-std-module/forward_list-dbg-info-content/TestDbgInfoContentForwardListFromStdModule.py (1523 of 1977) PASS: lldb-api :: functionalities/data-formatter/parray/TestPrintArray.py (1524 of 1977) PASS: lldb-unit :: Utility/./UtilityTests/ScalarTest.ExtractBitfield (1525 of 1977) PASS: lldb-api :: functionalities/object-file/TestImageListMultiArchitecture.py (1526 of 1977) PASS: lldb-api :: functionalities/thread/concurrent_events/TestConcurrentCrashWithWatchpoint.py (1527 of 1977) PASS: lldb-unit :: Expression/./ExpressionTests/CppModuleConfigurationTest.AmbiguousCLib (1528 of 1977) PASS: lldb-api :: driver/batch_mode/TestBatchMode.py (1529 of 1977) PASS: lldb-shell :: Minidump/memory-region-from-module.yaml (1530 of 1977) PASS: lldb-api :: commands/target/dump-symtab-demangle/TestDumpSymtabDemangle.py (1531 of 1977) PASS: lldb-shell :: ObjectFile/ELF/build-id-case.yaml (1532 of 1977) PASS: lldb-api :: lang/cpp/auto/TestCPPAuto.py (1533 of 1977) PASS: lldb-api :: commands/expression/dont_allow_jit/TestAllowJIT.py (1534 of 1977) PASS: lldb-unit :: Language/Highlighting/./HighlighterTests/HighlighterTest.DefaultHighlighterWithCursor (1535 of 1977) PASS: lldb-unit :: Process/minidump/./LLDBMinidumpTests/MinidumpParserTest.GetMemoryRegionInfoFromMemoryList (1536 of 1977) PASS: lldb-unit :: ObjectFile/ELF/./ObjectFileELFTests/ObjectFileELFTest.SectionsResolveConsistently (1537 of 1977) PASS: lldb-api :: functionalities/stats_api/TestStatisticsAPI.py (1538 of 1977) PASS: lldb-unit :: Process/minidump/./LLDBMinidumpTests/MinidumpParserTest.GetPidWow64 (1539 of 1977) PASS: lldb-unit :: Core/./LLDBCoreTests/RichManglingContextTest.FromCxxMethodName (1540 of 1977) PASS: lldb-unit :: ScriptInterpreter/Python/./ScriptInterpreterPythonTests/PythonDataObjectsTest.TestPythonFile (1541 of 1977) PASS: lldb-unit :: Symbol/./SymbolTests/SymbolsTest.TerminateLocateExecutableSymbolFileForUnknownExecutableAndUnknownSymbolFile (1542 of 1977) PASS: lldb-api :: functionalities/data-formatter/data-formatter-advanced/TestDataFormatterAdv.py (1543 of 1977) PASS: lldb-shell :: Driver/TestCommands.test (1544 of 1977) UNSUPPORTED: lldb-api :: terminal/TestEditline.py (1545 of 1977) PASS: lldb-unit :: Process/gdb-remote/./ProcessGdbRemoteTests/GDBRemoteClientBaseTest.SendContinueAndLateInterrupt (1546 of 1977) PASS: lldb-api :: functionalities/data-formatter/data-formatter-objc/TestDataFormatterObjCNSData.py (1547 of 1977) PASS: lldb-unit :: Utility/./UtilityTests/StreamTeeTest.SetStreamAtIndexOverwrite (1548 of 1977) PASS: lldb-api :: commands/frame/language/TestGuessLanguage.py (1549 of 1977) PASS: lldb-unit :: Utility/./UtilityTests/BinaryStreamTest.PutULEB128SixBytes (1550 of 1977) PASS: lldb-api :: lang/objc/hidden-ivars/TestHiddenIvars.py (1551 of 1977) PASS: lldb-api :: tools/lldb-server/commandline/TestStubReverseConnect.py (1552 of 1977) PASS: lldb-api :: lang/cpp/symbols/TestSymbols.py (1553 of 1977) PASS: lldb-api :: python_api/frame/get-variables/TestGetVariables.py (1554 of 1977) PASS: lldb-api :: commands/expression/import-std-module/forward_list/TestForwardListFromStdModule.py (1555 of 1977) PASS: lldb-api :: functionalities/breakpoint/breakpoint_locations/TestBreakpointLocations.py (1556 of 1977) UNSUPPORTED: lldb-api :: functionalities/darwin_log/filter/regex/subsystem/TestDarwinLogFilterRegexSubsystem.py (1557 of 1977) PASS: lldb-api :: lang/cpp/virtual-overload/TestVirtualOverload.py (1558 of 1977) PASS: lldb-unit :: Utility/./UtilityTests/BinaryStreamTest.PutSLEB128NineBytes (1559 of 1977) PASS: lldb-api :: lang/cpp/modules-import/TestCXXModulesImport.py (1560 of 1977) PASS: lldb-unit :: Symbol/./SymbolTests/LineEntryTest.GetSameLineContiguousAddressRangeNestedInline (1561 of 1977) PASS: lldb-api :: functionalities/thread/concurrent_events/TestConcurrentManyBreakpoints.py (1562 of 1977) PASS: lldb-shell :: SymbolFile/DWARF/DW_OP_piece-smaller-than-struct.s (1563 of 1977) PASS: lldb-api :: commands/log/basic/TestLogging.py (1564 of 1977) UNSUPPORTED: lldb-shell :: SymbolFile/PDB/pointers.test (1565 of 1977) PASS: lldb-api :: sample_test/TestSampleInlineTest.py (1566 of 1977) PASS: lldb-api :: terminal/TestSTTYBeforeAndAfter.py (1567 of 1977) PASS: lldb-shell :: SymbolFile/DWARF/compilercontext.ll (1568 of 1977) PASS: lldb-api :: lang/cpp/stl/TestSTL.py (1569 of 1977) PASS: lldb-unit :: UnwindAssembly/x86/./UnwindAssemblyx86Tests/Testx86AssemblyInspectionEngine.TestPushRBPWithREX (1570 of 1977) PASS: lldb-api :: commands/expression/rdar42038760/TestScalarURem.py (1571 of 1977) PASS: lldb-api :: functionalities/thread/concurrent_events/TestConcurrentTwoWatchpointThreads.py (1572 of 1977) PASS: lldb-api :: lang/objc/objc-static-method/TestObjCStaticMethod.py (1573 of 1977) PASS: lldb-api :: lang/cpp/function-qualifiers/TestCppFunctionQualifiers.py (1574 of 1977) PASS: lldb-unit :: Utility/./UtilityTests/BinaryStreamTest.PutSLEB128Zero (1575 of 1977) PASS: lldb-api :: commands/expression/persistent_types/TestPersistentTypes.py (1576 of 1977) PASS: lldb-unit :: Expression/./ExpressionTests/DiagnosticManagerTest.GetStringMultiline (1577 of 1977) PASS: lldb-api :: functionalities/data-formatter/nssetsynth/TestNSSetSynthetic.py (1578 of 1977) PASS: lldb-api :: commands/command/invalid-args/TestInvalidArgsCommand.py (1579 of 1977) PASS: lldb-api :: commands/process/launch-with-shellexpand/TestLaunchWithShellExpand.py (1580 of 1977) PASS: lldb-api :: functionalities/data-formatter/type_summary_list_script/TestTypeSummaryListScript.py (1581 of 1977) PASS: lldb-api :: functionalities/tail_call_frames/cross_dso/TestCrossDSOTailCalls.py (1582 of 1977) PASS: lldb-shell :: Settings/TestSettingsSet.test (1583 of 1977) PASS: lldb-api :: lang/objcxx/cxx-bridged-po/TestObjCXXBridgedPO.py (1584 of 1977) PASS: lldb-unit :: Utility/./UtilityTests/SubsystemRAIITest.SubsystemWithErrorSuccess (1585 of 1977) PASS: lldb-api :: tools/lldb-server/inferior-crash/TestGdbRemoteAbort.py (1586 of 1977) PASS: lldb-api :: python_api/sbvalue_const_addrof/TestSBValueConstAddrOf.py (1587 of 1977) UNSUPPORTED: lldb-api :: functionalities/data-formatter/data-formatter-stl/libstdcpp/list/TestDataFormatterStdList.py (1588 of 1977) PASS: lldb-unit :: Utility/./UtilityTests/BinaryStreamTest.PutSLEB128SixBytes (1589 of 1977) PASS: lldb-unit :: Utility/./UtilityTests/StructuredDataTest.StringDump (1590 of 1977) UNSUPPORTED: lldb-api :: functionalities/thread/concurrent_events/TestConcurrentManySignals.py (1591 of 1977) PASS: lldb-api :: lang/objc/modules-cache/TestClangModulesCache.py (1592 of 1977) UNSUPPORTED: lldb-api :: benchmarks/turnaround/TestCompileRunToBreakpointTurnaround.py (1593 of 1977) PASS: lldb-unit :: Language/Highlighting/./HighlighterTests/HighlighterTest.HighlighterSelectionPath (1594 of 1977) PASS: lldb-api :: commands/expression/import-std-module/list-dbg-info-content/TestDbgInfoContentListFromStdModule.py (1595 of 1977) PASS: lldb-shell :: SymbolFile/DWARF/inline-function-address.ll (1596 of 1977) PASS: lldb-api :: functionalities/avoids-fd-leak/TestFdLeak.py (1597 of 1977) PASS: lldb-unit :: Utility/./UtilityTests/StringListTest.SplitIntoLinesSingleTrailingCR (1598 of 1977) PASS: lldb-unit :: Utility/./UtilityTests/ScalarTest.SetValueFromCString (1599 of 1977) UNSUPPORTED: lldb-api :: functionalities/darwin_log/filter/regex/category/TestDarwinLogFilterRegexCategory.py (1600 of 1977) PASS: lldb-unit :: Host/./HostTests/SocketTest.DomainGetConnectURI (1601 of 1977) PASS: lldb-unit :: Utility/./UtilityTests/NameMatchesTest.Equals (1602 of 1977) PASS: lldb-unit :: UnwindAssembly/x86/./UnwindAssemblyx86Tests/Testx86AssemblyInspectionEngine.TestPopR15 (1603 of 1977) PASS: lldb-shell :: SymbolFile/DWARF/debug-types-missing-signature.test (1604 of 1977) PASS: lldb-unit :: UnwindAssembly/x86/./UnwindAssemblyx86Tests/Testx86AssemblyInspectionEngine.TestAddRSP (1605 of 1977) PASS: lldb-shell :: ObjectFile/ELF/PT_LOAD-overlap-section.yaml (1606 of 1977) PASS: lldb-unit :: UnwindAssembly/x86/./UnwindAssemblyx86Tests/Testx86AssemblyInspectionEngine.TestPopEDI (1607 of 1977) UNSUPPORTED: lldb-api :: commands/expression/multiline-completion/TestMultilineCompletion.py (1608 of 1977) PASS: lldb-unit :: Utility/./UtilityTests/OptionsWithRawTest.WhitespaceInput (1609 of 1977) PASS: lldb-unit :: Process/minidump/./LLDBMinidumpTests/MinidumpParserTest.GetMemoryRegionInfoLinuxMaps (1610 of 1977) PASS: lldb-shell :: SymbolFile/DWARF/find-variable-file.cpp (1611 of 1977) PASS: lldb-shell :: Process/TestEnvironment.test (1612 of 1977) PASS: lldb-api :: lang/objc/objc-new-syntax/TestObjCNewSyntaxLiteral.py (1613 of 1977) PASS: lldb-shell :: Watchpoint/SetErrorCases.test (1614 of 1977) PASS: lldb-api :: python_api/lldbutil/process/TestPrintStackTraces.py (1615 of 1977) PASS: lldb-unit :: Host/./HostTests/MainLoopTest.UnmonitoredSignal (1616 of 1977) UNSUPPORTED: lldb-api :: lang/cpp/printf/TestPrintf.py (1617 of 1977) PASS: lldb-api :: functionalities/gdb_remote_client/TestqOffsets.py (1618 of 1977) PASS: lldb-api :: python_api/disassemble-raw-data/TestDisassembleRawData.py (1619 of 1977) PASS: lldb-api :: tools/lldb-server/TestGdbRemote_qThreadStopInfo.py (1620 of 1977) PASS: lldb-shell :: SymbolFile/NativePDB/bitfields.cpp (1621 of 1977) PASS: lldb-unit :: Utility/./UtilityTests/StringLexerTest.AdvanceIf (1622 of 1977) PASS: lldb-shell :: SymbolFile/DWARF/DW_OP_piece-struct.s (1623 of 1977) PASS: lldb-api :: functionalities/plugins/python_os_plugin/TestPythonOSPlugin.py (1624 of 1977) PASS: lldb-unit :: Utility/./UtilityTests/ProcessInfoTest.Constructor (1625 of 1977) PASS: lldb-unit :: Utility/./UtilityTests/StreamTest.PutCharNull (1626 of 1977) PASS: lldb-api :: commands/settings/quoting/TestQuoting.py (1627 of 1977) PASS: lldb-unit :: Utility/./UtilityTests/DataExtractorTest.UncommonAddressSize (1628 of 1977) PASS: lldb-unit :: Process/gdb-remote/./ProcessGdbRemoteTests/GDBRemoteClientBaseTest.SendPacketAndReceiveResponseWithOutputSupport (1629 of 1977) PASS: lldb-unit :: UnwindAssembly/x86/./UnwindAssemblyx86Tests/Testx86AssemblyInspectionEngine.TestSimplex86_64Augmented (1630 of 1977) PASS: lldb-api :: functionalities/data-formatter/data-formatter-stl/libcxx/list/TestDataFormatterLibcxxList.py (1631 of 1977) PASS: lldb-api :: tools/lldb-vscode/stackTrace/TestVSCode_stackTrace.py (1632 of 1977) PASS: lldb-unit :: Utility/./UtilityTests/UriParserTest.MinimalPath (1633 of 1977) PASS: lldb-api :: commands/expression/persistent_types/TestNestedPersistentTypes.py (1634 of 1977) PASS: lldb-shell :: SymbolFile/DWARF/debug_line-relative_path.s (1635 of 1977) PASS: lldb-shell :: Minidump/Windows/broken-unwind.test (1636 of 1977) PASS: lldb-shell :: Breakpoint/jitbp_elf.test (1637 of 1977) PASS: lldb-unit :: Utility/./UtilityTests/BinaryStreamTest.PutSLEB128FiveBytes (1638 of 1977) PASS: lldb-api :: lang/cpp/namespace/TestNamespaceLookup.py (1639 of 1977) PASS: lldb-shell :: ObjectFile/PECOFF/dep-modules.yaml (1640 of 1977) PASS: lldb-api :: types/TestLongTypes.py (1641 of 1977) PASS: lldb-shell :: ScriptInterpreter/None/import_module.test (1642 of 1977) PASS: lldb-shell :: SymbolFile/DWARF/find-method-local-struct.cpp (1643 of 1977) PASS: lldb-unit :: Utility/./UtilityTests/ArchSpecTest.TestSetTriple (1644 of 1977) PASS: lldb-unit :: Host/./HostTests/MainLoopTest.DetectsEOF (1645 of 1977) PASS: lldb-api :: commands/watchpoints/hello_watchpoint/TestMyFirstWatchpoint.py (1646 of 1977) PASS: lldb-shell :: Reproducer/Functionalities/TestDataFormatter.test (1647 of 1977) PASS: lldb-api :: functionalities/breakpoint/breakpoint_set_restart/TestBreakpointSetRestart.py (1648 of 1977) PASS: lldb-unit :: Utility/./UtilityTests/ArgsTest.TestQuotedUnknownEscape (1649 of 1977) PASS: lldb-unit :: Utility/./UtilityTests/EventTest.DumpEventDataBytes (1650 of 1977) PASS: lldb-unit :: Signals/./SignalsTests/UnixSignalsTest.VersionChange (1651 of 1977) PASS: lldb-unit :: Utility/./UtilityTests/ArchSpecTest.TestParseMachCPUDashSubtypeTripleExtra (1652 of 1977) PASS: lldb-api :: commands/expression/persistent_variables/TestPersistentVariables.py (1653 of 1977) PASS: lldb-api :: commands/expression/import-std-module/conflicts/TestStdModuleWithConflicts.py (1654 of 1977) PASS: lldb-api :: functionalities/thread/concurrent_events/TestConcurrentSignalBreak.py (1655 of 1977) PASS: lldb-api :: lang/objc/foundation/TestSymbolTable.py (1656 of 1977) PASS: lldb-unit :: Symbol/./SymbolTests/LineEntryTest.GetSameLineContiguousAddressRangeOneInline (1657 of 1977) PASS: lldb-shell :: Register/x86-64-gp-read.test (1658 of 1977) PASS: lldb-api :: commands/apropos/with-process/TestAproposWithProcess.py (1659 of 1977) PASS: lldb-api :: lang/cpp/type_lookup/TestCppTypeLookup.py (1660 of 1977) PASS: lldb-unit :: Utility/./UtilityTests/StringExtractorTest.GetU64BigEndian (1661 of 1977) PASS: lldb-api :: commands/watchpoints/watchpoint_on_vectors/TestValueOfVectorVariable.py (1662 of 1977) PASS: lldb-shell :: ObjectFile/ELF/section-types.yaml (1663 of 1977) PASS: lldb-api :: lang/cpp/bitfields/TestCppBitfields.py (1664 of 1977) PASS: lldb-unit :: Symbol/./SymbolTests/TestClangASTImporter.DeportTypeTagDecl (1665 of 1977) PASS: lldb-api :: commands/breakpoint/command/list/TestBreakpointCommandList.py (1666 of 1977) PASS: lldb-unit :: Language/CPlusPlus/./LanguageCPlusPlusTests/CPlusPlusLanguage.MethodNameParsing (1667 of 1977) PASS: lldb-api :: commands/expression/import-std-module/vector-dbg-info-content/TestDbgInfoContentVectorFromStdModule.py (1668 of 1977) PASS: lldb-api :: functionalities/breakpoint/breakpoint_ids/TestBreakpointIDs.py (1669 of 1977) PASS: lldb-shell :: SymbolFile/Breakpad/symtab-macho.test (1670 of 1977) PASS: lldb-api :: functionalities/load_using_paths/TestLoadUsingPaths.py (1671 of 1977) PASS: lldb-api :: commands/command/nested_alias/TestNestedAlias.py (1672 of 1977) PASS: lldb-shell :: ObjectFile/Breakpad/discontiguous-sections.test (1673 of 1977) PASS: lldb-api :: functionalities/data-formatter/data-formatter-stl/libcxx/list/loop/TestDataFormatterLibcxxListLoop.py (1674 of 1977) PASS: lldb-unit :: Host/./HostTests/Host.GetEnvironment (1675 of 1977) PASS: lldb-api :: functionalities/tail_call_frames/unambiguous_sequence/TestUnambiguousTailCalls.py (1676 of 1977) PASS: lldb-api :: python_api/target/TestTargetAPI.py (1677 of 1977) PASS: lldb-unit :: Utility/./UtilityTests/BinaryStreamTest.PutULEB128NineBytes (1678 of 1977) PASS: lldb-unit :: Language/Highlighting/./HighlighterTests/HighlighterTest.ClangPreserveNewLine (1679 of 1977) PASS: lldb-unit :: Utility/./UtilityTests/CompletionRequest.TryCompleteCurrentArgBad (1680 of 1977) PASS: lldb-api :: functionalities/data-formatter/frameformat_smallstruct/TestFrameFormatSmallStruct.py (1681 of 1977) PASS: lldb-api :: commands/expression/import-std-module/basic/TestImportStdModule.py (1682 of 1977) PASS: lldb-unit :: Utility/./UtilityTests/BinaryStreamTest.PutSLEB128ThreeBytes (1683 of 1977) PASS: lldb-api :: lang/cpp/exceptions/TestCPPExceptionBreakpoints.py (1684 of 1977) PASS: lldb-unit :: Symbol/./SymbolTests/TestClangASTImporter.MetadataPropagation (1685 of 1977) UNSUPPORTED: lldb-api :: functionalities/gdb_remote_client/TestWasm.py (1686 of 1977) PASS: lldb-unit :: Utility/./UtilityTests/StringExtractorTest.GetHexU8_InvalidHex (1687 of 1977) PASS: lldb-unit :: Language/Highlighting/./HighlighterTests/HighlighterTest.ClangCursorPos (1688 of 1977) PASS: lldb-unit :: ScriptInterpreter/Python/./ScriptInterpreterPythonTests/PythonDataObjectsTest.TestResetting (1689 of 1977) PASS: lldb-api :: tools/lldb-vscode/launch/TestVSCode_launch.py (1690 of 1977) PASS: lldb-unit :: Symbol/./SymbolTests/LineEntryTest.GetSameLineContiguousAddressRangeNoInlines (1691 of 1977) PASS: lldb-unit :: Process/minidump/./LLDBMinidumpTests/MinidumpParserTest.GetPidWindows (1692 of 1977) PASS: lldb-api :: functionalities/process_crash_info/TestProcessCrashInfo.py (1693 of 1977) PASS: lldb-api :: tools/lldb-server/TestGdbRemoteThreadsInStopReply.py (1694 of 1977) PASS: lldb-api :: functionalities/data-formatter/stringprinter/TestStringPrinter.py (1695 of 1977) PASS: lldb-unit :: Process/gdb-remote/./ProcessGdbRemoteTests/GDBRemoteCommunicationClientTest.SendGetMetaDataPacket (1696 of 1977) PASS: lldb-api :: macosx/universal/TestUniversal.py (1697 of 1977) PASS: lldb-api :: functionalities/pre_run_dylibs/TestPreRunDylibs.py (1698 of 1977) PASS: lldb-unit :: UnwindAssembly/x86/./UnwindAssemblyx86Tests/Testx86AssemblyInspectionEngine.TestCALLNextInsn (1699 of 1977) PASS: lldb-unit :: Utility/./UtilityTests/StatusTest.Formatv (1700 of 1977) PASS: lldb-unit :: Process/gdb-remote/./ProcessGdbRemoteTests/GDBRemoteCommunicationClientTest.SaveRestoreRegistersNoSuffix (1701 of 1977) PASS: lldb-api :: lang/objc/single-entry-dictionary/TestObjCSingleEntryDictionary.py (1702 of 1977) PASS: lldb-api :: macosx/queues/TestQueues.py (1703 of 1977) PASS: lldb-unit :: Utility/./UtilityTests/ArgsTest.TestQuotedTrailingBackslash (1704 of 1977) PASS: lldb-unit :: Utility/./UtilityTests/ArchSpecTest.TripleComponentsWereSpecified (1705 of 1977) PASS: lldb-api :: lang/c/stepping/TestThreadStepping.py (1706 of 1977) PASS: lldb-api :: macosx/add-dsym/TestAddDsymMidExecutionCommand.py (1707 of 1977) PASS: lldb-shell :: Breakpoint/debug_rnglistx_rlex.test (1708 of 1977) PASS: lldb-api :: functionalities/tail_call_frames/cross_object/TestCrossObjectTailCalls.py (1709 of 1977) PASS: lldb-unit :: Symbol/./SymbolTests/TestTypeSystemClang.TestGetEnumIntegerTypeBasicTypes (1710 of 1977) PASS: lldb-shell :: Settings/TestSettingsWrite.test (1711 of 1977) PASS: lldb-unit :: Host/./HostTests/FileActionTest.Open (1712 of 1977) PASS: lldb-api :: functionalities/data-formatter/data-formatter-stl/libcxx/initializerlist/TestInitializerList.py (1713 of 1977) PASS: lldb-api :: commands/command/script/import/TestImport.py (1714 of 1977) PASS: lldb-unit :: Utility/./UtilityTests/UriParserTest.SchemeHostSeparator3 (1715 of 1977) PASS: lldb-api :: functionalities/data-formatter/data-formatter-stl/libstdcpp/unique_ptr/invalid/TestDataFormatterInvalidStdUniquePtr.py (1716 of 1977) PASS: lldb-unit :: Utility/./UtilityTests/StringLexerTest.Peek (1717 of 1977) PASS: lldb-unit :: Utility/./UtilityTests/RegularExpression.Valid (1718 of 1977) PASS: lldb-api :: lang/objcxx/hide-runtime-values/TestObjCXXHideRuntimeValues.py (1719 of 1977) PASS: lldb-api :: commands/expression/radar_9531204/TestPrintfAfterUp.py (1720 of 1977) PASS: lldb-unit :: Language/Highlighting/./HighlighterTests/HighlighterTest.Colons (1721 of 1977) PASS: lldb-api :: commands/expression/import-std-module/stack/TestStackFromStdModule.py (1722 of 1977) PASS: lldb-api :: commands/expression/persist_objc_pointeetype/TestPersistObjCPointeeType.py (1723 of 1977) UNSUPPORTED: lldb-api :: commands/expression/macros/TestMacros.py (1724 of 1977) PASS: lldb-api :: macosx/find-dsym/bundle-with-dot-in-filename/TestBundleWithDotInFilename.py (1725 of 1977) PASS: lldb-shell :: Driver/TestCore.test (1726 of 1977) PASS: lldb-api :: functionalities/data-formatter/data-formatter-stl/libcxx/string/TestDataFormatterLibcxxString.py (1727 of 1977) PASS: lldb-api :: commands/expression/char/TestExprsChar.py (1728 of 1977) PASS: lldb-unit :: Process/gdb-remote/./ProcessGdbRemoteTests/GDBRemoteCommunicationClientTest.SyncThreadState (1729 of 1977) PASS: lldb-unit :: Symbol/./SymbolTests/TestTypeSystemClang.TestGetBasicTypeFromEnum (1730 of 1977) PASS: lldb-unit :: Utility/./UtilityTests/OptionsWithRawTest.EmptyArgsOnlySuffix (1731 of 1977) PASS: lldb-api :: functionalities/breakpoint/consecutive_breakpoints/TestConsecutiveBreakpoints.py (1732 of 1977) PASS: lldb-shell :: SymbolFile/NativePDB/global-classes.cpp (1733 of 1977) PASS: lldb-api :: lang/cpp/scope/TestCppScope.py (1734 of 1977) PASS: lldb-api :: lang/cpp/incomplete-types/TestCppIncompleteTypes.py (1735 of 1977) PASS: lldb-unit :: Process/minidump/./LLDBMinidumpTests/MinidumpParserTest.GetMemoryRegionInfoFromMemory64List (1736 of 1977) UNSUPPORTED: lldb-shell :: Register/x86-64-zmm-read.test (1737 of 1977) PASS: lldb-api :: functionalities/thread/jump/TestThreadJump.py (1738 of 1977) PASS: lldb-api :: python_api/interpreter/TestRunCommandInterpreterAPI.py (1739 of 1977) UNSUPPORTED: lldb-api :: functionalities/darwin_log/filter/exact_match/category/TestDarwinLogFilterMatchCategory.py (1740 of 1977) PASS: lldb-unit :: Host/./HostTests/File.GetWaitableHandleFileno (1741 of 1977) PASS: lldb-unit :: Core/./LLDBCoreTests/RichManglingContextTest.Basic (1742 of 1977) PASS: lldb-api :: functionalities/data-formatter/data-formatter-stl/libcxx/set/TestDataFormatterLibcxxSet.py (1743 of 1977) PASS: lldb-unit :: Utility/./UtilityTests/RecordReplayTest.InstrumentedFooSameThis (1744 of 1977) PASS: lldb-api :: commands/expression/vector_of_enums/TestVectorOfEnums.py (1745 of 1977) PASS: lldb-api :: lang/objc/global_ptrs/TestGlobalObjects.py (1746 of 1977) PASS: lldb-unit :: Utility/./UtilityTests/SerializationRountripTest.SerializeDeserializeCString (1747 of 1977) PASS: lldb-unit :: Utility/./UtilityTests/ProcessInstanceInfo.DumpTable (1748 of 1977) PASS: lldb-unit :: Utility/./UtilityTests/ListenerTest.GetEventImmediate (1749 of 1977) PASS: lldb-unit :: Utility/./UtilityTests/StreamTest.PutCString (1750 of 1977) PASS: lldb-shell :: Minidump/Windows/Sigsegv/sigsegv.test (1751 of 1977) PASS: lldb-api :: functionalities/deleted-executable/TestDeletedExecutable.py (1752 of 1977) PASS: lldb-api :: lang/objc/objc-static-method-stripped/TestObjCStaticMethodStripped.py (1753 of 1977) PASS: lldb-unit :: DataFormatter/./LLDBFormatterTests/FormatManagerTests.CompatibleLangs (1754 of 1977) PASS: lldb-unit :: Utility/./UtilityTests/ArgsTest.BareSingleQuote (1755 of 1977) PASS: lldb-shell :: ObjectFile/PECOFF/invalid-export-table.yaml (1756 of 1977) PASS: lldb-unit :: Process/gdb-remote/./ProcessGdbRemoteTests/GDBRemoteCommunicationClientTest.GetModulesInfoInvalidResponse (1757 of 1977) PASS: lldb-api :: functionalities/data-formatter/synthupdate/TestSyntheticFilterRecompute.py (1758 of 1977) PASS: lldb-api :: python_api/function_symbol/TestSymbolAPI.py (1759 of 1977) PASS: lldb-shell :: ObjectFile/ELF/netbsd-exec-8.99.30-amd64.yaml (1760 of 1977) UNSUPPORTED: lldb-api :: functionalities/darwin_log/basic/TestDarwinLogBasic.py (1761 of 1977) PASS: lldb-api :: functionalities/data-formatter/data-formatter-objc/nsindexpath/TestDataFormatterNSIndexPath.py (1762 of 1977) UNSUPPORTED: lldb-api :: functionalities/darwin_log/filter/exact_match/activity/TestDarwinLogFilterMatchActivity.py (1763 of 1977) PASS: lldb-unit :: Utility/./UtilityTests/OptionsWithRawTest.UnterminatedQuote (1764 of 1977) PASS: lldb-unit :: ObjectFile/Breakpad/./ObjectFileBreakpadTests/ModuleRecord.parse (1765 of 1977) PASS: lldb-api :: commands/expression/import-std-module/vector-of-vectors/TestVectorOfVectorsFromStdModule.py (1766 of 1977) UNSUPPORTED: lldb-api :: functionalities/tsan/cpp_global_location/TestTsanCPPGlobalLocation.py (1767 of 1977) PASS: lldb-unit :: Utility/./UtilityTests/FileSpecTest.EqualDotsPosix (1768 of 1977) PASS: lldb-unit :: Utility/./UtilityTests/RangeDataVector.FindEntryIndexesThatContain_Overlap (1769 of 1977) PASS: lldb-api :: functionalities/postmortem/elf-core/thread_crash/TestLinuxCoreThreads.py (1770 of 1977) PASS: lldb-shell :: Breakpoint/debug_rnglist_rlestartend.test (1771 of 1977) PASS: lldb-shell :: Minidump/memory-region.yaml (1772 of 1977) PASS: lldb-unit :: Utility/./UtilityTests/RangeTest.ContainsAddr (1773 of 1977) PASS: lldb-unit :: Utility/./UtilityTests/StreamTeeTest.Write (1774 of 1977) PASS: lldb-unit :: Utility/./UtilityTests/Flags.Reset (1775 of 1977) PASS: lldb-unit :: Utility/./UtilityTests/UUIDTest.SetFromStringRef (1776 of 1977) PASS: lldb-unit :: UnwindAssembly/x86/./UnwindAssemblyx86Tests/Testx86AssemblyInspectionEngine.Test32bitFramelessSmallStackFrame (1777 of 1977) PASS: lldb-api :: functionalities/data-formatter/data-formatter-stl/libcxx/map/TestDataFormatterLibccMap.py (1778 of 1977) PASS: lldb-api :: tools/lldb-server/TestGdbRemoteExitCode.py (1779 of 1977) PASS: lldb-api :: lang/c/const_variables/TestConstVariables.py (1780 of 1977) PASS: lldb-shell :: SymbolFile/DWARF/forward-declarations.s (1781 of 1977) PASS: lldb-unit :: Utility/./UtilityTests/NameMatchesTest.Contains (1782 of 1977) PASS: lldb-unit :: Utility/./UtilityTests/LogChannelEnabledTest.log_options (1783 of 1977) PASS: lldb-unit :: Utility/./UtilityTests/VMRange.Clear (1784 of 1977) PASS: lldb-unit :: Utility/./UtilityTests/ArgsTest.TestSingleQuotedArgWithSpace (1785 of 1977) PASS: lldb-shell :: ObjectFile/wasm/unified-debug-sections.yaml (1786 of 1977) PASS: lldb-unit :: Utility/./UtilityTests/StringExtractorTest.GetHexU8_Extra (1787 of 1977) PASS: lldb-unit :: Process/gdb-remote/./ProcessGdbRemoteTests/GDBRemoteCommunicationClientTest.SendGetDataPacket (1788 of 1977) PASS: lldb-unit :: Utility/./UtilityTests/UUIDTest.RelationalOperators (1789 of 1977) UNSUPPORTED: lldb-api :: tools/lldb-server/thread-name/TestGdbRemoteThreadName.py (1790 of 1977) PASS: lldb-api :: lang/objc/objc-dyn-sbtype/TestObjCDynamicSBType.py (1791 of 1977) PASS: lldb-unit :: Utility/./UtilityTests/UriParserTest.BracketedHostnameWithColon (1792 of 1977) PASS: lldb-unit :: SymbolFile/DWARF/./SymbolFileDWARFTests/SymbolFileDWARFTests.TestAbilitiesForDWARF (1793 of 1977) UNSUPPORTED: lldb-api :: api/multiple-debuggers/TestMultipleDebuggers.py (1794 of 1977) PASS: lldb-api :: functionalities/breakpoint/auto_continue/TestBreakpointAutoContinue.py (1795 of 1977) UNSUPPORTED: lldb-shell :: ScriptInterpreter/Lua/breakpoint_callback.test (1796 of 1977) PASS: lldb-api :: lang/c/strings/TestCStrings.py (1797 of 1977) PASS: lldb-unit :: Utility/./UtilityTests/StreamTest.PutRawBytesToBigEndian (1798 of 1977) PASS: lldb-unit :: Utility/./UtilityTests/ProcessInstanceInfoMatch.Name (1799 of 1977) PASS: lldb-shell :: BuildScript/script-args.test (1800 of 1977) XFAIL: lldb-shell :: Register/x86-mm-xmm-read.test (1801 of 1977) PASS: lldb-api :: functionalities/thread/concurrent_events/TestConcurrentManyCrash.py (1802 of 1977) PASS: lldb-api :: lang/objc/forward-decl/TestForwardDecl.py (1803 of 1977) PASS: lldb-unit :: Symbol/./SymbolTests/TestTypeSystemClang.TestDisplayNameEmpty (1804 of 1977) PASS: lldb-unit :: Utility/./UtilityTests/StateTest.Formatv (1805 of 1977) PASS: lldb-api :: lang/cpp/dynamic-value/TestDynamicValue.py (1806 of 1977) PASS: lldb-api :: tools/lldb-server/TestGdbRemoteAttach.py (1807 of 1977) PASS: lldb-unit :: Utility/./UtilityTests/StringListTest.InsertStringAtIndexEnd (1808 of 1977) PASS: lldb-unit :: Symbol/./SymbolTests/TestTypeSystemClang.TestFunctionTemplateInRecordConstruction (1809 of 1977) PASS: lldb-unit :: Process/minidump/./LLDBMinidumpTests/MinidumpParserTest.MinidumpModuleOrder (1810 of 1977) UNSUPPORTED: lldb-api :: tools/lldb-server/signal-filtering/TestGdbRemote_QPassSignals.py (1811 of 1977) PASS: lldb-api :: functionalities/thread/concurrent_events/TestConcurrentWatchpointWithDelayWatchpointThreads.py (1812 of 1977) UNSUPPORTED: lldb-shell :: Register/x86-zmm-read.test (1813 of 1977) PASS: lldb-unit :: Utility/./UtilityTests/Flags.AnyClear (1814 of 1977) PASS: lldb-unit :: Process/gdb-remote/./ProcessGdbRemoteTests/GDBRemoteCommunicationClientTest.ReadRegister (1815 of 1977) PASS: lldb-unit :: Host/./HostTests/SocketTest.DecodeHostAndPort (1816 of 1977) PASS: lldb-api :: functionalities/breakpoint/comp_dir_symlink/TestCompDirSymLink.py (1817 of 1977) PASS: lldb-api :: macosx/version_zero/TestGetVersionZeroVersion.py (1818 of 1977) UNSUPPORTED: lldb-api :: functionalities/thread/create_during_step/TestCreateDuringStep.py (1819 of 1977) PASS: lldb-unit :: ScriptInterpreter/Python/./ScriptInterpreterPythonTests/PythonDataObjectsTest.TestPythonDictionaryValueEquality (1820 of 1977) PASS: lldb-api :: functionalities/thread/concurrent_events/TestConcurrentTwoWatchpointsOneSignal.py (1821 of 1977) PASS: lldb-shell :: Quit/TestQuitExitCodeNonInt.test (1822 of 1977) PASS: lldb-unit :: Utility/./UtilityTests/ArgsTest.TestAppendArg (1823 of 1977) PASS: lldb-unit :: Process/minidump/./LLDBMinidumpTests/MinidumpParserTest.GetMiscInfo_no_stream (1824 of 1977) PASS: lldb-unit :: Host/./HostTests/MainLoopTest.Signal (1825 of 1977) PASS: lldb-api :: functionalities/data-formatter/data-formatter-objc/TestDataFormatterObjCNSURL.py (1826 of 1977) UNSUPPORTED: lldb-api :: functionalities/tsan/multiple/TestTsanMultiple.py (1827 of 1977) PASS: lldb-unit :: Utility/./UtilityTests/OptionsWithRawTest.MultiWordSuffix (1828 of 1977) PASS: lldb-shell :: Driver/TestConvenienceVariables.test (1829 of 1977) PASS: lldb-shell :: SymbolFile/DWARF/dir-separator-no-comp-dir-relative-name.s (1830 of 1977) PASS: lldb-unit :: Utility/./UtilityTests/BroadcasterTest.BroadcastEvent (1831 of 1977) PASS: lldb-shell :: Unwind/eh-frame-dwarf-unwind.test (1832 of 1977) PASS: lldb-unit :: Core/./LLDBCoreTests/UniqueCStringMap.NoDefaultConstructor (1833 of 1977) PASS: lldb-unit :: Target/./TargetTests/MemoryRegionInfoTest.Formatv (1834 of 1977) PASS: lldb-unit :: SymbolFile/NativePDB/./SymbolFileNativePDBTests/PDBFPOProgramToDWARFExpressionTests.MultipleDependentAssignments (1835 of 1977) PASS: lldb-api :: python_api/value/empty_class/TestValueAPIEmptyClass.py (1836 of 1977) PASS: lldb-api :: python_api/value/linked_list/TestValueAPILinkedList.py (1837 of 1977) UNSUPPORTED: lldb-api :: commands/watchpoints/hello_watchlocation/TestWatchLocation.py (1838 of 1977) PASS: lldb-unit :: Utility/./UtilityTests/StreamTest.AddressRangeEmptyRange (1839 of 1977) PASS: lldb-unit :: SymbolFile/DWARF/./SymbolFileDWARFTests/SymbolFileDWARFTests.TestAbbrevOrder1Start1 (1840 of 1977) PASS: lldb-unit :: ScriptInterpreter/Python/./ScriptInterpreterPythonTests/PythonDataObjectsTest.TestPythonIntegerToStructuredInteger (1841 of 1977) PASS: lldb-unit :: Utility/./UtilityTests/StreamTest.PutHex16ByteOrderLittle (1842 of 1977) PASS: lldb-unit :: Expression/./ExpressionTests/CppModuleConfigurationTest.AmbiguousLibCpp (1843 of 1977) PASS: lldb-api :: functionalities/inferior-crashing/recursive-inferior/TestRecursiveInferiorStep.py (1844 of 1977) PASS: lldb-api :: commands/command/source/TestCommandSource.py (1845 of 1977) PASS: lldb-shell :: Settings/TestStopCommandSourceOnError.test (1846 of 1977) PASS: lldb-unit :: UnwindAssembly/x86/./UnwindAssemblyx86Tests/Testx86AssemblyInspectionEngine.TestPushEBX (1847 of 1977) PASS: lldb-api :: python_api/frame/inlines/TestInlinedFrame.py (1848 of 1977) PASS: lldb-api :: functionalities/data-formatter/dump_dynamic/TestDumpDynamic.py (1849 of 1977) PASS: lldb-unit :: Utility/./UtilityTests/StringListTest.InsertStringAtIndexStdString (1850 of 1977) PASS: lldb-unit :: SymbolFile/DWARF/./SymbolFileDWARFTests/SymbolFileDWARFTests.TestAbbrevNullAttrValidForm (1851 of 1977) PASS: lldb-api :: functionalities/tail_call_frames/disambiguate_paths_to_common_sink/TestDisambiguatePathsToCommonSink.py (1852 of 1977) PASS: lldb-api :: commands/expression/import-std-module/vector-bool/TestVectorBoolFromStdModule.py (1853 of 1977) PASS: lldb-shell :: Breakpoint/debug_rnglist_offset_pair.test (1854 of 1977) PASS: lldb-unit :: Host/./HostTests/ConnectionFileDescriptorTest.TCPGetURIv4 (1855 of 1977) PASS: lldb-api :: commands/expression/ir-interpreter-phi-nodes/TestIRInterpreterPHINodes.py (1856 of 1977) PASS: lldb-unit :: Symbol/./SymbolTests/TestClangASTImporter.DeportDeclTagDecl (1857 of 1977) PASS: lldb-unit :: Symbol/./SymbolTests/TestClangASTImporter.ImportInvalidType (1858 of 1977) PASS: lldb-api :: api/log/TestAPILog.py (1859 of 1977) PASS: lldb-api :: commands/frame/diagnose/complicated-expression/TestComplicatedExpression.py (1860 of 1977) PASS: lldb-api :: lang/objc/objc-super/TestObjCSuper.py (1861 of 1977) PASS: lldb-unit :: Utility/./UtilityTests/BinaryStreamTest.PutULEB128Zero (1862 of 1977) PASS: lldb-api :: functionalities/data-formatter/summary-string-onfail/Test-rdar-9974002.py (1863 of 1977) PASS: lldb-api :: commands/expression/import-std-module/unique_ptr/TestUniquePtrFromStdModule.py (1864 of 1977) PASS: lldb-shell :: ObjectFile/ELF/many-sections.s (1865 of 1977) PASS: lldb-api :: functionalities/gdb_remote_client/TestRecognizeBreakpoint.py (1866 of 1977) PASS: lldb-unit :: Utility/./UtilityTests/ConstStringTest.NullAndEmptyStates (1867 of 1977) PASS: lldb-api :: lang/cpp/nested-class-other-compilation-unit/TestNestedClassWithParentInAnotherCU.py (1868 of 1977) PASS: lldb-api :: lang/objc/ivar-IMP/TestObjCiVarIMP.py (1869 of 1977) PASS: lldb-unit :: Expression/./ExpressionTests/DiagnosticManagerTest.AppendMessageNoDiag (1870 of 1977) PASS: lldb-unit :: Utility/./UtilityTests/RegularExpression.Invalid (1871 of 1977) PASS: lldb-api :: lang/cpp/overloaded-functions/TestOverloadedFunctions.py (1872 of 1977) PASS: lldb-unit :: Utility/./UtilityTests/LogChannelTest.EnableOptions (1873 of 1977) PASS: lldb-api :: python_api/objc_type/TestObjCType.py (1874 of 1977) PASS: lldb-api :: functionalities/breakpoint/hardware_breakpoints/hardware_breakpoint_on_multiple_threads/TestHWBreakMultiThread.py (1875 of 1977) PASS: lldb-unit :: Utility/./UtilityTests/RecordReplayTest.InstrumentedBarPtr (1876 of 1977) PASS: lldb-unit :: ScriptInterpreter/Python/./ScriptInterpreterPythonTests/PythonDataObjectsTest.TestRun (1877 of 1977) UNSUPPORTED: lldb-api :: functionalities/darwin_log/filter/exact_match/message/TestDarwinLogFilterMatchMessage.py (1878 of 1977) PASS: lldb-shell :: SymbolFile/DWARF/dwo-type-in-main-file.s (1879 of 1977) PASS: lldb-api :: functionalities/dynamic_value_child_count/TestDynamicValueChildCount.py (1880 of 1977) UNSUPPORTED: lldb-shell :: ExecControl/StopHook/stop-hook-threads.test (1881 of 1977) PASS: lldb-api :: commands/expression/regression-access-function-template-in-record/TestRegressionAccessFunctionTemplateInRecord.py (1882 of 1977) PASS: lldb-unit :: Utility/./UtilityTests/VMRange.Comparison (1883 of 1977) PASS: lldb-unit :: SymbolFile/NativePDB/./SymbolFileNativePDBTests/PDBFPOProgramToDWARFExpressionTests.InvalidOpBinary (1884 of 1977) PASS: lldb-unit :: Utility/./UtilityTests/SerializationRountripTest.SerializeDeserializePod (1885 of 1977) PASS: lldb-unit :: SymbolFile/NativePDB/./SymbolFileNativePDBTests/PDBFPOProgramToDWARFExpressionTests.MultipleIndependentAssignments (1886 of 1977) PASS: lldb-api :: lang/objc/print-obj/TestPrintObj.py (1887 of 1977) PASS: lldb-unit :: Process/minidump/./LLDBMinidumpTests/MinidumpParserTest.GetThreadContext_x86_32_wow64 (1888 of 1977) PASS: lldb-api :: functionalities/breakpoint/move_nearest/TestMoveNearest.py (1889 of 1977) PASS: lldb-unit :: UnwindAssembly/x86/./UnwindAssemblyx86Tests/Testx86AssemblyInspectionEngine.Testi386IgnoredRegisters (1890 of 1977) PASS: lldb-api :: commands/expression/completion-crash-incomplete-record/TestCompletionCrashIncompleteRecord.py (1891 of 1977) PASS: lldb-api :: functionalities/data-formatter/data-formatter-named-summaries/TestDataFormatterNamedSummaries.py (1892 of 1977) PASS: lldb-shell :: ObjectFile/ELF/PT_LOAD-overlap-PT_TLS.yaml (1893 of 1977) PASS: lldb-unit :: Utility/./UtilityTests/StreamTest.AddressSize (1894 of 1977) PASS: lldb-unit :: Utility/./UtilityTests/StreamTest.AddressNoSuffix (1895 of 1977) PASS: lldb-api :: types/TestShortTypeExpr.py (1896 of 1977) PASS: lldb-shell :: SymbolFile/NativePDB/function-types-builtins.cpp (1897 of 1977) PASS: lldb-unit :: Host/./HostTests/FileSystemTest.EnumerateDirectory (1898 of 1977) PASS: lldb-unit :: Language/Highlighting/./HighlighterTests/HighlighterTest.ClangSquareBrackets (1899 of 1977) PASS: lldb-unit :: ScriptInterpreter/Python/./ScriptInterpreterPythonTests/PythonDataObjectsTest.TestGlobalNameResolutionWithDot (1900 of 1977) PASS: lldb-shell :: SymbolFile/DWARF/debug-types-address-ranges.s (1901 of 1977) PASS: lldb-api :: python_api/default-constructor/TestDefaultConstructorForAPIObjects.py (1902 of 1977) PASS: lldb-unit :: Utility/./UtilityTests/StringListTest.Clear (1903 of 1977) PASS: lldb-api :: functionalities/thread/concurrent_events/TestConcurrentBreakpointDelayBreakpointOneSignal.py (1904 of 1977) PASS: lldb-api :: lang/c/vla/TestVLA.py (1905 of 1977) PASS: lldb-api :: lang/objc/orderedset/TestOrderedSet.py (1906 of 1977) PASS: lldb-api :: tools/lldb-server/TestLldbGdbServer.py (1907 of 1977) PASS: lldb-api :: lang/objc/objc-runtime-ivars/TestRuntimeIvars.py (1908 of 1977) PASS: lldb-api :: commands/expression/rdar44436068/Test128BitsInteger.py (1909 of 1977) PASS: lldb-api :: functionalities/data-formatter/data-formatter-stl/libcxx/tuple/TestDataFormatterLibcxxTuple.py (1910 of 1977) PASS: lldb-shell :: Expr/TestIRMemoryMap.test (1911 of 1977) UNSUPPORTED: lldb-api :: functionalities/ubsan/user-expression/TestUbsanUserExpression.py (1912 of 1977) PASS: lldb-unit :: Utility/./UtilityTests/StringListTest.GetMaxStringLengthEqualSize (1913 of 1977) PASS: lldb-shell :: ObjectFile/MachO/symtab.yaml (1914 of 1977) PASS: lldb-unit :: Utility/./UtilityTests/ScalarTest.APIntConstructor (1915 of 1977) PASS: lldb-unit :: Language/Highlighting/./HighlighterTests/HighlighterTest.ClangCursorPosAfterOtherToken (1916 of 1977) PASS: lldb-api :: macosx/duplicate-archive-members/TestDuplicateMembers.py (1917 of 1977) PASS: lldb-unit :: Utility/./UtilityTests/StringListTest.JoinThree (1918 of 1977) PASS: lldb-api :: commands/watchpoints/watchpoint_disable/TestWatchpointDisable.py (1919 of 1977) PASS: lldb-api :: commands/help/TestHelp.py (1920 of 1977) PASS: lldb-api :: functionalities/thread/concurrent_events/TestConcurrentTwoBreakpointsOneDelaySignal.py (1921 of 1977) PASS: lldb-shell :: SymbolFile/DWARF/debug_loc-aslr.s (1922 of 1977) PASS: lldb-shell :: Register/x86-64-ymm-read.test (1923 of 1977) PASS: lldb-api :: functionalities/archives/TestBSDArchives.py (1924 of 1977) PASS: lldb-unit :: Utility/./UtilityTests/StringExtractorTest.InitEmpty (1925 of 1977) PASS: lldb-shell :: SymbolFile/DWARF/find-basic-namespace.cpp (1926 of 1977) PASS: lldb-api :: macosx/nslog/TestDarwinNSLogOutput.py (1927 of 1977) PASS: lldb-shell :: SymbolFile/Breakpad/unwind-via-stack-win-no-memory-info.yaml (1928 of 1977) PASS: lldb-unit :: Expression/./ExpressionTests/DWARFExpression.DW_OP_piece (1929 of 1977) PASS: lldb-api :: functionalities/breakpoint/address_breakpoints/TestBadAddressBreakpoints.py (1930 of 1977) PASS: lldb-shell :: Commands/command-disassemble.s (1931 of 1977) PASS: lldb-api :: functionalities/data-formatter/data-formatter-stl/libcxx/variant/TestDataFormatterLibcxxVariant.py (1932 of 1977) PASS: lldb-unit :: Utility/./UtilityTests/EnvironmentTest.EnvpConstruction (1933 of 1977) PASS: lldb-api :: commands/expression/top-level/TestTopLevelExprs.py (1934 of 1977) PASS: lldb-unit :: ScriptInterpreter/Python/./ScriptInterpreterPythonTests/PythonDataObjectsTest.TestPythonIntegerToStr (1935 of 1977) PASS: lldb-unit :: Utility/./UtilityTests/ConstStringTest.CompareStringRef (1936 of 1977) UNSUPPORTED: lldb-api :: functionalities/darwin_log/source/debug/TestDarwinLogSourceDebug.py (1937 of 1977) PASS: lldb-unit :: Utility/./UtilityTests/ArgsTest.TestUnknownEscape (1938 of 1977) PASS: lldb-api :: functionalities/thread/concurrent_events/TestConcurrentDelayedCrashWithBreakpointWatchpoint.py (1939 of 1977) PASS: lldb-api :: lang/objc/modules-app-update/TestClangModulesAppUpdate.py (1940 of 1977) PASS: lldb-unit :: Utility/./UtilityTests/OptionsWithRawTest.WhitespaceSuffix (1941 of 1977) PASS: lldb-unit :: Utility/./UtilityTests/StringExtractorTest.GetHexBytesAvail_Partial (1942 of 1977) PASS: lldb-unit :: Symbol/./SymbolTests/TestClangASTImporter.CanImportInvalidType (1943 of 1977) PASS: lldb-unit :: Utility/./UtilityTests/StringListTest.InsertStringAtIndexStart (1944 of 1977) PASS: lldb-unit :: Symbol/./SymbolTests/Type.CompilerContextPattern (1945 of 1977) PASS: lldb-api :: functionalities/data-formatter/data-formatter-objc/nsstring/TestDataFormatterNSString.py (1946 of 1977) PASS: lldb-unit :: Process/gdb-remote/./ProcessGdbRemoteTests/GDBRemoteCommunicationServerTest.SendErrorResponse_UnimplementedError (1947 of 1977) PASS: lldb-api :: functionalities/inferior-crashing/recursive-inferior/TestRecursiveInferior.py (1948 of 1977) PASS: lldb-unit :: Utility/./UtilityTests/ArgsTest.TestSingleArg (1949 of 1977) PASS: lldb-api :: python_api/value/change_values/TestChangeValueAPI.py (1950 of 1977) PASS: lldb-unit :: Process/gdb-remote/./ProcessGdbRemoteTests/GDBRemoteClientBaseTest.SendContinueAndWait (1951 of 1977) PASS: lldb-unit :: Utility/./UtilityTests/Flags.Clear (1952 of 1977) PASS: lldb-unit :: Utility/./UtilityTests/StreamTest.AddressRange (1953 of 1977) PASS: lldb-unit :: Utility/./UtilityTests/Flags.Test (1954 of 1977) PASS: lldb-api :: lang/cpp/operator-overload/TestOperatorOverload.py (1955 of 1977) PASS: lldb-api :: functionalities/breakpoint/serialize/TestBreakpointSerialization.py (1956 of 1977) PASS: lldb-api :: python_api/get-value-32bit-int/TestGetValue32BitInt.py (1957 of 1977) PASS: lldb-api :: commands/frame/var/TestFrameVar.py (1958 of 1977) UNSUPPORTED: lldb-api :: functionalities/signal/handle-segv/TestHandleSegv.py (1959 of 1977) PASS: lldb-api :: commands/target/basic/TestTargetCommand.py (1960 of 1977) PASS: lldb-api :: functionalities/thread/num_threads/TestNumThreads.py (1961 of 1977) PASS: lldb-unit :: Utility/./UtilityTests/StreamTest.PutRawBytesToLittleEndian (1962 of 1977) UNSUPPORTED: lldb-api :: tools/lldb-server/libraries-svr4/TestGdbRemoteLibrariesSvr4Support.py (1963 of 1977) PASS: lldb-api :: macosx/safe-to-func-call/TestSafeFuncCalls.py (1964 of 1977) PASS: lldb-shell :: Breakpoint/debug_rnglist_basic.test (1965 of 1977) PASS: lldb-api :: lang/objc/exceptions/TestObjCExceptions.py (1966 of 1977) PASS: lldb-api :: functionalities/data-formatter/data-formatter-objc/TestDataFormatterObjNSException.py (1967 of 1977) UNSUPPORTED: lldb-shell :: Process/Windows/exception_access_violation.cpp (1968 of 1977) PASS: lldb-shell :: SymbolFile/DWARF/debug-types-line-tables.s (1969 of 1977) PASS: lldb-unit :: UnwindAssembly/x86/./UnwindAssemblyx86Tests/Testx86AssemblyInspectionEngine.TestSpillRegToStackViaMOVx86_64 (1970 of 1977) PASS: lldb-api :: commands/frame/diagnose/dereference-function-return/TestDiagnoseDereferenceFunctionReturn.py (1971 of 1977) PASS: lldb-unit :: Utility/./UtilityTests/StreamTeeTest.GetStreamAtIndexOutOfBounds (1972 of 1977) PASS: lldb-api :: commands/expression/persistent_ptr_update/TestPersistentPtrUpdate.py (1973 of 1977) PASS: lldb-api :: commands/watchpoints/watchpoint_commands/command/TestWatchpointCommandPython.py (1974 of 1977) PASS: lldb-api :: commands/platform/process/list/TestProcessList.py (1975 of 1977) PASS: lldb-api :: functionalities/thread/concurrent_events/TestConcurrentTwoWatchpointsOneDelayBreakpoint.py (1976 of 1977) UNSUPPORTED: lldb-api :: lang/objc/objc-dynamic-value/TestObjCDynamicValue.py (1977 of 1977)

Hide Details

Testing Time: 4477.56s ******************** Failing Tests (3): lldb-api :: lang/objc/ptr_refs/TestPtrRefsObjC.py lldb-api :: python_api/thread/TestThreadAPI.py lldb-api :: functionalities/ptr_refs/TestPtrRefs.py

Hide Details

Hide Details

Slowest Tests: -------------------------------------------------------------------------- 93.89s: lldb-api :: types/TestLongTypes.py 95.46s: lldb-api :: commands/settings/TestSettings.py 98.53s: lldb-api :: functionalities/data-formatter/poarray/TestPrintObjectArray.py 112.79s: lldb-api :: types/TestIntegerTypeExpr.py 118.58s: lldb-api :: lang/objc/foundation/TestObjCMethodsNSError.py 119.09s: lldb-api :: lang/objc/foundation/TestObjCMethodsString.py 120.71s: lldb-api :: tools/lldb-server/TestGdbRemote_qThreadStopInfo.py 122.73s: lldb-api :: lang/objc/objc-new-syntax/TestObjCNewSyntaxArray.py 122.77s: lldb-api :: lang/objc/objc-new-syntax/TestObjCNewSyntaxDictionary.py 139.58s: lldb-api :: types/TestLongTypesExpr.py 144.38s: lldb-api :: lang/objc/real-definition/TestRealDefinition.py 146.55s: lldb-api :: lang/objc/exceptions/TestObjCExceptions.py 158.67s: lldb-api :: lang/cpp/namespace/TestNamespaceLookup.py 159.94s: lldb-api :: lang/objc/objc-new-syntax/TestObjCNewSyntaxLiteral.py 226.07s: lldb-api :: lang/objc/foundation/TestObjCMethods.py 232.44s: lldb-api :: lang/objc/hidden-ivars/TestHiddenIvars.py 248.75s: lldb-api :: tools/lldb-server/TestGdbRemoteThreadsInStopReply.py 266.24s: lldb-api :: api/multithreaded/TestMultithreaded.py 278.19s: lldb-api :: lang/cpp/enum_types/TestCPP11EnumTypes.py 370.86s: lldb-api :: tools/lldb-server/TestLldbGdbServer.py

Hide Details

Tests Times: -------------------------------------------------------------------------- [ Range ] :: [ Percentage ] :: [ Count ] -------------------------------------------------------------------------- [ 0s, 20s) :: [********************************** ] :: [1723/1977] [ 20s, 40s) :: [** ] :: [ 109/1977] [ 40s, 60s) :: [* ] :: [ 90/1977] [ 60s, 80s) :: [ ] :: [ 25/1977] [ 80s,100s) :: [ ] :: [ 12/1977] [100s,120s) :: [ ] :: [ 2/1977] [120s,140s) :: [ ] :: [ 5/1977] [140s,160s) :: [ ] :: [ 3/1977] [160s,180s) :: [ ] :: [ 2/1977] [180s,200s) :: [ ] :: [ 0/1977] [200s,220s) :: [ ] :: [ 0/1977] [220s,240s) :: [ ] :: [ 2/1977] [240s,260s) :: [ ] :: [ 1/1977] [260s,280s) :: [ ] :: [ 1/1977] [280s,300s) :: [ ] :: [ 1/1977] [300s,320s) :: [ ] :: [ 0/1977] [320s,340s) :: [ ] :: [ 0/1977] [340s,360s) :: [ ] :: [ 0/1977] [360s,380s) :: [ ] :: [ 1/1977] Expected Passes : 1801 Expected Failures : 6 Unsupported Tests : 167 Unexpected Failures: 3 FAILED: tools/lldb/test/CMakeFiles/check-lldb-lit cd /Users/buildslave/jenkins/workspace/lldb-cmake-sanitized/lldb-build/tools/lldb/test && /usr/local/bin/python /Users/buildslave/jenkins/workspace/lldb-cmake-sanitized/lldb-build/./bin/llvm-lit -v --time-tests --shuffle --xunit-xml-output=/Users/buildslave/jenkins/workspace/lldb-cmake-sanitized/test/results.xml -v -j 4 --timeout 1200 /Users/buildslave/jenkins/workspace/lldb-cmake-sanitized/lldb-build/tools/lldb/test ninja: build stopped: subcommand failed. Command failed: Command '['/usr/bin/env', 'TERM=vt100', '/usr/local/bin/ninja', '-v', 'check-lldb']' returned non-zero exit status 1. Command: ['/usr/bin/env', 'TERM=vt100', '/usr/local/bin/ninja', '-v', 'check-lldb'] [Pipeline] } [Pipeline] // timeout [Pipeline] } [Pipeline] // stage [Pipeline] stage [Pipeline] { (Declarative: Post Actions) [Pipeline] scanForIssues [Clang (LLVM based)] Sleeping for 5 seconds due to JENKINS-32191... [Clang (LLVM based)] Parsing console log (workspace: '/Users/buildslave/jenkins/workspace/lldb-cmake-sanitized') [Clang (LLVM based)] Successfully parsed console log [Clang (LLVM based)] -> found 5 issues (skipped 0 duplicates) [Clang (LLVM based)] Post processing issues on 'green-dragon-23' with source code encoding 'UTF-8' [Clang (LLVM based)] Creating SCM blamer to obtain author and commit information for affected files [Clang (LLVM based)] Creating SCM miner to obtain statistics for affected repository files [Clang (LLVM based)] Resolving file names for all issues in source directory '/Users/buildslave/jenkins/workspace/lldb-cmake-sanitized' [Clang (LLVM based)] -> resolved paths in source directory (4 found, 0 not found) [Clang (LLVM based)] Resolving module names from module definitions (build.xml, pom.xml, or Manifest.mf files) [Clang (LLVM based)] -> resolved module names for 5 issues [Clang (LLVM based)] Resolving package names (or namespaces) by parsing the affected files [Clang (LLVM based)] -> resolved package names of 4 affected files [Clang (LLVM based)] No filter has been set, publishing all 5 issues [Clang (LLVM based)] Creating fingerprints for all affected code blocks to track issues over different builds [Clang (LLVM based)] -> created fingerprints for 5 issues (skipped 0 issues) [Clang (LLVM based)] Copying affected files to Jenkins' build folder '/Users/Shared/Jenkins/Home/jobs/lldb-cmake-sanitized/builds/1164/files-with-issues' [Clang (LLVM based)] -> 4 copied, 0 not in workspace, 0 not-found, 0 with I/O error [Pipeline] junit Recording test results [Pipeline] } [Pipeline] // stage [Pipeline] } [Pipeline] // withEnv [Pipeline] } [Pipeline] // node [Pipeline] End of Pipeline ERROR: script returned exit code 1 Finished: FAILURE