FailedConsole Output

Skipping 7,646 KB.. Full Log
st_variables/TestConstVariables.py (853 of 1977)
PASS: lldb-unit :: Symbol/./SymbolTests/TestClangASTImporter.CopyTypeTagDecl (854 of 1977)
PASS: lldb-shell :: Heap/heap-cstr.test (855 of 1977)
PASS: lldb-shell :: Commands/command-disassemble-process.yaml (856 of 1977)
PASS: lldb-api :: functionalities/data-formatter/data-formatter-objc/TestDataFormatterObjCNSURL.py (857 of 1977)
PASS: lldb-shell :: Breakpoint/debug_rnglist_offset_pair.test (858 of 1977)
PASS: lldb-unit :: UnwindAssembly/x86/./UnwindAssemblyx86Tests/Testx86AssemblyInspectionEngine.TestSimple32bitFrameFunction (859 of 1977)
PASS: lldb-api :: macosx/profile_vrs_detach/TestDetachVrsProfile.py (860 of 1977)
PASS: lldb-unit :: Utility/./UtilityTests/ConstStringTest.UpdateMangledCounterpart (861 of 1977)
PASS: lldb-shell :: Quit/TestQuitExitCodeImplicit0.test (862 of 1977)
PASS: lldb-unit :: Utility/./UtilityTests/StringExtractorTest.InitEmpty (863 of 1977)
PASS: lldb-unit :: Utility/./UtilityTests/NameMatchesTest.RegularExpression (864 of 1977)
PASS: lldb-api :: lang/objc/objc-super/TestObjCSuper.py (865 of 1977)
PASS: lldb-api :: lang/cpp/nsimport/TestCppNsImport.py (866 of 1977)
PASS: lldb-shell :: Commands/command-backtrace.test (867 of 1977)
PASS: lldb-unit :: Interpreter/./InterpreterTests/CompletionTest.FileCompletionAbsolute (868 of 1977)
PASS: lldb-unit :: Target/./TargetTests/MCBasedABI.MapRegisterName (869 of 1977)
PASS: lldb-unit :: Utility/./UtilityTests/ProcessInstanceInfo.DumpTable_invalidUID (870 of 1977)
PASS: lldb-unit :: Utility/./UtilityTests/StreamTest.AddressSuffix (871 of 1977)
UNSUPPORTED: lldb-api :: functionalities/thread/state/TestThreadStates.py (872 of 1977)
PASS: lldb-api :: tools/lldb-server/TestGdbRemoteKill.py (873 of 1977)
PASS: lldb-unit :: Process/gdb-remote/./ProcessGdbRemoteTests/GDBRemoteClientBaseTest.SendContinueAndWait (874 of 1977)
PASS: lldb-api :: lang/objc/modules/TestObjCModules.py (875 of 1977)
PASS: lldb-shell :: ObjectFile/ELF/compressed-sections.yaml (876 of 1977)
PASS: lldb-unit :: Utility/./UtilityTests/RangeTest.LessThanInvalid (877 of 1977)
PASS: lldb-unit :: Utility/./UtilityTests/StreamTeeTest.DefaultConstructor (878 of 1977)
UNSUPPORTED: lldb-api :: functionalities/breakpoint/breakpoint_callback_command_source/TestBreakpointCallbackCommandSource.py (879 of 1977)
PASS: lldb-unit :: Utility/./UtilityTests/CompletionRequest.DuplicateFiltering (880 of 1977)
PASS: lldb-api :: functionalities/thread/concurrent_events/TestConcurrentDelayedCrashWithBreakpointWatchpoint.py (881 of 1977)
PASS: lldb-api :: terminal/TestSTTYBeforeAndAfter.py (882 of 1977)
PASS: lldb-shell :: SymbolFile/DWARF/find-function-regex.cpp (883 of 1977)
PASS: lldb-unit :: ScriptInterpreter/Python/./ScriptInterpreterPythonTests/PythonDataObjectsTest.TestPythonListManipulation (884 of 1977)
PASS: lldb-api :: tools/lldb-vscode/launch/TestVSCode_launch.py (885 of 1977)
PASS: lldb-unit :: Utility/./UtilityTests/RecordReplayTest.InstrumentedBar (886 of 1977)
PASS: lldb-unit :: UnwindAssembly/x86/./UnwindAssemblyx86Tests/Testx86AssemblyInspectionEngine.TestReturnDetect (887 of 1977)
PASS: lldb-shell :: SymbolFile/DWARF/find-inline-method.s (888 of 1977)
PASS: lldb-shell :: SymbolFile/DWARF/DW_AT_loclists_base.s (889 of 1977)
PASS: lldb-api :: functionalities/thread/concurrent_events/TestConcurrentManyWatchpoints.py (890 of 1977)
PASS: lldb-unit :: Utility/./UtilityTests/ProcessInstanceInfoMatch.Name (891 of 1977)
PASS: lldb-unit :: Utility/./UtilityTests/RangeTest.Constructor (892 of 1977)
PASS: lldb-unit :: SymbolFile/DWARF/./SymbolFileDWARFTests/SymbolFileDWARFTests.TestAbbrevMissingTerminator (893 of 1977)
PASS: lldb-api :: tools/lldb-server/TestGdbRemote_qThreadStopInfo.py (894 of 1977)
PASS: lldb-unit :: Utility/./UtilityTests/StringListTest.Clear (895 of 1977)
PASS: lldb-shell :: BuildScript/toolchain-clang.test (896 of 1977)
PASS: lldb-shell :: ObjectFile/ELF/many-sections.s (897 of 1977)
PASS: lldb-api :: lang/cpp/wchar_t/TestCxxWCharT.py (898 of 1977)
PASS: lldb-unit :: Utility/./UtilityTests/BinaryStreamTest.PutULEB128TwoBytes (899 of 1977)
UNSUPPORTED: lldb-api :: functionalities/tsan/basic/TestTsanBasic.py (900 of 1977)
PASS: lldb-unit :: Utility/./UtilityTests/ArchSpecTest.Compatibility (901 of 1977)
PASS: lldb-api :: lang/objc/exceptions/TestObjCExceptions.py (902 of 1977)
PASS: lldb-api :: lang/cpp/class_types/TestClassTypes.py (903 of 1977)
PASS: lldb-shell :: SymbolFile/Breakpad/unwind-via-raSearch.test (904 of 1977)
PASS: lldb-api :: commands/expression/radar_9531204/TestPrintfAfterUp.py (905 of 1977)
UNSUPPORTED: lldb-api :: benchmarks/libcxxmap/TestBenchmarkLibcxxMap.py (906 of 1977)
PASS: lldb-unit :: Utility/./UtilityTests/FileSpecTest.OperatorBool (907 of 1977)
PASS: lldb-unit :: Process/minidump/./LLDBMinidumpTests/MinidumpParserTest.GetArchitecture (908 of 1977)
PASS: lldb-unit :: Language/Highlighting/./HighlighterTests/HighlighterTest.ClangUnterminatedString (909 of 1977)
PASS: lldb-unit :: Expression/./ExpressionTests/CppModuleConfigurationTest.MissingUsrInclude (910 of 1977)
PASS: lldb-unit :: Utility/./UtilityTests/FileSpecTest.FormatFileSpec (911 of 1977)
PASS: lldb-unit :: Host/./HostTests/SocketTest.TCPListen0ConnectAccept (912 of 1977)
PASS: lldb-api :: commands/expression/import-std-module/forward_list/TestForwardListFromStdModule.py (913 of 1977)
PASS: lldb-api :: functionalities/thread/concurrent_events/TestConcurrentCrashWithWatchpointBreakpointSignal.py (914 of 1977)
PASS: lldb-api :: functionalities/thread/num_threads/TestNumThreads.py (915 of 1977)
PASS: lldb-api :: commands/watchpoints/watchpoint_commands/command/TestWatchpointCommandLLDB.py (916 of 1977)
PASS: lldb-api :: lang/cpp/limit-debug-info/TestWithLimitDebugInfo.py (917 of 1977)
PASS: lldb-shell :: SymbolFile/DWARF/debug_loc-aslr.s (918 of 1977)
PASS: lldb-api :: commands/expression/inline-namespace/TestInlineNamespace.py (919 of 1977)
PASS: lldb-unit :: UnwindAssembly/x86/./UnwindAssemblyx86Tests/Testx86AssemblyInspectionEngine.TestStackRealign32BitDisp_x86_64 (920 of 1977)
PASS: lldb-unit :: Symbol/./SymbolTests/TestClangASTImporter.RecordLayout (921 of 1977)
PASS: lldb-unit :: Expression/./ExpressionTests/CppModuleConfigurationTest.MissingLibCpp (922 of 1977)
PASS: lldb-unit :: Utility/./UtilityTests/UriParserTest.SchemeHostSeparator (923 of 1977)
PASS: lldb-shell :: SymbolFile/NativePDB/s_constant.cpp (924 of 1977)
PASS: lldb-unit :: ObjectFile/Breakpad/./ObjectFileBreakpadTests/LineRecord.parse (925 of 1977)
PASS: lldb-shell :: Settings/TestFrameFormatNoColor.test (926 of 1977)
PASS: lldb-unit :: Core/./LLDBCoreTests/RichManglingContextTest.FromCxxMethodName (927 of 1977)
PASS: lldb-api :: functionalities/postmortem/elf-core/thread_crash/TestLinuxCoreThreads.py (928 of 1977)
PASS: lldb-unit :: Core/./LLDBCoreTests/StreamCallbackTest.Callback (929 of 1977)
PASS: lldb-unit :: Utility/./UtilityTests/OptionsWithRawTest.MultiWordSuffix (930 of 1977)
PASS: lldb-unit :: Utility/./UtilityTests/ArgsTest.TestUnknownEscape (931 of 1977)
PASS: lldb-api :: functionalities/gdb_remote_client/TestRecognizeBreakpoint.py (932 of 1977)
UNSUPPORTED: lldb-api :: functionalities/thread/multi_break/TestMultipleBreakpoints.py (933 of 1977)
PASS: lldb-unit :: Utility/./UtilityTests/StringListTest.ForRangeEmpty (934 of 1977)
PASS: lldb-api :: lang/c/global_variables/TestGlobalVariables.py (935 of 1977)
PASS: lldb-shell :: Reproducer/TestReuseDirectory.test (936 of 1977)
PASS: lldb-api :: python_api/disassemble-raw-data/TestDisassembleRawData.py (937 of 1977)
PASS: lldb-unit :: Utility/./UtilityTests/ListenerTest.GetEventImmediate (938 of 1977)
PASS: lldb-unit :: ScriptInterpreter/Python/./ScriptInterpreterPythonTests/PythonDataObjectsTest.TestPythonTupleToStructuredList (939 of 1977)
PASS: lldb-unit :: Process/gdb-remote/./ProcessGdbRemoteTests/GDBRemoteCommunicationTest.ReadPacket_checksum (940 of 1977)
PASS: lldb-api :: lang/cpp/template-function/TestTemplateFunctions.py (941 of 1977)
PASS: lldb-unit :: Utility/./UtilityTests/DataExtractorTest.GetMaxU64 (942 of 1977)
PASS: lldb-api :: lang/cpp/const_this/TestConstThis.py (943 of 1977)
PASS: lldb-unit :: Host/./HostTests/SocketTest.DomainGetConnectURI (944 of 1977)
PASS: lldb-api :: python_api/sbvalue_persist/TestSBValuePersist.py (945 of 1977)
PASS: lldb-unit :: Host/./HostTests/NativeProcessProtocolTest.ReadCStringFromMemory_MaxSize (946 of 1977)
PASS: lldb-unit :: Host/./HostTests/SocketTest.DecodeHostAndPort (947 of 1977)
PASS: lldb-api :: functionalities/data-formatter/setvaluefromcstring/TestSetValueFromCString.py (948 of 1977)
PASS: lldb-api :: functionalities/data-formatter/data-formatter-proper-plurals/TestFormattersOneIsSingular.py (949 of 1977)
PASS: lldb-unit :: Utility/./UtilityTests/TimerTest.CategoryTimesStats (950 of 1977)
PASS: lldb-unit :: Utility/./UtilityTests/StringListTest.JoinMultiCharSeparator (951 of 1977)
PASS: lldb-unit :: Utility/./UtilityTests/UriParserTest.SchemeHostSeparator2 (952 of 1977)
UNSUPPORTED: lldb-api :: functionalities/darwin_log/filter/exact_match/subsystem/TestDarwinLogFilterMatchSubsystem.py (953 of 1977)
PASS: lldb-unit :: Process/minidump/./LLDBMinidumpTests/MinidumpParserTest.GetThreadContext_x86_32 (954 of 1977)
PASS: lldb-unit :: Expression/./ExpressionTests/DiagnosticManagerTest.AppendMessageSubsequentDiags (955 of 1977)
PASS: lldb-unit :: Utility/./UtilityTests/StreamTest.PutMaxHex64ByteOrderBig (956 of 1977)
PASS: lldb-unit :: Utility/./UtilityTests/GeneratorTest.GetOrCreate (957 of 1977)
PASS: lldb-shell :: ObjectFile/wasm/basic.yaml (958 of 1977)
PASS: lldb-shell :: Settings/TestDisableColor.test (959 of 1977)
PASS: lldb-unit :: Signals/./SignalsTests/UnixSignalsTest.Iteration (960 of 1977)
PASS: lldb-api :: commands/frame/diagnose/dereference-function-return/TestDiagnoseDereferenceFunctionReturn.py (961 of 1977)
PASS: lldb-unit :: Utility/./UtilityTests/BinaryStreamTest.PutULEB128MaxValue (962 of 1977)
UNSUPPORTED: lldb-shell :: ObjectFile/ELF/minidebuginfo-no-lzma.yaml (963 of 1977)
PASS: lldb-unit :: UnwindAssembly/x86/./UnwindAssemblyx86Tests/Testx86AssemblyInspectionEngine.TestSimplex86_64Augmented (964 of 1977)
PASS: lldb-unit :: Process/gdb-remote/./ProcessGdbRemoteTests/GDBRemoteCommunicationServerTest.SendErrorResponse_Status (965 of 1977)
PASS: lldb-api :: python_api/breakpoint/TestBreakpointAPI.py (966 of 1977)
PASS: lldb-unit :: Utility/./UtilityTests/StringExtractorTest.DecodeHexU8_InvalidHex2 (967 of 1977)
PASS: lldb-api :: commands/source/info/TestSourceInfo.py (968 of 1977)
PASS: lldb-api :: python_api/lldbutil/process/TestPrintStackTraces.py (969 of 1977)
PASS: lldb-api :: functionalities/data-formatter/boolreference/TestFormattersBoolRefPtr.py (970 of 1977)
PASS: lldb-api :: functionalities/gdb_remote_client/TestNoWatchpointSupportInfo.py (971 of 1977)
PASS: lldb-unit :: Utility/./UtilityTests/TimerTest.CategoryTimes2 (972 of 1977)
PASS: lldb-unit :: Utility/./UtilityTests/StringListTest.GetSize (973 of 1977)
UNSUPPORTED: lldb-api :: functionalities/unwind/standard/TestStandardUnwind.py (974 of 1977)
PASS: lldb-unit :: Utility/./UtilityTests/CompletionRequest.DuplicateFilteringWithComments (975 of 1977)
PASS: lldb-unit :: Language/Highlighting/./HighlighterTests/HighlighterTest.ClangCursorPosAfterOtherToken (976 of 1977)
PASS: lldb-api :: lang/c/enum_types/TestEnumTypes.py (977 of 1977)
PASS: lldb-api :: python_api/function_symbol/TestSymbolAPI.py (978 of 1977)
PASS: lldb-unit :: Utility/./UtilityTests/StreamTeeTest.Constructor1Stream (979 of 1977)
PASS: lldb-unit :: UnwindAssembly/x86/./UnwindAssemblyx86Tests/Testx86AssemblyInspectionEngine.Testi386IgnoredRegisters (980 of 1977)
PASS: lldb-api :: functionalities/inferior-crashing/recursive-inferior/TestRecursiveInferiorStep.py (981 of 1977)
PASS: lldb-api :: lang/cpp/rvalue-references/TestRvalueReferences.py (982 of 1977)
PASS: lldb-unit :: debugserver/./debugserverTests/RNBSocket.LoopBackListenIPv6 (983 of 1977)
PASS: lldb-unit :: Utility/./UtilityTests/OptionsWithRawTest.EmptyArgsOnlySuffix (984 of 1977)
PASS: lldb-api :: functionalities/data-formatter/ptr_ref_typedef/TestPtrRef2Typedef.py (985 of 1977)
PASS: lldb-api :: functionalities/data-formatter/data-formatter-stl/libcxx/atomic/TestLibCxxAtomic.py (986 of 1977)
PASS: lldb-shell :: SymbolFile/DWARF/dwp-separate-debug-file.cpp (987 of 1977)
PASS: lldb-api :: functionalities/thread/concurrent_events/TestConcurrentSignalDelayBreak.py (988 of 1977)
PASS: lldb-unit :: Utility/./UtilityTests/FileSpecTest.Equal (989 of 1977)
PASS: lldb-unit :: Utility/./UtilityTests/StreamTeeTest.GetStreamAtIndexOutOfBoundsEmpty (990 of 1977)
PASS: lldb-api :: lang/cpp/stl/TestSTL.py (991 of 1977)
PASS: lldb-unit :: Utility/./UtilityTests/RegularExpression.CopyAssignment (992 of 1977)
PASS: lldb-api :: python_api/sbstructureddata/TestStructuredDataAPI.py (993 of 1977)
PASS: lldb-unit :: ScriptInterpreter/Python/./ScriptInterpreterPythonTests/PythonDataObjectsTest.TestGlobalNameResolutionNoDot (994 of 1977)
PASS: lldb-shell :: Minidump/dump-all.test (995 of 1977)
UNSUPPORTED: lldb-api :: tools/lldb-server/thread-name/TestGdbRemoteThreadName.py (996 of 1977)
PASS: lldb-unit :: UnwindAssembly/x86/./UnwindAssemblyx86Tests/Testx86AssemblyInspectionEngine.Test64bitFramelessSmallStackFrame (997 of 1977)
PASS: lldb-api :: tools/lldb-server/commandline/TestStubReverseConnect.py (998 of 1977)
PASS: lldb-api :: lang/c/inlines/TestRedefinitionsInInlines.py (999 of 1977)
PASS: lldb-api :: lang/cpp/stl/TestStdCXXDisassembly.py (1000 of 1977)
PASS: lldb-unit :: Utility/./UtilityTests/StreamTest.PutRawBytesToLittleEndian (1001 of 1977)
PASS: lldb-unit :: Utility/./UtilityTests/ProcessInfoTest.Constructor (1002 of 1977)
PASS: lldb-shell :: Breakpoint/debug_rnglist_basic.test (1003 of 1977)
PASS: lldb-unit :: Process/minidump/./LLDBMinidumpTests/MinidumpParserTest.GetPidWow64 (1004 of 1977)
PASS: lldb-api :: functionalities/gdb_remote_client/TestTargetXMLArch.py (1005 of 1977)
PASS: lldb-api :: tools/lldb-server/inferior-crash/TestGdbRemoteAbort.py (1006 of 1977)
PASS: lldb-api :: python_api/sblaunchinfo/TestSBLaunchInfo.py (1007 of 1977)
PASS: lldb-shell :: ObjectFile/ELF/section-addresses.yaml (1008 of 1977)
PASS: lldb-api :: lang/c/strings/TestCStrings.py (1009 of 1977)
PASS: lldb-unit :: Process/gdb-remote/./ProcessGdbRemoteTests/GDBRemoteCommunicationClientTest.SendSignalsToIgnore (1010 of 1977)
PASS: lldb-shell :: ObjectFile/PECOFF/sections-names.yaml (1011 of 1977)
PASS: lldb-api :: python_api/sbdata/TestSBData.py (1012 of 1977)
PASS: lldb-unit :: Core/./LLDBCoreTests/RichManglingContextTest.Basic (1013 of 1977)
PASS: lldb-api :: lang/c/stepping/TestThreadStepping.py (1014 of 1977)
PASS: lldb-unit :: Host/./HostTests/NativeProcessProtocolTest.ReadCStringFromMemory_CrossPageBoundary (1015 of 1977)
PASS: lldb-unit :: Utility/./UtilityTests/StringListTest.AppendList (1016 of 1977)
PASS: lldb-shell :: SymbolFile/DWARF/debug_rnglists-dwo.s (1017 of 1977)
PASS: lldb-unit :: SymbolFile/NativePDB/./SymbolFileNativePDBTests/PDBFPOProgramToDWARFExpressionTests.InvalidOpBinary (1018 of 1977)
PASS: lldb-api :: functionalities/breakpoint/scripted_bkpt/TestScriptedResolver.py (1019 of 1977)
PASS: lldb-unit :: Utility/./UtilityTests/CompletionRequest.ShiftArguments (1020 of 1977)
PASS: lldb-api :: functionalities/unwind/noreturn/TestNoreturnUnwind.py (1021 of 1977)
PASS: lldb-unit :: Host/./HostTests/SocketAddressTest.Set (1022 of 1977)
UNSUPPORTED: lldb-api :: commands/register/register/intel_xtended_registers/mpx_offset_intersection/TestMPXOffsetIntersection.py (1023 of 1977)
PASS: lldb-shell :: SymbolFile/NativePDB/disassembly.cpp (1024 of 1977)
PASS: lldb-shell :: Settings/TestSettingsWrite.test (1025 of 1977)
PASS: lldb-shell :: Expr/TestIRMemoryMap.test (1026 of 1977)
PASS: lldb-api :: commands/watchpoints/hello_watchpoint/TestMyFirstWatchpoint.py (1027 of 1977)
PASS: lldb-unit :: UnwindAssembly/x86/./UnwindAssemblyx86Tests/Testx86AssemblyInspectionEngine.TestSpArithx86_64Augmented (1028 of 1977)
PASS: lldb-unit :: Utility/./UtilityTests/RegularExpression.Valid (1029 of 1977)
PASS: lldb-api :: lang/cpp/this/TestCPPThis.py (1030 of 1977)
PASS: lldb-shell :: Commands/command-regex-unalias.test (1031 of 1977)
PASS: lldb-shell :: ObjectFile/MachO/lc_build_version_notools.yaml (1032 of 1977)
PASS: lldb-unit :: Utility/./UtilityTests/ArgsTest.TestAppendArg (1033 of 1977)
UNSUPPORTED: lldb-shell :: SymbolFile/PDB/ast-restore.test (1034 of 1977)
PASS: lldb-shell :: ObjectFile/ELF/netbsd-exec-8.99.30-amd64.yaml (1035 of 1977)
PASS: lldb-unit :: ObjectFile/Breakpad/./ObjectFileBreakpadTests/PublicRecord.parse (1036 of 1977)
PASS: lldb-api :: functionalities/breakpoint/breakpoint_names/TestBreakpointNames.py (1037 of 1977)
PASS: lldb-unit :: Language/Highlighting/./HighlighterTests/HighlighterTest.FallbackHighlighter (1038 of 1977)
PASS: lldb-shell :: Process/TestEnvironment.test (1039 of 1977)
PASS: lldb-unit :: UnwindAssembly/x86/./UnwindAssemblyx86Tests/Testx86AssemblyInspectionEngine.TestSpillRegToStackViaMOVx86_64 (1040 of 1977)
PASS: lldb-unit :: Symbol/./SymbolTests/LineEntryTest.GetSameLineContiguousAddressRangeOneInline (1041 of 1977)
PASS: lldb-unit :: Process/minidump/./LLDBMinidumpTests/MinidumpParserTest.GetThreadsAndGetThreadContext (1042 of 1977)
PASS: lldb-shell :: SymbolFile/DWARF/array-sizes.s (1043 of 1977)
PASS: lldb-unit :: Expression/./ExpressionTests/CppModuleConfigurationTest.UnknownLibCppFile (1044 of 1977)
PASS: lldb-unit :: Symbol/./SymbolTests/TestClangASTImporter.MetadataPropagationAfterCopying (1045 of 1977)
PASS: lldb-shell :: ScriptInterpreter/Python/scripted_breakpoint.test (1046 of 1977)
UNSUPPORTED: lldb-api :: commands/watchpoints/hello_watchlocation/TestWatchLocation.py (1047 of 1977)
UNSUPPORTED: lldb-api :: arm/breakpoint-thumb-codesection/TestBreakpointThumbCodesection.py (1048 of 1977)
PASS: lldb-shell :: SymbolFile/DWARF/anon_class_w_and_wo_export_symbols.ll (1049 of 1977)
PASS: lldb-unit :: Utility/./UtilityTests/IndexToObjectTest.ObjectForIndex (1050 of 1977)
PASS: lldb-api :: types/TestIntegerType.py (1051 of 1977)
PASS: lldb-unit :: Utility/./UtilityTests/StringExtractorTest.GetHexU8_Extra (1052 of 1977)
PASS: lldb-unit :: Utility/./UtilityTests/StringLexerTest.HasAtLeast (1053 of 1977)
PASS: lldb-api :: functionalities/data-formatter/data-formatter-categories/TestDataFormatterCategories.py (1054 of 1977)
PASS: lldb-shell :: SymbolFile/DWARF/debug-line-basic.s (1055 of 1977)
PASS: lldb-api :: python_api/interpreter/TestCommandInterpreterAPI.py (1056 of 1977)
PASS: lldb-shell :: SymbolFile/DWARF/debug-names-compressed.cpp (1057 of 1977)
PASS: lldb-shell :: Breakpoint/implicit_const_form_support.test (1058 of 1977)
PASS: lldb-api :: macosx/load-kext/TestLoadKext.py (1059 of 1977)
PASS: lldb-api :: functionalities/inferior-crashing/TestInferiorCrashing.py (1060 of 1977)
PASS: lldb-api :: functionalities/data-formatter/data-formatter-objc/TestDataFormatterObjCPlain.py (1061 of 1977)
PASS: lldb-unit :: Target/./TargetTests/PathMappingListTest.RemapRoot (1062 of 1977)
PASS: lldb-api :: commands/expression/ignore-artificial-constructors/TestIgnoreArtificialConstructors.py (1063 of 1977)
PASS: lldb-unit :: UnwindAssembly/x86/./UnwindAssemblyx86Tests/Testx86AssemblyInspectionEngine.TestPushRBX (1064 of 1977)
PASS: lldb-shell :: Settings/TestEchoCommands.test (1065 of 1977)
PASS: lldb-unit :: Utility/./UtilityTests/BinaryStreamTest.PutSLEB128TwoBytes (1066 of 1977)
PASS: lldb-api :: functionalities/tail_call_frames/disambiguate_paths_to_common_sink/TestDisambiguatePathsToCommonSink.py (1067 of 1977)
PASS: lldb-unit :: Utility/./UtilityTests/StreamTest.AddressRangeInvalidRange (1068 of 1977)
UNSUPPORTED: lldb-shell :: SymbolFile/PDB/expressions.test (1069 of 1977)
PASS: lldb-unit :: UnwindAssembly/x86/./UnwindAssemblyx86Tests/Testx86AssemblyInspectionEngine.TestDisassemblyJunkBytes (1070 of 1977)
PASS: lldb-shell :: ExecControl/StopHook/stop-hook.test (1071 of 1977)
PASS: lldb-api :: types/TestLongTypesExpr.py (1072 of 1977)
UNSUPPORTED: lldb-shell :: ScriptInterpreter/Lua/command_script_import.test (1073 of 1977)
PASS: lldb-unit :: Utility/./UtilityTests/ArgsTest.BareSingleQuote (1074 of 1977)
PASS: lldb-shell :: SymbolFile/Breakpad/line-table-mixed-path-styles.test (1075 of 1977)
UNSUPPORTED: lldb-api :: lang/cpp/printf/TestPrintf.py (1076 of 1977)
UNSUPPORTED: lldb-shell :: Register/x86-64-ymm16-read.test (1077 of 1977)
UNSUPPORTED: lldb-api :: functionalities/darwin_log/filter/regex/subsystem/TestDarwinLogFilterRegexSubsystem.py (1078 of 1977)
PASS: lldb-shell :: BuildScript/compiler-full-path.test (1079 of 1977)
PASS: lldb-unit :: Host/./HostTests/FileSystemTest.EnumerateDirectory (1080 of 1977)
PASS: lldb-unit :: Utility/./UtilityTests/StringExtractorTest.GetHexU8_Exact (1081 of 1977)
PASS: lldb-api :: functionalities/breakpoint/cpp/TestCPPBreakpointLocations.py (1082 of 1977)
PASS: lldb-unit :: Utility/./UtilityTests/FileSpecTest.PrependPathComponent (1083 of 1977)
UNSUPPORTED: lldb-shell :: Register/x86-64-gp-write.test (1084 of 1977)
PASS: lldb-unit :: Process/gdb-remote/./ProcessGdbRemoteTests/GDBRemoteCommunicationClientTest.WriteRegisterNoSuffix (1085 of 1977)
PASS: lldb-unit :: Utility/./UtilityTests/SharedCluster.ClusterManager (1086 of 1977)
UNSUPPORTED: lldb-api :: functionalities/data-formatter/data-formatter-stl/libstdcpp/vbool/TestDataFormatterStdVBool.py (1087 of 1977)
PASS: lldb-unit :: ScriptInterpreter/Python/./ScriptInterpreterPythonTests/PythonDataObjectsTest.TestPythonDictionaryManipulation (1088 of 1977)
PASS: lldb-unit :: UnwindAssembly/x86/./UnwindAssemblyx86Tests/Testx86AssemblyInspectionEngine.TestPushEDX (1089 of 1977)
PASS: lldb-unit :: Utility/./UtilityTests/TimeoutTest.Construction (1090 of 1977)
PASS: lldb-api :: commands/platform/basic/TestPlatformPython.py (1091 of 1977)
PASS: lldb-api :: python_api/frame/TestFrames.py (1092 of 1977)
PASS: lldb-unit :: Utility/./UtilityTests/VASprintfTest.NoBufferResize (1093 of 1977)
UNSUPPORTED: lldb-shell :: Register/x86-gp-write.test (1094 of 1977)
PASS: lldb-unit :: Process/gdb-remote/./ProcessGdbRemoteTests/GDBRemoteCommunicationClientTest.WriteRegister (1095 of 1977)
PASS: lldb-unit :: Utility/./UtilityTests/BinaryStreamTest.PutSLEB128SixBytes (1096 of 1977)
UNSUPPORTED: lldb-api :: benchmarks/turnaround/TestCompileRunToBreakpointTurnaround.py (1097 of 1977)
PASS: lldb-shell :: Quit/TestQuitExitCode30.test (1098 of 1977)
PASS: lldb-unit :: Process/gdb-remote/./ProcessGdbRemoteTests/GDBRemoteCommunicationClientTest.GetMemoryRegionInfoInvalidResponse (1099 of 1977)
PASS: lldb-unit :: Utility/./UtilityTests/UriParserTest.MinimalPortPath (1100 of 1977)
PASS: lldb-unit :: Utility/./UtilityTests/ReproducerTest.SetCapture (1101 of 1977)
PASS: lldb-shell :: Breakpoint/debug_addrx.test (1102 of 1977)
PASS: lldb-api :: commands/process/launch/TestProcessLaunch.py (1103 of 1977)
UNSUPPORTED: lldb-api :: functionalities/data-formatter/data-formatter-stl/libstdcpp/unique_ptr/TestDataFormatterStdUniquePtr.py (1104 of 1977)
PASS: lldb-api :: functionalities/memory/find/TestMemoryFind.py (1105 of 1977)
PASS: lldb-api :: commands/expression/anonymous-struct/TestCallUserAnonTypedef.py (1106 of 1977)
PASS: lldb-shell :: ObjectFile/ELF/section-types-edgecases.yaml (1107 of 1977)
PASS: lldb-api :: lang/cpp/function-qualifiers/TestCppFunctionQualifiers.py (1108 of 1977)
PASS: lldb-unit :: Utility/./UtilityTests/FileSpecTest.GetPath (1109 of 1977)
PASS: lldb-unit :: Utility/./UtilityTests/StringListTest.ShiftStdString (1110 of 1977)
UNSUPPORTED: lldb-shell :: Register/x86-gp-read.test (1111 of 1977)
PASS: lldb-api :: lang/objc/objc-new-syntax/TestObjCNewSyntaxDictionary.py (1112 of 1977)
PASS: lldb-unit :: Process/minidump/./LLDBMinidumpTests/MinidumpParserTest.GetLinuxProcStatus (1113 of 1977)
PASS: lldb-api :: functionalities/breakpoint/move_nearest/TestMoveNearest.py (1114 of 1977)
PASS: lldb-shell :: ObjectFile/ELF/aarch64-relocations.yaml (1115 of 1977)
PASS: lldb-api :: functionalities/var_path/TestVarPath.py (1116 of 1977)
PASS: lldb-api :: commands/expression/diagnostics/TestExprDiagnostics.py (1117 of 1977)
PASS: lldb-shell :: Quit/TestQuitExitCodeHexA.test (1118 of 1977)
PASS: lldb-shell :: SymbolFile/DWARF/dwarf5-atomic.s (1119 of 1977)
PASS: lldb-unit :: UnwindAssembly/x86/./UnwindAssemblyx86Tests/Testx86AssemblyInspectionEngine.TestPush0 (1120 of 1977)
PASS: lldb-api :: sanity/TestSettingSkipping.py (1121 of 1977)
PASS: lldb-api :: lang/c/set_values/TestSetValues.py (1122 of 1977)
PASS: lldb-api :: lang/cpp/global_variables/TestCPPGlobalVariables.py (1123 of 1977)
PASS: lldb-unit :: Utility/./UtilityTests/ScalarTest.Promotion (1124 of 1977)
PASS: lldb-shell :: SymbolFile/DWARF/split-dwarf-multiple-cu.ll (1125 of 1977)
PASS: lldb-shell :: Reproducer/TestGDBRemoteRepro.test (1126 of 1977)
PASS: lldb-unit :: ScriptInterpreter/Python/./ScriptInterpreterPythonTests/PythonDataObjectsTest.TestOwnedReferences (1127 of 1977)
PASS: lldb-unit :: Language/Highlighting/./HighlighterTests/HighlighterTest.ClangCommas (1128 of 1977)
PASS: lldb-api :: lang/objc/rdar-11355592/TestRdar11355592.py (1129 of 1977)
PASS: lldb-shell :: SymbolFile/Breakpad/line-table-missing-file.test (1130 of 1977)
PASS: lldb-api :: api/log/TestAPILog.py (1131 of 1977)
PASS: lldb-unit :: Utility/./UtilityTests/UriParserTest.MinimalPath (1132 of 1977)
PASS: lldb-unit :: ObjectFile/PECOFF/./ObjectFilePECOFFTests/PECallFrameInfoTest.Chained_eh (1133 of 1977)
PASS: lldb-api :: commands/frame/diagnose/array/TestArray.py (1134 of 1977)
PASS: lldb-shell :: ObjectFile/Breakpad/uuid-matching-mac.test (1135 of 1977)
PASS: lldb-unit :: Utility/./UtilityTests/ArgsTest.TestTrailingBackslash (1136 of 1977)
PASS: lldb-shell :: ObjectFile/wasm/stripped-debug-sections.yaml (1137 of 1977)
UNSUPPORTED: lldb-api :: benchmarks/libcxxlist/TestBenchmarkLibcxxList.py (1138 of 1977)
PASS: lldb-api :: python_api/class_members/TestSBTypeClassMembers.py (1139 of 1977)
PASS: lldb-unit :: Utility/./UtilityTests/NameMatchesTest.EndsWith (1140 of 1977)
PASS: lldb-unit :: Utility/./UtilityTests/StringListTest.InsertStringAtIndexOutOfBounds (1141 of 1977)
PASS: lldb-api :: tools/lldb-vscode/breakpoint-events/TestVSCode_breakpointEvents.py (1142 of 1977)
PASS: lldb-api :: functionalities/thread/concurrent_events/TestConcurrentSignalNWatchNBreak.py (1143 of 1977)
PASS: lldb-unit :: Host/./HostTests/FileActionTest.Open (1144 of 1977)
PASS: lldb-unit :: Language/Highlighting/./HighlighterTests/HighlighterTest.ClangTrailingBackslashBeforeNewline (1145 of 1977)
PASS: lldb-unit :: UnwindAssembly/x86/./UnwindAssemblyx86Tests/Testx86AssemblyInspectionEngine.Test32bitFramelessBigStackFrame (1146 of 1977)
PASS: lldb-unit :: Process/gdb-remote/./ProcessGdbRemoteTests/GDBRemoteClientBaseTest.SendContinueAndInterrupt2PacketBug (1147 of 1977)
PASS: lldb-unit :: Utility/./UtilityTests/ScalarTest.Comparison (1148 of 1977)
PASS: lldb-api :: functionalities/data-formatter/data-formatter-objc/TestDataFormatterObjCExpr.py (1149 of 1977)
PASS: lldb-unit :: Host/./HostTests/ConnectionFileDescriptorTest.TCPGetURIv4 (1150 of 1977)
PASS: lldb-unit :: Utility/./UtilityTests/RangeTest.DoesAdjoinOrIntersect (1151 of 1977)
PASS: lldb-api :: functionalities/thread/concurrent_events/TestConcurrentTwoWatchpointsOneBreakpoint.py (1152 of 1977)
PASS: lldb-shell :: SymbolFile/NativePDB/function-types-classes.cpp (1153 of 1977)
PASS: lldb-api :: functionalities/load_using_paths/TestLoadUsingPaths.py (1154 of 1977)
PASS: lldb-unit :: Utility/./UtilityTests/StreamTeeTest.SetStreamAtIndexOverwrite (1155 of 1977)
PASS: lldb-api :: commands/expression/import-std-module/list/TestListFromStdModule.py (1156 of 1977)
PASS: lldb-api :: python_api/frame/get-variables/TestGetVariables.py (1157 of 1977)
PASS: lldb-shell :: SymbolFile/NativePDB/ast-types.cpp (1158 of 1977)
PASS: lldb-unit :: Utility/./UtilityTests/AnsiTerminal.AtStart (1159 of 1977)
PASS: lldb-api :: python_api/value/empty_class/TestValueAPIEmptyClass.py (1160 of 1977)
PASS: lldb-api :: functionalities/tail_call_frames/ambiguous_tail_call_seq2/TestAmbiguousTailCallSeq2.py (1161 of 1977)
PASS: lldb-unit :: Language/Highlighting/./HighlighterTests/HighlighterTest.ClangPreserveNewLine (1162 of 1977)
PASS: lldb-shell :: ObjectFile/Breakpad/sections-trailing-func.test (1163 of 1977)
PASS: lldb-shell :: ObjectFile/ELF/PT_LOAD-overlap-PT_TLS.yaml (1164 of 1977)
PASS: lldb-unit :: Utility/./UtilityTests/StringListTest.Join (1165 of 1977)
PASS: lldb-api :: functionalities/thread/concurrent_events/TestConcurrentSignalWatch.py (1166 of 1977)
PASS: lldb-api :: commands/expression/import-std-module/queue/TestQueueFromStdModule.py (1167 of 1977)
PASS: lldb-api :: functionalities/tail_call_frames/thread_step_out_or_return/TestSteppingOutWithArtificialFrames.py (1168 of 1977)
PASS: lldb-unit :: Utility/./UtilityTests/ProcessInstanceInfo.DumpTable (1169 of 1977)
PASS: lldb-unit :: ObjectFile/PECOFF/./ObjectFilePECOFFTests/PECallFrameInfoTest.Frame_reg_eh (1170 of 1977)
PASS: lldb-shell :: ObjectFile/PECOFF/export-dllfunc.yaml (1171 of 1977)
PASS: lldb-api :: functionalities/gdb_remote_client/TestNoGPacketSupported.py (1172 of 1977)
PASS: lldb-shell :: ObjectFile/ELF/PT_LOAD-overlap.yaml (1173 of 1977)
UNSUPPORTED: lldb-shell :: ScriptInterpreter/Lua/bindings.test (1174 of 1977)
PASS: lldb-api :: python_api/value/change_values/TestChangeValueAPI.py (1175 of 1977)
PASS: lldb-unit :: Utility/./UtilityTests/ArgsTest.AppendArguments (1176 of 1977)
PASS: lldb-api :: lang/objc/foundation/TestObjectDescriptionAPI.py (1177 of 1977)
PASS: lldb-api :: commands/watchpoints/multiple_hits/TestMultipleHits.py (1178 of 1977)
PASS: lldb-api :: tools/lldb-vscode/step/TestVSCode_step.py (1179 of 1977)
UNSUPPORTED: lldb-api :: linux/sepdebugsymlink/TestTargetSymbolsSepDebugSymlink.py (1180 of 1977)
PASS: lldb-unit :: Utility/./UtilityTests/BinaryStreamTest.PutSLEB128Zero (1181 of 1977)
PASS: lldb-unit :: Utility/./UtilityTests/StringExtractorTest.GetHexBytes_FullString (1182 of 1977)
PASS: lldb-unit :: Utility/./UtilityTests/BinaryStreamTest.PutULEB128ThreeBytes (1183 of 1977)
PASS: lldb-shell :: Minidump/memory-region.yaml (1184 of 1977)
PASS: lldb-shell :: Minidump/Windows/Sigsegv/sigsegv.test (1185 of 1977)
PASS: lldb-unit :: Core/./LLDBCoreTests/MangledTest.EmptyForInvalidName (1186 of 1977)
UNSUPPORTED: lldb-api :: lang/cpp/function-template-parameter-pack/TestFunctionTemplateParameterPack.py (1187 of 1977)
PASS: lldb-api :: functionalities/thread/concurrent_events/TestConcurrentManyBreakpoints.py (1188 of 1977)
UNSUPPORTED: lldb-api :: tools/lldb-server/TestGdbRemoteAuxvSupport.py (1189 of 1977)
PASS: lldb-unit :: UnwindAssembly/x86/./UnwindAssemblyx86Tests/Testx86AssemblyInspectionEngine.TestPushECX (1190 of 1977)
PASS: lldb-api :: python_api/sbenvironment/TestSBEnvironment.py (1191 of 1977)
PASS: lldb-api :: commands/expression/static-initializers/TestStaticInitializers.py (1192 of 1977)
PASS: lldb-api :: lang/cpp/frame-var-anon-unions/TestFrameVariableAnonymousUnions.py (1193 of 1977)
PASS: lldb-api :: commands/expression/calculator_mode/TestCalculatorMode.py (1194 of 1977)
PASS: lldb-unit :: debugserver/./debugserverTests/JSON.Parse (1195 of 1977)
UNSUPPORTED: lldb-api :: benchmarks/frame_variable/TestFrameVariableResponse.py (1196 of 1977)
PASS: lldb-unit :: Utility/./UtilityTests/RangeTest.DefaultConstructor (1197 of 1977)
PASS: lldb-api :: functionalities/data-formatter/data-formatter-stl/libcxx/initializerlist/TestInitializerList.py (1198 of 1977)
PASS: lldb-api :: functionalities/thread/create_after_attach/TestCreateAfterAttach.py (1199 of 1977)
PASS: lldb-unit :: Symbol/./SymbolTests/PostfixExpression.ToDWARF (1200 of 1977)
PASS: lldb-unit :: UnwindAssembly/x86/./UnwindAssemblyx86Tests/Testx86AssemblyInspectionEngine.TestSimple64bitFrameFunction (1201 of 1977)
PASS: lldb-api :: functionalities/data-formatter/data-formatter-stl/libcxx/vbool/TestDataFormatterLibcxxVBool.py (1202 of 1977)
PASS: lldb-unit :: Utility/./UtilityTests/StreamTeeTest.AppendStream (1203 of 1977)
PASS: lldb-api :: commands/expression/formatters/TestFormatters.py (1204 of 1977)
PASS: lldb-shell :: Minidump/no-process-id.yaml (1205 of 1977)
PASS: lldb-unit :: Process/minidump/./LLDBMinidumpTests/MinidumpParserTest.GetLinuxProcStatus_no_stream (1206 of 1977)
PASS: lldb-api :: commands/expression/import-std-module/empty-module/TestEmptyStdModule.py (1207 of 1977)
PASS: lldb-api :: python_api/symbol-context/two-files/TestSymbolContextTwoFiles.py (1208 of 1977)
PASS: lldb-unit :: Utility/./UtilityTests/NameMatchesTest.StartsWith (1209 of 1977)
PASS: lldb-shell :: ObjectFile/ELF/netbsd-core-amd64.test (1210 of 1977)
PASS: lldb-api :: functionalities/thread/concurrent_events/TestConcurrentWatchBreakDelay.py (1211 of 1977)
PASS: lldb-shell :: Reproducer/Functionalities/TestDataFormatter.test (1212 of 1977)
PASS: lldb-unit :: ObjectFile/Breakpad/./ObjectFileBreakpadTests/FuncRecord.parse (1213 of 1977)
PASS: lldb-unit :: Utility/./UtilityTests/UriParserTest.Minimal (1214 of 1977)
UNSUPPORTED: lldb-api :: functionalities/gdb_remote_client/TestWasm.py (1215 of 1977)
PASS: lldb-shell :: Commands/CommandScriptImmediateOutput/CommandScriptImmediateOutputFile.test (1216 of 1977)
PASS: lldb-api :: commands/expression/codegen-crash-typedefdecl-not-in_declcontext/TestCodegenCrashTypedefDeclNotInDeclContext.py (1217 of 1977)
PASS: lldb-api :: commands/expression/options/TestExprOptions.py (1218 of 1977)
UNSUPPORTED: lldb-api :: functionalities/unwind/ehframe/TestEhFrameUnwind.py (1219 of 1977)
PASS: lldb-api :: functionalities/tail_call_frames/inlining_and_tail_calls/TestInliningAndTailCalls.py (1220 of 1977)
PASS: lldb-api :: functionalities/data-formatter/data-formatter-globals/TestDataFormatterGlobals.py (1221 of 1977)
PASS: lldb-unit :: Core/./LLDBCoreTests/MangledTest.ResultForValidName (1222 of 1977)
PASS: lldb-unit :: Utility/./UtilityTests/OptionsWithRawTest.EmptySuffix (1223 of 1977)
PASS: lldb-unit :: Utility/./UtilityTests/Flags.GetBitSize (1224 of 1977)
PASS: lldb-unit :: ScriptInterpreter/Python/./ScriptInterpreterPythonTests/PythonDataObjectsTest.TestCallable (1225 of 1977)
PASS: lldb-shell :: SymbolFile/DWARF/split-dwarf-inlining.cpp (1226 of 1977)
PASS: lldb-unit :: Expression/./ExpressionTests/CppModuleConfigurationTest.Linux (1227 of 1977)
PASS: lldb-api :: functionalities/thread/concurrent_events/TestConcurrentSignalDelayWatch.py (1228 of 1977)
PASS: lldb-api :: macosx/find-dsym/deep-bundle/TestDeepBundle.py (1229 of 1977)
PASS: lldb-api :: commands/log/invalid-args/TestInvalidArgsLog.py (1230 of 1977)
PASS: lldb-unit :: Process/gdb-remote/./ProcessGdbRemoteTests/GDBRemoteCommunicationServerTest.SendErrorResponse_UnimplementedError (1231 of 1977)
PASS: lldb-api :: functionalities/data-formatter/data-formatter-stl/libcxx/optional/TestDataFormatterLibcxxOptional.py (1232 of 1977)
PASS: lldb-api :: lang/cpp/dynamic-value/TestDynamicValue.py (1233 of 1977)
PASS: lldb-unit :: Utility/./UtilityTests/ArgsTest.TestSingleArg (1234 of 1977)
PASS: lldb-unit :: tools/lldb-server/tests/./LLDBServerTests/TestBase.DebugserverEnv (1235 of 1977)
PASS: lldb-unit :: Utility/./UtilityTests/StreamTest.PutCString (1236 of 1977)
PASS: lldb-shell :: SymbolFile/Breakpad/line-table-discontinuous-file-ids.test (1237 of 1977)
PASS: lldb-api :: commands/apropos/basic/TestApropos.py (1238 of 1977)
PASS: lldb-unit :: ScriptInterpreter/Python/./ScriptInterpreterPythonTests/PythonDataObjectsTest.TestObjectAttributes (1239 of 1977)
PASS: lldb-unit :: Symbol/./SymbolTests/TestClangASTImporter.MetadataPropagation (1240 of 1977)
PASS: lldb-unit :: Utility/./UtilityTests/StringExtractorTest.DecodeHexU8_Exact (1241 of 1977)
PASS: lldb-unit :: Host/./HostTests/FileSystemTest.Exists (1242 of 1977)
PASS: lldb-shell :: SymbolFile/NativePDB/globals-bss.cpp (1243 of 1977)
PASS: lldb-shell :: SymbolFile/DWARF/debug-types-missing-signature.test (1244 of 1977)
PASS: lldb-unit :: Host/./HostTests/HostInfoTest.GetAugmentedArchSpec (1245 of 1977)
UNSUPPORTED: lldb-api :: functionalities/tsan/thread_leak/TestTsanThreadLeak.py (1246 of 1977)
UNSUPPORTED: lldb-shell :: BuildScript/toolchain-msvc.test (1247 of 1977)
PASS: lldb-api :: lang/c/forward/TestForwardDeclaration.py (1248 of 1977)
PASS: lldb-unit :: Language/Highlighting/./HighlighterTests/HighlighterTest.ClangSquareBrackets (1249 of 1977)
PASS: lldb-shell :: ObjectFile/PECOFF/section-types.yaml (1250 of 1977)
PASS: lldb-shell :: ObjectFile/ELF/section-overlap.yaml (1251 of 1977)
UNSUPPORTED: lldb-shell :: Breakpoint/ppc64-localentry.test (1252 of 1977)
PASS: lldb-unit :: Utility/./UtilityTests/StreamTest.PutHex32ByteOrderLittle (1253 of 1977)
PASS: lldb-unit :: Utility/./UtilityTests/FileSpecTest.GuessPathStyle (1254 of 1977)
PASS: lldb-shell :: SymbolFile/DWARF/dir-separator-no-comp-dir.s (1255 of 1977)
PASS: lldb-unit :: Utility/./UtilityTests/StringExtractorTest.GetHexU8_Exact_NoEof (1256 of 1977)
PASS: lldb-shell :: SymbolFile/DWARF/debug-types-dwo-cross-reference.cpp (1257 of 1977)
UNSUPPORTED: lldb-shell :: ScriptInterpreter/Lua/watchpoint_callback.test (1258 of 1977)
PASS: lldb-api :: commands/gui/invalid-args/TestInvalidArgsGui.py (1259 of 1977)
PASS: lldb-api :: commands/command/script/import/rdar-12586188/TestRdar12586188.py (1260 of 1977)
PASS: lldb-api :: functionalities/gdb_remote_client/TestRegDefinitionInParts.py (1261 of 1977)
PASS: lldb-api :: functionalities/data-formatter/cstring-utf8-summary/TestCstringUnicode.py (1262 of 1977)
PASS: lldb-api :: functionalities/breakpoint/serialize/TestBreakpointSerialization.py (1263 of 1977)
PASS: lldb-unit :: Language/Highlighting/./HighlighterTests/HighlighterTest.HighlighterSelectionPath (1264 of 1977)
PASS: lldb-api :: functionalities/data-formatter/data-formatter-enum-format/TestDataFormatterEnumFormat.py (1265 of 1977)
PASS: lldb-api :: lang/cpp/offsetof/TestOffsetofCpp.py (1266 of 1977)
PASS: lldb-shell :: SymbolFile/DWARF/clang-ast-from-dwarf-objc-property.m (1267 of 1977)
PASS: lldb-unit :: Process/gdb-remote/./ProcessGdbRemoteTests/GDBRemoteCommunicationClientTest.SyncThreadState (1268 of 1977)
PASS: lldb-api :: commands/frame/diagnose/virtual-method-call/TestDiagnoseDereferenceVirtualMethodCall.py (1269 of 1977)
UNSUPPORTED: lldb-api :: commands/gui/basic/TestGuiBasic.py (1270 of 1977)
PASS: lldb-api :: lang/cpp/global_operators/TestCppGlobalOperators.py (1271 of 1977)
PASS: lldb-api :: tools/lldb-server/register-reading/TestGdbRemoteGPacket.py (1272 of 1977)
PASS: lldb-api :: commands/watchpoints/watchpoint_events/TestWatchpointEvents.py (1273 of 1977)
UNSUPPORTED: lldb-shell :: Register/x86-64-xmm16-write.test (1274 of 1977)
PASS: lldb-api :: commands/target/dump-symtab-demangle/TestDumpSymtabDemangle.py (1275 of 1977)
PASS: lldb-api :: functionalities/data-formatter/nsdictionarysynth/TestNSDictionarySynthetic.py (1276 of 1977)
UNSUPPORTED: lldb-shell :: ScriptInterpreter/Lua/convenience_variables.test (1277 of 1977)
PASS: lldb-api :: commands/help/TestHelp.py (1278 of 1977)
PASS: lldb-shell :: SymbolFile/DWARF/find-basic-function.cpp (1279 of 1977)
PASS: lldb-unit :: ScriptInterpreter/Python/./ScriptInterpreterPythonTests/PythonDataObjectsTest.TestPythonInteger (1280 of 1977)
PASS: lldb-api :: functionalities/data-formatter/data-formatter-disabling/TestDataFormatterDisabling.py (1281 of 1977)
PASS: lldb-unit :: Utility/./UtilityTests/BroadcasterTest.BroadcastEvent (1282 of 1977)
PASS: lldb-unit :: Utility/./UtilityTests/StreamTest.AddressPrefixAndSuffix (1283 of 1977)
XFAIL: lldb-shell :: Register/x86-64-write.test (1284 of 1977)
PASS: lldb-api :: commands/watchpoints/watchpoint_set_command/TestWatchLocationWithWatchSet.py (1285 of 1977)
PASS: lldb-api :: functionalities/tail_call_frames/unambiguous_sequence/TestUnambiguousTailCalls.py (1286 of 1977)
PASS: lldb-unit :: Symbol/./SymbolTests/TestTypeSystemClang.TestFunctionTemplateConstruction (1287 of 1977)
UNSUPPORTED: lldb-api :: functionalities/tsan/cpp_global_location/TestTsanCPPGlobalLocation.py (1288 of 1977)
PASS: lldb-api :: commands/expression/persistent_variables/TestPersistentVariables.py (1289 of 1977)
PASS: lldb-api :: lang/objc/forward-decl/TestForwardDecl.py (1290 of 1977)
PASS: lldb-api :: lang/cpp/exceptions/TestCPPExceptionBreakpoints.py (1291 of 1977)
PASS: lldb-unit :: UnwindAssembly/x86/./UnwindAssemblyx86Tests/Testx86AssemblyInspectionEngine.TestStackRealign8BitDisp_i386 (1292 of 1977)
PASS: lldb-unit :: Language/CPlusPlus/./LanguageCPlusPlusTests/CPlusPlusLanguage.MethodNameParsing (1293 of 1977)
PASS: lldb-unit :: Utility/./UtilityTests/StreamTest.ShiftOperatorPtr (1294 of 1977)
PASS: lldb-unit :: UnwindAssembly/x86/./UnwindAssemblyx86Tests/Testx86AssemblyInspectionEngine.TestPushExtended (1295 of 1977)
PASS: lldb-api :: functionalities/optimized_code/TestNoASanExceptionAfterEvalOP_piece.py (1296 of 1977)
PASS: lldb-api :: commands/watchpoints/watchpoint_size/TestWatchpointSizes.py (1297 of 1977)
UNSUPPORTED: lldb-shell :: SymbolFile/PDB/compilands.test (1298 of 1977)
PASS: lldb-unit :: Language/Highlighting/./HighlighterTests/HighlighterTest.ClangIdentifiers (1299 of 1977)
PASS: lldb-api :: functionalities/breakpoint/breakpoint_language/TestBreakpointLanguage.py (1300 of 1977)
PASS: lldb-api :: types/TestShortType.py (1301 of 1977)
PASS: lldb-api :: lang/objc/foundation/TestObjCMethods2.py (1302 of 1977)
PASS: lldb-unit :: Utility/./UtilityTests/RangeTest.ClearWithStarAddress (1303 of 1977)
PASS: lldb-unit :: Utility/./UtilityTests/FileSpecTest.EqualDotsPosixRoot (1304 of 1977)
PASS: lldb-unit :: Utility/./UtilityTests/StringLexerTest.Next (1305 of 1977)
PASS: lldb-unit :: Host/./HostTests/Host.WaitStatusFormat (1306 of 1977)
PASS: lldb-api :: commands/disassemble/basic/TestDisassembleBreakpoint.py (1307 of 1977)
PASS: lldb-shell :: Unwind/thread-step-out-ret-addr-check.test (1308 of 1977)
PASS: lldb-unit :: SymbolFile/DWARF/./SymbolFileDWARFTests/DWARFASTParserClangTests.EnsureAllDIEsInDeclContextHaveBeenParsedParsesOnlyMatchingEntries (1309 of 1977)
PASS: lldb-unit :: Utility/./UtilityTests/StringExtractorTest.GetHexBytes_OddPair (1310 of 1977)
PASS: lldb-api :: commands/target/create-deps/TestTargetCreateDeps.py (1311 of 1977)
PASS: lldb-unit :: Expression/./ExpressionTests/CppModuleConfigurationTest.Xcode (1312 of 1977)
PASS: lldb-api :: commands/reproducer/invalid-args/TestInvalidArgsReproducer.py (1313 of 1977)
PASS: lldb-unit :: ScriptInterpreter/Python/./ScriptInterpreterPythonTests/PythonDataObjectsTest.TestTypeNameResolutionNoDot (1314 of 1977)
PASS: lldb-api :: types/TestRecursiveTypes.py (1315 of 1977)
UNSUPPORTED: lldb-shell :: SymbolFile/NativePDB/typedefs.cpp (1316 of 1977)
PASS: lldb-api :: types/TestDoubleTypesExpr.py (1317 of 1977)
PASS: lldb-shell :: SymbolFile/DWARF/dwo-type-in-main-file.s (1318 of 1977)
PASS: lldb-unit :: Utility/./UtilityTests/SubsystemRAIITest.NormalSubsystem (1319 of 1977)
PASS: lldb-unit :: Symbol/./SymbolTests/DWARFCallFrameInfoTest.Basic_eh (1320 of 1977)
PASS: lldb-api :: functionalities/memory-region/TestMemoryRegion.py (1321 of 1977)
PASS: lldb-api :: lang/objc/objc-new-syntax/TestObjCNewSyntaxArray.py (1322 of 1977)
PASS: lldb-unit :: UnwindAssembly/x86/./UnwindAssemblyx86Tests/Testx86AssemblyInspectionEngine.TestPopEDI (1323 of 1977)
PASS: lldb-api :: commands/expression/import-std-module/shared_ptr-dbg-info-content/TestSharedPtrDbgInfoContentFromStdModule.py (1324 of 1977)
PASS: lldb-unit :: Utility/./UtilityTests/StringListTest.LongestCommonPrefixSingleElement (1325 of 1977)
PASS: lldb-api :: lang/c/anonymous/TestAnonymous.py (1326 of 1977)
PASS: lldb-api :: python_api/section/TestSectionAPI.py (1327 of 1977)
PASS: lldb-unit :: UnwindAssembly/x86/./UnwindAssemblyx86Tests/Testx86AssemblyInspectionEngine.TestPushEBP (1328 of 1977)
PASS: lldb-api :: functionalities/data-formatter/array_typedef/TestArrayTypedef.py (1329 of 1977)
PASS: lldb-unit :: Utility/./UtilityTests/StringListTest.LongestCommonPrefixEmpty (1330 of 1977)
PASS: lldb-unit :: Language/Highlighting/./HighlighterTests/HighlighterTest.ClangEmptyInput (1331 of 1977)
PASS: lldb-unit :: Utility/./UtilityTests/StreamTeeTest.GetStreamAtIndexOutOfBounds (1332 of 1977)
PASS: lldb-unit :: Utility/./UtilityTests/UUIDTest.StringConverion (1333 of 1977)
PASS: lldb-unit :: Symbol/./SymbolTests/TestTypeSystemClang.TestDisplayNameEmpty (1334 of 1977)
PASS: lldb-unit :: Symbol/./SymbolTests/TestClangASTImporter.ImportInvalidType (1335 of 1977)
PASS: lldb-api :: python_api/exprpath_synthetic/TestExprPathSynthetic.py (1336 of 1977)
PASS: lldb-unit :: debugserver/./debugserverTests/RNBSocket.LoopBackConnectIPv4 (1337 of 1977)
PASS: lldb-unit :: Symbol/./SymbolTests/TestTypeSystemClang.TemplateArguments (1338 of 1977)
PASS: lldb-unit :: Utility/./UtilityTests/StringExtractorTest.GetHexBytesAvail (1339 of 1977)
PASS: lldb-api :: python_api/function_symbol/TestDisasmAPI.py (1340 of 1977)
PASS: lldb-api :: lang/objc/objc-checker/TestObjCCheckers.py (1341 of 1977)
PASS: lldb-unit :: Utility/./UtilityTests/VMRange.IsValid (1342 of 1977)
PASS: lldb-unit :: Utility/./UtilityTests/ArchSpecTest.YAML (1343 of 1977)
PASS: lldb-api :: lang/cpp/unicode-literals/TestUnicodeLiterals.py (1344 of 1977)
PASS: lldb-unit :: ScriptInterpreter/Python/./ScriptInterpreterPythonTests/PythonDataObjectsTest.TestPythonTupleValues (1345 of 1977)
PASS: lldb-api :: lang/c/unicode/TestUnicodeSymbols.py (1346 of 1977)
PASS: lldb-unit :: ScriptInterpreter/Python/./ScriptInterpreterPythonTests/PythonDataObjectsTest.TestPythonListToStructuredList (1347 of 1977)
PASS: lldb-api :: lang/objc/foundation/TestObjCMethodsNSError.py (1348 of 1977)
PASS: lldb-unit :: Symbol/./SymbolTests/TestTypeSystemClang.TestGetTypeClassDeclType (1349 of 1977)
PASS: lldb-unit :: Utility/./UtilityTests/FileSpecTest.EqualSeparator (1350 of 1977)
PASS: lldb-api :: functionalities/avoids-fd-leak/TestFdLeak.py (1351 of 1977)
UNSUPPORTED: lldb-shell :: ScriptInterpreter/Lua/persistent_state.test (1352 of 1977)
PASS: lldb-api :: lang/objc/objc-static-method/TestObjCStaticMethod.py (1353 of 1977)
PASS: lldb-unit :: Utility/./UtilityTests/StringLexerTest.Peek (1354 of 1977)
PASS: lldb-api :: commands/watchpoints/watchpoint_commands/command/TestWatchpointCommandPython.py (1355 of 1977)
PASS: lldb-unit :: Host/./HostTests/FileSystemTest.Resolve (1356 of 1977)
PASS: lldb-unit :: Utility/./UtilityTests/StreamTest.PutCharWhitespace (1357 of 1977)
PASS: lldb-shell :: Expr/TestTypeOfDeclTypeExpr.test (1358 of 1977)
PASS: lldb-api :: python_api/interpreter/TestRunCommandInterpreterAPI.py (1359 of 1977)
PASS: lldb-api :: functionalities/data-formatter/data-formatter-stl/libcxx/string/TestDataFormatterLibcxxString.py (1360 of 1977)
PASS: lldb-unit :: Process/minidump/./LLDBMinidumpTests/MinidumpParserTest.InvalidMinidump (1361 of 1977)
PASS: lldb-api :: macosx/lc-note/kern-ver-str/TestKernVerStrLCNOTE.py (1362 of 1977)
UNSUPPORTED: lldb-shell :: Register/x86-zmm-write.test (1363 of 1977)
UNSUPPORTED: lldb-api :: python_api/event/TestEvents.py (1364 of 1977)
PASS: lldb-shell :: ObjectFile/PECOFF/symbol.yaml (1365 of 1977)
PASS: lldb-unit :: Interpreter/./InterpreterTests/CompletionTest.DirCompletionUsername (1366 of 1977)
PASS: lldb-api :: macosx/find-dsym/bundle-with-dot-in-filename/TestBundleWithDotInFilename.py (1367 of 1977)
PASS: lldb-api :: functionalities/thread/concurrent_events/TestConcurrentDelayWatchBreak.py (1368 of 1977)
PASS: lldb-api :: lang/objc/objc-struct-return/TestObjCStructReturn.py (1369 of 1977)
PASS: lldb-shell :: SymbolFile/DWARF/DW_OP_piece-smaller-than-struct.s (1370 of 1977)
UNSUPPORTED: lldb-api :: functionalities/param_entry_vals/basic_entry_values_x86_64/TestBasicEntryValuesX86_64.py (1371 of 1977)
PASS: lldb-api :: commands/watchpoints/multiple_threads/TestWatchpointMultipleThreads.py (1372 of 1977)
PASS: lldb-unit :: Utility/./UtilityTests/RegularExpression.Match (1373 of 1977)
PASS: lldb-api :: functionalities/type_lookup/TestTypeLookup.py (1374 of 1977)
UNSUPPORTED: lldb-api :: functionalities/darwin_log/source/info/TestDarwinLogSourceInfo.py (1375 of 1977)
PASS: lldb-unit :: ObjectFile/ELF/./ObjectFileELFTests/ObjectFileELFTest.SectionsResolveConsistently (1376 of 1977)
PASS: lldb-shell :: Host/TestCustomShell.test (1377 of 1977)
PASS: lldb-unit :: Utility/./UtilityTests/StringExtractorTest.GetHexBytes_Partial (1378 of 1977)
PASS: lldb-unit :: Process/gdb-remote/./ProcessGdbRemoteTests/GDBRemoteCommunicationClientTest.GetModulesInfo (1379 of 1977)
PASS: lldb-unit :: Utility/./UtilityTests/UriParserTest.BadPort2 (1380 of 1977)
PASS: lldb-unit :: Expression/./ExpressionTests/DiagnosticManagerTest.AppendMessageNoDiag (1381 of 1977)
UNSUPPORTED: lldb-api :: python_api/disassemble-raw-data/TestDisassemble_VST1_64.py (1382 of 1977)
PASS: lldb-api :: commands/expression/save_jit_objects/TestSaveJITObjects.py (1383 of 1977)
UNSUPPORTED: lldb-api :: functionalities/asan/TestMemoryHistory.py (1384 of 1977)
PASS: lldb-shell :: SymbolFile/DWARF/debug_loclists-dwo.s (1385 of 1977)
PASS: lldb-api :: commands/frame/recognizer/TestFrameRecognizer.py (1386 of 1977)
PASS: lldb-unit :: Utility/./UtilityTests/NameMatchesTest.Ignore (1387 of 1977)
PASS: lldb-unit :: Utility/./UtilityTests/RangeTest.ContainsEndInclusiveInvalid (1388 of 1977)
PASS: lldb-api :: lang/objc/objc-ivar-offsets/TestObjCIvarOffsets.py (1389 of 1977)
PASS: lldb-unit :: Utility/./UtilityTests/BinaryStreamTest.PutULEB128One (1390 of 1977)
PASS: lldb-unit :: UnwindAssembly/x86/./UnwindAssemblyx86Tests/Testx86AssemblyInspectionEngine.TestPushR13 (1391 of 1977)
PASS: lldb-api :: lang/objc/modules-app-update/TestClangModulesAppUpdate.py (1392 of 1977)
PASS: lldb-unit :: Symbol/./SymbolTests/TestTypeSystemClang.TestDeletingImplicitCopyCstrDueToMoveCStr (1393 of 1977)
PASS: lldb-api :: functionalities/thread/crash_during_step/TestCrashDuringStep.py (1394 of 1977)
PASS: lldb-unit :: UnwindAssembly/x86/./UnwindAssemblyx86Tests/Testx86AssemblyInspectionEngine.TestLEAVE (1395 of 1977)
PASS: lldb-unit :: SymbolFile/NativePDB/./SymbolFileNativePDBTests/PDBFPOProgramToDWARFExpressionTests.InvalidAssignmentMultiple (1396 of 1977)
PASS: lldb-api :: commands/expression/import-std-module/conflicts/TestStdModuleWithConflicts.py (1397 of 1977)
UNSUPPORTED: lldb-api :: functionalities/signal/handle-segv/TestHandleSegv.py (1398 of 1977)
PASS: lldb-unit :: Utility/./UtilityTests/UserIDResolver.GetUserName (1399 of 1977)
UNSUPPORTED: lldb-api :: functionalities/darwin_log/filter/regex/message/TestDarwinLogFilterRegexMessage.py (1400 of 1977)
PASS: lldb-api :: lang/objc/print-obj/TestPrintObj.py (1401 of 1977)
PASS: lldb-api :: functionalities/data-formatter/data-formatter-synth/TestDataFormatterSynth.py (1402 of 1977)
UNSUPPORTED: lldb-api :: functionalities/thread/break_after_join/TestBreakAfterJoin.py (1403 of 1977)
PASS: lldb-api :: functionalities/breakpoint/breakpoint_by_line_and_column/TestBreakpointByLineAndColumn.py (1404 of 1977)
PASS: lldb-unit :: Expression/./ExpressionTests/DiagnosticManagerTest.GetStringMultiline (1405 of 1977)
PASS: lldb-api :: python_api/module_section/TestModuleAndSection.py (1406 of 1977)
PASS: lldb-api :: commands/expression/no-deadlock/TestExprDoesntBlock.py (1407 of 1977)
PASS: lldb-api :: functionalities/type_completion/TestTypeCompletion.py (1408 of 1977)
PASS: lldb-unit :: Utility/./UtilityTests/RangeTest.ContainsAddr (1409 of 1977)
PASS: lldb-api :: functionalities/gdb_remote_client/TestqOffsets.py (1410 of 1977)
PASS: lldb-unit :: Utility/./UtilityTests/ArgsTest.TestInsertArg (1411 of 1977)
PASS: lldb-api :: lang/c/struct_types/TestStructTypes.py (1412 of 1977)
PASS: lldb-api :: commands/command/script/import/TestImport.py (1413 of 1977)
PASS: lldb-shell :: SymbolFile/Breakpad/unwind-via-stack-win.test (1414 of 1977)
PASS: lldb-api :: functionalities/gdb_remote_client/TestWriteMemory.py (1415 of 1977)
PASS: lldb-shell :: Driver/TestRepl.test (1416 of 1977)
PASS: lldb-unit :: Process/minidump/./LLDBMinidumpTests/MinidumpParserTest.GetPidWindows (1417 of 1977)
PASS: lldb-api :: functionalities/data-formatter/data-formatter-stl/libcxx/tuple/TestDataFormatterLibcxxTuple.py (1418 of 1977)
PASS: lldb-unit :: Utility/./UtilityTests/ArchSpecTest.TestSetTriple (1419 of 1977)
PASS: lldb-api :: commands/frame/var/TestFrameVar.py (1420 of 1977)
PASS: lldb-unit :: Process/gdb-remote/./ProcessGdbRemoteTests/GDBRemoteClientBaseTest.SendPacketAndReceiveResponseWithOutputSupport (1421 of 1977)
PASS: lldb-api :: functionalities/postmortem/mach-core/TestMachCore.py (1422 of 1977)
UNSUPPORTED: lldb-api :: functionalities/darwin_log/basic/TestDarwinLogBasic.py (1423 of 1977)
PASS: lldb-unit :: Utility/./UtilityTests/StatusTest.ErrorConstructor (1424 of 1977)
PASS: lldb-shell :: SymbolFile/DWARF/debug-types-dwarf5.s (1425 of 1977)
PASS: lldb-unit :: Process/gdb-remote/./ProcessGdbRemoteTests/GDBRemoteClientBaseTest.SendContinueDelegateStructuredDataReceipt (1426 of 1977)
PASS: lldb-unit :: Utility/./UtilityTests/StreamTest.PutHex64ByteOrderBig (1427 of 1977)
PASS: lldb-shell :: SymbolFile/DWARF/debug_ranges-missing-section.s (1428 of 1977)
PASS: lldb-api :: macosx/universal/TestUniversal.py (1429 of 1977)
PASS: lldb-api :: macosx/thread-names/TestInterruptThreadNames.py (1430 of 1977)
PASS: lldb-api :: commands/expression/completion/TestExprCompletion.py (1431 of 1977)
PASS: lldb-api :: lang/objc/objc-class-method/TestObjCClassMethod.py (1432 of 1977)
PASS: lldb-unit :: UnwindAssembly/x86/./UnwindAssemblyx86Tests/Testx86AssemblyInspectionEngine.TestPushRBP (1433 of 1977)
PASS: lldb-unit :: Utility/./UtilityTests/SerializationRountripTest.SerializeDeserializeCStringArrayNullptr (1434 of 1977)
PASS: lldb-api :: lang/cpp/class-template-parameter-pack/TestClassTemplateParameterPack.py (1435 of 1977)
PASS: lldb-api :: lang/c/shared_lib_stripped_symbols/TestSharedLibStrippedSymbols.py (1436 of 1977)
PASS: lldb-unit :: Host/./HostTests/FileSystemTest.Readable (1437 of 1977)
PASS: lldb-api :: functionalities/data-formatter/data-formatter-stl/libcxx/queue/TestDataFormatterLibcxxQueue.py (1438 of 1977)
UNSUPPORTED: lldb-api :: functionalities/data-formatter/data-formatter-stl/libstdcpp/vector/TestDataFormatterStdVector.py (1439 of 1977)
PASS: lldb-api :: functionalities/thread/concurrent_events/TestConcurrentCrashWithWatchpoint.py (1440 of 1977)
PASS: lldb-unit :: Utility/./UtilityTests/StreamTest.PutBytesAsRawHex8ToBigEndian (1441 of 1977)
PASS: lldb-unit :: Target/./TargetTests/ModuleCacheTest.GetAndPutStrangeHostname (1442 of 1977)
PASS: lldb-unit :: Utility/./UtilityTests/BinaryStreamTest.PutSLEB128FourBytes (1443 of 1977)
PASS: lldb-unit :: Utility/./UtilityTests/StringListTest.GetMaxStringLengthMixed (1444 of 1977)
PASS: lldb-api :: functionalities/thread/concurrent_events/TestConcurrentDelayedCrashWithBreakpointSignal.py (1445 of 1977)
PASS: lldb-api :: commands/expression/context-object-objc/TestContextObjectObjc.py (1446 of 1977)
PASS: lldb-unit :: Target/./TargetTests/PathMappingListTest.RelativeTests (1447 of 1977)
PASS: lldb-api :: functionalities/tail_call_frames/ambiguous_tail_call_seq1/TestAmbiguousTailCallSeq1.py (1448 of 1977)
UNSUPPORTED: lldb-shell :: SymbolFile/dissassemble-entry-point.s (1449 of 1977)
PASS: lldb-unit :: Process/minidump/./LLDBMinidumpTests/MinidumpParserTest.GetThreadContext_x86_64 (1450 of 1977)
PASS: lldb-unit :: Utility/./UtilityTests/StringExtractorTest.GetU32BigEndian (1451 of 1977)
PASS: lldb-unit :: Utility/./UtilityTests/RangeTest.Union (1452 of 1977)
PASS: lldb-unit :: Utility/./UtilityTests/OptionsWithRawTest.WhitespaceInput (1453 of 1977)
PASS: lldb-shell :: SymbolFile/DWARF/debug-types-basic.test (1454 of 1977)
PASS: lldb-api :: functionalities/data-formatter/data-formatter-python-synth/TestDataFormatterPythonSynth.py (1455 of 1977)
PASS: lldb-shell :: SymbolFile/NativePDB/function-types-builtins.cpp (1456 of 1977)
PASS: lldb-unit :: ObjectFile/PECOFF/./ObjectFilePECOFFTests/PECallFrameInfoTest.Basic_eh (1457 of 1977)
XFAIL: lldb-shell :: Register/x86-64-ymm-write.test (1458 of 1977)
PASS: lldb-api :: functionalities/thread/concurrent_events/TestConcurrentTwoBreakpointThreads.py (1459 of 1977)
PASS: lldb-unit :: Utility/./UtilityTests/UUIDTest.SetFromStringRef (1460 of 1977)
PASS: lldb-unit :: Utility/./UtilityTests/StreamTest.PutHex16ByteOrderBig (1461 of 1977)
PASS: lldb-api :: lang/cpp/accelerator-table/TestCPPAccelerator.py (1462 of 1977)
PASS: lldb-api :: functionalities/postmortem/elf-core/TestLinuxCore.py (1463 of 1977)
PASS: lldb-api :: lang/cpp/class_types/TestClassTypesDisassembly.py (1464 of 1977)
PASS: lldb-unit :: Utility/./UtilityTests/StringLexerTest.PutBack (1465 of 1977)
PASS: lldb-api :: functionalities/data-formatter/data-formatter-objc/nsindexpath/TestDataFormatterNSIndexPath.py (1466 of 1977)
PASS: lldb-api :: lang/c/modules/TestCModules.py (1467 of 1977)
PASS: lldb-api :: commands/expression/expr-in-syscall/TestExpressionInSyscall.py (1468 of 1977)
PASS: lldb-unit :: Utility/./UtilityTests/ScalarTest.Division (1469 of 1977)
PASS: lldb-unit :: Utility/./UtilityTests/RangeTest.Equal (1470 of 1977)
PASS: lldb-unit :: Utility/./UtilityTests/StringListTest.SplitIntoLinesSingleTrailingCR (1471 of 1977)
PASS: lldb-shell :: BuildScript/script-args.test (1472 of 1977)
PASS: lldb-unit :: Utility/./UtilityTests/VMRange.ContainsRange (1473 of 1977)
PASS: lldb-shell :: SymbolFile/DWARF/dwp.s (1474 of 1977)
PASS: lldb-api :: python_api/name_lookup/TestNameLookup.py (1475 of 1977)
PASS: lldb-shell :: SymbolFile/NativePDB/ast-methods.cpp (1476 of 1977)
PASS: lldb-api :: commands/expression/entry-bp/TestExprEntryBP.py (1477 of 1977)
PASS: lldb-unit :: Host/./HostTests/SocketTest.TCPGetConnectURI (1478 of 1977)
PASS: lldb-api :: commands/target/stop-hooks/TestStopHooks.py (1479 of 1977)
PASS: lldb-unit :: Utility/./UtilityTests/StringExtractorTest.GetU32LittleEndian (1480 of 1977)
PASS: lldb-unit :: Utility/./UtilityTests/StreamTeeTest.Flush (1481 of 1977)
PASS: lldb-unit :: SymbolFile/DWARF/./SymbolFileDWARFTests/SymbolFileDWARFTests.TestAbbrevInvalidNULLTag (1482 of 1977)
PASS: lldb-unit :: UnwindAssembly/x86/./UnwindAssemblyx86Tests/Testx86AssemblyInspectionEngine.Test32BitOnlyInstruction (1483 of 1977)
PASS: lldb-unit :: Utility/./UtilityTests/StringExtractorTest.GetHexU8_InvalidHex (1484 of 1977)
PASS: lldb-api :: functionalities/data-formatter/summary-string-onfail/Test-rdar-9974002.py (1485 of 1977)
PASS: lldb-unit :: Process/minidump/./LLDBMinidumpTests/MinidumpParserTest.GetFilteredModuleList (1486 of 1977)
PASS: lldb-api :: functionalities/set-data/TestSetData.py (1487 of 1977)
PASS: lldb-unit :: UnwindAssembly/x86/./UnwindAssemblyx86Tests/Testx86AssemblyInspectionEngine.TestPushImm (1488 of 1977)
PASS: lldb-api :: commands/expression/context-object/TestContextObject.py (1489 of 1977)
PASS: lldb-unit :: SymbolFile/NativePDB/./SymbolFileNativePDBTests/PDBFPOProgramToDWARFExpressionTests.MultipleIndependentAssignments (1490 of 1977)
PASS: lldb-api :: functionalities/thread/concurrent_events/TestConcurrentSignalBreak.py (1491 of 1977)
UNSUPPORTED: lldb-shell :: ScriptInterpreter/Lua/nested_sessions.test (1492 of 1977)
PASS: lldb-unit :: Utility/./UtilityTests/FileSpecTest.Match (1493 of 1977)
PASS: lldb-api :: functionalities/tail_call_frames/disambiguate_call_site/TestDisambiguateCallSite.py (1494 of 1977)
PASS: lldb-api :: functionalities/data-formatter/data-formatter-stl/libcxx/set/TestDataFormatterLibcxxSet.py (1495 of 1977)
PASS: lldb-shell :: Quit/TestQuitExitCode-30.test (1496 of 1977)
PASS: lldb-unit :: Utility/./UtilityTests/ArgsTest.DoubleQuotedItem (1497 of 1977)
PASS: lldb-unit :: Symbol/./SymbolTests/TestTypeSystemClang.TestGetTypeClassNested (1498 of 1977)
PASS: lldb-shell :: ScriptInterpreter/None/import_module.test (1499 of 1977)
UNSUPPORTED: lldb-api :: terminal/TestEditline.py (1500 of 1977)
PASS: lldb-api :: commands/expression/timeout/TestCallWithTimeout.py (1501 of 1977)
PASS: lldb-shell :: ObjectFile/MachO/lc_build_version.yaml (1502 of 1977)
PASS: lldb-api :: functionalities/archives/TestBSDArchives.py (1503 of 1977)
PASS: lldb-unit :: Host/./HostTests/TaskPoolTest.TaskMap (1504 of 1977)
PASS: lldb-unit :: Utility/./UtilityTests/RangeTest.ContainsRangeStartingFromZero (1505 of 1977)
PASS: lldb-shell :: SymbolFile/DWARF/find-qualified-variable.cpp (1506 of 1977)
PASS: lldb-api :: functionalities/object-file/TestImageListMultiArchitecture.py (1507 of 1977)
PASS: lldb-unit :: debugserver/./debugserverTests/RNBSocket.LoopBackListenIPv4 (1508 of 1977)
UNSUPPORTED: lldb-api :: functionalities/tsan/multiple/TestTsanMultiple.py (1509 of 1977)
PASS: lldb-shell :: ScriptInterpreter/Python/crashlog.test (1510 of 1977)
PASS: lldb-api :: lang/cpp/char1632_t/TestChar1632T.py (1511 of 1977)
PASS: lldb-unit :: Host/./HostTests/MainLoopTest.UnmonitoredSignal (1512 of 1977)
PASS: lldb-shell :: Driver/TestProcessAttach.test (1513 of 1977)
PASS: lldb-api :: commands/expression/call-throws/TestCallThatThrows.py (1514 of 1977)
PASS: lldb-unit :: Utility/./UtilityTests/FileSpecTest.FileAndDirectoryComponents (1515 of 1977)
PASS: lldb-unit :: debugserver/./debugserverTests/RNBSocket.LoopBackConnectIPv6 (1516 of 1977)
UNSUPPORTED: lldb-shell :: Register/aarch64-fp-read.test (1517 of 1977)
UNSUPPORTED: lldb-shell :: Process/Windows/exception_access_violation.cpp (1518 of 1977)
PASS: lldb-unit :: Breakpoint/./LLDBBreakpointTests/BreakpointIDTest.StringIsBreakpointName (1519 of 1977)
PASS: lldb-unit :: Utility/./UtilityTests/Flags.AllSet (1520 of 1977)
PASS: lldb-api :: functionalities/data-formatter/data-formatter-stl/libcxx/bitset/TestDataFormatterLibcxxBitset.py (1521 of 1977)
PASS: lldb-api :: tools/lldb-server/TestGdbRemoteHostInfo.py (1522 of 1977)
PASS: lldb-unit :: Process/minidump/./LLDBMinidumpTests/MinidumpParserTest.GetArchitectureWindows (1523 of 1977)
UNSUPPORTED: lldb-shell :: ScriptInterpreter/Lua/independent_state.test (1524 of 1977)
PASS: lldb-unit :: Utility/./UtilityTests/SerializationRountripTest.SerializeDeserializeCStringArray (1525 of 1977)
PASS: lldb-api :: macosx/find-app-in-bundle/TestFindAppInBundle.py (1526 of 1977)
PASS: lldb-api :: functionalities/thread/concurrent_events/TestConcurrentSignalWatchBreak.py (1527 of 1977)
PASS: lldb-api :: functionalities/signal/raise/TestRaise.py (1528 of 1977)
PASS: lldb-unit :: Host/./HostTests/MainLoopTest.TerminatesImmediately (1529 of 1977)
PASS: lldb-unit :: ObjectFile/ELF/./ObjectFileELFTests/ObjectFileELFTest.GetSymtab_NoSymEntryPointArmThumbAddressClass (1530 of 1977)
PASS: lldb-api :: commands/expression/import-std-module/shared_ptr/TestSharedPtrFromStdModule.py (1531 of 1977)
PASS: lldb-api :: functionalities/testid/TestTestId.py (1532 of 1977)
PASS: lldb-unit :: Process/gdb-remote/./ProcessGdbRemoteTests/GDBRemoteCommunicationClientTest.ReadRegister (1533 of 1977)
PASS: lldb-api :: lang/objc/direct-dispatch-step/TestObjCDirectDispatchStepping.py (1534 of 1977)
PASS: lldb-api :: lang/objc/objc-struct-argument/TestObjCStructArgument.py (1535 of 1977)
UNSUPPORTED: lldb-api :: commands/register/register/intel_xtended_registers/mpx_bound_violation/TestBoundViolation.py (1536 of 1977)
PASS: lldb-api :: lang/mixed/TestMixedLanguages.py (1537 of 1977)
PASS: lldb-unit :: Language/Highlighting/./HighlighterTests/HighlighterTest.ClangCursorPosInOtherToken (1538 of 1977)
PASS: lldb-unit :: Utility/./UtilityTests/StringListTest.InsertStringAtIndexStart (1539 of 1977)
PASS: lldb-unit :: Host/./HostTests/NativeProcessProtocolTest.SetBreakpointFailWrite (1540 of 1977)
PASS: lldb-unit :: Utility/./UtilityTests/ConstStringTest.CompareStringRef (1541 of 1977)
UNSUPPORTED: lldb-api :: lang/objc/rdar-12408181/TestRdar12408181.py (1542 of 1977)
UNSUPPORTED: lldb-api :: functionalities/darwin_log/filter/regex/activity-chain/TestDarwinLogFilterRegexActivityChain.py (1543 of 1977)
PASS: lldb-unit :: Utility/./UtilityTests/StringListTest.AppendListCStringArrayEmpty (1544 of 1977)
PASS: lldb-api :: lang/c/step_over_no_deadlock/TestStepOverDoesntBlock.py (1545 of 1977)
PASS: lldb-api :: lang/objc/objc_direct-methods/TestObjCDirectMethods.py (1546 of 1977)
UNSUPPORTED: lldb-api :: tools/lldb-server/platform-process-connect/TestPlatformProcessConnect.py (1547 of 1977)
PASS: lldb-unit :: Host/./HostTests/MainLoopTest.DetectsEOF (1548 of 1977)
PASS: lldb-api :: commands/target/basic/TestTargetCommand.py (1549 of 1977)
PASS: lldb-api :: types/TestFloatTypesExpr.py (1550 of 1977)
UNSUPPORTED: lldb-shell :: Register/x86-zmm-read.test (1551 of 1977)
PASS: lldb-unit :: Utility/./UtilityTests/ArchSpecTest.OperatorBool (1552 of 1977)
PASS: lldb-unit :: Utility/./UtilityTests/DataExtractorTest.GetCStrAtNullOffset (1553 of 1977)
PASS: lldb-unit :: Utility/./UtilityTests/StringListTest.PopBack (1554 of 1977)
PASS: lldb-api :: functionalities/breakpoint/step_over_breakpoint/TestStepOverBreakpoint.py (1555 of 1977)
PASS: lldb-shell :: Reproducer/TestDump.test (1556 of 1977)
PASS: lldb-unit :: Symbol/./SymbolTests/DWARFCallFrameInfoTest.Basic_dwarf3 (1557 of 1977)
PASS: lldb-unit :: Host/./HostTests/NativeProcessProtocolTest.ReadCStringFromMemory (1558 of 1977)
PASS: lldb-unit :: Utility/./UtilityTests/StructuredDataTest.ParseJSONFromFile (1559 of 1977)
PASS: lldb-api :: lang/cpp/scope/TestCppScope.py (1560 of 1977)
PASS: lldb-api :: commands/statistics/basic/TestStats.py (1561 of 1977)
PASS: lldb-shell :: SymbolFile/DWARF/find-basic-namespace.cpp (1562 of 1977)
PASS: lldb-api :: functionalities/data-formatter/data-formatter-objc/TestDataFormatterObjNSException.py (1563 of 1977)
PASS: lldb-shell :: Register/x86-64-ymm-read.test (1564 of 1977)
PASS: lldb-api :: lang/cpp/gmodules-templates/TestGModules.py (1565 of 1977)
PASS: lldb-api :: commands/command/nested_alias/TestNestedAlias.py (1566 of 1977)
PASS: lldb-shell :: Breakpoint/jitbp_elf.test (1567 of 1977)
PASS: lldb-shell :: Settings/TestDisassemblyFormat.test (1568 of 1977)
PASS: lldb-api :: commands/disassemble/basic/TestFrameDisassemble.py (1569 of 1977)
PASS: lldb-unit :: Utility/./UtilityTests/StructuredDataTest.StringDump (1570 of 1977)
PASS: lldb-api :: functionalities/postmortem/elf-core/gcore/TestGCore.py (1571 of 1977)
PASS: lldb-api :: functionalities/breakpoint/address_breakpoints/TestAddressBreakpoints.py (1572 of 1977)
PASS: lldb-shell :: Expr/TestMultilineExpr.test (1573 of 1977)
PASS: lldb-unit :: Symbol/./SymbolTests/TestTypeSystemClang.TestGetEnumIntegerTypeInvalid (1574 of 1977)
PASS: lldb-api :: commands/expression/test/TestExprs.py (1575 of 1977)
PASS: lldb-unit :: Utility/./UtilityTests/StreamTeeTest.Write (1576 of 1977)
PASS: lldb-api :: commands/expression/dollar-in-variable/TestDollarInVariable.py (1577 of 1977)
PASS: lldb-api :: functionalities/abbreviation/TestAbbreviations.py (1578 of 1977)
PASS: lldb-api :: lang/c/step-target/TestStepTarget.py (1579 of 1977)
PASS: lldb-shell :: SymbolFile/Breakpad/stack-cfi-parsing.test (1580 of 1977)
PASS: lldb-shell :: Reproducer/TestMultipleTargets.test (1581 of 1977)
PASS: lldb-api :: functionalities/breakpoint/consecutive_breakpoints/TestConsecutiveBreakpoints.py (1582 of 1977)
PASS: lldb-unit :: Utility/./UtilityTests/SerializationRountripTest.SerializeDeserializeCStringNull (1583 of 1977)
PASS: lldb-api :: functionalities/postmortem/minidump/TestMiniDump.py (1584 of 1977)
PASS: lldb-shell :: Reproducer/Functionalities/TestStepping.test (1585 of 1977)
XFAIL: lldb-shell :: Unwind/prefer-debug-over-eh-frame.test (1586 of 1977)
UNSUPPORTED: lldb-api :: lang/objc/bitfield_ivars/TestBitfieldIvars.py (1587 of 1977)
PASS: lldb-unit :: Utility/./UtilityTests/LogTest.Register (1588 of 1977)
PASS: lldb-api :: lang/c/bitfields/TestBitfields.py (1589 of 1977)
PASS: lldb-api :: functionalities/thread/concurrent_events/TestConcurrentCrashWithSignal.py (1590 of 1977)
PASS: lldb-shell :: ObjectFile/Breakpad/breakpad-identification.test (1591 of 1977)
PASS: lldb-api :: commands/expression/import-std-module/deque-dbg-info-content/TestDbgInfoContentDequeFromStdModule.py (1592 of 1977)
PASS: lldb-shell :: Reproducer/TestSynchronous.test (1593 of 1977)
PASS: lldb-api :: commands/breakpoint/command/list/TestBreakpointCommandList.py (1594 of 1977)
PASS: lldb-unit :: Process/gdb-remote/./ProcessGdbRemoteTests/GDBRemoteClientBaseTest.SendContinueAndInterrupt (1595 of 1977)
PASS: lldb-api :: functionalities/gdb_remote_client/TestGDBRemoteClient.py (1596 of 1977)
PASS: lldb-api :: lang/cpp/chained-calls/TestCppChainedCalls.py (1597 of 1977)
PASS: lldb-api :: functionalities/history/TestHistoryRecall.py (1598 of 1977)
PASS: lldb-api :: macosx/version_zero/TestGetVersionZeroVersion.py (1599 of 1977)
UNSUPPORTED: lldb-shell :: SymbolFile/PDB/function-level-linking.test (1600 of 1977)
PASS: lldb-api :: commands/watchpoints/step_over_watchpoint/TestStepOverWatchpoint.py (1601 of 1977)
PASS: lldb-shell :: Commands/command-script-import.test (1602 of 1977)
PASS: lldb-unit :: Utility/./UtilityTests/UriParserTest.BracketedHostname (1603 of 1977)
PASS: lldb-unit :: Utility/./UtilityTests/UUIDTest.RelationalOperators (1604 of 1977)
PASS: lldb-unit :: UnwindAssembly/x86/./UnwindAssemblyx86Tests/Testx86AssemblyInspectionEngine.TestMovRSPtoRBP (1605 of 1977)
UNSUPPORTED: lldb-api :: functionalities/thread/create_during_step/TestCreateDuringStep.py (1606 of 1977)
PASS: lldb-unit :: Utility/./UtilityTests/ScalarTest.APIntConstructor (1607 of 1977)
FAIL: lldb-api :: python_api/thread/TestThreadAPI.py (1608 of 1977)
******************** TEST 'lldb-api :: python_api/thread/TestThreadAPI.py' FAILED ********************
Script:
--
/usr/local/bin/python /Users/buildslave/jenkins/workspace/lldb-cmake-sanitized/llvm-project/lldb/test/API/dotest.py --arch x86_64 -s /Users/buildslave/jenkins/workspace/lldb-cmake-sanitized/lldb-build/lldb-test-traces -S nm -u CXXFLAGS -u CFLAGS --codesign-identity lldb_codesign --server /Users/buildslave/jenkins/workspace/lldb-cmake-sanitized/lldb-build/./bin/debugserver --arch x86_64 --build-dir /Users/buildslave/jenkins/workspace/lldb-cmake-sanitized/lldb-build/lldb-test-build.noindex -s=/Users/buildslave/jenkins/workspace/lldb-cmake-sanitized/test/logs -t --env TERM=vt100 --env LLVM_LIBS_DIR=/Users/buildslave/jenkins/workspace/lldb-cmake-sanitized/lldb-build/./lib --inferior-env ASAN_OPTIONS=detect_stack_use_after_return=1 --inferior-env DYLD_INSERT_LIBRARIES=/Users/buildslave/jenkins/workspace/lldb-cmake-sanitized/host-compiler/lib/clang/11.0.0/lib/darwin/libclang_rt.asan_osx_dynamic.dylib --build-dir /Users/buildslave/jenkins/workspace/lldb-cmake-sanitized/lldb-build/lldb-test-build.noindex --lldb-module-cache-dir /Users/buildslave/jenkins/workspace/lldb-cmake-sanitized/lldb-build/lldb-test-build.noindex/module-cache-lldb/lldb-api --clang-module-cache-dir /Users/buildslave/jenkins/workspace/lldb-cmake-sanitized/lldb-build/lldb-test-build.noindex/module-cache-clang/lldb-api --executable /Users/buildslave/jenkins/workspace/lldb-cmake-sanitized/lldb-build/./bin/lldb --compiler /Users/buildslave/jenkins/workspace/lldb-cmake-sanitized/lldb-build/./bin/clang --dsymutil /Users/buildslave/jenkins/workspace/lldb-cmake-sanitized/lldb-build/./bin/dsymutil --filecheck /Users/buildslave/jenkins/workspace/lldb-cmake-sanitized/lldb-build/./bin/FileCheck --lldb-libs-dir /Users/buildslave/jenkins/workspace/lldb-cmake-sanitized/lldb-build/./lib /Users/buildslave/jenkins/workspace/lldb-cmake-sanitized/llvm-project/lldb/test/API/python_api/thread -p TestThreadAPI.py
--
Exit Code: 1

Hide Details

Command Output (stdout): -- lldb version 11.0.99 clang revision 2451e4c597885aaa76a1a70f98056ecca7d23cf8 llvm revision 2451e4c597885aaa76a1a70f98056ecca7d23cf8 LLDB library dir: /Users/buildslave/jenkins/workspace/lldb-cmake-sanitized/lldb-build/bin LLDB import library dir: /Users/buildslave/jenkins/workspace/lldb-cmake-sanitized/lldb-build/./lib libstdcxx tests will not be run because: Don't know how to build with libstdcxx on macosx Skipping following debug info categories: ['dwo'] start addr: 0x1072b9e66 end addr: 0x1072b9e70 start addr: 0x1006d0e66 end addr: 0x1006d0e70 start addr: 0x104bd1e66 end addr: 0x104bd1e70

Hide Details

-- Command Output (stderr): --

Hide Details

Session logs for test failures/errors/unexpected successes will go into directory '/Users/buildslave/jenkins/workspace/lldb-cmake-sanitized/test/logs' Command invoked: /Users/buildslave/jenkins/workspace/lldb-cmake-sanitized/llvm-project/lldb/test/API/dotest.py --arch x86_64 -s /Users/buildslave/jenkins/workspace/lldb-cmake-sanitized/lldb-build/lldb-test-traces -S nm -u CXXFLAGS -u CFLAGS --codesign-identity lldb_codesign --server /Users/buildslave/jenkins/workspace/lldb-cmake-sanitized/lldb-build/./bin/debugserver --arch x86_64 --build-dir /Users/buildslave/jenkins/workspace/lldb-cmake-sanitized/lldb-build/lldb-test-build.noindex -s=/Users/buildslave/jenkins/workspace/lldb-cmake-sanitized/test/logs -t --env TERM=vt100 --env LLVM_LIBS_DIR=/Users/buildslave/jenkins/workspace/lldb-cmake-sanitized/lldb-build/./lib --inferior-env ASAN_OPTIONS=detect_stack_use_after_return=1 --inferior-env DYLD_INSERT_LIBRARIES=/Users/buildslave/jenkins/workspace/lldb-cmake-sanitized/host-compiler/lib/clang/11.0.0/lib/darwin/libclang_rt.asan_osx_dynamic.dylib --build-dir /Users/buildslave/jenkins/workspace/lldb-cmake-sanitized/lldb-build/lldb-test-build.noindex --lldb-module-cache-dir /Users/buildslave/jenkins/workspace/lldb-cmake-sanitized/lldb-build/lldb-test-build.noindex/module-cache-lldb/lldb-api --clang-module-cache-dir /Users/buildslave/jenkins/workspace/lldb-cmake-sanitized/lldb-build/lldb-test-build.noindex/module-cache-clang/lldb-api --executable /Users/buildslave/jenkins/workspace/lldb-cmake-sanitized/lldb-build/./bin/lldb --compiler /Users/buildslave/jenkins/workspace/lldb-cmake-sanitized/lldb-build/./bin/clang --dsymutil /Users/buildslave/jenkins/workspace/lldb-cmake-sanitized/lldb-build/./bin/dsymutil --filecheck /Users/buildslave/jenkins/workspace/lldb-cmake-sanitized/lldb-build/./bin/FileCheck --lldb-libs-dir /Users/buildslave/jenkins/workspace/lldb-cmake-sanitized/lldb-build/./lib /Users/buildslave/jenkins/workspace/lldb-cmake-sanitized/llvm-project/lldb/test/API/python_api/thread -p TestThreadAPI.py Change dir to: /Users/buildslave/jenkins/workspace/lldb-cmake-sanitized/llvm-project/lldb/test/API/python_api/thread runCmd: settings clear -all output:

Hide Details

runCmd: settings set symbols.enable-external-lookup false output:

Hide Details

runCmd: settings set target.auto-apply-fixits false output:

Hide Details

runCmd: settings set plugin.process.gdb-remote.packet-timeout 60 output:

Hide Details

runCmd: settings set symbols.clang-modules-cache-path "/Users/buildslave/jenkins/workspace/lldb-cmake-sanitized/lldb-build/lldb-test-build.noindex/module-cache-lldb/lldb-api" output:

Hide Details

runCmd: settings set use-color false output:

Hide Details

runCmd: setting set target.prefer-dynamic-value no-dynamic-values output:

Hide Details

runCmd: settings set target.env-vars ASAN_OPTIONS=detect_stack_use_after_return=1 DYLD_INSERT_LIBRARIES=/Users/buildslave/jenkins/workspace/lldb-cmake-sanitized/host-compiler/lib/clang/11.0.0/lib/darwin/libclang_rt.asan_osx_dynamic.dylib output:

Hide Details

runCmd: breakpoint list output: Current breakpoints: 1: file = 'main.cpp', line = 17, exact_match = 0, locations = 1 1.1: where = a.out`main + 115 at main.cpp:17:5, address = a.out[0x0000000100000f53], unresolved, hit count = 0

Hide Details

Hide Details

Hide Details

runCmd: process status output: Process 16452 stopped * thread #1, queue = 'com.apple.main-thread', stop reason = breakpoint 1.1 frame #0: 0x0000000107e50f53 a.out`main(argc=1, argv=0x00007ffee7daf4c8) at main.cpp:17:5 14 15 printf("after the loop: my_char='%c'\n", my_char); // 'my_char' should print out as 'x'. 16 -> 17 return 0; // Set break point at this line and check variable 'my_char'. ^ 18 }

Hide Details

Hide Details

<bound method SBProcess.Kill of <lldb.SBProcess; proxy of <Swig Object of type 'lldb::SBProcess *' at 0x127879ab0> >>: success

Hide Details

PASS: LLDB (/Users/buildslave/jenkins/workspace/lldb-cmake-sanitized/lldb-build/bin/clang-11-x86_64) :: test_get_process_dsym (TestThreadAPI.ThreadAPITestCase) runCmd: settings clear -all output:

Hide Details

runCmd: settings set symbols.enable-external-lookup false output:

Hide Details

runCmd: settings set target.auto-apply-fixits false output:

Hide Details

runCmd: settings set plugin.process.gdb-remote.packet-timeout 60 output:

Hide Details

runCmd: settings set symbols.clang-modules-cache-path "/Users/buildslave/jenkins/workspace/lldb-cmake-sanitized/lldb-build/lldb-test-build.noindex/module-cache-lldb/lldb-api" output:

Hide Details

runCmd: settings set use-color false output:

Hide Details

runCmd: setting set target.prefer-dynamic-value no-dynamic-values output:

Hide Details

runCmd: settings set target.env-vars ASAN_OPTIONS=detect_stack_use_after_return=1 DYLD_INSERT_LIBRARIES=/Users/buildslave/jenkins/workspace/lldb-cmake-sanitized/host-compiler/lib/clang/11.0.0/lib/darwin/libclang_rt.asan_osx_dynamic.dylib output:

Hide Details

runCmd: breakpoint list output: Current breakpoints: 1: file = 'main.cpp', line = 17, exact_match = 0, locations = 1 1.1: where = a.out`main + 115 at main.cpp:17:5, address = a.out[0x0000000100000f53], unresolved, hit count = 0

Hide Details

Hide Details

Hide Details

runCmd: process status output: Process 16589 stopped * thread #1, queue = 'com.apple.main-thread', stop reason = breakpoint 1.1 frame #0: 0x000000010d288f53 a.out`main(argc=1, argv=0x00007ffee2977498) at main.cpp:17:5 14 15 printf("after the loop: my_char='%c'\n", my_char); // 'my_char' should print out as 'x'. 16 -> 17 return 0; // Set break point at this line and check variable 'my_char'. ^ 18 }

Hide Details

Hide Details

<bound method SBProcess.Kill of <lldb.SBProcess; proxy of <Swig Object of type 'lldb::SBProcess *' at 0x11061e990> >>: success

Hide Details

PASS: LLDB (/Users/buildslave/jenkins/workspace/lldb-cmake-sanitized/lldb-build/bin/clang-11-x86_64) :: test_get_process_dwarf (TestThreadAPI.ThreadAPITestCase) UNSUPPORTED: LLDB (/Users/buildslave/jenkins/workspace/lldb-cmake-sanitized/lldb-build/bin/clang-11-x86_64) :: test_get_process_dwo (TestThreadAPI.ThreadAPITestCase) (test case does not fall in any category of interest for this run) runCmd: settings clear -all output:

Hide Details

runCmd: settings set symbols.enable-external-lookup false output:

Hide Details

runCmd: settings set target.auto-apply-fixits false output:

Hide Details

runCmd: settings set plugin.process.gdb-remote.packet-timeout 60 output:

Hide Details

runCmd: settings set symbols.clang-modules-cache-path "/Users/buildslave/jenkins/workspace/lldb-cmake-sanitized/lldb-build/lldb-test-build.noindex/module-cache-lldb/lldb-api" output:

Hide Details

runCmd: settings set use-color false output:

Hide Details

runCmd: setting set target.prefer-dynamic-value no-dynamic-values output:

Hide Details

runCmd: settings set target.env-vars ASAN_OPTIONS=detect_stack_use_after_return=1 DYLD_INSERT_LIBRARIES=/Users/buildslave/jenkins/workspace/lldb-cmake-sanitized/host-compiler/lib/clang/11.0.0/lib/darwin/libclang_rt.asan_osx_dynamic.dylib output:

Hide Details

runCmd: breakpoint list output: Current breakpoints: 1: file = 'main.cpp', line = 17, exact_match = 0, locations = 1 1.1: where = a.out`main + 115 at main.cpp:17:5, address = a.out[0x0000000100000f53], unresolved, hit count = 0

Hide Details

Hide Details

Hide Details

runCmd: process status output: Process 16681 stopped * thread #1, queue = 'com.apple.main-thread', stop reason = breakpoint 1.1 frame #0: 0x000000010129cf53 a.out`main(argc=1, argv=0x00007ffeee963498) at main.cpp:17:5 14 15 printf("after the loop: my_char='%c'\n", my_char); // 'my_char' should print out as 'x'. 16 -> 17 return 0; // Set break point at this line and check variable 'my_char'. ^ 18 }

Hide Details

Hide Details

<bound method SBProcess.Kill of <lldb.SBProcess; proxy of <Swig Object of type 'lldb::SBProcess *' at 0x1278798d0> >>: success

Hide Details

PASS: LLDB (/Users/buildslave/jenkins/workspace/lldb-cmake-sanitized/lldb-build/bin/clang-11-x86_64) :: test_get_process_gmodules (TestThreadAPI.ThreadAPITestCase) runCmd: settings clear -all output:

Hide Details

runCmd: settings set symbols.enable-external-lookup false output:

Hide Details

runCmd: settings set target.auto-apply-fixits false output:

Hide Details

runCmd: settings set plugin.process.gdb-remote.packet-timeout 60 output:

Hide Details

runCmd: settings set symbols.clang-modules-cache-path "/Users/buildslave/jenkins/workspace/lldb-cmake-sanitized/lldb-build/lldb-test-build.noindex/module-cache-lldb/lldb-api" output:

Hide Details

runCmd: settings set use-color false output:

Hide Details

runCmd: setting set target.prefer-dynamic-value no-dynamic-values output:

Hide Details

runCmd: settings set target.env-vars ASAN_OPTIONS=detect_stack_use_after_return=1 DYLD_INSERT_LIBRARIES=/Users/buildslave/jenkins/workspace/lldb-cmake-sanitized/host-compiler/lib/clang/11.0.0/lib/darwin/libclang_rt.asan_osx_dynamic.dylib output:

Hide Details

<bound method SBProcess.Kill of <lldb.SBProcess; proxy of <Swig Object of type 'lldb::SBProcess *' at 0x11061e960> >>: success

Hide Details

PASS: LLDB (/Users/buildslave/jenkins/workspace/lldb-cmake-sanitized/lldb-build/bin/clang-11-x86_64) :: test_get_stop_description_dsym (TestThreadAPI.ThreadAPITestCase) runCmd: settings clear -all output:

Hide Details

runCmd: settings set symbols.enable-external-lookup false output:

Hide Details

runCmd: settings set target.auto-apply-fixits false output:

Hide Details

runCmd: settings set plugin.process.gdb-remote.packet-timeout 60 output:

Hide Details

runCmd: settings set symbols.clang-modules-cache-path "/Users/buildslave/jenkins/workspace/lldb-cmake-sanitized/lldb-build/lldb-test-build.noindex/module-cache-lldb/lldb-api" output:

Hide Details

runCmd: settings set use-color false output:

Hide Details

runCmd: setting set target.prefer-dynamic-value no-dynamic-values output:

Hide Details

runCmd: settings set target.env-vars ASAN_OPTIONS=detect_stack_use_after_return=1 DYLD_INSERT_LIBRARIES=/Users/buildslave/jenkins/workspace/lldb-cmake-sanitized/host-compiler/lib/clang/11.0.0/lib/darwin/libclang_rt.asan_osx_dynamic.dylib output:

Hide Details

<bound method SBProcess.Kill of <lldb.SBProcess; proxy of <Swig Object of type 'lldb::SBProcess *' at 0x1272962d0> >>: success

Hide Details

PASS: LLDB (/Users/buildslave/jenkins/workspace/lldb-cmake-sanitized/lldb-build/bin/clang-11-x86_64) :: test_get_stop_description_dwarf (TestThreadAPI.ThreadAPITestCase) UNSUPPORTED: LLDB (/Users/buildslave/jenkins/workspace/lldb-cmake-sanitized/lldb-build/bin/clang-11-x86_64) :: test_get_stop_description_dwo (TestThreadAPI.ThreadAPITestCase) (test case does not fall in any category of interest for this run) runCmd: settings clear -all output:

Hide Details

runCmd: settings set symbols.enable-external-lookup false output:

Hide Details

runCmd: settings set target.auto-apply-fixits false output:

Hide Details

runCmd: settings set plugin.process.gdb-remote.packet-timeout 60 output:

Hide Details

runCmd: settings set symbols.clang-modules-cache-path "/Users/buildslave/jenkins/workspace/lldb-cmake-sanitized/lldb-build/lldb-test-build.noindex/module-cache-lldb/lldb-api" output:

Hide Details

runCmd: settings set use-color false output:

Hide Details

runCmd: setting set target.prefer-dynamic-value no-dynamic-values output:

Hide Details

runCmd: settings set target.env-vars ASAN_OPTIONS=detect_stack_use_after_return=1 DYLD_INSERT_LIBRARIES=/Users/buildslave/jenkins/workspace/lldb-cmake-sanitized/host-compiler/lib/clang/11.0.0/lib/darwin/libclang_rt.asan_osx_dynamic.dylib output:

Hide Details

<bound method SBProcess.Kill of <lldb.SBProcess; proxy of <Swig Object of type 'lldb::SBProcess *' at 0x11061e990> >>: success

Hide Details

PASS: LLDB (/Users/buildslave/jenkins/workspace/lldb-cmake-sanitized/lldb-build/bin/clang-11-x86_64) :: test_get_stop_description_gmodules (TestThreadAPI.ThreadAPITestCase) runCmd: settings clear -all output:

Hide Details

runCmd: settings set symbols.enable-external-lookup false output:

Hide Details

runCmd: settings set target.auto-apply-fixits false output:

Hide Details

runCmd: settings set plugin.process.gdb-remote.packet-timeout 60 output:

Hide Details

runCmd: settings set symbols.clang-modules-cache-path "/Users/buildslave/jenkins/workspace/lldb-cmake-sanitized/lldb-build/lldb-test-build.noindex/module-cache-lldb/lldb-api" output:

Hide Details

runCmd: settings set use-color false output:

Hide Details

runCmd: setting set target.prefer-dynamic-value no-dynamic-values output:

Hide Details

runCmd: settings set target.env-vars ASAN_OPTIONS=detect_stack_use_after_return=1 DYLD_INSERT_LIBRARIES=/Users/buildslave/jenkins/workspace/lldb-cmake-sanitized/host-compiler/lib/clang/11.0.0/lib/darwin/libclang_rt.asan_osx_dynamic.dylib output:

Hide Details

runCmd: breakpoint list output: Current breakpoints: 1: file = 'main2.cpp', line = 21, exact_match = 0, locations = 1 1.1: where = test_run_to_address_dsym`b(int) + 22 at main2.cpp:21:17, address = test_run_to_address_dsym[0x0000000100000e66], unresolved, hit count = 0

Hide Details

Hide Details

Hide Details

runCmd: thread backtrace output: * thread #1, queue = 'com.apple.main-thread', stop reason = breakpoint 1.1 * frame #0: 0x00000001072b9e66 test_run_to_address_dsym`b(val=1) at main2.cpp:21:17 frame #1: 0x00000001072b9e0d test_run_to_address_dsym`a(val=1) at main2.cpp:11:16 frame #2: 0x00000001072b9ee0 test_run_to_address_dsym`main(argc=1, argv=0x00007ffee8946470) at main2.cpp:36:14 frame #3: 0x00007fff742d5085 libdyld.dylib`start + 1

Hide Details

Hide Details

runCmd: breakpoint list output: Current breakpoints: 1: file = 'main2.cpp', line = 21, exact_match = 0, locations = 1 Options: disabled 1.1: where = test_run_to_address_dsym`b(int) + 22 at main2.cpp:21:17, address = 0x00000001072b9e66, unresolved, hit count = 1

Hide Details

Hide Details

Hide Details

runCmd: thread backtrace output: * thread #1, queue = 'com.apple.main-thread', stop reason = step over * frame #0: 0x00000001072b9e9d test_run_to_address_dsym`b(val=1) at main2.cpp:26:12 frame #1: 0x00000001072b9e0d test_run_to_address_dsym`a(val=1) at main2.cpp:11:16 frame #2: 0x00000001072b9ee0 test_run_to_address_dsym`main(argc=1, argv=0x00007ffee8946470) at main2.cpp:36:14 frame #3: 0x00007fff742d5085 libdyld.dylib`start + 1

Hide Details

Hide Details

runCmd: process status output: Process 17156 stopped * thread #1, queue = 'com.apple.main-thread', stop reason = run to address: 0x00000001072b9e66 frame #0: 0x00000001072b9e66 test_run_to_address_dsym`b(val=2) at main2.cpp:21:17 18 int b(int val) 19 { 20 int rc = c(val); -> 21 void *ptr = malloc(1024); // thread step-out of malloc into function b. ^ 22 if (!ptr) 23 return -1; 24 else

Hide Details

Hide Details

<bound method SBProcess.Kill of <lldb.SBProcess; proxy of <Swig Object of type 'lldb::SBProcess *' at 0x127095de0> >>: success

Hide Details

PASS: LLDB (/Users/buildslave/jenkins/workspace/lldb-cmake-sanitized/lldb-build/bin/clang-11-x86_64) :: test_run_to_address_dsym (TestThreadAPI.ThreadAPITestCase) runCmd: settings clear -all output:

Hide Details

runCmd: settings set symbols.enable-external-lookup false output:

Hide Details

runCmd: settings set target.auto-apply-fixits false output:

Hide Details

runCmd: settings set plugin.process.gdb-remote.packet-timeout 60 output:

Hide Details

runCmd: settings set symbols.clang-modules-cache-path "/Users/buildslave/jenkins/workspace/lldb-cmake-sanitized/lldb-build/lldb-test-build.noindex/module-cache-lldb/lldb-api" output:

Hide Details

runCmd: settings set use-color false output:

Hide Details

runCmd: setting set target.prefer-dynamic-value no-dynamic-values output:

Hide Details

runCmd: settings set target.env-vars ASAN_OPTIONS=detect_stack_use_after_return=1 DYLD_INSERT_LIBRARIES=/Users/buildslave/jenkins/workspace/lldb-cmake-sanitized/host-compiler/lib/clang/11.0.0/lib/darwin/libclang_rt.asan_osx_dynamic.dylib output:

Hide Details

runCmd: breakpoint list output: Current breakpoints: 1: file = 'main2.cpp', line = 21, exact_match = 0, locations = 1 1.1: where = test_run_to_address_dwarf`b(int) + 22 at main2.cpp:21:17, address = test_run_to_address_dwarf[0x0000000100000e66], unresolved, hit count = 0

Hide Details

Hide Details

Hide Details

runCmd: thread backtrace output: * thread #1, queue = 'com.apple.main-thread', stop reason = breakpoint 1.1 * frame #0: 0x00000001006d0e66 test_run_to_address_dwarf`b(val=1) at main2.cpp:21:17 frame #1: 0x00000001006d0e0d test_run_to_address_dwarf`a(val=1) at main2.cpp:11:16 frame #2: 0x00000001006d0ee0 test_run_to_address_dwarf`main(argc=1, argv=0x00007ffeef52f470) at main2.cpp:36:14 frame #3: 0x00007fff742d5085 libdyld.dylib`start + 1

Hide Details

Hide Details

runCmd: breakpoint list output: Current breakpoints: 1: file = 'main2.cpp', line = 21, exact_match = 0, locations = 1 Options: disabled 1.1: where = test_run_to_address_dwarf`b(int) + 22 at main2.cpp:21:17, address = 0x00000001006d0e66, unresolved, hit count = 1

Hide Details

Hide Details

Hide Details

runCmd: thread backtrace output: * thread #1, queue = 'com.apple.main-thread', stop reason = step over * frame #0: 0x00000001006d0e9d test_run_to_address_dwarf`b(val=1) at main2.cpp:26:12 frame #1: 0x00000001006d0e0d test_run_to_address_dwarf`a(val=1) at main2.cpp:11:16 frame #2: 0x00000001006d0ee0 test_run_to_address_dwarf`main(argc=1, argv=0x00007ffeef52f470) at main2.cpp:36:14 frame #3: 0x00007fff742d5085 libdyld.dylib`start + 1

Hide Details

Hide Details

runCmd: process status output: Process 17291 stopped * thread #1, queue = 'com.apple.main-thread', stop reason = run to address: 0x00000001006d0e66 frame #0: 0x00000001006d0e66 test_run_to_address_dwarf`b(val=2) at main2.cpp:21:17 18 int b(int val) 19 { 20 int rc = c(val); -> 21 void *ptr = malloc(1024); // thread step-out of malloc into function b. ^ 22 if (!ptr) 23 return -1; 24 else

Hide Details

Hide Details

<bound method SBProcess.Kill of <lldb.SBProcess; proxy of <Swig Object of type 'lldb::SBProcess *' at 0x11061e960> >>: success

Hide Details

PASS: LLDB (/Users/buildslave/jenkins/workspace/lldb-cmake-sanitized/lldb-build/bin/clang-11-x86_64) :: test_run_to_address_dwarf (TestThreadAPI.ThreadAPITestCase) UNSUPPORTED: LLDB (/Users/buildslave/jenkins/workspace/lldb-cmake-sanitized/lldb-build/bin/clang-11-x86_64) :: test_run_to_address_dwo (TestThreadAPI.ThreadAPITestCase) (test case does not fall in any category of interest for this run) runCmd: settings clear -all output:

Hide Details

runCmd: settings set symbols.enable-external-lookup false output:

Hide Details

runCmd: settings set target.auto-apply-fixits false output:

Hide Details

runCmd: settings set plugin.process.gdb-remote.packet-timeout 60 output:

Hide Details

runCmd: settings set symbols.clang-modules-cache-path "/Users/buildslave/jenkins/workspace/lldb-cmake-sanitized/lldb-build/lldb-test-build.noindex/module-cache-lldb/lldb-api" output:

Hide Details

runCmd: settings set use-color false output:

Hide Details

runCmd: setting set target.prefer-dynamic-value no-dynamic-values output:

Hide Details

runCmd: settings set target.env-vars ASAN_OPTIONS=detect_stack_use_after_return=1 DYLD_INSERT_LIBRARIES=/Users/buildslave/jenkins/workspace/lldb-cmake-sanitized/host-compiler/lib/clang/11.0.0/lib/darwin/libclang_rt.asan_osx_dynamic.dylib output:

Hide Details

runCmd: breakpoint list output: Current breakpoints: 1: file = 'main2.cpp', line = 21, exact_match = 0, locations = 1 1.1: where = test_run_to_address_gmodules`b(int) + 22 at main2.cpp:21:17, address = test_run_to_address_gmodules[0x0000000100000e66], unresolved, hit count = 0

Hide Details

Hide Details

Hide Details

runCmd: thread backtrace output: * thread #1, queue = 'com.apple.main-thread', stop reason = breakpoint 1.1 * frame #0: 0x0000000104bd1e66 test_run_to_address_gmodules`b(val=1) at main2.cpp:21:17 frame #1: 0x0000000104bd1e0d test_run_to_address_gmodules`a(val=1) at main2.cpp:11:16 frame #2: 0x0000000104bd1ee0 test_run_to_address_gmodules`main(argc=1, argv=0x00007ffeeb02e460) at main2.cpp:36:14 frame #3: 0x00007fff742d5085 libdyld.dylib`start + 1

Hide Details

Hide Details

runCmd: breakpoint list output: Current breakpoints: 1: file = 'main2.cpp', line = 21, exact_match = 0, locations = 1 Options: disabled 1.1: where = test_run_to_address_gmodules`b(int) + 22 at main2.cpp:21:17, address = 0x0000000104bd1e66, unresolved, hit count = 1

Hide Details

Hide Details

Hide Details

runCmd: thread backtrace output: * thread #1, queue = 'com.apple.main-thread', stop reason = step over * frame #0: 0x0000000104bd1e9d test_run_to_address_gmodules`b(val=1) at main2.cpp:26:12 frame #1: 0x0000000104bd1e0d test_run_to_address_gmodules`a(val=1) at main2.cpp:11:16 frame #2: 0x0000000104bd1ee0 test_run_to_address_gmodules`main(argc=1, argv=0x00007ffeeb02e460) at main2.cpp:36:14 frame #3: 0x00007fff742d5085 libdyld.dylib`start + 1

Hide Details

Hide Details

runCmd: process status output: Process 17376 stopped * thread #1, queue = 'com.apple.main-thread', stop reason = run to address: 0x0000000104bd1e66 frame #0: 0x0000000104bd1e66 test_run_to_address_gmodules`b(val=2) at main2.cpp:21:17 18 int b(int val) 19 { 20 int rc = c(val); -> 21 void *ptr = malloc(1024); // thread step-out of malloc into function b. ^ 22 if (!ptr) 23 return -1; 24 else

Hide Details

Hide Details

<bound method SBProcess.Kill of <lldb.SBProcess; proxy of <Swig Object of type 'lldb::SBProcess *' at 0x1272962d0> >>: success

Hide Details

PASS: LLDB (/Users/buildslave/jenkins/workspace/lldb-cmake-sanitized/lldb-build/bin/clang-11-x86_64) :: test_run_to_address_gmodules (TestThreadAPI.ThreadAPITestCase) runCmd: settings clear -all output:

Hide Details

runCmd: settings set symbols.enable-external-lookup false output:

Hide Details

runCmd: settings set target.auto-apply-fixits false output:

Hide Details

runCmd: settings set plugin.process.gdb-remote.packet-timeout 60 output:

Hide Details

runCmd: settings set symbols.clang-modules-cache-path "/Users/buildslave/jenkins/workspace/lldb-cmake-sanitized/lldb-build/lldb-test-build.noindex/module-cache-lldb/lldb-api" output:

Hide Details

runCmd: settings set use-color false output:

Hide Details

runCmd: setting set target.prefer-dynamic-value no-dynamic-values output:

Hide Details

runCmd: settings set target.env-vars ASAN_OPTIONS=detect_stack_use_after_return=1 DYLD_INSERT_LIBRARIES=/Users/buildslave/jenkins/workspace/lldb-cmake-sanitized/host-compiler/lib/clang/11.0.0/lib/darwin/libclang_rt.asan_osx_dynamic.dylib output:

Hide Details

FAIL: LLDB (/Users/buildslave/jenkins/workspace/lldb-cmake-sanitized/lldb-build/bin/clang-11-x86_64) :: test_step_out_of_malloc_into_function_b_dsym (TestThreadAPI.ThreadAPITestCase) <bound method SBProcess.Kill of <lldb.SBProcess; proxy of <Swig Object of type 'lldb::SBProcess *' at 0x11061e990> >>: success

Hide Details

runCmd: settings clear -all output:

Hide Details

runCmd: settings set symbols.enable-external-lookup false output:

Hide Details

runCmd: settings set target.auto-apply-fixits false output:

Hide Details

runCmd: settings set plugin.process.gdb-remote.packet-timeout 60 output:

Hide Details

runCmd: settings set symbols.clang-modules-cache-path "/Users/buildslave/jenkins/workspace/lldb-cmake-sanitized/lldb-build/lldb-test-build.noindex/module-cache-lldb/lldb-api" output:

Hide Details

runCmd: settings set use-color false output:

Hide Details

runCmd: setting set target.prefer-dynamic-value no-dynamic-values output:

Hide Details

runCmd: settings set target.env-vars ASAN_OPTIONS=detect_stack_use_after_return=1 DYLD_INSERT_LIBRARIES=/Users/buildslave/jenkins/workspace/lldb-cmake-sanitized/host-compiler/lib/clang/11.0.0/lib/darwin/libclang_rt.asan_osx_dynamic.dylib output:

Hide Details

FAIL: LLDB (/Users/buildslave/jenkins/workspace/lldb-cmake-sanitized/lldb-build/bin/clang-11-x86_64) :: test_step_out_of_malloc_into_function_b_dwarf (TestThreadAPI.ThreadAPITestCase) <bound method SBProcess.Kill of <lldb.SBProcess; proxy of <Swig Object of type 'lldb::SBProcess *' at 0x127095de0> >>: success

Hide Details

UNSUPPORTED: LLDB (/Users/buildslave/jenkins/workspace/lldb-cmake-sanitized/lldb-build/bin/clang-11-x86_64) :: test_step_out_of_malloc_into_function_b_dwo (TestThreadAPI.ThreadAPITestCase) (test case does not fall in any category of interest for this run) runCmd: settings clear -all output:

Hide Details

runCmd: settings set symbols.enable-external-lookup false output:

Hide Details

runCmd: settings set target.auto-apply-fixits false output:

Hide Details

runCmd: settings set plugin.process.gdb-remote.packet-timeout 60 output:

Hide Details

runCmd: settings set symbols.clang-modules-cache-path "/Users/buildslave/jenkins/workspace/lldb-cmake-sanitized/lldb-build/lldb-test-build.noindex/module-cache-lldb/lldb-api" output:

Hide Details

runCmd: settings set use-color false output:

Hide Details

runCmd: setting set target.prefer-dynamic-value no-dynamic-values output:

Hide Details

runCmd: settings set target.env-vars ASAN_OPTIONS=detect_stack_use_after_return=1 DYLD_INSERT_LIBRARIES=/Users/buildslave/jenkins/workspace/lldb-cmake-sanitized/host-compiler/lib/clang/11.0.0/lib/darwin/libclang_rt.asan_osx_dynamic.dylib output:

Hide Details

FAIL: LLDB (/Users/buildslave/jenkins/workspace/lldb-cmake-sanitized/lldb-build/bin/clang-11-x86_64) :: test_step_out_of_malloc_into_function_b_gmodules (TestThreadAPI.ThreadAPITestCase) <bound method SBProcess.Kill of <lldb.SBProcess; proxy of <Swig Object of type 'lldb::SBProcess *' at 0x11061e990> >>: success

Hide Details

runCmd: settings clear -all output:

Hide Details

runCmd: settings set symbols.enable-external-lookup false output:

Hide Details

runCmd: settings set target.auto-apply-fixits false output:

Hide Details

runCmd: settings set plugin.process.gdb-remote.packet-timeout 60 output:

Hide Details

runCmd: settings set symbols.clang-modules-cache-path "/Users/buildslave/jenkins/workspace/lldb-cmake-sanitized/lldb-build/lldb-test-build.noindex/module-cache-lldb/lldb-api" output:

Hide Details

runCmd: settings set use-color false output:

Hide Details

runCmd: setting set target.prefer-dynamic-value no-dynamic-values output:

Hide Details

runCmd: settings set target.env-vars ASAN_OPTIONS=detect_stack_use_after_return=1 DYLD_INSERT_LIBRARIES=/Users/buildslave/jenkins/workspace/lldb-cmake-sanitized/host-compiler/lib/clang/11.0.0/lib/darwin/libclang_rt.asan_osx_dynamic.dylib output:

Hide Details

runCmd: breakpoint list output: Current breakpoints: 1: file = 'main2.cpp', line = 21, exact_match = 0, locations = 1 1.1: where = test_step_over_3_times_dsym`b(int) + 22 at main2.cpp:21:17, address = test_step_over_3_times_dsym[0x0000000100000e66], unresolved, hit count = 0

Hide Details

Hide Details

Hide Details

runCmd: thread backtrace output: * thread #1, queue = 'com.apple.main-thread', stop reason = breakpoint 1.1 * frame #0: 0x0000000107eb4e66 test_step_over_3_times_dsym`b(val=1) at main2.cpp:21:17 frame #1: 0x0000000107eb4e0d test_step_over_3_times_dsym`a(val=1) at main2.cpp:11:16 frame #2: 0x0000000107eb4ee0 test_step_over_3_times_dsym`main(argc=1, argv=0x00007ffee7d4b468) at main2.cpp:36:14 frame #3: 0x00007fff742d5085 libdyld.dylib`start + 1 frame #4: 0x00007fff742d5085 libdyld.dylib`start + 1

Hide Details

Hide Details

runCmd: thread backtrace output: * thread #1, queue = 'com.apple.main-thread', stop reason = step over * frame #0: 0x0000000107eb4e9d test_step_over_3_times_dsym`b(val=1) at main2.cpp:26:12 frame #1: 0x0000000107eb4e0d test_step_over_3_times_dsym`a(val=1) at main2.cpp:11:16 frame #2: 0x0000000107eb4ee0 test_step_over_3_times_dsym`main(argc=1, argv=0x00007ffee7d4b468) at main2.cpp:36:14 frame #3: 0x00007fff742d5085 libdyld.dylib`start + 1 frame #4: 0x00007fff742d5085 libdyld.dylib`start + 1

Hide Details

Hide Details

<bound method SBProcess.Kill of <lldb.SBProcess; proxy of <Swig Object of type 'lldb::SBProcess *' at 0x127095de0> >>: success

Hide Details

PASS: LLDB (/Users/buildslave/jenkins/workspace/lldb-cmake-sanitized/lldb-build/bin/clang-11-x86_64) :: test_step_over_3_times_dsym (TestThreadAPI.ThreadAPITestCase) runCmd: settings clear -all output:

Hide Details

runCmd: settings set symbols.enable-external-lookup false output:

Hide Details

runCmd: settings set target.auto-apply-fixits false output:

Hide Details

runCmd: settings set plugin.process.gdb-remote.packet-timeout 60 output:

Hide Details

runCmd: settings set symbols.clang-modules-cache-path "/Users/buildslave/jenkins/workspace/lldb-cmake-sanitized/lldb-build/lldb-test-build.noindex/module-cache-lldb/lldb-api" output:

Hide Details

runCmd: settings set use-color false output:

Hide Details

runCmd: setting set target.prefer-dynamic-value no-dynamic-values output:

Hide Details

runCmd: settings set target.env-vars ASAN_OPTIONS=detect_stack_use_after_return=1 DYLD_INSERT_LIBRARIES=/Users/buildslave/jenkins/workspace/lldb-cmake-sanitized/host-compiler/lib/clang/11.0.0/lib/darwin/libclang_rt.asan_osx_dynamic.dylib output:

Hide Details

runCmd: breakpoint list output: Current breakpoints: 1: file = 'main2.cpp', line = 21, exact_match = 0, locations = 1 1.1: where = test_step_over_3_times_dwarf`b(int) + 22 at main2.cpp:21:17, address = test_step_over_3_times_dwarf[0x0000000100000e66], unresolved, hit count = 0

Hide Details

Hide Details

Hide Details

runCmd: thread backtrace output: * thread #1, queue = 'com.apple.main-thread', stop reason = breakpoint 1.1 * frame #0: 0x000000010d826e66 test_step_over_3_times_dwarf`b(val=1) at main2.cpp:21:17 frame #1: 0x000000010d826e0d test_step_over_3_times_dwarf`a(val=1) at main2.cpp:11:16 frame #2: 0x000000010d826ee0 test_step_over_3_times_dwarf`main(argc=1, argv=0x00007ffee23d9460) at main2.cpp:36:14 frame #3: 0x00007fff742d5085 libdyld.dylib`start + 1

Hide Details

Hide Details

runCmd: thread backtrace output: * thread #1, queue = 'com.apple.main-thread', stop reason = step over * frame #0: 0x000000010d826e9d test_step_over_3_times_dwarf`b(val=1) at main2.cpp:26:12 frame #1: 0x000000010d826e0d test_step_over_3_times_dwarf`a(val=1) at main2.cpp:11:16 frame #2: 0x000000010d826ee0 test_step_over_3_times_dwarf`main(argc=1, argv=0x00007ffee23d9460) at main2.cpp:36:14 frame #3: 0x00007fff742d5085 libdyld.dylib`start + 1

Hide Details

Hide Details

<bound method SBProcess.Kill of <lldb.SBProcess; proxy of <Swig Object of type 'lldb::SBProcess *' at 0x11061e990> >>: success

Hide Details

PASS: LLDB (/Users/buildslave/jenkins/workspace/lldb-cmake-sanitized/lldb-build/bin/clang-11-x86_64) :: test_step_over_3_times_dwarf (TestThreadAPI.ThreadAPITestCase) UNSUPPORTED: LLDB (/Users/buildslave/jenkins/workspace/lldb-cmake-sanitized/lldb-build/bin/clang-11-x86_64) :: test_step_over_3_times_dwo (TestThreadAPI.ThreadAPITestCase) (test case does not fall in any category of interest for this run) runCmd: settings clear -all output:

Hide Details

runCmd: settings set symbols.enable-external-lookup false output:

Hide Details

runCmd: settings set target.auto-apply-fixits false output:

Hide Details

runCmd: settings set plugin.process.gdb-remote.packet-timeout 60 output:

Hide Details

runCmd: settings set symbols.clang-modules-cache-path "/Users/buildslave/jenkins/workspace/lldb-cmake-sanitized/lldb-build/lldb-test-build.noindex/module-cache-lldb/lldb-api" output:

Hide Details

runCmd: settings set use-color false output:

Hide Details

runCmd: setting set target.prefer-dynamic-value no-dynamic-values output:

Hide Details

runCmd: settings set target.env-vars ASAN_OPTIONS=detect_stack_use_after_return=1 DYLD_INSERT_LIBRARIES=/Users/buildslave/jenkins/workspace/lldb-cmake-sanitized/host-compiler/lib/clang/11.0.0/lib/darwin/libclang_rt.asan_osx_dynamic.dylib output:

Hide Details

runCmd: breakpoint list output: Current breakpoints: 1: file = 'main2.cpp', line = 21, exact_match = 0, locations = 1 1.1: where = test_step_over_3_times_gmodules`b(int) + 22 at main2.cpp:21:17, address = test_step_over_3_times_gmodules[0x0000000100000e66], unresolved, hit count = 0

Hide Details

Hide Details

Hide Details

runCmd: thread backtrace output: * thread #1, queue = 'com.apple.main-thread', stop reason = breakpoint 1.1 * frame #0: 0x0000000106a69e66 test_step_over_3_times_gmodules`b(val=1) at main2.cpp:21:17 frame #1: 0x0000000106a69e0d test_step_over_3_times_gmodules`a(val=1) at main2.cpp:11:16 frame #2: 0x0000000106a69ee0 test_step_over_3_times_gmodules`main(argc=1, argv=0x00007ffee9196458) at main2.cpp:36:14 frame #3: 0x00007fff742d5085 libdyld.dylib`start + 1 frame #4: 0x00007fff742d5085 libdyld.dylib`start + 1

Hide Details

Hide Details

runCmd: thread backtrace output: * thread #1, queue = 'com.apple.main-thread', stop reason = step over * frame #0: 0x0000000106a69e9d test_step_over_3_times_gmodules`b(val=1) at main2.cpp:26:12 frame #1: 0x0000000106a69e0d test_step_over_3_times_gmodules`a(val=1) at main2.cpp:11:16 frame #2: 0x0000000106a69ee0 test_step_over_3_times_gmodules`main(argc=1, argv=0x00007ffee9196458) at main2.cpp:36:14 frame #3: 0x00007fff742d5085 libdyld.dylib`start + 1 frame #4: 0x00007fff742d5085 libdyld.dylib`start + 1

Hide Details

Hide Details

<bound method SBProcess.Kill of <lldb.SBProcess; proxy of <Swig Object of type 'lldb::SBProcess *' at 0x1272962d0> >>: success

Hide Details

PASS: LLDB (/Users/buildslave/jenkins/workspace/lldb-cmake-sanitized/lldb-build/bin/clang-11-x86_64) :: test_step_over_3_times_gmodules (TestThreadAPI.ThreadAPITestCase) Restore dir to: /Users/buildslave/jenkins/workspace/lldb-cmake-sanitized/lldb-build/tools/lldb/test ====================================================================== ERROR: test_step_out_of_malloc_into_function_b_dsym (TestThreadAPI.ThreadAPITestCase) Test Python SBThread.StepOut() API to step out of a malloc call where the call site is at function b(). ---------------------------------------------------------------------- Traceback (most recent call last): File "/Users/buildslave/jenkins/workspace/lldb-cmake-sanitized/llvm-project/lldb/packages/Python/lldbsuite/test/lldbtest.py", line 1751, in test_method return attrvalue(self) File "/Users/buildslave/jenkins/workspace/lldb-cmake-sanitized/llvm-project/lldb/packages/Python/lldbsuite/test/decorators.py", line 110, in wrapper func(*args, **kwargs) File "/Users/buildslave/jenkins/workspace/lldb-cmake-sanitized/llvm-project/lldb/packages/Python/lldbsuite/test/decorators.py", line 110, in wrapper func(*args, **kwargs) File "/Users/buildslave/jenkins/workspace/lldb-cmake-sanitized/llvm-project/lldb/packages/Python/lldbsuite/test/decorators.py", line 110, in wrapper func(*args, **kwargs) File "/Users/buildslave/jenkins/workspace/lldb-cmake-sanitized/llvm-project/lldb/test/API/python_api/thread/TestThreadAPI.py", line 50, in test_step_out_of_malloc_into_function_b self.step_out_of_malloc_into_function_b(self.exe_name) File "/Users/buildslave/jenkins/workspace/lldb-cmake-sanitized/llvm-project/lldb/test/API/python_api/thread/TestThreadAPI.py", line 157, in step_out_of_malloc_into_function_b thread.IsValid(), AttributeError: 'NoneType' object has no attribute 'IsValid' Config=x86_64-/Users/buildslave/jenkins/workspace/lldb-cmake-sanitized/lldb-build/bin/clang-11 ====================================================================== ERROR: test_step_out_of_malloc_into_function_b_dwarf (TestThreadAPI.ThreadAPITestCase) Test Python SBThread.StepOut() API to step out of a malloc call where the call site is at function b(). ---------------------------------------------------------------------- Traceback (most recent call last): File "/Users/buildslave/jenkins/workspace/lldb-cmake-sanitized/llvm-project/lldb/packages/Python/lldbsuite/test/lldbtest.py", line 1751, in test_method return attrvalue(self) File "/Users/buildslave/jenkins/workspace/lldb-cmake-sanitized/llvm-project/lldb/packages/Python/lldbsuite/test/decorators.py", line 110, in wrapper func(*args, **kwargs) File "/Users/buildslave/jenkins/workspace/lldb-cmake-sanitized/llvm-project/lldb/packages/Python/lldbsuite/test/decorators.py", line 110, in wrapper func(*args, **kwargs) File "/Users/buildslave/jenkins/workspace/lldb-cmake-sanitized/llvm-project/lldb/packages/Python/lldbsuite/test/decorators.py", line 110, in wrapper func(*args, **kwargs) File "/Users/buildslave/jenkins/workspace/lldb-cmake-sanitized/llvm-project/lldb/test/API/python_api/thread/TestThreadAPI.py", line 50, in test_step_out_of_malloc_into_function_b self.step_out_of_malloc_into_function_b(self.exe_name) File "/Users/buildslave/jenkins/workspace/lldb-cmake-sanitized/llvm-project/lldb/test/API/python_api/thread/TestThreadAPI.py", line 157, in step_out_of_malloc_into_function_b thread.IsValid(), AttributeError: 'NoneType' object has no attribute 'IsValid' Config=x86_64-/Users/buildslave/jenkins/workspace/lldb-cmake-sanitized/lldb-build/bin/clang-11 ====================================================================== ERROR: test_step_out_of_malloc_into_function_b_gmodules (TestThreadAPI.ThreadAPITestCase) Test Python SBThread.StepOut() API to step out of a malloc call where the call site is at function b(). ---------------------------------------------------------------------- Traceback (most recent call last): File "/Users/buildslave/jenkins/workspace/lldb-cmake-sanitized/llvm-project/lldb/packages/Python/lldbsuite/test/lldbtest.py", line 1751, in test_method return attrvalue(self) File "/Users/buildslave/jenkins/workspace/lldb-cmake-sanitized/llvm-project/lldb/packages/Python/lldbsuite/test/decorators.py", line 110, in wrapper func(*args, **kwargs) File "/Users/buildslave/jenkins/workspace/lldb-cmake-sanitized/llvm-project/lldb/packages/Python/lldbsuite/test/decorators.py", line 110, in wrapper func(*args, **kwargs) File "/Users/buildslave/jenkins/workspace/lldb-cmake-sanitized/llvm-project/lldb/packages/Python/lldbsuite/test/decorators.py", line 110, in wrapper func(*args, **kwargs) File "/Users/buildslave/jenkins/workspace/lldb-cmake-sanitized/llvm-project/lldb/test/API/python_api/thread/TestThreadAPI.py", line 50, in test_step_out_of_malloc_into_function_b self.step_out_of_malloc_into_function_b(self.exe_name) File "/Users/buildslave/jenkins/workspace/lldb-cmake-sanitized/llvm-project/lldb/test/API/python_api/thread/TestThreadAPI.py", line 157, in step_out_of_malloc_into_function_b thread.IsValid(), AttributeError: 'NoneType' object has no attribute 'IsValid' Config=x86_64-/Users/buildslave/jenkins/workspace/lldb-cmake-sanitized/lldb-build/bin/clang-11 ---------------------------------------------------------------------- Ran 20 tests in 41.584s

Hide Details

RESULT: FAILED (12 passes, 0 failures, 3 errors, 5 skipped, 0 expected failures, 0 unexpected successes)

Hide Details

--

Hide Details

******************** UNSUPPORTED: lldb-shell :: SymbolFile/PDB/calling-conventions.test (1609 of 1977) PASS: lldb-unit :: Symbol/./SymbolTests/Type.GetTypeScopeAndBasename (1610 of 1977) PASS: lldb-api :: lang/objc/objc-stepping/TestObjCStepping.py (1611 of 1977) PASS: lldb-unit :: Utility/./UtilityTests/StringExtractorTest.GetHexBytes_OddPair2 (1612 of 1977) PASS: lldb-unit :: Symbol/./SymbolTests/Type.CompilerContextPattern (1613 of 1977) PASS: lldb-unit :: Interpreter/./InterpreterTests/OptionArgParserTest.toScriptLanguage (1614 of 1977) PASS: lldb-unit :: Utility/./UtilityTests/StreamTest.PutBytesAsRawHex8ToLittleEndian (1615 of 1977) PASS: lldb-shell :: Reproducer/TestFileRepro.test (1616 of 1977) PASS: lldb-shell :: SymbolFile/Breakpad/unwind-via-stack-cfi.test (1617 of 1977) PASS: lldb-api :: commands/expression/top-level/TestTopLevelExprs.py (1618 of 1977) PASS: lldb-unit :: Utility/./UtilityTests/CompletionRequest.FakeLastArg (1619 of 1977) PASS: lldb-api :: commands/expression/import-std-module/unique_ptr-dbg-info-content/TestUniquePtrDbgInfoContent.py (1620 of 1977) PASS: lldb-api :: commands/expression/po_verbosity/TestPoVerbosity.py (1621 of 1977) PASS: lldb-unit :: Utility/./UtilityTests/Predicate.WaitForValueNotEqualTo (1622 of 1977) PASS: lldb-unit :: Utility/./UtilityTests/UriParserTest.BracketedHostnameWithPortIPv6 (1623 of 1977) PASS: lldb-unit :: Language/Highlighting/./HighlighterTests/HighlighterTest.ClangScalarLiterals (1624 of 1977) PASS: lldb-api :: functionalities/return-value/TestReturnValue.py (1625 of 1977) PASS: lldb-unit :: Utility/./UtilityTests/StreamTeeTest.Assignment (1626 of 1977) PASS: lldb-unit :: Utility/./UtilityTests/SubsystemRAIITest.SubsystemWithErrorSuccess (1627 of 1977) PASS: lldb-unit :: UnwindAssembly/x86/./UnwindAssemblyx86Tests/Testx86AssemblyInspectionEngine.TestPopRBX (1628 of 1977) PASS: lldb-unit :: Utility/./UtilityTests/AnsiTerminal.KnownPrefix (1629 of 1977) PASS: lldb-unit :: ScriptInterpreter/Python/./ScriptInterpreterPythonTests/PythonDataObjectsTest.TestPythonCallableInvoke (1630 of 1977) UNSUPPORTED: lldb-api :: functionalities/tsan/global_location/TestTsanGlobalLocation.py (1631 of 1977) PASS: lldb-api :: functionalities/thread/step_until/TestStepUntil.py (1632 of 1977) PASS: lldb-shell :: Commands/command-source.test (1633 of 1977) PASS: lldb-shell :: SymbolFile/DWARF/find-variable-file.cpp (1634 of 1977) PASS: lldb-unit :: Utility/./UtilityTests/UriParserTest.BadPort (1635 of 1977) PASS: lldb-api :: commands/expression/argument_passing_restrictions/TestArgumentPassingRestrictions.py (1636 of 1977) UNSUPPORTED: lldb-api :: commands/expression/multiline-navigation/TestMultilineNavigation.py (1637 of 1977) PASS: lldb-api :: functionalities/abbreviation/TestCommonShortSpellings.py (1638 of 1977) PASS: lldb-unit :: Utility/./UtilityTests/StringListTest.DefaultConstructor (1639 of 1977) PASS: lldb-api :: commands/register/register/register_command/TestRegisters.py (1640 of 1977) PASS: lldb-api :: commands/expression/invalid-args/TestInvalidArgsExpression.py (1641 of 1977) PASS: lldb-unit :: Utility/./UtilityTests/SerializationRountripTest.SerializeDeserializePodReferences (1642 of 1977) PASS: lldb-unit :: SymbolFile/NativePDB/./SymbolFileNativePDBTests/PDBFPOProgramToDWARFExpressionTests.UnresolvedRegisterAssignmentReference (1643 of 1977) PASS: lldb-api :: lang/cpp/thread_local/TestThreadLocal.py (1644 of 1977) PASS: lldb-api :: functionalities/thread/exit_during_break/TestExitDuringBreak.py (1645 of 1977) PASS: lldb-api :: functionalities/data-formatter/data-formatter-stl/libcxx/unordered/TestDataFormatterUnordered.py (1646 of 1977) PASS: lldb-unit :: Utility/./UtilityTests/DataExtractorTest.UncommonAddressSize (1647 of 1977) UNSUPPORTED: lldb-api :: linux/add-symbols/TestTargetSymbolsAddCommand.py (1648 of 1977) PASS: lldb-api :: functionalities/data-formatter/data-formatter-objc/TestDataFormatterObjCNSData.py (1649 of 1977) PASS: lldb-api :: lang/cpp/namespace_definitions/TestNamespaceDefinitions.py (1650 of 1977) UNSUPPORTED: lldb-api :: functionalities/data-formatter/data-formatter-stl/libstdcpp/string/TestDataFormatterStdString.py (1651 of 1977) PASS: lldb-unit :: Utility/./UtilityTests/FileSpecTest.Yaml (1652 of 1977) PASS: lldb-api :: functionalities/pre_run_dylibs/TestPreRunDylibs.py (1653 of 1977) PASS: lldb-api :: python_api/value/TestValueAPI.py (1654 of 1977) PASS: lldb-unit :: UnwindAssembly/x86/./UnwindAssemblyx86Tests/Testx86AssemblyInspectionEngine.TestSubRSP (1655 of 1977) PASS: lldb-unit :: Host/./HostTests/FileSystemTest.GetPermissions (1656 of 1977) PASS: lldb-api :: lang/cpp/nested-class-other-compilation-unit/TestNestedClassWithParentInAnotherCU.py (1657 of 1977) PASS: lldb-unit :: Utility/./UtilityTests/BinaryStreamTest.PutULEB128SixBytes (1658 of 1977) PASS: lldb-unit :: Utility/./UtilityTests/RangeTest.ContainsRange (1659 of 1977) UNSUPPORTED: lldb-api :: commands/target/auto-install-main-executable/TestAutoInstallMainExecutable.py (1660 of 1977) PASS: lldb-shell :: Breakpoint/debug_rnglist_rlestartend.test (1661 of 1977) PASS: lldb-unit :: Utility/./UtilityTests/ScalarTest.ExtractBitfield (1662 of 1977) PASS: lldb-shell :: ObjectFile/ELF/PT_LOAD.yaml (1663 of 1977) PASS: lldb-unit :: Utility/./UtilityTests/ArchSpecTest.MergeFromMachOUnknown (1664 of 1977) PASS: lldb-api :: commands/settings/TestSettings.py (1665 of 1977) PASS: lldb-unit :: Utility/./UtilityTests/StreamTest.ChangingByteOrder (1666 of 1977) PASS: lldb-shell :: ObjectFile/MachO/symtab.yaml (1667 of 1977) PASS: lldb-unit :: Utility/./UtilityTests/Predicate.WaitForValueEqualTo (1668 of 1977) PASS: lldb-api :: functionalities/data-formatter/pyobjsynthprovider/TestPyObjSynthProvider.py (1669 of 1977) PASS: lldb-api :: lang/cpp/constructors/TestCppConstructors.py (1670 of 1977) PASS: lldb-unit :: Utility/./UtilityTests/DataExtractorTest.GetMaxS64 (1671 of 1977) PASS: lldb-unit :: Process/minidump/./LLDBMinidumpTests/MinidumpParserTest.FindMemoryRange (1672 of 1977) PASS: lldb-api :: macosx/order/TestOrderFile.py (1673 of 1977) PASS: lldb-unit :: Utility/./UtilityTests/ScalarTest.Equality (1674 of 1977) PASS: lldb-shell :: Driver/TestCore.test (1675 of 1977) PASS: lldb-unit :: Process/gdb-remote/./ProcessGdbRemoteTests/GDBRemoteCommunicationClientTest.SendGetMetaDataPacket (1676 of 1977) UNSUPPORTED: lldb-api :: functionalities/thread/concurrent_events/TestConcurrentManySignals.py (1677 of 1977) PASS: lldb-api :: lang/objc/global_ptrs/TestGlobalObjects.py (1678 of 1977) PASS: lldb-api :: functionalities/data-formatter/data-formatter-objc/TestDataFormatterObjCKVO.py (1679 of 1977) PASS: lldb-api :: functionalities/data-formatter/vector-types/TestVectorTypesFormatting.py (1680 of 1977) PASS: lldb-api :: functionalities/gdb_remote_client/TestJLink6Armv7RegisterDefinition.py (1681 of 1977) UNSUPPORTED: lldb-api :: commands/expression/call-restarts/TestCallThatRestarts.py (1682 of 1977) PASS: lldb-api :: functionalities/breakpoint/auto_continue/TestBreakpointAutoContinue.py (1683 of 1977) PASS: lldb-api :: api/command-return-object/TestSBCommandReturnObject.py (1684 of 1977) UNSUPPORTED: lldb-shell :: ExecControl/StopHook/stop-hook-threads.test (1685 of 1977) PASS: lldb-api :: python_api/watchpoint/watchlocation/TestSetWatchlocation.py (1686 of 1977) PASS: lldb-unit :: Symbol/./SymbolTests/TestClangASTImporter.DeportTypeTagDecl (1687 of 1977) PASS: lldb-unit :: Target/./TargetTests/ExecutionContextTest.GetByteOrder (1688 of 1977) PASS: lldb-api :: commands/expression/vector_of_enums/TestVectorOfEnums.py (1689 of 1977) PASS: lldb-unit :: Utility/./UtilityTests/TildeExpressionResolver.ResolveFullPath (1690 of 1977) XFAIL: lldb-shell :: SymbolFile/DWARF/find-type-in-function.cpp (1691 of 1977) PASS: lldb-unit :: Process/gdb-remote/./ProcessGdbRemoteTests/GDBRemoteCommunicationClientTest.SaveRestoreRegistersNoSuffix (1692 of 1977) PASS: lldb-unit :: Utility/./UtilityTests/LogTest.LLDB_LOG_nullptr (1693 of 1977) PASS: lldb-api :: lang/cpp/std-function-step-into-callable/TestStdFunctionStepIntoCallable.py (1694 of 1977) PASS: lldb-api :: commands/quit/TestQuit.py (1695 of 1977) PASS: lldb-api :: functionalities/tail_call_frames/cross_object/TestCrossObjectTailCalls.py (1696 of 1977) PASS: lldb-api :: python_api/watchpoint/condition/TestWatchpointConditionAPI.py (1697 of 1977) PASS: lldb-api :: api/multithreaded/TestMultithreaded.py (1698 of 1977) PASS: lldb-unit :: Utility/./UtilityTests/CompletionRequest.Constructor (1699 of 1977) PASS: lldb-unit :: Utility/./UtilityTests/StringListTest.JoinSingle (1700 of 1977) PASS: lldb-unit :: Utility/./UtilityTests/UriParserTest.BracketedHostnamePort (1701 of 1977) PASS: lldb-unit :: Utility/./UtilityTests/RecordReplayTest.InstrumentedBarPtr (1702 of 1977) PASS: lldb-unit :: UnwindAssembly/x86/./UnwindAssemblyx86Tests/Testx86AssemblyInspectionEngine.TestPushEBX (1703 of 1977) PASS: lldb-unit :: Utility/./UtilityTests/GeneratorTest.Get (1704 of 1977) PASS: lldb-unit :: Symbol/./SymbolTests/TestTypeSystemClang.TestGetBasicTypeFromName (1705 of 1977) PASS: lldb-api :: lang/cpp/lambdas/TestLambdas.py (1706 of 1977) PASS: lldb-shell :: SymbolFile/DWARF/find-basic-type.cpp (1707 of 1977) PASS: lldb-shell :: SymbolFile/DWARF/find-method.cpp (1708 of 1977) PASS: lldb-unit :: ScriptInterpreter/Python/./ScriptInterpreterPythonTests/PythonDataObjectsTest.TestExtractingUInt64ThroughStructuredData (1709 of 1977) PASS: lldb-api :: commands/platform/basic/TestPlatformCommand.py (1710 of 1977) PASS: lldb-api :: functionalities/thread/concurrent_events/TestConcurrentWatchBreak.py (1711 of 1977) PASS: lldb-unit :: Expression/./ExpressionTests/DWARFExpression.DW_OP_piece (1712 of 1977) PASS: lldb-api :: functionalities/thread/concurrent_events/TestConcurrentNWatchNBreak.py (1713 of 1977) PASS: lldb-unit :: Utility/./UtilityTests/RegularExpression.Empty (1714 of 1977) PASS: lldb-unit :: Utility/./UtilityTests/VASprintfTest.BufferResize (1715 of 1977) PASS: lldb-api :: functionalities/data-formatter/nssetsynth/TestNSSetSynthetic.py (1716 of 1977) PASS: lldb-shell :: Reproducer/TestCaptureEnvOverride.test (1717 of 1977) PASS: lldb-api :: functionalities/completion/TestCompletion.py (1718 of 1977) PASS: lldb-unit :: Process/gdb-remote/./ProcessGdbRemoteTests/GDBRemoteClientBaseTest.InterruptNoResponse (1719 of 1977) PASS: lldb-api :: functionalities/plugins/command_plugin/TestPluginCommands.py (1720 of 1977) PASS: lldb-unit :: Utility/./UtilityTests/StringListTest.CopyListSingle (1721 of 1977) PASS: lldb-shell :: SymbolFile/DWARF/dwarf5-partial-index.cpp (1722 of 1977) PASS: lldb-api :: tools/lldb-server/TestGdbRemoteExpeditedRegisters.py (1723 of 1977) PASS: lldb-api :: functionalities/breakpoint/breakpoint_conditions/TestBreakpointConditions.py (1724 of 1977) PASS: lldb-api :: lang/objc/foundation/TestObjCMethods.py (1725 of 1977) PASS: lldb-unit :: Utility/./UtilityTests/ArgsTest.ReplaceArgumentAtIndexEqual (1726 of 1977) PASS: lldb-unit :: Utility/./UtilityTests/StringListTest.ShiftMove (1727 of 1977) PASS: lldb-unit :: Language/Highlighting/./HighlighterTests/HighlighterTest.ClangTrailingBackslashMissingNewLine (1728 of 1977) PASS: lldb-unit :: Symbol/./SymbolTests/SymbolsTest.TerminateLocateExecutableSymbolFileForUnknownExecutableAndUnknownSymbolFile (1729 of 1977) UNSUPPORTED: lldb-api :: functionalities/darwin_log/filter/exact_match/category/TestDarwinLogFilterMatchCategory.py (1730 of 1977) PASS: lldb-shell :: SymbolFile/DWARF/debug_ranges.s (1731 of 1977) PASS: lldb-api :: functionalities/target_var/TestTargetVar.py (1732 of 1977) PASS: lldb-api :: lang/cpp/covariant-return-types/TestCovariantReturnTypes.py (1733 of 1977) PASS: lldb-shell :: SymbolFile/DWARF/dwarf5-index-is-used.cpp (1734 of 1977) PASS: lldb-unit :: Utility/./UtilityTests/ConstStringTest.FromMidOfBufferStringRef (1735 of 1977) PASS: lldb-shell :: ObjectFile/ELF/section-types.yaml (1736 of 1977) PASS: lldb-api :: types/TestIntegerTypeExpr.py (1737 of 1977) PASS: lldb-api :: lang/objc/unicode-string/TestUnicodeString.py (1738 of 1977) PASS: lldb-unit :: Host/./HostTests/SocketAddressTest.GetAddressInfo (1739 of 1977) PASS: lldb-api :: lang/objc/objc-runtime-ivars/TestRuntimeIvars.py (1740 of 1977) PASS: lldb-shell :: SymbolFile/DWARF/debug_loc_and_loclists.s (1741 of 1977) PASS: lldb-unit :: UnwindAssembly/x86/./UnwindAssemblyx86Tests/Testx86AssemblyInspectionEngine.TestPushRBPWithREX (1742 of 1977) PASS: lldb-unit :: Utility/./UtilityTests/StringListTest.InsertStringAtIndexMove (1743 of 1977) PASS: lldb-unit :: Utility/./UtilityTests/StringListTest.SetSize (1744 of 1977) UNSUPPORTED: lldb-api :: functionalities/darwin_log/format/TestDarwinLogMessageFormat.py (1745 of 1977) PASS: lldb-api :: functionalities/thread/concurrent_events/TestConcurrentTwoWatchpointThreads.py (1746 of 1977) PASS: lldb-api :: functionalities/data-formatter/language_category_updates/TestDataFormatterLanguageCategoryUpdates.py (1747 of 1977) PASS: lldb-unit :: Utility/./UtilityTests/ScalarTest.Scalar_512 (1748 of 1977) PASS: lldb-shell :: SymbolFile/NativePDB/ast-functions.cpp (1749 of 1977) PASS: lldb-api :: lang/objc/foundation/TestSymbolTable.py (1750 of 1977) PASS: lldb-api :: lang/objc/conflicting-definition/TestConflictingDefinition.py (1751 of 1977) PASS: lldb-api :: python_api/formatters/TestFormattersSBAPI.py (1752 of 1977) PASS: lldb-unit :: Utility/./UtilityTests/UriParserTest.TypicalPortPathIPv6 (1753 of 1977) PASS: lldb-api :: macosx/indirect_symbol/TestIndirectSymbols.py (1754 of 1977) PASS: lldb-unit :: Utility/./UtilityTests/AnsiTerminal.Twice (1755 of 1977) PASS: lldb-api :: functionalities/thread/concurrent_events/TestConcurrentWatchpointDelayWatchpointOneBreakpoint.py (1756 of 1977) PASS: lldb-unit :: Utility/./UtilityTests/SerializationRountripTest.SerializeDeserializePod (1757 of 1977) UNSUPPORTED: lldb-api :: functionalities/breakpoint/breakpoint_in_delayslot/TestAvoidBreakpointInDelaySlot.py (1758 of 1977) PASS: lldb-api :: lang/objc/foundation/TestObjCMethodsString.py (1759 of 1977) PASS: lldb-api :: functionalities/gdb_remote_client/TestThreadSelectionBug.py (1760 of 1977) PASS: lldb-api :: commands/expression/persist_objc_pointeetype/TestPersistObjCPointeeType.py (1761 of 1977) UNSUPPORTED: lldb-api :: functionalities/darwin_log/filter/regex/category/TestDarwinLogFilterRegexCategory.py (1762 of 1977) PASS: lldb-api :: lang/cpp/unsigned_types/TestUnsignedTypes.py (1763 of 1977) PASS: lldb-api :: functionalities/thread/concurrent_events/TestConcurrentTwoWatchpointsOneSignal.py (1764 of 1977) UNSUPPORTED: lldb-shell :: Register/x86-64-zmm-read.test (1765 of 1977) UNSUPPORTED: lldb-api :: commands/expression/macros/TestMacros.py (1766 of 1977) PASS: lldb-unit :: Utility/./UtilityTests/StringListTest.CopyList (1767 of 1977) PASS: lldb-shell :: SymbolFile/DWARF/inline-function-address-shared.test (1768 of 1977) UNSUPPORTED: lldb-shell :: Register/x86-64-zmm-write.test (1769 of 1977) PASS: lldb-api :: functionalities/thread/backtrace_all/TestBacktraceAll.py (1770 of 1977) PASS: lldb-unit :: Process/minidump/./LLDBMinidumpTests/MinidumpParserTest.GetMemoryRegionInfoFromMemory64List (1771 of 1977) PASS: lldb-unit :: Utility/./UtilityTests/OptionsWithRawTest.ArgsButNoDelimiter (1772 of 1977) PASS: lldb-shell :: SymbolFile/NativePDB/global-classes.cpp (1773 of 1977) UNSUPPORTED: lldb-shell :: Register/x86-ymm-write.test (1774 of 1977) UNSUPPORTED: lldb-api :: benchmarks/stepping/TestSteppingSpeed.py (1775 of 1977) UNSUPPORTED: lldb-shell :: SymbolFile/PDB/function-nested-block.test (1776 of 1977) PASS: lldb-api :: functionalities/thread/concurrent_events/TestConcurrentCrashWithBreak.py (1777 of 1977) PASS: lldb-api :: lang/c/function_types/TestFunctionTypes.py (1778 of 1977) PASS: lldb-api :: functionalities/thread/jump/TestThreadJump.py (1779 of 1977) UNSUPPORTED: lldb-api :: linux/thread/create_during_instruction_step/TestCreateDuringInstructionStep.py (1780 of 1977) PASS: lldb-api :: tools/lldb-vscode/breakpoint/TestVSCode_setBreakpoints.py (1781 of 1977) PASS: lldb-api :: functionalities/data-formatter/poarray/TestPrintObjectArray.py (1782 of 1977) PASS: lldb-unit :: Utility/./UtilityTests/BinaryStreamTest.PutSLEB128MaxValue (1783 of 1977) PASS: lldb-unit :: Utility/./UtilityTests/StringExtractorTest.GetHexU8_Underflow (1784 of 1977) PASS: lldb-api :: commands/command/invalid-args/TestInvalidArgsCommand.py (1785 of 1977) PASS: lldb-api :: functionalities/target-new-solib-notifications/TestModuleLoadedNotifys.py (1786 of 1977) XFAIL: lldb-shell :: Register/x86-mm-xmm-write.test (1787 of 1977) PASS: lldb-api :: commands/target/create-no-such-arch/TestNoSuchArch.py (1788 of 1977) PASS: lldb-api :: python_api/value/linked_list/TestValueAPILinkedList.py (1789 of 1977) PASS: lldb-api :: commands/frame/diagnose/local-variable/TestLocalVariable.py (1790 of 1977) PASS: lldb-unit :: Process/gdb-remote/./ProcessGdbRemoteTests/GDBRemoteCommunicationServerTest.SendErrorResponse_ErrorList (1791 of 1977) PASS: lldb-api :: functionalities/thread/concurrent_events/TestConcurrentManyCrash.py (1792 of 1977) PASS: lldb-shell :: Reproducer/TestRelativePath.test (1793 of 1977) UNSUPPORTED: lldb-shell :: Register/x86-ymm-read.test (1794 of 1977) PASS: lldb-api :: functionalities/data-formatter/data-formatter-stl/libcxx/map/TestDataFormatterLibccMap.py (1795 of 1977) PASS: lldb-unit :: Utility/./UtilityTests/VASprintfTest.EncodingError (1796 of 1977) UNSUPPORTED: lldb-shell :: Breakpoint/case-insensitive.test (1797 of 1977) PASS: lldb-api :: functionalities/data-formatter/frameformat_smallstruct/TestFrameFormatSmallStruct.py (1798 of 1977) PASS: lldb-shell :: SymbolFile/NativePDB/bitfields.cpp (1799 of 1977) UNSUPPORTED: lldb-api :: tools/lldb-vscode/completions/TestVSCode_completions.py (1800 of 1977) PASS: lldb-unit :: ScriptInterpreter/Python/./ScriptInterpreterPythonTests/PythonDataObjectsTest.TestPythonTupleInitializerList2 (1801 of 1977) PASS: lldb-shell :: SymbolFile/symbol-binding.test (1802 of 1977) PASS: lldb-unit :: UnwindAssembly/x86/./UnwindAssemblyx86Tests/Testx86AssemblyInspectionEngine.TestDisassemblyMidFunctionEpilogues (1803 of 1977) PASS: lldb-unit :: Interpreter/./InterpreterTests/OptionArgParserTest.toBoolean (1804 of 1977) PASS: lldb-api :: python_api/debugger/TestDebuggerAPI.py (1805 of 1977) PASS: lldb-api :: lang/cpp/virtual-overload/TestVirtualOverload.py (1806 of 1977) PASS: lldb-api :: sample_test/TestSampleTest.py (1807 of 1977) PASS: lldb-api :: functionalities/data-formatter/data-formatter-stl/libcxx/unique_ptr/TestDataFormatterLibcxxUniquePtr.py (1808 of 1977) PASS: lldb-unit :: Expression/./ExpressionTests/ClangHostTest.ComputeClangResourceDirectory (1809 of 1977) PASS: lldb-unit :: Utility/./UtilityTests/StatusTest.Formatv (1810 of 1977) UNSUPPORTED: lldb-api :: benchmarks/continue/TestBenchmarkContinue.py (1811 of 1977) PASS: lldb-api :: commands/expression/function_template_specialization_temp_args/TestFunctionTemplateSpecializationTempArgs.py (1812 of 1977) PASS: lldb-unit :: Utility/./UtilityTests/TimerTest.CategoryTimesNested (1813 of 1977) PASS: lldb-unit :: Process/gdb-remote/./ProcessGdbRemoteTests/GDBRemoteCommunicationClientTest.TestPacketSpeedJSON (1814 of 1977) PASS: lldb-api :: lang/c/tls_globals/TestTlsGlobals.py (1815 of 1977) PASS: lldb-unit :: Expression/./ExpressionTests/ClangHostTest.MacOSX (1816 of 1977) PASS: lldb-api :: lang/objc/modules-hash-mismatch/TestClangModulesHashMismatch.py (1817 of 1977) PASS: lldb-shell :: ObjectFile/ELF/gnu-debuglink.yaml (1818 of 1977) PASS: lldb-api :: lang/objc/variadic_methods/TestVariadicMethods.py (1819 of 1977) UNSUPPORTED: lldb-api :: benchmarks/startup/TestStartupDelays.py (1820 of 1977) PASS: lldb-api :: commands/frame/diagnose/complicated-expression/TestComplicatedExpression.py (1821 of 1977) PASS: lldb-unit :: Utility/./UtilityTests/BinaryStreamTest.PutSLEB128FiveBytes (1822 of 1977) PASS: lldb-api :: functionalities/breakpoint/breakpoint_command/TestBreakpointCommand.py (1823 of 1977) PASS: lldb-shell :: ObjectFile/ELF/duplicate-section.yaml (1824 of 1977) PASS: lldb-unit :: Utility/./UtilityTests/FileSpecTest.RemoveLastPathComponent (1825 of 1977) PASS: lldb-shell :: Breakpoint/debug_rnglistx_rlex.test (1826 of 1977) PASS: lldb-unit :: Process/minidump/./LLDBMinidumpTests/MinidumpParserTest.FindMemoryRangeWithFullMemoryMinidump (1827 of 1977) PASS: lldb-unit :: Utility/./UtilityTests/ScalarTest.GetBytes (1828 of 1977) PASS: lldb-unit :: UnwindAssembly/x86/./UnwindAssemblyx86Tests/Testx86AssemblyInspectionEngine.TestPushESI (1829 of 1977) PASS: lldb-api :: functionalities/data-formatter/data-formatter-named-summaries/TestDataFormatterNamedSummaries.py (1830 of 1977) PASS: lldb-unit :: Expression/./ExpressionTests/ClangExpressionDeclMapTest.TestUnknownIdentifierLookup (1831 of 1977) PASS: lldb-unit :: Symbol/./SymbolTests/DWARFCallFrameInfoTest.Basic_dwarf4 (1832 of 1977) PASS: lldb-unit :: Utility/./UtilityTests/OptionsWithRawTest.UnterminatedQuote (1833 of 1977) PASS: lldb-unit :: ScriptInterpreter/Python/./ScriptInterpreterPythonTests/PythonDataObjectsTest.TestInstanceNameResolutionNoDot (1834 of 1977) PASS: lldb-api :: functionalities/paths/TestPaths.py (1835 of 1977) PASS: lldb-unit :: Process/minidump/./LLDBMinidumpTests/MinidumpParserTest.GetMemory (1836 of 1977) PASS: lldb-unit :: Utility/./UtilityTests/StringExtractorTest.GetNameColonValueContainsColon (1837 of 1977) UNSUPPORTED: lldb-api :: commands/watchpoints/multi_watchpoint_slots/TestWatchpointMultipleSlots.py (1838 of 1977) PASS: lldb-shell :: SymbolFile/DWARF/debug_rnglists.s (1839 of 1977) PASS: lldb-unit :: UnwindAssembly/x86/./UnwindAssemblyx86Tests/Testx86AssemblyInspectionEngine.TestSubESP (1840 of 1977) PASS: lldb-unit :: Utility/./UtilityTests/StreamTest.ShiftOperatorChars (1841 of 1977) PASS: lldb-unit :: Utility/./UtilityTests/StringListTest.JoinEmpty (1842 of 1977) PASS: lldb-unit :: Language/Highlighting/./HighlighterTests/HighlighterTest.ClangComments (1843 of 1977) PASS: lldb-api :: commands/command/script_alias/TestCommandScriptAlias.py (1844 of 1977) PASS: lldb-unit :: Symbol/./SymbolTests/TestTypeSystemClang.TestRemoveFastQualifiers (1845 of 1977) PASS: lldb-unit :: Process/gdb-remote/./ProcessGdbRemoteTests/GDBRemoteCommunicationClientTest.SendStopTracePacket (1846 of 1977) PASS: lldb-api :: python_api/watchpoint/watchlocation/TestTargetWatchAddress.py (1847 of 1977) PASS: lldb-shell :: SymbolFile/DWARF/forward-declarations.s (1848 of 1977) PASS: lldb-unit :: Utility/./UtilityTests/OptionsWithRawTest.LeadingSpaceArgs (1849 of 1977) PASS: lldb-unit :: Expression/./ExpressionTests/DiagnosticManagerTest.PutStringSeverities (1850 of 1977) PASS: lldb-api :: tools/lldb-server/TestAppleSimulatorOSType.py (1851 of 1977) PASS: lldb-api :: commands/expression/ir-interpreter-phi-nodes/TestIRInterpreterPHINodes.py (1852 of 1977) PASS: lldb-api :: commands/apropos/with-process/TestAproposWithProcess.py (1853 of 1977) PASS: lldb-unit :: Utility/./UtilityTests/StringExtractorTest.GetU64BigEndian (1854 of 1977) PASS: lldb-unit :: Utility/./UtilityTests/StringExtractorTest.GetHexU8_Underflow2 (1855 of 1977) PASS: lldb-unit :: Language/Highlighting/./HighlighterTests/HighlighterTest.ClangCursorPosBeforeOtherToken (1856 of 1977) PASS: lldb-unit :: Utility/./UtilityTests/StreamTeeTest.Constructor2Streams (1857 of 1977) PASS: lldb-api :: lang/cpp/operator-overload/TestOperatorOverload.py (1858 of 1977) PASS: lldb-shell :: Quit/TestQuitExitCodeTooManyArgs.test (1859 of 1977) PASS: lldb-unit :: Symbol/./SymbolTests/TestTypeSystemClang.TestIsClangType (1860 of 1977) UNSUPPORTED: lldb-shell :: Reproducer/TestLuaImport.test (1861 of 1977) PASS: lldb-unit :: Process/gdb-remote/./ProcessGdbRemoteTests/GDBRemoteClientBaseTest.SendContinueAndLateInterrupt (1862 of 1977) PASS: lldb-unit :: Expression/./ExpressionTests/DiagnosticManagerTest.GetStringPreserveOrder (1863 of 1977) UNSUPPORTED: lldb-api :: functionalities/darwin_log/filter/exact_match/activity-chain/TestDarwinLogFilterMatchActivityChain.py (1864 of 1977) PASS: lldb-unit :: Utility/./UtilityTests/NameMatchesTest.Equals (1865 of 1977) PASS: lldb-unit :: Utility/./UtilityTests/RangeTest.SlideZero (1866 of 1977) PASS: lldb-unit :: Utility/./UtilityTests/StringExtractorTest.GetNameColonValueNoSemicolon (1867 of 1977) PASS: lldb-api :: functionalities/thread/step_out/TestThreadStepOut.py (1868 of 1977) PASS: lldb-unit :: Utility/./UtilityTests/DataExtractorTest.GetCStrEmpty (1869 of 1977) UNSUPPORTED: lldb-shell :: Unwind/unwind-plan-dwarf-dump.test (1870 of 1977) PASS: lldb-unit :: Platform/./LLDBPlatformTests/PlatformDarwinTest.GetSDKNameForType (1871 of 1977) PASS: lldb-unit :: Utility/./UtilityTests/DataExtractorTest.GetCStrUnterminated (1872 of 1977) PASS: lldb-shell :: ObjectFile/PECOFF/basic-info-arm.yaml (1873 of 1977) PASS: lldb-unit :: Utility/./UtilityTests/Flags.AnyClear (1874 of 1977) PASS: lldb-shell :: SymbolFile/Breakpad/symtab-macho.test (1875 of 1977) PASS: lldb-shell :: Breakpoint/split-dwarf5-debug-stroffsets.test (1876 of 1977) PASS: lldb-unit :: Interpreter/./InterpreterTests/OptionArgParserTest.toChar (1877 of 1977) PASS: lldb-api :: lang/objc/objc-new-syntax/TestObjCNewSyntaxLiteral.py (1878 of 1977) PASS: lldb-api :: macosx/safe-to-func-call/TestSafeFuncCalls.py (1879 of 1977) PASS: lldb-api :: commands/expression/radar_8638051/Test8638051.py (1880 of 1977) PASS: lldb-api :: lang/objc/foundation/TestRuntimeTypes.py (1881 of 1977) PASS: lldb-unit :: Utility/./UtilityTests/StringExtractorTest.GetHexU8_InvalidHex_NoEof (1882 of 1977) PASS: lldb-unit :: Utility/./UtilityTests/VMRange.Reset (1883 of 1977) UNSUPPORTED: lldb-shell :: SymbolFile/PDB/typedefs.test (1884 of 1977) PASS: lldb-unit :: Symbol/./SymbolTests/TestClangASTImporter.MetadataPropagationIndirectImport (1885 of 1977) PASS: lldb-shell :: SymbolFile/DWARF/compilercontext.ll (1886 of 1977) PASS: lldb-unit :: SymbolFile/NativePDB/./SymbolFileNativePDBTests/PDBFPOProgramToDWARFExpressionTests.InvalidOpUnary (1887 of 1977) PASS: lldb-api :: functionalities/data-formatter/data-formatter-stl/libcxx/multimap/TestDataFormatterLibccMultiMap.py (1888 of 1977) PASS: lldb-api :: functionalities/data-formatter/compactvectors/TestCompactVectors.py (1889 of 1977) PASS: lldb-unit :: Utility/./UtilityTests/RangeDataVector.FindEntryThatContains (1890 of 1977) PASS: lldb-unit :: UnwindAssembly/x86/./UnwindAssemblyx86Tests/Testx86AssemblyInspectionEngine.TestPopR13 (1891 of 1977) PASS: lldb-api :: lang/c/blocks/TestBlocks.py (1892 of 1977) PASS: lldb-unit :: Language/Highlighting/./HighlighterTests/HighlighterTest.Colons (1893 of 1977) PASS: lldb-api :: functionalities/data-formatter/data-formatter-synthtype/TestDataFormatterSynthType.py (1894 of 1977) PASS: lldb-api :: commands/expression/completion-crash-incomplete-record/TestCompletionCrashIncompleteRecord.py (1895 of 1977) PASS: lldb-api :: commands/expression/unwind_expression/TestUnwindExpression.py (1896 of 1977) UNSUPPORTED: lldb-api :: functionalities/data-formatter/data-formatter-stl/libstdcpp/list/TestDataFormatterStdList.py (1897 of 1977) PASS: lldb-shell :: VSCode/TestOptions.test (1898 of 1977) PASS: lldb-unit :: Utility/./UtilityTests/Flags.AnySet (1899 of 1977) PASS: lldb-unit :: Utility/./UtilityTests/RangeTest.NotEqual (1900 of 1977) PASS: lldb-unit :: Utility/./UtilityTests/StreamTest.PutHex8 (1901 of 1977) PASS: lldb-shell :: SymbolFile/DWARF/parallel-indexing-stress.s (1902 of 1977) PASS: lldb-api :: lang/cpp/unique-types/TestUniqueTypes.py (1903 of 1977) PASS: lldb-api :: commands/expression/import-std-module/vector/TestVectorFromStdModule.py (1904 of 1977) PASS: lldb-unit :: Symbol/./SymbolTests/TestTypeSystemClang.TestUnifyAccessSpecifiers (1905 of 1977) PASS: lldb-shell :: Breakpoint/single-file-split-dwarf.test (1906 of 1977) PASS: lldb-unit :: Utility/./UtilityTests/StringExtractorTest.GetHexBytes (1907 of 1977) PASS: lldb-unit :: Editline/./EditlineTests/EditlineTestFixture.EditlineReceivesMultiLineText (1908 of 1977) PASS: lldb-api :: types/TestFloatTypes.py (1909 of 1977) PASS: lldb-shell :: ObjectFile/ELF/section-permissions.yaml (1910 of 1977) PASS: lldb-api :: functionalities/breakpoint/breakpoint_ignore_count/TestBreakpointIgnoreCount.py (1911 of 1977) PASS: lldb-unit :: Host/./HostTests/TaskPoolTest.AddTask (1912 of 1977) PASS: lldb-unit :: Expression/./ExpressionTests/DWARFExpression.DW_OP_pick (1913 of 1977) PASS: lldb-shell :: Quit/TestQuitExitCodeHex0.test (1914 of 1977) PASS: lldb-unit :: Utility/./UtilityTests/VMRange.Clear (1915 of 1977) UNSUPPORTED: lldb-shell :: Expr/TestIRMemoryMapWindows.test (1916 of 1977) PASS: lldb-unit :: Host/./HostTests/HostInfoTest.GetHostname (1917 of 1977) PASS: lldb-unit :: Utility/./UtilityTests/UserIDResolver.GetGroupName (1918 of 1977) PASS: lldb-api :: functionalities/data-formatter/data-formatter-stl/libcxx/variant/TestDataFormatterLibcxxVariant.py (1919 of 1977) PASS: lldb-shell :: SymbolFile/DWARF/clang-ast-from-dwarf-unamed-and-anon-structs.cpp (1920 of 1977) PASS: lldb-api :: types/TestLongTypes.py (1921 of 1977) PASS: lldb-unit :: Utility/./UtilityTests/StateTest.Formatv (1922 of 1977) PASS: lldb-unit :: Utility/./UtilityTests/RegisterValueTest.GetSet8 (1923 of 1977) PASS: lldb-shell :: SymbolFile/DWARF/dir-separator-posix.s (1924 of 1977) PASS: lldb-api :: functionalities/stats_api/TestStatisticsAPI.py (1925 of 1977) PASS: lldb-shell :: SymbolFile/DWARF/DW_OP_piece-struct.s (1926 of 1977) PASS: lldb-unit :: Utility/./UtilityTests/StreamTest.PutStringAsRawHex8 (1927 of 1977) PASS: lldb-unit :: SymbolFile/DWARF/./SymbolFileDWARFTests/SymbolFileDWARFTests.TestAbbrevValidAttrNullForm (1928 of 1977) PASS: lldb-api :: commands/expression/completion-in-lambda-and-unnamed-class/TestCompletionInLambdaAndUnnamedClass.py (1929 of 1977) PASS: lldb-shell :: Settings/TestModuleCacheSanity.test (1930 of 1977) PASS: lldb-unit :: Expression/./ExpressionTests/DiagnosticManagerTest.PutString (1931 of 1977) PASS: lldb-shell :: Unwind/trap_frame_sym_ctx.test (1932 of 1977) PASS: lldb-shell :: SymbolFile/NativePDB/tag-types.cpp (1933 of 1977) PASS: lldb-unit :: Process/minidump/./LLDBMinidumpTests/MinidumpParserTest.MinidumpDuplicateModuleMinAddress (1934 of 1977) PASS: lldb-unit :: Utility/./UtilityTests/RangeTest.Clear (1935 of 1977) PASS: lldb-unit :: Utility/./UtilityTests/StreamTest.SetIndentLevel (1936 of 1977) PASS: lldb-unit :: Utility/./UtilityTests/ArgsTest.TestMultipleArgs (1937 of 1977) PASS: lldb-unit :: Utility/./UtilityTests/RangeDataVector.CustomSort (1938 of 1977) PASS: lldb-api :: functionalities/signal/handle-abrt/TestHandleAbort.py (1939 of 1977) PASS: lldb-shell :: ObjectFile/PECOFF/uuid.yaml (1940 of 1977) PASS: lldb-unit :: Utility/./UtilityTests/StreamTest.AddressRange (1941 of 1977) PASS: lldb-unit :: Utility/./UtilityTests/ScalarTest.ComparisonFloat (1942 of 1977) PASS: lldb-unit :: ObjectFile/ELF/./ObjectFileELFTests/ObjectFileELFTest.GetSymtab_NoSymEntryPointArmAddressClass (1943 of 1977) PASS: lldb-unit :: Utility/./UtilityTests/AnsiTerminal.Empty (1944 of 1977) PASS: lldb-api :: lang/objc/objc-ivar-stripped/TestObjCIvarStripped.py (1945 of 1977) PASS: lldb-api :: lang/c/offsetof/TestOffsetof.py (1946 of 1977) PASS: lldb-api :: lang/objc/blocks/TestObjCIvarsInBlocks.py (1947 of 1977) PASS: lldb-unit :: Utility/./UtilityTests/DataExtractorTest.PeekData (1948 of 1977) PASS: lldb-unit :: Utility/./UtilityTests/OptionsWithRawTest.TerminatedQuote (1949 of 1977) PASS: lldb-api :: functionalities/inline-stepping/TestInlineStepping.py (1950 of 1977) PASS: lldb-api :: lang/c/unions/TestUnionMembers.py (1951 of 1977) PASS: lldb-api :: tools/lldb-server/commandline/TestStubSetSID.py (1952 of 1977) PASS: lldb-unit :: Symbol/./SymbolTests/LineEntryTest.GetSameLineContiguousAddressRangeNestedInline (1953 of 1977) PASS: lldb-api :: lang/c/array_types/TestArrayTypes.py (1954 of 1977) PASS: lldb-api :: commands/expression/test/TestExprs2.py (1955 of 1977) PASS: lldb-unit :: Expression/./ExpressionTests/DiagnosticManagerTest.HasFixits (1956 of 1977) PASS: lldb-unit :: UnwindAssembly/x86/./UnwindAssemblyx86Tests/Testx86AssemblyInspectionEngine.TestCALLNextInsn (1957 of 1977) PASS: lldb-unit :: Utility/./UtilityTests/StringListTest.LongestCommonPrefixNoPrefix (1958 of 1977) UNSUPPORTED: lldb-api :: commands/watchpoints/variable_out_of_scope/TestWatchedVarHitWhenInScope.py (1959 of 1977) PASS: lldb-api :: macosx/queues/TestQueues.py (1960 of 1977) PASS: lldb-unit :: Utility/./UtilityTests/StreamTest.PutPtr (1961 of 1977) PASS: lldb-api :: lang/objc/radar-9691614/TestObjCMethodReturningBOOL.py (1962 of 1977) PASS: lldb-api :: commands/expression/import-std-module/list-dbg-info-content/TestDbgInfoContentListFromStdModule.py (1963 of 1977) PASS: lldb-shell :: Commands/command-regex-delete.test (1964 of 1977) PASS: lldb-unit :: Process/gdb-remote/./ProcessGdbRemoteTests/GDBRemoteCommunicationClientTest.GetModulesInfoInvalidResponse (1965 of 1977) PASS: lldb-shell :: Minidump/breakpad-symbols.test (1966 of 1977) PASS: lldb-api :: functionalities/data-formatter/data-formatter-advanced/TestDataFormatterAdv.py (1967 of 1977) PASS: lldb-unit :: Utility/./UtilityTests/OptionsWithRawTest.SingleWordSuffix (1968 of 1977) PASS: lldb-unit :: Utility/./UtilityTests/RegularExpression.Invalid (1969 of 1977) PASS: lldb-unit :: Utility/./UtilityTests/GeneratorTest.Create (1970 of 1977) PASS: lldb-unit :: UnwindAssembly/x86/./UnwindAssemblyx86Tests/Testx86AssemblyInspectionEngine.TestPopRBPWithREX (1971 of 1977) PASS: lldb-unit :: Utility/./UtilityTests/DataExtractorTest.GetBitfield (1972 of 1977) PASS: lldb-shell :: SymbolFile/DWARF/debug_loc.s (1973 of 1977) PASS: lldb-unit :: Expression/./ExpressionTests/DiagnosticManagerTest.AddDiagnostic (1974 of 1977) PASS: lldb-api :: commands/expression/dont_allow_jit/TestAllowJIT.py (1975 of 1977) PASS: lldb-api :: lang/objcxx/objcxx-ivar-vector/TestIvarVector.py (1976 of 1977) PASS: lldb-api :: lang/objc/foundation/TestObjCMethodsNSArray.py (1977 of 1977)

Hide Details

Testing Time: 4484.92s ******************** Failing Tests (3): lldb-api :: lang/objc/ptr_refs/TestPtrRefsObjC.py lldb-api :: functionalities/ptr_refs/TestPtrRefs.py lldb-api :: python_api/thread/TestThreadAPI.py

Hide Details

Hide Details

Slowest Tests: -------------------------------------------------------------------------- 94.79s: lldb-api :: functionalities/data-formatter/data-formatter-objc/TestDataFormatterObjCNSError.py 95.03s: lldb-api :: commands/settings/TestSettings.py 100.83s: lldb-api :: types/TestLongTypes.py 110.00s: lldb-api :: python_api/lldbutil/iter/TestLLDBIterator.py 118.63s: lldb-api :: lang/objc/foundation/TestObjCMethodsNSError.py 119.96s: lldb-api :: lang/objc/foundation/TestObjCMethodsString.py 120.42s: lldb-api :: tools/lldb-server/TestGdbRemote_qThreadStopInfo.py 123.25s: lldb-api :: lang/objc/objc-new-syntax/TestObjCNewSyntaxDictionary.py 124.32s: lldb-api :: lang/objc/objc-new-syntax/TestObjCNewSyntaxArray.py 135.70s: lldb-api :: types/TestLongTypesExpr.py 137.50s: lldb-api :: lang/objc/exceptions/TestObjCExceptions.py 146.02s: lldb-api :: lang/objc/real-definition/TestRealDefinition.py 163.13s: lldb-api :: lang/objc/objc-new-syntax/TestObjCNewSyntaxLiteral.py 165.53s: lldb-api :: lang/cpp/namespace/TestNamespaceLookup.py 225.27s: lldb-api :: lang/objc/foundation/TestObjCMethods.py 244.69s: lldb-api :: lang/objc/hidden-ivars/TestHiddenIvars.py 248.64s: lldb-api :: tools/lldb-server/TestGdbRemoteThreadsInStopReply.py 265.43s: lldb-api :: api/multithreaded/TestMultithreaded.py 265.91s: lldb-api :: lang/cpp/enum_types/TestCPP11EnumTypes.py 359.82s: lldb-api :: tools/lldb-server/TestLldbGdbServer.py

Hide Details

Tests Times: -------------------------------------------------------------------------- [ Range ] :: [ Percentage ] :: [ Count ] -------------------------------------------------------------------------- [ 0s, 20s) :: [********************************** ] :: [1727/1977] [ 20s, 40s) :: [** ] :: [ 109/1977] [ 40s, 60s) :: [* ] :: [ 90/1977] [ 60s, 80s) :: [ ] :: [ 25/1977] [ 80s,100s) :: [ ] :: [ 8/1977] [100s,120s) :: [ ] :: [ 3/1977] [120s,140s) :: [ ] :: [ 6/1977] [140s,160s) :: [ ] :: [ 1/1977] [160s,180s) :: [ ] :: [ 2/1977] [180s,200s) :: [ ] :: [ 0/1977] [200s,220s) :: [ ] :: [ 0/1977] [220s,240s) :: [ ] :: [ 1/1977] [240s,260s) :: [ ] :: [ 2/1977] [260s,280s) :: [ ] :: [ 2/1977] [280s,300s) :: [ ] :: [ 0/1977] [300s,320s) :: [ ] :: [ 0/1977] [320s,340s) :: [ ] :: [ 0/1977] [340s,360s) :: [ ] :: [ 1/1977] Expected Passes : 1801 Expected Failures : 6 Unsupported Tests : 167 Unexpected Failures: 3 FAILED: tools/lldb/test/CMakeFiles/check-lldb-lit cd /Users/buildslave/jenkins/workspace/lldb-cmake-sanitized/lldb-build/tools/lldb/test && /usr/local/bin/python /Users/buildslave/jenkins/workspace/lldb-cmake-sanitized/lldb-build/./bin/llvm-lit -v --time-tests --shuffle --xunit-xml-output=/Users/buildslave/jenkins/workspace/lldb-cmake-sanitized/test/results.xml -v -j 4 --timeout 1200 /Users/buildslave/jenkins/workspace/lldb-cmake-sanitized/lldb-build/tools/lldb/test ninja: build stopped: subcommand failed. Command failed: Command '['/usr/bin/env', 'TERM=vt100', '/usr/local/bin/ninja', '-v', 'check-lldb']' returned non-zero exit status 1. Command: ['/usr/bin/env', 'TERM=vt100', '/usr/local/bin/ninja', '-v', 'check-lldb'] [Pipeline] } [Pipeline] // timeout [Pipeline] } [Pipeline] // stage [Pipeline] stage [Pipeline] { (Declarative: Post Actions) [Pipeline] scanForIssues [Clang (LLVM based)] Sleeping for 5 seconds due to JENKINS-32191... [Clang (LLVM based)] Parsing console log (workspace: '/Users/buildslave/jenkins/workspace/lldb-cmake-sanitized') [Clang (LLVM based)] Successfully parsed console log [Clang (LLVM based)] -> found 4 issues (skipped 0 duplicates) [Clang (LLVM based)] Post processing issues on 'green-dragon-23' with source code encoding 'UTF-8' [Clang (LLVM based)] Creating SCM blamer to obtain author and commit information for affected files [Clang (LLVM based)] Creating SCM miner to obtain statistics for affected repository files [Clang (LLVM based)] Resolving file names for all issues in source directory '/Users/buildslave/jenkins/workspace/lldb-cmake-sanitized' [Clang (LLVM based)] -> resolved paths in source directory (3 found, 0 not found) [Clang (LLVM based)] Resolving module names from module definitions (build.xml, pom.xml, or Manifest.mf files) [Clang (LLVM based)] -> resolved module names for 4 issues [Clang (LLVM based)] Resolving package names (or namespaces) by parsing the affected files [Clang (LLVM based)] -> resolved package names of 3 affected files [Clang (LLVM based)] No filter has been set, publishing all 4 issues [Clang (LLVM based)] Creating fingerprints for all affected code blocks to track issues over different builds [Clang (LLVM based)] -> created fingerprints for 4 issues (skipped 0 issues) [Clang (LLVM based)] Copying affected files to Jenkins' build folder '/Users/Shared/Jenkins/Home/jobs/lldb-cmake-sanitized/builds/1165/files-with-issues' [Clang (LLVM based)] -> 3 copied, 0 not in workspace, 0 not-found, 0 with I/O error [Pipeline] junit Recording test results [Pipeline] } [Pipeline] // stage [Pipeline] } [Pipeline] // withEnv [Pipeline] } [Pipeline] // node [Pipeline] End of Pipeline ERROR: script returned exit code 1 Finished: FAILURE