FailedConsole Output

Skipping 1,638 KB.. Full Log
chProvider (988 of 1977)
UNSUPPORTED: lldb-api :: tools/lldb-vscode/completions/TestVSCode_completions.py (989 of 1977)
PASS: lldb-unit :: Language/Highlighting/./HighlighterTests/HighlighterTest.ClangCursorOutOfBounds (990 of 1977)
PASS: lldb-unit :: Process/gdb-remote/./ProcessGdbRemoteTests/GDBRemoteCommunicationClientTest.SendStartTracePacket (991 of 1977)
PASS: lldb-unit :: Language/Highlighting/./HighlighterTests/HighlighterTest.ClangBraces (992 of 1977)
PASS: lldb-shell :: SymbolFile/NativePDB/ast-functions.cpp (993 of 1977)
PASS: lldb-api :: commands/expression/expr-in-syscall/TestExpressionInSyscall.py (994 of 1977)
PASS: lldb-api :: functionalities/data-formatter/parray/TestPrintArray.py (995 of 1977)
PASS: lldb-shell :: SymbolFile/Breakpad/symtab-macho.test (996 of 1977)
PASS: lldb-unit :: ScriptInterpreter/Python/./ScriptInterpreterPythonTests/PythonDataObjectsTest.TestBorrowedReferences (997 of 1977)
PASS: lldb-unit :: Process/gdb-remote/./ProcessGdbRemoteTests/GDBRemoteClientBaseTest.SendContinueAndLateInterrupt (998 of 1977)
PASS: lldb-api :: commands/frame/diagnose/complicated-expression/TestComplicatedExpression.py (999 of 1977)
PASS: lldb-unit :: Utility/./UtilityTests/StringListTest.InsertStringAtIndexStart (1000 of 1977)
PASS: lldb-unit :: Symbol/./SymbolTests/TestClangASTImporter.CopyDeclTagDecl (1001 of 1977)
UNSUPPORTED: lldb-api :: lang/objc/foundation/TestFoundationDisassembly.py (1002 of 1977)
PASS: lldb-shell :: Reproducer/Functionalities/TestDataFormatter.test (1003 of 1977)
PASS: lldb-api :: functionalities/history/TestHistoryRecall.py (1004 of 1977)
PASS: lldb-unit :: Utility/./UtilityTests/OptionsWithRawTest.SingleWordSuffix (1005 of 1977)
UNSUPPORTED: lldb-api :: functionalities/darwin_log/filter/exact_match/category/TestDarwinLogFilterMatchCategory.py (1006 of 1977)
PASS: lldb-api :: commands/expression/result_numbering/TestResultNumbering.py (1007 of 1977)
PASS: lldb-unit :: Symbol/./SymbolTests/TestTypeSystemClang.TestFunctionTemplateConstruction (1008 of 1977)
PASS: lldb-api :: lang/objc/self/TestObjCSelf.py (1009 of 1977)
PASS: lldb-api :: functionalities/data-formatter/data-formatter-objc/TestDataFormatterObjCNSData.py (1010 of 1977)
PASS: lldb-shell :: Commands/CommandScriptImmediateOutput/CommandScriptImmediateOutputFile.test (1011 of 1977)
PASS: lldb-api :: functionalities/type_completion/TestTypeCompletion.py (1012 of 1977)
PASS: lldb-shell :: SymbolFile/DWARF/find-variable-dwo.cpp (1013 of 1977)
PASS: lldb-unit :: Language/Highlighting/./HighlighterTests/HighlighterTest.Keywords (1014 of 1977)
UNSUPPORTED: lldb-api :: functionalities/darwin_log/format/TestDarwinLogMessageFormat.py (1015 of 1977)
PASS: lldb-unit :: Utility/./UtilityTests/StreamTest.PutHex64ByteOrderLittle (1016 of 1977)
PASS: lldb-unit :: ScriptInterpreter/Python/./ScriptInterpreterPythonTests/PythonDataObjectsTest.TestModuleNameResolutionNoDot (1017 of 1977)
PASS: lldb-shell :: Commands/command-thread-select.test (1018 of 1977)
PASS: lldb-api :: functionalities/thread/concurrent_events/TestConcurrentTwoBreakpointsOneSignal.py (1019 of 1977)
PASS: lldb-unit :: Process/gdb-remote/./ProcessGdbRemoteTests/GDBRemoteClientBaseTest.SendContinueDelegateStructuredDataReceipt (1020 of 1977)
PASS: lldb-api :: lang/cpp/inlines/TestInlines.py (1021 of 1977)
PASS: lldb-api :: functionalities/thread/concurrent_events/TestConcurrentDelayWatchBreak.py (1022 of 1977)
PASS: lldb-unit :: Utility/./UtilityTests/LogChannelTest.Disable (1023 of 1977)
PASS: lldb-unit :: Utility/./UtilityTests/VMRange.ContainsRange (1024 of 1977)
PASS: lldb-unit :: Interpreter/./InterpreterTests/CompletionTest.DirCompletionUsername (1025 of 1977)
PASS: lldb-shell :: Reproducer/TestMultipleTargets.test (1026 of 1977)
PASS: lldb-api :: lang/c/stepping/TestThreadStepping.py (1027 of 1977)
PASS: lldb-unit :: Process/minidump/./LLDBMinidumpTests/MinidumpParserTest.GetPidWow64 (1028 of 1977)
PASS: lldb-api :: functionalities/tail_call_frames/unambiguous_sequence/TestUnambiguousTailCalls.py (1029 of 1977)
PASS: lldb-unit :: Utility/./UtilityTests/OptionsWithRawTest.QuotedSuffix (1030 of 1977)
PASS: lldb-unit :: Utility/./UtilityTests/ArchSpecTest.MergeFrom (1031 of 1977)
PASS: lldb-unit :: Utility/./UtilityTests/GeneratorTest.GetOrCreate (1032 of 1977)
PASS: lldb-shell :: ObjectFile/ELF/section-overlap.yaml (1033 of 1977)
PASS: lldb-unit :: Utility/./UtilityTests/ListenerTest.GetEventWait (1034 of 1977)
PASS: lldb-unit :: debugserver/./debugserverTests/JSON.Parse (1035 of 1977)
PASS: lldb-api :: api/multiple-targets/TestMultipleTargets.py (1036 of 1977)
PASS: lldb-unit :: Utility/./UtilityTests/StringExtractorTest.GetHexBytesAvail_Underflow (1037 of 1977)
PASS: lldb-api :: commands/expression/persistent_ptr_update/TestPersistentPtrUpdate.py (1038 of 1977)
PASS: lldb-unit :: Utility/./UtilityTests/StreamTest.SetIndentLevel (1039 of 1977)
PASS: lldb-unit :: Process/gdb-remote/./ProcessGdbRemoteTests/GDBRemoteCommunicationTest.ReadPacket_checksum (1040 of 1977)
PASS: lldb-api :: commands/watchpoints/watchpoint_commands/command/TestWatchpointCommandLLDB.py (1041 of 1977)
PASS: lldb-unit :: Process/gdb-remote/./ProcessGdbRemoteTests/GDBRemoteCommunicationClientTest.GetMemoryRegionInfo (1042 of 1977)
PASS: lldb-api :: lang/cpp/stl/TestSTL.py (1043 of 1977)
PASS: lldb-unit :: SymbolFile/NativePDB/./SymbolFileNativePDBTests/PDBFPOProgramToDWARFExpressionTests.DependencyChain (1044 of 1977)
PASS: lldb-unit :: Utility/./UtilityTests/UserIDResolver.GetGroupName (1045 of 1977)
PASS: lldb-unit :: UnwindAssembly/x86/./UnwindAssemblyx86Tests/Testx86AssemblyInspectionEngine.TestStackRealignMSVC_i386 (1046 of 1977)
PASS: lldb-api :: lang/cpp/chained-calls/TestCppChainedCalls.py (1047 of 1977)
UNSUPPORTED: lldb-shell :: SymbolFile/Breakpad/stack-cfi-arm.yaml (1048 of 1977)
UNSUPPORTED: lldb-api :: lang/c/typedef/Testtypedef.py (1049 of 1977)
PASS: lldb-unit :: Utility/./UtilityTests/RangeTest.ClearWithStarAddress (1050 of 1977)
PASS: lldb-api :: functionalities/postmortem/minidump-new/TestMiniDumpUUID.py (1051 of 1977)
PASS: lldb-shell :: ObjectFile/ELF/build-id-case.yaml (1052 of 1977)
PASS: lldb-unit :: Utility/./UtilityTests/FileSpecTest.Equal (1053 of 1977)
PASS: lldb-api :: functionalities/data-formatter/data-formatter-stl/libcxx/vbool/TestDataFormatterLibcxxVBool.py (1054 of 1977)
PASS: lldb-unit :: Utility/./UtilityTests/ArchSpecTest.TripleComponentsWereSpecified (1055 of 1977)
PASS: lldb-api :: functionalities/data-formatter/data-formatter-stl/libcxx/vector/TestDataFormatterLibcxxVector.py (1056 of 1977)
PASS: lldb-unit :: Utility/./UtilityTests/StringListTest.InsertStringAtIndexStdString (1057 of 1977)
PASS: lldb-shell :: ObjectFile/PECOFF/uuid.yaml (1058 of 1977)
UNSUPPORTED: lldb-api :: commands/expression/macros/TestMacros.py (1059 of 1977)
PASS: lldb-unit :: Utility/./UtilityTests/StringExtractorTest.GetHexBytes_Underflow (1060 of 1977)
PASS: lldb-unit :: Process/minidump/./LLDBMinidumpTests/MinidumpParserTest.GetMiscInfoWindows (1061 of 1977)
PASS: lldb-unit :: Process/minidump/./LLDBMinidumpTests/MinidumpParserTest.GetThreadContext_x86_64 (1062 of 1977)
PASS: lldb-api :: lang/objcxx/objcxx-ivar-vector/TestIvarVector.py (1063 of 1977)
PASS: lldb-api :: lang/cpp/llvm-style/TestLLVMStyle.py (1064 of 1977)
PASS: lldb-api :: functionalities/breakpoint/serialize/TestBreakpointSerialization.py (1065 of 1977)
PASS: lldb-unit :: ScriptInterpreter/Python/./ScriptInterpreterPythonTests/PythonDataObjectsTest.TestGlobalNameResolutionNoDot (1066 of 1977)
UNSUPPORTED: lldb-shell :: Breakpoint/ppc64-localentry.test (1067 of 1977)
PASS: lldb-api :: lang/cpp/multiple-inheritance/TestCppMultipleInheritance.py (1068 of 1977)
PASS: lldb-unit :: Symbol/./SymbolTests/TestTypeSystemClang.TestFunctionTemplateInRecordConstruction (1069 of 1977)
PASS: lldb-shell :: Quit/TestQuitExitCodeTooManyArgs.test (1070 of 1977)
PASS: lldb-unit :: UnwindAssembly/x86/./UnwindAssemblyx86Tests/Testx86AssemblyInspectionEngine.Test64bitFramelessBigStackFrame (1071 of 1977)
PASS: lldb-api :: functionalities/breakpoint/breakpoint_by_line_and_column/TestBreakpointByLineAndColumn.py (1072 of 1977)
PASS: lldb-unit :: Expression/./ExpressionTests/CppModuleConfigurationTest.AmbiguousCLib (1073 of 1977)
PASS: lldb-unit :: UnwindAssembly/x86/./UnwindAssemblyx86Tests/Testx86AssemblyInspectionEngine.TestSimplei386ugmented (1074 of 1977)
PASS: lldb-unit :: Utility/./UtilityTests/StreamTeeTest.CopyConstructor (1075 of 1977)
PASS: lldb-unit :: Utility/./UtilityTests/ProcessInstanceInfo.Dump (1076 of 1977)
PASS: lldb-shell :: ScriptInterpreter/None/none.test (1077 of 1977)
FAIL: lldb-api :: python_api/thread/TestThreadAPI.py (1078 of 1977)
******************** TEST 'lldb-api :: python_api/thread/TestThreadAPI.py' FAILED ********************
Script:
--
/usr/local/bin/python /Users/buildslave/jenkins/workspace/lldb-cmake-sanitized/llvm-project/lldb/test/API/dotest.py --arch x86_64 -s /Users/buildslave/jenkins/workspace/lldb-cmake-sanitized/lldb-build/lldb-test-traces -S nm -u CXXFLAGS -u CFLAGS --codesign-identity lldb_codesign --server /Users/buildslave/jenkins/workspace/lldb-cmake-sanitized/lldb-build/./bin/debugserver --arch x86_64 --build-dir /Users/buildslave/jenkins/workspace/lldb-cmake-sanitized/lldb-build/lldb-test-build.noindex -s=/Users/buildslave/jenkins/workspace/lldb-cmake-sanitized/test/logs -t --env TERM=vt100 --env LLVM_LIBS_DIR=/Users/buildslave/jenkins/workspace/lldb-cmake-sanitized/lldb-build/./lib --inferior-env ASAN_OPTIONS=detect_stack_use_after_return=1 --inferior-env DYLD_INSERT_LIBRARIES=/Users/buildslave/jenkins/workspace/lldb-cmake-sanitized/host-compiler/lib/clang/11.0.0/lib/darwin/libclang_rt.asan_osx_dynamic.dylib --build-dir /Users/buildslave/jenkins/workspace/lldb-cmake-sanitized/lldb-build/lldb-test-build.noindex --lldb-module-cache-dir /Users/buildslave/jenkins/workspace/lldb-cmake-sanitized/lldb-build/lldb-test-build.noindex/module-cache-lldb/lldb-api --clang-module-cache-dir /Users/buildslave/jenkins/workspace/lldb-cmake-sanitized/lldb-build/lldb-test-build.noindex/module-cache-clang/lldb-api --executable /Users/buildslave/jenkins/workspace/lldb-cmake-sanitized/lldb-build/./bin/lldb --compiler /Users/buildslave/jenkins/workspace/lldb-cmake-sanitized/lldb-build/./bin/clang --dsymutil /Users/buildslave/jenkins/workspace/lldb-cmake-sanitized/lldb-build/./bin/dsymutil --filecheck /Users/buildslave/jenkins/workspace/lldb-cmake-sanitized/lldb-build/./bin/FileCheck --lldb-libs-dir /Users/buildslave/jenkins/workspace/lldb-cmake-sanitized/lldb-build/./lib /Users/buildslave/jenkins/workspace/lldb-cmake-sanitized/llvm-project/lldb/test/API/python_api/thread -p TestThreadAPI.py
--
Exit Code: 1

Hide Details

Command Output (stdout): -- lldb version 11.0.99 clang revision 12f6b024f9f58cee72770849a8c86a1436046ff7 llvm revision 12f6b024f9f58cee72770849a8c86a1436046ff7 LLDB library dir: /Users/buildslave/jenkins/workspace/lldb-cmake-sanitized/lldb-build/bin LLDB import library dir: /Users/buildslave/jenkins/workspace/lldb-cmake-sanitized/lldb-build/./lib libstdcxx tests will not be run because: Don't know how to build with libstdcxx on macosx Skipping following debug info categories: ['dwo'] start addr: 0x109dece66 end addr: 0x109dece70 start addr: 0x102c93e66 end addr: 0x102c93e70 start addr: 0x10b764e66 end addr: 0x10b764e70

Hide Details

-- Command Output (stderr): --

Hide Details

Session logs for test failures/errors/unexpected successes will go into directory '/Users/buildslave/jenkins/workspace/lldb-cmake-sanitized/test/logs' Command invoked: /Users/buildslave/jenkins/workspace/lldb-cmake-sanitized/llvm-project/lldb/test/API/dotest.py --arch x86_64 -s /Users/buildslave/jenkins/workspace/lldb-cmake-sanitized/lldb-build/lldb-test-traces -S nm -u CXXFLAGS -u CFLAGS --codesign-identity lldb_codesign --server /Users/buildslave/jenkins/workspace/lldb-cmake-sanitized/lldb-build/./bin/debugserver --arch x86_64 --build-dir /Users/buildslave/jenkins/workspace/lldb-cmake-sanitized/lldb-build/lldb-test-build.noindex -s=/Users/buildslave/jenkins/workspace/lldb-cmake-sanitized/test/logs -t --env TERM=vt100 --env LLVM_LIBS_DIR=/Users/buildslave/jenkins/workspace/lldb-cmake-sanitized/lldb-build/./lib --inferior-env ASAN_OPTIONS=detect_stack_use_after_return=1 --inferior-env DYLD_INSERT_LIBRARIES=/Users/buildslave/jenkins/workspace/lldb-cmake-sanitized/host-compiler/lib/clang/11.0.0/lib/darwin/libclang_rt.asan_osx_dynamic.dylib --build-dir /Users/buildslave/jenkins/workspace/lldb-cmake-sanitized/lldb-build/lldb-test-build.noindex --lldb-module-cache-dir /Users/buildslave/jenkins/workspace/lldb-cmake-sanitized/lldb-build/lldb-test-build.noindex/module-cache-lldb/lldb-api --clang-module-cache-dir /Users/buildslave/jenkins/workspace/lldb-cmake-sanitized/lldb-build/lldb-test-build.noindex/module-cache-clang/lldb-api --executable /Users/buildslave/jenkins/workspace/lldb-cmake-sanitized/lldb-build/./bin/lldb --compiler /Users/buildslave/jenkins/workspace/lldb-cmake-sanitized/lldb-build/./bin/clang --dsymutil /Users/buildslave/jenkins/workspace/lldb-cmake-sanitized/lldb-build/./bin/dsymutil --filecheck /Users/buildslave/jenkins/workspace/lldb-cmake-sanitized/lldb-build/./bin/FileCheck --lldb-libs-dir /Users/buildslave/jenkins/workspace/lldb-cmake-sanitized/lldb-build/./lib /Users/buildslave/jenkins/workspace/lldb-cmake-sanitized/llvm-project/lldb/test/API/python_api/thread -p TestThreadAPI.py Change dir to: /Users/buildslave/jenkins/workspace/lldb-cmake-sanitized/llvm-project/lldb/test/API/python_api/thread runCmd: settings clear -all output:

Hide Details

runCmd: settings set symbols.enable-external-lookup false output:

Hide Details

runCmd: settings set target.auto-apply-fixits false output:

Hide Details

runCmd: settings set plugin.process.gdb-remote.packet-timeout 60 output:

Hide Details

runCmd: settings set symbols.clang-modules-cache-path "/Users/buildslave/jenkins/workspace/lldb-cmake-sanitized/lldb-build/lldb-test-build.noindex/module-cache-lldb/lldb-api" output:

Hide Details

runCmd: settings set use-color false output:

Hide Details

runCmd: setting set target.prefer-dynamic-value no-dynamic-values output:

Hide Details

runCmd: settings set target.env-vars ASAN_OPTIONS=detect_stack_use_after_return=1 DYLD_INSERT_LIBRARIES=/Users/buildslave/jenkins/workspace/lldb-cmake-sanitized/host-compiler/lib/clang/11.0.0/lib/darwin/libclang_rt.asan_osx_dynamic.dylib output:

Hide Details

runCmd: breakpoint list output: Current breakpoints: 1: file = 'main.cpp', line = 17, exact_match = 0, locations = 1 1.1: where = a.out`main + 115 at main.cpp:17:5, address = a.out[0x0000000100000f53], unresolved, hit count = 0

Hide Details

Hide Details

Hide Details

runCmd: process status output: Process 69357 stopped * thread #1, queue = 'com.apple.main-thread', stop reason = breakpoint 1.1 frame #0: 0x000000010d8c2f53 a.out`main(argc=1, argv=0x00007ffee233d4c8) at main.cpp:17:5 14 15 printf("after the loop: my_char='%c'\n", my_char); // 'my_char' should print out as 'x'. 16 -> 17 return 0; // Set break point at this line and check variable 'my_char'. ^ 18 }

Hide Details

Hide Details

<bound method SBProcess.Kill of <lldb.SBProcess; proxy of <Swig Object of type 'lldb::SBProcess *' at 0x10ee60ab0> >>: success

Hide Details

PASS: LLDB (/Users/buildslave/jenkins/workspace/lldb-cmake-sanitized/lldb-build/bin/clang-11-x86_64) :: test_get_process_dsym (TestThreadAPI.ThreadAPITestCase) runCmd: settings clear -all output:

Hide Details

runCmd: settings set symbols.enable-external-lookup false output:

Hide Details

runCmd: settings set target.auto-apply-fixits false output:

Hide Details

runCmd: settings set plugin.process.gdb-remote.packet-timeout 60 output:

Hide Details

runCmd: settings set symbols.clang-modules-cache-path "/Users/buildslave/jenkins/workspace/lldb-cmake-sanitized/lldb-build/lldb-test-build.noindex/module-cache-lldb/lldb-api" output:

Hide Details

runCmd: settings set use-color false output:

Hide Details

runCmd: setting set target.prefer-dynamic-value no-dynamic-values output:

Hide Details

runCmd: settings set target.env-vars ASAN_OPTIONS=detect_stack_use_after_return=1 DYLD_INSERT_LIBRARIES=/Users/buildslave/jenkins/workspace/lldb-cmake-sanitized/host-compiler/lib/clang/11.0.0/lib/darwin/libclang_rt.asan_osx_dynamic.dylib output:

Hide Details

runCmd: breakpoint list output: Current breakpoints: 1: file = 'main.cpp', line = 17, exact_match = 0, locations = 1 1.1: where = a.out`main + 115 at main.cpp:17:5, address = a.out[0x0000000100000f53], unresolved, hit count = 0

Hide Details

Hide Details

Hide Details

runCmd: process status output: Process 69439 stopped * thread #1, queue = 'com.apple.main-thread', stop reason = breakpoint 1.1 frame #0: 0x000000010bb9df53 a.out`main(argc=1, argv=0x00007ffee4062498) at main.cpp:17:5 14 15 printf("after the loop: my_char='%c'\n", my_char); // 'my_char' should print out as 'x'. 16 -> 17 return 0; // Set break point at this line and check variable 'my_char'. ^ 18 }

Hide Details

Hide Details

<bound method SBProcess.Kill of <lldb.SBProcess; proxy of <Swig Object of type 'lldb::SBProcess *' at 0x10e1e3990> >>: success

Hide Details

PASS: LLDB (/Users/buildslave/jenkins/workspace/lldb-cmake-sanitized/lldb-build/bin/clang-11-x86_64) :: test_get_process_dwarf (TestThreadAPI.ThreadAPITestCase) UNSUPPORTED: LLDB (/Users/buildslave/jenkins/workspace/lldb-cmake-sanitized/lldb-build/bin/clang-11-x86_64) :: test_get_process_dwo (TestThreadAPI.ThreadAPITestCase) (test case does not fall in any category of interest for this run) runCmd: settings clear -all output:

Hide Details

runCmd: settings set symbols.enable-external-lookup false output:

Hide Details

runCmd: settings set target.auto-apply-fixits false output:

Hide Details

runCmd: settings set plugin.process.gdb-remote.packet-timeout 60 output:

Hide Details

runCmd: settings set symbols.clang-modules-cache-path "/Users/buildslave/jenkins/workspace/lldb-cmake-sanitized/lldb-build/lldb-test-build.noindex/module-cache-lldb/lldb-api" output:

Hide Details

runCmd: settings set use-color false output:

Hide Details

runCmd: setting set target.prefer-dynamic-value no-dynamic-values output:

Hide Details

runCmd: settings set target.env-vars ASAN_OPTIONS=detect_stack_use_after_return=1 DYLD_INSERT_LIBRARIES=/Users/buildslave/jenkins/workspace/lldb-cmake-sanitized/host-compiler/lib/clang/11.0.0/lib/darwin/libclang_rt.asan_osx_dynamic.dylib output:

Hide Details

runCmd: breakpoint list output: Current breakpoints: 1: file = 'main.cpp', line = 17, exact_match = 0, locations = 1 1.1: where = a.out`main + 115 at main.cpp:17:5, address = a.out[0x0000000100000f53], unresolved, hit count = 0

Hide Details

Hide Details

Hide Details

runCmd: process status output: Process 69547 stopped * thread #1, queue = 'com.apple.main-thread', stop reason = breakpoint 1.1 frame #0: 0x0000000109adbf53 a.out`main(argc=1, argv=0x00007ffee6124498) at main.cpp:17:5 14 15 printf("after the loop: my_char='%c'\n", my_char); // 'my_char' should print out as 'x'. 16 -> 17 return 0; // Set break point at this line and check variable 'my_char'. ^ 18 }

Hide Details

Hide Details

<bound method SBProcess.Kill of <lldb.SBProcess; proxy of <Swig Object of type 'lldb::SBProcess *' at 0x10ee608d0> >>: success

Hide Details

PASS: LLDB (/Users/buildslave/jenkins/workspace/lldb-cmake-sanitized/lldb-build/bin/clang-11-x86_64) :: test_get_process_gmodules (TestThreadAPI.ThreadAPITestCase) runCmd: settings clear -all output:

Hide Details

runCmd: settings set symbols.enable-external-lookup false output:

Hide Details

runCmd: settings set target.auto-apply-fixits false output:

Hide Details

runCmd: settings set plugin.process.gdb-remote.packet-timeout 60 output:

Hide Details

runCmd: settings set symbols.clang-modules-cache-path "/Users/buildslave/jenkins/workspace/lldb-cmake-sanitized/lldb-build/lldb-test-build.noindex/module-cache-lldb/lldb-api" output:

Hide Details

runCmd: settings set use-color false output:

Hide Details

runCmd: setting set target.prefer-dynamic-value no-dynamic-values output:

Hide Details

runCmd: settings set target.env-vars ASAN_OPTIONS=detect_stack_use_after_return=1 DYLD_INSERT_LIBRARIES=/Users/buildslave/jenkins/workspace/lldb-cmake-sanitized/host-compiler/lib/clang/11.0.0/lib/darwin/libclang_rt.asan_osx_dynamic.dylib output:

Hide Details

<bound method SBProcess.Kill of <lldb.SBProcess; proxy of <Swig Object of type 'lldb::SBProcess *' at 0x10e1e3960> >>: success

Hide Details

PASS: LLDB (/Users/buildslave/jenkins/workspace/lldb-cmake-sanitized/lldb-build/bin/clang-11-x86_64) :: test_get_stop_description_dsym (TestThreadAPI.ThreadAPITestCase) runCmd: settings clear -all output:

Hide Details

runCmd: settings set symbols.enable-external-lookup false output:

Hide Details

runCmd: settings set target.auto-apply-fixits false output:

Hide Details

runCmd: settings set plugin.process.gdb-remote.packet-timeout 60 output:

Hide Details

runCmd: settings set symbols.clang-modules-cache-path "/Users/buildslave/jenkins/workspace/lldb-cmake-sanitized/lldb-build/lldb-test-build.noindex/module-cache-lldb/lldb-api" output:

Hide Details

runCmd: settings set use-color false output:

Hide Details

runCmd: setting set target.prefer-dynamic-value no-dynamic-values output:

Hide Details

runCmd: settings set target.env-vars ASAN_OPTIONS=detect_stack_use_after_return=1 DYLD_INSERT_LIBRARIES=/Users/buildslave/jenkins/workspace/lldb-cmake-sanitized/host-compiler/lib/clang/11.0.0/lib/darwin/libclang_rt.asan_osx_dynamic.dylib output:

Hide Details

<bound method SBProcess.Kill of <lldb.SBProcess; proxy of <Swig Object of type 'lldb::SBProcess *' at 0x10e87b2d0> >>: success

Hide Details

PASS: LLDB (/Users/buildslave/jenkins/workspace/lldb-cmake-sanitized/lldb-build/bin/clang-11-x86_64) :: test_get_stop_description_dwarf (TestThreadAPI.ThreadAPITestCase) UNSUPPORTED: LLDB (/Users/buildslave/jenkins/workspace/lldb-cmake-sanitized/lldb-build/bin/clang-11-x86_64) :: test_get_stop_description_dwo (TestThreadAPI.ThreadAPITestCase) (test case does not fall in any category of interest for this run) runCmd: settings clear -all output:

Hide Details

runCmd: settings set symbols.enable-external-lookup false output:

Hide Details

runCmd: settings set target.auto-apply-fixits false output:

Hide Details

runCmd: settings set plugin.process.gdb-remote.packet-timeout 60 output:

Hide Details

runCmd: settings set symbols.clang-modules-cache-path "/Users/buildslave/jenkins/workspace/lldb-cmake-sanitized/lldb-build/lldb-test-build.noindex/module-cache-lldb/lldb-api" output:

Hide Details

runCmd: settings set use-color false output:

Hide Details

runCmd: setting set target.prefer-dynamic-value no-dynamic-values output:

Hide Details

runCmd: settings set target.env-vars ASAN_OPTIONS=detect_stack_use_after_return=1 DYLD_INSERT_LIBRARIES=/Users/buildslave/jenkins/workspace/lldb-cmake-sanitized/host-compiler/lib/clang/11.0.0/lib/darwin/libclang_rt.asan_osx_dynamic.dylib output:

Hide Details

<bound method SBProcess.Kill of <lldb.SBProcess; proxy of <Swig Object of type 'lldb::SBProcess *' at 0x10e1e3990> >>: success

Hide Details

PASS: LLDB (/Users/buildslave/jenkins/workspace/lldb-cmake-sanitized/lldb-build/bin/clang-11-x86_64) :: test_get_stop_description_gmodules (TestThreadAPI.ThreadAPITestCase) runCmd: settings clear -all output:

Hide Details

runCmd: settings set symbols.enable-external-lookup false output:

Hide Details

runCmd: settings set target.auto-apply-fixits false output:

Hide Details

runCmd: settings set plugin.process.gdb-remote.packet-timeout 60 output:

Hide Details

runCmd: settings set symbols.clang-modules-cache-path "/Users/buildslave/jenkins/workspace/lldb-cmake-sanitized/lldb-build/lldb-test-build.noindex/module-cache-lldb/lldb-api" output:

Hide Details

runCmd: settings set use-color false output:

Hide Details

runCmd: setting set target.prefer-dynamic-value no-dynamic-values output:

Hide Details

runCmd: settings set target.env-vars ASAN_OPTIONS=detect_stack_use_after_return=1 DYLD_INSERT_LIBRARIES=/Users/buildslave/jenkins/workspace/lldb-cmake-sanitized/host-compiler/lib/clang/11.0.0/lib/darwin/libclang_rt.asan_osx_dynamic.dylib output:

Hide Details

runCmd: breakpoint list output: Current breakpoints: 1: file = 'main2.cpp', line = 21, exact_match = 0, locations = 1 1.1: where = test_run_to_address_dsym`b(int) + 22 at main2.cpp:21:17, address = test_run_to_address_dsym[0x0000000100000e66], unresolved, hit count = 0

Hide Details

Hide Details

Hide Details

runCmd: thread backtrace output: * thread #1, queue = 'com.apple.main-thread', stop reason = breakpoint 1.1 * frame #0: 0x0000000109dece66 test_run_to_address_dsym`b(val=1) at main2.cpp:21:17 frame #1: 0x0000000109dece0d test_run_to_address_dsym`a(val=1) at main2.cpp:11:16 frame #2: 0x0000000109decee0 test_run_to_address_dsym`main(argc=1, argv=0x00007ffee5e13470) at main2.cpp:36:14 frame #3: 0x00007fff742d5085 libdyld.dylib`start + 1

Hide Details

Hide Details

runCmd: breakpoint list output: Current breakpoints: 1: file = 'main2.cpp', line = 21, exact_match = 0, locations = 1 Options: disabled 1.1: where = test_run_to_address_dsym`b(int) + 22 at main2.cpp:21:17, address = 0x0000000109dece66, unresolved, hit count = 1

Hide Details

Hide Details

Hide Details

runCmd: thread backtrace output: * thread #1, queue = 'com.apple.main-thread', stop reason = step over * frame #0: 0x0000000109dece9d test_run_to_address_dsym`b(val=1) at main2.cpp:26:12 frame #1: 0x0000000109dece0d test_run_to_address_dsym`a(val=1) at main2.cpp:11:16 frame #2: 0x0000000109decee0 test_run_to_address_dsym`main(argc=1, argv=0x00007ffee5e13470) at main2.cpp:36:14 frame #3: 0x00007fff742d5085 libdyld.dylib`start + 1

Hide Details

Hide Details

runCmd: process status output: Process 69838 stopped * thread #1, queue = 'com.apple.main-thread', stop reason = run to address: 0x0000000109dece66 frame #0: 0x0000000109dece66 test_run_to_address_dsym`b(val=2) at main2.cpp:21:17 18 int b(int val) 19 { 20 int rc = c(val); -> 21 void *ptr = malloc(1024); // thread step-out of malloc into function b. ^ 22 if (!ptr) 23 return -1; 24 else

Hide Details

Hide Details

<bound method SBProcess.Kill of <lldb.SBProcess; proxy of <Swig Object of type 'lldb::SBProcess *' at 0x10e67bde0> >>: success

Hide Details

PASS: LLDB (/Users/buildslave/jenkins/workspace/lldb-cmake-sanitized/lldb-build/bin/clang-11-x86_64) :: test_run_to_address_dsym (TestThreadAPI.ThreadAPITestCase) runCmd: settings clear -all output:

Hide Details

runCmd: settings set symbols.enable-external-lookup false output:

Hide Details

runCmd: settings set target.auto-apply-fixits false output:

Hide Details

runCmd: settings set plugin.process.gdb-remote.packet-timeout 60 output:

Hide Details

runCmd: settings set symbols.clang-modules-cache-path "/Users/buildslave/jenkins/workspace/lldb-cmake-sanitized/lldb-build/lldb-test-build.noindex/module-cache-lldb/lldb-api" output:

Hide Details

runCmd: settings set use-color false output:

Hide Details

runCmd: setting set target.prefer-dynamic-value no-dynamic-values output:

Hide Details

runCmd: settings set target.env-vars ASAN_OPTIONS=detect_stack_use_after_return=1 DYLD_INSERT_LIBRARIES=/Users/buildslave/jenkins/workspace/lldb-cmake-sanitized/host-compiler/lib/clang/11.0.0/lib/darwin/libclang_rt.asan_osx_dynamic.dylib output:

Hide Details

runCmd: breakpoint list output: Current breakpoints: 1: file = 'main2.cpp', line = 21, exact_match = 0, locations = 1 1.1: where = test_run_to_address_dwarf`b(int) + 22 at main2.cpp:21:17, address = test_run_to_address_dwarf[0x0000000100000e66], unresolved, hit count = 0

Hide Details

Hide Details

Hide Details

runCmd: thread backtrace output: * thread #1, queue = 'com.apple.main-thread', stop reason = breakpoint 1.1 * frame #0: 0x0000000102c93e66 test_run_to_address_dwarf`b(val=1) at main2.cpp:21:17 frame #1: 0x0000000102c93e0d test_run_to_address_dwarf`a(val=1) at main2.cpp:11:16 frame #2: 0x0000000102c93ee0 test_run_to_address_dwarf`main(argc=1, argv=0x00007ffeecf6c470) at main2.cpp:36:14 frame #3: 0x00007fff742d5085 libdyld.dylib`start + 1

Hide Details

Hide Details

runCmd: breakpoint list output: Current breakpoints: 1: file = 'main2.cpp', line = 21, exact_match = 0, locations = 1 Options: disabled 1.1: where = test_run_to_address_dwarf`b(int) + 22 at main2.cpp:21:17, address = 0x0000000102c93e66, unresolved, hit count = 1

Hide Details

Hide Details

Hide Details

runCmd: thread backtrace output: * thread #1, queue = 'com.apple.main-thread', stop reason = step over * frame #0: 0x0000000102c93e9d test_run_to_address_dwarf`b(val=1) at main2.cpp:26:12 frame #1: 0x0000000102c93e0d test_run_to_address_dwarf`a(val=1) at main2.cpp:11:16 frame #2: 0x0000000102c93ee0 test_run_to_address_dwarf`main(argc=1, argv=0x00007ffeecf6c470) at main2.cpp:36:14 frame #3: 0x00007fff742d5085 libdyld.dylib`start + 1

Hide Details

Hide Details

runCmd: process status output: Process 69970 stopped * thread #1, queue = 'com.apple.main-thread', stop reason = run to address: 0x0000000102c93e66 frame #0: 0x0000000102c93e66 test_run_to_address_dwarf`b(val=2) at main2.cpp:21:17 18 int b(int val) 19 { 20 int rc = c(val); -> 21 void *ptr = malloc(1024); // thread step-out of malloc into function b. ^ 22 if (!ptr) 23 return -1; 24 else

Hide Details

Hide Details

<bound method SBProcess.Kill of <lldb.SBProcess; proxy of <Swig Object of type 'lldb::SBProcess *' at 0x10e1e3960> >>: success

Hide Details

PASS: LLDB (/Users/buildslave/jenkins/workspace/lldb-cmake-sanitized/lldb-build/bin/clang-11-x86_64) :: test_run_to_address_dwarf (TestThreadAPI.ThreadAPITestCase) UNSUPPORTED: LLDB (/Users/buildslave/jenkins/workspace/lldb-cmake-sanitized/lldb-build/bin/clang-11-x86_64) :: test_run_to_address_dwo (TestThreadAPI.ThreadAPITestCase) (test case does not fall in any category of interest for this run) runCmd: settings clear -all output:

Hide Details

runCmd: settings set symbols.enable-external-lookup false output:

Hide Details

runCmd: settings set target.auto-apply-fixits false output:

Hide Details

runCmd: settings set plugin.process.gdb-remote.packet-timeout 60 output:

Hide Details

runCmd: settings set symbols.clang-modules-cache-path "/Users/buildslave/jenkins/workspace/lldb-cmake-sanitized/lldb-build/lldb-test-build.noindex/module-cache-lldb/lldb-api" output:

Hide Details

runCmd: settings set use-color false output:

Hide Details

runCmd: setting set target.prefer-dynamic-value no-dynamic-values output:

Hide Details

runCmd: settings set target.env-vars ASAN_OPTIONS=detect_stack_use_after_return=1 DYLD_INSERT_LIBRARIES=/Users/buildslave/jenkins/workspace/lldb-cmake-sanitized/host-compiler/lib/clang/11.0.0/lib/darwin/libclang_rt.asan_osx_dynamic.dylib output:

Hide Details

runCmd: breakpoint list output: Current breakpoints: 1: file = 'main2.cpp', line = 21, exact_match = 0, locations = 1 1.1: where = test_run_to_address_gmodules`b(int) + 22 at main2.cpp:21:17, address = test_run_to_address_gmodules[0x0000000100000e66], unresolved, hit count = 0

Hide Details

Hide Details

Hide Details

runCmd: thread backtrace output: * thread #1, queue = 'com.apple.main-thread', stop reason = breakpoint 1.1 * frame #0: 0x000000010b764e66 test_run_to_address_gmodules`b(val=1) at main2.cpp:21:17 frame #1: 0x000000010b764e0d test_run_to_address_gmodules`a(val=1) at main2.cpp:11:16 frame #2: 0x000000010b764ee0 test_run_to_address_gmodules`main(argc=1, argv=0x00007ffee449b460) at main2.cpp:36:14 frame #3: 0x00007fff742d5085 libdyld.dylib`start + 1

Hide Details

Hide Details

runCmd: breakpoint list output: Current breakpoints: 1: file = 'main2.cpp', line = 21, exact_match = 0, locations = 1 Options: disabled 1.1: where = test_run_to_address_gmodules`b(int) + 22 at main2.cpp:21:17, address = 0x000000010b764e66, unresolved, hit count = 1

Hide Details

Hide Details

Hide Details

runCmd: thread backtrace output: * thread #1, queue = 'com.apple.main-thread', stop reason = step over * frame #0: 0x000000010b764e9d test_run_to_address_gmodules`b(val=1) at main2.cpp:26:12 frame #1: 0x000000010b764e0d test_run_to_address_gmodules`a(val=1) at main2.cpp:11:16 frame #2: 0x000000010b764ee0 test_run_to_address_gmodules`main(argc=1, argv=0x00007ffee449b460) at main2.cpp:36:14 frame #3: 0x00007fff742d5085 libdyld.dylib`start + 1

Hide Details

Hide Details

runCmd: process status output: Process 70028 stopped * thread #1, queue = 'com.apple.main-thread', stop reason = run to address: 0x000000010b764e66 frame #0: 0x000000010b764e66 test_run_to_address_gmodules`b(val=2) at main2.cpp:21:17 18 int b(int val) 19 { 20 int rc = c(val); -> 21 void *ptr = malloc(1024); // thread step-out of malloc into function b. ^ 22 if (!ptr) 23 return -1; 24 else

Hide Details

Hide Details

<bound method SBProcess.Kill of <lldb.SBProcess; proxy of <Swig Object of type 'lldb::SBProcess *' at 0x10e87b2d0> >>: success

Hide Details

PASS: LLDB (/Users/buildslave/jenkins/workspace/lldb-cmake-sanitized/lldb-build/bin/clang-11-x86_64) :: test_run_to_address_gmodules (TestThreadAPI.ThreadAPITestCase) runCmd: settings clear -all output:

Hide Details

runCmd: settings set symbols.enable-external-lookup false output:

Hide Details

runCmd: settings set target.auto-apply-fixits false output:

Hide Details

runCmd: settings set plugin.process.gdb-remote.packet-timeout 60 output:

Hide Details

runCmd: settings set symbols.clang-modules-cache-path "/Users/buildslave/jenkins/workspace/lldb-cmake-sanitized/lldb-build/lldb-test-build.noindex/module-cache-lldb/lldb-api" output:

Hide Details

runCmd: settings set use-color false output:

Hide Details

runCmd: setting set target.prefer-dynamic-value no-dynamic-values output:

Hide Details

runCmd: settings set target.env-vars ASAN_OPTIONS=detect_stack_use_after_return=1 DYLD_INSERT_LIBRARIES=/Users/buildslave/jenkins/workspace/lldb-cmake-sanitized/host-compiler/lib/clang/11.0.0/lib/darwin/libclang_rt.asan_osx_dynamic.dylib output:

Hide Details

FAIL: LLDB (/Users/buildslave/jenkins/workspace/lldb-cmake-sanitized/lldb-build/bin/clang-11-x86_64) :: test_step_out_of_malloc_into_function_b_dsym (TestThreadAPI.ThreadAPITestCase) <bound method SBProcess.Kill of <lldb.SBProcess; proxy of <Swig Object of type 'lldb::SBProcess *' at 0x10e1e3990> >>: success

Hide Details

runCmd: settings clear -all output:

Hide Details

runCmd: settings set symbols.enable-external-lookup false output:

Hide Details

runCmd: settings set target.auto-apply-fixits false output:

Hide Details

runCmd: settings set plugin.process.gdb-remote.packet-timeout 60 output:

Hide Details

runCmd: settings set symbols.clang-modules-cache-path "/Users/buildslave/jenkins/workspace/lldb-cmake-sanitized/lldb-build/lldb-test-build.noindex/module-cache-lldb/lldb-api" output:

Hide Details

runCmd: settings set use-color false output:

Hide Details

runCmd: setting set target.prefer-dynamic-value no-dynamic-values output:

Hide Details

runCmd: settings set target.env-vars ASAN_OPTIONS=detect_stack_use_after_return=1 DYLD_INSERT_LIBRARIES=/Users/buildslave/jenkins/workspace/lldb-cmake-sanitized/host-compiler/lib/clang/11.0.0/lib/darwin/libclang_rt.asan_osx_dynamic.dylib output:

Hide Details

FAIL: LLDB (/Users/buildslave/jenkins/workspace/lldb-cmake-sanitized/lldb-build/bin/clang-11-x86_64) :: test_step_out_of_malloc_into_function_b_dwarf (TestThreadAPI.ThreadAPITestCase) <bound method SBProcess.Kill of <lldb.SBProcess; proxy of <Swig Object of type 'lldb::SBProcess *' at 0x10e67bde0> >>: success

Hide Details

UNSUPPORTED: LLDB (/Users/buildslave/jenkins/workspace/lldb-cmake-sanitized/lldb-build/bin/clang-11-x86_64) :: test_step_out_of_malloc_into_function_b_dwo (TestThreadAPI.ThreadAPITestCase) (test case does not fall in any category of interest for this run) runCmd: settings clear -all output:

Hide Details

runCmd: settings set symbols.enable-external-lookup false output:

Hide Details

runCmd: settings set target.auto-apply-fixits false output:

Hide Details

runCmd: settings set plugin.process.gdb-remote.packet-timeout 60 output:

Hide Details

runCmd: settings set symbols.clang-modules-cache-path "/Users/buildslave/jenkins/workspace/lldb-cmake-sanitized/lldb-build/lldb-test-build.noindex/module-cache-lldb/lldb-api" output:

Hide Details

runCmd: settings set use-color false output:

Hide Details

runCmd: setting set target.prefer-dynamic-value no-dynamic-values output:

Hide Details

runCmd: settings set target.env-vars ASAN_OPTIONS=detect_stack_use_after_return=1 DYLD_INSERT_LIBRARIES=/Users/buildslave/jenkins/workspace/lldb-cmake-sanitized/host-compiler/lib/clang/11.0.0/lib/darwin/libclang_rt.asan_osx_dynamic.dylib output:

Hide Details

FAIL: LLDB (/Users/buildslave/jenkins/workspace/lldb-cmake-sanitized/lldb-build/bin/clang-11-x86_64) :: test_step_out_of_malloc_into_function_b_gmodules (TestThreadAPI.ThreadAPITestCase) <bound method SBProcess.Kill of <lldb.SBProcess; proxy of <Swig Object of type 'lldb::SBProcess *' at 0x10e1e3990> >>: success

Hide Details

runCmd: settings clear -all output:

Hide Details

runCmd: settings set symbols.enable-external-lookup false output:

Hide Details

runCmd: settings set target.auto-apply-fixits false output:

Hide Details

runCmd: settings set plugin.process.gdb-remote.packet-timeout 60 output:

Hide Details

runCmd: settings set symbols.clang-modules-cache-path "/Users/buildslave/jenkins/workspace/lldb-cmake-sanitized/lldb-build/lldb-test-build.noindex/module-cache-lldb/lldb-api" output:

Hide Details

runCmd: settings set use-color false output:

Hide Details

runCmd: setting set target.prefer-dynamic-value no-dynamic-values output:

Hide Details

runCmd: settings set target.env-vars ASAN_OPTIONS=detect_stack_use_after_return=1 DYLD_INSERT_LIBRARIES=/Users/buildslave/jenkins/workspace/lldb-cmake-sanitized/host-compiler/lib/clang/11.0.0/lib/darwin/libclang_rt.asan_osx_dynamic.dylib output:

Hide Details

runCmd: breakpoint list output: Current breakpoints: 1: file = 'main2.cpp', line = 21, exact_match = 0, locations = 1 1.1: where = test_step_over_3_times_dsym`b(int) + 22 at main2.cpp:21:17, address = test_step_over_3_times_dsym[0x0000000100000e66], unresolved, hit count = 0

Hide Details

Hide Details

Hide Details

runCmd: thread backtrace output: * thread #1, queue = 'com.apple.main-thread', stop reason = breakpoint 1.1 * frame #0: 0x00000001088b2e66 test_step_over_3_times_dsym`b(val=1) at main2.cpp:21:17 frame #1: 0x00000001088b2e0d test_step_over_3_times_dsym`a(val=1) at main2.cpp:11:16 frame #2: 0x00000001088b2ee0 test_step_over_3_times_dsym`main(argc=1, argv=0x00007ffee734d468) at main2.cpp:36:14 frame #3: 0x00007fff742d5085 libdyld.dylib`start + 1 frame #4: 0x00007fff742d5085 libdyld.dylib`start + 1

Hide Details

Hide Details

runCmd: thread backtrace output: * thread #1, queue = 'com.apple.main-thread', stop reason = step over * frame #0: 0x00000001088b2e9d test_step_over_3_times_dsym`b(val=1) at main2.cpp:26:12 frame #1: 0x00000001088b2e0d test_step_over_3_times_dsym`a(val=1) at main2.cpp:11:16 frame #2: 0x00000001088b2ee0 test_step_over_3_times_dsym`main(argc=1, argv=0x00007ffee734d468) at main2.cpp:36:14 frame #3: 0x00007fff742d5085 libdyld.dylib`start + 1 frame #4: 0x00007fff742d5085 libdyld.dylib`start + 1

Hide Details

Hide Details

<bound method SBProcess.Kill of <lldb.SBProcess; proxy of <Swig Object of type 'lldb::SBProcess *' at 0x10e67bde0> >>: success

Hide Details

PASS: LLDB (/Users/buildslave/jenkins/workspace/lldb-cmake-sanitized/lldb-build/bin/clang-11-x86_64) :: test_step_over_3_times_dsym (TestThreadAPI.ThreadAPITestCase) runCmd: settings clear -all output:

Hide Details

runCmd: settings set symbols.enable-external-lookup false output:

Hide Details

runCmd: settings set target.auto-apply-fixits false output:

Hide Details

runCmd: settings set plugin.process.gdb-remote.packet-timeout 60 output:

Hide Details

runCmd: settings set symbols.clang-modules-cache-path "/Users/buildslave/jenkins/workspace/lldb-cmake-sanitized/lldb-build/lldb-test-build.noindex/module-cache-lldb/lldb-api" output:

Hide Details

runCmd: settings set use-color false output:

Hide Details

runCmd: setting set target.prefer-dynamic-value no-dynamic-values output:

Hide Details

runCmd: settings set target.env-vars ASAN_OPTIONS=detect_stack_use_after_return=1 DYLD_INSERT_LIBRARIES=/Users/buildslave/jenkins/workspace/lldb-cmake-sanitized/host-compiler/lib/clang/11.0.0/lib/darwin/libclang_rt.asan_osx_dynamic.dylib output:

Hide Details

runCmd: breakpoint list output: Current breakpoints: 1: file = 'main2.cpp', line = 21, exact_match = 0, locations = 1 1.1: where = test_step_over_3_times_dwarf`b(int) + 22 at main2.cpp:21:17, address = test_step_over_3_times_dwarf[0x0000000100000e66], unresolved, hit count = 0

Hide Details

Hide Details

Hide Details

runCmd: thread backtrace output: * thread #1, queue = 'com.apple.main-thread', stop reason = breakpoint 1.1 * frame #0: 0x0000000104de9e66 test_step_over_3_times_dwarf`b(val=1) at main2.cpp:21:17 frame #1: 0x0000000104de9e0d test_step_over_3_times_dwarf`a(val=1) at main2.cpp:11:16 frame #2: 0x0000000104de9ee0 test_step_over_3_times_dwarf`main(argc=1, argv=0x00007ffeeae16460) at main2.cpp:36:14 frame #3: 0x00007fff742d5085 libdyld.dylib`start + 1

Hide Details

Hide Details

runCmd: thread backtrace output: * thread #1, queue = 'com.apple.main-thread', stop reason = step over * frame #0: 0x0000000104de9e9d test_step_over_3_times_dwarf`b(val=1) at main2.cpp:26:12 frame #1: 0x0000000104de9e0d test_step_over_3_times_dwarf`a(val=1) at main2.cpp:11:16 frame #2: 0x0000000104de9ee0 test_step_over_3_times_dwarf`main(argc=1, argv=0x00007ffeeae16460) at main2.cpp:36:14 frame #3: 0x00007fff742d5085 libdyld.dylib`start + 1

Hide Details

Hide Details

<bound method SBProcess.Kill of <lldb.SBProcess; proxy of <Swig Object of type 'lldb::SBProcess *' at 0x10e1e3990> >>: success

Hide Details

PASS: LLDB (/Users/buildslave/jenkins/workspace/lldb-cmake-sanitized/lldb-build/bin/clang-11-x86_64) :: test_step_over_3_times_dwarf (TestThreadAPI.ThreadAPITestCase) UNSUPPORTED: LLDB (/Users/buildslave/jenkins/workspace/lldb-cmake-sanitized/lldb-build/bin/clang-11-x86_64) :: test_step_over_3_times_dwo (TestThreadAPI.ThreadAPITestCase) (test case does not fall in any category of interest for this run) runCmd: settings clear -all output:

Hide Details

runCmd: settings set symbols.enable-external-lookup false output:

Hide Details

runCmd: settings set target.auto-apply-fixits false output:

Hide Details

runCmd: settings set plugin.process.gdb-remote.packet-timeout 60 output:

Hide Details

runCmd: settings set symbols.clang-modules-cache-path "/Users/buildslave/jenkins/workspace/lldb-cmake-sanitized/lldb-build/lldb-test-build.noindex/module-cache-lldb/lldb-api" output:

Hide Details

runCmd: settings set use-color false output:

Hide Details

runCmd: setting set target.prefer-dynamic-value no-dynamic-values output:

Hide Details

runCmd: settings set target.env-vars ASAN_OPTIONS=detect_stack_use_after_return=1 DYLD_INSERT_LIBRARIES=/Users/buildslave/jenkins/workspace/lldb-cmake-sanitized/host-compiler/lib/clang/11.0.0/lib/darwin/libclang_rt.asan_osx_dynamic.dylib output:

Hide Details

runCmd: breakpoint list output: Current breakpoints: 1: file = 'main2.cpp', line = 21, exact_match = 0, locations = 1 1.1: where = test_step_over_3_times_gmodules`b(int) + 22 at main2.cpp:21:17, address = test_step_over_3_times_gmodules[0x0000000100000e66], unresolved, hit count = 0

Hide Details

Hide Details

Hide Details

runCmd: thread backtrace output: * thread #1, queue = 'com.apple.main-thread', stop reason = breakpoint 1.1 * frame #0: 0x000000010a8e7e66 test_step_over_3_times_gmodules`b(val=1) at main2.cpp:21:17 frame #1: 0x000000010a8e7e0d test_step_over_3_times_gmodules`a(val=1) at main2.cpp:11:16 frame #2: 0x000000010a8e7ee0 test_step_over_3_times_gmodules`main(argc=1, argv=0x00007ffee5318458) at main2.cpp:36:14 frame #3: 0x00007fff742d5085 libdyld.dylib`start + 1 frame #4: 0x00007fff742d5085 libdyld.dylib`start + 1

Hide Details

Hide Details

runCmd: thread backtrace output: * thread #1, queue = 'com.apple.main-thread', stop reason = step over * frame #0: 0x000000010a8e7e9d test_step_over_3_times_gmodules`b(val=1) at main2.cpp:26:12 frame #1: 0x000000010a8e7e0d test_step_over_3_times_gmodules`a(val=1) at main2.cpp:11:16 frame #2: 0x000000010a8e7ee0 test_step_over_3_times_gmodules`main(argc=1, argv=0x00007ffee5318458) at main2.cpp:36:14 frame #3: 0x00007fff742d5085 libdyld.dylib`start + 1 frame #4: 0x00007fff742d5085 libdyld.dylib`start + 1

Hide Details

Hide Details

<bound method SBProcess.Kill of <lldb.SBProcess; proxy of <Swig Object of type 'lldb::SBProcess *' at 0x10e87b2d0> >>: success

Hide Details

PASS: LLDB (/Users/buildslave/jenkins/workspace/lldb-cmake-sanitized/lldb-build/bin/clang-11-x86_64) :: test_step_over_3_times_gmodules (TestThreadAPI.ThreadAPITestCase) Restore dir to: /Users/buildslave/jenkins/workspace/lldb-cmake-sanitized/lldb-build/tools/lldb/test ====================================================================== ERROR: test_step_out_of_malloc_into_function_b_dsym (TestThreadAPI.ThreadAPITestCase) Test Python SBThread.StepOut() API to step out of a malloc call where the call site is at function b(). ---------------------------------------------------------------------- Traceback (most recent call last): File "/Users/buildslave/jenkins/workspace/lldb-cmake-sanitized/llvm-project/lldb/packages/Python/lldbsuite/test/lldbtest.py", line 1751, in test_method return attrvalue(self) File "/Users/buildslave/jenkins/workspace/lldb-cmake-sanitized/llvm-project/lldb/packages/Python/lldbsuite/test/decorators.py", line 110, in wrapper func(*args, **kwargs) File "/Users/buildslave/jenkins/workspace/lldb-cmake-sanitized/llvm-project/lldb/packages/Python/lldbsuite/test/decorators.py", line 110, in wrapper func(*args, **kwargs) File "/Users/buildslave/jenkins/workspace/lldb-cmake-sanitized/llvm-project/lldb/packages/Python/lldbsuite/test/decorators.py", line 110, in wrapper func(*args, **kwargs) File "/Users/buildslave/jenkins/workspace/lldb-cmake-sanitized/llvm-project/lldb/test/API/python_api/thread/TestThreadAPI.py", line 50, in test_step_out_of_malloc_into_function_b self.step_out_of_malloc_into_function_b(self.exe_name) File "/Users/buildslave/jenkins/workspace/lldb-cmake-sanitized/llvm-project/lldb/test/API/python_api/thread/TestThreadAPI.py", line 157, in step_out_of_malloc_into_function_b thread.IsValid(), AttributeError: 'NoneType' object has no attribute 'IsValid' Config=x86_64-/Users/buildslave/jenkins/workspace/lldb-cmake-sanitized/lldb-build/bin/clang-11 ====================================================================== ERROR: test_step_out_of_malloc_into_function_b_dwarf (TestThreadAPI.ThreadAPITestCase) Test Python SBThread.StepOut() API to step out of a malloc call where the call site is at function b(). ---------------------------------------------------------------------- Traceback (most recent call last): File "/Users/buildslave/jenkins/workspace/lldb-cmake-sanitized/llvm-project/lldb/packages/Python/lldbsuite/test/lldbtest.py", line 1751, in test_method return attrvalue(self) File "/Users/buildslave/jenkins/workspace/lldb-cmake-sanitized/llvm-project/lldb/packages/Python/lldbsuite/test/decorators.py", line 110, in wrapper func(*args, **kwargs) File "/Users/buildslave/jenkins/workspace/lldb-cmake-sanitized/llvm-project/lldb/packages/Python/lldbsuite/test/decorators.py", line 110, in wrapper func(*args, **kwargs) File "/Users/buildslave/jenkins/workspace/lldb-cmake-sanitized/llvm-project/lldb/packages/Python/lldbsuite/test/decorators.py", line 110, in wrapper func(*args, **kwargs) File "/Users/buildslave/jenkins/workspace/lldb-cmake-sanitized/llvm-project/lldb/test/API/python_api/thread/TestThreadAPI.py", line 50, in test_step_out_of_malloc_into_function_b self.step_out_of_malloc_into_function_b(self.exe_name) File "/Users/buildslave/jenkins/workspace/lldb-cmake-sanitized/llvm-project/lldb/test/API/python_api/thread/TestThreadAPI.py", line 157, in step_out_of_malloc_into_function_b thread.IsValid(), AttributeError: 'NoneType' object has no attribute 'IsValid' Config=x86_64-/Users/buildslave/jenkins/workspace/lldb-cmake-sanitized/lldb-build/bin/clang-11 ====================================================================== ERROR: test_step_out_of_malloc_into_function_b_gmodules (TestThreadAPI.ThreadAPITestCase) Test Python SBThread.StepOut() API to step out of a malloc call where the call site is at function b(). ---------------------------------------------------------------------- Traceback (most recent call last): File "/Users/buildslave/jenkins/workspace/lldb-cmake-sanitized/llvm-project/lldb/packages/Python/lldbsuite/test/lldbtest.py", line 1751, in test_method return attrvalue(self) File "/Users/buildslave/jenkins/workspace/lldb-cmake-sanitized/llvm-project/lldb/packages/Python/lldbsuite/test/decorators.py", line 110, in wrapper func(*args, **kwargs) File "/Users/buildslave/jenkins/workspace/lldb-cmake-sanitized/llvm-project/lldb/packages/Python/lldbsuite/test/decorators.py", line 110, in wrapper func(*args, **kwargs) File "/Users/buildslave/jenkins/workspace/lldb-cmake-sanitized/llvm-project/lldb/packages/Python/lldbsuite/test/decorators.py", line 110, in wrapper func(*args, **kwargs) File "/Users/buildslave/jenkins/workspace/lldb-cmake-sanitized/llvm-project/lldb/test/API/python_api/thread/TestThreadAPI.py", line 50, in test_step_out_of_malloc_into_function_b self.step_out_of_malloc_into_function_b(self.exe_name) File "/Users/buildslave/jenkins/workspace/lldb-cmake-sanitized/llvm-project/lldb/test/API/python_api/thread/TestThreadAPI.py", line 157, in step_out_of_malloc_into_function_b thread.IsValid(), AttributeError: 'NoneType' object has no attribute 'IsValid' Config=x86_64-/Users/buildslave/jenkins/workspace/lldb-cmake-sanitized/lldb-build/bin/clang-11 ---------------------------------------------------------------------- Ran 20 tests in 39.534s

Hide Details

RESULT: FAILED (12 passes, 0 failures, 3 errors, 5 skipped, 0 expected failures, 0 unexpected successes)

Hide Details

--

Hide Details

******************** PASS: lldb-api :: api/multithreaded/TestMultithreaded.py (1079 of 1977) PASS: lldb-unit :: Symbol/./SymbolTests/TestTypeSystemClang.TestBuiltinTypeForEncodingAndBitSize (1080 of 1977) PASS: lldb-api :: functionalities/data-formatter/data-formatter-globals/TestDataFormatterGlobals.py (1081 of 1977) PASS: lldb-unit :: Breakpoint/./LLDBBreakpointTests/BreakpointIDTest.StringIsBreakpointName (1082 of 1977) PASS: lldb-api :: commands/expression/fixits/TestFixIts.py (1083 of 1977) PASS: lldb-api :: lang/objc/objc-new-syntax/TestObjCNewSyntaxArray.py (1084 of 1977) PASS: lldb-shell :: Reproducer/Functionalities/TestStepping.test (1085 of 1977) PASS: lldb-unit :: Utility/./UtilityTests/DataExtractorTest.PeekData (1086 of 1977) PASS: lldb-unit :: Utility/./UtilityTests/FileSpecTest.GetPath (1087 of 1977) PASS: lldb-unit :: Utility/./UtilityTests/EventTest.DumpEventDataBytes (1088 of 1977) PASS: lldb-api :: commands/process/attach-resume/TestAttachResume.py (1089 of 1977) UNSUPPORTED: lldb-api :: functionalities/darwin_log/filter/exact_match/activity/TestDarwinLogFilterMatchActivity.py (1090 of 1977) PASS: lldb-api :: functionalities/multidebugger_commands/TestMultipleDebuggersCommands.py (1091 of 1977) PASS: lldb-unit :: Utility/./UtilityTests/ArgsTest.TestQuotedUnknownEscape (1092 of 1977) PASS: lldb-shell :: ObjectFile/PECOFF/basic-info-arm64.yaml (1093 of 1977) PASS: lldb-shell :: SymbolFile/DWARF/debug_loc_and_loclists.s (1094 of 1977) PASS: lldb-shell :: ObjectFile/PECOFF/section-types.yaml (1095 of 1977) PASS: lldb-unit :: ScriptInterpreter/Python/./ScriptInterpreterPythonTests/PythonDataObjectsTest.TestPythonStringToStructuredString (1096 of 1977) PASS: lldb-api :: functionalities/data-formatter/data-formatter-named-summaries/TestDataFormatterNamedSummaries.py (1097 of 1977) UNSUPPORTED: lldb-api :: functionalities/tsan/thread_numbers/TestTsanThreadNumbers.py (1098 of 1977) PASS: lldb-unit :: Utility/./UtilityTests/ConstStringTest.CompareStringRef (1099 of 1977) PASS: lldb-api :: python_api/sbenvironment/TestSBEnvironment.py (1100 of 1977) PASS: lldb-unit :: ScriptInterpreter/Python/./ScriptInterpreterPythonTests/PythonDataObjectsTest.TestPythonDictionaryValueEquality (1101 of 1977) PASS: lldb-api :: commands/command/invalid-args/TestInvalidArgsCommand.py (1102 of 1977) PASS: lldb-unit :: Utility/./UtilityTests/AnsiTerminal.Twice (1103 of 1977) PASS: lldb-shell :: ObjectFile/PECOFF/sections.yaml (1104 of 1977) PASS: lldb-shell :: SymbolFile/DWARF/debug_line-relative_path.s (1105 of 1977) PASS: lldb-shell :: Reproducer/TestVersionCheck.test (1106 of 1977) UNSUPPORTED: lldb-api :: functionalities/param_entry_vals/basic_entry_values_x86_64/TestBasicEntryValuesX86_64.py (1107 of 1977) PASS: lldb-api :: functionalities/data-formatter/data-formatter-proper-plurals/TestFormattersOneIsSingular.py (1108 of 1977) PASS: lldb-unit :: Process/gdb-remote/./ProcessGdbRemoteTests/GDBRemoteClientBaseTest.SendContinueDelegateInterface (1109 of 1977) PASS: lldb-unit :: Utility/./UtilityTests/StringExtractorTest.GetHexU8_Underflow2_NoEof (1110 of 1977) PASS: lldb-unit :: Utility/./UtilityTests/StringListTest.InsertStringAtIndexOutOfBounds (1111 of 1977) PASS: lldb-shell :: SymbolFile/DWARF/parallel-indexing-stress.s (1112 of 1977) PASS: lldb-api :: commands/expression/pr35310/TestExprsBug35310.py (1113 of 1977) PASS: lldb-shell :: SymbolFile/DWARF/debug-types-dwo-cross-reference.cpp (1114 of 1977) PASS: lldb-unit :: ObjectFile/Breakpad/./ObjectFileBreakpadTests/StackCFIRecord.parse (1115 of 1977) PASS: lldb-api :: functionalities/thread/step_out/TestThreadStepOut.py (1116 of 1977) PASS: lldb-unit :: Process/gdb-remote/./ProcessGdbRemoteTests/GDBRemoteCommunicationClientTest.TestPacketSpeedJSON (1117 of 1977) PASS: lldb-unit :: Utility/./UtilityTests/RangeTest.SizeTypes (1118 of 1977) PASS: lldb-api :: commands/expression/persistent_types/TestPersistentTypes.py (1119 of 1977) PASS: lldb-api :: tools/lldb-server/TestLldbGdbServer.py (1120 of 1977) UNSUPPORTED: lldb-api :: arm/breakpoint-it/TestBreakpointIt.py (1121 of 1977) PASS: lldb-unit :: debugserver/./debugserverTests/RNBSocket.AnyListen (1122 of 1977) PASS: lldb-api :: commands/expression/import-std-module/shared_ptr-dbg-info-content/TestSharedPtrDbgInfoContentFromStdModule.py (1123 of 1977) PASS: lldb-api :: functionalities/conditional_break/TestConditionalBreak.py (1124 of 1977) PASS: lldb-unit :: UnwindAssembly/x86/./UnwindAssemblyx86Tests/Testx86AssemblyInspectionEngine.TestPopR14 (1125 of 1977) PASS: lldb-api :: types/TestDoubleTypesExpr.py (1126 of 1977) PASS: lldb-unit :: Utility/./UtilityTests/SerializationRountripTest.SerializeDeserializePodReferences (1127 of 1977) PASS: lldb-api :: lang/cpp/limit-debug-info/TestWithLimitDebugInfo.py (1128 of 1977) PASS: lldb-unit :: Expression/./ExpressionTests/DiagnosticManagerTest.GetStringMultipleDiags (1129 of 1977) PASS: lldb-unit :: Expression/./ExpressionTests/ClangExpressionDeclMapTest.TestUnknownIdentifierLookup (1130 of 1977) PASS: lldb-api :: tools/lldb-server/register-reading/TestGdbRemoteGPacket.py (1131 of 1977) PASS: lldb-unit :: Utility/./UtilityTests/OptionsWithRawTest.EmptyArgsOnlySuffix (1132 of 1977) PASS: lldb-unit :: Utility/./UtilityTests/Flags.AnySet (1133 of 1977) PASS: lldb-api :: python_api/process/TestProcessAPI.py (1134 of 1977) PASS: lldb-api :: lang/objc/objc-struct-return/TestObjCStructReturn.py (1135 of 1977) PASS: lldb-api :: macosx/lc-note/kern-ver-str/TestKernVerStrLCNOTE.py (1136 of 1977) PASS: lldb-shell :: Reproducer/TestFileRepro.test (1137 of 1977) PASS: lldb-api :: functionalities/data-formatter/data-formatter-objc/TestDataFormatterObjCPlain.py (1138 of 1977) PASS: lldb-unit :: Utility/./UtilityTests/ScalarTest.GetBytes (1139 of 1977) PASS: lldb-unit :: Utility/./UtilityTests/BinaryStreamTest.PutULEB128OneByte (1140 of 1977) PASS: lldb-unit :: Symbol/./SymbolTests/SymbolsTest.LocateExecutableSymbolFileForUnknownExecutableAndMissingSymbolFile (1141 of 1977) PASS: lldb-api :: functionalities/data-formatter/data-formatter-stl/libcxx/multiset/TestDataFormatterLibcxxMultiSet.py (1142 of 1977) PASS: lldb-api :: lang/cpp/auto/TestCPPAuto.py (1143 of 1977) UNSUPPORTED: lldb-api :: functionalities/thread/break_after_join/TestBreakAfterJoin.py (1144 of 1977) PASS: lldb-shell :: ObjectFile/ELF/PT_LOAD-overlap.yaml (1145 of 1977) PASS: lldb-unit :: UnwindAssembly/x86/./UnwindAssemblyx86Tests/Testx86AssemblyInspectionEngine.TestPushEBP (1146 of 1977) UNSUPPORTED: lldb-api :: linux/add-symbols/TestTargetSymbolsAddCommand.py (1147 of 1977) PASS: lldb-shell :: ObjectFile/MachO/lc_build_version_notools.yaml (1148 of 1977) PASS: lldb-api :: commands/log/basic/TestLogging.py (1149 of 1977) PASS: lldb-unit :: DataFormatter/./LLDBFormatterTests/FormatManagerTests.CompatibleLangs (1150 of 1977) PASS: lldb-api :: lang/cpp/enum_types/TestCPP11EnumTypes.py (1151 of 1977) PASS: lldb-unit :: Expression/./ExpressionTests/CppModuleConfigurationTest.MissingUsrInclude (1152 of 1977) UNSUPPORTED: lldb-api :: commands/expression/multiline-navigation/TestMultilineNavigation.py (1153 of 1977) PASS: lldb-api :: functionalities/thread/concurrent_events/TestConcurrentManyCrash.py (1154 of 1977) PASS: lldb-unit :: Utility/./UtilityTests/Predicate.WaitForValueEqualTo (1155 of 1977) PASS: lldb-unit :: ScriptInterpreter/Python/./ScriptInterpreterPythonTests/PythonDataObjectsTest.TestPythonBytes (1156 of 1977) PASS: lldb-unit :: Utility/./UtilityTests/TimerTest.CategoryTimes (1157 of 1977) PASS: lldb-unit :: Utility/./UtilityTests/ArgsTest.TestInsertArg (1158 of 1977) PASS: lldb-api :: functionalities/data-formatter/data-formatter-stl/libstdcpp/unique_ptr/invalid/TestDataFormatterInvalidStdUniquePtr.py (1159 of 1977) PASS: lldb-api :: commands/target/create-deps/TestTargetCreateDeps.py (1160 of 1977) PASS: lldb-shell :: ObjectFile/ELF/minidebuginfo-corrupt-xz.yaml (1161 of 1977) PASS: lldb-shell :: SymbolFile/NativePDB/globals-bss.cpp (1162 of 1977) PASS: lldb-shell :: SymbolFile/DWARF/dir-separator-posix.s (1163 of 1977) PASS: lldb-unit :: Utility/./UtilityTests/UriParserTest.MinimalPortPath (1164 of 1977) PASS: lldb-api :: functionalities/target_var/TestTargetVar.py (1165 of 1977) PASS: lldb-api :: python_api/type/TestTypeList.py (1166 of 1977) PASS: lldb-unit :: Utility/./UtilityTests/StreamTeeTest.GetStreamAtIndexOutOfBounds (1167 of 1977) PASS: lldb-shell :: SymbolFile/DWARF/win-i386-line-table.s (1168 of 1977) PASS: lldb-shell :: Expr/TestTypeOfDeclTypeExpr.test (1169 of 1977) PASS: lldb-api :: commands/expression/no-deadlock/TestExprDoesntBlock.py (1170 of 1977) PASS: lldb-unit :: Utility/./UtilityTests/StreamTest.ShiftOperatorChars (1171 of 1977) PASS: lldb-unit :: Utility/./UtilityTests/UriParserTest.BracketedHostnameWithPortIPv4 (1172 of 1977) PASS: lldb-shell :: ObjectFile/wasm/unified-debug-sections.yaml (1173 of 1977) PASS: lldb-api :: commands/command/source/TestCommandSource.py (1174 of 1977) PASS: lldb-api :: commands/frame/select/TestFrameSelect.py (1175 of 1977) PASS: lldb-shell :: SymbolFile/DWARF/split-dwarf-multiple-cu.ll (1176 of 1977) PASS: lldb-unit :: Language/Highlighting/./HighlighterTests/HighlighterTest.DefaultHighlighter (1177 of 1977) PASS: lldb-shell :: Reproducer/TestDiscard.test (1178 of 1977) PASS: lldb-unit :: Utility/./UtilityTests/StreamTest.PutHex64ByteOrderBig (1179 of 1977) PASS: lldb-api :: tools/lldb-vscode/attach/TestVSCode_attach.py (1180 of 1977) PASS: lldb-shell :: SymbolFile/DWARF/find-variable-file.cpp (1181 of 1977) PASS: lldb-api :: lang/objc/rdar-11355592/TestRdar11355592.py (1182 of 1977) PASS: lldb-unit :: Utility/./UtilityTests/StringExtractorTest.GetNameColonValueContainsColon (1183 of 1977) PASS: lldb-unit :: SymbolFile/DWARF/./SymbolFileDWARFTests/SymbolFileDWARFTests.TestAbbrevNullAttrValidForm (1184 of 1977) PASS: lldb-unit :: Core/./LLDBCoreTests/RichManglingContextTest.IPDRealloc (1185 of 1977) PASS: lldb-api :: types/TestDoubleTypes.py (1186 of 1977) UNSUPPORTED: lldb-shell :: SymbolFile/PDB/compilands.test (1187 of 1977) PASS: lldb-unit :: UnwindAssembly/x86/./UnwindAssemblyx86Tests/Testx86AssemblyInspectionEngine.TestAddRSP (1188 of 1977) PASS: lldb-api :: commands/expression/call-function/TestCallStopAndContinue.py (1189 of 1977) PASS: lldb-api :: commands/expression/invalid-args/TestInvalidArgsExpression.py (1190 of 1977) PASS: lldb-api :: lang/cpp/const_this/TestConstThis.py (1191 of 1977) PASS: lldb-unit :: Utility/./UtilityTests/BinaryStreamTest.PutULEB128SixBytes (1192 of 1977) PASS: lldb-unit :: Utility/./UtilityTests/StringExtractorTest.DecodeHexU8_Exact (1193 of 1977) PASS: lldb-api :: tools/lldb-vscode/stackTrace/TestVSCode_stackTrace.py (1194 of 1977) PASS: lldb-api :: functionalities/breakpoint/breakpoint_locations/TestBreakpointLocations.py (1195 of 1977) PASS: lldb-api :: functionalities/abbreviation/TestCommonShortSpellings.py (1196 of 1977) PASS: lldb-unit :: Symbol/./SymbolTests/TestTypeSystemClang.TestGetBasicTypeFromName (1197 of 1977) PASS: lldb-api :: commands/expression/po_verbosity/TestPoVerbosity.py (1198 of 1977) PASS: lldb-shell :: SymbolFile/Breakpad/symtab.test (1199 of 1977) PASS: lldb-unit :: Utility/./UtilityTests/OptionsWithRawTest.EmptySuffix (1200 of 1977) PASS: lldb-unit :: Utility/./UtilityTests/RegularExpression.CopyAssignment (1201 of 1977) PASS: lldb-api :: lang/objc/orderedset/TestOrderedSet.py (1202 of 1977) UNSUPPORTED: lldb-api :: commands/watchpoints/hello_watchlocation/TestWatchLocation.py (1203 of 1977) PASS: lldb-unit :: Utility/./UtilityTests/StringExtractorTest.GetHexBytesAvail_Partial (1204 of 1977) PASS: lldb-api :: functionalities/thread/concurrent_events/TestConcurrentSignalDelayBreak.py (1205 of 1977) PASS: lldb-api :: lang/cpp/nested-class-other-compilation-unit/TestNestedClassWithParentInAnotherCU.py (1206 of 1977) PASS: lldb-unit :: Utility/./UtilityTests/LogChannelEnabledTest.LogThread (1207 of 1977) PASS: lldb-unit :: Process/gdb-remote/./ProcessGdbRemoteTests/GDBRemoteCommunicationClientTest.WriteRegisterNoSuffix (1208 of 1977) PASS: lldb-shell :: SymbolFile/NativePDB/globals-fundamental.cpp (1209 of 1977) PASS: lldb-unit :: Utility/./UtilityTests/ConstStringTest.MangledCounterpart (1210 of 1977) PASS: lldb-unit :: UnwindAssembly/x86/./UnwindAssemblyx86Tests/Testx86AssemblyInspectionEngine.TestSpArithx86_64Augmented (1211 of 1977) PASS: lldb-unit :: UnwindAssembly/x86/./UnwindAssemblyx86Tests/Testx86AssemblyInspectionEngine.TestSpillRegToStackViaMOVi386 (1212 of 1977) PASS: lldb-unit :: ScriptInterpreter/Python/./ScriptInterpreterPythonTests/PythonDataObjectsTest.TestObjectAttributes (1213 of 1977) PASS: lldb-api :: lang/cpp/char8_t/TestCxxChar8_t.py (1214 of 1977) PASS: lldb-shell :: ObjectFile/ELF/many-sections.s (1215 of 1977) PASS: lldb-unit :: Utility/./UtilityTests/FileSpecTest.FileAndDirectoryComponents (1216 of 1977) PASS: lldb-unit :: Utility/./UtilityTests/StringLexerTest.HasAtLeast (1217 of 1977) UNSUPPORTED: lldb-api :: functionalities/thread/concurrent_events/TestConcurrentManySignals.py (1218 of 1977) PASS: lldb-unit :: UnwindAssembly/x86/./UnwindAssemblyx86Tests/Testx86AssemblyInspectionEngine.TestSubESP (1219 of 1977) PASS: lldb-unit :: ScriptInterpreter/Python/./ScriptInterpreterPythonTests/PythonDataObjectsTest.TestPythonIntegerToStructuredInteger (1220 of 1977) PASS: lldb-shell :: ObjectFile/Breakpad/discontiguous-sections.test (1221 of 1977) PASS: lldb-unit :: Interpreter/./InterpreterTests/OptionArgParserTest.toChar (1222 of 1977) PASS: lldb-unit :: Expression/./ExpressionTests/DWARFExpression.DW_OP_piece (1223 of 1977) PASS: lldb-api :: commands/statistics/basic/TestStats.py (1224 of 1977) PASS: lldb-unit :: Utility/./UtilityTests/StringExtractorTest.GetHexU8_Underflow (1225 of 1977) PASS: lldb-unit :: Utility/./UtilityTests/StringListTest.LongestCommonPrefixDuplicateElement (1226 of 1977) PASS: lldb-api :: tools/lldb-server/inferior-crash/TestGdbRemoteAbort.py (1227 of 1977) PASS: lldb-shell :: Minidump/disassemble-no-module.yaml (1228 of 1977) PASS: lldb-unit :: UnwindAssembly/x86/./UnwindAssemblyx86Tests/Testx86AssemblyInspectionEngine.TestSimple64bitFrameFunction (1229 of 1977) PASS: lldb-unit :: Process/minidump/./LLDBMinidumpTests/MinidumpParserTest.GetMemoryRegionInfoFromMemoryList (1230 of 1977) PASS: lldb-unit :: debugserver/./debugserverTests/RNBSocket.LoopBackConnectIPv6 (1231 of 1977) PASS: lldb-api :: lang/cpp/std-function-step-into-callable/TestStdFunctionStepIntoCallable.py (1232 of 1977) PASS: lldb-shell :: ObjectFile/PECOFF/symbol.yaml (1233 of 1977) PASS: lldb-unit :: Utility/./UtilityTests/DataExtractorTest.UncommonAddressSize (1234 of 1977) PASS: lldb-api :: functionalities/gdb_remote_client/TestRestartBug.py (1235 of 1977) PASS: lldb-unit :: Utility/./UtilityTests/ScalarTest.Scalar_512 (1236 of 1977) PASS: lldb-unit :: Utility/./UtilityTests/StringExtractorTest.GetNameColonValueSuccess (1237 of 1977) PASS: lldb-unit :: Host/./HostTests/NativeProcessProtocolTest.ReadCStringFromMemory_CrossPageBoundary (1238 of 1977) PASS: lldb-unit :: Utility/./UtilityTests/BinaryStreamTest.PutSLEB128TwoBytes (1239 of 1977) UNSUPPORTED: lldb-api :: commands/gui/basic/TestGuiBasic.py (1240 of 1977) PASS: lldb-unit :: Target/./TargetTests/ModuleCacheTest.GetAndPutUuidExists (1241 of 1977) PASS: lldb-shell :: SymbolFile/DWARF/debug-types-signature-loop.s (1242 of 1977) PASS: lldb-unit :: Process/minidump/./LLDBMinidumpTests/MinidumpParserTest.MinidumpDuplicateModuleMinAddress (1243 of 1977) PASS: lldb-api :: functionalities/data-formatter/data-formatter-objc/TestDataFormatterObjNSException.py (1244 of 1977) PASS: lldb-unit :: Utility/./UtilityTests/FileSpecTest.EqualDotsPosixRoot (1245 of 1977) PASS: lldb-shell :: Register/x86-64-gp-read.test (1246 of 1977) PASS: lldb-api :: functionalities/gdb_remote_client/TestRegDefinitionInParts.py (1247 of 1977) PASS: lldb-api :: lang/objc/objc++/TestObjCXX.py (1248 of 1977) PASS: lldb-unit :: ScriptInterpreter/Python/./ScriptInterpreterPythonTests/PythonDataObjectsTest.TestDictionaryResolutionWithDot (1249 of 1977) PASS: lldb-api :: python_api/exprpath_synthetic/TestExprPathSynthetic.py (1250 of 1977) PASS: lldb-api :: commands/expression/import-std-module/vector/TestVectorFromStdModule.py (1251 of 1977) PASS: lldb-unit :: Process/gdb-remote/./ProcessGdbRemoteTests/GDBRemoteCommunicationServerTest.SendErrorResponse_ErrorList (1252 of 1977) PASS: lldb-unit :: Utility/./UtilityTests/AnsiTerminal.AtStart (1253 of 1977) PASS: lldb-unit :: SymbolFile/NativePDB/./SymbolFileNativePDBTests/PDBFPOProgramToDWARFExpressionTests.UnresolvedRegisterReference (1254 of 1977) UNSUPPORTED: lldb-api :: functionalities/tsan/multiple/TestTsanMultiple.py (1255 of 1977) PASS: lldb-api :: functionalities/breakpoint/require_hw_breakpoints/TestRequireHWBreakpoints.py (1256 of 1977) PASS: lldb-api :: functionalities/data-formatter/data-formatter-stl/libcxx/list/loop/TestDataFormatterLibcxxListLoop.py (1257 of 1977) PASS: lldb-api :: functionalities/unwind/zeroth_frame/TestZerothFrame.py (1258 of 1977) PASS: lldb-api :: commands/expression/call-function/TestCallBuiltinFunction.py (1259 of 1977) PASS: lldb-unit :: Utility/./UtilityTests/StreamTest.PutPtr (1260 of 1977) PASS: lldb-api :: commands/target/stop-hooks/TestStopHooks.py (1261 of 1977) PASS: lldb-shell :: Breakpoint/split-dwarf5-debug-stroffsets.test (1262 of 1977) PASS: lldb-unit :: Host/./HostTests/MainLoopTest.ReadObject (1263 of 1977) PASS: lldb-unit :: UnwindAssembly/x86/./UnwindAssemblyx86Tests/Testx86AssemblyInspectionEngine.TestPopEBX (1264 of 1977) PASS: lldb-unit :: Utility/./UtilityTests/BinaryStreamTest.PutSLEB128SixBytes (1265 of 1977) UNSUPPORTED: lldb-api :: api/multiple-debuggers/TestMultipleDebuggers.py (1266 of 1977) UNSUPPORTED: lldb-api :: lang/cpp/printf/TestPrintf.py (1267 of 1977) PASS: lldb-unit :: Utility/./UtilityTests/CompletionRequest.TryCompleteCurrentArgBad (1268 of 1977) PASS: lldb-unit :: Utility/./UtilityTests/ArgsTest.TestQuotedTrailingBackslash (1269 of 1977) PASS: lldb-api :: commands/watchpoints/watchpoint_disable/TestWatchpointDisable.py (1270 of 1977) PASS: lldb-unit :: Utility/./UtilityTests/TimerTest.CategoryTimesStats (1271 of 1977) PASS: lldb-api :: lang/objc/modules/TestObjCModules.py (1272 of 1977) PASS: lldb-unit :: Interpreter/./InterpreterTests/OptionArgParserTest.toBoolean (1273 of 1977) PASS: lldb-unit :: Utility/./UtilityTests/OptionsWithRawTest.SingleWhitespaceInput (1274 of 1977) PASS: lldb-api :: functionalities/thread/concurrent_events/TestConcurrentWatchBreakDelay.py (1275 of 1977) PASS: lldb-api :: lang/cpp/breakpoint_in_member_func_w_non_primitive_params/TestBreakpointInMemberFuncWNonPrimitiveParams.py (1276 of 1977) PASS: lldb-unit :: Utility/./UtilityTests/StringListTest.AppendStringCString (1277 of 1977) PASS: lldb-unit :: Utility/./UtilityTests/VMRange.Comparison (1278 of 1977) PASS: lldb-unit :: Symbol/./SymbolTests/PostfixExpression.ParseOneExpression (1279 of 1977) PASS: lldb-api :: commands/expression/import-std-module/unique_ptr-dbg-info-content/TestUniquePtrDbgInfoContent.py (1280 of 1977) UNSUPPORTED: lldb-shell :: ScriptInterpreter/Lua/independent_state.test (1281 of 1977) UNSUPPORTED: lldb-api :: functionalities/darwin_log/filter/exact_match/message/TestDarwinLogFilterMatchMessage.py (1282 of 1977) PASS: lldb-unit :: Symbol/./SymbolTests/SymbolsTest.TerminateLocateExecutableSymbolFileForUnknownExecutableAndUnknownSymbolFile (1283 of 1977) PASS: lldb-api :: lang/cpp/extern_c/TestExternCSymbols.py (1284 of 1977) PASS: lldb-shell :: ScriptInterpreter/Python/crashlog.test (1285 of 1977) PASS: lldb-unit :: Symbol/./SymbolTests/LineEntryTest.GetSameLineContiguousAddressRangeNestedInline (1286 of 1977) PASS: lldb-api :: api/command-return-object/TestSBCommandReturnObject.py (1287 of 1977) PASS: lldb-shell :: Breakpoint/debug_rnglist_basic.test (1288 of 1977) PASS: lldb-shell :: Driver/TestFile.test (1289 of 1977) PASS: lldb-api :: commands/frame/var-scope/TestFrameVariableScope.py (1290 of 1977) PASS: lldb-unit :: Utility/./UtilityTests/ArgsTest.TestSingleQuotedArgWithSpace (1291 of 1977) PASS: lldb-api :: functionalities/thread/concurrent_events/TestConcurrentWatchBreak.py (1292 of 1977) PASS: lldb-unit :: Symbol/./SymbolTests/LineEntryTest.GetSameLineContiguousAddressRangeNoInlines (1293 of 1977) UNSUPPORTED: lldb-api :: functionalities/darwin_log/filter/exact_match/activity-chain/TestDarwinLogFilterMatchActivityChain.py (1294 of 1977) PASS: lldb-unit :: Signals/./SignalsTests/UnixSignalsTest.VersionChange (1295 of 1977) PASS: lldb-unit :: UnwindAssembly/x86/./UnwindAssemblyx86Tests/Testx86AssemblyInspectionEngine.TestPopR12 (1296 of 1977) PASS: lldb-api :: commands/expression/import-std-module/vector-of-vectors/TestVectorOfVectorsFromStdModule.py (1297 of 1977) PASS: lldb-unit :: Utility/./UtilityTests/StreamTest.PutCStringWithStringRef (1298 of 1977) UNSUPPORTED: lldb-api :: functionalities/process_save_core/TestProcessSaveCore.py (1299 of 1977) PASS: lldb-unit :: Utility/./UtilityTests/FileSpecTest.Yaml (1300 of 1977) PASS: lldb-shell :: SymbolFile/DWARF/find-basic-namespace.cpp (1301 of 1977) PASS: lldb-api :: functionalities/data-formatter/data-formatter-stl/libcxx/forward_list/TestDataFormatterLibcxxForwardList.py (1302 of 1977) PASS: lldb-shell :: Quit/TestQuitExitCodeImplicit0.test (1303 of 1977) PASS: lldb-unit :: Utility/./UtilityTests/LogChannelTest.EnableOptions (1304 of 1977) PASS: lldb-unit :: debugserver/./debugserverTests/RNBSocket.LoopBackListenIPv4 (1305 of 1977) PASS: lldb-api :: functionalities/avoids-fd-leak/TestFdLeak.py (1306 of 1977) PASS: lldb-api :: lang/objc/radar-9691614/TestObjCMethodReturningBOOL.py (1307 of 1977) PASS: lldb-api :: functionalities/thread/num_threads/TestNumThreads.py (1308 of 1977) PASS: lldb-shell :: Reproducer/TestCaptureEnvOverride.test (1309 of 1977) PASS: lldb-shell :: Driver/TestCommands.test (1310 of 1977) PASS: lldb-api :: python_api/breakpoint/TestBreakpointAPI.py (1311 of 1977) PASS: lldb-unit :: Utility/./UtilityTests/StringExtractorTest.GetHexBytesAvail_OddPair (1312 of 1977) PASS: lldb-api :: functionalities/breakpoint/objc/TestObjCBreakpoints.py (1313 of 1977) PASS: lldb-unit :: Utility/./UtilityTests/AnsiTerminal.Unknown (1314 of 1977) PASS: lldb-shell :: SymbolFile/DWARF/apple-index-is-used.cpp (1315 of 1977) PASS: lldb-api :: functionalities/gdb_remote_client/TestqOffsets.py (1316 of 1977) PASS: lldb-api :: lang/cpp/template/TestTemplateArgs.py (1317 of 1977) PASS: lldb-api :: commands/expression/ir-interpreter/TestIRInterpreter.py (1318 of 1977) PASS: lldb-api :: commands/command/script/import/rdar-12586188/TestRdar12586188.py (1319 of 1977) PASS: lldb-shell :: SymbolFile/DWARF/deterministic-build.cpp (1320 of 1977) PASS: lldb-unit :: Utility/./UtilityTests/StreamTest.PutULEB128 (1321 of 1977) PASS: lldb-unit :: Target/./TargetTests/PathMappingListTest.RelativeTests (1322 of 1977) PASS: lldb-unit :: Process/gdb-remote/./ProcessGdbRemoteTests/GDBRemoteClientBaseTest.SendContinueAndAsyncPacket (1323 of 1977) PASS: lldb-shell :: SymbolFile/DWARF/dwarf5-partial-index.cpp (1324 of 1977) PASS: lldb-unit :: Language/CPlusPlus/./LanguageCPlusPlusTests/CPlusPlusLanguage.ExtractContextAndIdentifier (1325 of 1977) PASS: lldb-api :: functionalities/testid/TestTestId.py (1326 of 1977) PASS: lldb-api :: functionalities/thread/step_until/TestStepUntil.py (1327 of 1977) PASS: lldb-shell :: ObjectFile/wasm/stripped-debug-sections.yaml (1328 of 1977) PASS: lldb-shell :: Expr/TestMultilineExpr.test (1329 of 1977) PASS: lldb-shell :: SymbolFile/DWARF/debug-types-missing-signature.test (1330 of 1977) PASS: lldb-unit :: Core/./LLDBCoreTests/StreamCallbackTest.Callback (1331 of 1977) PASS: lldb-unit :: Utility/./UtilityTests/StringListTest.AppendList (1332 of 1977) PASS: lldb-api :: commands/expression/char/TestExprsChar.py (1333 of 1977) PASS: lldb-api :: lang/objc/objc-new-syntax/TestObjCNewSyntaxDictionary.py (1334 of 1977) PASS: lldb-unit :: Utility/./UtilityTests/FileSpecTest.IsRelative (1335 of 1977) PASS: lldb-api :: functionalities/data-formatter/compactvectors/TestCompactVectors.py (1336 of 1977) PASS: lldb-api :: commands/platform/basic/TestPlatformPython.py (1337 of 1977) PASS: lldb-shell :: ObjectFile/ELF/base-address.yaml (1338 of 1977) PASS: lldb-api :: functionalities/tail_call_frames/ambiguous_tail_call_seq2/TestAmbiguousTailCallSeq2.py (1339 of 1977) XFAIL: lldb-shell :: Register/x86-64-ymm-write.test (1340 of 1977) PASS: lldb-unit :: Utility/./UtilityTests/StringListTest.ForRangeEmpty (1341 of 1977) PASS: lldb-api :: lang/objc/blocks/TestObjCIvarsInBlocks.py (1342 of 1977) PASS: lldb-api :: commands/process/attach/attach_denied/TestAttachDenied.py (1343 of 1977) PASS: lldb-api :: functionalities/data-formatter/data-formatter-objc/nsindexpath/TestDataFormatterNSIndexPath.py (1344 of 1977) PASS: lldb-unit :: Utility/./UtilityTests/ScalarTest.RightShiftOperator (1345 of 1977) PASS: lldb-api :: commands/expression/vector_of_enums/TestVectorOfEnums.py (1346 of 1977) PASS: lldb-unit :: Utility/./UtilityTests/OptionsWithRawTest.LeadingSpaceArgs (1347 of 1977) PASS: lldb-api :: commands/expression/import-std-module/forward_list/TestForwardListFromStdModule.py (1348 of 1977) PASS: lldb-shell :: Reproducer/TestGDBRemoteRepro.test (1349 of 1977) PASS: lldb-shell :: SymbolFile/Breakpad/unwind-via-stack-win-no-memory-info.yaml (1350 of 1977) FAIL: lldb-api :: functionalities/ptr_refs/TestPtrRefs.py (1351 of 1977) ******************** TEST 'lldb-api :: functionalities/ptr_refs/TestPtrRefs.py' FAILED ******************** Script: -- /usr/local/bin/python /Users/buildslave/jenkins/workspace/lldb-cmake-sanitized/llvm-project/lldb/test/API/dotest.py --arch x86_64 -s /Users/buildslave/jenkins/workspace/lldb-cmake-sanitized/lldb-build/lldb-test-traces -S nm -u CXXFLAGS -u CFLAGS --codesign-identity lldb_codesign --server /Users/buildslave/jenkins/workspace/lldb-cmake-sanitized/lldb-build/./bin/debugserver --arch x86_64 --build-dir /Users/buildslave/jenkins/workspace/lldb-cmake-sanitized/lldb-build/lldb-test-build.noindex -s=/Users/buildslave/jenkins/workspace/lldb-cmake-sanitized/test/logs -t --env TERM=vt100 --env LLVM_LIBS_DIR=/Users/buildslave/jenkins/workspace/lldb-cmake-sanitized/lldb-build/./lib --inferior-env ASAN_OPTIONS=detect_stack_use_after_return=1 --inferior-env DYLD_INSERT_LIBRARIES=/Users/buildslave/jenkins/workspace/lldb-cmake-sanitized/host-compiler/lib/clang/11.0.0/lib/darwin/libclang_rt.asan_osx_dynamic.dylib --build-dir /Users/buildslave/jenkins/workspace/lldb-cmake-sanitized/lldb-build/lldb-test-build.noindex --lldb-module-cache-dir /Users/buildslave/jenkins/workspace/lldb-cmake-sanitized/lldb-build/lldb-test-build.noindex/module-cache-lldb/lldb-api --clang-module-cache-dir /Users/buildslave/jenkins/workspace/lldb-cmake-sanitized/lldb-build/lldb-test-build.noindex/module-cache-clang/lldb-api --executable /Users/buildslave/jenkins/workspace/lldb-cmake-sanitized/lldb-build/./bin/lldb --compiler /Users/buildslave/jenkins/workspace/lldb-cmake-sanitized/lldb-build/./bin/clang --dsymutil /Users/buildslave/jenkins/workspace/lldb-cmake-sanitized/lldb-build/./bin/dsymutil --filecheck /Users/buildslave/jenkins/workspace/lldb-cmake-sanitized/lldb-build/./bin/FileCheck --lldb-libs-dir /Users/buildslave/jenkins/workspace/lldb-cmake-sanitized/lldb-build/./lib /Users/buildslave/jenkins/workspace/lldb-cmake-sanitized/llvm-project/lldb/test/API/functionalities/ptr_refs -p TestPtrRefs.py -- Exit Code: 1

Hide Details

Command Output (stdout): -- lldb version 11.0.99 clang revision 12f6b024f9f58cee72770849a8c86a1436046ff7 llvm revision 12f6b024f9f58cee72770849a8c86a1436046ff7 "crashlog" and "save_crashlog" command installed, use the "--help" option for detailed help "malloc_info", "ptr_refs", "cstr_refs", "find_variable", and "objc_refs" commands have been installed, use the "--help" options on these commands for detailed help. LLDB library dir: /Users/buildslave/jenkins/workspace/lldb-cmake-sanitized/lldb-build/bin LLDB import library dir: /Users/buildslave/jenkins/workspace/lldb-cmake-sanitized/lldb-build/./lib libstdcxx tests will not be run because: Don't know how to build with libstdcxx on macosx Skipping following debug info categories: ['dwo'] 0x00007ffee50b9478: stack in frame #0 of thread #1: tid 0x13b1b19 in variable at 0x7ffee50b9478: (const char *) my_ptr = 0x00006020000000b0 "hello" 0x00007ffee50b9410: stack (red zone)

Hide Details

-- Command Output (stderr): -- error: 'ptr_refs' is not a valid command. error: 'ptr_refs' is not a valid command.

Hide Details

Session logs for test failures/errors/unexpected successes will go into directory '/Users/buildslave/jenkins/workspace/lldb-cmake-sanitized/test/logs' Command invoked: /Users/buildslave/jenkins/workspace/lldb-cmake-sanitized/llvm-project/lldb/test/API/dotest.py --arch x86_64 -s /Users/buildslave/jenkins/workspace/lldb-cmake-sanitized/lldb-build/lldb-test-traces -S nm -u CXXFLAGS -u CFLAGS --codesign-identity lldb_codesign --server /Users/buildslave/jenkins/workspace/lldb-cmake-sanitized/lldb-build/./bin/debugserver --arch x86_64 --build-dir /Users/buildslave/jenkins/workspace/lldb-cmake-sanitized/lldb-build/lldb-test-build.noindex -s=/Users/buildslave/jenkins/workspace/lldb-cmake-sanitized/test/logs -t --env TERM=vt100 --env LLVM_LIBS_DIR=/Users/buildslave/jenkins/workspace/lldb-cmake-sanitized/lldb-build/./lib --inferior-env ASAN_OPTIONS=detect_stack_use_after_return=1 --inferior-env DYLD_INSERT_LIBRARIES=/Users/buildslave/jenkins/workspace/lldb-cmake-sanitized/host-compiler/lib/clang/11.0.0/lib/darwin/libclang_rt.asan_osx_dynamic.dylib --build-dir /Users/buildslave/jenkins/workspace/lldb-cmake-sanitized/lldb-build/lldb-test-build.noindex --lldb-module-cache-dir /Users/buildslave/jenkins/workspace/lldb-cmake-sanitized/lldb-build/lldb-test-build.noindex/module-cache-lldb/lldb-api --clang-module-cache-dir /Users/buildslave/jenkins/workspace/lldb-cmake-sanitized/lldb-build/lldb-test-build.noindex/module-cache-clang/lldb-api --executable /Users/buildslave/jenkins/workspace/lldb-cmake-sanitized/lldb-build/./bin/lldb --compiler /Users/buildslave/jenkins/workspace/lldb-cmake-sanitized/lldb-build/./bin/clang --dsymutil /Users/buildslave/jenkins/workspace/lldb-cmake-sanitized/lldb-build/./bin/dsymutil --filecheck /Users/buildslave/jenkins/workspace/lldb-cmake-sanitized/lldb-build/./bin/FileCheck --lldb-libs-dir /Users/buildslave/jenkins/workspace/lldb-cmake-sanitized/lldb-build/./lib /Users/buildslave/jenkins/workspace/lldb-cmake-sanitized/llvm-project/lldb/test/API/functionalities/ptr_refs -p TestPtrRefs.py Change dir to: /Users/buildslave/jenkins/workspace/lldb-cmake-sanitized/llvm-project/lldb/test/API/functionalities/ptr_refs runCmd: settings clear -all output:

Hide Details

runCmd: settings set symbols.enable-external-lookup false output:

Hide Details

runCmd: settings set target.auto-apply-fixits false output:

Hide Details

runCmd: settings set plugin.process.gdb-remote.packet-timeout 60 output:

Hide Details

runCmd: settings set symbols.clang-modules-cache-path "/Users/buildslave/jenkins/workspace/lldb-cmake-sanitized/lldb-build/lldb-test-build.noindex/module-cache-lldb/lldb-api" output:

Hide Details

runCmd: settings set use-color false output:

Hide Details

runCmd: setting set target.prefer-dynamic-value no-dynamic-values output:

Hide Details

runCmd: settings set target.env-vars ASAN_OPTIONS=detect_stack_use_after_return=1 DYLD_INSERT_LIBRARIES=/Users/buildslave/jenkins/workspace/lldb-cmake-sanitized/host-compiler/lib/clang/11.0.0/lib/darwin/libclang_rt.asan_osx_dynamic.dylib output:

Hide Details

runCmd: script import lldb.macosx.heap output: "crashlog" and "save_crashlog" command installed, use the "--help" option for detailed help "malloc_info", "ptr_refs", "cstr_refs", "find_variable", and "objc_refs" commands have been installed, use the "--help" options on these commands for detailed help.

Hide Details

Hide Details

runCmd: ptr_refs my_ptr output: 0x00007ffee50b9478: stack in frame #0 of thread #1: tid 0x13b1b19 in variable at 0x7ffee50b9478: (const char *) my_ptr = 0x00006020000000b0 "hello" 0x00007ffee50b9410: stack (red zone)

Hide Details

Hide Details

Expecting sub string: malloc Not matched

Hide Details

FAIL: LLDB (/Users/buildslave/jenkins/workspace/lldb-cmake-sanitized/lldb-build/bin/clang-11-x86_64) :: test_ptr_refs_dsym (TestPtrRefs.TestPtrRefs) <bound method SBProcess.Kill of <lldb.SBProcess; proxy of <Swig Object of type 'lldb::SBProcess *' at 0x12150e8a0> >>: success

Hide Details

runCmd: settings clear -all output:

Hide Details

runCmd: settings set symbols.enable-external-lookup false output:

Hide Details

runCmd: settings set target.auto-apply-fixits false output:

Hide Details

runCmd: settings set plugin.process.gdb-remote.packet-timeout 60 output:

Hide Details

runCmd: settings set symbols.clang-modules-cache-path "/Users/buildslave/jenkins/workspace/lldb-cmake-sanitized/lldb-build/lldb-test-build.noindex/module-cache-lldb/lldb-api" output:

Hide Details

runCmd: settings set use-color false output:

Hide Details

runCmd: setting set target.prefer-dynamic-value no-dynamic-values output:

Hide Details

runCmd: settings set target.env-vars ASAN_OPTIONS=detect_stack_use_after_return=1 DYLD_INSERT_LIBRARIES=/Users/buildslave/jenkins/workspace/lldb-cmake-sanitized/host-compiler/lib/clang/11.0.0/lib/darwin/libclang_rt.asan_osx_dynamic.dylib output:

Hide Details

runCmd: script import lldb.macosx.heap output:

Hide Details

runCmd: ptr_refs my_ptr runCmd failed! error: 'ptr_refs' is not a valid command.

Hide Details

Hide Details

XFAIL: LLDB (/Users/buildslave/jenkins/workspace/lldb-cmake-sanitized/lldb-build/bin/clang-11-x86_64) :: test_ptr_refs_dwarf (TestPtrRefs.TestPtrRefs) <bound method SBProcess.Kill of <lldb.SBProcess; proxy of <Swig Object of type 'lldb::SBProcess *' at 0x10a2ff990> >>: success

Hide Details

UNSUPPORTED: LLDB (/Users/buildslave/jenkins/workspace/lldb-cmake-sanitized/lldb-build/bin/clang-11-x86_64) :: test_ptr_refs_dwo (TestPtrRefs.TestPtrRefs) (test case does not fall in any category of interest for this run) runCmd: settings clear -all output:

Hide Details

runCmd: settings set symbols.enable-external-lookup false output:

Hide Details

runCmd: settings set target.auto-apply-fixits false output:

Hide Details

runCmd: settings set plugin.process.gdb-remote.packet-timeout 60 output:

Hide Details

runCmd: settings set symbols.clang-modules-cache-path "/Users/buildslave/jenkins/workspace/lldb-cmake-sanitized/lldb-build/lldb-test-build.noindex/module-cache-lldb/lldb-api" output:

Hide Details

runCmd: settings set use-color false output:

Hide Details

runCmd: setting set target.prefer-dynamic-value no-dynamic-values output:

Hide Details

runCmd: settings set target.env-vars ASAN_OPTIONS=detect_stack_use_after_return=1 DYLD_INSERT_LIBRARIES=/Users/buildslave/jenkins/workspace/lldb-cmake-sanitized/host-compiler/lib/clang/11.0.0/lib/darwin/libclang_rt.asan_osx_dynamic.dylib output:

Hide Details

runCmd: script import lldb.macosx.heap output:

Hide Details

runCmd: ptr_refs my_ptr runCmd failed! error: 'ptr_refs' is not a valid command.

Hide Details

Hide Details

XFAIL: LLDB (/Users/buildslave/jenkins/workspace/lldb-cmake-sanitized/lldb-build/bin/clang-11-x86_64) :: test_ptr_refs_gmodules (TestPtrRefs.TestPtrRefs) <bound method SBProcess.Kill of <lldb.SBProcess; proxy of <Swig Object of type 'lldb::SBProcess *' at 0x12150e1e0> >>: success

Hide Details

Restore dir to: /Users/buildslave/jenkins/workspace/lldb-cmake-sanitized/lldb-build/tools/lldb/test ====================================================================== FAIL: test_ptr_refs_dsym (TestPtrRefs.TestPtrRefs) Test format string functionality. ---------------------------------------------------------------------- Traceback (most recent call last): File "/Users/buildslave/jenkins/workspace/lldb-cmake-sanitized/llvm-project/lldb/packages/Python/lldbsuite/test/lldbtest.py", line 1751, in test_method return attrvalue(self) File "/Users/buildslave/jenkins/workspace/lldb-cmake-sanitized/llvm-project/lldb/packages/Python/lldbsuite/test/decorators.py", line 110, in wrapper func(*args, **kwargs) File "/Users/buildslave/jenkins/workspace/lldb-cmake-sanitized/llvm-project/lldb/test/API/functionalities/ptr_refs/TestPtrRefs.py", line 47, in test_ptr_refs self.expect("ptr_refs my_ptr", substrs=["malloc", "stack"]) File "/Users/buildslave/jenkins/workspace/lldb-cmake-sanitized/llvm-project/lldb/packages/Python/lldbsuite/test/lldbtest.py", line 2391, in expect if msg else EXP_MSG(str, output, exe)) AssertionError: False is not True : 'ptr_refs my_ptr' returns expected result, got '0x00007ffee50b9478: stack in frame #0 of thread #1: tid 0x13b1b19 in variable at 0x7ffee50b9478: (const char *) my_ptr = 0x00006020000000b0 "hello" 0x00007ffee50b9410: stack (red zone)' Config=x86_64-/Users/buildslave/jenkins/workspace/lldb-cmake-sanitized/lldb-build/bin/clang-11 ---------------------------------------------------------------------- Ran 4 tests in 8.662s

Hide Details

RESULT: FAILED (0 passes, 1 failures, 0 errors, 1 skipped, 2 expected failures, 0 unexpected successes)

Hide Details

--

Hide Details

******************** PASS: lldb-unit :: Utility/./UtilityTests/SerializationRountripTest.SerializeDeserializeCString (1352 of 1977) PASS: lldb-unit :: Symbol/./SymbolTests/TestClangASTImporter.CompleteFwdDeclWithOtherOrigin (1353 of 1977) PASS: lldb-unit :: Utility/./UtilityTests/StringExtractorTest.GetHexU8_Underflow_NoEof (1354 of 1977) PASS: lldb-api :: functionalities/breakpoint/breakpoint_ignore_count/TestBreakpointIgnoreCount.py (1355 of 1977) PASS: lldb-api :: commands/expression/regression-access-function-template-in-record/TestRegressionAccessFunctionTemplateInRecord.py (1356 of 1977) PASS: lldb-api :: functionalities/data-formatter/synthcapping/TestSyntheticCapping.py (1357 of 1977) PASS: lldb-api :: functionalities/data-formatter/data-formatter-objc/nsstring/TestDataFormatterNSString.py (1358 of 1977) PASS: lldb-api :: functionalities/data-formatter/data-formatter-smart-array/TestDataFormatterSmartArray.py (1359 of 1977) PASS: lldb-shell :: ObjectFile/ELF/PT_LOAD-empty.yaml (1360 of 1977) PASS: lldb-shell :: Settings/TestStopCommandSourceOnError.test (1361 of 1977) UNSUPPORTED: lldb-shell :: Register/x86-64-ymm16-write.test (1362 of 1977) PASS: lldb-api :: python_api/process/read-mem-cstring/TestReadMemCString.py (1363 of 1977) PASS: lldb-shell :: Driver/TestConvenienceVariables.test (1364 of 1977) PASS: lldb-api :: functionalities/gdb_remote_client/TestIOSSimulator.py (1365 of 1977) PASS: lldb-api :: tools/lldb-server/TestAppleSimulatorOSType.py (1366 of 1977) PASS: lldb-unit :: Utility/./UtilityTests/ArgsTest.AppendArguments (1367 of 1977) PASS: lldb-unit :: Utility/./UtilityTests/StringListTest.CopyListEmpty (1368 of 1977) PASS: lldb-unit :: Signals/./SignalsTests/UnixSignalsTest.GetInfo (1369 of 1977) PASS: lldb-api :: lang/c/unions/TestUnionMembers.py (1370 of 1977) PASS: lldb-api :: commands/expression/static-initializers/TestStaticInitializers.py (1371 of 1977) PASS: lldb-api :: lang/c/set_values/TestSetValues.py (1372 of 1977) UNSUPPORTED: lldb-shell :: SymbolFile/PDB/typedefs.test (1373 of 1977) PASS: lldb-unit :: Target/./TargetTests/ModuleCacheTest.GetAndPut (1374 of 1977) PASS: lldb-unit :: ScriptInterpreter/Python/./ScriptInterpreterPythonTests/PythonDataObjectsTest.TestPythonIntegerToStr (1375 of 1977) PASS: lldb-shell :: Unwind/thread-step-out-ret-addr-check.test (1376 of 1977) PASS: lldb-unit :: ObjectFile/Breakpad/./ObjectFileBreakpadTests/LineRecord.parse (1377 of 1977) PASS: lldb-unit :: Symbol/./SymbolTests/TestTypeSystemClang.TestGetEnumIntegerTypeBasicTypes (1378 of 1977) PASS: lldb-unit :: Utility/./UtilityTests/StringListTest.LongestCommonPrefix (1379 of 1977) PASS: lldb-api :: lang/cpp/breakpoint-commands/TestCPPBreakpointCommands.py (1380 of 1977) PASS: lldb-api :: commands/expression/dont_allow_jit/TestAllowJIT.py (1381 of 1977) PASS: lldb-api :: lang/objc/objc-class-method/TestObjCClassMethod.py (1382 of 1977) PASS: lldb-unit :: Utility/./UtilityTests/SerializationRountripTest.SerializeDeserializeCStringNull (1383 of 1977) UNSUPPORTED: lldb-shell :: Reproducer/TestLuaImport.test (1384 of 1977) PASS: lldb-api :: lang/cpp/call-function/TestCallCPPFunction.py (1385 of 1977) PASS: lldb-api :: functionalities/thread/concurrent_events/TestConcurrentBreakpointOneDelayBreakpointThreads.py (1386 of 1977) PASS: lldb-unit :: Utility/./UtilityTests/UUIDTest.StringConverion (1387 of 1977) PASS: lldb-shell :: Quit/TestQuitExitCode0.test (1388 of 1977) PASS: lldb-unit :: Expression/./ExpressionTests/DiagnosticManagerTest.AppendMessageAttachToLastDiag (1389 of 1977) PASS: lldb-api :: functionalities/breakpoint/breakpoint_command/TestBreakpointCommandsFromPython.py (1390 of 1977) PASS: lldb-api :: terminal/TestSTTYBeforeAndAfter.py (1391 of 1977) PASS: lldb-api :: functionalities/thread/crash_during_step/TestCrashDuringStep.py (1392 of 1977) PASS: lldb-api :: types/TestCharTypeExpr.py (1393 of 1977) PASS: lldb-unit :: Symbol/./SymbolTests/TestTypeSystemClang.TestGetTypeClassTypeOfExpr (1394 of 1977) PASS: lldb-unit :: Utility/./UtilityTests/LogChannelEnabledTest.log_options (1395 of 1977) PASS: lldb-unit :: Utility/./UtilityTests/StringListTest.Join (1396 of 1977) PASS: lldb-api :: python_api/sblaunchinfo/TestSBLaunchInfo.py (1397 of 1977) PASS: lldb-unit :: Utility/./UtilityTests/StatusTest.ErrorConstructor (1398 of 1977) PASS: lldb-api :: functionalities/data-formatter/varscript_formatting/TestDataFormatterVarScriptFormatting.py (1399 of 1977) PASS: lldb-shell :: Recognizer/assert.test (1400 of 1977) PASS: lldb-shell :: BuildScript/modes.test (1401 of 1977) PASS: lldb-unit :: Symbol/./SymbolTests/TestTypeSystemClang.TestUnifyAccessSpecifiers (1402 of 1977) PASS: lldb-unit :: Symbol/./SymbolTests/TestTypeSystemClang.TestGetTypeClassDeclType (1403 of 1977) UNSUPPORTED: lldb-api :: android/platform/TestDefaultCacheLineSize.py (1404 of 1977) PASS: lldb-unit :: SymbolFile/DWARF/./SymbolFileDWARFTests/DWARFASTParserClangTests.EnsureAllDIEsInDeclContextHaveBeenParsedParsesOnlyMatchingEntries (1405 of 1977) PASS: lldb-api :: lang/objc/single-entry-dictionary/TestObjCSingleEntryDictionary.py (1406 of 1977) PASS: lldb-unit :: Utility/./UtilityTests/RangeTest.ContainsEndInclusiveInvalid (1407 of 1977) PASS: lldb-unit :: Utility/./UtilityTests/TildeExpressionResolver.ResolveFullPath (1408 of 1977) PASS: lldb-shell :: ObjectFile/ELF/section-types.yaml (1409 of 1977) PASS: lldb-api :: functionalities/tail_call_frames/disambiguate_paths_to_common_sink/TestDisambiguatePathsToCommonSink.py (1410 of 1977) PASS: lldb-shell :: ObjectFile/wasm/basic.yaml (1411 of 1977) PASS: lldb-api :: types/TestIntegerTypeExpr.py (1412 of 1977) PASS: lldb-unit :: UnwindAssembly/x86/./UnwindAssemblyx86Tests/Testx86AssemblyInspectionEngine.Test64bitFramelessSmallStackFrame (1413 of 1977) PASS: lldb-api :: linux/builtin_trap/TestBuiltinTrap.py (1414 of 1977) UNSUPPORTED: lldb-shell :: Register/x86-64-ymm16-read.test (1415 of 1977) PASS: lldb-unit :: Utility/./UtilityTests/StringExtractorTest.DecodeHexU8_InvalidHex2 (1416 of 1977) PASS: lldb-unit :: Utility/./UtilityTests/NameMatchesTest.Equals (1417 of 1977) PASS: lldb-api :: lang/cpp/dynamic-value-same-basename/TestDynamicValueSameBase.py (1418 of 1977) PASS: lldb-api :: functionalities/data-formatter/type_summary_list_script/TestTypeSummaryListScript.py (1419 of 1977) PASS: lldb-unit :: Utility/./UtilityTests/CompletionRequest.Constructor (1420 of 1977) PASS: lldb-api :: macosx/load-kext/TestLoadKext.py (1421 of 1977) PASS: lldb-api :: functionalities/gdb_remote_client/TestRecognizeBreakpoint.py (1422 of 1977) PASS: lldb-shell :: SymbolFile/DWARF/split-dwarf-inlining.cpp (1423 of 1977) PASS: lldb-api :: lang/cpp/unsigned_types/TestUnsignedTypes.py (1424 of 1977) PASS: lldb-api :: commands/expression/formatters/TestFormatters.py (1425 of 1977) PASS: lldb-unit :: Utility/./UtilityTests/LogChannelTest.Enable (1426 of 1977) PASS: lldb-api :: lang/cpp/member-and-local-vars-with-same-name/TestMembersAndLocalsWithSameName.py (1427 of 1977) PASS: lldb-unit :: Process/minidump/./LLDBMinidumpTests/MinidumpParserTest.GetMemoryRegionInfoFromMemory64List (1428 of 1977) PASS: lldb-api :: lang/c/find_struct_type/TestFindStructTypes.py (1429 of 1977) PASS: lldb-api :: lang/cpp/function_refs/TestFunctionRefs.py (1430 of 1977) PASS: lldb-api :: functionalities/thread/concurrent_events/TestConcurrentSignalDelayWatch.py (1431 of 1977) PASS: lldb-api :: commands/command/script/import/TestImport.py (1432 of 1977) PASS: lldb-unit :: Utility/./UtilityTests/StringExtractorTest.GetHexBytes_Partial (1433 of 1977) PASS: lldb-shell :: Breakpoint/case-sensitive.test (1434 of 1977) PASS: lldb-api :: functionalities/thread/concurrent_events/TestConcurrentBreakpointsDelayedBreakpointOneWatchpoint.py (1435 of 1977) PASS: lldb-unit :: Utility/./UtilityTests/RecordReplayTest.InstrumentedFooSameThis (1436 of 1977) PASS: lldb-api :: lang/c/function_types/TestFunctionTypes.py (1437 of 1977) PASS: lldb-api :: functionalities/tail_call_frames/thread_step_out_message/TestArtificialFrameStepOutMessage.py (1438 of 1977) PASS: lldb-unit :: Utility/./UtilityTests/LogTest.Unregister (1439 of 1977) UNSUPPORTED: lldb-shell :: ScriptInterpreter/Lua/convenience_variables.test (1440 of 1977) XFAIL: lldb-shell :: Unwind/prefer-debug-over-eh-frame.test (1441 of 1977) PASS: lldb-api :: functionalities/data-formatter/data-formatter-synth/TestDataFormatterSynth.py (1442 of 1977) PASS: lldb-unit :: Utility/./UtilityTests/RangeTest.NotEqual (1443 of 1977) PASS: lldb-unit :: Symbol/./SymbolTests/PostfixExpression.ParseFPOProgram (1444 of 1977) PASS: lldb-api :: functionalities/tail_call_frames/sbapi_support/TestTailCallFrameSBAPI.py (1445 of 1977) UNSUPPORTED: lldb-api :: linux/sepdebugsymlink/TestTargetSymbolsSepDebugSymlink.py (1446 of 1977) PASS: lldb-api :: lang/objc/modules-incomplete/TestIncompleteModules.py (1447 of 1977) PASS: lldb-unit :: Utility/./UtilityTests/StringListTest.ShiftMove (1448 of 1977) PASS: lldb-shell :: ObjectFile/MachO/lc_build_version.yaml (1449 of 1977) PASS: lldb-shell :: SymbolFile/DWARF/dir-separator-windows.s (1450 of 1977) UNSUPPORTED: lldb-shell :: SymbolFile/PDB/enums-layout.test (1451 of 1977) PASS: lldb-api :: lang/objc/modules-auto-import/TestModulesAutoImport.py (1452 of 1977) PASS: lldb-unit :: Utility/./UtilityTests/StringExtractorTest.InitEmpty (1453 of 1977) PASS: lldb-shell :: ObjectFile/Breakpad/breakpad-identification.test (1454 of 1977) PASS: lldb-unit :: Utility/./UtilityTests/BinaryStreamTest.PutULEB128EightBytes (1455 of 1977) PASS: lldb-unit :: SymbolFile/DWARF/./SymbolFileDWARFTests/SymbolFileDWARFTests.TestAbbrevOrder1Start5 (1456 of 1977) PASS: lldb-shell :: SymbolFile/DWARF/dwo-type-in-main-file.s (1457 of 1977) PASS: lldb-unit :: Utility/./UtilityTests/VMRange.Reset (1458 of 1977) PASS: lldb-unit :: Utility/./UtilityTests/StringListTest.SplitIntoLines (1459 of 1977) PASS: lldb-unit :: Utility/./UtilityTests/ArgsTest.EscapeLLDBCommandArgument (1460 of 1977) PASS: lldb-shell :: Reproducer/Functionalities/TestExpressionEvaluation.test (1461 of 1977) PASS: lldb-shell :: SymbolFile/DWARF/dwp-debug-types.s (1462 of 1977) PASS: lldb-unit :: ScriptInterpreter/Python/./ScriptInterpreterPythonTests/PythonDataObjectsTest.TestInstanceNameResolutionNoDot (1463 of 1977) PASS: lldb-unit :: Utility/./UtilityTests/StringListTest.GetMaxStringLengthIncreasingSize (1464 of 1977) PASS: lldb-unit :: UnwindAssembly/x86/./UnwindAssemblyx86Tests/Testx86AssemblyInspectionEngine.TestPushR12 (1465 of 1977) PASS: lldb-unit :: Utility/./UtilityTests/StringExtractorTest.DecodeHexU8_Underflow (1466 of 1977) PASS: lldb-unit :: Utility/./UtilityTests/StringListTest.CopyListSingle (1467 of 1977) PASS: lldb-api :: functionalities/data-formatter/data-formatter-objc/TestDataFormatterObjCNSDate.py (1468 of 1977) PASS: lldb-api :: python_api/symbol-context/TestSymbolContext.py (1469 of 1977) PASS: lldb-unit :: Editline/./EditlineTests/EditlineTestFixture.EditlineReceivesSingleLineText (1470 of 1977) PASS: lldb-api :: functionalities/breakpoint/auto_continue/TestBreakpointAutoContinue.py (1471 of 1977) UNSUPPORTED: lldb-api :: commands/expression/completion-crash-invalid-iterator/TestInvalidIteratorCompletionCrash.py (1472 of 1977) PASS: lldb-api :: functionalities/return-value/TestReturnValue.py (1473 of 1977) PASS: lldb-api :: commands/expression/radar_9531204/TestPrintfAfterUp.py (1474 of 1977) PASS: lldb-api :: macosx/duplicate-archive-members/TestDuplicateMembers.py (1475 of 1977) PASS: lldb-api :: python_api/signals/TestSignalsAPI.py (1476 of 1977) PASS: lldb-unit :: Language/Highlighting/./HighlighterTests/HighlighterTest.ClangTrailingBackslashMissingNewLine (1477 of 1977) PASS: lldb-api :: functionalities/optimized_code/TestNoASanExceptionAfterEvalOP_piece.py (1478 of 1977) PASS: lldb-unit :: Utility/./UtilityTests/StringListTest.GetSize (1479 of 1977) PASS: lldb-api :: commands/platform/basic/TestPlatformCommand.py (1480 of 1977) PASS: lldb-unit :: SymbolFile/DWARF/./SymbolFileDWARFTests/SymbolFileDWARFTests.ParseArangesNonzeroSegmentSize (1481 of 1977) PASS: lldb-api :: commands/gui/invalid-args/TestInvalidArgsGui.py (1482 of 1977) PASS: lldb-api :: commands/watchpoints/watchpoint_size/TestWatchpointSizes.py (1483 of 1977) PASS: lldb-api :: functionalities/data-formatter/array_typedef/TestArrayTypedef.py (1484 of 1977) PASS: lldb-unit :: Utility/./UtilityTests/StringListTest.PopBack (1485 of 1977) PASS: lldb-shell :: SymbolFile/DWARF/debug_ranges_and_rnglists.test (1486 of 1977) PASS: lldb-shell :: Reproducer/TestCrash.test (1487 of 1977) PASS: lldb-api :: commands/frame/diagnose/array/TestArray.py (1488 of 1977) PASS: lldb-unit :: Utility/./UtilityTests/StructuredDataTest.StringDump (1489 of 1977) PASS: lldb-api :: functionalities/signal/handle-abrt/TestHandleAbort.py (1490 of 1977) PASS: lldb-api :: commands/reproducer/invalid-args/TestInvalidArgsReproducer.py (1491 of 1977) UNSUPPORTED: lldb-api :: functionalities/asan/TestMemoryHistory.py (1492 of 1977) PASS: lldb-api :: commands/frame/var/TestFrameVar.py (1493 of 1977) PASS: lldb-api :: commands/expression/namespace_local_var_same_name_obj_c/TestNamespaceLocalVarSameNameObjC.py (1494 of 1977) PASS: lldb-unit :: Utility/./UtilityTests/StringExtractorTest.GetHexU8_InvalidHex (1495 of 1977) PASS: lldb-api :: lang/mixed/TestMixedLanguages.py (1496 of 1977) PASS: lldb-api :: commands/expression/namespace_local_var_same_name_cpp_and_c/TestNamespaceLocalVarSameNameCppAndC.py (1497 of 1977) PASS: lldb-unit :: Utility/./UtilityTests/ArchSpecTest.Compatibility (1498 of 1977) PASS: lldb-unit :: Host/./HostTests/SocketAddressTest.Set (1499 of 1977) PASS: lldb-shell :: ObjectFile/ELF/netbsd-exec-8.99.30-amd64.yaml (1500 of 1977) PASS: lldb-unit :: Utility/./UtilityTests/StreamTeeTest.Assignment (1501 of 1977) PASS: lldb-unit :: Utility/./UtilityTests/RegularExpression.Valid (1502 of 1977) PASS: lldb-unit :: Expression/./ExpressionTests/DiagnosticManagerTest.GetStringBasic (1503 of 1977) PASS: lldb-api :: lang/c/step-target/TestStepTarget.py (1504 of 1977) PASS: lldb-unit :: SymbolFile/DWARF/./SymbolFileDWARFTests/SymbolFileDWARFTests.TestAbilitiesForDWARF (1505 of 1977) PASS: lldb-unit :: Utility/./UtilityTests/CompletionRequest.DuplicateFilteringWithComments (1506 of 1977) PASS: lldb-unit :: Utility/./UtilityTests/LogTest.LLDB_LOG_nullptr (1507 of 1977) PASS: lldb-api :: commands/frame/diagnose/local-variable/TestLocalVariable.py (1508 of 1977) PASS: lldb-unit :: Utility/./UtilityTests/DataExtractorTest.GetCStrAtEnd (1509 of 1977) PASS: lldb-unit :: Host/./HostTests/MainLoopTest.TerminatesImmediately (1510 of 1977) PASS: lldb-unit :: SymbolFile/NativePDB/./SymbolFileNativePDBTests/PDBFPOProgramToDWARFExpressionTests.UnresolvedDependentCyclicRegisterAssignmentReference (1511 of 1977) PASS: lldb-api :: lang/cpp/diamond/TestDiamond.py (1512 of 1977) PASS: lldb-shell :: ScriptInterpreter/None/import_module.test (1513 of 1977) PASS: lldb-api :: types/TestLongTypesExpr.py (1514 of 1977) PASS: lldb-api :: lang/cpp/rvalue-references/TestRvalueReferences.py (1515 of 1977) PASS: lldb-shell :: Minidump/no-process-id.yaml (1516 of 1977) PASS: lldb-unit :: Utility/./UtilityTests/RangeDataVector.FindEntryThatContains (1517 of 1977) PASS: lldb-api :: functionalities/data-formatter/dump_dynamic/TestDumpDynamic.py (1518 of 1977) PASS: lldb-api :: functionalities/data-formatter/boolreference/TestFormattersBoolRefPtr.py (1519 of 1977) PASS: lldb-api :: functionalities/data-formatter/data-formatter-script/TestDataFormatterScript.py (1520 of 1977) UNSUPPORTED: lldb-api :: terminal/TestEditline.py (1521 of 1977) PASS: lldb-shell :: SymbolFile/Breakpad/line-table-discontinuous-file-ids.test (1522 of 1977) PASS: lldb-unit :: Utility/./UtilityTests/NameMatchesTest.Contains (1523 of 1977) PASS: lldb-shell :: Quit/TestQuitExitCode-30.test (1524 of 1977) PASS: lldb-api :: python_api/name_lookup/TestNameLookup.py (1525 of 1977) PASS: lldb-api :: api/listeners/TestListener.py (1526 of 1977) PASS: lldb-unit :: Utility/./UtilityTests/VASprintfTest.BufferResize (1527 of 1977) PASS: lldb-unit :: Host/./HostTests/SocketTest.DomainListenConnectAccept (1528 of 1977) PASS: lldb-api :: lang/objc/objc-ivar-offsets/TestObjCIvarOffsets.py (1529 of 1977) PASS: lldb-unit :: Utility/./UtilityTests/Flags.AllSet (1530 of 1977) PASS: lldb-unit :: Utility/./UtilityTests/FileSpecTest.EqualSeparator (1531 of 1977) PASS: lldb-api :: functionalities/thread/concurrent_events/TestConcurrentSignalWatchBreak.py (1532 of 1977) PASS: lldb-unit :: Target/./TargetTests/StackFrameRecognizerTest.NullModuleRegex (1533 of 1977) PASS: lldb-unit :: Utility/./UtilityTests/LogChannelTest.List (1534 of 1977) PASS: lldb-unit :: Utility/./UtilityTests/StreamTest.PutNHex8 (1535 of 1977) PASS: lldb-api :: commands/settings/quoting/TestQuoting.py (1536 of 1977) PASS: lldb-unit :: Utility/./UtilityTests/StringLexerTest.GetUnlexed (1537 of 1977) PASS: lldb-shell :: Settings/TestDisableColor.test (1538 of 1977) PASS: lldb-api :: functionalities/thread/backtrace_limit/TestBacktraceLimit.py (1539 of 1977) PASS: lldb-shell :: Breakpoint/implicit_const_form_support.test (1540 of 1977) PASS: lldb-api :: lang/cpp/static_methods/TestCPPStaticMethods.py (1541 of 1977) UNSUPPORTED: lldb-api :: functionalities/data-formatter/data-formatter-stl/libstdcpp/list/TestDataFormatterStdList.py (1542 of 1977) PASS: lldb-unit :: UnwindAssembly/x86/./UnwindAssemblyx86Tests/Testx86AssemblyInspectionEngine.TestSubRSP (1543 of 1977) PASS: lldb-unit :: Utility/./UtilityTests/ArgsTest.TestArgv (1544 of 1977) PASS: lldb-api :: functionalities/gdb_remote_client/TestNestedRegDefinitions.py (1545 of 1977) PASS: lldb-unit :: Utility/./UtilityTests/TimeoutTest.Construction (1546 of 1977) PASS: lldb-api :: lang/cpp/function-qualifiers/TestCppFunctionQualifiers.py (1547 of 1977) PASS: lldb-api :: functionalities/data-formatter/data-formatter-disabling/TestDataFormatterDisabling.py (1548 of 1977) PASS: lldb-unit :: Utility/./UtilityTests/StringListTest.JoinEmpty (1549 of 1977) PASS: lldb-unit :: Utility/./UtilityTests/StringListTest.AppendStringMove (1550 of 1977) PASS: lldb-api :: commands/expression/persistent_types/TestNestedPersistentTypes.py (1551 of 1977) PASS: lldb-api :: macosx/function-starts/TestFunctionStarts.py (1552 of 1977) PASS: lldb-api :: tools/lldb-server/commandline/TestStubSetSID.py (1553 of 1977) PASS: lldb-api :: python_api/debugger/TestDebuggerAPI.py (1554 of 1977) PASS: lldb-api :: commands/expression/import-std-module/unique_ptr/TestUniquePtrFromStdModule.py (1555 of 1977) PASS: lldb-api :: driver/batch_mode/TestBatchMode.py (1556 of 1977) PASS: lldb-api :: types/TestFloatTypesExpr.py (1557 of 1977) PASS: lldb-unit :: UnwindAssembly/x86/./UnwindAssemblyx86Tests/Testx86AssemblyInspectionEngine.TestDisassemblyMidFunctionEpilogues (1558 of 1977) PASS: lldb-api :: functionalities/data-formatter/data-formatter-objc/TestDataFormatterObjCKVO.py (1559 of 1977) PASS: lldb-unit :: Symbol/./SymbolTests/TestTypeSystemClang.TemplateArguments (1560 of 1977) PASS: lldb-api :: python_api/disassemble-raw-data/TestDisassembleRawData.py (1561 of 1977) PASS: lldb-api :: commands/settings/TestSettings.py (1562 of 1977) PASS: lldb-api :: functionalities/breakpoint/move_nearest/TestMoveNearest.py (1563 of 1977) PASS: lldb-unit :: Host/./HostTests/Host.GetEnvironment (1564 of 1977) PASS: lldb-api :: functionalities/thread/concurrent_events/TestConcurrentBreakpointDelayBreakpointOneSignal.py (1565 of 1977) PASS: lldb-shell :: ObjectFile/ELF/PT_TLS-overlap-PT_LOAD.yaml (1566 of 1977) PASS: lldb-unit :: Utility/./UtilityTests/DataExtractorTest.GetMaxU64_unchecked (1567 of 1977) PASS: lldb-api :: commands/expression/test/TestExprs.py (1568 of 1977) PASS: lldb-api :: commands/watchpoints/watchpoint_on_vectors/TestValueOfVectorVariable.py (1569 of 1977) PASS: lldb-api :: python_api/hello_world/TestHelloWorld.py (1570 of 1977) UNSUPPORTED: lldb-api :: functionalities/thread/multi_break/TestMultipleBreakpoints.py (1571 of 1977) UNSUPPORTED: lldb-shell :: Register/x86-zmm-read.test (1572 of 1977) PASS: lldb-unit :: Host/./HostTests/SocketTest.TCPGetAddress (1573 of 1977) PASS: lldb-unit :: Process/gdb-remote/./ProcessGdbRemoteTests/GDBRemoteCommunicationClientTest.SendGetMetaDataPacket (1574 of 1977) PASS: lldb-unit :: Utility/./UtilityTests/RangeDataVector.FindEntryIndexesThatContain_Overlap (1575 of 1977) PASS: lldb-api :: functionalities/data-formatter/data-formatter-objc/TestDataFormatterObjCNSBundle.py (1576 of 1977) PASS: lldb-api :: commands/command/script_alias/TestCommandScriptAlias.py (1577 of 1977) PASS: lldb-unit :: ScriptInterpreter/Python/./ScriptInterpreterPythonTests/PythonDataObjectsTest.TestPythonTupleToStructuredList (1578 of 1977) PASS: lldb-unit :: SymbolFile/DWARF/./SymbolFileDWARFTests/SymbolFileDWARFTests.TestAbbrevOutOfOrder (1579 of 1977) PASS: lldb-unit :: Utility/./UtilityTests/RangeDataVector.FindEntryIndexesThatContain (1580 of 1977) UNSUPPORTED: lldb-shell :: ScriptInterpreter/Lua/lua.test (1581 of 1977) PASS: lldb-unit :: Host/./HostTests/HostInfoTest.GetAugmentedArchSpec (1582 of 1977) PASS: lldb-api :: functionalities/data-formatter/nssetsynth/TestNSSetSynthetic.py (1583 of 1977) PASS: lldb-unit :: Utility/./UtilityTests/BinaryStreamTest.PutSLEB128SevenBytes (1584 of 1977) PASS: lldb-shell :: ObjectFile/ELF/duplicate-section.yaml (1585 of 1977) UNSUPPORTED: lldb-api :: functionalities/darwin_log/filter/regex/message/TestDarwinLogFilterRegexMessage.py (1586 of 1977) PASS: lldb-unit :: Language/Highlighting/./HighlighterTests/HighlighterTest.ClangCursorPosAfterOtherToken (1587 of 1977) PASS: lldb-api :: functionalities/gdb_remote_client/TestThreadSelectionBug.py (1588 of 1977) PASS: lldb-unit :: Utility/./UtilityTests/StringExtractorTest.InitMisc (1589 of 1977) PASS: lldb-unit :: Utility/./UtilityTests/RangeTest.ContainsAddr (1590 of 1977) PASS: lldb-unit :: Utility/./UtilityTests/ArgsTest.TestSingleArg (1591 of 1977) PASS: lldb-unit :: Utility/./UtilityTests/BroadcasterTest.EventTypeHasListeners (1592 of 1977) PASS: lldb-unit :: Utility/./UtilityTests/EnvironmentTest.EnvpConversion (1593 of 1977) UNSUPPORTED: lldb-shell :: ScriptInterpreter/Lua/command_script_import.test (1594 of 1977) PASS: lldb-unit :: Utility/./UtilityTests/StringExtractorTest.GetNameColonValueNoColon (1595 of 1977) PASS: lldb-unit :: Utility/./UtilityTests/ReproducerTest.SetCapture (1596 of 1977) PASS: lldb-shell :: SymbolFile/NativePDB/s_constant.cpp (1597 of 1977) PASS: lldb-api :: lang/objc/ivar-IMP/TestObjCiVarIMP.py (1598 of 1977) UNSUPPORTED: lldb-api :: functionalities/unwind/ehframe/TestEhFrameUnwind.py (1599 of 1977) PASS: lldb-api :: functionalities/gdb_remote_client/TestArmRegisterDefinition.py (1600 of 1977) PASS: lldb-unit :: Utility/./UtilityTests/CompletionRequest.TryCompleteCurrentArgMode (1601 of 1977) PASS: lldb-unit :: Core/./LLDBCoreTests/MangledTest.EmptyForInvalidName (1602 of 1977) PASS: lldb-unit :: Utility/./UtilityTests/AnsiTerminal.AtEnd (1603 of 1977) PASS: lldb-api :: functionalities/inferior-crashing/recursive-inferior/TestRecursiveInferior.py (1604 of 1977) UNSUPPORTED: lldb-shell :: SymbolFile/PDB/pointers.test (1605 of 1977) PASS: lldb-unit :: Process/gdb-remote/./ProcessGdbRemoteTests/GDBRemoteCommunicationServerTest.SendErrorResponse_StringError (1606 of 1977) PASS: lldb-unit :: Editline/./EditlineTests/EditlineTestFixture.EditlineReceivesMultiLineText (1607 of 1977) PASS: lldb-api :: functionalities/data-formatter/data-formatter-cpp/TestDataFormatterCpp.py (1608 of 1977) PASS: lldb-api :: lang/c/array_types/TestArrayTypes.py (1609 of 1977) PASS: lldb-api :: commands/watchpoints/watchpoint_set_command/TestWatchLocationWithWatchSet.py (1610 of 1977) UNSUPPORTED: lldb-shell :: Register/x86-zmm-write.test (1611 of 1977) PASS: lldb-unit :: SymbolFile/NativePDB/./SymbolFileNativePDBTests/PDBFPOProgramToDWARFExpressionTests.MissingTargetRegister (1612 of 1977) PASS: lldb-api :: commands/expression/codegen-crash-typedefdecl-not-in_declcontext/TestCodegenCrashTypedefDeclNotInDeclContext.py (1613 of 1977) PASS: lldb-unit :: Symbol/./SymbolTests/TestTypeSystemClang.TestIsClangType (1614 of 1977) PASS: lldb-unit :: Expression/./ExpressionTests/CppModuleConfigurationTest.UnrelatedLibrary (1615 of 1977) PASS: lldb-unit :: Utility/./UtilityTests/StreamTest.AddressPrefix (1616 of 1977) PASS: lldb-api :: macosx/indirect_symbol/TestIndirectSymbols.py (1617 of 1977) PASS: lldb-api :: functionalities/data-formatter/data-formatter-stl/libcxx/tuple/TestDataFormatterLibcxxTuple.py (1618 of 1977) PASS: lldb-unit :: Utility/./UtilityTests/VMRange.CollectionContains (1619 of 1977) PASS: lldb-unit :: SymbolFile/NativePDB/./SymbolFileNativePDBTests/PDBFPOProgramToDWARFExpressionTests.UnsupportedRASearch (1620 of 1977) PASS: lldb-api :: lang/objc/objc-struct-argument/TestObjCStructArgument.py (1621 of 1977) PASS: lldb-unit :: Language/Highlighting/./HighlighterTests/HighlighterTest.ClangPPDirectives (1622 of 1977) PASS: lldb-shell :: Reproducer/TestPythonImport.test (1623 of 1977) PASS: lldb-api :: functionalities/thread/concurrent_events/TestConcurrentDelaySignalWatch.py (1624 of 1977) PASS: lldb-api :: functionalities/thread/concurrent_events/TestConcurrentManyWatchpoints.py (1625 of 1977) PASS: lldb-shell :: ObjectFile/PECOFF/dep-modules.yaml (1626 of 1977) PASS: lldb-unit :: Utility/./UtilityTests/UriParserTest.SchemeHostSeparator4 (1627 of 1977) PASS: lldb-unit :: Host/./HostTests/NativeProcessProtocolTest.SetBreakpoint (1628 of 1977) PASS: lldb-unit :: ScriptInterpreter/Python/./ScriptInterpreterPythonTests/PythonDataObjectsTest.TestPythonInteger (1629 of 1977) PASS: lldb-shell :: SymbolFile/DWARF/childless-compile-unit.s (1630 of 1977) PASS: lldb-shell :: SymbolFile/DWARF/forward-declarations.s (1631 of 1977) PASS: lldb-shell :: ObjectFile/wasm/embedded-debug-sections.yaml (1632 of 1977) PASS: lldb-unit :: Utility/./UtilityTests/StreamTest.Indent (1633 of 1977) PASS: lldb-api :: lang/objc/objc-runtime-ivars/TestRuntimeIvars.py (1634 of 1977) PASS: lldb-unit :: Expression/./ExpressionTests/CppModuleConfigurationTest.LinuxLocalLibCpp (1635 of 1977) PASS: lldb-unit :: Utility/./UtilityTests/StringListTest.AppendListCStringArrayEmpty (1636 of 1977) PASS: lldb-api :: lang/c/offsetof/TestOffsetof.py (1637 of 1977) PASS: lldb-unit :: Utility/./UtilityTests/StringListTest.AppendStringStdString (1638 of 1977) PASS: lldb-api :: commands/help/TestHelp.py (1639 of 1977) PASS: lldb-api :: lang/objc/objc-ivar-stripped/TestObjCIvarStripped.py (1640 of 1977) PASS: lldb-unit :: Language/Highlighting/./HighlighterTests/HighlighterTest.ClangPreserveNewLine (1641 of 1977) PASS: lldb-unit :: Utility/./UtilityTests/StateTest.Formatv (1642 of 1977) PASS: lldb-shell :: Commands/command-script-import.test (1643 of 1977) PASS: lldb-unit :: Utility/./UtilityTests/StringListTest.SetSize (1644 of 1977) PASS: lldb-unit :: Symbol/./SymbolTests/TestTypeSystemClang.TestRemoveFastQualifiers (1645 of 1977) PASS: lldb-api :: lang/objc/foundation/TestObjCMethods.py (1646 of 1977) PASS: lldb-unit :: Utility/./UtilityTests/ScalarTest.Comparison (1647 of 1977) UNSUPPORTED: lldb-api :: linux/mix-dwo-and-regular-objects/TestMixedDwarfBinary.py (1648 of 1977) PASS: lldb-unit :: Utility/./UtilityTests/StructuredDataTest.ParseJSONFromFile (1649 of 1977) PASS: lldb-unit :: Core/./LLDBCoreTests/MangledTest.NameIndexes_FindFunctionSymbols (1650 of 1977) PASS: lldb-unit :: Utility/./UtilityTests/StringExtractorTest.GetHexU8_Underflow2 (1651 of 1977) PASS: lldb-api :: functionalities/thread/thread_exit/TestThreadExit.py (1652 of 1977) PASS: lldb-shell :: SymbolFile/DWARF/find-method.cpp (1653 of 1977) PASS: lldb-api :: lang/c/modules/TestCModules.py (1654 of 1977) PASS: lldb-api :: commands/expression/import-std-module/weak_ptr-dbg-info-content/TestDbgInfoContentWeakPtrFromStdModule.py (1655 of 1977) PASS: lldb-api :: commands/expression/two-files/TestObjCTypeQueryFromOtherCompileUnit.py (1656 of 1977) UNSUPPORTED: lldb-api :: functionalities/tsan/thread_leak/TestTsanThreadLeak.py (1657 of 1977) PASS: lldb-unit :: Utility/./UtilityTests/FileSpecTest.AppendPathComponent (1658 of 1977) PASS: lldb-unit :: Utility/./UtilityTests/LogChannelEnabledTest.LLDB_LOG_ERROR (1659 of 1977) PASS: lldb-api :: tools/lldb-server/TestGdbRemoteHostInfo.py (1660 of 1977) PASS: lldb-unit :: Utility/./UtilityTests/RangeTest.Constructor (1661 of 1977) PASS: lldb-api :: commands/expression/persistent_variables/TestPersistentVariables.py (1662 of 1977) PASS: lldb-unit :: Utility/./UtilityTests/CompletionRequest.ShiftArguments (1663 of 1977) PASS: lldb-api :: lang/objc/foundation/TestObjectDescriptionAPI.py (1664 of 1977) PASS: lldb-shell :: ObjectFile/ELF/section-addresses.yaml (1665 of 1977) UNSUPPORTED: lldb-api :: functionalities/data-formatter/data-formatter-stl/libstdcpp/string/TestDataFormatterStdString.py (1666 of 1977) UNSUPPORTED: lldb-api :: functionalities/longjmp/TestLongjmp.py (1667 of 1977) PASS: lldb-unit :: Process/gdb-remote/./ProcessGdbRemoteTests/GDBRemoteCommunicationServerTest.SendErrorResponse_ErrorNumber (1668 of 1977) PASS: lldb-unit :: Utility/./UtilityTests/BinaryStreamTest.PutSLEB128EightBytes (1669 of 1977) PASS: lldb-api :: functionalities/breakpoint/breakpoint_command/TestBreakpointCommand.py (1670 of 1977) PASS: lldb-api :: functionalities/thread/concurrent_events/TestConcurrentCrashWithWatchpoint.py (1671 of 1977) PASS: lldb-unit :: Process/minidump/./LLDBMinidumpTests/MinidumpParserTest.FindMemoryRange (1672 of 1977) PASS: lldb-unit :: Utility/./UtilityTests/FileSpecTest.CopyByAppendingPathComponent (1673 of 1977) PASS: lldb-shell :: SymbolFile/DWARF/dwp.s (1674 of 1977) PASS: lldb-api :: python_api/watchpoint/TestSetWatchpoint.py (1675 of 1977) PASS: lldb-unit :: Utility/./UtilityTests/BinaryStreamTest.PutULEB128One (1676 of 1977) PASS: lldb-unit :: Language/Highlighting/./HighlighterTests/HighlighterTest.ClangTrailingBackslashBeforeNewline (1677 of 1977) PASS: lldb-api :: lang/objc/exceptions/TestObjCExceptions.py (1678 of 1977) PASS: lldb-unit :: Utility/./UtilityTests/OptionsWithRawTest.ArgsButNoDelimiter (1679 of 1977) PASS: lldb-api :: lang/objc/objc-checker/TestObjCCheckers.py (1680 of 1977) PASS: lldb-unit :: debugserver/./debugserverTests/RNBSocket.LoopBackListenIPv6 (1681 of 1977) PASS: lldb-api :: functionalities/step-avoids-no-debug/TestStepNoDebug.py (1682 of 1977) PASS: lldb-api :: functionalities/inferior-crashing/TestInferiorCrashingStep.py (1683 of 1977) PASS: lldb-unit :: Utility/./UtilityTests/StreamTest.PutHex8 (1684 of 1977) PASS: lldb-api :: lang/c/forward/TestForwardDeclaration.py (1685 of 1977) PASS: lldb-unit :: Utility/./UtilityTests/FileSpecTest.EqualDotsPosix (1686 of 1977) PASS: lldb-api :: functionalities/data-formatter/synthupdate/TestSyntheticFilterRecompute.py (1687 of 1977) PASS: lldb-api :: macosx/thread_suspend/TestInternalThreadSuspension.py (1688 of 1977) PASS: lldb-shell :: Process/TestEnvironment.test (1689 of 1977) PASS: lldb-unit :: Utility/./UtilityTests/Flags.AllClear (1690 of 1977) PASS: lldb-unit :: Utility/./UtilityTests/BinaryStreamTest.PutSLEB128One (1691 of 1977) PASS: lldb-api :: lang/objc/objc-property/TestObjCProperty.py (1692 of 1977) PASS: lldb-api :: functionalities/type_lookup/TestTypeLookup.py (1693 of 1977) PASS: lldb-api :: functionalities/postmortem/elf-core/TestLinuxCore.py (1694 of 1977) PASS: lldb-unit :: SymbolFile/NativePDB/./SymbolFileNativePDBTests/PDBFPOProgramToDWARFExpressionTests.MultipleIndependentAssignments (1695 of 1977) PASS: lldb-api :: functionalities/breakpoint/cpp_exception/TestCPPExceptionBreakpoint.py (1696 of 1977) PASS: lldb-api :: functionalities/thread/concurrent_events/TestConcurrentNWatchNBreak.py (1697 of 1977) PASS: lldb-shell :: Register/x86-64-read.test (1698 of 1977) UNSUPPORTED: lldb-shell :: SymbolFile/PDB/calling-conventions.test (1699 of 1977) PASS: lldb-api :: lang/cpp/exceptions/TestCPPExceptionBreakpoints.py (1700 of 1977) PASS: lldb-unit :: Utility/./UtilityTests/RangeTest.Copy (1701 of 1977) PASS: lldb-api :: functionalities/data-formatter/nsdictionarysynth/TestNSDictionarySynthetic.py (1702 of 1977) PASS: lldb-shell :: Reproducer/TestDriverOptions.test (1703 of 1977) UNSUPPORTED: lldb-api :: functionalities/darwin_log/filter/regex/category/TestDarwinLogFilterRegexCategory.py (1704 of 1977) PASS: lldb-unit :: Process/minidump/./LLDBMinidumpTests/MinidumpParserTest.GetMemoryRegionInfoLinuxMaps (1705 of 1977) PASS: lldb-unit :: SymbolFile/NativePDB/./SymbolFileNativePDBTests/PDBFPOProgramToDWARFExpressionTests.MultipleDependentAssignments (1706 of 1977) PASS: lldb-unit :: Utility/./UtilityTests/SubsystemRAIITest.SubsystemWithErrorSuccess (1707 of 1977) PASS: lldb-api :: python_api/interpreter/TestCommandInterpreterAPI.py (1708 of 1977) PASS: lldb-api :: lang/objc/objc-foundation-dictionary-empty/TestNSDictionary0.py (1709 of 1977) PASS: lldb-unit :: UnwindAssembly/x86/./UnwindAssemblyx86Tests/Testx86AssemblyInspectionEngine.TestPopEBP (1710 of 1977) PASS: lldb-api :: lang/cpp/accelerator-table/TestCPPAccelerator.py (1711 of 1977) PASS: lldb-api :: functionalities/data-formatter/data-formatter-stl/libcxx/set/TestDataFormatterLibcxxSet.py (1712 of 1977) PASS: lldb-unit :: Host/./HostTests/NativeProcessProtocolTest.ReadMemoryWithoutTrap (1713 of 1977) PASS: lldb-shell :: SymbolFile/NativePDB/nested-types.cpp (1714 of 1977) UNSUPPORTED: lldb-shell :: Register/arm-fp-read.test (1715 of 1977) UNSUPPORTED: lldb-api :: functionalities/tsan/global_location/TestTsanGlobalLocation.py (1716 of 1977) PASS: lldb-api :: functionalities/thread/concurrent_events/TestConcurrentCrashWithBreak.py (1717 of 1977) PASS: lldb-api :: lang/objc/modules-non-objc-target/TestObjCModulesNonObjCTarget.py (1718 of 1977) UNSUPPORTED: lldb-api :: functionalities/exec/TestExec.py (1719 of 1977) PASS: lldb-unit :: Utility/./UtilityTests/ArgsTest.ReplaceArgumentAtIndexOutOfRange (1720 of 1977) PASS: lldb-unit :: Utility/./UtilityTests/ScalarTest.Division (1721 of 1977) PASS: lldb-shell :: Breakpoint/split-dwarf-5-addrbase.test (1722 of 1977) UNSUPPORTED: lldb-shell :: SymbolFile/PDB/type-quals.test (1723 of 1977) PASS: lldb-unit :: Expression/./ExpressionTests/CppModuleConfigurationTest.AmbiguousLibCpp (1724 of 1977) PASS: lldb-unit :: Utility/./UtilityTests/BinaryStreamTest.PutULEB128TwoBytes (1725 of 1977) UNSUPPORTED: lldb-shell :: SymbolFile/target-symbols-add-unwind.test (1726 of 1977) PASS: lldb-unit :: Utility/./UtilityTests/ConstStringTest.UpdateMangledCounterpart (1727 of 1977) PASS: lldb-unit :: ScriptInterpreter/Python/./ScriptInterpreterPythonTests/PythonDataObjectsTest.TestPythonDictionaryManipulation (1728 of 1977) PASS: lldb-unit :: Utility/./UtilityTests/ConstStringTest.format_provider (1729 of 1977) PASS: lldb-unit :: Utility/./UtilityTests/StringExtractorTest.GetU64LittleEndian (1730 of 1977) PASS: lldb-unit :: Language/Highlighting/./HighlighterTests/HighlighterTest.ClangIdentifiers (1731 of 1977) PASS: lldb-unit :: SymbolFile/DWARF/./SymbolFileDWARFTests/SymbolFileDWARFTests.TestAbbrevValidAttrNullForm (1732 of 1977) PASS: lldb-api :: functionalities/data-formatter/vector-types/TestVectorTypesFormatting.py (1733 of 1977) PASS: lldb-api :: functionalities/dead-strip/TestDeadStrip.py (1734 of 1977) UNSUPPORTED: lldb-shell :: SymbolFile/PDB/function-nested-block.test (1735 of 1977) PASS: lldb-api :: commands/expression/options/TestExprOptions.py (1736 of 1977) PASS: lldb-api :: functionalities/breakpoint/comp_dir_symlink/TestCompDirSymLink.py (1737 of 1977) PASS: lldb-unit :: Language/Highlighting/./HighlighterTests/HighlighterTest.ClangUnterminatedString (1738 of 1977) PASS: lldb-unit :: Core/./LLDBCoreTests/RichManglingContextTest.FromCxxMethodName (1739 of 1977) PASS: lldb-unit :: Utility/./UtilityTests/StreamTeeTest.Flush (1740 of 1977) PASS: lldb-api :: commands/expression/import-std-module/stack/TestStackFromStdModule.py (1741 of 1977) PASS: lldb-api :: tools/lldb-vscode/breakpoint-events/TestVSCode_breakpointEvents.py (1742 of 1977) PASS: lldb-api :: lang/cpp/bool/TestCPPBool.py (1743 of 1977) PASS: lldb-api :: commands/expression/import-std-module/queue/TestQueueFromStdModule.py (1744 of 1977) PASS: lldb-api :: lang/c/strings/TestCStrings.py (1745 of 1977) PASS: lldb-unit :: Symbol/./SymbolTests/PostfixExpression.ToDWARF (1746 of 1977) UNSUPPORTED: lldb-api :: tools/lldb-server/TestGdbRemote_vContThreads.py (1747 of 1977) PASS: lldb-unit :: Symbol/./SymbolTests/LineEntryTest.GetSameLineContiguousAddressRangeOneInline (1748 of 1977) PASS: lldb-unit :: Utility/./UtilityTests/StreamTest.PutMaxHex64ByteOrderBig (1749 of 1977) PASS: lldb-api :: functionalities/postmortem/wow64_minidump/TestWow64MiniDump.py (1750 of 1977) PASS: lldb-unit :: Process/minidump/./LLDBMinidumpTests/MinidumpParserTest.GetLinuxProcStatus_no_stream (1751 of 1977) PASS: lldb-api :: functionalities/pre_run_dylibs/TestPreRunDylibs.py (1752 of 1977) PASS: lldb-api :: functionalities/thread/exit_during_step/TestExitDuringStep.py (1753 of 1977) PASS: lldb-api :: macosx/add-dsym/TestAddDsymMidExecutionCommand.py (1754 of 1977) PASS: lldb-unit :: Host/./HostTests/MainLoopTest.UnmonitoredSignal (1755 of 1977) PASS: lldb-api :: functionalities/memory/find/TestMemoryFind.py (1756 of 1977) PASS: lldb-unit :: Utility/./UtilityTests/OptionsWithRawTest.WhitespaceInput (1757 of 1977) PASS: lldb-unit :: ObjectFile/ELF/./ObjectFileELFTests/ObjectFileELFTest.GetSymtab_NoSymEntryPointArmAddressClass (1758 of 1977) PASS: lldb-shell :: SymbolFile/NativePDB/ast-types.cpp (1759 of 1977) PASS: lldb-unit :: Process/gdb-remote/./ProcessGdbRemoteTests/GDBRemoteClientBaseTest.InterruptNoResponse (1760 of 1977) PASS: lldb-unit :: Process/minidump/./LLDBMinidumpTests/MinidumpParserTest.FindMemoryRangeWithFullMemoryMinidump (1761 of 1977) PASS: lldb-api :: python_api/lldbutil/process/TestPrintStackTraces.py (1762 of 1977) PASS: lldb-api :: commands/expression/persist_objc_pointeetype/TestPersistObjCPointeeType.py (1763 of 1977) PASS: lldb-shell :: SymbolFile/DWARF/find-basic-variable.cpp (1764 of 1977) PASS: lldb-api :: lang/objc/objc-ivar-protocols/TestIvarProtocols.py (1765 of 1977) PASS: lldb-api :: macosx/find-app-in-bundle/TestFindAppInBundle.py (1766 of 1977) UNSUPPORTED: lldb-api :: functionalities/gdb_remote_client/TestWasm.py (1767 of 1977) PASS: lldb-api :: commands/watchpoints/watchpoint_commands/command/TestWatchpointCommandPython.py (1768 of 1977) PASS: lldb-unit :: Utility/./UtilityTests/StreamTest.PutRawBytesToLittleEndian (1769 of 1977) PASS: lldb-api :: functionalities/process_group/TestChangeProcessGroup.py (1770 of 1977) PASS: lldb-unit :: Symbol/./SymbolTests/TestTypeSystemClang.TestGetEnumIntegerTypeUnexpectedType (1771 of 1977) PASS: lldb-api :: api/check_public_api_headers/TestPublicAPIHeaders.py (1772 of 1977) PASS: lldb-unit :: Utility/./UtilityTests/StreamTest.PutHex16ByteOrderBig (1773 of 1977) PASS: lldb-api :: lang/cpp/bitfields/TestCppBitfields.py (1774 of 1977) PASS: lldb-api :: commands/expression/unwind_expression/TestUnwindExpression.py (1775 of 1977) UNSUPPORTED: lldb-api :: tools/lldb-server/TestGdbRemoteAuxvSupport.py (1776 of 1977) PASS: lldb-unit :: Expression/./ExpressionTests/CppModuleConfigurationTest.IgnoreLibStdCpp (1777 of 1977) PASS: lldb-api :: lang/cpp/operators/TestCppOperators.py (1778 of 1977) PASS: lldb-api :: functionalities/tail_call_frames/inlining_and_tail_calls/TestInliningAndTailCalls.py (1779 of 1977) PASS: lldb-unit :: Utility/./UtilityTests/NameMatchesTest.StartsWith (1780 of 1977) PASS: lldb-unit :: Utility/./UtilityTests/FileSpecTest.RemoveLastPathComponent (1781 of 1977) PASS: lldb-unit :: Process/gdb-remote/./ProcessGdbRemoteTests/GDBRemoteCommunicationClientTest.SaveRestoreRegistersNoSuffix (1782 of 1977) PASS: lldb-unit :: Utility/./UtilityTests/UriParserTest.Empty (1783 of 1977) PASS: lldb-shell :: Commands/command-source.test (1784 of 1977) PASS: lldb-api :: lang/objc/modules-hash-mismatch/TestClangModulesHashMismatch.py (1785 of 1977) PASS: lldb-unit :: SymbolFile/DWARF/./SymbolFileDWARFTests/SymbolFileDWARFTests.TestAbbrevOrder1Start1 (1786 of 1977) PASS: lldb-shell :: SymbolFile/DWARF/clang-ast-from-dwarf-unamed-and-anon-structs.cpp (1787 of 1977) PASS: lldb-api :: commands/add-dsym/uuid/TestAddDsymCommand.py (1788 of 1977) PASS: lldb-unit :: UnwindAssembly/x86/./UnwindAssemblyx86Tests/Testx86AssemblyInspectionEngine.TestPushR13 (1789 of 1977) PASS: lldb-unit :: Utility/./UtilityTests/OptionsWithRawTest.MultiWordSuffix (1790 of 1977) PASS: lldb-api :: commands/expression/import-std-module/deque-basic/TestDequeFromStdModule.py (1791 of 1977) PASS: lldb-api :: functionalities/tail_call_frames/cross_dso/TestCrossDSOTailCalls.py (1792 of 1977) PASS: lldb-api :: functionalities/jitloader_gdb/TestJITLoaderGDB.py (1793 of 1977) PASS: lldb-api :: tools/lldb-server/inferior-crash/TestGdbRemoteSegFault.py (1794 of 1977) PASS: lldb-unit :: UnwindAssembly/x86/./UnwindAssemblyx86Tests/Testx86AssemblyInspectionEngine.TestPopR15 (1795 of 1977) PASS: lldb-unit :: Process/minidump/./LLDBMinidumpTests/RegisterContextMinidump.ConvertMinidumpContext_x86_32 (1796 of 1977) PASS: lldb-unit :: Utility/./UtilityTests/StringExtractorTest.DecodeHexU8_Extra (1797 of 1977) PASS: lldb-unit :: Utility/./UtilityTests/SerializationRountripTest.SerializeDeserializeCStringArray (1798 of 1977) PASS: lldb-api :: functionalities/inferior-assert/TestInferiorAssert.py (1799 of 1977) PASS: lldb-api :: lang/objc/global_ptrs/TestGlobalObjects.py (1800 of 1977) PASS: lldb-unit :: Process/minidump/./LLDBMinidumpTests/MinidumpParserTest.GetThreadsAndGetThreadContext (1801 of 1977) PASS: lldb-unit :: Utility/./UtilityTests/StringListTest.DefaultConstructor (1802 of 1977) PASS: lldb-unit :: Utility/./UtilityTests/ArchSpecTest.MergeFromMachOUnknown (1803 of 1977) UNSUPPORTED: lldb-shell :: BuildScript/toolchain-clang-cl.test (1804 of 1977) PASS: lldb-api :: commands/target/basic/TestTargetCommand.py (1805 of 1977) PASS: lldb-api :: source-manager/TestSourceManager.py (1806 of 1977) PASS: lldb-api :: commands/expression/import-std-module/no-std-module/TestMissingStdModule.py (1807 of 1977) PASS: lldb-shell :: Minidump/memory-region.yaml (1808 of 1977) PASS: lldb-unit :: Utility/./UtilityTests/SerializationRountripTest.SerializeDeserializePodPointers (1809 of 1977) PASS: lldb-api :: lang/objc/conflicting-definition/TestConflictingDefinition.py (1810 of 1977) PASS: lldb-api :: lang/cpp/nsimport/TestCppNsImport.py (1811 of 1977) PASS: lldb-unit :: Utility/./UtilityTests/RecordReplayTest.InstrumentedBarPtr (1812 of 1977) PASS: lldb-api :: lang/objc/foundation/TestConstStrings.py (1813 of 1977) UNSUPPORTED: lldb-api :: functionalities/breakpoint/breakpoint_callback_command_source/TestBreakpointCallbackCommandSource.py (1814 of 1977) PASS: lldb-unit :: Utility/./UtilityTests/UUIDTest.SetFromStringRef (1815 of 1977) PASS: lldb-unit :: Utility/./UtilityTests/StringListTest.InsertStringAtIndexEnd (1816 of 1977) PASS: lldb-api :: python_api/watchpoint/watchlocation/TestTargetWatchAddress.py (1817 of 1977) PASS: lldb-shell :: ObjectFile/ELF/section-types-edgecases.yaml (1818 of 1977) UNSUPPORTED: lldb-api :: functionalities/signal/handle-segv/TestHandleSegv.py (1819 of 1977) PASS: lldb-unit :: UnwindAssembly/x86/./UnwindAssemblyx86Tests/Testx86AssemblyInspectionEngine.TestStackRealign32BitDisp_x86_64 (1820 of 1977) PASS: lldb-unit :: Process/minidump/./LLDBMinidumpTests/MinidumpParserTest.GetArchitecture (1821 of 1977) PASS: lldb-api :: functionalities/thread/concurrent_events/TestConcurrentCrashWithSignal.py (1822 of 1977) PASS: lldb-unit :: Language/CPlusPlus/./LanguageCPlusPlusTests/CPlusPlusLanguage.MethodNameParsing (1823 of 1977) PASS: lldb-api :: functionalities/thread/concurrent_events/TestConcurrentTwoWatchpointThreads.py (1824 of 1977) PASS: lldb-api :: commands/expression/completion-in-lambda-and-unnamed-class/TestCompletionInLambdaAndUnnamedClass.py (1825 of 1977) PASS: lldb-unit :: Host/./HostTests/SocketTest.DecodeHostAndPort (1826 of 1977) PASS: lldb-api :: lang/c/tls_globals/TestTlsGlobals.py (1827 of 1977) PASS: lldb-api :: lang/cpp/frame-var-anon-unions/TestFrameVariableAnonymousUnions.py (1828 of 1977) PASS: lldb-unit :: Host/./HostTests/SocketAddressTest.GetAddressInfo (1829 of 1977) PASS: lldb-unit :: Utility/./UtilityTests/StreamTest.PutStringAsRawHex8 (1830 of 1977) PASS: lldb-unit :: Utility/./UtilityTests/StringExtractorTest.GetHexBytesAvail_OddPair2 (1831 of 1977) PASS: lldb-shell :: ObjectFile/ELF/PT_LOAD-overlap-section.yaml (1832 of 1977) PASS: lldb-unit :: Utility/./UtilityTests/ProcessInstanceInfoList.Yaml (1833 of 1977) PASS: lldb-api :: functionalities/data-formatter/data-formatter-stl/libcxx/unique_ptr/TestDataFormatterLibcxxUniquePtr.py (1834 of 1977) PASS: lldb-unit :: Symbol/./SymbolTests/Type.CompilerContextPattern (1835 of 1977) PASS: lldb-unit :: Expression/./ExpressionTests/CppModuleConfigurationTest.Xcode (1836 of 1977) PASS: lldb-api :: functionalities/breakpoint/breakpoint_ids/TestBreakpointIDs.py (1837 of 1977) UNSUPPORTED: lldb-api :: functionalities/data-formatter/data-formatter-stl/libstdcpp/smart_ptr/TestDataFormatterStdSmartPtr.py (1838 of 1977) PASS: lldb-api :: tools/lldb-server/TestGdbRemoteSingleStep.py (1839 of 1977) PASS: lldb-unit :: Utility/./UtilityTests/StringExtractorTest.DecodeHexU8_Underflow2 (1840 of 1977) PASS: lldb-api :: types/TestLongTypes.py (1841 of 1977) UNSUPPORTED: lldb-api :: commands/register/register/intel_xtended_registers/mpx_offset_intersection/TestMPXOffsetIntersection.py (1842 of 1977) PASS: lldb-unit :: Utility/./UtilityTests/FileSpecTest.Match (1843 of 1977) PASS: lldb-unit :: Utility/./UtilityTests/UriParserTest.SchemeHostSeparator2 (1844 of 1977) PASS: lldb-api :: functionalities/step_scripted/TestStepScripted.py (1845 of 1977) PASS: lldb-api :: functionalities/lazy-loading/TestLazyLoading.py (1846 of 1977) PASS: lldb-api :: macosx/universal/TestUniversal.py (1847 of 1977) PASS: lldb-unit :: Utility/./UtilityTests/RecordReplayTest.InstrumentedBar (1848 of 1977) PASS: lldb-api :: functionalities/data-formatter/format-propagation/TestFormatPropagation.py (1849 of 1977) PASS: lldb-shell :: SymbolFile/DWARF/debug_loc-aslr.s (1850 of 1977) PASS: lldb-unit :: Utility/./UtilityTests/StringExtractorTest.GetHexU8_InvalidHex_NoEof (1851 of 1977) PASS: lldb-unit :: Process/gdb-remote/./ProcessGdbRemoteTests/GDBRemoteCommunicationClientTest.WriteRegister (1852 of 1977) PASS: lldb-shell :: SymbolFile/DWARF/find-function-regex.cpp (1853 of 1977) UNSUPPORTED: lldb-shell :: ScriptInterpreter/Lua/persistent_state.test (1854 of 1977) PASS: lldb-unit :: Utility/./UtilityTests/StringExtractorTest.GetHexU8_Extra (1855 of 1977) PASS: lldb-api :: types/TestShortType.py (1856 of 1977) PASS: lldb-api :: python_api/sbdata/TestSBData.py (1857 of 1977) PASS: lldb-unit :: Expression/./ExpressionTests/DWARFExpression.DW_OP_convert (1858 of 1977) PASS: lldb-api :: functionalities/thread/concurrent_events/TestConcurrentSignalBreak.py (1859 of 1977) PASS: lldb-api :: functionalities/gdb_remote_client/TestGDBRemoteLoad.py (1860 of 1977) PASS: lldb-api :: functionalities/plugins/command_plugin/TestPluginCommands.py (1861 of 1977) PASS: lldb-unit :: Language/Highlighting/./HighlighterTests/HighlighterTest.ClangCursorPosEndOfLine (1862 of 1977) PASS: lldb-unit :: Utility/./UtilityTests/SerializationRountripTest.SerializeDeserializePod (1863 of 1977) PASS: lldb-unit :: UnwindAssembly/x86/./UnwindAssemblyx86Tests/Testx86AssemblyInspectionEngine.TestPush0 (1864 of 1977) PASS: lldb-unit :: Utility/./UtilityTests/SharedCluster.ClusterManager (1865 of 1977) PASS: lldb-api :: functionalities/inline-stepping/TestInlineStepping.py (1866 of 1977) PASS: lldb-unit :: SymbolFile/NativePDB/./SymbolFileNativePDBTests/PDBFPOProgramToDWARFExpressionTests.InvalidOpUnary (1867 of 1977) PASS: lldb-api :: functionalities/data-formatter/data-formatter-stl/libcxx/queue/TestDataFormatterLibcxxQueue.py (1868 of 1977) PASS: lldb-unit :: Process/gdb-remote/./ProcessGdbRemoteTests/GDBRemoteClientBaseTest.SendContinueAndWait (1869 of 1977) PASS: lldb-unit :: Utility/./UtilityTests/RangeTest.ContainsEndInclusive (1870 of 1977) UNSUPPORTED: lldb-shell :: Register/x86-gp-write.test (1871 of 1977) UNSUPPORTED: lldb-api :: tools/lldb-server/TestGdbRemoteModuleInfo.py (1872 of 1977) PASS: lldb-shell :: Reproducer/TestDump.test (1873 of 1977) PASS: lldb-api :: lang/objc/foundation/TestRuntimeTypes.py (1874 of 1977) UNSUPPORTED: lldb-shell :: ObjectFile/PECOFF/disassemble-thumb.yaml (1875 of 1977) PASS: lldb-api :: lang/cpp/namespace/TestNamespaceLookup.py (1876 of 1977) XFAIL: lldb-shell :: Register/x86-mm-xmm-read.test (1877 of 1977) PASS: lldb-unit :: Utility/./UtilityTests/DataExtractorTest.GetMaxU64 (1878 of 1977) PASS: lldb-unit :: Utility/./UtilityTests/ScalarTest.CastOperations (1879 of 1977) PASS: lldb-api :: functionalities/data-formatter/refpointer-recursion/TestDataFormatterRefPtrRecursion.py (1880 of 1977) PASS: lldb-unit :: Utility/./UtilityTests/StringListTest.InsertStringAtIndexMove (1881 of 1977) PASS: lldb-api :: lang/cpp/class_static/TestStaticVariables.py (1882 of 1977) PASS: lldb-unit :: Utility/./UtilityTests/StringExtractorTest.GetHexBytes (1883 of 1977) PASS: lldb-unit :: Utility/./UtilityTests/StringLexerTest.Peek (1884 of 1977) PASS: lldb-unit :: Utility/./UtilityTests/StreamTeeTest.DefaultConstructor (1885 of 1977) PASS: lldb-shell :: ObjectFile/MachO/lc_version_min.yaml (1886 of 1977) PASS: lldb-shell :: Driver/TestTarget.test (1887 of 1977) PASS: lldb-unit :: ObjectFile/PECOFF/./ObjectFilePECOFFTests/PECallFrameInfoTest.Chained_eh (1888 of 1977) PASS: lldb-shell :: Minidump/Windows/broken-unwind.test (1889 of 1977) PASS: lldb-unit :: Utility/./UtilityTests/StringLexerTest.PutBack (1890 of 1977) PASS: lldb-api :: commands/expression/dollar-in-variable/TestDollarInVariable.py (1891 of 1977) PASS: lldb-api :: lang/cpp/constructors/TestCppConstructors.py (1892 of 1977) PASS: lldb-api :: commands/expression/import-std-module/list-dbg-info-content/TestDbgInfoContentListFromStdModule.py (1893 of 1977) PASS: lldb-unit :: Utility/./UtilityTests/RegisterValueTest.GetSet8 (1894 of 1977) PASS: lldb-unit :: Utility/./UtilityTests/IndexToObjectTest.ObjectForIndex (1895 of 1977) PASS: lldb-api :: functionalities/thread/concurrent_events/TestConcurrentManyBreakpoints.py (1896 of 1977) PASS: lldb-unit :: Utility/./UtilityTests/StringListTest.RemoveBlankLines (1897 of 1977) UNSUPPORTED: lldb-api :: functionalities/breakpoint/breakpoint_in_delayslot/TestAvoidBreakpointInDelaySlot.py (1898 of 1977) PASS: lldb-api :: lang/c/global_variables/TestGlobalVariables.py (1899 of 1977) PASS: lldb-unit :: UnwindAssembly/x86/./UnwindAssemblyx86Tests/Testx86AssemblyInspectionEngine.TestPushExtended (1900 of 1977) PASS: lldb-shell :: SymbolFile/DWARF/debug-types-address-ranges.s (1901 of 1977) PASS: lldb-api :: functionalities/postmortem/elf-core/gcore/TestGCore.py (1902 of 1977) PASS: lldb-unit :: Utility/./UtilityTests/StringListTest.JoinThree (1903 of 1977) PASS: lldb-unit :: SymbolFile/NativePDB/./SymbolFileNativePDBTests/PDBFPOProgramToDWARFExpressionTests.SingleAssignmentRegisterRef (1904 of 1977) PASS: lldb-api :: commands/expression/top-level/TestTopLevelExprs.py (1905 of 1977) PASS: lldb-unit :: Expression/./ExpressionTests/CppModuleConfigurationTest.UnknownLibCppFile (1906 of 1977) PASS: lldb-unit :: Utility/./UtilityTests/SerializationRountripTest.SerializeDeserializeObjectPointer (1907 of 1977) UNSUPPORTED: lldb-api :: commands/expression/call-restarts/TestCallThatRestarts.py (1908 of 1977) UNSUPPORTED: lldb-shell :: Register/x86-64-xmm16-read.test (1909 of 1977) PASS: lldb-unit :: SymbolFile/NativePDB/./SymbolFileNativePDBTests/PDBFPOProgramToDWARFExpressionTests.UnresolvedCyclicRegisterAssignmentReference (1910 of 1977) PASS: lldb-api :: lang/objcxx/class-name-clash/TestNameClash.py (1911 of 1977) UNSUPPORTED: lldb-api :: tools/lldb-server/signal-filtering/TestGdbRemote_QPassSignals.py (1912 of 1977) PASS: lldb-unit :: Utility/./UtilityTests/ArgsTest.TestUnknownEscape (1913 of 1977) PASS: lldb-unit :: Utility/./UtilityTests/StringExtractorTest.GetHexBytes_OddPair (1914 of 1977) PASS: lldb-unit :: Utility/./UtilityTests/StringExtractorTest.GetHexBytesAvail_FullString (1915 of 1977) PASS: lldb-api :: commands/expression/import-std-module/list/TestListFromStdModule.py (1916 of 1977) PASS: lldb-api :: python_api/watchpoint/watchlocation/TestSetWatchlocation.py (1917 of 1977) PASS: lldb-unit :: Language/Highlighting/./HighlighterTests/HighlighterTest.ClangCursorPosBeforeOtherToken (1918 of 1977) PASS: lldb-unit :: Utility/./UtilityTests/FileSpecTest.GuessPathStyle (1919 of 1977) PASS: lldb-unit :: Utility/./UtilityTests/StringExtractorTest.GetU32LittleEndian (1920 of 1977) UNSUPPORTED: lldb-api :: benchmarks/libcxxmap/TestBenchmarkLibcxxMap.py (1921 of 1977) UNSUPPORTED: lldb-api :: commands/watchpoints/variable_out_of_scope/TestWatchedVarHitWhenInScope.py (1922 of 1977) PASS: lldb-api :: functionalities/thread/thread_specific_break/TestThreadSpecificBreakpoint.py (1923 of 1977) PASS: lldb-api :: commands/frame/diagnose/dereference-argument/TestDiagnoseDereferenceArgument.py (1924 of 1977) PASS: lldb-api :: functionalities/data-formatter/data-formatter-stl/libcxx/atomic/TestLibCxxAtomic.py (1925 of 1977) PASS: lldb-api :: commands/expression/issue_11588/Test11588.py (1926 of 1977) PASS: lldb-api :: functionalities/memory/read/TestMemoryRead.py (1927 of 1977) PASS: lldb-unit :: Utility/./UtilityTests/StringListTest.GetMaxStringLengthDecreasingSize (1928 of 1977) PASS: lldb-unit :: Utility/./UtilityTests/SerializationRountripTest.SerializeDeserializeObjectReference (1929 of 1977) PASS: lldb-shell :: Expr/TestIRMemoryMap.test (1930 of 1977) PASS: lldb-unit :: ObjectFile/Breakpad/./ObjectFileBreakpadTests/Record.classify (1931 of 1977) PASS: lldb-unit :: Utility/./UtilityTests/RegularExpression.Match (1932 of 1977) PASS: lldb-unit :: Utility/./UtilityTests/BroadcasterTest.BroadcastEvent (1933 of 1977) PASS: lldb-shell :: SymbolFile/DWARF/inline-function-address.ll (1934 of 1977) PASS: lldb-api :: commands/expression/save_jit_objects/TestSaveJITObjects.py (1935 of 1977) PASS: lldb-api :: tools/lldb-server/TestGdbRemoteThreadsInStopReply.py (1936 of 1977) PASS: lldb-unit :: UnwindAssembly/x86/./UnwindAssemblyx86Tests/Testx86AssemblyInspectionEngine.TestCALLNextInsn (1937 of 1977) UNSUPPORTED: lldb-shell :: SymbolFile/PDB/udt-layout.test (1938 of 1977) PASS: lldb-api :: macosx/find-dsym/deep-bundle/TestDeepBundle.py (1939 of 1977) PASS: lldb-unit :: Utility/./UtilityTests/VMRange.ContainsAddr (1940 of 1977) PASS: lldb-unit :: Utility/./UtilityTests/ArchSpecTest.TestParseMachCPUDashSubtypeTripleExtra (1941 of 1977) PASS: lldb-shell :: SymbolFile/DWARF/debug_loclists-dwo.s (1942 of 1977) PASS: lldb-api :: lang/objc/objc-builtin-types/TestObjCBuiltinTypes.py (1943 of 1977) PASS: lldb-unit :: ScriptInterpreter/Python/./ScriptInterpreterPythonTests/PythonDataObjectsTest.TestPythonTupleInitializerList2 (1944 of 1977) PASS: lldb-api :: commands/target/create-no-such-arch/TestNoSuchArch.py (1945 of 1977) PASS: lldb-api :: tools/lldb-server/TestGdbRemoteAttach.py (1946 of 1977) PASS: lldb-api :: functionalities/breakpoint/inlined_breakpoints/TestInlinedBreakpoints.py (1947 of 1977) PASS: lldb-unit :: ScriptInterpreter/Python/./ScriptInterpreterPythonTests/PythonDataObjectsTest.TestPythonStringToStr (1948 of 1977) PASS: lldb-unit :: Utility/./UtilityTests/StreamTest.QuotedCString (1949 of 1977) PASS: lldb-unit :: Utility/./UtilityTests/StreamTest.PutHex32ByteOrderLittle (1950 of 1977) UNSUPPORTED: lldb-api :: iohandler/unicode/TestUnicode.py (1951 of 1977) PASS: lldb-unit :: Utility/./UtilityTests/ArgsTest.GetArgumentArrayRef (1952 of 1977) PASS: lldb-unit :: Utility/./UtilityTests/StringListTest.CopyList (1953 of 1977) PASS: lldb-unit :: Utility/./UtilityTests/BinaryStreamTest.PutULEB128FourBytes (1954 of 1977) PASS: lldb-api :: sanity/TestModuleCacheSanity.py (1955 of 1977) PASS: lldb-unit :: Utility/./UtilityTests/ArgsTest.TestAppendArg (1956 of 1977) PASS: lldb-unit :: Platform/./LLDBPlatformTests/PlatformDarwinTest.GetSDKNameForType (1957 of 1977) PASS: lldb-unit :: Utility/./UtilityTests/RangeTest.LessThanInvalid (1958 of 1977) PASS: lldb-unit :: Utility/./UtilityTests/FileSpecTest.OperatorBool (1959 of 1977) PASS: lldb-unit :: Platform/./LLDBPlatformTests/PlatformDarwinTest.FindXcodeContentsDirectoryInPath (1960 of 1977) PASS: lldb-unit :: Host/./HostTests/Host.WaitStatusFormat (1961 of 1977) PASS: lldb-api :: commands/expression/timeout/TestCallWithTimeout.py (1962 of 1977) PASS: lldb-unit :: Utility/./UtilityTests/ArgsTest.StringListConstructor (1963 of 1977) UNSUPPORTED: lldb-api :: functionalities/thread/thread_specific_break_plus_condition/TestThreadSpecificBpPlusCondition.py (1964 of 1977) PASS: lldb-unit :: Platform/./LLDBPlatformTests/PlatformDarwinTest.FindComponentInPath (1965 of 1977) PASS: lldb-api :: functionalities/unwind/noreturn/module-end/TestNoReturnModuleEnd.py (1966 of 1977) PASS: lldb-unit :: Symbol/./SymbolTests/TestClangASTImporter.DeportTypeTagDecl (1967 of 1977) PASS: lldb-api :: lang/objcxx/hide-runtime-values/TestObjCXXHideRuntimeValues.py (1968 of 1977) PASS: lldb-api :: lang/cpp/stl/TestStdCXXDisassembly.py (1969 of 1977) PASS: lldb-unit :: Utility/./UtilityTests/VASprintfTest.EncodingError (1970 of 1977) PASS: lldb-unit :: Utility/./UtilityTests/AnsiTerminal.Incomplete (1971 of 1977) PASS: lldb-unit :: Utility/./UtilityTests/LogTest.Register (1972 of 1977) PASS: lldb-api :: functionalities/data-formatter/data-formatter-synthval/TestDataFormatterSynthVal.py (1973 of 1977) PASS: lldb-api :: commands/expression/completion/TestExprCompletion.py (1974 of 1977) PASS: lldb-api :: commands/version/TestVersion.py (1975 of 1977) PASS: lldb-api :: lang/cpp/modules-import/TestCXXModulesImport.py (1976 of 1977) PASS: lldb-api :: lang/objc/foundation/TestObjCMethodsString.py (1977 of 1977)

Hide Details

Testing Time: 4458.70s ******************** Failing Tests (3): lldb-api :: lang/objc/ptr_refs/TestPtrRefsObjC.py lldb-api :: python_api/thread/TestThreadAPI.py lldb-api :: functionalities/ptr_refs/TestPtrRefs.py

Hide Details

Hide Details

Slowest Tests: -------------------------------------------------------------------------- 95.47s: lldb-api :: commands/settings/TestSettings.py 96.18s: lldb-api :: types/TestLongTypes.py 98.25s: lldb-api :: functionalities/data-formatter/poarray/TestPrintObjectArray.py 105.52s: lldb-api :: lang/objc/forward-decl/TestForwardDecl.py 114.98s: lldb-api :: lang/objc/foundation/TestObjCMethodsString.py 119.08s: lldb-api :: lang/objc/foundation/TestObjCMethodsNSError.py 120.26s: lldb-api :: tools/lldb-server/TestGdbRemote_qThreadStopInfo.py 122.24s: lldb-api :: lang/objc/objc-new-syntax/TestObjCNewSyntaxArray.py 122.67s: lldb-api :: lang/objc/objc-new-syntax/TestObjCNewSyntaxDictionary.py 140.41s: lldb-api :: types/TestLongTypesExpr.py 145.23s: lldb-api :: lang/objc/real-definition/TestRealDefinition.py 146.28s: lldb-api :: lang/objc/exceptions/TestObjCExceptions.py 161.39s: lldb-api :: lang/cpp/namespace/TestNamespaceLookup.py 162.48s: lldb-api :: lang/objc/objc-new-syntax/TestObjCNewSyntaxLiteral.py 224.96s: lldb-api :: lang/objc/hidden-ivars/TestHiddenIvars.py 226.50s: lldb-api :: lang/objc/foundation/TestObjCMethods.py 249.17s: lldb-api :: tools/lldb-server/TestGdbRemoteThreadsInStopReply.py 263.29s: lldb-api :: api/multithreaded/TestMultithreaded.py 274.65s: lldb-api :: lang/cpp/enum_types/TestCPP11EnumTypes.py 368.91s: lldb-api :: tools/lldb-server/TestLldbGdbServer.py

Hide Details

Tests Times: -------------------------------------------------------------------------- [ Range ] :: [ Percentage ] :: [ Count ] -------------------------------------------------------------------------- [ 0s, 20s) :: [********************************** ] :: [1723/1977] [ 20s, 40s) :: [** ] :: [ 107/1977] [ 40s, 60s) :: [* ] :: [ 92/1977] [ 60s, 80s) :: [ ] :: [ 26/1977] [ 80s,100s) :: [ ] :: [ 11/1977] [100s,120s) :: [ ] :: [ 3/1977] [120s,140s) :: [ ] :: [ 4/1977] [140s,160s) :: [ ] :: [ 3/1977] [160s,180s) :: [ ] :: [ 2/1977] [180s,200s) :: [ ] :: [ 0/1977] [200s,220s) :: [ ] :: [ 0/1977] [220s,240s) :: [ ] :: [ 2/1977] [240s,260s) :: [ ] :: [ 1/1977] [260s,280s) :: [ ] :: [ 1/1977] [280s,300s) :: [ ] :: [ 1/1977] [300s,320s) :: [ ] :: [ 0/1977] [320s,340s) :: [ ] :: [ 0/1977] [340s,360s) :: [ ] :: [ 0/1977] [360s,380s) :: [ ] :: [ 1/1977] Expected Passes : 1801 Expected Failures : 6 Unsupported Tests : 167 Unexpected Failures: 3 FAILED: tools/lldb/test/CMakeFiles/check-lldb-lit cd /Users/buildslave/jenkins/workspace/lldb-cmake-sanitized/lldb-build/tools/lldb/test && /usr/local/bin/python /Users/buildslave/jenkins/workspace/lldb-cmake-sanitized/lldb-build/./bin/llvm-lit -v --time-tests --shuffle --xunit-xml-output=/Users/buildslave/jenkins/workspace/lldb-cmake-sanitized/test/results.xml -v -j 4 --timeout 1200 /Users/buildslave/jenkins/workspace/lldb-cmake-sanitized/lldb-build/tools/lldb/test ninja: build stopped: subcommand failed. Command failed: Command '['/usr/bin/env', 'TERM=vt100', '/usr/local/bin/ninja', '-v', 'check-lldb']' returned non-zero exit status 1. Command: ['/usr/bin/env', 'TERM=vt100', '/usr/local/bin/ninja', '-v', 'check-lldb'] [Pipeline] } [Pipeline] // timeout [Pipeline] } [Pipeline] // stage [Pipeline] stage [Pipeline] { (Declarative: Post Actions) [Pipeline] scanForIssues [Clang (LLVM based)] Sleeping for 5 seconds due to JENKINS-32191... [Clang (LLVM based)] Parsing console log (workspace: '/Users/buildslave/jenkins/workspace/lldb-cmake-sanitized') [Clang (LLVM based)] Successfully parsed console log [Clang (LLVM based)] -> found 1 issue (skipped 0 duplicates) [Clang (LLVM based)] Post processing issues on 'green-dragon-23' with source code encoding 'UTF-8' [Clang (LLVM based)] Creating SCM blamer to obtain author and commit information for affected files [Clang (LLVM based)] Creating SCM miner to obtain statistics for affected repository files [Clang (LLVM based)] Resolving file names for all issues in source directory '/Users/buildslave/jenkins/workspace/lldb-cmake-sanitized' [Clang (LLVM based)] -> resolved paths in source directory (1 found, 0 not found) [Clang (LLVM based)] Resolving module names from module definitions (build.xml, pom.xml, or Manifest.mf files) [Clang (LLVM based)] -> resolved module names for 1 issues [Clang (LLVM based)] Resolving package names (or namespaces) by parsing the affected files [Clang (LLVM based)] -> resolved package names of 1 affected files [Clang (LLVM based)] No filter has been set, publishing all 1 issues [Clang (LLVM based)] Creating fingerprints for all affected code blocks to track issues over different builds [Clang (LLVM based)] -> created fingerprints for 1 issues (skipped 0 issues) [Clang (LLVM based)] Copying affected files to Jenkins' build folder '/Users/Shared/Jenkins/Home/jobs/lldb-cmake-sanitized/builds/1166/files-with-issues' [Clang (LLVM based)] -> 1 copied, 0 not in workspace, 0 not-found, 0 with I/O error [Pipeline] junit Recording test results [Pipeline] } [Pipeline] // stage [Pipeline] } [Pipeline] // withEnv [Pipeline] } [Pipeline] // node [Pipeline] End of Pipeline ERROR: script returned exit code 1 Finished: FAILURE