FailedConsole Output

Skipping 8,477 KB.. Full Log
alloc(1024); // thread step-out of malloc into function b.
    	                ^
   22  	    if (!ptr)
   23  	        return -1;
   24  	    else

Hide Details

Hide Details

<bound method SBProcess.Kill of <lldb.SBProcess; proxy of <Swig Object of type 'lldb::SBProcess *' at 0x112904db0> >>: success

Hide Details

PASS: LLDB (/Users/buildslave/jenkins/workspace/lldb-cmake-sanitized/lldb-build/bin/clang-11-x86_64) :: test_run_to_address_gmodules (TestThreadAPI.ThreadAPITestCase) runCmd: settings clear -all output:

Hide Details

runCmd: settings set symbols.enable-external-lookup false output:

Hide Details

runCmd: settings set target.auto-apply-fixits false output:

Hide Details

runCmd: settings set plugin.process.gdb-remote.packet-timeout 60 output:

Hide Details

runCmd: settings set symbols.clang-modules-cache-path "/Users/buildslave/jenkins/workspace/lldb-cmake-sanitized/lldb-build/lldb-test-build.noindex/module-cache-lldb/lldb-api" output:

Hide Details

runCmd: settings set use-color false output:

Hide Details

runCmd: setting set target.prefer-dynamic-value no-dynamic-values output:

Hide Details

runCmd: settings set target.env-vars ASAN_OPTIONS=detect_stack_use_after_return=1 DYLD_INSERT_LIBRARIES=/Users/buildslave/jenkins/workspace/lldb-cmake-sanitized/host-compiler/lib/clang/11.0.0/lib/darwin/libclang_rt.asan_osx_dynamic.dylib output:

Hide Details

FAIL: LLDB (/Users/buildslave/jenkins/workspace/lldb-cmake-sanitized/lldb-build/bin/clang-11-x86_64) :: test_step_out_of_malloc_into_function_b_dsym (TestThreadAPI.ThreadAPITestCase) <bound method SBProcess.Kill of <lldb.SBProcess; proxy of <Swig Object of type 'lldb::SBProcess *' at 0x112453990> >>: success

Hide Details

runCmd: settings clear -all output:

Hide Details

runCmd: settings set symbols.enable-external-lookup false output:

Hide Details

runCmd: settings set target.auto-apply-fixits false output:

Hide Details

runCmd: settings set plugin.process.gdb-remote.packet-timeout 60 output:

Hide Details

runCmd: settings set symbols.clang-modules-cache-path "/Users/buildslave/jenkins/workspace/lldb-cmake-sanitized/lldb-build/lldb-test-build.noindex/module-cache-lldb/lldb-api" output:

Hide Details

runCmd: settings set use-color false output:

Hide Details

runCmd: setting set target.prefer-dynamic-value no-dynamic-values output:

Hide Details

runCmd: settings set target.env-vars ASAN_OPTIONS=detect_stack_use_after_return=1 DYLD_INSERT_LIBRARIES=/Users/buildslave/jenkins/workspace/lldb-cmake-sanitized/host-compiler/lib/clang/11.0.0/lib/darwin/libclang_rt.asan_osx_dynamic.dylib output:

Hide Details

FAIL: LLDB (/Users/buildslave/jenkins/workspace/lldb-cmake-sanitized/lldb-build/bin/clang-11-x86_64) :: test_step_out_of_malloc_into_function_b_dwarf (TestThreadAPI.ThreadAPITestCase) <bound method SBProcess.Kill of <lldb.SBProcess; proxy of <Swig Object of type 'lldb::SBProcess *' at 0x112904de0> >>: success

Hide Details

UNSUPPORTED: LLDB (/Users/buildslave/jenkins/workspace/lldb-cmake-sanitized/lldb-build/bin/clang-11-x86_64) :: test_step_out_of_malloc_into_function_b_dwo (TestThreadAPI.ThreadAPITestCase) (test case does not fall in any category of interest for this run) runCmd: settings clear -all output:

Hide Details

runCmd: settings set symbols.enable-external-lookup false output:

Hide Details

runCmd: settings set target.auto-apply-fixits false output:

Hide Details

runCmd: settings set plugin.process.gdb-remote.packet-timeout 60 output:

Hide Details

runCmd: settings set symbols.clang-modules-cache-path "/Users/buildslave/jenkins/workspace/lldb-cmake-sanitized/lldb-build/lldb-test-build.noindex/module-cache-lldb/lldb-api" output:

Hide Details

runCmd: settings set use-color false output:

Hide Details

runCmd: setting set target.prefer-dynamic-value no-dynamic-values output:

Hide Details

runCmd: settings set target.env-vars ASAN_OPTIONS=detect_stack_use_after_return=1 DYLD_INSERT_LIBRARIES=/Users/buildslave/jenkins/workspace/lldb-cmake-sanitized/host-compiler/lib/clang/11.0.0/lib/darwin/libclang_rt.asan_osx_dynamic.dylib output:

Hide Details

FAIL: LLDB (/Users/buildslave/jenkins/workspace/lldb-cmake-sanitized/lldb-build/bin/clang-11-x86_64) :: test_step_out_of_malloc_into_function_b_gmodules (TestThreadAPI.ThreadAPITestCase) <bound method SBProcess.Kill of <lldb.SBProcess; proxy of <Swig Object of type 'lldb::SBProcess *' at 0x112453990> >>: success

Hide Details

runCmd: settings clear -all output:

Hide Details

runCmd: settings set symbols.enable-external-lookup false output:

Hide Details

runCmd: settings set target.auto-apply-fixits false output:

Hide Details

runCmd: settings set plugin.process.gdb-remote.packet-timeout 60 output:

Hide Details

runCmd: settings set symbols.clang-modules-cache-path "/Users/buildslave/jenkins/workspace/lldb-cmake-sanitized/lldb-build/lldb-test-build.noindex/module-cache-lldb/lldb-api" output:

Hide Details

runCmd: settings set use-color false output:

Hide Details

runCmd: setting set target.prefer-dynamic-value no-dynamic-values output:

Hide Details

runCmd: settings set target.env-vars ASAN_OPTIONS=detect_stack_use_after_return=1 DYLD_INSERT_LIBRARIES=/Users/buildslave/jenkins/workspace/lldb-cmake-sanitized/host-compiler/lib/clang/11.0.0/lib/darwin/libclang_rt.asan_osx_dynamic.dylib output:

Hide Details

runCmd: breakpoint list output: Current breakpoints: 1: file = 'main2.cpp', line = 21, exact_match = 0, locations = 1 1.1: where = test_step_over_3_times_dsym`b(int) + 22 at main2.cpp:21:17, address = test_step_over_3_times_dsym[0x0000000100000e66], unresolved, hit count = 0

Hide Details

Hide Details

Hide Details

runCmd: thread backtrace output: * thread #1, queue = 'com.apple.main-thread', stop reason = breakpoint 1.1 * frame #0: 0x0000000103004e66 test_step_over_3_times_dsym`b(val=1) at main2.cpp:21:17 frame #1: 0x0000000103004e0d test_step_over_3_times_dsym`a(val=1) at main2.cpp:11:16 frame #2: 0x0000000103004ee0 test_step_over_3_times_dsym`main(argc=1, argv=0x00007ffeecbfb468) at main2.cpp:36:14 frame #3: 0x00007fff5da0b085 libdyld.dylib`start + 1 frame #4: 0x00007fff5da0b085 libdyld.dylib`start + 1

Hide Details

Hide Details

runCmd: thread backtrace output: * thread #1, queue = 'com.apple.main-thread', stop reason = step over * frame #0: 0x0000000103004e9d test_step_over_3_times_dsym`b(val=1) at main2.cpp:26:12 frame #1: 0x0000000103004e0d test_step_over_3_times_dsym`a(val=1) at main2.cpp:11:16 frame #2: 0x0000000103004ee0 test_step_over_3_times_dsym`main(argc=1, argv=0x00007ffeecbfb468) at main2.cpp:36:14 frame #3: 0x00007fff5da0b085 libdyld.dylib`start + 1 frame #4: 0x00007fff5da0b085 libdyld.dylib`start + 1

Hide Details

Hide Details

<bound method SBProcess.Kill of <lldb.SBProcess; proxy of <Swig Object of type 'lldb::SBProcess *' at 0x112904de0> >>: success

Hide Details

PASS: LLDB (/Users/buildslave/jenkins/workspace/lldb-cmake-sanitized/lldb-build/bin/clang-11-x86_64) :: test_step_over_3_times_dsym (TestThreadAPI.ThreadAPITestCase) runCmd: settings clear -all output:

Hide Details

runCmd: settings set symbols.enable-external-lookup false output:

Hide Details

runCmd: settings set target.auto-apply-fixits false output:

Hide Details

runCmd: settings set plugin.process.gdb-remote.packet-timeout 60 output:

Hide Details

runCmd: settings set symbols.clang-modules-cache-path "/Users/buildslave/jenkins/workspace/lldb-cmake-sanitized/lldb-build/lldb-test-build.noindex/module-cache-lldb/lldb-api" output:

Hide Details

runCmd: settings set use-color false output:

Hide Details

runCmd: setting set target.prefer-dynamic-value no-dynamic-values output:

Hide Details

runCmd: settings set target.env-vars ASAN_OPTIONS=detect_stack_use_after_return=1 DYLD_INSERT_LIBRARIES=/Users/buildslave/jenkins/workspace/lldb-cmake-sanitized/host-compiler/lib/clang/11.0.0/lib/darwin/libclang_rt.asan_osx_dynamic.dylib output:

Hide Details

runCmd: breakpoint list output: Current breakpoints: 1: file = 'main2.cpp', line = 21, exact_match = 0, locations = 1 1.1: where = test_step_over_3_times_dwarf`b(int) + 22 at main2.cpp:21:17, address = test_step_over_3_times_dwarf[0x0000000100000e66], unresolved, hit count = 0

Hide Details

Hide Details

Hide Details

runCmd: thread backtrace output: * thread #1, queue = 'com.apple.main-thread', stop reason = breakpoint 1.1 * frame #0: 0x00000001076bde66 test_step_over_3_times_dwarf`b(val=1) at main2.cpp:21:17 frame #1: 0x00000001076bde0d test_step_over_3_times_dwarf`a(val=1) at main2.cpp:11:16 frame #2: 0x00000001076bdee0 test_step_over_3_times_dwarf`main(argc=1, argv=0x00007ffee8542460) at main2.cpp:36:14 frame #3: 0x00007fff5da0b085 libdyld.dylib`start + 1

Hide Details

Hide Details

runCmd: thread backtrace output: * thread #1, queue = 'com.apple.main-thread', stop reason = step over * frame #0: 0x00000001076bde9d test_step_over_3_times_dwarf`b(val=1) at main2.cpp:26:12 frame #1: 0x00000001076bde0d test_step_over_3_times_dwarf`a(val=1) at main2.cpp:11:16 frame #2: 0x00000001076bdee0 test_step_over_3_times_dwarf`main(argc=1, argv=0x00007ffee8542460) at main2.cpp:36:14 frame #3: 0x00007fff5da0b085 libdyld.dylib`start + 1

Hide Details

Hide Details

<bound method SBProcess.Kill of <lldb.SBProcess; proxy of <Swig Object of type 'lldb::SBProcess *' at 0x112453990> >>: success

Hide Details

PASS: LLDB (/Users/buildslave/jenkins/workspace/lldb-cmake-sanitized/lldb-build/bin/clang-11-x86_64) :: test_step_over_3_times_dwarf (TestThreadAPI.ThreadAPITestCase) UNSUPPORTED: LLDB (/Users/buildslave/jenkins/workspace/lldb-cmake-sanitized/lldb-build/bin/clang-11-x86_64) :: test_step_over_3_times_dwo (TestThreadAPI.ThreadAPITestCase) (test case does not fall in any category of interest for this run) runCmd: settings clear -all output:

Hide Details

runCmd: settings set symbols.enable-external-lookup false output:

Hide Details

runCmd: settings set target.auto-apply-fixits false output:

Hide Details

runCmd: settings set plugin.process.gdb-remote.packet-timeout 60 output:

Hide Details

runCmd: settings set symbols.clang-modules-cache-path "/Users/buildslave/jenkins/workspace/lldb-cmake-sanitized/lldb-build/lldb-test-build.noindex/module-cache-lldb/lldb-api" output:

Hide Details

runCmd: settings set use-color false output:

Hide Details

runCmd: setting set target.prefer-dynamic-value no-dynamic-values output:

Hide Details

runCmd: settings set target.env-vars ASAN_OPTIONS=detect_stack_use_after_return=1 DYLD_INSERT_LIBRARIES=/Users/buildslave/jenkins/workspace/lldb-cmake-sanitized/host-compiler/lib/clang/11.0.0/lib/darwin/libclang_rt.asan_osx_dynamic.dylib output:

Hide Details

runCmd: breakpoint list output: Current breakpoints: 1: file = 'main2.cpp', line = 21, exact_match = 0, locations = 1 1.1: where = test_step_over_3_times_gmodules`b(int) + 22 at main2.cpp:21:17, address = test_step_over_3_times_gmodules[0x0000000100000e66], unresolved, hit count = 0

Hide Details

Hide Details

Hide Details

runCmd: thread backtrace output: * thread #1, queue = 'com.apple.main-thread', stop reason = breakpoint 1.1 * frame #0: 0x000000010f97de66 test_step_over_3_times_gmodules`b(val=1) at main2.cpp:21:17 frame #1: 0x000000010f97de0d test_step_over_3_times_gmodules`a(val=1) at main2.cpp:11:16 frame #2: 0x000000010f97dee0 test_step_over_3_times_gmodules`main(argc=1, argv=0x00007ffee0282458) at main2.cpp:36:14 frame #3: 0x00007fff5da0b085 libdyld.dylib`start + 1 frame #4: 0x00007fff5da0b085 libdyld.dylib`start + 1

Hide Details

Hide Details

runCmd: thread backtrace output: * thread #1, queue = 'com.apple.main-thread', stop reason = step over * frame #0: 0x000000010f97de9d test_step_over_3_times_gmodules`b(val=1) at main2.cpp:26:12 frame #1: 0x000000010f97de0d test_step_over_3_times_gmodules`a(val=1) at main2.cpp:11:16 frame #2: 0x000000010f97dee0 test_step_over_3_times_gmodules`main(argc=1, argv=0x00007ffee0282458) at main2.cpp:36:14 frame #3: 0x00007fff5da0b085 libdyld.dylib`start + 1 frame #4: 0x00007fff5da0b085 libdyld.dylib`start + 1

Hide Details

Hide Details

<bound method SBProcess.Kill of <lldb.SBProcess; proxy of <Swig Object of type 'lldb::SBProcess *' at 0x112904db0> >>: success

Hide Details

PASS: LLDB (/Users/buildslave/jenkins/workspace/lldb-cmake-sanitized/lldb-build/bin/clang-11-x86_64) :: test_step_over_3_times_gmodules (TestThreadAPI.ThreadAPITestCase) Restore dir to: /Users/buildslave/jenkins/workspace/lldb-cmake-sanitized/lldb-build/tools/lldb/test ====================================================================== ERROR: test_step_out_of_malloc_into_function_b_dsym (TestThreadAPI.ThreadAPITestCase) Test Python SBThread.StepOut() API to step out of a malloc call where the call site is at function b(). ---------------------------------------------------------------------- Traceback (most recent call last): File "/Users/buildslave/jenkins/workspace/lldb-cmake-sanitized/llvm-project/lldb/packages/Python/lldbsuite/test/lldbtest.py", line 1751, in test_method return attrvalue(self) File "/Users/buildslave/jenkins/workspace/lldb-cmake-sanitized/llvm-project/lldb/packages/Python/lldbsuite/test/decorators.py", line 110, in wrapper func(*args, **kwargs) File "/Users/buildslave/jenkins/workspace/lldb-cmake-sanitized/llvm-project/lldb/packages/Python/lldbsuite/test/decorators.py", line 110, in wrapper func(*args, **kwargs) File "/Users/buildslave/jenkins/workspace/lldb-cmake-sanitized/llvm-project/lldb/packages/Python/lldbsuite/test/decorators.py", line 110, in wrapper func(*args, **kwargs) File "/Users/buildslave/jenkins/workspace/lldb-cmake-sanitized/llvm-project/lldb/test/API/python_api/thread/TestThreadAPI.py", line 50, in test_step_out_of_malloc_into_function_b self.step_out_of_malloc_into_function_b(self.exe_name) File "/Users/buildslave/jenkins/workspace/lldb-cmake-sanitized/llvm-project/lldb/test/API/python_api/thread/TestThreadAPI.py", line 157, in step_out_of_malloc_into_function_b thread.IsValid(), AttributeError: 'NoneType' object has no attribute 'IsValid' Config=x86_64-/Users/buildslave/jenkins/workspace/lldb-cmake-sanitized/lldb-build/bin/clang-11 ====================================================================== ERROR: test_step_out_of_malloc_into_function_b_dwarf (TestThreadAPI.ThreadAPITestCase) Test Python SBThread.StepOut() API to step out of a malloc call where the call site is at function b(). ---------------------------------------------------------------------- Traceback (most recent call last): File "/Users/buildslave/jenkins/workspace/lldb-cmake-sanitized/llvm-project/lldb/packages/Python/lldbsuite/test/lldbtest.py", line 1751, in test_method return attrvalue(self) File "/Users/buildslave/jenkins/workspace/lldb-cmake-sanitized/llvm-project/lldb/packages/Python/lldbsuite/test/decorators.py", line 110, in wrapper func(*args, **kwargs) File "/Users/buildslave/jenkins/workspace/lldb-cmake-sanitized/llvm-project/lldb/packages/Python/lldbsuite/test/decorators.py", line 110, in wrapper func(*args, **kwargs) File "/Users/buildslave/jenkins/workspace/lldb-cmake-sanitized/llvm-project/lldb/packages/Python/lldbsuite/test/decorators.py", line 110, in wrapper func(*args, **kwargs) File "/Users/buildslave/jenkins/workspace/lldb-cmake-sanitized/llvm-project/lldb/test/API/python_api/thread/TestThreadAPI.py", line 50, in test_step_out_of_malloc_into_function_b self.step_out_of_malloc_into_function_b(self.exe_name) File "/Users/buildslave/jenkins/workspace/lldb-cmake-sanitized/llvm-project/lldb/test/API/python_api/thread/TestThreadAPI.py", line 157, in step_out_of_malloc_into_function_b thread.IsValid(), AttributeError: 'NoneType' object has no attribute 'IsValid' Config=x86_64-/Users/buildslave/jenkins/workspace/lldb-cmake-sanitized/lldb-build/bin/clang-11 ====================================================================== ERROR: test_step_out_of_malloc_into_function_b_gmodules (TestThreadAPI.ThreadAPITestCase) Test Python SBThread.StepOut() API to step out of a malloc call where the call site is at function b(). ---------------------------------------------------------------------- Traceback (most recent call last): File "/Users/buildslave/jenkins/workspace/lldb-cmake-sanitized/llvm-project/lldb/packages/Python/lldbsuite/test/lldbtest.py", line 1751, in test_method return attrvalue(self) File "/Users/buildslave/jenkins/workspace/lldb-cmake-sanitized/llvm-project/lldb/packages/Python/lldbsuite/test/decorators.py", line 110, in wrapper func(*args, **kwargs) File "/Users/buildslave/jenkins/workspace/lldb-cmake-sanitized/llvm-project/lldb/packages/Python/lldbsuite/test/decorators.py", line 110, in wrapper func(*args, **kwargs) File "/Users/buildslave/jenkins/workspace/lldb-cmake-sanitized/llvm-project/lldb/packages/Python/lldbsuite/test/decorators.py", line 110, in wrapper func(*args, **kwargs) File "/Users/buildslave/jenkins/workspace/lldb-cmake-sanitized/llvm-project/lldb/test/API/python_api/thread/TestThreadAPI.py", line 50, in test_step_out_of_malloc_into_function_b self.step_out_of_malloc_into_function_b(self.exe_name) File "/Users/buildslave/jenkins/workspace/lldb-cmake-sanitized/llvm-project/lldb/test/API/python_api/thread/TestThreadAPI.py", line 157, in step_out_of_malloc_into_function_b thread.IsValid(), AttributeError: 'NoneType' object has no attribute 'IsValid' Config=x86_64-/Users/buildslave/jenkins/workspace/lldb-cmake-sanitized/lldb-build/bin/clang-11 ---------------------------------------------------------------------- Ran 20 tests in 39.406s

Hide Details

RESULT: FAILED (12 passes, 0 failures, 3 errors, 5 skipped, 0 expected failures, 0 unexpected successes)

Hide Details

--

Hide Details

******************** PASS: lldb-unit :: Utility/./UtilityTests/VASprintfTest.BufferResize (856 of 1983) PASS: lldb-unit :: Utility/./UtilityTests/RangeTest.Clear (857 of 1983) PASS: lldb-api :: functionalities/gdb_remote_client/TestArmRegisterDefinition.py (858 of 1983) PASS: lldb-api :: functionalities/gdb_remote_client/TestTargetXMLArch.py (859 of 1983) UNSUPPORTED: lldb-api :: functionalities/darwin_log/filter/regex/category/TestDarwinLogFilterRegexCategory.py (860 of 1983) PASS: lldb-shell :: SymbolFile/NativePDB/globals-fundamental.cpp (861 of 1983) PASS: lldb-unit :: tools/lldb-server/tests/./LLDBServerTests/StandardStartupTest.TestStopReplyContainsThreadPcs (862 of 1983) PASS: lldb-api :: lang/objc/objc-ivar-stripped/TestObjCIvarStripped.py (863 of 1983) PASS: lldb-unit :: Utility/./UtilityTests/SharedCluster.ClusterManager (864 of 1983) PASS: lldb-unit :: Symbol/./SymbolTests/TestTypeSystemClang.TestFunctionTemplateConstruction (865 of 1983) PASS: lldb-unit :: Host/./HostTests/FileSystemTest.EnumerateDirectory (866 of 1983) UNSUPPORTED: lldb-shell :: SymbolFile/target-symbols-add-unwind.test (867 of 1983) PASS: lldb-api :: macosx/thread-names/TestInterruptThreadNames.py (868 of 1983) PASS: lldb-api :: functionalities/data-formatter/data-formatter-objc/nsindexpath/TestDataFormatterNSIndexPath.py (869 of 1983) PASS: lldb-api :: lang/objc/unicode-string/TestUnicodeString.py (870 of 1983) PASS: lldb-api :: commands/process/attach/TestProcessAttach.py (871 of 1983) PASS: lldb-unit :: UnwindAssembly/x86/./UnwindAssemblyx86Tests/Testx86AssemblyInspectionEngine.TestDisassemblyMidFunctionEpilogues (872 of 1983) UNSUPPORTED: lldb-api :: lang/objc/foundation/TestFoundationDisassembly.py (873 of 1983) PASS: lldb-api :: commands/expression/import-std-module/unique_ptr-dbg-info-content/TestUniquePtrDbgInfoContent.py (874 of 1983) PASS: lldb-api :: tools/lldb-server/TestGdbRemote_qThreadStopInfo.py (875 of 1983) PASS: lldb-unit :: Expression/./ExpressionTests/CppModuleConfigurationTest.UnrelatedLibrary (876 of 1983) PASS: lldb-unit :: Utility/./UtilityTests/StreamTest.PutRawBytesToMixedEndian (877 of 1983) PASS: lldb-api :: api/multiple-targets/TestMultipleTargets.py (878 of 1983) PASS: lldb-shell :: Reproducer/TestGDBRemoteRepro.test (879 of 1983) UNSUPPORTED: lldb-shell :: ScriptInterpreter/Lua/persistent_state.test (880 of 1983) PASS: lldb-unit :: Utility/./UtilityTests/UserIDResolver.GetGroupName (881 of 1983) UNSUPPORTED: lldb-shell :: BuildScript/toolchain-msvc.test (882 of 1983) PASS: lldb-unit :: Utility/./UtilityTests/StreamTest.AddressRangeEmptyRange (883 of 1983) PASS: lldb-unit :: Symbol/./SymbolTests/Type.CompilerContextPattern (884 of 1983) PASS: lldb-shell :: ObjectFile/ELF/PT_LOAD-overlap.yaml (885 of 1983) PASS: lldb-unit :: Utility/./UtilityTests/BinaryStreamTest.PutULEB128Zero (886 of 1983) PASS: lldb-api :: lang/cpp/static_methods/TestCPPStaticMethods.py (887 of 1983) PASS: lldb-unit :: Utility/./UtilityTests/UriParserTest.BracketedHostnameWithColon (888 of 1983) PASS: lldb-unit :: Host/./HostTests/Host.WaitStatusFormat (889 of 1983) PASS: lldb-api :: lang/c/shared_lib/TestSharedLib.py (890 of 1983) PASS: lldb-unit :: Process/gdb-remote/./ProcessGdbRemoteTests/GDBRemoteCommunicationClientTest.GetModulesInfo (891 of 1983) PASS: lldb-api :: python_api/sbtype_typeclass/TestSBTypeTypeClass.py (892 of 1983) PASS: lldb-unit :: Utility/./UtilityTests/StreamTest.SetIndentLevel (893 of 1983) PASS: lldb-unit :: ScriptInterpreter/Python/./ScriptInterpreterPythonTests/PythonDataObjectsTest.TestPythonCallableCheck (894 of 1983) PASS: lldb-unit :: ObjectFile/Breakpad/./ObjectFileBreakpadTests/StackWinRecord.parse (895 of 1983) PASS: lldb-api :: commands/target/stop-hooks/TestStopHooks.py (896 of 1983) PASS: lldb-api :: commands/register/register/register_command/TestRegisters.py (897 of 1983) PASS: lldb-shell :: Breakpoint/debug_rnglist_rlestartend.test (898 of 1983) UNSUPPORTED: lldb-api :: functionalities/asan/TestReportData.py (899 of 1983) PASS: lldb-shell :: ObjectFile/ELF/short-build-id.yaml (900 of 1983) PASS: lldb-api :: lang/cpp/breakpoint_in_member_func_w_non_primitive_params/TestBreakpointInMemberFuncWNonPrimitiveParams.py (901 of 1983) PASS: lldb-unit :: Utility/./UtilityTests/OptionsWithRawTest.EmptySuffixSingleWhitespace (902 of 1983) PASS: lldb-api :: commands/target/create-deps/TestTargetCreateDeps.py (903 of 1983) PASS: lldb-api :: lang/cpp/dynamic-value/TestDynamicValue.py (904 of 1983) PASS: lldb-unit :: Host/./HostTests/NativeProcessProtocolTest.SetBreakpointFailRead (905 of 1983) PASS: lldb-unit :: Utility/./UtilityTests/SerializationRountripTest.SerializeDeserializeCStringArray (906 of 1983) PASS: lldb-api :: linux/builtin_trap/TestBuiltinTrap.py (907 of 1983) PASS: lldb-shell :: ObjectFile/MachO/subsections.yaml (908 of 1983) PASS: lldb-api :: functionalities/data-formatter/data-formatter-cpp/TestDataFormatterCpp.py (909 of 1983) PASS: lldb-api :: functionalities/gdb_remote_client/TestPlatformClient.py (910 of 1983) PASS: lldb-api :: commands/expression/anonymous-struct/TestCallUserAnonTypedef.py (911 of 1983) PASS: lldb-unit :: Utility/./UtilityTests/Flags.Clear (912 of 1983) PASS: lldb-unit :: Platform/./LLDBPlatformTests/PlatformDarwinTest.FindComponentInPath (913 of 1983) PASS: lldb-unit :: Utility/./UtilityTests/StreamTest.PutChar (914 of 1983) PASS: lldb-unit :: Utility/./UtilityTests/OptionsWithRawTest.WhitespaceInput (915 of 1983) PASS: lldb-unit :: Symbol/./SymbolTests/TestTypeSystemClang.TestGetEnumIntegerTypeBasicTypes (916 of 1983) PASS: lldb-api :: lang/objcxx/class-name-clash/TestNameClash.py (917 of 1983) PASS: lldb-api :: tools/lldb-vscode/launch/TestVSCode_launch.py (918 of 1983) PASS: lldb-unit :: Language/Highlighting/./HighlighterTests/HighlighterTest.ClangBraces (919 of 1983) PASS: lldb-unit :: Utility/./UtilityTests/StreamTest.PutBytesAsRawHex8ToBigEndian (920 of 1983) PASS: lldb-unit :: Symbol/./SymbolTests/TestClangASTImporter.CanImportInvalidType (921 of 1983) PASS: lldb-unit :: UnwindAssembly/x86/./UnwindAssemblyx86Tests/Testx86AssemblyInspectionEngine.TestPushEDX (922 of 1983) PASS: lldb-shell :: SymbolFile/DWARF/debug_loc-aslr.s (923 of 1983) PASS: lldb-unit :: SymbolFile/NativePDB/./SymbolFileNativePDBTests/PDBFPOProgramToDWARFExpressionTests.UnknownOp (924 of 1983) PASS: lldb-unit :: SymbolFile/NativePDB/./SymbolFileNativePDBTests/PDBFPOProgramToDWARFExpressionTests.UnresolvedDependentCyclicRegisterAssignmentReference (925 of 1983) PASS: lldb-unit :: Utility/./UtilityTests/CompletionRequest.TryCompleteCurrentArgMode (926 of 1983) PASS: lldb-api :: functionalities/data-formatter/data-formatter-categories/TestDataFormatterCategories.py (927 of 1983) PASS: lldb-unit :: Utility/./UtilityTests/UriParserTest.BracketedHostnameWithPortIPv6 (928 of 1983) PASS: lldb-api :: lang/cpp/llvm-style/TestLLVMStyle.py (929 of 1983) PASS: lldb-unit :: Utility/./UtilityTests/ScalarTest.RightShiftOperator (930 of 1983) PASS: lldb-api :: python_api/frame/TestFrames.py (931 of 1983) PASS: lldb-unit :: Utility/./UtilityTests/StringExtractorTest.GetHexU8_Extra (932 of 1983) PASS: lldb-unit :: Utility/./UtilityTests/RangeTest.SetRangeBase (933 of 1983) PASS: lldb-api :: lang/cpp/nested-class-other-compilation-unit/TestNestedClassWithParentInAnotherCU.py (934 of 1983) PASS: lldb-shell :: Minidump/disassemble-no-module.yaml (935 of 1983) PASS: lldb-unit :: Editline/./EditlineTests/EditlineTestFixture.EditlineReceivesMultiLineText (936 of 1983) PASS: lldb-api :: sanity/TestModuleCacheSanity.py (937 of 1983) PASS: lldb-api :: python_api/watchpoint/watchlocation/TestTargetWatchAddress.py (938 of 1983) PASS: lldb-shell :: ExecControl/StopHook/stop-hook.test (939 of 1983) PASS: lldb-api :: lang/c/step-target/TestStepTarget.py (940 of 1983) PASS: lldb-unit :: Utility/./UtilityTests/SerializationRountripTest.SerializeDeserializePodPointers (941 of 1983) PASS: lldb-unit :: ObjectFile/Breakpad/./ObjectFileBreakpadTests/InfoRecord.parse (942 of 1983) PASS: lldb-api :: functionalities/data-formatter/data-formatter-objc/TestDataFormatterObjCNSBundle.py (943 of 1983) PASS: lldb-unit :: Utility/./UtilityTests/ArgsTest.ReplaceArgumentAtIndexShort (944 of 1983) PASS: lldb-api :: commands/expression/call-throws/TestCallThatThrows.py (945 of 1983) PASS: lldb-unit :: Process/gdb-remote/./ProcessGdbRemoteTests/GDBRemoteClientBaseTest.InterruptNoResponse (946 of 1983) PASS: lldb-api :: functionalities/conditional_break/TestConditionalBreak.py (947 of 1983) PASS: lldb-unit :: Symbol/./SymbolTests/TestTypeSystemClang.TestGetTypeClassDeclType (948 of 1983) PASS: lldb-api :: functionalities/thread/step_out/TestThreadStepOut.py (949 of 1983) PASS: lldb-unit :: Utility/./UtilityTests/ProcessInstanceInfo.Dump (950 of 1983) PASS: lldb-unit :: Symbol/./SymbolTests/TestTypeSystemClang.TestDisplayNameEmpty (951 of 1983) PASS: lldb-unit :: Utility/./UtilityTests/UriParserTest.SchemeHostSeparator3 (952 of 1983) PASS: lldb-shell :: SymbolFile/DWARF/debug_rnglists.s (953 of 1983) UNSUPPORTED: lldb-shell :: ObjectFile/PECOFF/disassemble-thumb.yaml (954 of 1983) PASS: lldb-api :: functionalities/postmortem/minidump-new/TestMiniDumpUUID.py (955 of 1983) PASS: lldb-unit :: Utility/./UtilityTests/StreamTest.PutBytesAsRawHex8ToLittleEndian (956 of 1983) PASS: lldb-unit :: Utility/./UtilityTests/OptionsWithRawTest.WhitespaceSuffix (957 of 1983) PASS: lldb-unit :: Utility/./UtilityTests/GeneratorTest.Get (958 of 1983) PASS: lldb-unit :: Utility/./UtilityTests/SerializationRountripTest.SerializeDeserializePodReferences (959 of 1983) PASS: lldb-unit :: Language/Highlighting/./HighlighterTests/HighlighterTest.ClangCommas (960 of 1983) PASS: lldb-api :: commands/expression/no-deadlock/TestExprDoesntBlock.py (961 of 1983) PASS: lldb-api :: functionalities/inferior-crashing/TestInferiorCrashingStep.py (962 of 1983) PASS: lldb-shell :: SymbolFile/DWARF/find-variable-file.cpp (963 of 1983) UNSUPPORTED: lldb-shell :: Register/aarch64-fp-read.test (964 of 1983) PASS: lldb-api :: macosx/thread_suspend/TestInternalThreadSuspension.py (965 of 1983) PASS: lldb-unit :: Symbol/./SymbolTests/PostfixExpression.ParseOneExpression (966 of 1983) PASS: lldb-api :: commands/expression/ir-interpreter/TestIRInterpreter.py (967 of 1983) PASS: lldb-api :: commands/expression/persistent_variables/TestPersistentVariables.py (968 of 1983) PASS: lldb-shell :: SymbolFile/DWARF/debug-types-line-tables.s (969 of 1983) PASS: lldb-shell :: SymbolFile/DWARF/DW_OP_piece-struct.s (970 of 1983) PASS: lldb-shell :: Host/TestCustomShell.test (971 of 1983) PASS: lldb-api :: python_api/sbenvironment/TestSBEnvironment.py (972 of 1983) PASS: lldb-api :: commands/expression/regression-access-function-template-in-record/TestRegressionAccessFunctionTemplateInRecord.py (973 of 1983) PASS: lldb-api :: functionalities/thread/concurrent_events/TestConcurrentSignalWatch.py (974 of 1983) PASS: lldb-unit :: UnwindAssembly/x86/./UnwindAssemblyx86Tests/Testx86AssemblyInspectionEngine.TestSubESP (975 of 1983) PASS: lldb-unit :: Symbol/./SymbolTests/DWARFCallFrameInfoTest.Basic_dwarf3 (976 of 1983) PASS: lldb-api :: functionalities/thread/thread_specific_break/TestThreadSpecificBreakpoint.py (977 of 1983) PASS: lldb-api :: functionalities/postmortem/minidump/TestMiniDump.py (978 of 1983) PASS: lldb-unit :: Utility/./UtilityTests/RangeTest.Union (979 of 1983) PASS: lldb-shell :: SymbolFile/DWARF/find-variable-dwo.cpp (980 of 1983) PASS: lldb-unit :: Utility/./UtilityTests/AnsiTerminal.Empty (981 of 1983) PASS: lldb-unit :: Symbol/./SymbolTests/TestClangASTImporter.DeportDeclTagDecl (982 of 1983) PASS: lldb-api :: functionalities/archives/TestBSDArchives.py (983 of 1983) PASS: lldb-unit :: Utility/./UtilityTests/ScalarTest.GetValue (984 of 1983) PASS: lldb-unit :: Utility/./UtilityTests/StringListTest.LongestCommonPrefixNoPrefix (985 of 1983) PASS: lldb-api :: functionalities/thread/concurrent_events/TestConcurrentTwoBreakpointsOneDelaySignal.py (986 of 1983) PASS: lldb-unit :: Utility/./UtilityTests/ProcessInstanceInfo.Yaml (987 of 1983) PASS: lldb-api :: lang/cpp/bool/TestCPPBool.py (988 of 1983) PASS: lldb-api :: macosx/profile_vrs_detach/TestDetachVrsProfile.py (989 of 1983) PASS: lldb-unit :: Utility/./UtilityTests/ArgsTest.TestSingleQuotedArgWithSpace (990 of 1983) PASS: lldb-unit :: Utility/./UtilityTests/StringListTest.GetMaxStringLengthEqualSize (991 of 1983) XFAIL: lldb-shell :: Register/x86-64-write.test (992 of 1983) PASS: lldb-unit :: Utility/./UtilityTests/StringExtractorTest.GetHexU8_Underflow (993 of 1983) PASS: lldb-api :: functionalities/data-formatter/data-formatter-stl/libcxx/function/TestLibCxxFunction.py (994 of 1983) PASS: lldb-unit :: Utility/./UtilityTests/TildeExpressionResolver.ResolveFullPath (995 of 1983) PASS: lldb-api :: commands/expression/call-function/TestCallStdStringFunction.py (996 of 1983) PASS: lldb-unit :: Language/Highlighting/./HighlighterTests/HighlighterTest.ClangOperators (997 of 1983) PASS: lldb-unit :: Utility/./UtilityTests/VASprintfTest.EncodingError (998 of 1983) PASS: lldb-unit :: SymbolFile/NativePDB/./SymbolFileNativePDBTests/PDBFPOProgramToDWARFExpressionTests.MultipleDependentAssignments (999 of 1983) PASS: lldb-api :: lang/objc/global_ptrs/TestGlobalObjects.py (1000 of 1983) PASS: lldb-unit :: Utility/./UtilityTests/IndexToObjectTest.ObjectForIndex (1001 of 1983) PASS: lldb-unit :: Utility/./UtilityTests/StreamTest.ShiftOperatorChars (1002 of 1983) PASS: lldb-api :: functionalities/backticks/TestBackticksWithoutATarget.py (1003 of 1983) PASS: lldb-unit :: Language/Highlighting/./HighlighterTests/HighlighterTest.ClangTrailingBackslashWithWhitespace (1004 of 1983) PASS: lldb-unit :: Host/./HostTests/TaskPoolTest.AddTask (1005 of 1983) PASS: lldb-unit :: Utility/./UtilityTests/ArgsTest.TestQuotedTrailingBackslash (1006 of 1983) UNSUPPORTED: lldb-api :: functionalities/darwin_log/filter/exact_match/activity-chain/TestDarwinLogFilterMatchActivityChain.py (1007 of 1983) PASS: lldb-api :: types/TestRecursiveTypes.py (1008 of 1983) PASS: lldb-unit :: Process/minidump/./LLDBMinidumpTests/MinidumpParserTest.GetArchitecture (1009 of 1983) PASS: lldb-unit :: Utility/./UtilityTests/RangeTest.SizeTypes (1010 of 1983) XFAIL: lldb-shell :: Unwind/prefer-debug-over-eh-frame.test (1011 of 1983) PASS: lldb-api :: commands/expression/import-std-module/unique_ptr/TestUniquePtrFromStdModule.py (1012 of 1983) PASS: lldb-unit :: Utility/./UtilityTests/StreamTeeTest.Constructor1Stream (1013 of 1983) PASS: lldb-api :: functionalities/data-formatter/data-formatter-objc/TestDataFormatterObjNSException.py (1014 of 1983) PASS: lldb-unit :: Utility/./UtilityTests/ReproducerTest.SetReplay (1015 of 1983) PASS: lldb-unit :: Signals/./SignalsTests/UnixSignalsTest.GetFilteredSignals (1016 of 1983) PASS: lldb-shell :: Watchpoint/SetErrorCases.test (1017 of 1983) PASS: lldb-unit :: UnwindAssembly/x86/./UnwindAssemblyx86Tests/Testx86AssemblyInspectionEngine.TestPushECX (1018 of 1983) PASS: lldb-api :: python_api/file_handle/TestFileHandle.py (1019 of 1983) PASS: lldb-unit :: Utility/./UtilityTests/StringListTest.JoinThree (1020 of 1983) PASS: lldb-unit :: Language/Highlighting/./HighlighterTests/HighlighterTest.ClangCursorPos (1021 of 1983) UNSUPPORTED: lldb-api :: functionalities/data-formatter/data-formatter-stl/libstdcpp/map/TestDataFormatterStdMap.py (1022 of 1983) PASS: lldb-api :: python_api/interpreter/TestRunCommandInterpreterAPI.py (1023 of 1983) PASS: lldb-shell :: Register/x86-64-ymm-read.test (1024 of 1983) PASS: lldb-api :: lang/c/unions/TestUnionMembers.py (1025 of 1983) PASS: lldb-unit :: Utility/./UtilityTests/StringListTest.SplitIntoLines (1026 of 1983) PASS: lldb-api :: functionalities/paths/TestPaths.py (1027 of 1983) PASS: lldb-unit :: Utility/./UtilityTests/StreamTest.ShiftOperatorPtr (1028 of 1983) PASS: lldb-api :: tools/lldb-vscode/stackTrace/TestVSCode_stackTrace.py (1029 of 1983) PASS: lldb-unit :: Utility/./UtilityTests/Flags.AllClear (1030 of 1983) PASS: lldb-unit :: Host/./HostTests/ConnectionFileDescriptorTest.TCPGetURIv4 (1031 of 1983) PASS: lldb-api :: commands/target/basic/TestTargetCommand.py (1032 of 1983) PASS: lldb-api :: python_api/signals/TestSignalsAPI.py (1033 of 1983) PASS: lldb-unit :: Host/./HostTests/MainLoopTest.Signal (1034 of 1983) PASS: lldb-unit :: Utility/./UtilityTests/ProcessInstanceInfoMatch.Name (1035 of 1983) PASS: lldb-unit :: ScriptInterpreter/Python/./ScriptInterpreterPythonTests/PythonDataObjectsTest.TestPythonTupleToStructuredList (1036 of 1983) PASS: lldb-shell :: SymbolFile/DWARF/debug-names-compressed.cpp (1037 of 1983) PASS: lldb-unit :: Utility/./UtilityTests/StreamTest.PutMaxHex64ByteOrderLittle (1038 of 1983) PASS: lldb-api :: lang/objc/objc-static-method/TestObjCStaticMethod.py (1039 of 1983) PASS: lldb-unit :: SymbolFile/DWARF/./SymbolFileDWARFTests/SymbolFileDWARFTests.TestAbbrevInvalidNULLTag (1040 of 1983) PASS: lldb-unit :: Utility/./UtilityTests/StringExtractorTest.GetHexBytesAvail_OddPair (1041 of 1983) UNSUPPORTED: lldb-shell :: Register/x86-64-xmm16-write.test (1042 of 1983) PASS: lldb-api :: lang/cpp/char1632_t/TestChar1632T.py (1043 of 1983) PASS: lldb-api :: functionalities/data-formatter/synthcapping/TestSyntheticCapping.py (1044 of 1983) PASS: lldb-api :: lang/objc/modules-non-objc-target/TestObjCModulesNonObjCTarget.py (1045 of 1983) PASS: lldb-api :: functionalities/multiword-commands/TestMultiWordCommands.py (1046 of 1983) PASS: lldb-api :: macosx/find-app-in-bundle/TestFindAppInBundle.py (1047 of 1983) PASS: lldb-unit :: Utility/./UtilityTests/FileSpecTest.EqualDotsWindows (1048 of 1983) PASS: lldb-api :: lang/c/tls_globals/TestTlsGlobals.py (1049 of 1983) PASS: lldb-unit :: Process/gdb-remote/./ProcessGdbRemoteTests/GDBRemoteCommunicationServerTest.SendErrorResponse_ErrorNumber (1050 of 1983) PASS: lldb-api :: functionalities/tail_call_frames/cross_dso/TestCrossDSOTailCalls.py (1051 of 1983) PASS: lldb-api :: commands/expression/completion-crash-incomplete-record/TestCompletionCrashIncompleteRecord.py (1052 of 1983) UNSUPPORTED: lldb-shell :: SymbolFile/NativePDB/ast-functions-msvc.cpp (1053 of 1983) PASS: lldb-api :: functionalities/data-formatter/data-formatter-stl/libcxx/list/TestDataFormatterLibcxxList.py (1054 of 1983) PASS: lldb-api :: python_api/class_members/TestSBTypeClassMembers.py (1055 of 1983) UNSUPPORTED: lldb-api :: functionalities/data-formatter/data-formatter-stl/libstdcpp/smart_ptr/TestDataFormatterStdSmartPtr.py (1056 of 1983) PASS: lldb-unit :: Utility/./UtilityTests/StatusTest.ErrorConversion (1057 of 1983) PASS: lldb-api :: python_api/lldbutil/process/TestPrintStackTraces.py (1058 of 1983) PASS: lldb-api :: lang/c/offsetof/TestOffsetof.py (1059 of 1983) UNSUPPORTED: lldb-api :: lang/objc/rdar-12408181/TestRdar12408181.py (1060 of 1983) PASS: lldb-api :: functionalities/mtc/simple/TestMTCSimple.py (1061 of 1983) PASS: lldb-unit :: Utility/./UtilityTests/RangeTest.ContainsAddrInvalid (1062 of 1983) PASS: lldb-api :: commands/expression/import-std-module/list-dbg-info-content/TestDbgInfoContentListFromStdModule.py (1063 of 1983) PASS: lldb-unit :: Utility/./UtilityTests/ScalarTest.GetBytes (1064 of 1983) PASS: lldb-api :: lang/cpp/global_variables/TestCPPGlobalVariables.py (1065 of 1983) PASS: lldb-api :: tools/lldb-server/TestGdbRemoteAttach.py (1066 of 1983) PASS: lldb-unit :: Utility/./UtilityTests/OptionsWithRawTest.EmptyArgsOnlySuffix (1067 of 1983) PASS: lldb-unit :: Interpreter/./InterpreterTests/OptionArgParserTest.toChar (1068 of 1983) PASS: lldb-api :: commands/expression/dollar-in-variable/TestDollarInVariable.py (1069 of 1983) PASS: lldb-api :: lang/cpp/breakpoint-commands/TestCPPBreakpointCommands.py (1070 of 1983) PASS: lldb-api :: functionalities/recursion/TestValueObjectRecursion.py (1071 of 1983) PASS: lldb-api :: commands/expression/issue_11588/Test11588.py (1072 of 1983) PASS: lldb-shell :: Breakpoint/split-dwarf5-debug-stroffsets.test (1073 of 1983) PASS: lldb-api :: lang/cpp/bitfields/TestCppBitfields.py (1074 of 1983) PASS: lldb-api :: functionalities/avoids-fd-leak/TestFdLeak.py (1075 of 1983) PASS: lldb-unit :: Utility/./UtilityTests/BinaryStreamTest.PutULEB128EightBytes (1076 of 1983) PASS: lldb-unit :: Utility/./UtilityTests/ArgsTest.DoubleQuotedItem (1077 of 1983) PASS: lldb-api :: functionalities/inferior-crashing/TestInferiorCrashing.py (1078 of 1983) UNSUPPORTED: lldb-api :: python_api/disassemble-raw-data/TestDisassemble_VST1_64.py (1079 of 1983) PASS: lldb-api :: functionalities/thread/concurrent_events/TestConcurrentDelayedCrashWithBreakpointWatchpoint.py (1080 of 1983) PASS: lldb-shell :: Minidump/no-process-id.yaml (1081 of 1983) UNSUPPORTED: lldb-shell :: BuildScript/toolchain-clang-cl.test (1082 of 1983) PASS: lldb-unit :: Platform/./LLDBPlatformTests/PlatformDarwinTest.GetSDKNameForType (1083 of 1983) PASS: lldb-shell :: ObjectFile/ELF/compressed-sections.yaml (1084 of 1983) PASS: lldb-unit :: Utility/./UtilityTests/StreamTest.AddressSize (1085 of 1983) PASS: lldb-api :: lang/c/forward/TestForwardDeclaration.py (1086 of 1983) PASS: lldb-unit :: Host/./HostTests/TaskPoolTest.RunTasks (1087 of 1983) PASS: lldb-unit :: Utility/./UtilityTests/ArgsTest.ReplaceArgumentAtIndexOutOfRange (1088 of 1983) PASS: lldb-api :: commands/command/invalid-args/TestInvalidArgsCommand.py (1089 of 1983) PASS: lldb-api :: functionalities/target_var/TestTargetVar.py (1090 of 1983) PASS: lldb-unit :: Language/CPlusPlus/./LanguageCPlusPlusTests/CPlusPlusLanguage.CPlusPlusNameParser (1091 of 1983) PASS: lldb-unit :: Process/minidump/./LLDBMinidumpTests/RegisterContextMinidump.CheckRegisterContextMinidump_ARM (1092 of 1983) PASS: lldb-api :: sample_test/TestSampleInlineTest.py (1093 of 1983) PASS: lldb-unit :: UnwindAssembly/x86/./UnwindAssemblyx86Tests/Testx86AssemblyInspectionEngine.TestSimplex86_64Augmented (1094 of 1983) PASS: lldb-api :: functionalities/breakpoint/cpp/TestCPPBreakpointLocations.py (1095 of 1983) PASS: lldb-unit :: Utility/./UtilityTests/StringExtractorTest.DecodeHexU8_InvalidHex2 (1096 of 1983) PASS: lldb-unit :: Utility/./UtilityTests/NameMatchesTest.Ignore (1097 of 1983) PASS: lldb-unit :: Utility/./UtilityTests/StringListTest.LongestCommonPrefixEmpty (1098 of 1983) PASS: lldb-api :: commands/watchpoints/watchpoint_count/TestWatchpointCount.py (1099 of 1983) PASS: lldb-unit :: UnwindAssembly/x86/./UnwindAssemblyx86Tests/Testx86AssemblyInspectionEngine.TestStackRealign32BitDisp_x86_64 (1100 of 1983) PASS: lldb-api :: functionalities/dead-strip/TestDeadStrip.py (1101 of 1983) PASS: lldb-api :: python_api/type/TestTypeList.py (1102 of 1983) UNSUPPORTED: lldb-api :: iohandler/completion/TestIOHandlerCompletion.py (1103 of 1983) PASS: lldb-shell :: Commands/command-regex-delete.test (1104 of 1983) PASS: lldb-unit :: Utility/./UtilityTests/RangeDataVector.FindEntryIndexesThatContain_Overlap (1105 of 1983) PASS: lldb-api :: functionalities/memory/read/TestMemoryRead.py (1106 of 1983) PASS: lldb-shell :: ObjectFile/ELF/gnu-debuglink.yaml (1107 of 1983) PASS: lldb-shell :: ObjectFile/MachO/lc_build_version.yaml (1108 of 1983) PASS: lldb-api :: tools/lldb-server/TestGdbRemoteThreadsInStopReply.py (1109 of 1983) PASS: lldb-api :: python_api/process/read-mem-cstring/TestReadMemCString.py (1110 of 1983) PASS: lldb-api :: functionalities/gdb_remote_client/TestRecognizeBreakpoint.py (1111 of 1983) PASS: lldb-api :: functionalities/breakpoint/breakpoint_by_line_and_column/TestBreakpointByLineAndColumn.py (1112 of 1983) PASS: lldb-unit :: UnwindAssembly/x86/./UnwindAssemblyx86Tests/Testx86AssemblyInspectionEngine.TestPopRBP (1113 of 1983) PASS: lldb-shell :: ObjectFile/ELF/base-address.yaml (1114 of 1983) PASS: lldb-api :: lang/objc/objc-ivar-offsets/TestObjCIvarOffsets.py (1115 of 1983) PASS: lldb-unit :: debugserver/./debugserverTests/RNBSocket.AnyListen (1116 of 1983) PASS: lldb-api :: commands/frame/diagnose/array/TestArray.py (1117 of 1983) PASS: lldb-unit :: tools/lldb-server/tests/./LLDBServerTests/TestBase.LaunchModePreservesEnvironment (1118 of 1983) PASS: lldb-api :: functionalities/return-value/TestReturnValue.py (1119 of 1983) PASS: lldb-api :: lang/cpp/rvalue-references/TestRvalueReferences.py (1120 of 1983) PASS: lldb-unit :: Utility/./UtilityTests/FileSpecTest.PrependPathComponent (1121 of 1983) PASS: lldb-unit :: ScriptInterpreter/Python/./ScriptInterpreterPythonTests/PythonDataObjectsTest.TestPythonListManipulation (1122 of 1983) PASS: lldb-api :: lang/cpp/class_static/TestStaticVariables.py (1123 of 1983) PASS: lldb-shell :: Reproducer/TestReuseDirectory.test (1124 of 1983) PASS: lldb-unit :: Utility/./UtilityTests/StringExtractorTest.GetHexBytesAvail_Underflow (1125 of 1983) PASS: lldb-api :: functionalities/breakpoint/address_breakpoints/TestBadAddressBreakpoints.py (1126 of 1983) UNSUPPORTED: lldb-shell :: SymbolFile/PDB/pointers.test (1127 of 1983) UNSUPPORTED: lldb-api :: tools/lldb-server/signal-filtering/TestGdbRemote_QPassSignals.py (1128 of 1983) PASS: lldb-api :: functionalities/deleted-executable/TestDeletedExecutable.py (1129 of 1983) PASS: lldb-unit :: Utility/./UtilityTests/EnvironmentTest.EnvpConstruction (1130 of 1983) PASS: lldb-api :: lang/c/local_variables/TestLocalVariables.py (1131 of 1983) PASS: lldb-shell :: SymbolFile/DWARF/parallel-indexing-stress.s (1132 of 1983) PASS: lldb-api :: commands/expression/import_builtin_fileid/TestImportBuiltinFileID.py (1133 of 1983) PASS: lldb-unit :: Utility/./UtilityTests/RegularExpression.CopyAssignment (1134 of 1983) PASS: lldb-api :: lang/cpp/this/TestCPPThis.py (1135 of 1983) PASS: lldb-unit :: Host/./HostTests/TaskPoolTest.TaskMap (1136 of 1983) PASS: lldb-api :: commands/expression/pr35310/TestExprsBug35310.py (1137 of 1983) PASS: lldb-unit :: Utility/./UtilityTests/StringExtractorTest.GetHexBytes_OddPair2 (1138 of 1983) PASS: lldb-api :: commands/version/TestVersion.py (1139 of 1983) PASS: lldb-unit :: Utility/./UtilityTests/RangeTest.EqualInvalid (1140 of 1983) PASS: lldb-shell :: SymbolFile/DWARF/debug_line-relative_path.s (1141 of 1983) PASS: lldb-unit :: Utility/./UtilityTests/AnsiTerminal.WhiteSpace (1142 of 1983) PASS: lldb-api :: lang/objc/objc-runtime-ivars/TestRuntimeIvars.py (1143 of 1983) PASS: lldb-unit :: ObjectFile/PECOFF/./ObjectFilePECOFFTests/PECallFrameInfoTest.Chained_eh (1144 of 1983) PASS: lldb-unit :: UnwindAssembly/x86/./UnwindAssemblyx86Tests/Testx86AssemblyInspectionEngine.TestPopRBX (1145 of 1983) PASS: lldb-api :: commands/log/basic/TestLogging.py (1146 of 1983) PASS: lldb-unit :: Process/minidump/./LLDBMinidumpTests/MinidumpParserTest.MinidumpModuleOrder (1147 of 1983) PASS: lldb-unit :: UnwindAssembly/x86/./UnwindAssemblyx86Tests/Testx86AssemblyInspectionEngine.Test64bitFramelessSmallStackFrame (1148 of 1983) PASS: lldb-api :: lang/objc/print-obj/TestPrintObj.py (1149 of 1983) UNSUPPORTED: lldb-api :: benchmarks/turnaround/TestCompileRunToBreakpointTurnaround.py (1150 of 1983) PASS: lldb-unit :: UnwindAssembly/x86/./UnwindAssemblyx86Tests/Testx86AssemblyInspectionEngine.Test64bitFramelessBigStackFrame (1151 of 1983) PASS: lldb-api :: commands/expression/calculator_mode/TestCalculatorMode.py (1152 of 1983) PASS: lldb-api :: functionalities/process_crash_info/TestProcessCrashInfo.py (1153 of 1983) PASS: lldb-shell :: SymbolFile/Breakpad/line-table-mixed-path-styles.test (1154 of 1983) PASS: lldb-unit :: Utility/./UtilityTests/RangeTest.ContainsAddr (1155 of 1983) PASS: lldb-api :: functionalities/data-formatter/data-formatter-disabling/TestDataFormatterDisabling.py (1156 of 1983) PASS: lldb-shell :: Settings/TestLineMarkerColor.test (1157 of 1983) PASS: lldb-api :: commands/watchpoints/multiple_hits/TestMultipleHits.py (1158 of 1983) PASS: lldb-unit :: UnwindAssembly/x86/./UnwindAssemblyx86Tests/Testx86AssemblyInspectionEngine.TestSpArithx86_64Augmented (1159 of 1983) XFAIL: lldb-shell :: Register/x86-mm-xmm-write.test (1160 of 1983) PASS: lldb-shell :: Reproducer/TestDriverOptions.test (1161 of 1983) PASS: lldb-unit :: Language/Highlighting/./HighlighterTests/HighlighterTest.Colons (1162 of 1983) PASS: lldb-unit :: Process/gdb-remote/./ProcessGdbRemoteTests/GDBRemoteClientBaseTest.SendContinueAndInterrupt (1163 of 1983) PASS: lldb-api :: functionalities/breakpoint/source_regexp/TestSourceRegexBreakpoints.py (1164 of 1983) PASS: lldb-shell :: SymbolFile/DWARF/find-method-local-struct.cpp (1165 of 1983) PASS: lldb-unit :: tools/lldb-server/tests/./LLDBServerTests/TestBase.DebugserverEnv (1166 of 1983) PASS: lldb-unit :: ScriptInterpreter/Python/./ScriptInterpreterPythonTests/PythonDataObjectsTest.TestPythonBytes (1167 of 1983) PASS: lldb-unit :: SymbolFile/DWARF/./SymbolFileDWARFTests/SymbolFileDWARFTests.TestAbbrevOutOfOrder (1168 of 1983) PASS: lldb-shell :: BuildScript/script-args.test (1169 of 1983) UNSUPPORTED: lldb-api :: commands/watchpoints/variable_out_of_scope/TestWatchedVarHitWhenInScope.py (1170 of 1983) PASS: lldb-api :: lang/cpp/class_types/TestClassTypesDisassembly.py (1171 of 1983) PASS: lldb-unit :: Language/Highlighting/./HighlighterTests/HighlighterTest.Keywords (1172 of 1983) PASS: lldb-unit :: Utility/./UtilityTests/ProcessInstanceInfo.DumpTable (1173 of 1983) PASS: lldb-api :: lang/c/modules/TestCModules.py (1174 of 1983) PASS: lldb-unit :: Utility/./UtilityTests/StringExtractorTest.GetHexBytes_FullString (1175 of 1983) PASS: lldb-api :: commands/expression/vector_of_enums/TestVectorOfEnums.py (1176 of 1983) PASS: lldb-api :: commands/frame/diagnose/dereference-this/TestDiagnoseDereferenceThis.py (1177 of 1983) UNSUPPORTED: lldb-shell :: ScriptInterpreter/Lua/convenience_variables.test (1178 of 1983) PASS: lldb-shell :: ObjectFile/ELF/many-sections.s (1179 of 1983) PASS: lldb-shell :: ObjectFile/ELF/netbsd-exec-8.99.30-amd64.yaml (1180 of 1983) PASS: lldb-unit :: Utility/./UtilityTests/StreamTeeTest.Flush (1181 of 1983) PASS: lldb-shell :: ObjectFile/ELF/PT_TLS-overlap-PT_LOAD.yaml (1182 of 1983) PASS: lldb-unit :: Symbol/./SymbolTests/TestTypeSystemClang.TestRemoveFastQualifiers (1183 of 1983) PASS: lldb-unit :: UnwindAssembly/x86/./UnwindAssemblyx86Tests/Testx86AssemblyInspectionEngine.TestSimple64bitFrameFunction (1184 of 1983) UNSUPPORTED: lldb-shell :: ScriptInterpreter/Lua/watchpoint_callback.test (1185 of 1983) PASS: lldb-unit :: Utility/./UtilityTests/ScalarTest.CastOperations (1186 of 1983) PASS: lldb-api :: sanity/TestSettingSkipping.py (1187 of 1983) PASS: lldb-api :: macosx/dyld-trie-symbols/TestDyldTrieSymbols.py (1188 of 1983) PASS: lldb-api :: functionalities/thread/concurrent_events/TestConcurrentTwoWatchpointsOneBreakpoint.py (1189 of 1983) PASS: lldb-api :: functionalities/gdb_remote_client/TestThreadSelectionBug.py (1190 of 1983) PASS: lldb-unit :: Utility/./UtilityTests/StringExtractorTest.GetHexBytesAvail_OddPair2 (1191 of 1983) PASS: lldb-unit :: Expression/./ExpressionTests/CppModuleConfigurationTest.AmbiguousCLib (1192 of 1983) PASS: lldb-unit :: Utility/./UtilityTests/StringListTest.SetSize (1193 of 1983) PASS: lldb-api :: functionalities/memory/find/TestMemoryFind.py (1194 of 1983) PASS: lldb-api :: functionalities/breakpoint/breakpoint_command/TestBreakpointCommandsFromPython.py (1195 of 1983) PASS: lldb-api :: functionalities/data-formatter/var-in-aggregate-misuse/TestVarInAggregateMisuse.py (1196 of 1983) PASS: lldb-unit :: Utility/./UtilityTests/GeneratorTest.Create (1197 of 1983) PASS: lldb-unit :: Language/Highlighting/./HighlighterTests/HighlighterTest.FallbackHighlighter (1198 of 1983) PASS: lldb-unit :: Host/./HostTests/FileSystemTest.OpenErrno (1199 of 1983) PASS: lldb-unit :: UnwindAssembly/x86/./UnwindAssemblyx86Tests/Testx86AssemblyInspectionEngine.TestPushExtended (1200 of 1983) PASS: lldb-api :: macosx/universal/TestUniversal.py (1201 of 1983) PASS: lldb-shell :: Settings/TestFrameFormatColor.test (1202 of 1983) PASS: lldb-unit :: Utility/./UtilityTests/SerializationRountripTest.SerializeDeserializeCStringNull (1203 of 1983) PASS: lldb-unit :: Process/minidump/./LLDBMinidumpTests/MinidumpParserTest.GetFilteredModuleList (1204 of 1983) PASS: lldb-api :: lang/c/blocks/TestBlocks.py (1205 of 1983) PASS: lldb-api :: functionalities/data-formatter/data-formatter-objc/TestDataFormatterObjCKVO.py (1206 of 1983) PASS: lldb-unit :: Host/./HostTests/SocketTest.DomainGetConnectURI (1207 of 1983) PASS: lldb-unit :: Utility/./UtilityTests/StreamTeeTest.DefaultConstructor (1208 of 1983) PASS: lldb-unit :: Host/./HostTests/SocketTest.TCPGetConnectURI (1209 of 1983) PASS: lldb-api :: lang/objc/foundation/TestObjCMethods2.py (1210 of 1983) PASS: lldb-unit :: Utility/./UtilityTests/StructuredDataTest.StringDump (1211 of 1983) PASS: lldb-unit :: Host/./HostTests/HostInfoTest.GetAugmentedArchSpec (1212 of 1983) UNSUPPORTED: lldb-api :: functionalities/darwin_log/source/info/TestDarwinLogSourceInfo.py (1213 of 1983) PASS: lldb-api :: lang/objc/objc_direct-methods/TestObjCDirectMethods.py (1214 of 1983) PASS: lldb-unit :: UnwindAssembly/x86/./UnwindAssemblyx86Tests/Testx86AssemblyInspectionEngine.TestMovRSPtoRBP (1215 of 1983) UNSUPPORTED: lldb-shell :: Minidump/Windows/arm-fp-unwind.test (1216 of 1983) PASS: lldb-shell :: SymbolFile/DWARF/dwarf5-atomic.s (1217 of 1983) UNSUPPORTED: lldb-api :: benchmarks/expression/TestExpressionCmd.py (1218 of 1983) PASS: lldb-api :: api/log/TestAPILog.py (1219 of 1983) PASS: lldb-api :: lang/c/unicode/TestUnicodeSymbols.py (1220 of 1983) PASS: lldb-unit :: UnwindAssembly/x86/./UnwindAssemblyx86Tests/Testx86AssemblyInspectionEngine.TestPushEAX (1221 of 1983) PASS: lldb-api :: commands/expression/top-level/TestTopLevelExprs.py (1222 of 1983) PASS: lldb-shell :: Quit/TestQuitExitCode0.test (1223 of 1983) PASS: lldb-shell :: ObjectFile/PECOFF/uuid.yaml (1224 of 1983) PASS: lldb-api :: functionalities/breakpoint/breakpoint_locations/TestBreakpointLocations.py (1225 of 1983) PASS: lldb-api :: functionalities/thread/concurrent_events/TestConcurrentSignalWatchBreak.py (1226 of 1983) UNSUPPORTED: lldb-shell :: SymbolFile/PDB/class-layout.test (1227 of 1983) PASS: lldb-api :: commands/log/invalid-args/TestInvalidArgsLog.py (1228 of 1983) PASS: lldb-unit :: debugserver/./debugserverTests/RNBSocket.LoopBackListenIPv6 (1229 of 1983) PASS: lldb-unit :: Utility/./UtilityTests/RangeTest.SlideZero (1230 of 1983) PASS: lldb-unit :: Utility/./UtilityTests/BinaryStreamTest.PutULEB128OneByte (1231 of 1983) PASS: lldb-unit :: SymbolFile/NativePDB/./SymbolFileNativePDBTests/PDBFPOProgramToDWARFExpressionTests.UnsupportedRASearch (1232 of 1983) PASS: lldb-unit :: Utility/./UtilityTests/RangeTest.DefaultConstructor (1233 of 1983) PASS: lldb-api :: commands/command/script_alias/TestCommandScriptAlias.py (1234 of 1983) PASS: lldb-unit :: ScriptInterpreter/Python/./ScriptInterpreterPythonTests/PythonDataObjectsTest.TestPythonTupleValues (1235 of 1983) PASS: lldb-api :: functionalities/breakpoint/dummy_target_breakpoints/TestBreakpointsWithNoTargets.py (1236 of 1983) PASS: lldb-api :: functionalities/gdb_remote_client/TestNestedRegDefinitions.py (1237 of 1983) PASS: lldb-api :: functionalities/pre_run_dylibs/TestPreRunDylibs.py (1238 of 1983) PASS: lldb-shell :: Breakpoint/split-dwarf-5-addrbase.test (1239 of 1983) PASS: lldb-unit :: UnwindAssembly/x86/./UnwindAssemblyx86Tests/Testx86AssemblyInspectionEngine.TestPushRBPWithREX (1240 of 1983) PASS: lldb-unit :: Utility/./UtilityTests/StringListTest.JoinEmpty (1241 of 1983) PASS: lldb-unit :: Utility/./UtilityTests/BinaryStreamTest.PutSLEB128FiveBytes (1242 of 1983) PASS: lldb-api :: functionalities/data-formatter/data-formatter-objc/TestDataFormatterObjCPlain.py (1243 of 1983) PASS: lldb-unit :: Process/minidump/./LLDBMinidumpTests/MinidumpParserTest.GetArchitectureWindows (1244 of 1983) PASS: lldb-unit :: ScriptInterpreter/Python/./ScriptInterpreterPythonTests/PythonDataObjectsTest.TestPythonDictionaryValueEquality (1245 of 1983) PASS: lldb-api :: commands/process/attach/attach_denied/TestAttachDenied.py (1246 of 1983) UNSUPPORTED: lldb-shell :: ScriptInterpreter/Lua/command_script_import.test (1247 of 1983) PASS: lldb-unit :: Utility/./UtilityTests/StringListTest.Assignment (1248 of 1983) UNSUPPORTED: lldb-api :: functionalities/ubsan/basic/TestUbsanBasic.py (1249 of 1983) PASS: lldb-unit :: Language/Highlighting/./HighlighterTests/HighlighterTest.ClangCursorPosInOtherToken (1250 of 1983) PASS: lldb-unit :: Target/./TargetTests/PathMappingListTest.RemapRoot (1251 of 1983) PASS: lldb-shell :: Reproducer/Functionalities/TestImageList.test (1252 of 1983) UNSUPPORTED: lldb-api :: functionalities/darwin_log/basic/TestDarwinLogBasic.py (1253 of 1983) PASS: lldb-unit :: Utility/./UtilityTests/VMRange.IsValid (1254 of 1983) PASS: lldb-api :: functionalities/data-formatter/data-formatter-stl/libcxx/iterator/TestDataFormatterLibccIterator.py (1255 of 1983) PASS: lldb-api :: lang/cpp/const_this/TestConstThis.py (1256 of 1983) PASS: lldb-unit :: Process/gdb-remote/./ProcessGdbRemoteTests/GDBRemoteCommunicationClientTest.SyncThreadState (1257 of 1983) UNSUPPORTED: lldb-api :: functionalities/tsan/thread_leak/TestTsanThreadLeak.py (1258 of 1983) PASS: lldb-api :: commands/watchpoints/watchpoint_commands/condition/TestWatchpointConditionCmd.py (1259 of 1983) PASS: lldb-shell :: SymbolFile/NativePDB/ast-methods.cpp (1260 of 1983) PASS: lldb-api :: macosx/duplicate-archive-members/TestDuplicateMembers.py (1261 of 1983) PASS: lldb-api :: lang/objc/foundation/TestObjCMethodsNSError.py (1262 of 1983) PASS: lldb-api :: commands/watchpoints/watchpoint_set_command/TestWatchLocationWithWatchSet.py (1263 of 1983) PASS: lldb-api :: terminal/TestSTTYBeforeAndAfter.py (1264 of 1983) PASS: lldb-unit :: Core/./LLDBCoreTests/RichManglingContextTest.Basic (1265 of 1983) PASS: lldb-unit :: Utility/./UtilityTests/ArgsTest.TestQuotedUnknownEscape (1266 of 1983) PASS: lldb-api :: commands/frame/language/TestGuessLanguage.py (1267 of 1983) PASS: lldb-api :: functionalities/thread/concurrent_events/TestConcurrentWatchBreak.py (1268 of 1983) PASS: lldb-unit :: Utility/./UtilityTests/StreamTest.PutHex16ByteOrderBig (1269 of 1983) PASS: lldb-unit :: Utility/./UtilityTests/UriParserTest.LongPath (1270 of 1983) PASS: lldb-api :: lang/cpp/multiple-inheritance/TestCppMultipleInheritance.py (1271 of 1983) PASS: lldb-api :: lang/cpp/dynamic-value-same-basename/TestDynamicValueSameBase.py (1272 of 1983) PASS: lldb-api :: commands/expression/expr-in-syscall/TestExpressionInSyscall.py (1273 of 1983) PASS: lldb-shell :: Reproducer/Functionalities/TestDataFormatter.test (1274 of 1983) PASS: lldb-api :: lang/objc/objc-super/TestObjCSuper.py (1275 of 1983) PASS: lldb-unit :: ObjectFile/Breakpad/./ObjectFileBreakpadTests/ModuleRecord.parse (1276 of 1983) PASS: lldb-shell :: SymbolFile/DWARF/debug_ranges-missing-section.s (1277 of 1983) PASS: lldb-shell :: SymbolFile/NativePDB/bitfields.cpp (1278 of 1983) PASS: lldb-unit :: Utility/./UtilityTests/GeneratorTest.GetOrCreate (1279 of 1983) PASS: lldb-api :: tools/lldb-server/TestAppleSimulatorOSType.py (1280 of 1983) PASS: lldb-unit :: Signals/./SignalsTests/UnixSignalsTest.GetInfo (1281 of 1983) PASS: lldb-shell :: SymbolFile/NativePDB/function-types-calling-conv.cpp (1282 of 1983) UNSUPPORTED: lldb-api :: arm/breakpoint-thumb-codesection/TestBreakpointThumbCodesection.py (1283 of 1983) PASS: lldb-shell :: Settings/TestSettingsSet.test (1284 of 1983) PASS: lldb-unit :: Utility/./UtilityTests/StringExtractorTest.GetHexU8_Underflow2_NoEof (1285 of 1983) PASS: lldb-unit :: Utility/./UtilityTests/StreamTest.PutMaxHex64ByteOrderBig (1286 of 1983) PASS: lldb-shell :: Process/TestEnvironment.test (1287 of 1983) PASS: lldb-api :: lang/cpp/covariant-return-types/TestCovariantReturnTypes.py (1288 of 1983) PASS: lldb-unit :: Utility/./UtilityTests/BinaryStreamTest.PutULEB128One (1289 of 1983) UNSUPPORTED: lldb-shell :: SymbolFile/dissassemble-entry-point.s (1290 of 1983) PASS: lldb-unit :: Language/CPlusPlus/./LanguageCPlusPlusTests/CPlusPlusLanguage.ExtractContextAndIdentifier (1291 of 1983) PASS: lldb-api :: lang/objc/radar-9691614/TestObjCMethodReturningBOOL.py (1292 of 1983) PASS: lldb-api :: lang/cpp/signed_types/TestSignedTypes.py (1293 of 1983) PASS: lldb-shell :: Driver/LocalLLDBInit.test (1294 of 1983) PASS: lldb-api :: commands/expression/context-object/TestContextObject.py (1295 of 1983) PASS: lldb-unit :: Interpreter/./InterpreterTests/OptionArgParserTest.toBoolean (1296 of 1983) PASS: lldb-unit :: Utility/./UtilityTests/StringListTest.GetMaxStringLengthMixed (1297 of 1983) PASS: lldb-api :: lang/cpp/auto/TestCPPAuto.py (1298 of 1983) PASS: lldb-api :: functionalities/data-formatter/typedef_array/TestTypedefArray.py (1299 of 1983) UNSUPPORTED: lldb-shell :: Register/x86-ymm-read.test (1300 of 1983) PASS: lldb-api :: commands/command/source/TestCommandSource.py (1301 of 1983) PASS: lldb-api :: functionalities/plugins/python_os_plugin/TestPythonOSPlugin.py (1302 of 1983) PASS: lldb-api :: functionalities/breakpoint/breakpoint_ids/TestBreakpointIDs.py (1303 of 1983) PASS: lldb-unit :: Utility/./UtilityTests/BinaryStreamTest.PutSLEB128ThreeBytes (1304 of 1983) PASS: lldb-unit :: Utility/./UtilityTests/RangeTest.ContainsEndInclusiveInvalid (1305 of 1983) UNSUPPORTED: lldb-api :: commands/register/register/intel_xtended_registers/mpx_bound_violation/TestBoundViolation.py (1306 of 1983) PASS: lldb-unit :: Host/./HostTests/NativeProcessProtocolTest.ReadCStringFromMemory_CrossPageBoundary (1307 of 1983) UNSUPPORTED: lldb-shell :: Register/arm-fp-read.test (1308 of 1983) PASS: lldb-shell :: SymbolFile/DWARF/DW_AT_loclists_base.s (1309 of 1983) PASS: lldb-unit :: Utility/./UtilityTests/BinaryStreamTest.PutULEB128ThreeBytes (1310 of 1983) PASS: lldb-unit :: Host/./HostTests/NativeProcessProtocolTest.SetBreakpoint (1311 of 1983) PASS: lldb-unit :: Process/gdb-remote/./ProcessGdbRemoteTests/GDBRemoteClientBaseTest.SendContinueDelegateInterface (1312 of 1983) UNSUPPORTED: lldb-api :: functionalities/breakpoint/breakpoint_callback_command_source/TestBreakpointCallbackCommandSource.py (1313 of 1983) PASS: lldb-api :: commands/process/launch/TestProcessLaunch.py (1314 of 1983) PASS: lldb-unit :: Symbol/./SymbolTests/TestTypeSystemClang.TestGetEnumIntegerTypeInvalid (1315 of 1983) PASS: lldb-unit :: SymbolFile/DWARF/./SymbolFileDWARFTests/SymbolFileDWARFTests.TestAbbrevOrder1Start5 (1316 of 1983) PASS: lldb-unit :: Utility/./UtilityTests/BinaryStreamTest.PutULEB128SixBytes (1317 of 1983) PASS: lldb-api :: python_api/value/TestValueAPI.py (1318 of 1983) PASS: lldb-unit :: UnwindAssembly/x86/./UnwindAssemblyx86Tests/Testx86AssemblyInspectionEngine.TestAddESP (1319 of 1983) PASS: lldb-api :: functionalities/data-formatter/data-formatter-stl/libcxx/variant/TestDataFormatterLibcxxVariant.py (1320 of 1983) UNSUPPORTED: lldb-shell :: ScriptInterpreter/Lua/breakpoint_callback.test (1321 of 1983) PASS: lldb-shell :: Expr/TestMultilineExpr.test (1322 of 1983) PASS: lldb-api :: lang/objc/objc-stepping/TestObjCStepping.py (1323 of 1983) PASS: lldb-shell :: SymbolFile/Breakpad/line-table-edgecases.test (1324 of 1983) PASS: lldb-unit :: UnwindAssembly/x86/./UnwindAssemblyx86Tests/Testx86AssemblyInspectionEngine.Test32BitOnlyInstruction (1325 of 1983) PASS: lldb-unit :: UnwindAssembly/x86/./UnwindAssemblyx86Tests/Testx86AssemblyInspectionEngine.TestAddRSP (1326 of 1983) PASS: lldb-unit :: Utility/./UtilityTests/StreamTest.PutHex32ByteOrderLittle (1327 of 1983) PASS: lldb-unit :: Process/minidump/./LLDBMinidumpTests/MinidumpParserTest.GetMemoryRegionInfoLinuxMaps (1328 of 1983) PASS: lldb-shell :: ObjectFile/PECOFF/basic-info.yaml (1329 of 1983) PASS: lldb-shell :: ObjectFile/ELF/minidebuginfo-find-symbols.yaml (1330 of 1983) PASS: lldb-shell :: SymbolFile/Breakpad/unwind-via-stack-win-no-memory-info.yaml (1331 of 1983) PASS: lldb-api :: lang/objcxx/objcxx-ivar-vector/TestIvarVector.py (1332 of 1983) PASS: lldb-unit :: Utility/./UtilityTests/TimerTest.CategoryTimesStats (1333 of 1983) PASS: lldb-api :: commands/disassemble/basic/TestFrameDisassemble.py (1334 of 1983) PASS: lldb-shell :: Minidump/memory-region.yaml (1335 of 1983) PASS: lldb-unit :: Utility/./UtilityTests/ArgsTest.EscapeLLDBCommandArgument (1336 of 1983) PASS: lldb-api :: functionalities/data-formatter/data-formatter-stl/libcxx/queue/TestDataFormatterLibcxxQueue.py (1337 of 1983) PASS: lldb-unit :: Utility/./UtilityTests/StringListTest.InsertStringAtIndexStdString (1338 of 1983) PASS: lldb-shell :: ObjectFile/wasm/unified-debug-sections.yaml (1339 of 1983) PASS: lldb-unit :: Utility/./UtilityTests/LogChannelTest.List (1340 of 1983) PASS: lldb-unit :: Core/./LLDBCoreTests/MangledTest.EmptyForInvalidName (1341 of 1983) UNSUPPORTED: lldb-api :: functionalities/tsan/cpp_global_location/TestTsanCPPGlobalLocation.py (1342 of 1983) PASS: lldb-api :: lang/objc/orderedset/TestOrderedSet.py (1343 of 1983) PASS: lldb-api :: functionalities/thread/concurrent_events/TestConcurrentBreakpointDelayBreakpointOneSignal.py (1344 of 1983) PASS: lldb-api :: functionalities/data-formatter/data-formatter-stl/libcxx/list/loop/TestDataFormatterLibcxxListLoop.py (1345 of 1983) PASS: lldb-unit :: UnwindAssembly/x86/./UnwindAssemblyx86Tests/Testx86AssemblyInspectionEngine.TestPopESI (1346 of 1983) UNSUPPORTED: lldb-api :: linux/mix-dwo-and-regular-objects/TestMixedDwarfBinary.py (1347 of 1983) PASS: lldb-api :: functionalities/gdb_remote_client/TestRegDefinitionInParts.py (1348 of 1983) PASS: lldb-unit :: SymbolFile/DWARF/./SymbolFileDWARFTests/DWARFASTParserClangTests.EnsureAllDIEsInDeclContextHaveBeenParsedParsesOnlyMatchingEntries (1349 of 1983) PASS: lldb-unit :: Host/./HostTests/FileSystemTest.Exists (1350 of 1983) PASS: lldb-api :: commands/expression/radar_8638051/Test8638051.py (1351 of 1983) PASS: lldb-shell :: SymbolFile/NativePDB/function-types-builtins.cpp (1352 of 1983) PASS: lldb-unit :: Interpreter/./InterpreterTests/CompletionTest.FileCompletionAbsolute (1353 of 1983) PASS: lldb-shell :: Quit/TestQuitExitCodeHex0.test (1354 of 1983) UNSUPPORTED: lldb-api :: functionalities/thread/break_after_join/TestBreakAfterJoin.py (1355 of 1983) PASS: lldb-api :: functionalities/jitloader_gdb/TestJITLoaderGDB.py (1356 of 1983) PASS: lldb-unit :: ScriptInterpreter/Python/./ScriptInterpreterPythonTests/PythonDataObjectsTest.TestPythonString (1357 of 1983) PASS: lldb-api :: types/TestFloatTypesExpr.py (1358 of 1983) PASS: lldb-unit :: Utility/./UtilityTests/StringExtractorTest.GetHexU8_InvalidHex_NoEof (1359 of 1983) PASS: lldb-api :: lang/objc/direct-dispatch-step/TestObjCDirectDispatchStepping.py (1360 of 1983) PASS: lldb-api :: tools/lldb-server/TestGdbRemoteExitCode.py (1361 of 1983) PASS: lldb-unit :: Expression/./ExpressionTests/DiagnosticManagerTest.AddDiagnostic (1362 of 1983) PASS: lldb-api :: functionalities/thread/concurrent_events/TestConcurrentManyBreakpoints.py (1363 of 1983) PASS: lldb-api :: lang/cpp/limit-debug-info/TestWithLimitDebugInfo.py (1364 of 1983) PASS: lldb-api :: functionalities/thread/concurrent_events/TestConcurrentDelaySignalWatch.py (1365 of 1983) PASS: lldb-api :: commands/expression/deleting-implicit-copy-constructor/TestDeletingImplicitCopyConstructor.py (1366 of 1983) PASS: lldb-unit :: Core/./LLDBCoreTests/RichManglingContextTest.IPDRealloc (1367 of 1983) PASS: lldb-unit :: Target/./TargetTests/ModuleCacheTest.GetAndPut (1368 of 1983) PASS: lldb-api :: functionalities/data-formatter/data-formatter-synthval/TestDataFormatterSynthVal.py (1369 of 1983) PASS: lldb-shell :: ObjectFile/ELF/basic-info.yaml (1370 of 1983) PASS: lldb-api :: commands/add-dsym/uuid/TestAddDsymCommand.py (1371 of 1983) PASS: lldb-api :: commands/expression/radar_9531204/TestPrintfAfterUp.py (1372 of 1983) PASS: lldb-api :: functionalities/thread/concurrent_events/TestConcurrentBreakpointOneDelayBreakpointThreads.py (1373 of 1983) UNSUPPORTED: lldb-api :: functionalities/unwind/standard/TestStandardUnwind.py (1374 of 1983) PASS: lldb-unit :: Utility/./UtilityTests/DataExtractorTest.GetCStrUnterminated (1375 of 1983) PASS: lldb-unit :: ScriptInterpreter/Python/./ScriptInterpreterPythonTests/PythonDataObjectsTest.TestPythonListToStructuredList (1376 of 1983) PASS: lldb-shell :: ObjectFile/Breakpad/sections-trailing-func.test (1377 of 1983) UNSUPPORTED: lldb-shell :: Watchpoint/netbsd-nouserdbregs.test (1378 of 1983) PASS: lldb-unit :: Process/gdb-remote/./ProcessGdbRemoteTests/GDBRemoteCommunicationClientTest.SendGetTraceConfigPacket (1379 of 1983) PASS: lldb-api :: commands/frame/diagnose/virtual-method-call/TestDiagnoseDereferenceVirtualMethodCall.py (1380 of 1983) PASS: lldb-api :: python_api/value/change_values/TestChangeValueAPI.py (1381 of 1983) PASS: lldb-unit :: Utility/./UtilityTests/Predicate.WaitForValueEqualTo (1382 of 1983) PASS: lldb-api :: commands/watchpoints/multiple_threads/TestWatchpointMultipleThreads.py (1383 of 1983) FAIL: lldb-api :: lang/objc/ptr_refs/TestPtrRefsObjC.py (1384 of 1983) ******************** TEST 'lldb-api :: lang/objc/ptr_refs/TestPtrRefsObjC.py' FAILED ******************** Script: -- /usr/local/bin/python /Users/buildslave/jenkins/workspace/lldb-cmake-sanitized/llvm-project/lldb/test/API/dotest.py --arch x86_64 -s /Users/buildslave/jenkins/workspace/lldb-cmake-sanitized/lldb-build/lldb-test-traces -S nm -u CXXFLAGS -u CFLAGS --codesign-identity lldb_codesign --server /Users/buildslave/jenkins/workspace/lldb-cmake-sanitized/lldb-build/./bin/debugserver --arch x86_64 --build-dir /Users/buildslave/jenkins/workspace/lldb-cmake-sanitized/lldb-build/lldb-test-build.noindex -s=/Users/buildslave/jenkins/workspace/lldb-cmake-sanitized/test/logs -t --env TERM=vt100 --env LLVM_LIBS_DIR=/Users/buildslave/jenkins/workspace/lldb-cmake-sanitized/lldb-build/./lib --inferior-env ASAN_OPTIONS=detect_stack_use_after_return=1 --inferior-env DYLD_INSERT_LIBRARIES=/Users/buildslave/jenkins/workspace/lldb-cmake-sanitized/host-compiler/lib/clang/11.0.0/lib/darwin/libclang_rt.asan_osx_dynamic.dylib --build-dir /Users/buildslave/jenkins/workspace/lldb-cmake-sanitized/lldb-build/lldb-test-build.noindex --lldb-module-cache-dir /Users/buildslave/jenkins/workspace/lldb-cmake-sanitized/lldb-build/lldb-test-build.noindex/module-cache-lldb/lldb-api --clang-module-cache-dir /Users/buildslave/jenkins/workspace/lldb-cmake-sanitized/lldb-build/lldb-test-build.noindex/module-cache-clang/lldb-api --executable /Users/buildslave/jenkins/workspace/lldb-cmake-sanitized/lldb-build/./bin/lldb --compiler /Users/buildslave/jenkins/workspace/lldb-cmake-sanitized/lldb-build/./bin/clang --dsymutil /Users/buildslave/jenkins/workspace/lldb-cmake-sanitized/lldb-build/./bin/dsymutil --filecheck /Users/buildslave/jenkins/workspace/lldb-cmake-sanitized/lldb-build/./bin/FileCheck --lldb-libs-dir /Users/buildslave/jenkins/workspace/lldb-cmake-sanitized/lldb-build/./lib /Users/buildslave/jenkins/workspace/lldb-cmake-sanitized/llvm-project/lldb/test/API/lang/objc/ptr_refs -p TestPtrRefsObjC.py -- Exit Code: 1

Hide Details

Command Output (stdout): -- lldb version 11.0.99 clang revision 146d685cd657399a4698015f16cc5910cc828728 llvm revision 146d685cd657399a4698015f16cc5910cc828728 "crashlog" and "save_crashlog" command installed, use the "--help" option for detailed help "malloc_info", "ptr_refs", "cstr_refs", "find_variable", and "objc_refs" commands have been installed, use the "--help" options on these commands for detailed help. LLDB library dir: /Users/buildslave/jenkins/workspace/lldb-cmake-sanitized/lldb-build/bin LLDB import library dir: /Users/buildslave/jenkins/workspace/lldb-cmake-sanitized/lldb-build/./lib libstdcxx tests will not be run because: Don't know how to build with libstdcxx on macosx Skipping following debug info categories: ['dwo'] 0x00007ffee6ca3468: stack in frame #0 of thread #1: tid 0x2b58b7 in variable at 0x7ffee6ca3468: (MyClass *) self = 0x00006020000000d0 0x00007ffee6ca33e0: stack (red zone)

Hide Details

-- Command Output (stderr): -- error: 'ptr_refs' is not a valid command. error: 'ptr_refs' is not a valid command.

Hide Details

Session logs for test failures/errors/unexpected successes will go into directory '/Users/buildslave/jenkins/workspace/lldb-cmake-sanitized/test/logs' Command invoked: /Users/buildslave/jenkins/workspace/lldb-cmake-sanitized/llvm-project/lldb/test/API/dotest.py --arch x86_64 -s /Users/buildslave/jenkins/workspace/lldb-cmake-sanitized/lldb-build/lldb-test-traces -S nm -u CXXFLAGS -u CFLAGS --codesign-identity lldb_codesign --server /Users/buildslave/jenkins/workspace/lldb-cmake-sanitized/lldb-build/./bin/debugserver --arch x86_64 --build-dir /Users/buildslave/jenkins/workspace/lldb-cmake-sanitized/lldb-build/lldb-test-build.noindex -s=/Users/buildslave/jenkins/workspace/lldb-cmake-sanitized/test/logs -t --env TERM=vt100 --env LLVM_LIBS_DIR=/Users/buildslave/jenkins/workspace/lldb-cmake-sanitized/lldb-build/./lib --inferior-env ASAN_OPTIONS=detect_stack_use_after_return=1 --inferior-env DYLD_INSERT_LIBRARIES=/Users/buildslave/jenkins/workspace/lldb-cmake-sanitized/host-compiler/lib/clang/11.0.0/lib/darwin/libclang_rt.asan_osx_dynamic.dylib --build-dir /Users/buildslave/jenkins/workspace/lldb-cmake-sanitized/lldb-build/lldb-test-build.noindex --lldb-module-cache-dir /Users/buildslave/jenkins/workspace/lldb-cmake-sanitized/lldb-build/lldb-test-build.noindex/module-cache-lldb/lldb-api --clang-module-cache-dir /Users/buildslave/jenkins/workspace/lldb-cmake-sanitized/lldb-build/lldb-test-build.noindex/module-cache-clang/lldb-api --executable /Users/buildslave/jenkins/workspace/lldb-cmake-sanitized/lldb-build/./bin/lldb --compiler /Users/buildslave/jenkins/workspace/lldb-cmake-sanitized/lldb-build/./bin/clang --dsymutil /Users/buildslave/jenkins/workspace/lldb-cmake-sanitized/lldb-build/./bin/dsymutil --filecheck /Users/buildslave/jenkins/workspace/lldb-cmake-sanitized/lldb-build/./bin/FileCheck --lldb-libs-dir /Users/buildslave/jenkins/workspace/lldb-cmake-sanitized/lldb-build/./lib /Users/buildslave/jenkins/workspace/lldb-cmake-sanitized/llvm-project/lldb/test/API/lang/objc/ptr_refs -p TestPtrRefsObjC.py Change dir to: /Users/buildslave/jenkins/workspace/lldb-cmake-sanitized/llvm-project/lldb/test/API/lang/objc/ptr_refs runCmd: settings clear -all output:

Hide Details

runCmd: settings set symbols.enable-external-lookup false output:

Hide Details

runCmd: settings set target.auto-apply-fixits false output:

Hide Details

runCmd: settings set plugin.process.gdb-remote.packet-timeout 60 output:

Hide Details

runCmd: settings set symbols.clang-modules-cache-path "/Users/buildslave/jenkins/workspace/lldb-cmake-sanitized/lldb-build/lldb-test-build.noindex/module-cache-lldb/lldb-api" output:

Hide Details

runCmd: settings set use-color false output:

Hide Details

runCmd: setting set target.prefer-dynamic-value no-dynamic-values output:

Hide Details

runCmd: settings set target.env-vars ASAN_OPTIONS=detect_stack_use_after_return=1 DYLD_INSERT_LIBRARIES=/Users/buildslave/jenkins/workspace/lldb-cmake-sanitized/host-compiler/lib/clang/11.0.0/lib/darwin/libclang_rt.asan_osx_dynamic.dylib output:

Hide Details

runCmd: script import lldb.macosx.heap output: "crashlog" and "save_crashlog" command installed, use the "--help" option for detailed help "malloc_info", "ptr_refs", "cstr_refs", "find_variable", and "objc_refs" commands have been installed, use the "--help" options on these commands for detailed help.

Hide Details

Hide Details

runCmd: ptr_refs self output: 0x00007ffee6ca3468: stack in frame #0 of thread #1: tid 0x2b58b7 in variable at 0x7ffee6ca3468: (MyClass *) self = 0x00006020000000d0 0x00007ffee6ca33e0: stack (red zone)

Hide Details

Hide Details

Expecting sub string: malloc Not matched

Hide Details

FAIL: LLDB (/Users/buildslave/jenkins/workspace/lldb-cmake-sanitized/lldb-build/bin/clang-11-x86_64) :: test_ptr_refs_dsym (TestPtrRefsObjC.TestPtrRefsObjC) <bound method SBProcess.Kill of <lldb.SBProcess; proxy of <Swig Object of type 'lldb::SBProcess *' at 0x12afc38a0> >>: success

Hide Details

runCmd: settings clear -all output:

Hide Details

runCmd: settings set symbols.enable-external-lookup false output:

Hide Details

runCmd: settings set target.auto-apply-fixits false output:

Hide Details

runCmd: settings set plugin.process.gdb-remote.packet-timeout 60 output:

Hide Details

runCmd: settings set symbols.clang-modules-cache-path "/Users/buildslave/jenkins/workspace/lldb-cmake-sanitized/lldb-build/lldb-test-build.noindex/module-cache-lldb/lldb-api" output:

Hide Details

runCmd: settings set use-color false output:

Hide Details

runCmd: setting set target.prefer-dynamic-value no-dynamic-values output:

Hide Details

runCmd: settings set target.env-vars ASAN_OPTIONS=detect_stack_use_after_return=1 DYLD_INSERT_LIBRARIES=/Users/buildslave/jenkins/workspace/lldb-cmake-sanitized/host-compiler/lib/clang/11.0.0/lib/darwin/libclang_rt.asan_osx_dynamic.dylib output:

Hide Details

runCmd: script import lldb.macosx.heap output:

Hide Details

runCmd: ptr_refs self runCmd failed! error: 'ptr_refs' is not a valid command.

Hide Details

Hide Details

XFAIL: LLDB (/Users/buildslave/jenkins/workspace/lldb-cmake-sanitized/lldb-build/bin/clang-11-x86_64) :: test_ptr_refs_dwarf (TestPtrRefsObjC.TestPtrRefsObjC) <bound method SBProcess.Kill of <lldb.SBProcess; proxy of <Swig Object of type 'lldb::SBProcess *' at 0x113c96990> >>: success

Hide Details

UNSUPPORTED: LLDB (/Users/buildslave/jenkins/workspace/lldb-cmake-sanitized/lldb-build/bin/clang-11-x86_64) :: test_ptr_refs_dwo (TestPtrRefsObjC.TestPtrRefsObjC) (test case does not fall in any category of interest for this run) runCmd: settings clear -all output:

Hide Details

runCmd: settings set symbols.enable-external-lookup false output:

Hide Details

runCmd: settings set target.auto-apply-fixits false output:

Hide Details

runCmd: settings set plugin.process.gdb-remote.packet-timeout 60 output:

Hide Details

runCmd: settings set symbols.clang-modules-cache-path "/Users/buildslave/jenkins/workspace/lldb-cmake-sanitized/lldb-build/lldb-test-build.noindex/module-cache-lldb/lldb-api" output:

Hide Details

runCmd: settings set use-color false output:

Hide Details

runCmd: setting set target.prefer-dynamic-value no-dynamic-values output:

Hide Details

runCmd: settings set target.env-vars ASAN_OPTIONS=detect_stack_use_after_return=1 DYLD_INSERT_LIBRARIES=/Users/buildslave/jenkins/workspace/lldb-cmake-sanitized/host-compiler/lib/clang/11.0.0/lib/darwin/libclang_rt.asan_osx_dynamic.dylib output:

Hide Details

runCmd: script import lldb.macosx.heap output:

Hide Details

runCmd: ptr_refs self runCmd failed! error: 'ptr_refs' is not a valid command.

Hide Details

Hide Details

XFAIL: LLDB (/Users/buildslave/jenkins/workspace/lldb-cmake-sanitized/lldb-build/bin/clang-11-x86_64) :: test_ptr_refs_gmodules (TestPtrRefsObjC.TestPtrRefsObjC) <bound method SBProcess.Kill of <lldb.SBProcess; proxy of <Swig Object of type 'lldb::SBProcess *' at 0x12afc31e0> >>: success

Hide Details

Restore dir to: /Users/buildslave/jenkins/workspace/lldb-cmake-sanitized/lldb-build/tools/lldb/test ====================================================================== FAIL: test_ptr_refs_dsym (TestPtrRefsObjC.TestPtrRefsObjC) Test the ptr_refs tool on Darwin with Objective-C ---------------------------------------------------------------------- Traceback (most recent call last): File "/Users/buildslave/jenkins/workspace/lldb-cmake-sanitized/llvm-project/lldb/packages/Python/lldbsuite/test/lldbtest.py", line 1751, in test_method return attrvalue(self) File "/Users/buildslave/jenkins/workspace/lldb-cmake-sanitized/llvm-project/lldb/packages/Python/lldbsuite/test/decorators.py", line 110, in wrapper func(*args, **kwargs) File "/Users/buildslave/jenkins/workspace/lldb-cmake-sanitized/llvm-project/lldb/test/API/lang/objc/ptr_refs/TestPtrRefsObjC.py", line 47, in test_ptr_refs self.expect("ptr_refs self", substrs=["malloc", "stack"]) File "/Users/buildslave/jenkins/workspace/lldb-cmake-sanitized/llvm-project/lldb/packages/Python/lldbsuite/test/lldbtest.py", line 2391, in expect if msg else EXP_MSG(str, output, exe)) AssertionError: False is not True : 'ptr_refs self' returns expected result, got '0x00007ffee6ca3468: stack in frame #0 of thread #1: tid 0x2b58b7 in variable at 0x7ffee6ca3468: (MyClass *) self = 0x00006020000000d0 0x00007ffee6ca33e0: stack (red zone)' Config=x86_64-/Users/buildslave/jenkins/workspace/lldb-cmake-sanitized/lldb-build/bin/clang-11 ---------------------------------------------------------------------- Ran 4 tests in 22.398s

Hide Details

RESULT: FAILED (0 passes, 1 failures, 0 errors, 1 skipped, 2 expected failures, 0 unexpected successes)

Hide Details

--

Hide Details

******************** PASS: lldb-api :: lang/cpp/function-qualifiers/TestCppFunctionQualifiers.py (1385 of 1983) PASS: lldb-api :: commands/watchpoints/watchpoint_commands/command/TestWatchpointCommandLLDB.py (1386 of 1983) PASS: lldb-unit :: Utility/./UtilityTests/NameMatchesTest.StartsWith (1387 of 1983) PASS: lldb-api :: macosx/find-dsym/bundle-with-dot-in-filename/TestBundleWithDotInFilename.py (1388 of 1983) PASS: lldb-shell :: ObjectFile/Breakpad/discontiguous-sections.test (1389 of 1983) PASS: lldb-unit :: Utility/./UtilityTests/UUIDTest.Validity (1390 of 1983) PASS: lldb-unit :: Utility/./UtilityTests/StringLexerTest.AdvanceIf (1391 of 1983) PASS: lldb-shell :: SymbolFile/NativePDB/ast-types.cpp (1392 of 1983) UNSUPPORTED: lldb-api :: benchmarks/startup/TestStartupDelays.py (1393 of 1983) UNSUPPORTED: lldb-api :: commands/watchpoints/hello_watchlocation/TestWatchLocation.py (1394 of 1983) PASS: lldb-api :: lang/objc/objc-new-syntax/TestObjCNewSyntaxArray.py (1395 of 1983) PASS: lldb-unit :: Symbol/./SymbolTests/TestTypeSystemClang.TestGetEnumIntegerTypeUnexpectedType (1396 of 1983) PASS: lldb-api :: functionalities/thread/concurrent_events/TestConcurrentCrashWithWatchpointBreakpointSignal.py (1397 of 1983) PASS: lldb-unit :: Utility/./UtilityTests/StringListTest.Join (1398 of 1983) PASS: lldb-unit :: Utility/./UtilityTests/SerializationRountripTest.SerializeDeserializePod (1399 of 1983) PASS: lldb-unit :: Utility/./UtilityTests/VMRange.Clear (1400 of 1983) PASS: lldb-api :: macosx/function-starts/TestFunctionStarts.py (1401 of 1983) PASS: lldb-api :: macosx/lc-note/kern-ver-str/TestKernVerStrLCNOTE.py (1402 of 1983) PASS: lldb-shell :: SymbolFile/DWARF/debug_loc.s (1403 of 1983) PASS: lldb-unit :: UnwindAssembly/x86/./UnwindAssemblyx86Tests/Testx86AssemblyInspectionEngine.TestCALLNextInsn (1404 of 1983) UNSUPPORTED: lldb-shell :: SymbolFile/PDB/type-quals.test (1405 of 1983) PASS: lldb-unit :: Utility/./UtilityTests/VMRange.ContainsRange (1406 of 1983) PASS: lldb-api :: lang/objc/variadic_methods/TestVariadicMethods.py (1407 of 1983) PASS: lldb-shell :: SymbolFile/NativePDB/break-by-function.cpp (1408 of 1983) PASS: lldb-shell :: ObjectFile/Breakpad/uuid-matching-mac.test (1409 of 1983) PASS: lldb-shell :: SymbolFile/Breakpad/symtab-macho.test (1410 of 1983) UNSUPPORTED: lldb-shell :: Register/aarch64-gp-read.test (1411 of 1983) PASS: lldb-unit :: Utility/./UtilityTests/ScalarTest.Scalar_512 (1412 of 1983) PASS: lldb-shell :: BuildScript/compiler-full-path.test (1413 of 1983) PASS: lldb-api :: tools/lldb-vscode/console/TestVSCode_console.py (1414 of 1983) PASS: lldb-shell :: SymbolFile/Breakpad/symtab.test (1415 of 1983) PASS: lldb-shell :: SymbolFile/DWARF/compilercontext.ll (1416 of 1983) PASS: lldb-unit :: Utility/./UtilityTests/ArgsTest.GetArgumentArrayRef (1417 of 1983) PASS: lldb-unit :: Target/./TargetTests/MemoryRegionInfoTest.Formatv (1418 of 1983) PASS: lldb-api :: python_api/watchpoint/TestSetWatchpoint.py (1419 of 1983) PASS: lldb-unit :: Utility/./UtilityTests/CompletionRequest.TryCompleteCurrentArgBad (1420 of 1983) PASS: lldb-unit :: Platform/./LLDBPlatformTests/PlatformDarwinTest.TestParseVersionBuildDir (1421 of 1983) PASS: lldb-unit :: Utility/./UtilityTests/DataExtractorTest.GetMaxU64_unchecked (1422 of 1983) UNSUPPORTED: lldb-shell :: SymbolFile/PDB/enums-layout.test (1423 of 1983) UNSUPPORTED: lldb-api :: terminal/TestEditline.py (1424 of 1983) PASS: lldb-api :: lang/objc/objc-baseclass-sbtype/TestObjCBaseClassSBType.py (1425 of 1983) PASS: lldb-api :: functionalities/tail_call_frames/unambiguous_sequence/TestUnambiguousTailCalls.py (1426 of 1983) PASS: lldb-api :: functionalities/thread/concurrent_events/TestConcurrentSignalNWatchNBreak.py (1427 of 1983) UNSUPPORTED: lldb-shell :: SymbolFile/NativePDB/local-variables.cpp (1428 of 1983) PASS: lldb-unit :: Utility/./UtilityTests/StringListTest.LongestCommonPrefixDuplicateElement (1429 of 1983) PASS: lldb-shell :: Reproducer/TestWorkingDir.test (1430 of 1983) PASS: lldb-api :: lang/cpp/member-and-local-vars-with-same-name/TestMembersAndLocalsWithSameName.py (1431 of 1983) PASS: lldb-api :: lang/c/bitfields/TestBitfields.py (1432 of 1983) PASS: lldb-api :: commands/expression/completion-in-lambda-and-unnamed-class/TestCompletionInLambdaAndUnnamedClass.py (1433 of 1983) PASS: lldb-api :: functionalities/data-formatter/user-format-vs-summary/TestUserFormatVsSummary.py (1434 of 1983) PASS: lldb-unit :: Utility/./UtilityTests/OptionsWithRawTest.EmptyInput (1435 of 1983) PASS: lldb-unit :: Symbol/./SymbolTests/TestTypeSystemClang.TestDisplayName (1436 of 1983) PASS: lldb-api :: functionalities/data-formatter/setvaluefromcstring/TestSetValueFromCString.py (1437 of 1983) UNSUPPORTED: lldb-api :: functionalities/thread/thread_specific_break_plus_condition/TestThreadSpecificBpPlusCondition.py (1438 of 1983) PASS: lldb-api :: functionalities/breakpoint/auto_continue/TestBreakpointAutoContinue.py (1439 of 1983) PASS: lldb-shell :: Minidump/dump-all.test (1440 of 1983) PASS: lldb-api :: lang/objc/rdar-10967107/TestRdar10967107.py (1441 of 1983) PASS: lldb-unit :: SymbolFile/NativePDB/./SymbolFileNativePDBTests/PDBFPOProgramToDWARFExpressionTests.MissingTargetRegister (1442 of 1983) PASS: lldb-api :: functionalities/breakpoint/global_constructor/TestBreakpointInGlobalConstructor.py (1443 of 1983) PASS: lldb-shell :: SymbolFile/DWARF/debug-types-dwarf5.s (1444 of 1983) PASS: lldb-unit :: Process/minidump/./LLDBMinidumpTests/MinidumpParserTest.GetThreadContext_x86_64 (1445 of 1983) PASS: lldb-api :: functionalities/thread/concurrent_events/TestConcurrentDelayedCrashWithBreakpointSignal.py (1446 of 1983) PASS: lldb-unit :: UnwindAssembly/x86/./UnwindAssemblyx86Tests/Testx86AssemblyInspectionEngine.TestLEAVE (1447 of 1983) PASS: lldb-api :: types/TestShortTypeExpr.py (1448 of 1983) PASS: lldb-shell :: SymbolFile/DWARF/debug_ranges_and_rnglists.test (1449 of 1983) PASS: lldb-api :: functionalities/data-formatter/nsdictionarysynth/TestNSDictionarySynthetic.py (1450 of 1983) PASS: lldb-unit :: UnwindAssembly/x86/./UnwindAssemblyx86Tests/Testx86AssemblyInspectionEngine.TestPush0 (1451 of 1983) PASS: lldb-api :: python_api/frame/inlines/TestInlinedFrame.py (1452 of 1983) PASS: lldb-api :: python_api/watchpoint/TestWatchpointIgnoreCount.py (1453 of 1983) PASS: lldb-shell :: ObjectFile/ELF/PT_LOAD.yaml (1454 of 1983) PASS: lldb-unit :: Utility/./UtilityTests/RangeDataVector.FindEntryThatContains (1455 of 1983) PASS: lldb-unit :: Utility/./UtilityTests/StringExtractorTest.GetU32LittleEndian (1456 of 1983) PASS: lldb-unit :: Utility/./UtilityTests/StringListTest.LongestCommonPrefixSingleElement (1457 of 1983) PASS: lldb-api :: lang/objc/objc-new-syntax/TestObjCNewSyntaxDictionary.py (1458 of 1983) PASS: lldb-unit :: Utility/./UtilityTests/UriParserTest.BadPort (1459 of 1983) PASS: lldb-api :: lang/cpp/std-function-step-into-callable/TestStdFunctionStepIntoCallable.py (1460 of 1983) PASS: lldb-unit :: Target/./TargetTests/PathMappingListTest.RelativeTests (1461 of 1983) PASS: lldb-api :: commands/expression/persist_objc_pointeetype/TestPersistObjCPointeeType.py (1462 of 1983) PASS: lldb-unit :: ScriptInterpreter/Python/./ScriptInterpreterPythonTests/PythonDataObjectsTest.TestRun (1463 of 1983) PASS: lldb-shell :: Breakpoint/debug_rnglist_offset_pair.test (1464 of 1983) UNSUPPORTED: lldb-shell :: SymbolFile/PDB/variables.test (1465 of 1983) PASS: lldb-api :: lang/objc/single-entry-dictionary/TestObjCSingleEntryDictionary.py (1466 of 1983) PASS: lldb-unit :: Symbol/./SymbolTests/TestClangASTImporter.MetadataPropagationAfterCopying (1467 of 1983) PASS: lldb-unit :: Utility/./UtilityTests/StringExtractorTest.GetU64LittleEndian (1468 of 1983) PASS: lldb-api :: functionalities/dynamic_value_child_count/TestDynamicValueChildCount.py (1469 of 1983) UNSUPPORTED: lldb-shell :: ObjectFile/ELF/minidebuginfo-no-lzma.yaml (1470 of 1983) PASS: lldb-api :: commands/gui/invalid-args/TestInvalidArgsGui.py (1471 of 1983) PASS: lldb-shell :: SymbolFile/DWARF/dwp-debug-types.s (1472 of 1983) PASS: lldb-unit :: Process/gdb-remote/./ProcessGdbRemoteTests/GDBRemoteClientBaseTest.SendContinueDelegateStructuredDataReceipt (1473 of 1983) UNSUPPORTED: lldb-api :: linux/thread/create_during_instruction_step/TestCreateDuringInstructionStep.py (1474 of 1983) PASS: lldb-unit :: Utility/./UtilityTests/ArchSpecTest.YAML (1475 of 1983) PASS: lldb-unit :: Utility/./UtilityTests/StringExtractorTest.GetNameColonValueNoColon (1476 of 1983) PASS: lldb-api :: functionalities/float-display/TestFloatDisplay.py (1477 of 1983) UNSUPPORTED: lldb-api :: commands/expression/macros/TestMacros.py (1478 of 1983) PASS: lldb-unit :: Utility/./UtilityTests/RangeTest.ContainsEndInclusive (1479 of 1983) PASS: lldb-unit :: Utility/./UtilityTests/StringListTest.SplitIntoLinesSingleTrailingCR (1480 of 1983) PASS: lldb-shell :: SymbolFile/Breakpad/unwind-via-stack-cfi.test (1481 of 1983) PASS: lldb-unit :: SymbolFile/NativePDB/./SymbolFileNativePDBTests/PDBFPOProgramToDWARFExpressionTests.InvalidOpBinary (1482 of 1983) PASS: lldb-api :: lang/cpp/gmodules-templates/TestGModules.py (1483 of 1983) PASS: lldb-api :: lang/objc/foundation/TestObjCMethodsNSArray.py (1484 of 1983) PASS: lldb-shell :: ObjectFile/ELF/duplicate-section.yaml (1485 of 1983) PASS: lldb-shell :: Reproducer/Modules/TestModuleCXX.test (1486 of 1983) PASS: lldb-unit :: Symbol/./SymbolTests/TestTypeSystemClang.TestConvertAccessTypeToAccessSpecifier (1487 of 1983) PASS: lldb-unit :: Process/minidump/./LLDBMinidumpTests/MinidumpParserTest.GetMiscInfoWindows (1488 of 1983) PASS: lldb-api :: functionalities/data-formatter/summary-string-onfail/Test-rdar-9974002.py (1489 of 1983) PASS: lldb-shell :: Settings/TestEchoCommands.test (1490 of 1983) PASS: lldb-unit :: Utility/./UtilityTests/ProcessInstanceInfo.DumpTable_invalidUID (1491 of 1983) PASS: lldb-api :: lang/cpp/virtual-overload/TestVirtualOverload.py (1492 of 1983) PASS: lldb-unit :: UnwindAssembly/x86/./UnwindAssemblyx86Tests/Testx86AssemblyInspectionEngine.TestPopR13 (1493 of 1983) PASS: lldb-api :: commands/watchpoints/step_over_watchpoint/TestStepOverWatchpoint.py (1494 of 1983) PASS: lldb-shell :: SymbolFile/DWARF/debug-types-dwo-cross-reference.cpp (1495 of 1983) PASS: lldb-api :: functionalities/thread/exit_during_break/TestExitDuringBreak.py (1496 of 1983) PASS: lldb-unit :: Utility/./UtilityTests/StreamTest.PutHex64ByteOrderLittle (1497 of 1983) PASS: lldb-api :: lang/cpp/operators/TestCppOperators.py (1498 of 1983) PASS: lldb-api :: lang/c/shared_lib_stripped_symbols/TestSharedLibStrippedSymbols.py (1499 of 1983) PASS: lldb-unit :: Utility/./UtilityTests/StringExtractorTest.DecodeHexU8_Extra (1500 of 1983) PASS: lldb-api :: macosx/version_zero/TestGetVersionZeroVersion.py (1501 of 1983) UNSUPPORTED: lldb-api :: linux/add-symbols/TestTargetSymbolsAddCommand.py (1502 of 1983) UNSUPPORTED: lldb-api :: android/platform/TestDefaultCacheLineSize.py (1503 of 1983) PASS: lldb-api :: lang/objc/objc-builtin-types/TestObjCBuiltinTypes.py (1504 of 1983) PASS: lldb-api :: lang/c/local_types/TestUseClosestType.py (1505 of 1983) PASS: lldb-api :: functionalities/gdb_remote_client/TestqOffsets.py (1506 of 1983) PASS: lldb-unit :: Interpreter/./InterpreterTests/CompletionTest.DirCompletionUsername (1507 of 1983) PASS: lldb-unit :: Utility/./UtilityTests/UriParserTest.TypicalPortPathIPv6 (1508 of 1983) PASS: lldb-api :: functionalities/data-formatter/data-formatter-globals/TestDataFormatterGlobals.py (1509 of 1983) PASS: lldb-api :: python_api/function_symbol/TestSymbolAPI.py (1510 of 1983) UNSUPPORTED: lldb-shell :: SymbolFile/PDB/expressions.test (1511 of 1983) PASS: lldb-shell :: Driver/TestTarget.test (1512 of 1983) PASS: lldb-unit :: Utility/./UtilityTests/LogChannelTest.EnableOptions (1513 of 1983) PASS: lldb-shell :: Breakpoint/debug_rnglist_basic.test (1514 of 1983) PASS: lldb-api :: commands/expression/cast_int_to_anonymous_enum/TestCastIntToAnonymousEnum.py (1515 of 1983) PASS: lldb-api :: lang/c/global_variables/TestGlobalVariables.py (1516 of 1983) UNSUPPORTED: lldb-api :: functionalities/param_entry_vals/basic_entry_values_x86_64/TestBasicEntryValuesX86_64.py (1517 of 1983) PASS: lldb-api :: lang/cpp/lambdas/TestLambdas.py (1518 of 1983) PASS: lldb-unit :: Utility/./UtilityTests/LogChannelEnabledTest.LLDB_LOG_ERROR (1519 of 1983) PASS: lldb-unit :: Utility/./UtilityTests/DataExtractorTest.GetCStrEmpty (1520 of 1983) PASS: lldb-unit :: ScriptInterpreter/Python/./ScriptInterpreterPythonTests/PythonDataObjectsTest.TestOwnedReferences (1521 of 1983) PASS: lldb-unit :: Utility/./UtilityTests/DataExtractorTest.PeekData (1522 of 1983) PASS: lldb-api :: lang/c/find_struct_type/TestFindStructTypes.py (1523 of 1983) PASS: lldb-unit :: Utility/./UtilityTests/RecordReplayTest.InstrumentedFooSameThis (1524 of 1983) PASS: lldb-unit :: ScriptInterpreter/Python/./ScriptInterpreterPythonTests/PythonDataObjectsTest.TestPythonTupleSize (1525 of 1983) PASS: lldb-api :: functionalities/thread/concurrent_events/TestConcurrentSignalDelayBreak.py (1526 of 1983) PASS: lldb-unit :: Utility/./UtilityTests/RegularExpression.Empty (1527 of 1983) PASS: lldb-shell :: ScriptInterpreter/None/import_module.test (1528 of 1983) PASS: lldb-unit :: Target/./TargetTests/ExecutionContextTest.GetByteOrderProcess (1529 of 1983) PASS: lldb-api :: lang/objc/hidden-ivars/TestHiddenIvars.py (1530 of 1983) PASS: lldb-unit :: Host/./HostTests/MainLoopTest.DetectsEOF (1531 of 1983) PASS: lldb-unit :: Symbol/./SymbolTests/TestTypeSystemClang.TestDeletingImplicitCopyCstrDueToMoveCStr (1532 of 1983) PASS: lldb-unit :: SymbolFile/NativePDB/./SymbolFileNativePDBTests/PDBFPOProgramToDWARFExpressionTests.InvalidAssignmentSingle (1533 of 1983) PASS: lldb-api :: functionalities/signal/raise/TestRaise.py (1534 of 1983) PASS: lldb-unit :: Utility/./UtilityTests/LogChannelEnabledTest.LogVerboseThread (1535 of 1983) PASS: lldb-shell :: Unwind/thread-step-out-ret-addr-check.test (1536 of 1983) PASS: lldb-shell :: SymbolFile/DWARF/dwp.s (1537 of 1983) PASS: lldb-unit :: Utility/./UtilityTests/ProcessInfoTest.Constructor (1538 of 1983) PASS: lldb-shell :: ObjectFile/ELF/section-overlap.yaml (1539 of 1983) PASS: lldb-unit :: Utility/./UtilityTests/OptionsWithRawTest.ArgsButNoDelimiter (1540 of 1983) PASS: lldb-shell :: Expr/TestIRMemoryMap.test (1541 of 1983) PASS: lldb-api :: lang/objc/modules-hash-mismatch/TestClangModulesHashMismatch.py (1542 of 1983) PASS: lldb-shell :: ObjectFile/PECOFF/invalid-export-table.yaml (1543 of 1983) PASS: lldb-api :: commands/expression/import-std-module/empty-module/TestEmptyStdModule.py (1544 of 1983) PASS: lldb-api :: functionalities/unwind/noreturn/module-end/TestNoReturnModuleEnd.py (1545 of 1983) PASS: lldb-api :: types/TestLongTypesExpr.py (1546 of 1983) PASS: lldb-api :: functionalities/data-formatter/data-formatter-stl/libcxx/multiset/TestDataFormatterLibcxxMultiSet.py (1547 of 1983) PASS: lldb-unit :: SymbolFile/DWARF/./SymbolFileDWARFTests/SymbolFileDWARFTests.TestAbbrevOrder1Start1 (1548 of 1983) PASS: lldb-api :: lang/objc/blocks/TestObjCIvarsInBlocks.py (1549 of 1983) PASS: lldb-unit :: Utility/./UtilityTests/StringExtractorTest.InitMisc (1550 of 1983) PASS: lldb-unit :: debugserver/./debugserverTests/RNBSocket.LoopBackListenIPv4 (1551 of 1983) UNSUPPORTED: lldb-shell :: Process/Windows/exception_access_violation.cpp (1552 of 1983) PASS: lldb-shell :: ObjectFile/ELF/aarch64-relocations.yaml (1553 of 1983) PASS: lldb-shell :: SymbolFile/DWARF/inline-function-address.ll (1554 of 1983) PASS: lldb-api :: functionalities/data-formatter/ostypeformatting/TestFormattersOsType.py (1555 of 1983) PASS: lldb-unit :: Utility/./UtilityTests/VMRange.Ordering (1556 of 1983) PASS: lldb-unit :: UnwindAssembly/x86/./UnwindAssemblyx86Tests/Testx86AssemblyInspectionEngine.TestPopEDI (1557 of 1983) PASS: lldb-unit :: Signals/./SignalsTests/UnixSignalsTest.Iteration (1558 of 1983) PASS: lldb-api :: functionalities/thread/thread_exit/TestThreadExit.py (1559 of 1983) PASS: lldb-unit :: Utility/./UtilityTests/FileSpecTest.AppendPathComponent (1560 of 1983) PASS: lldb-api :: python_api/sbstructureddata/TestStructuredDataAPI.py (1561 of 1983) PASS: lldb-api :: commands/frame/diagnose/dereference-function-return/TestDiagnoseDereferenceFunctionReturn.py (1562 of 1983) PASS: lldb-api :: functionalities/abbreviation/TestCommonShortSpellings.py (1563 of 1983) PASS: lldb-api :: functionalities/data-formatter/pyobjsynthprovider/TestPyObjSynthProvider.py (1564 of 1983) PASS: lldb-shell :: Recognizer/assert.test (1565 of 1983) PASS: lldb-api :: lang/objc/exceptions/TestObjCExceptions.py (1566 of 1983) FAIL: lldb-api :: functionalities/ptr_refs/TestPtrRefs.py (1567 of 1983) ******************** TEST 'lldb-api :: functionalities/ptr_refs/TestPtrRefs.py' FAILED ******************** Script: -- /usr/local/bin/python /Users/buildslave/jenkins/workspace/lldb-cmake-sanitized/llvm-project/lldb/test/API/dotest.py --arch x86_64 -s /Users/buildslave/jenkins/workspace/lldb-cmake-sanitized/lldb-build/lldb-test-traces -S nm -u CXXFLAGS -u CFLAGS --codesign-identity lldb_codesign --server /Users/buildslave/jenkins/workspace/lldb-cmake-sanitized/lldb-build/./bin/debugserver --arch x86_64 --build-dir /Users/buildslave/jenkins/workspace/lldb-cmake-sanitized/lldb-build/lldb-test-build.noindex -s=/Users/buildslave/jenkins/workspace/lldb-cmake-sanitized/test/logs -t --env TERM=vt100 --env LLVM_LIBS_DIR=/Users/buildslave/jenkins/workspace/lldb-cmake-sanitized/lldb-build/./lib --inferior-env ASAN_OPTIONS=detect_stack_use_after_return=1 --inferior-env DYLD_INSERT_LIBRARIES=/Users/buildslave/jenkins/workspace/lldb-cmake-sanitized/host-compiler/lib/clang/11.0.0/lib/darwin/libclang_rt.asan_osx_dynamic.dylib --build-dir /Users/buildslave/jenkins/workspace/lldb-cmake-sanitized/lldb-build/lldb-test-build.noindex --lldb-module-cache-dir /Users/buildslave/jenkins/workspace/lldb-cmake-sanitized/lldb-build/lldb-test-build.noindex/module-cache-lldb/lldb-api --clang-module-cache-dir /Users/buildslave/jenkins/workspace/lldb-cmake-sanitized/lldb-build/lldb-test-build.noindex/module-cache-clang/lldb-api --executable /Users/buildslave/jenkins/workspace/lldb-cmake-sanitized/lldb-build/./bin/lldb --compiler /Users/buildslave/jenkins/workspace/lldb-cmake-sanitized/lldb-build/./bin/clang --dsymutil /Users/buildslave/jenkins/workspace/lldb-cmake-sanitized/lldb-build/./bin/dsymutil --filecheck /Users/buildslave/jenkins/workspace/lldb-cmake-sanitized/lldb-build/./bin/FileCheck --lldb-libs-dir /Users/buildslave/jenkins/workspace/lldb-cmake-sanitized/lldb-build/./lib /Users/buildslave/jenkins/workspace/lldb-cmake-sanitized/llvm-project/lldb/test/API/functionalities/ptr_refs -p TestPtrRefs.py -- Exit Code: 1

Hide Details

Command Output (stdout): -- lldb version 11.0.99 clang revision 146d685cd657399a4698015f16cc5910cc828728 llvm revision 146d685cd657399a4698015f16cc5910cc828728 "crashlog" and "save_crashlog" command installed, use the "--help" option for detailed help "malloc_info", "ptr_refs", "cstr_refs", "find_variable", and "objc_refs" commands have been installed, use the "--help" options on these commands for detailed help. LLDB library dir: /Users/buildslave/jenkins/workspace/lldb-cmake-sanitized/lldb-build/bin LLDB import library dir: /Users/buildslave/jenkins/workspace/lldb-cmake-sanitized/lldb-build/./lib libstdcxx tests will not be run because: Don't know how to build with libstdcxx on macosx Skipping following debug info categories: ['dwo'] 0x00007ffeece1b478: stack in frame #0 of thread #1: tid 0x2bc6a0 in variable at 0x7ffeece1b478: (const char *) my_ptr = 0x00006020000000b0 "hello" 0x00007ffeece1b410: stack (red zone)

Hide Details

-- Command Output (stderr): -- error: 'ptr_refs' is not a valid command. error: 'ptr_refs' is not a valid command.

Hide Details

Session logs for test failures/errors/unexpected successes will go into directory '/Users/buildslave/jenkins/workspace/lldb-cmake-sanitized/test/logs' Command invoked: /Users/buildslave/jenkins/workspace/lldb-cmake-sanitized/llvm-project/lldb/test/API/dotest.py --arch x86_64 -s /Users/buildslave/jenkins/workspace/lldb-cmake-sanitized/lldb-build/lldb-test-traces -S nm -u CXXFLAGS -u CFLAGS --codesign-identity lldb_codesign --server /Users/buildslave/jenkins/workspace/lldb-cmake-sanitized/lldb-build/./bin/debugserver --arch x86_64 --build-dir /Users/buildslave/jenkins/workspace/lldb-cmake-sanitized/lldb-build/lldb-test-build.noindex -s=/Users/buildslave/jenkins/workspace/lldb-cmake-sanitized/test/logs -t --env TERM=vt100 --env LLVM_LIBS_DIR=/Users/buildslave/jenkins/workspace/lldb-cmake-sanitized/lldb-build/./lib --inferior-env ASAN_OPTIONS=detect_stack_use_after_return=1 --inferior-env DYLD_INSERT_LIBRARIES=/Users/buildslave/jenkins/workspace/lldb-cmake-sanitized/host-compiler/lib/clang/11.0.0/lib/darwin/libclang_rt.asan_osx_dynamic.dylib --build-dir /Users/buildslave/jenkins/workspace/lldb-cmake-sanitized/lldb-build/lldb-test-build.noindex --lldb-module-cache-dir /Users/buildslave/jenkins/workspace/lldb-cmake-sanitized/lldb-build/lldb-test-build.noindex/module-cache-lldb/lldb-api --clang-module-cache-dir /Users/buildslave/jenkins/workspace/lldb-cmake-sanitized/lldb-build/lldb-test-build.noindex/module-cache-clang/lldb-api --executable /Users/buildslave/jenkins/workspace/lldb-cmake-sanitized/lldb-build/./bin/lldb --compiler /Users/buildslave/jenkins/workspace/lldb-cmake-sanitized/lldb-build/./bin/clang --dsymutil /Users/buildslave/jenkins/workspace/lldb-cmake-sanitized/lldb-build/./bin/dsymutil --filecheck /Users/buildslave/jenkins/workspace/lldb-cmake-sanitized/lldb-build/./bin/FileCheck --lldb-libs-dir /Users/buildslave/jenkins/workspace/lldb-cmake-sanitized/lldb-build/./lib /Users/buildslave/jenkins/workspace/lldb-cmake-sanitized/llvm-project/lldb/test/API/functionalities/ptr_refs -p TestPtrRefs.py Change dir to: /Users/buildslave/jenkins/workspace/lldb-cmake-sanitized/llvm-project/lldb/test/API/functionalities/ptr_refs runCmd: settings clear -all output:

Hide Details

runCmd: settings set symbols.enable-external-lookup false output:

Hide Details

runCmd: settings set target.auto-apply-fixits false output:

Hide Details

runCmd: settings set plugin.process.gdb-remote.packet-timeout 60 output:

Hide Details

runCmd: settings set symbols.clang-modules-cache-path "/Users/buildslave/jenkins/workspace/lldb-cmake-sanitized/lldb-build/lldb-test-build.noindex/module-cache-lldb/lldb-api" output:

Hide Details

runCmd: settings set use-color false output:

Hide Details

runCmd: setting set target.prefer-dynamic-value no-dynamic-values output:

Hide Details

runCmd: settings set target.env-vars ASAN_OPTIONS=detect_stack_use_after_return=1 DYLD_INSERT_LIBRARIES=/Users/buildslave/jenkins/workspace/lldb-cmake-sanitized/host-compiler/lib/clang/11.0.0/lib/darwin/libclang_rt.asan_osx_dynamic.dylib output:

Hide Details

runCmd: script import lldb.macosx.heap output: "crashlog" and "save_crashlog" command installed, use the "--help" option for detailed help "malloc_info", "ptr_refs", "cstr_refs", "find_variable", and "objc_refs" commands have been installed, use the "--help" options on these commands for detailed help.

Hide Details

Hide Details

runCmd: ptr_refs my_ptr output: 0x00007ffeece1b478: stack in frame #0 of thread #1: tid 0x2bc6a0 in variable at 0x7ffeece1b478: (const char *) my_ptr = 0x00006020000000b0 "hello" 0x00007ffeece1b410: stack (red zone)

Hide Details

Hide Details

Expecting sub string: malloc Not matched

Hide Details

FAIL: LLDB (/Users/buildslave/jenkins/workspace/lldb-cmake-sanitized/lldb-build/bin/clang-11-x86_64) :: test_ptr_refs_dsym (TestPtrRefs.TestPtrRefs) <bound method SBProcess.Kill of <lldb.SBProcess; proxy of <Swig Object of type 'lldb::SBProcess *' at 0x10fba08a0> >>: success

Hide Details

runCmd: settings clear -all output:

Hide Details

runCmd: settings set symbols.enable-external-lookup false output:

Hide Details

runCmd: settings set target.auto-apply-fixits false output:

Hide Details

runCmd: settings set plugin.process.gdb-remote.packet-timeout 60 output:

Hide Details

runCmd: settings set symbols.clang-modules-cache-path "/Users/buildslave/jenkins/workspace/lldb-cmake-sanitized/lldb-build/lldb-test-build.noindex/module-cache-lldb/lldb-api" output:

Hide Details

runCmd: settings set use-color false output:

Hide Details

runCmd: setting set target.prefer-dynamic-value no-dynamic-values output:

Hide Details

runCmd: settings set target.env-vars ASAN_OPTIONS=detect_stack_use_after_return=1 DYLD_INSERT_LIBRARIES=/Users/buildslave/jenkins/workspace/lldb-cmake-sanitized/host-compiler/lib/clang/11.0.0/lib/darwin/libclang_rt.asan_osx_dynamic.dylib output:

Hide Details

runCmd: script import lldb.macosx.heap output:

Hide Details

runCmd: ptr_refs my_ptr runCmd failed! error: 'ptr_refs' is not a valid command.

Hide Details

Hide Details

XFAIL: LLDB (/Users/buildslave/jenkins/workspace/lldb-cmake-sanitized/lldb-build/bin/clang-11-x86_64) :: test_ptr_refs_dwarf (TestPtrRefs.TestPtrRefs) <bound method SBProcess.Kill of <lldb.SBProcess; proxy of <Swig Object of type 'lldb::SBProcess *' at 0x10efa0990> >>: success

Hide Details

UNSUPPORTED: LLDB (/Users/buildslave/jenkins/workspace/lldb-cmake-sanitized/lldb-build/bin/clang-11-x86_64) :: test_ptr_refs_dwo (TestPtrRefs.TestPtrRefs) (test case does not fall in any category of interest for this run) runCmd: settings clear -all output:

Hide Details

runCmd: settings set symbols.enable-external-lookup false output:

Hide Details

runCmd: settings set target.auto-apply-fixits false output:

Hide Details

runCmd: settings set plugin.process.gdb-remote.packet-timeout 60 output:

Hide Details

runCmd: settings set symbols.clang-modules-cache-path "/Users/buildslave/jenkins/workspace/lldb-cmake-sanitized/lldb-build/lldb-test-build.noindex/module-cache-lldb/lldb-api" output:

Hide Details

runCmd: settings set use-color false output:

Hide Details

runCmd: setting set target.prefer-dynamic-value no-dynamic-values output:

Hide Details

runCmd: settings set target.env-vars ASAN_OPTIONS=detect_stack_use_after_return=1 DYLD_INSERT_LIBRARIES=/Users/buildslave/jenkins/workspace/lldb-cmake-sanitized/host-compiler/lib/clang/11.0.0/lib/darwin/libclang_rt.asan_osx_dynamic.dylib output:

Hide Details

runCmd: script import lldb.macosx.heap output:

Hide Details

runCmd: ptr_refs my_ptr runCmd failed! error: 'ptr_refs' is not a valid command.

Hide Details

Hide Details

XFAIL: LLDB (/Users/buildslave/jenkins/workspace/lldb-cmake-sanitized/lldb-build/bin/clang-11-x86_64) :: test_ptr_refs_gmodules (TestPtrRefs.TestPtrRefs) <bound method SBProcess.Kill of <lldb.SBProcess; proxy of <Swig Object of type 'lldb::SBProcess *' at 0x10fba01e0> >>: success

Hide Details

Restore dir to: /Users/buildslave/jenkins/workspace/lldb-cmake-sanitized/lldb-build/tools/lldb/test ====================================================================== FAIL: test_ptr_refs_dsym (TestPtrRefs.TestPtrRefs) Test format string functionality. ---------------------------------------------------------------------- Traceback (most recent call last): File "/Users/buildslave/jenkins/workspace/lldb-cmake-sanitized/llvm-project/lldb/packages/Python/lldbsuite/test/lldbtest.py", line 1751, in test_method return attrvalue(self) File "/Users/buildslave/jenkins/workspace/lldb-cmake-sanitized/llvm-project/lldb/packages/Python/lldbsuite/test/decorators.py", line 110, in wrapper func(*args, **kwargs) File "/Users/buildslave/jenkins/workspace/lldb-cmake-sanitized/llvm-project/lldb/test/API/functionalities/ptr_refs/TestPtrRefs.py", line 47, in test_ptr_refs self.expect("ptr_refs my_ptr", substrs=["malloc", "stack"]) File "/Users/buildslave/jenkins/workspace/lldb-cmake-sanitized/llvm-project/lldb/packages/Python/lldbsuite/test/lldbtest.py", line 2391, in expect if msg else EXP_MSG(str, output, exe)) AssertionError: False is not True : 'ptr_refs my_ptr' returns expected result, got '0x00007ffeece1b478: stack in frame #0 of thread #1: tid 0x2bc6a0 in variable at 0x7ffeece1b478: (const char *) my_ptr = 0x00006020000000b0 "hello" 0x00007ffeece1b410: stack (red zone)' Config=x86_64-/Users/buildslave/jenkins/workspace/lldb-cmake-sanitized/lldb-build/bin/clang-11 ---------------------------------------------------------------------- Ran 4 tests in 8.918s

Hide Details

RESULT: FAILED (0 passes, 1 failures, 0 errors, 1 skipped, 2 expected failures, 0 unexpected successes)

Hide Details

--

Hide Details

******************** PASS: lldb-unit :: Utility/./UtilityTests/RecordReplayTest.InstrumentedBarPtr (1568 of 1983) PASS: lldb-shell :: SymbolFile/DWARF/find-basic-variable.cpp (1569 of 1983) PASS: lldb-api :: functionalities/breakpoint/require_hw_breakpoints/TestRequireHWBreakpoints.py (1570 of 1983) PASS: lldb-api :: lang/cpp/accelerator-table/TestCPPAccelerator.py (1571 of 1983) PASS: lldb-api :: commands/expression/import-std-module/forward_list-dbg-info-content/TestDbgInfoContentForwardListFromStdModule.py (1572 of 1983) PASS: lldb-unit :: Expression/./ExpressionTests/DWARFExpression.DW_OP_pick (1573 of 1983) PASS: lldb-api :: lang/cpp/incomplete-types/TestCppIncompleteTypes.py (1574 of 1983) UNSUPPORTED: lldb-api :: functionalities/darwin_log/filter/regex/activity/TestDarwinLogFilterRegexActivity.py (1575 of 1983) PASS: lldb-api :: commands/expression/persistent_ptr_update/TestPersistentPtrUpdate.py (1576 of 1983) PASS: lldb-shell :: SymbolFile/DWARF/split-dwarf-multiple-cu.ll (1577 of 1983) PASS: lldb-unit :: Utility/./UtilityTests/ConstStringTest.YAML (1578 of 1983) PASS: lldb-api :: lang/mixed/TestMixedLanguages.py (1579 of 1983) PASS: lldb-shell :: SymbolFile/DWARF/debug-types-basic.test (1580 of 1983) UNSUPPORTED: lldb-api :: functionalities/asan/TestMemoryHistory.py (1581 of 1983) PASS: lldb-api :: functionalities/thread/concurrent_events/TestConcurrentDelayWatchBreak.py (1582 of 1983) PASS: lldb-api :: functionalities/data-formatter/data-formatter-caching/TestDataFormatterCaching.py (1583 of 1983) PASS: lldb-shell :: Reproducer/TestCaptureEnvOverride.test (1584 of 1983) PASS: lldb-unit :: ScriptInterpreter/Python/./ScriptInterpreterPythonTests/PythonDataObjectsTest.TestExceptions (1585 of 1983) PASS: lldb-unit :: Utility/./UtilityTests/StringListTest.ForRangeEmpty (1586 of 1983) PASS: lldb-shell :: ObjectFile/PECOFF/dep-modules.yaml (1587 of 1983) PASS: lldb-unit :: Process/minidump/./LLDBMinidumpTests/MinidumpParserTest.GetPid (1588 of 1983) PASS: lldb-shell :: Minidump/breakpad-symbols.test (1589 of 1983) PASS: lldb-unit :: Utility/./UtilityTests/StreamTeeTest.Assignment (1590 of 1983) PASS: lldb-unit :: ScriptInterpreter/Python/./ScriptInterpreterPythonTests/PythonDataObjectsTest.TestPythonInteger (1591 of 1983) UNSUPPORTED: lldb-api :: functionalities/unwind/ehframe/TestEhFrameUnwind.py (1592 of 1983) PASS: lldb-api :: types/TestShortType.py (1593 of 1983) UNSUPPORTED: lldb-shell :: SymbolFile/PDB/udt-layout.test (1594 of 1983) PASS: lldb-shell :: Reproducer/TestSynchronous.test (1595 of 1983) PASS: lldb-unit :: Process/gdb-remote/./ProcessGdbRemoteTests/GDBRemoteCommunicationClientTest.GetMemoryRegionInfo (1596 of 1983) PASS: lldb-unit :: Utility/./UtilityTests/OptionsWithRawTest.ArgsButNoLeadingDash (1597 of 1983) PASS: lldb-unit :: Utility/./UtilityTests/Flags.GetBitSize (1598 of 1983) PASS: lldb-shell :: SymbolFile/DWARF/win-i386-line-table.s (1599 of 1983) PASS: lldb-api :: lang/cpp/trivial_abi/TestTrivialABI.py (1600 of 1983) PASS: lldb-api :: tools/lldb-vscode/variables/TestVSCode_variables.py (1601 of 1983) PASS: lldb-unit :: Expression/./ExpressionTests/DiagnosticManagerTest.GetStringPreserveOrder (1602 of 1983) UNSUPPORTED: lldb-api :: tools/intel-features/intel-pt/test/TestIntelPTSimpleBinary.py (1603 of 1983) PASS: lldb-api :: lang/objc/objc-property/TestObjCProperty.py (1604 of 1983) PASS: lldb-shell :: ObjectFile/ELF/section-types.yaml (1605 of 1983) PASS: lldb-api :: functionalities/breakpoint/breakpoint_hit_count/TestBreakpointHitCount.py (1606 of 1983) UNSUPPORTED: lldb-api :: lang/cpp/static_members/TestCPPStaticMembers.py (1607 of 1983) PASS: lldb-unit :: Utility/./UtilityTests/StreamTeeTest.Write (1608 of 1983) PASS: lldb-unit :: Utility/./UtilityTests/StreamTest.PutCharNull (1609 of 1983) PASS: lldb-api :: lang/objc/objc++/TestObjCXX.py (1610 of 1983) PASS: lldb-shell :: ObjectFile/wasm/embedded-debug-sections.yaml (1611 of 1983) PASS: lldb-unit :: Expression/./ExpressionTests/ClangHostTest.ComputeClangResourceDirectory (1612 of 1983) PASS: lldb-unit :: Utility/./UtilityTests/RangeTest.ContainsRange (1613 of 1983) PASS: lldb-unit :: Process/gdb-remote/./ProcessGdbRemoteTests/GDBRemoteCommunicationClientTest.WriteRegisterNoSuffix (1614 of 1983) PASS: lldb-api :: commands/expression/import-std-module/vector/TestVectorFromStdModule.py (1615 of 1983) PASS: lldb-shell :: SymbolFile/NativePDB/s_constant.cpp (1616 of 1983) PASS: lldb-unit :: Language/Highlighting/./HighlighterTests/HighlighterTest.HighlighterSelectionPath (1617 of 1983) PASS: lldb-api :: tools/lldb-server/TestGdbRemoteExpeditedRegisters.py (1618 of 1983) PASS: lldb-unit :: Utility/./UtilityTests/StreamTest.PutPtr (1619 of 1983) PASS: lldb-api :: functionalities/thread/concurrent_events/TestConcurrentBreakpointsDelayedBreakpointOneWatchpoint.py (1620 of 1983) PASS: lldb-shell :: Commands/CommandScriptImmediateOutput/CommandScriptImmediateOutputConsole.test (1621 of 1983) PASS: lldb-unit :: UnwindAssembly/x86/./UnwindAssemblyx86Tests/Testx86AssemblyInspectionEngine.TestPushRBP (1622 of 1983) PASS: lldb-api :: functionalities/tail_call_frames/cross_object/TestCrossObjectTailCalls.py (1623 of 1983) UNSUPPORTED: lldb-shell :: Register/x86-ymm-write.test (1624 of 1983) PASS: lldb-api :: api/command-return-object/TestSBCommandReturnObject.py (1625 of 1983) PASS: lldb-api :: commands/expression/test/TestExprs.py (1626 of 1983) PASS: lldb-api :: lang/c/set_values/TestSetValues.py (1627 of 1983) PASS: lldb-unit :: Utility/./UtilityTests/BinaryStreamTest.PutULEB128MaxValue (1628 of 1983) PASS: lldb-api :: functionalities/object-file/TestImageListMultiArchitecture.py (1629 of 1983) PASS: lldb-unit :: Expression/./ExpressionTests/DiagnosticManagerTest.PutStringMultiple (1630 of 1983) PASS: lldb-api :: macosx/add-dsym/TestAddDsymMidExecutionCommand.py (1631 of 1983) PASS: lldb-unit :: Utility/./UtilityTests/StatusTest.ErrorConstructor (1632 of 1983) PASS: lldb-api :: functionalities/breakpoint/serialize/TestBreakpointSerialization.py (1633 of 1983) PASS: lldb-unit :: Utility/./UtilityTests/ArgsTest.TestArgv (1634 of 1983) PASS: lldb-unit :: Language/Highlighting/./HighlighterTests/HighlighterTest.ClangPreserveNewLine (1635 of 1983) PASS: lldb-api :: functionalities/data-formatter/data-formatter-objc/TestDataFormatterObjCNSData.py (1636 of 1983) PASS: lldb-unit :: Process/gdb-remote/./ProcessGdbRemoteTests/GDBRemoteCommunicationClientTest.GetModulesInfo_UUID20 (1637 of 1983) PASS: lldb-api :: functionalities/show_location/TestShowLocationDwarf5.py (1638 of 1983) PASS: lldb-unit :: Utility/./UtilityTests/StreamTest.AddressPrefix (1639 of 1983) PASS: lldb-unit :: Symbol/./SymbolTests/Type.GetTypeScopeAndBasename (1640 of 1983) PASS: lldb-api :: commands/expression/import-std-module/deque-basic/TestDequeFromStdModule.py (1641 of 1983) PASS: lldb-unit :: SymbolFile/NativePDB/./SymbolFileNativePDBTests/PDBFPOProgramToDWARFExpressionTests.UnresolvedRegisterAssignmentReference (1642 of 1983) PASS: lldb-unit :: Utility/./UtilityTests/ScalarTest.Equality (1643 of 1983) PASS: lldb-unit :: ScriptInterpreter/Python/./ScriptInterpreterPythonTests/PythonDataObjectsTest.TestPythonDictionaryManipulation (1644 of 1983) PASS: lldb-api :: types/TestDoubleTypes.py (1645 of 1983) PASS: lldb-api :: functionalities/var_path/TestVarPath.py (1646 of 1983) PASS: lldb-unit :: Utility/./UtilityTests/StringListTest.AppendStringMove (1647 of 1983) PASS: lldb-unit :: Symbol/./SymbolTests/LineEntryTest.GetSameLineContiguousAddressRangeNoInlines (1648 of 1983) PASS: lldb-unit :: Utility/./UtilityTests/BinaryStreamTest.PutSLEB128EightBytes (1649 of 1983) PASS: lldb-api :: commands/expression/function_template_specialization_temp_args/TestFunctionTemplateSpecializationTempArgs.py (1650 of 1983) PASS: lldb-shell :: ObjectFile/MachO/lc_build_version_notools.yaml (1651 of 1983) PASS: lldb-api :: functionalities/thread/concurrent_events/TestConcurrentTwoWatchpointThreads.py (1652 of 1983) PASS: lldb-api :: functionalities/type_lookup/TestTypeLookup.py (1653 of 1983) UNSUPPORTED: lldb-api :: tools/lldb-server/thread-name/TestGdbRemoteThreadName.py (1654 of 1983) PASS: lldb-unit :: Utility/./UtilityTests/RegularExpression.Invalid (1655 of 1983) PASS: lldb-shell :: Commands/command-regex-unalias.test (1656 of 1983) PASS: lldb-shell :: SymbolFile/DWARF/debug-line-basic.s (1657 of 1983) PASS: lldb-api :: functionalities/gdb_remote_client/TestStopPCs.py (1658 of 1983) PASS: lldb-api :: lang/cpp/nsimport/TestCppNsImport.py (1659 of 1983) PASS: lldb-api :: lang/cpp/extern_c/TestExternCSymbols.py (1660 of 1983) PASS: lldb-unit :: Utility/./UtilityTests/VMRange.ContainsAddr (1661 of 1983) PASS: lldb-unit :: Utility/./UtilityTests/ReproducerTest.SetCapture (1662 of 1983) PASS: lldb-api :: functionalities/tail_call_frames/disambiguate_call_site/TestDisambiguateCallSite.py (1663 of 1983) PASS: lldb-api :: commands/expression/import-std-module/no-std-module/TestMissingStdModule.py (1664 of 1983) PASS: lldb-api :: python_api/module_section/TestModuleAndSection.py (1665 of 1983) PASS: lldb-shell :: Reproducer/TestPythonImport.test (1666 of 1983) PASS: lldb-api :: functionalities/data-formatter/data-formatter-stl/libcxx/string/TestDataFormatterLibcxxString.py (1667 of 1983) PASS: lldb-unit :: Utility/./UtilityTests/StreamTest.Indent (1668 of 1983) PASS: lldb-api :: commands/settings/quoting/TestQuoting.py (1669 of 1983) UNSUPPORTED: lldb-shell :: Register/x86-64-ymm16-read.test (1670 of 1983) PASS: lldb-api :: lang/c/const_variables/TestConstVariables.py (1671 of 1983) PASS: lldb-shell :: SymbolFile/DWARF/find-basic-type.cpp (1672 of 1983) PASS: lldb-unit :: Expression/./ExpressionTests/CppModuleConfigurationTest.LinuxLocalLibCpp (1673 of 1983) PASS: lldb-unit :: Process/gdb-remote/./ProcessGdbRemoteTests/GDBRemoteCommunicationTest.ReadPacket_checksum (1674 of 1983) PASS: lldb-unit :: Host/./HostTests/SocketTest.UDPConnect (1675 of 1983) PASS: lldb-unit :: Symbol/./SymbolTests/DWARFCallFrameInfoTest.Basic_eh (1676 of 1983) PASS: lldb-unit :: Utility/./UtilityTests/UriParserTest.PortOverflow (1677 of 1983) PASS: lldb-api :: python_api/sbdata/TestSBData.py (1678 of 1983) PASS: lldb-unit :: Process/gdb-remote/./ProcessGdbRemoteTests/GDBRemoteCommunicationClientTest.SendSignalsToIgnore (1679 of 1983) PASS: lldb-api :: lang/cpp/template/TestTemplateArgs.py (1680 of 1983) PASS: lldb-api :: lang/objc/objc-ivar-protocols/TestIvarProtocols.py (1681 of 1983) PASS: lldb-api :: functionalities/data-formatter/dump_dynamic/TestDumpDynamic.py (1682 of 1983) UNSUPPORTED: lldb-api :: commands/register/register/intel_xtended_registers/TestMPXRegisters.py (1683 of 1983) PASS: lldb-unit :: Utility/./UtilityTests/StreamTeeTest.GetStreamAtIndexOutOfBoundsEmpty (1684 of 1983) UNSUPPORTED: lldb-api :: functionalities/data-formatter/data-formatter-stl/libstdcpp/list/TestDataFormatterStdList.py (1685 of 1983) PASS: lldb-unit :: Utility/./UtilityTests/LogChannelTest.Disable (1686 of 1983) PASS: lldb-api :: lang/objc/objc-optimized/TestObjcOptimized.py (1687 of 1983) PASS: lldb-shell :: Register/x86-64-gp-read.test (1688 of 1983) PASS: lldb-api :: macosx/queues/TestQueues.py (1689 of 1983) PASS: lldb-unit :: Utility/./UtilityTests/FileSpecTest.EqualSeparator (1690 of 1983) UNSUPPORTED: lldb-shell :: SymbolFile/PDB/compilands.test (1691 of 1983) PASS: lldb-api :: functionalities/inferior-changed/TestInferiorChanged.py (1692 of 1983) PASS: lldb-unit :: Utility/./UtilityTests/FileSpecTest.IsRelative (1693 of 1983) UNSUPPORTED: lldb-api :: commands/expression/multiline-completion/TestMultilineCompletion.py (1694 of 1983) PASS: lldb-unit :: ScriptInterpreter/Python/./ScriptInterpreterPythonTests/PythonDataObjectsTest.TestPythonIntegerToStructuredInteger (1695 of 1983) PASS: lldb-api :: functionalities/breakpoint/breakpoint_names/TestBreakpointNames.py (1696 of 1983) PASS: lldb-unit :: Utility/./UtilityTests/StreamTest.AddressRangeInvalidRange (1697 of 1983) PASS: lldb-api :: functionalities/data-formatter/data-formatter-stl/libcxx/vbool/TestDataFormatterLibcxxVBool.py (1698 of 1983) PASS: lldb-unit :: Utility/./UtilityTests/RangeTest.Equal (1699 of 1983) PASS: lldb-api :: functionalities/completion/TestCompletion.py (1700 of 1983) PASS: lldb-api :: lang/cpp/virtual-functions/TestCppVirtualFunctions.py (1701 of 1983) PASS: lldb-shell :: Reproducer/TestCrash.test (1702 of 1983) PASS: lldb-api :: commands/statistics/basic/TestStats.py (1703 of 1983) PASS: lldb-unit :: Expression/./ExpressionTests/DiagnosticManagerTest.GetStringMultipleDiags (1704 of 1983) PASS: lldb-shell :: SymbolFile/NativePDB/break-by-line.cpp (1705 of 1983) PASS: lldb-unit :: Utility/./UtilityTests/StringListTest.JoinMultiCharSeparator (1706 of 1983) PASS: lldb-api :: functionalities/plugins/command_plugin/TestPluginCommands.py (1707 of 1983) PASS: lldb-unit :: debugserver/./debugserverTests/RNBSocket.LoopBackConnectIPv6 (1708 of 1983) PASS: lldb-api :: macosx/indirect_symbol/TestIndirectSymbols.py (1709 of 1983) UNSUPPORTED: lldb-shell :: Register/x86-64-ymm16-write.test (1710 of 1983) PASS: lldb-unit :: ScriptInterpreter/Python/./ScriptInterpreterPythonTests/PythonDataObjectsTest.TestScript (1711 of 1983) PASS: lldb-unit :: Utility/./UtilityTests/ArgsTest.TestOverwriteArgs (1712 of 1983) PASS: lldb-shell :: Reproducer/TestFileRepro.test (1713 of 1983) PASS: lldb-api :: lang/c/enum_types/TestEnumTypes.py (1714 of 1983) PASS: lldb-api :: types/TestLongTypes.py (1715 of 1983) PASS: lldb-api :: commands/expression/static-initializers/TestStaticInitializers.py (1716 of 1983) PASS: lldb-unit :: Symbol/./SymbolTests/TestClangASTImporter.MetadataPropagationIndirectImport (1717 of 1983) PASS: lldb-unit :: Utility/./UtilityTests/Flags.AnyClear (1718 of 1983) PASS: lldb-unit :: Utility/./UtilityTests/StringListTest.JoinNonSpace (1719 of 1983) PASS: lldb-unit :: Host/./HostTests/Host.GetEnvironment (1720 of 1983) PASS: lldb-unit :: Utility/./UtilityTests/SerializationRountripTest.SerializeDeserializeCStringArrayNullptr (1721 of 1983) PASS: lldb-api :: functionalities/thread/concurrent_events/TestConcurrentTwoWatchpointsOneSignal.py (1722 of 1983) PASS: lldb-api :: lang/cpp/class_types/TestClassTypes.py (1723 of 1983) PASS: lldb-unit :: Process/minidump/./LLDBMinidumpTests/MinidumpParserTest.GetThreadContext_x86_32_wow64 (1724 of 1983) PASS: lldb-shell :: Driver/TestNoUseColor.test (1725 of 1983) PASS: lldb-unit :: Expression/./ExpressionTests/DiagnosticManagerTest.GetStringNoDiags (1726 of 1983) PASS: lldb-api :: functionalities/inferior-assert/TestInferiorAssert.py (1727 of 1983) PASS: lldb-unit :: UnwindAssembly/x86/./UnwindAssemblyx86Tests/Testx86AssemblyInspectionEngine.TestSimple32bitFrameFunction (1728 of 1983) PASS: lldb-unit :: ObjectFile/Breakpad/./ObjectFileBreakpadTests/Record.classify (1729 of 1983) PASS: lldb-unit :: Utility/./UtilityTests/ArgsTest.ReplaceArgumentAtIndexLonger (1730 of 1983) PASS: lldb-unit :: Utility/./UtilityTests/ArchSpecTest.Compatibility (1731 of 1983) PASS: lldb-api :: functionalities/optimized_code/TestNoASanExceptionAfterEvalOP_piece.py (1732 of 1983) PASS: lldb-shell :: Driver/TestCore.test (1733 of 1983) PASS: lldb-api :: lang/c/anonymous/TestAnonymous.py (1734 of 1983) PASS: lldb-unit :: Language/Highlighting/./HighlighterTests/HighlighterTest.ClangComments (1735 of 1983) PASS: lldb-api :: functionalities/data-formatter/synthupdate/TestSyntheticFilterRecompute.py (1736 of 1983) PASS: lldb-unit :: SymbolFile/NativePDB/./SymbolFileNativePDBTests/PDBFPOProgramToDWARFExpressionTests.MultipleIndependentAssignments (1737 of 1983) PASS: lldb-unit :: UnwindAssembly/x86/./UnwindAssemblyx86Tests/Testx86AssemblyInspectionEngine.TestPushR15 (1738 of 1983) PASS: lldb-shell :: Commands/command-source.test (1739 of 1983) PASS: lldb-unit :: Utility/./UtilityTests/ArchSpecTest.TripleComponentsWereSpecified (1740 of 1983) PASS: lldb-api :: lang/cpp/frame-var-anon-unions/TestFrameVariableAnonymousUnions.py (1741 of 1983) PASS: lldb-api :: python_api/value/empty_class/TestValueAPIEmptyClass.py (1742 of 1983) PASS: lldb-unit :: Utility/./UtilityTests/StringExtractorTest.DecodeHexU8_Exact (1743 of 1983) PASS: lldb-unit :: Symbol/./SymbolTests/LineEntryTest.GetSameLineContiguousAddressRangeOneInline (1744 of 1983) PASS: lldb-api :: functionalities/data-formatter/data-formatter-named-summaries/TestDataFormatterNamedSummaries.py (1745 of 1983) PASS: lldb-api :: types/TestIntegerType.py (1746 of 1983) PASS: lldb-unit :: Utility/./UtilityTests/NameMatchesTest.EndsWith (1747 of 1983) PASS: lldb-api :: commands/expression/unicode-in-variable/TestUnicodeInVariable.py (1748 of 1983) PASS: lldb-shell :: Breakpoint/dummy-target.test (1749 of 1983) PASS: lldb-unit :: Utility/./UtilityTests/UriParserTest.TypicalPortPathIPv4 (1750 of 1983) PASS: lldb-unit :: Language/Highlighting/./HighlighterTests/HighlighterTest.DefaultHighlighterWithCursorOutOfBounds (1751 of 1983) PASS: lldb-unit :: Host/./HostTests/SocketAddressTest.GetAddressInfo (1752 of 1983) PASS: lldb-shell :: SymbolFile/DWARF/gnu-style-compression.cpp (1753 of 1983) PASS: lldb-api :: commands/frame/var/TestFrameVar.py (1754 of 1983) PASS: lldb-api :: functionalities/breakpoint/scripted_bkpt/TestScriptedResolver.py (1755 of 1983) PASS: lldb-unit :: Symbol/./SymbolTests/TestTypeSystemClang.TestRecordHasFields (1756 of 1983) PASS: lldb-unit :: Expression/./ExpressionTests/DiagnosticManagerTest.PutStringSeverities (1757 of 1983) PASS: lldb-unit :: Process/minidump/./LLDBMinidumpTests/MinidumpParserTest.GetThreadsAndGetThreadContext (1758 of 1983) PASS: lldb-unit :: Utility/./UtilityTests/StringLexerTest.NextIf (1759 of 1983) PASS: lldb-unit :: Utility/./UtilityTests/ConstStringTest.CompareConstString (1760 of 1983) PASS: lldb-api :: functionalities/unwind/sigtramp/TestSigtrampUnwind.py (1761 of 1983) PASS: lldb-api :: functionalities/inline-stepping/TestInlineStepping.py (1762 of 1983) PASS: lldb-api :: functionalities/thread/concurrent_events/TestConcurrentManyCrash.py (1763 of 1983) PASS: lldb-unit :: Process/gdb-remote/./ProcessGdbRemoteTests/GDBRemoteCommunicationClientTest.SaveRestoreRegistersNoSuffix (1764 of 1983) PASS: lldb-shell :: ObjectFile/PECOFF/sections.yaml (1765 of 1983) PASS: lldb-unit :: Utility/./UtilityTests/StreamTest.PutCharWhitespace (1766 of 1983) PASS: lldb-api :: commands/expression/context-object-objc/TestContextObjectObjc.py (1767 of 1983) PASS: lldb-shell :: Driver/TestConvenienceVariables.test (1768 of 1983) PASS: lldb-shell :: Driver/TestSingleQuote.test (1769 of 1983) XFAIL: lldb-shell :: Register/x86-mm-xmm-read.test (1770 of 1983) PASS: lldb-api :: lang/objc/rdar-11355592/TestRdar11355592.py (1771 of 1983) PASS: lldb-api :: functionalities/signal/handle-abrt/TestHandleAbort.py (1772 of 1983) PASS: lldb-shell :: SymbolFile/DWARF/dwp-separate-debug-file.cpp (1773 of 1983) PASS: lldb-unit :: Process/gdb-remote/./ProcessGdbRemoteTests/GDBRemoteCommunicationClientTest.SendStartTracePacket (1774 of 1983) PASS: lldb-api :: types/TestCharTypeExpr.py (1775 of 1983) UNSUPPORTED: lldb-shell :: Register/x86-64-gp-write.test (1776 of 1983) PASS: lldb-unit :: Target/./TargetTests/PathMappingListTest.AbsoluteTests (1777 of 1983) PASS: lldb-unit :: Utility/./UtilityTests/StreamTest.AddressRangeSize (1778 of 1983) PASS: lldb-unit :: ScriptInterpreter/Python/./ScriptInterpreterPythonTests/PythonDataObjectsTest.TestPythonByteArray (1779 of 1983) PASS: lldb-unit :: Host/./HostTests/FileSystemTest.FileAndDirectoryComponents (1780 of 1983) PASS: lldb-shell :: ObjectFile/wasm/stripped-debug-sections.yaml (1781 of 1983) PASS: lldb-unit :: Utility/./UtilityTests/UriParserTest.Empty (1782 of 1983) PASS: lldb-unit :: ScriptInterpreter/Python/./ScriptInterpreterPythonTests/PythonDataObjectsTest.TestPythonTupleInitializerList2 (1783 of 1983) PASS: lldb-api :: functionalities/source-map/TestTargetSourceMap.py (1784 of 1983) PASS: lldb-api :: functionalities/data-formatter/type_summary_list_script/TestTypeSummaryListScript.py (1785 of 1983) PASS: lldb-api :: lang/cpp/constructors/TestCppConstructors.py (1786 of 1983) PASS: lldb-unit :: Signals/./SignalsTests/UnixSignalsTest.VersionChange (1787 of 1983) PASS: lldb-unit :: Host/./HostTests/NativeProcessProtocolTest.ReadCStringFromMemory (1788 of 1983) PASS: lldb-api :: functionalities/thread/concurrent_events/TestConcurrentWatchpointWithDelayWatchpointThreads.py (1789 of 1983) PASS: lldb-api :: python_api/get-value-32bit-int/TestGetValue32BitInt.py (1790 of 1983) PASS: lldb-api :: commands/watchpoints/watchpoint_on_vectors/TestValueOfVectorVariable.py (1791 of 1983) PASS: lldb-shell :: Reproducer/TestDump.test (1792 of 1983) PASS: lldb-unit :: Utility/./UtilityTests/BinaryStreamTest.PutULEB128FourBytes (1793 of 1983) PASS: lldb-shell :: Quit/TestQuitExitCode30.test (1794 of 1983) PASS: lldb-api :: lang/objc/objc-checker/TestObjCCheckers.py (1795 of 1983) UNSUPPORTED: lldb-api :: arm/breakpoint-it/TestBreakpointIt.py (1796 of 1983) PASS: lldb-unit :: Utility/./UtilityTests/FileSpecTest.CopyByAppendingPathComponent (1797 of 1983) UNSUPPORTED: lldb-api :: lang/c/typedef/Testtypedef.py (1798 of 1983) PASS: lldb-shell :: Expr/TestTypeOfDeclTypeExpr.test (1799 of 1983) PASS: lldb-unit :: Utility/./UtilityTests/RangeTest.LessThanInvalid (1800 of 1983) PASS: lldb-api :: lang/c/vla/TestVLA.py (1801 of 1983) PASS: lldb-api :: lang/c/strings/TestCStrings.py (1802 of 1983) PASS: lldb-unit :: Interpreter/./InterpreterTests/CompletionTest.DirCompletionAbsolute (1803 of 1983) PASS: lldb-unit :: Utility/./UtilityTests/VMRange.Reset (1804 of 1983) PASS: lldb-unit :: Process/gdb-remote/./ProcessGdbRemoteTests/GDBRemoteCommunicationServerTest.SendErrorResponse_StringError (1805 of 1983) PASS: lldb-shell :: Unwind/eh-frame-dwarf-unwind.test (1806 of 1983) UNSUPPORTED: lldb-api :: functionalities/thread/create_during_step/TestCreateDuringStep.py (1807 of 1983) PASS: lldb-unit :: Utility/./UtilityTests/UUIDTest.RelationalOperators (1808 of 1983) UNSUPPORTED: lldb-shell :: SymbolFile/PDB/ast-restore.test (1809 of 1983) PASS: lldb-unit :: Utility/./UtilityTests/ArchSpecTest.OperatorBool (1810 of 1983) PASS: lldb-unit :: Utility/./UtilityTests/StringListTest.ShiftStdString (1811 of 1983) PASS: lldb-api :: functionalities/postmortem/elf-core/thread_crash/TestLinuxCoreThreads.py (1812 of 1983) PASS: lldb-unit :: debugserver/./debugserverTests/JSON.Parse (1813 of 1983) PASS: lldb-shell :: Breakpoint/jitbp_elf.test (1814 of 1983) PASS: lldb-api :: functionalities/postmortem/elf-core/TestLinuxCore.py (1815 of 1983) PASS: lldb-api :: types/TestFloatTypes.py (1816 of 1983) PASS: lldb-shell :: ObjectFile/PECOFF/export-dllfunc.yaml (1817 of 1983) PASS: lldb-shell :: Breakpoint/debug_addrx.test (1818 of 1983) PASS: lldb-api :: commands/frame/var-scope/TestFrameVariableScope.py (1819 of 1983) PASS: lldb-unit :: Utility/./UtilityTests/UriParserTest.BracketedHostnameWithPortIPv4 (1820 of 1983) PASS: lldb-unit :: Symbol/./SymbolTests/TestClangASTImporter.DeportTypeTagDecl (1821 of 1983) PASS: lldb-api :: functionalities/thread/jump/TestThreadJump.py (1822 of 1983) PASS: lldb-api :: lang/objc/foundation/TestSymbolTable.py (1823 of 1983) PASS: lldb-api :: functionalities/postmortem/mach-core/TestMachCore.py (1824 of 1983) PASS: lldb-shell :: ObjectFile/MachO/symtab.yaml (1825 of 1983) UNSUPPORTED: lldb-api :: functionalities/data-formatter/data-formatter-stl/libstdcpp/vbool/TestDataFormatterStdVBool.py (1826 of 1983) PASS: lldb-api :: functionalities/rerun/TestRerun.py (1827 of 1983) PASS: lldb-api :: functionalities/gdb_remote_client/TestNoGPacketSupported.py (1828 of 1983) UNSUPPORTED: lldb-shell :: ScriptInterpreter/Lua/nested_sessions.test (1829 of 1983) PASS: lldb-unit :: Utility/./UtilityTests/StringExtractorTest.GetHexBytes_OddPair (1830 of 1983) PASS: lldb-api :: tools/lldb-server/TestGdbRemote_vCont.py (1831 of 1983) PASS: lldb-api :: lang/cpp/scope/TestCppScope.py (1832 of 1983) UNSUPPORTED: lldb-api :: functionalities/signal/handle-segv/TestHandleSegv.py (1833 of 1983) PASS: lldb-api :: lang/objc/modules-app-update/TestClangModulesAppUpdate.py (1834 of 1983) PASS: lldb-unit :: Host/./HostTests/SocketTest.DomainListenConnectAccept (1835 of 1983) PASS: lldb-unit :: Utility/./UtilityTests/StringListTest.RemoveBlankLines (1836 of 1983) PASS: lldb-unit :: Utility/./UtilityTests/EnvironmentTest.EnvpConversion (1837 of 1983) PASS: lldb-unit :: Process/minidump/./LLDBMinidumpTests/MinidumpParserTest.GetMemoryRegionInfoFromMemoryList (1838 of 1983) PASS: lldb-api :: python_api/findvalue_duplist/TestSBFrameFindValue.py (1839 of 1983) PASS: lldb-api :: commands/expression/po_verbosity/TestPoVerbosity.py (1840 of 1983) PASS: lldb-unit :: Utility/./UtilityTests/StringExtractorTest.GetHexBytesAvail_FullString (1841 of 1983) PASS: lldb-shell :: VSCode/TestOptions.test (1842 of 1983) PASS: lldb-unit :: Symbol/./SymbolTests/TestClangASTImporter.CopyDeclTagDecl (1843 of 1983) PASS: lldb-unit :: Symbol/./SymbolTests/PostfixExpression.ParseFPOProgram (1844 of 1983) PASS: lldb-unit :: Language/Highlighting/./HighlighterTests/HighlighterTest.ClangPPDirectives (1845 of 1983) PASS: lldb-unit :: Host/./HostTests/File.GetWaitableHandleFileno (1846 of 1983) PASS: lldb-shell :: SymbolFile/NativePDB/source-list.cpp (1847 of 1983) UNSUPPORTED: lldb-api :: lang/objc/bitfield_ivars/TestBitfieldIvars.py (1848 of 1983) PASS: lldb-unit :: Utility/./UtilityTests/RangeTest.Slide (1849 of 1983) PASS: lldb-unit :: Utility/./UtilityTests/StreamTest.PutBytesAsRawHex8ToMixedEndian (1850 of 1983) PASS: lldb-unit :: Utility/./UtilityTests/StringExtractorTest.GetHexBytes_Underflow (1851 of 1983) PASS: lldb-unit :: Utility/./UtilityTests/CompletionRequest.DuplicateFilteringWithComments (1852 of 1983) PASS: lldb-unit :: ScriptInterpreter/Python/./ScriptInterpreterPythonTests/PythonDataObjectsTest.TestPythonBoolean (1853 of 1983) PASS: lldb-unit :: UnwindAssembly/x86/./UnwindAssemblyx86Tests/Testx86AssemblyInspectionEngine.TestPopR12 (1854 of 1983) PASS: lldb-api :: commands/watchpoints/watchpoint_disable/TestWatchpointDisable.py (1855 of 1983) PASS: lldb-api :: functionalities/unwind/noreturn/TestNoreturnUnwind.py (1856 of 1983) PASS: lldb-api :: functionalities/testid/TestTestId.py (1857 of 1983) PASS: lldb-unit :: Utility/./UtilityTests/LogChannelEnabledTest.LogThread (1858 of 1983) PASS: lldb-unit :: Utility/./UtilityTests/StreamTest.AddressEmptyPrefix (1859 of 1983) PASS: lldb-unit :: Utility/./UtilityTests/StreamTeeTest.GetStreamAtIndexOutOfBounds (1860 of 1983) PASS: lldb-api :: commands/expression/import-std-module/stack/TestStackFromStdModule.py (1861 of 1983) PASS: lldb-api :: lang/cpp/function_refs/TestFunctionRefs.py (1862 of 1983) PASS: lldb-api :: functionalities/memory-region/TestMemoryRegion.py (1863 of 1983) PASS: lldb-api :: lang/cpp/overloaded-functions/TestOverloadedFunctions.py (1864 of 1983) PASS: lldb-api :: lang/cpp/unsigned_types/TestUnsignedTypes.py (1865 of 1983) PASS: lldb-unit :: Utility/./UtilityTests/OptionsWithRawTest.TerminatedQuote (1866 of 1983) PASS: lldb-api :: commands/command/nested_alias/TestNestedAlias.py (1867 of 1983) PASS: lldb-api :: functionalities/data-formatter/language_category_updates/TestDataFormatterLanguageCategoryUpdates.py (1868 of 1983) PASS: lldb-shell :: ObjectFile/PECOFF/section-types.yaml (1869 of 1983) PASS: lldb-unit :: Language/Highlighting/./HighlighterTests/HighlighterTest.ClangCursorPosAfterOtherToken (1870 of 1983) PASS: lldb-api :: lang/c/function_types/TestFunctionTypes.py (1871 of 1983) UNSUPPORTED: lldb-shell :: ScriptInterpreter/Lua/independent_state.test (1872 of 1983) PASS: lldb-unit :: Utility/./UtilityTests/AnsiTerminal.Incomplete (1873 of 1983) PASS: lldb-unit :: Utility/./UtilityTests/StreamTest.PutCStringWithStringRef (1874 of 1983) PASS: lldb-api :: functionalities/tail_call_frames/thread_step_out_message/TestArtificialFrameStepOutMessage.py (1875 of 1983) PASS: lldb-api :: commands/expression/import-std-module/forward_list/TestForwardListFromStdModule.py (1876 of 1983) PASS: lldb-unit :: UnwindAssembly/x86/./UnwindAssemblyx86Tests/Testx86AssemblyInspectionEngine.TestPopEBP (1877 of 1983) PASS: lldb-api :: functionalities/data-formatter/data-formatter-ptr-to-array/TestPtrToArrayFormatting.py (1878 of 1983) PASS: lldb-shell :: SymbolFile/DWARF/debug-types-address-ranges.s (1879 of 1983) PASS: lldb-api :: functionalities/data-formatter/cstring-utf8-summary/TestCstringUnicode.py (1880 of 1983) PASS: lldb-api :: commands/help/TestHelp.py (1881 of 1983) PASS: lldb-unit :: Utility/./UtilityTests/RangeTest.DoesAdjoinOrIntersect (1882 of 1983) PASS: lldb-api :: functionalities/data-formatter/data-formatter-objc/cmtime/TestDataFormatterCMTime.py (1883 of 1983) PASS: lldb-api :: functionalities/data-formatter/refpointer-recursion/TestDataFormatterRefPtrRecursion.py (1884 of 1983) PASS: lldb-unit :: Utility/./UtilityTests/BinaryStreamTest.PutSLEB128SevenBytes (1885 of 1983) PASS: lldb-shell :: SymbolFile/DWARF/find-inline-method.s (1886 of 1983) PASS: lldb-api :: functionalities/breakpoint/step_over_breakpoint/TestStepOverBreakpoint.py (1887 of 1983) PASS: lldb-api :: functionalities/reproducers/attach/TestReproducerAttach.py (1888 of 1983) PASS: lldb-api :: functionalities/data-formatter/data-formatter-stl/libcxx/tuple/TestDataFormatterLibcxxTuple.py (1889 of 1983) PASS: lldb-api :: functionalities/breakpoint/breakpoint_command/TestBreakpointCommand.py (1890 of 1983) PASS: lldb-shell :: ObjectFile/ELF/section-types-edgecases.yaml (1891 of 1983) PASS: lldb-api :: commands/expression/import-std-module/deque-dbg-info-content/TestDbgInfoContentDequeFromStdModule.py (1892 of 1983) PASS: lldb-unit :: Expression/./ExpressionTests/CppModuleConfigurationTest.MissingLibCpp (1893 of 1983) PASS: lldb-unit :: Utility/./UtilityTests/CompletionRequest.Constructor (1894 of 1983) UNSUPPORTED: lldb-api :: functionalities/darwin_log/filter/exact_match/subsystem/TestDarwinLogFilterMatchSubsystem.py (1895 of 1983) PASS: lldb-unit :: Utility/./UtilityTests/StreamTest.ShiftOperatorStrings (1896 of 1983) PASS: lldb-unit :: Utility/./UtilityTests/RangeDataVector.FindEntryIndexesThatContain (1897 of 1983) PASS: lldb-unit :: Utility/./UtilityTests/VMRange.SetEndAddress (1898 of 1983) PASS: lldb-api :: functionalities/load_unload/TestLoadUnload.py (1899 of 1983) PASS: lldb-api :: lang/objc/objc-class-method/TestObjCClassMethod.py (1900 of 1983) PASS: lldb-api :: python_api/watchpoint/watchlocation/TestSetWatchlocation.py (1901 of 1983) PASS: lldb-unit :: Utility/./UtilityTests/ArgsTest.ReplaceArgumentAtIndexFarOutOfRange (1902 of 1983) PASS: lldb-shell :: SymbolFile/DWARF/clang-ast-from-dwarf-objc-property.m (1903 of 1983) PASS: lldb-unit :: Process/gdb-remote/./ProcessGdbRemoteTests/GDBRemoteClientBaseTest.SendContinueAndWait (1904 of 1983) PASS: lldb-unit :: Utility/./UtilityTests/TimerTest.CategoryTimesNested (1905 of 1983) UNSUPPORTED: lldb-shell :: Register/x86-gp-write.test (1906 of 1983) PASS: lldb-api :: commands/process/launch-with-shellexpand/TestLaunchWithShellExpand.py (1907 of 1983) PASS: lldb-unit :: ScriptInterpreter/Python/./ScriptInterpreterPythonTests/PythonDataObjectsTest.TestObjectAttributes (1908 of 1983) PASS: lldb-api :: commands/frame/diagnose/local-variable/TestLocalVariable.py (1909 of 1983) PASS: lldb-shell :: SymbolFile/DWARF/array-sizes.s (1910 of 1983) UNSUPPORTED: lldb-shell :: SymbolFile/PDB/typedefs.test (1911 of 1983) PASS: lldb-unit :: Utility/./UtilityTests/StringExtractorTest.GetHexU8_Exact (1912 of 1983) PASS: lldb-shell :: SymbolFile/NativePDB/global-classes.cpp (1913 of 1983) PASS: lldb-unit :: Process/minidump/./LLDBMinidumpTests/MinidumpParserTest.GetExceptionStream (1914 of 1983) PASS: lldb-api :: commands/watchpoints/hello_watchpoint/TestMyFirstWatchpoint.py (1915 of 1983) PASS: lldb-api :: functionalities/thread/backtrace_limit/TestBacktraceLimit.py (1916 of 1983) PASS: lldb-unit :: Process/gdb-remote/./ProcessGdbRemoteTests/GDBRemoteClientBaseTest.SendContinueAndLateInterrupt (1917 of 1983) PASS: lldb-api :: functionalities/data-formatter/data-formatter-stl/libcxx/set/TestDataFormatterLibcxxSet.py (1918 of 1983) UNSUPPORTED: lldb-api :: benchmarks/continue/TestBenchmarkContinue.py (1919 of 1983) PASS: lldb-api :: functionalities/data-formatter/nsarraysynth/TestNSArraySynthetic.py (1920 of 1983) PASS: lldb-shell :: SymbolFile/DWARF/find-function-regex.cpp (1921 of 1983) PASS: lldb-shell :: BuildScript/toolchain-clang.test (1922 of 1983) PASS: lldb-api :: python_api/lldbutil/TestSwigVersion.py (1923 of 1983) PASS: lldb-shell :: Reproducer/Functionalities/TestExpressionEvaluation.test (1924 of 1983) PASS: lldb-unit :: UnwindAssembly/x86/./UnwindAssemblyx86Tests/Testx86AssemblyInspectionEngine.TestReturnDetect (1925 of 1983) PASS: lldb-api :: functionalities/fat_archives/TestFatArchives.py (1926 of 1983) PASS: lldb-unit :: ScriptInterpreter/Python/./ScriptInterpreterPythonTests/PythonDataObjectsTest.TestPythonCallableInvoke (1927 of 1983) PASS: lldb-shell :: Minidump/Windows/find-module.test (1928 of 1983) PASS: lldb-api :: lang/cpp/offsetof/TestOffsetofCpp.py (1929 of 1983) UNSUPPORTED: lldb-shell :: ScriptInterpreter/Lua/bindings.test (1930 of 1983) PASS: lldb-unit :: Host/./HostTests/NativeProcessProtocolTest.ReadCStringFromMemory_MaxSize (1931 of 1983) PASS: lldb-api :: commands/expression/argument_passing_restrictions/TestArgumentPassingRestrictions.py (1932 of 1983) PASS: lldb-api :: functionalities/thread/concurrent_events/TestConcurrentCrashWithSignal.py (1933 of 1983) PASS: lldb-shell :: ObjectFile/wasm/basic.yaml (1934 of 1983) PASS: lldb-unit :: Utility/./UtilityTests/ArchSpecTest.MergeFromMachOUnknown (1935 of 1983) PASS: lldb-unit :: Utility/./UtilityTests/DeserializerTest.HasData (1936 of 1983) PASS: lldb-api :: commands/expression/unwind_expression/TestUnwindExpression.py (1937 of 1983) PASS: lldb-unit :: SymbolFile/NativePDB/./SymbolFileNativePDBTests/PDBFPOProgramToDWARFExpressionTests.SingleAssignmentRegisterRef (1938 of 1983) PASS: lldb-shell :: Reproducer/TestDiscard.test (1939 of 1983) PASS: lldb-api :: commands/watchpoints/watchpoint_commands/TestWatchpointCommands.py (1940 of 1983) UNSUPPORTED: lldb-api :: python_api/event/TestEvents.py (1941 of 1983) PASS: lldb-unit :: UnwindAssembly/x86/./UnwindAssemblyx86Tests/Testx86AssemblyInspectionEngine.TestPushR12 (1942 of 1983) PASS: lldb-api :: commands/expression/dont_allow_jit/TestAllowJIT.py (1943 of 1983) PASS: lldb-shell :: SymbolFile/DWARF/split-dwarf-inlining.cpp (1944 of 1983) PASS: lldb-api :: lang/objc/objc-foundation-dictionary-empty/TestNSDictionary0.py (1945 of 1983) PASS: lldb-unit :: Utility/./UtilityTests/StringExtractorTest.GetNameColonValueSuccess (1946 of 1983) PASS: lldb-api :: types/TestDoubleTypesExpr.py (1947 of 1983) PASS: lldb-unit :: Utility/./UtilityTests/ArchSpecTest.TestSetTriple (1948 of 1983) PASS: lldb-api :: lang/cpp/gmodules/TestWithModuleDebugging.py (1949 of 1983) PASS: lldb-shell :: Settings/TestDisassemblyFormat.test (1950 of 1983) PASS: lldb-api :: lang/objc/objc-struct-argument/TestObjCStructArgument.py (1951 of 1983) PASS: lldb-shell :: SymbolFile/NativePDB/disassembly.cpp (1952 of 1983) PASS: lldb-api :: lang/cpp/unicode-literals/TestUnicodeLiterals.py (1953 of 1983) PASS: lldb-unit :: Utility/./UtilityTests/StringListTest.InsertStringAtIndexOutOfBounds (1954 of 1983) PASS: lldb-unit :: Symbol/./SymbolTests/TestTypeSystemClang.TestFunctionTemplateInRecordConstruction (1955 of 1983) PASS: lldb-unit :: Utility/./UtilityTests/VASprintfTest.NoBufferResize (1956 of 1983) PASS: lldb-api :: commands/expression/diagnostics/TestExprDiagnostics.py (1957 of 1983) PASS: lldb-unit :: Utility/./UtilityTests/FileSpecTest.OperatorBool (1958 of 1983) PASS: lldb-shell :: SymbolFile/DWARF/inline-function-address-shared.test (1959 of 1983) PASS: lldb-unit :: Utility/./UtilityTests/FileSpecTest.Yaml (1960 of 1983) PASS: lldb-unit :: Language/CPlusPlus/./LanguageCPlusPlusTests/CPlusPlusLanguage.FindAlternateFunctionManglings (1961 of 1983) PASS: lldb-unit :: Process/gdb-remote/./ProcessGdbRemoteTests/GDBRemoteClientBaseTest.SendContinueAndAsyncPacket (1962 of 1983) PASS: lldb-unit :: Utility/./UtilityTests/ScalarTest.Comparison (1963 of 1983) UNSUPPORTED: lldb-shell :: Register/x86-zmm-write.test (1964 of 1983) PASS: lldb-api :: functionalities/thread/concurrent_events/TestConcurrentWatchBreakDelay.py (1965 of 1983) PASS: lldb-unit :: Utility/./UtilityTests/BinaryStreamTest.PutSLEB128MaxValue (1966 of 1983) PASS: lldb-unit :: Utility/./UtilityTests/ConstStringTest.FromMidOfBufferStringRef (1967 of 1983) PASS: lldb-unit :: Process/minidump/./LLDBMinidumpTests/MinidumpParserTest.GetThreadContext_x86_32 (1968 of 1983) PASS: lldb-unit :: Utility/./UtilityTests/Predicate.WaitForValueNotEqualTo (1969 of 1983) PASS: lldb-shell :: ObjectFile/ELF/section-addresses.yaml (1970 of 1983) PASS: lldb-api :: functionalities/inferior-crashing/recursive-inferior/TestRecursiveInferiorStep.py (1971 of 1983) PASS: lldb-unit :: Process/minidump/./LLDBMinidumpTests/MinidumpParserTest.GetMemoryRegionInfoFromMemory64List (1972 of 1983) PASS: lldb-unit :: ObjectFile/PECOFF/./ObjectFilePECOFFTests/PECallFrameInfoTest.Frame_reg_eh (1973 of 1983) PASS: lldb-shell :: SymbolFile/Breakpad/unwind-via-raSearch.test (1974 of 1983) PASS: lldb-unit :: Core/./LLDBCoreTests/MangledTest.ResultForValidName (1975 of 1983) PASS: lldb-unit :: UnwindAssembly/x86/./UnwindAssemblyx86Tests/Testx86AssemblyInspectionEngine.TestPushEBP (1976 of 1983) PASS: lldb-unit :: Utility/./UtilityTests/BinaryStreamTest.PutSLEB128TwoBytes (1977 of 1983) PASS: lldb-unit :: SymbolFile/DWARF/./SymbolFileDWARFTests/SymbolFileDWARFTests.TestAbilitiesForDWARF (1978 of 1983) PASS: lldb-unit :: UnwindAssembly/x86/./UnwindAssemblyx86Tests/Testx86AssemblyInspectionEngine.Testi386IgnoredRegisters (1979 of 1983) PASS: lldb-api :: lang/cpp/namespace/TestNamespace.py (1980 of 1983) PASS: lldb-api :: functionalities/thread/concurrent_events/TestConcurrentTwoBreakpointsOneSignal.py (1981 of 1983) PASS: lldb-api :: commands/expression/completion/TestExprCompletion.py (1982 of 1983) PASS: lldb-api :: api/multithreaded/TestMultithreaded.py (1983 of 1983)

Hide Details

Testing Time: 4536.80s ******************** Failing Tests (3): lldb-api :: python_api/thread/TestThreadAPI.py lldb-api :: lang/objc/ptr_refs/TestPtrRefsObjC.py lldb-api :: functionalities/ptr_refs/TestPtrRefs.py

Hide Details

Hide Details

Slowest Tests: -------------------------------------------------------------------------- 94.29s: lldb-api :: commands/settings/TestSettings.py 95.95s: lldb-api :: functionalities/data-formatter/data-formatter-objc/TestDataFormatterObjCCF.py 98.29s: lldb-api :: types/TestLongTypes.py 109.59s: lldb-api :: python_api/lldbutil/iter/TestLLDBIterator.py 119.44s: lldb-api :: lang/objc/foundation/TestObjCMethodsString.py 121.23s: lldb-api :: tools/lldb-server/TestGdbRemote_qThreadStopInfo.py 121.28s: lldb-api :: lang/objc/objc-new-syntax/TestObjCNewSyntaxArray.py 121.44s: lldb-api :: lang/objc/objc-new-syntax/TestObjCNewSyntaxDictionary.py 121.75s: lldb-api :: lang/objc/foundation/TestObjCMethodsNSError.py 132.76s: lldb-api :: types/TestLongTypesExpr.py 144.89s: lldb-api :: lang/objc/exceptions/TestObjCExceptions.py 144.96s: lldb-api :: lang/objc/real-definition/TestRealDefinition.py 161.09s: lldb-api :: lang/objc/objc-new-syntax/TestObjCNewSyntaxLiteral.py 161.62s: lldb-api :: lang/cpp/namespace/TestNamespaceLookup.py 224.45s: lldb-api :: lang/objc/foundation/TestObjCMethods.py 226.84s: lldb-api :: lang/objc/hidden-ivars/TestHiddenIvars.py 239.28s: lldb-api :: api/multithreaded/TestMultithreaded.py 249.53s: lldb-api :: tools/lldb-server/TestGdbRemoteThreadsInStopReply.py 274.28s: lldb-api :: lang/cpp/enum_types/TestCPP11EnumTypes.py 368.72s: lldb-api :: tools/lldb-server/TestLldbGdbServer.py

Hide Details

Tests Times: -------------------------------------------------------------------------- [ Range ] :: [ Percentage ] :: [ Count ] -------------------------------------------------------------------------- [ 0s, 20s) :: [********************************** ] :: [1727/1983] [ 20s, 40s) :: [** ] :: [ 111/1983] [ 40s, 60s) :: [* ] :: [ 89/1983] [ 60s, 80s) :: [ ] :: [ 29/1983] [ 80s,100s) :: [ ] :: [ 9/1983] [100s,120s) :: [ ] :: [ 2/1983] [120s,140s) :: [ ] :: [ 6/1983] [140s,160s) :: [ ] :: [ 2/1983] [160s,180s) :: [ ] :: [ 2/1983] [180s,200s) :: [ ] :: [ 0/1983] [200s,220s) :: [ ] :: [ 0/1983] [220s,240s) :: [ ] :: [ 2/1983] [240s,260s) :: [ ] :: [ 2/1983] [260s,280s) :: [ ] :: [ 0/1983] [280s,300s) :: [ ] :: [ 1/1983] [300s,320s) :: [ ] :: [ 0/1983] [320s,340s) :: [ ] :: [ 0/1983] [340s,360s) :: [ ] :: [ 0/1983] [360s,380s) :: [ ] :: [ 1/1983] Expected Passes : 1806 Expected Failures : 6 Unsupported Tests : 168 Unexpected Failures: 3 FAILED: tools/lldb/test/CMakeFiles/check-lldb-lit cd /Users/buildslave/jenkins/workspace/lldb-cmake-sanitized/lldb-build/tools/lldb/test && /usr/local/bin/python /Users/buildslave/jenkins/workspace/lldb-cmake-sanitized/lldb-build/./bin/llvm-lit -v --time-tests --shuffle --xunit-xml-output=/Users/buildslave/jenkins/workspace/lldb-cmake-sanitized/test/results.xml -v -j 4 --timeout 1200 /Users/buildslave/jenkins/workspace/lldb-cmake-sanitized/lldb-build/tools/lldb/test ninja: build stopped: subcommand failed. Command failed: Command '['/usr/bin/env', 'TERM=vt100', '/usr/local/bin/ninja', '-v', 'check-lldb']' returned non-zero exit status 1. Command: ['/usr/bin/env', 'TERM=vt100', '/usr/local/bin/ninja', '-v', 'check-lldb'] [Pipeline] } [Pipeline] // timeout [Pipeline] } [Pipeline] // stage [Pipeline] stage [Pipeline] { (Declarative: Post Actions) [Pipeline] scanForIssues [Clang (LLVM based)] Sleeping for 5 seconds due to JENKINS-32191... [Clang (LLVM based)] Parsing console log (workspace: '/Users/buildslave/jenkins/workspace/lldb-cmake-sanitized') [Clang (LLVM based)] Successfully parsed console log [Clang (LLVM based)] -> found 5 issues (skipped 0 duplicates) [Clang (LLVM based)] Post processing issues on 'green-dragon-23' with source code encoding 'UTF-8' [Clang (LLVM based)] Creating SCM blamer to obtain author and commit information for affected files [Clang (LLVM based)] Creating SCM miner to obtain statistics for affected repository files [Clang (LLVM based)] Resolving file names for all issues in source directory '/Users/buildslave/jenkins/workspace/lldb-cmake-sanitized' [Clang (LLVM based)] -> resolved paths in source directory (4 found, 0 not found) [Clang (LLVM based)] Resolving module names from module definitions (build.xml, pom.xml, or Manifest.mf files) [Clang (LLVM based)] -> resolved module names for 5 issues [Clang (LLVM based)] Resolving package names (or namespaces) by parsing the affected files [Clang (LLVM based)] -> resolved package names of 4 affected files [Clang (LLVM based)] No filter has been set, publishing all 5 issues [Clang (LLVM based)] Creating fingerprints for all affected code blocks to track issues over different builds [Clang (LLVM based)] -> created fingerprints for 5 issues (skipped 0 issues) [Clang (LLVM based)] Copying affected files to Jenkins' build folder '/Users/Shared/Jenkins/Home/jobs/lldb-cmake-sanitized/builds/1189/files-with-issues' [Clang (LLVM based)] -> 4 copied, 0 not in workspace, 0 not-found, 0 with I/O error [Pipeline] junit Recording test results [Pipeline] } [Pipeline] // stage [Pipeline] } [Pipeline] // withEnv [Pipeline] } [Pipeline] // node [Pipeline] End of Pipeline ERROR: script returned exit code 1 Finished: FAILURE