FailedConsole Output

Skipping 8,576 KB.. Full Log
ectForIndex (1110 of 1989)
PASS: lldb-unit :: Utility/./UtilityTests/StringListTest.AppendStringStdString (1111 of 1989)
PASS: lldb-api :: python_api/lldbutil/iter/TestLLDBIterator.py (1112 of 1989)
PASS: lldb-api :: lang/objc/orderedset/TestOrderedSet.py (1113 of 1989)
PASS: lldb-api :: python_api/watchpoint/watchlocation/TestSetWatchlocation.py (1114 of 1989)
PASS: lldb-shell :: SymbolFile/Breakpad/stack-cfi-parsing.test (1115 of 1989)
PASS: lldb-unit :: debugserver/./debugserverTests/RNBSocket.LoopBackListenIPv6 (1116 of 1989)
PASS: lldb-api :: tools/lldb-server/TestGdbRemoteExitCode.py (1117 of 1989)
PASS: lldb-unit :: Signals/./SignalsTests/UnixSignalsTest.GetFilteredSignals (1118 of 1989)
PASS: lldb-unit :: Utility/./UtilityTests/ArchSpecTest.TestParseMachCPUDashSubtypeTripleExtra (1119 of 1989)
PASS: lldb-unit :: Utility/./UtilityTests/BinaryStreamTest.PutSLEB128One (1120 of 1989)
PASS: lldb-api :: commands/expression/weak_symbols/TestWeakSymbols.py (1121 of 1989)
PASS: lldb-api :: lang/cpp/lambdas/TestLambdas.py (1122 of 1989)
PASS: lldb-unit :: Utility/./UtilityTests/CompletionRequest.ShiftArguments (1123 of 1989)
PASS: lldb-api :: lang/c/struct_types/TestStructTypes.py (1124 of 1989)
PASS: lldb-api :: lang/cpp/global_operators/TestCppGlobalOperators.py (1125 of 1989)
PASS: lldb-unit :: Utility/./UtilityTests/StringExtractorTest.GetU64BigEndian (1126 of 1989)
PASS: lldb-shell :: SymbolFile/DWARF/find-function-regex.cpp (1127 of 1989)
PASS: lldb-unit :: Utility/./UtilityTests/ConstStringTest.MangledCounterpart (1128 of 1989)
PASS: lldb-unit :: Language/Highlighting/./HighlighterTests/HighlighterTest.ClangStringLiterals (1129 of 1989)
PASS: lldb-api :: commands/target/dump-symtab-demangle/TestDumpSymtabDemangle.py (1130 of 1989)
PASS: lldb-unit :: Symbol/./SymbolTests/TestTypeSystemClang.TestGetTypeClassDeclType (1131 of 1989)
PASS: lldb-api :: functionalities/reproducers/attach/TestReproducerAttach.py (1132 of 1989)
PASS: lldb-api :: functionalities/data-formatter/data-formatter-objc/cmtime/TestDataFormatterCMTime.py (1133 of 1989)
PASS: lldb-unit :: Expression/./ExpressionTests/DiagnosticManagerTest.HasFixits (1134 of 1989)
PASS: lldb-unit :: Language/Highlighting/./HighlighterTests/HighlighterTest.ClangCursorPosAfterOtherToken (1135 of 1989)
PASS: lldb-shell :: Minidump/memory-region-from-module.yaml (1136 of 1989)
PASS: lldb-shell :: Reproducer/TestReuseDirectory.test (1137 of 1989)
UNSUPPORTED: lldb-shell :: Process/Windows/exception_access_violation.cpp (1138 of 1989)
PASS: lldb-shell :: ObjectFile/ELF/minidebuginfo-corrupt-xz.yaml (1139 of 1989)
PASS: lldb-unit :: Symbol/./SymbolTests/TestTypeSystemClang.TestUnifyAccessSpecifiers (1140 of 1989)
PASS: lldb-unit :: Host/./HostTests/SocketTest.UDPGetConnectURI (1141 of 1989)
PASS: lldb-unit :: Expression/./ExpressionTests/ClangHostTest.MacOSX (1142 of 1989)
PASS: lldb-unit :: ScriptInterpreter/Python/./ScriptInterpreterPythonTests/PythonDataObjectsTest.TestExtractingUInt64ThroughStructuredData (1143 of 1989)
PASS: lldb-api :: commands/expression/pr35310/TestExprsBug35310.py (1144 of 1989)
PASS: lldb-unit :: Host/./HostTests/FileSystemTest.Exists (1145 of 1989)
PASS: lldb-unit :: ScriptInterpreter/Python/./ScriptInterpreterPythonTests/PythonDataObjectsTest.TestPythonBoolean (1146 of 1989)
PASS: lldb-api :: macosx/function-starts/TestFunctionStarts.py (1147 of 1989)
PASS: lldb-unit :: ObjectFile/Breakpad/./ObjectFileBreakpadTests/StackWinRecord.parse (1148 of 1989)
PASS: lldb-api :: functionalities/data-formatter/data-formatter-stl/libcxx/unique_ptr/TestDataFormatterLibcxxUniquePtr.py (1149 of 1989)
PASS: lldb-api :: lang/objc/print-obj/TestPrintObj.py (1150 of 1989)
PASS: lldb-api :: functionalities/backticks/TestBackticksWithoutATarget.py (1151 of 1989)
PASS: lldb-api :: functionalities/data-formatter/data-formatter-stl/libcxx/function/TestLibCxxFunction.py (1152 of 1989)
PASS: lldb-unit :: Symbol/./SymbolTests/DWARFCallFrameInfoTest.Basic_dwarf3 (1153 of 1989)
PASS: lldb-unit :: ScriptInterpreter/Python/./ScriptInterpreterPythonTests/PythonDataObjectsTest.TestPythonListValueEquality (1154 of 1989)
PASS: lldb-api :: commands/expression/radar_8638051/Test8638051.py (1155 of 1989)
PASS: lldb-unit :: Utility/./UtilityTests/AnsiTerminal.Empty (1156 of 1989)
PASS: lldb-api :: types/TestCharType.py (1157 of 1989)
PASS: lldb-shell :: ObjectFile/ELF/duplicate-section.yaml (1158 of 1989)
PASS: lldb-unit :: ScriptInterpreter/Python/./ScriptInterpreterPythonTests/PythonDataObjectsTest.TestResetting (1159 of 1989)
PASS: lldb-unit :: Utility/./UtilityTests/StatusTest.ErrorConstructor (1160 of 1989)
PASS: lldb-unit :: Utility/./UtilityTests/OptionsWithRawTest.EmptyArgsOnlySuffix (1161 of 1989)
PASS: lldb-shell :: Register/x86-64-ymm-read.test (1162 of 1989)
PASS: lldb-unit :: Process/gdb-remote/./ProcessGdbRemoteTests/GDBRemoteCommunicationServerTest.SendErrorResponse_UnimplementedError (1163 of 1989)
PASS: lldb-shell :: SymbolFile/DWARF/debug-types-dwo-cross-reference.cpp (1164 of 1989)
PASS: lldb-api :: functionalities/data-formatter/parray/TestPrintArray.py (1165 of 1989)
PASS: lldb-api :: functionalities/data-formatter/data-formatter-stl/libcxx/queue/TestDataFormatterLibcxxQueue.py (1166 of 1989)
PASS: lldb-unit :: Utility/./UtilityTests/StringListTest.AppendStringCString (1167 of 1989)
PASS: lldb-shell :: VSCode/TestOptions.test (1168 of 1989)
PASS: lldb-unit :: Language/Highlighting/./HighlighterTests/HighlighterTest.ClangTrailingBackslashMissingNewLine (1169 of 1989)
PASS: lldb-api :: tools/lldb-vscode/breakpoint/TestVSCode_setFunctionBreakpoints.py (1170 of 1989)
PASS: lldb-unit :: Utility/./UtilityTests/BinaryStreamTest.PutSLEB128OneByte (1171 of 1989)
PASS: lldb-api :: functionalities/signal/TestSendSignal.py (1172 of 1989)
UNSUPPORTED: lldb-api :: functionalities/darwin_log/filter/exact_match/subsystem/TestDarwinLogFilterMatchSubsystem.py (1173 of 1989)
PASS: lldb-unit :: SymbolFile/NativePDB/./SymbolFileNativePDBTests/PDBFPOProgramToDWARFExpressionTests.UnsupportedRASearch (1174 of 1989)
PASS: lldb-api :: commands/expression/entry-bp/TestExprEntryBP.py (1175 of 1989)
PASS: lldb-unit :: Utility/./UtilityTests/RangeTest.EqualInvalid (1176 of 1989)
PASS: lldb-shell :: Reproducer/TestVersionCheck.test (1177 of 1989)
PASS: lldb-shell :: SymbolFile/DWARF/inline-function-address.ll (1178 of 1989)
PASS: lldb-api :: lang/objcxx/cxx-bridged-po/TestObjCXXBridgedPO.py (1179 of 1989)
PASS: lldb-api :: commands/expression/function_template_specialization_temp_args/TestFunctionTemplateSpecializationTempArgs.py (1180 of 1989)
PASS: lldb-unit :: Process/gdb-remote/./ProcessGdbRemoteTests/GDBRemoteClientBaseTest.SendPacketAndReceiveResponseWithOutputSupport (1181 of 1989)
PASS: lldb-unit :: Utility/./UtilityTests/StringListTest.GetMaxStringLengthMixed (1182 of 1989)
PASS: lldb-api :: macosx/version_zero/TestGetVersionZeroVersion.py (1183 of 1989)
PASS: lldb-unit :: Utility/./UtilityTests/ArgsTest.TestSingleQuotedArgWithSpace (1184 of 1989)
PASS: lldb-unit :: Utility/./UtilityTests/StreamTest.PutHex16ByteOrderBig (1185 of 1989)
PASS: lldb-unit :: Utility/./UtilityTests/ArgsTest.BareSingleQuote (1186 of 1989)
PASS: lldb-unit :: Language/Highlighting/./HighlighterTests/HighlighterTest.ClangPreserveNewLine (1187 of 1989)
PASS: lldb-shell :: SymbolFile/DWARF/find-variable-file.cpp (1188 of 1989)
PASS: lldb-shell :: Breakpoint/case-sensitive.test (1189 of 1989)
PASS: lldb-unit :: Utility/./UtilityTests/StringExtractorTest.GetNameColonValueSuccess (1190 of 1989)
PASS: lldb-unit :: Utility/./UtilityTests/ListenerTest.GetEventWait (1191 of 1989)
PASS: lldb-api :: commands/platform/basic/TestPlatformCommand.py (1192 of 1989)
UNSUPPORTED: lldb-shell :: SymbolFile/PDB/enums-layout.test (1193 of 1989)
PASS: lldb-unit :: Platform/./LLDBPlatformTests/PlatformDarwinTest.FindXcodeContentsDirectoryInPath (1194 of 1989)
UNSUPPORTED: lldb-api :: arm/breakpoint-it/TestBreakpointIt.py (1195 of 1989)
PASS: lldb-unit :: Host/./HostTests/ConnectionFileDescriptorTest.TCPGetURIv4 (1196 of 1989)
PASS: lldb-unit :: UnwindAssembly/x86/./UnwindAssemblyx86Tests/Testx86AssemblyInspectionEngine.TestStackRealignMSVC_i386 (1197 of 1989)
UNSUPPORTED: lldb-api :: lang/cpp/static_members/TestCPPStaticMembers.py (1198 of 1989)
PASS: lldb-api :: commands/watchpoints/watchpoint_commands/condition/TestWatchpointConditionCmd.py (1199 of 1989)
PASS: lldb-unit :: Utility/./UtilityTests/FileSpecTest.AppendPathComponent (1200 of 1989)
PASS: lldb-api :: lang/cpp/class_types/TestClassTypesDisassembly.py (1201 of 1989)
PASS: lldb-api :: commands/expression/import-std-module/basic/TestImportStdModule.py (1202 of 1989)
PASS: lldb-unit :: Utility/./UtilityTests/OptionsWithRawTest.EmptyInput (1203 of 1989)
PASS: lldb-api :: functionalities/data-formatter/data-formatter-stl/libcxx/bitset/TestDataFormatterLibcxxBitset.py (1204 of 1989)
PASS: lldb-api :: functionalities/var_path/TestVarPath.py (1205 of 1989)
PASS: lldb-shell :: Reproducer/TestWorkingDir.test (1206 of 1989)
PASS: lldb-api :: lang/cpp/call-function/TestCallCPPFunction.py (1207 of 1989)
PASS: lldb-shell :: Expr/TestIRMemoryMap.test (1208 of 1989)
PASS: lldb-unit :: Utility/./UtilityTests/UriParserTest.MinimalPortPath (1209 of 1989)
PASS: lldb-unit :: Symbol/./SymbolTests/TestTypeSystemClang.TestGetEnumIntegerTypeUnexpectedType (1210 of 1989)
PASS: lldb-shell :: SymbolFile/DWARF/debug_loc.s (1211 of 1989)
PASS: lldb-shell :: SymbolFile/DWARF/clang-ast-from-dwarf-unamed-and-anon-structs.cpp (1212 of 1989)
PASS: lldb-unit :: Process/minidump/./LLDBMinidumpTests/MinidumpParserTest.GetThreadsAndGetThreadContext (1213 of 1989)
PASS: lldb-shell :: Reproducer/TestDSYM.test (1214 of 1989)
PASS: lldb-shell :: Settings/TestEchoCommands.test (1215 of 1989)
PASS: lldb-api :: commands/expression/import-std-module/vector/TestVectorFromStdModule.py (1216 of 1989)
PASS: lldb-api :: functionalities/inferior-crashing/TestInferiorCrashingStep.py (1217 of 1989)
PASS: lldb-api :: functionalities/breakpoint/auto_continue/TestBreakpointAutoContinue.py (1218 of 1989)
UNSUPPORTED: lldb-shell :: Register/x86-64-gp-write.test (1219 of 1989)
PASS: lldb-api :: functionalities/data-formatter/summary-string-onfail/Test-rdar-9974002.py (1220 of 1989)
PASS: lldb-api :: commands/settings/quoting/TestQuoting.py (1221 of 1989)
PASS: lldb-api :: lang/cpp/enum_types/TestCPP11EnumTypes.py (1222 of 1989)
PASS: lldb-unit :: SymbolFile/DWARF/./SymbolFileDWARFTests/SymbolFileDWARFTests.TestAbbrevMissingTerminator (1223 of 1989)
UNSUPPORTED: lldb-shell :: SymbolFile/NativePDB/local-variables.cpp (1224 of 1989)
PASS: lldb-unit :: Utility/./UtilityTests/ArgsTest.ReplaceArgumentAtIndexOutOfRange (1225 of 1989)
UNSUPPORTED: lldb-shell :: BuildScript/toolchain-clang-cl.test (1226 of 1989)
PASS: lldb-unit :: Utility/./UtilityTests/StreamTest.PutMaxHex64ByteOrderLittle (1227 of 1989)
PASS: lldb-shell :: Reproducer/Modules/TestModuleCXX.test (1228 of 1989)
PASS: lldb-api :: lang/objc/objc++/TestObjCXX.py (1229 of 1989)
PASS: lldb-unit :: Utility/./UtilityTests/BinaryStreamTest.PutULEB128One (1230 of 1989)
PASS: lldb-unit :: Utility/./UtilityTests/UriParserTest.SchemeHostSeparator (1231 of 1989)
PASS: lldb-api :: types/TestFloatTypes.py (1232 of 1989)
PASS: lldb-shell :: SymbolFile/DWARF/find-basic-function.cpp (1233 of 1989)
PASS: lldb-unit :: Utility/./UtilityTests/StateTest.Formatv (1234 of 1989)
PASS: lldb-api :: functionalities/breakpoint/require_hw_breakpoints/TestRequireHWBreakpoints.py (1235 of 1989)
UNSUPPORTED: lldb-api :: benchmarks/turnaround/TestCompileRunToBreakpointTurnaround.py (1236 of 1989)
PASS: lldb-unit :: Process/minidump/./LLDBMinidumpTests/MinidumpParserTest.GetMiscInfoWindows (1237 of 1989)
PASS: lldb-shell :: Minidump/Windows/Sigsegv/sigsegv.test (1238 of 1989)
PASS: lldb-api :: functionalities/breakpoint/breakpoint_command/TestRegexpBreakCommand.py (1239 of 1989)
PASS: lldb-api :: functionalities/thread/step_until/TestStepUntil.py (1240 of 1989)
PASS: lldb-unit :: Utility/./UtilityTests/RangeTest.Slide (1241 of 1989)
PASS: lldb-api :: macosx/add-dsym/TestAddDsymMidExecutionCommand.py (1242 of 1989)
PASS: lldb-unit :: Utility/./UtilityTests/RangeTest.Union (1243 of 1989)
UNSUPPORTED: lldb-api :: functionalities/darwin_log/filter/regex/category/TestDarwinLogFilterRegexCategory.py (1244 of 1989)
PASS: lldb-api :: lang/objc/objc-static-method/TestObjCStaticMethod.py (1245 of 1989)
PASS: lldb-api :: functionalities/postmortem/elf-core/gcore/TestGCore.py (1246 of 1989)
UNSUPPORTED: lldb-api :: commands/expression/completion-crash-invalid-iterator/TestInvalidIteratorCompletionCrash.py (1247 of 1989)
PASS: lldb-api :: commands/platform/process/list/TestProcessList.py (1248 of 1989)
PASS: lldb-api :: functionalities/thread/concurrent_events/TestConcurrentTwoWatchpointsOneDelayBreakpoint.py (1249 of 1989)
PASS: lldb-unit :: Symbol/./SymbolTests/Type.GetTypeScopeAndBasename (1250 of 1989)
PASS: lldb-unit :: Language/Highlighting/./HighlighterTests/HighlighterTest.ClangCursorPos (1251 of 1989)
PASS: lldb-unit :: Process/minidump/./LLDBMinidumpTests/MinidumpParserTest.GetArchitecture (1252 of 1989)
PASS: lldb-shell :: ObjectFile/PECOFF/basic-info-arm64.yaml (1253 of 1989)
PASS: lldb-unit :: Symbol/./SymbolTests/TestTypeSystemClang.TestGetEnumIntegerTypeBasicTypes (1254 of 1989)
PASS: lldb-unit :: Expression/./ExpressionTests/DiagnosticManagerTest.GetStringNoDiags (1255 of 1989)
PASS: lldb-unit :: Interpreter/./InterpreterTests/OptionArgParserTest.toScriptLanguage (1256 of 1989)
PASS: lldb-api :: functionalities/breakpoint/breakpoint_conditions/TestBreakpointConditions.py (1257 of 1989)
PASS: lldb-unit :: Utility/./UtilityTests/VMRange.IsValid (1258 of 1989)
PASS: lldb-api :: python_api/hello_world/TestHelloWorld.py (1259 of 1989)
PASS: lldb-unit :: Utility/./UtilityTests/FileSpecTest.RemoveLastPathComponent (1260 of 1989)
PASS: lldb-api :: functionalities/data-formatter/data-formatter-stl/libcxx/optional/TestDataFormatterLibcxxOptional.py (1261 of 1989)
PASS: lldb-unit :: UnwindAssembly/x86/./UnwindAssemblyx86Tests/Testx86AssemblyInspectionEngine.TestPopRBP (1262 of 1989)
PASS: lldb-unit :: Process/minidump/./LLDBMinidumpTests/MinidumpParserTest.MinidumpDuplicateModuleMinAddress (1263 of 1989)
PASS: lldb-api :: functionalities/breakpoint/cpp/TestCPPBreakpointLocations.py (1264 of 1989)
PASS: lldb-api :: types/TestDoubleTypesExpr.py (1265 of 1989)
PASS: lldb-api :: functionalities/gdb_remote_client/TestGDBRemoteClient.py (1266 of 1989)
PASS: lldb-unit :: Host/./HostTests/Host.WaitStatusFormat (1267 of 1989)
PASS: lldb-unit :: UnwindAssembly/x86/./UnwindAssemblyx86Tests/Testx86AssemblyInspectionEngine.TestSpillRegToStackViaMOVi386 (1268 of 1989)
PASS: lldb-api :: commands/expression/completion/TestExprCompletion.py (1269 of 1989)
PASS: lldb-api :: tools/lldb-server/TestGdbRemote_vCont.py (1270 of 1989)
PASS: lldb-unit :: Host/./HostTests/NativeProcessProtocolTest.SetBreakpoint (1271 of 1989)
PASS: lldb-api :: commands/expression/call-function/TestCallUserDefinedFunction.py (1272 of 1989)
PASS: lldb-api :: lang/objc/foundation/TestConstStrings.py (1273 of 1989)
PASS: lldb-api :: functionalities/data-formatter/data-formatter-objc/TestDataFormatterObjCExpr.py (1274 of 1989)
PASS: lldb-unit :: Utility/./UtilityTests/StringLexerTest.Next (1275 of 1989)
PASS: lldb-unit :: Core/./LLDBCoreTests/MangledTest.ResultForBlockInvocation (1276 of 1989)
PASS: lldb-api :: functionalities/type_completion/TestTypeCompletion.py (1277 of 1989)
PASS: lldb-shell :: SymbolFile/DWARF/win-i386-line-table.s (1278 of 1989)
PASS: lldb-shell :: Quit/TestQuitExitCodeTooManyArgs.test (1279 of 1989)
PASS: lldb-shell :: Unwind/eh-frame-dwarf-unwind.test (1280 of 1989)
UNSUPPORTED: lldb-api :: functionalities/darwin_log/filter/regex/activity/TestDarwinLogFilterRegexActivity.py (1281 of 1989)
PASS: lldb-api :: functionalities/data-formatter/data-formatter-objc/TestDataFormatterObjCNSContainer.py (1282 of 1989)
PASS: lldb-api :: functionalities/data-formatter/type_summary_list_arg/TestTypeSummaryListArg.py (1283 of 1989)
PASS: lldb-api :: lang/c/unions/TestUnionMembers.py (1284 of 1989)
UNSUPPORTED: lldb-api :: linux/add-symbols/TestTargetSymbolsAddCommand.py (1285 of 1989)
PASS: lldb-shell :: Settings/TestFrameFormatNoColor.test (1286 of 1989)
PASS: lldb-unit :: Host/./HostTests/FileSystemTest.MakeAbsolute (1287 of 1989)
PASS: lldb-unit :: Utility/./UtilityTests/DataExtractorTest.GetBitfield (1288 of 1989)
PASS: lldb-unit :: Host/./HostTests/HostInfoTest.GetAugmentedArchSpec (1289 of 1989)
PASS: lldb-unit :: Utility/./UtilityTests/StringListTest.SplitIntoLines (1290 of 1989)
PASS: lldb-unit :: Expression/./ExpressionTests/CppModuleConfigurationTest.IgnoreLibStdCpp (1291 of 1989)
PASS: lldb-unit :: Signals/./SignalsTests/UnixSignalsTest.VersionChange (1292 of 1989)
PASS: lldb-api :: lang/objcxx/objcxx-ivar-vector/TestIvarVector.py (1293 of 1989)
PASS: lldb-unit :: Utility/./UtilityTests/ReproducerTest.SetCapture (1294 of 1989)
PASS: lldb-api :: commands/expression/radar_9531204/TestPrintfAfterUp.py (1295 of 1989)
PASS: lldb-api :: functionalities/data-formatter/data-formatter-stl/libcxx/map/TestDataFormatterLibccMap.py (1296 of 1989)
UNSUPPORTED: lldb-shell :: ScriptInterpreter/Lua/breakpoint_callback.test (1297 of 1989)
PASS: lldb-api :: commands/expression/ir-interpreter-phi-nodes/TestIRInterpreterPHINodes.py (1298 of 1989)
PASS: lldb-shell :: SymbolFile/DWARF/debug_ranges_and_rnglists.test (1299 of 1989)
PASS: lldb-api :: lang/cpp/function-qualifiers/TestCppFunctionQualifiers.py (1300 of 1989)
PASS: lldb-unit :: Utility/./UtilityTests/StreamTeeTest.AppendStream (1301 of 1989)
PASS: lldb-api :: commands/expression/codegen-crash-typedefdecl-not-in_declcontext/TestCodegenCrashTypedefDeclNotInDeclContext.py (1302 of 1989)
PASS: lldb-unit :: SymbolFile/DWARF/./SymbolFileDWARFTests/SymbolFileDWARFTests.TestAbilitiesForDWARF (1303 of 1989)
PASS: lldb-unit :: Utility/./UtilityTests/StreamTest.PutRawBytesToBigEndian (1304 of 1989)
PASS: lldb-unit :: Utility/./UtilityTests/StringListTest.LongestCommonPrefix (1305 of 1989)
PASS: lldb-unit :: ScriptInterpreter/Python/./ScriptInterpreterPythonTests/PythonDataObjectsTest.TestPythonTupleValues (1306 of 1989)
PASS: lldb-shell :: Quit/TestQuitExitCodeNonInt.test (1307 of 1989)
PASS: lldb-unit :: Symbol/./SymbolTests/TestTypeSystemClang.TestGetBasicTypeFromEnum (1308 of 1989)
UNSUPPORTED: lldb-api :: functionalities/darwin_log/basic/TestDarwinLogBasic.py (1309 of 1989)
PASS: lldb-api :: commands/expression/import-std-module/list/TestListFromStdModule.py (1310 of 1989)
PASS: lldb-api :: commands/expression/po_verbosity/TestPoVerbosity.py (1311 of 1989)
PASS: lldb-unit :: Utility/./UtilityTests/UserIDResolver.GetUserName (1312 of 1989)
PASS: lldb-shell :: Commands/command-disassemble.s (1313 of 1989)
PASS: lldb-shell :: Driver/TestConvenienceVariables.test (1314 of 1989)
PASS: lldb-api :: python_api/watchpoint/TestSetWatchpoint.py (1315 of 1989)
PASS: lldb-api :: tools/lldb-server/TestGdbRemoteSingleStep.py (1316 of 1989)
PASS: lldb-api :: functionalities/show_location/TestShowLocationDwarf5.py (1317 of 1989)
PASS: lldb-api :: lang/cpp/gmodules/TestWithModuleDebugging.py (1318 of 1989)
PASS: lldb-unit :: ScriptInterpreter/Python/./ScriptInterpreterPythonTests/PythonDataObjectsTest.TestGlobalNameResolutionWithDot (1319 of 1989)
XFAIL: lldb-shell :: Unwind/prefer-debug-over-eh-frame.test (1320 of 1989)
PASS: lldb-api :: commands/expression/ir-interpreter/TestIRInterpreter.py (1321 of 1989)
PASS: lldb-shell :: Driver/TestProcessAttach.test (1322 of 1989)
PASS: lldb-unit :: Process/gdb-remote/./ProcessGdbRemoteTests/GDBRemoteCommunicationClientTest.SendGetTraceConfigPacket (1323 of 1989)
PASS: lldb-shell :: Minidump/Windows/find-module.test (1324 of 1989)
PASS: lldb-shell :: SymbolFile/DWARF/debug_loc-aslr.s (1325 of 1989)
PASS: lldb-shell :: Driver/TestRepl.test (1326 of 1989)
PASS: lldb-unit :: Utility/./UtilityTests/ArchSpecTest.YAML (1327 of 1989)
PASS: lldb-api :: functionalities/tail_call_frames/disambiguate_call_site/TestDisambiguateCallSite.py (1328 of 1989)
PASS: lldb-unit :: Utility/./UtilityTests/StatusTest.ErrorConversion (1329 of 1989)
PASS: lldb-unit :: Utility/./UtilityTests/StringExtractorTest.GetHexBytesAvail_Underflow (1330 of 1989)
PASS: lldb-shell :: ObjectFile/ELF/build-id-case.yaml (1331 of 1989)
PASS: lldb-unit :: Process/gdb-remote/./ProcessGdbRemoteTests/GDBRemoteCommunicationClientTest.GetMemoryRegionInfoInvalidResponse (1332 of 1989)
PASS: lldb-api :: python_api/sbplatform/TestSBPlatform.py (1333 of 1989)
PASS: lldb-api :: functionalities/data-formatter/synthcapping/TestSyntheticCapping.py (1334 of 1989)
PASS: lldb-shell :: ObjectFile/ELF/compressed-sections.yaml (1335 of 1989)
PASS: lldb-unit :: Target/./TargetTests/MemoryRegionInfoTest.Formatv (1336 of 1989)
PASS: lldb-unit :: Utility/./UtilityTests/NameMatchesTest.Equals (1337 of 1989)
PASS: lldb-unit :: Utility/./UtilityTests/StringListTest.SplitIntoLinesEmpty (1338 of 1989)
PASS: lldb-unit :: Expression/./ExpressionTests/DiagnosticManagerTest.GetStringMultiline (1339 of 1989)
PASS: lldb-unit :: Utility/./UtilityTests/StreamTest.AddressRangeInvalidRange (1340 of 1989)
PASS: lldb-api :: functionalities/data-formatter/data-formatter-enum-format/TestDataFormatterEnumFormat.py (1341 of 1989)
PASS: lldb-unit :: Utility/./UtilityTests/ArgsTest.AppendArguments (1342 of 1989)
PASS: lldb-api :: python_api/process/io/TestProcessIO.py (1343 of 1989)
PASS: lldb-shell :: SymbolFile/DWARF/gnu-style-compression.cpp (1344 of 1989)
UNSUPPORTED: lldb-shell :: Register/x86-ymm-write.test (1345 of 1989)
UNSUPPORTED: lldb-shell :: ScriptInterpreter/Lua/command_script_import.test (1346 of 1989)
PASS: lldb-unit :: Symbol/./SymbolTests/TestClangASTImporter.CopyDeclTagDecl (1347 of 1989)
PASS: lldb-shell :: SymbolFile/Breakpad/symtab.test (1348 of 1989)
PASS: lldb-api :: lang/objc/foundation/TestObjCMethodsString.py (1349 of 1989)
PASS: lldb-unit :: Signals/./SignalsTests/UnixSignalsTest.Iteration (1350 of 1989)
PASS: lldb-unit :: Utility/./UtilityTests/ScalarTest.SetValueFromCString (1351 of 1989)
PASS: lldb-shell :: ObjectFile/wasm/embedded-debug-sections.yaml (1352 of 1989)
PASS: lldb-unit :: ObjectFile/Breakpad/./ObjectFileBreakpadTests/InfoRecord.parse (1353 of 1989)
PASS: lldb-api :: commands/expression/import-std-module/shared_ptr/TestSharedPtrFromStdModule.py (1354 of 1989)
UNSUPPORTED: lldb-shell :: Minidump/Windows/arm-fp-unwind.test (1355 of 1989)
PASS: lldb-unit :: Expression/./ExpressionTests/CppModuleConfigurationTest.Xcode (1356 of 1989)
PASS: lldb-api :: python_api/file_handle/TestFileHandle.py (1357 of 1989)
PASS: lldb-unit :: DataFormatter/./LLDBFormatterTests/FormatManagerTests.CompatibleLangs (1358 of 1989)
UNSUPPORTED: lldb-shell :: Unwind/unwind-plan-dwarf-dump.test (1359 of 1989)
PASS: lldb-api :: functionalities/memory/cache/TestMemoryCache.py (1360 of 1989)
PASS: lldb-shell :: BuildScript/script-args.test (1361 of 1989)
PASS: lldb-unit :: Process/minidump/./LLDBMinidumpTests/MinidumpParserTest.MinidumpModuleOrder (1362 of 1989)
PASS: lldb-api :: commands/expression/save_jit_objects/TestSaveJITObjects.py (1363 of 1989)
PASS: lldb-unit :: Utility/./UtilityTests/LogChannelEnabledTest.LLDB_LOG_ERROR (1364 of 1989)
PASS: lldb-unit :: ScriptInterpreter/Python/./ScriptInterpreterPythonTests/PythonDataObjectsTest.TestPythonStringToStr (1365 of 1989)
PASS: lldb-api :: lang/cpp/rvalue-references/TestRvalueReferences.py (1366 of 1989)
PASS: lldb-shell :: SymbolFile/DWARF/childless-compile-unit.s (1367 of 1989)
PASS: lldb-unit :: Utility/./UtilityTests/OptionsWithRawTest.EmptySuffixSingleWhitespace (1368 of 1989)
PASS: lldb-unit :: Utility/./UtilityTests/ScalarTest.Equality (1369 of 1989)
PASS: lldb-unit :: ObjectFile/Breakpad/./ObjectFileBreakpadTests/StackCFIRecord.parse (1370 of 1989)
PASS: lldb-shell :: ObjectFile/wasm/basic.yaml (1371 of 1989)
PASS: lldb-api :: lang/cpp/function_refs/TestFunctionRefs.py (1372 of 1989)
UNSUPPORTED: lldb-shell :: SymbolFile/PDB/typedefs.test (1373 of 1989)
PASS: lldb-api :: commands/expression/xvalue/TestXValuePrinting.py (1374 of 1989)
PASS: lldb-shell :: ScriptInterpreter/None/import_module.test (1375 of 1989)
PASS: lldb-api :: functionalities/target_var/TestTargetVar.py (1376 of 1989)
PASS: lldb-unit :: Utility/./UtilityTests/StringListTest.InsertStringAtIndexOutOfBounds (1377 of 1989)
PASS: lldb-unit :: Expression/./ExpressionTests/CppModuleConfigurationTest.MissingLibCpp (1378 of 1989)
PASS: lldb-shell :: Driver/TestNoUseColor.test (1379 of 1989)
PASS: lldb-unit :: UnwindAssembly/x86/./UnwindAssemblyx86Tests/Testx86AssemblyInspectionEngine.TestPushEBP (1380 of 1989)
PASS: lldb-api :: lang/cpp/dynamic-value/TestDynamicValue.py (1381 of 1989)
PASS: lldb-api :: python_api/function_symbol/TestDisasmAPI.py (1382 of 1989)
PASS: lldb-api :: lang/objc/forward-decl/TestForwardDecl.py (1383 of 1989)
PASS: lldb-shell :: Commands/command-regex-delete.test (1384 of 1989)
PASS: lldb-unit :: Expression/./ExpressionTests/DWARFExpression.DW_OP_convert (1385 of 1989)
PASS: lldb-api :: commands/watchpoints/watchpoint_set_command/TestWatchLocationWithWatchSet.py (1386 of 1989)
PASS: lldb-api :: lang/cpp/inlines/TestInlines.py (1387 of 1989)
PASS: lldb-shell :: Breakpoint/dummy-target.test (1388 of 1989)
UNSUPPORTED: lldb-api :: tools/lldb-server/signal-filtering/TestGdbRemote_QPassSignals.py (1389 of 1989)
PASS: lldb-shell :: SymbolFile/DWARF/dwp.s (1390 of 1989)
PASS: lldb-unit :: Utility/./UtilityTests/BinaryStreamTest.PutSLEB128ThreeBytes (1391 of 1989)
PASS: lldb-api :: commands/process/launch-with-shellexpand/TestLaunchWithShellExpand.py (1392 of 1989)
PASS: lldb-shell :: Reproducer/TestRelativePath.test (1393 of 1989)
PASS: lldb-api :: functionalities/jitloader_gdb/TestJITLoaderGDB.py (1394 of 1989)
PASS: lldb-shell :: ObjectFile/ELF/section-overlap.yaml (1395 of 1989)
PASS: lldb-api :: functionalities/thread/concurrent_events/TestConcurrentTwoWatchpointsOneSignal.py (1396 of 1989)
UNSUPPORTED: lldb-shell :: ScriptInterpreter/Lua/bindings.test (1397 of 1989)
PASS: lldb-unit :: Utility/./UtilityTests/StreamTest.PutBytesAsRawHex8ToBigEndian (1398 of 1989)
PASS: lldb-api :: lang/cpp/template/TestTemplateArgs.py (1399 of 1989)
PASS: lldb-unit :: Utility/./UtilityTests/StringExtractorTest.GetHexU8_InvalidHex_NoEof (1400 of 1989)
PASS: lldb-api :: api/multithreaded/TestMultithreaded.py (1401 of 1989)
PASS: lldb-unit :: UnwindAssembly/x86/./UnwindAssemblyx86Tests/Testx86AssemblyInspectionEngine.Test32bitFramelessBigStackFrame (1402 of 1989)
PASS: lldb-unit :: tools/lldb-server/tests/./LLDBServerTests/TestBase.LaunchModePreservesEnvironment (1403 of 1989)
PASS: lldb-api :: functionalities/optimized_code/TestNoASanExceptionAfterEvalOP_piece.py (1404 of 1989)
PASS: lldb-api :: commands/settings/TestSettings.py (1405 of 1989)
PASS: lldb-unit :: Language/Highlighting/./HighlighterTests/HighlighterTest.ClangUnterminatedString (1406 of 1989)
PASS: lldb-unit :: Utility/./UtilityTests/EnvironmentTest.EnvpConstruction (1407 of 1989)
PASS: lldb-api :: lang/objc/foundation/TestObjCMethodsNSArray.py (1408 of 1989)
PASS: lldb-api :: lang/objc/modules/TestObjCModules.py (1409 of 1989)
PASS: lldb-api :: lang/c/vla/TestVLA.py (1410 of 1989)
PASS: lldb-api :: macosx/find-dsym/bundle-with-dot-in-filename/TestBundleWithDotInFilename.py (1411 of 1989)
PASS: lldb-unit :: SymbolFile/NativePDB/./SymbolFileNativePDBTests/PDBFPOProgramToDWARFExpressionTests.InvalidAssignmentMultiple (1412 of 1989)
PASS: lldb-unit :: ScriptInterpreter/Python/./ScriptInterpreterPythonTests/PythonDataObjectsTest.TestTypeNameResolutionNoDot (1413 of 1989)
PASS: lldb-unit :: Utility/./UtilityTests/AnsiTerminal.AtEnd (1414 of 1989)
PASS: lldb-unit :: Utility/./UtilityTests/TimeoutTest.Construction (1415 of 1989)
PASS: lldb-api :: functionalities/thread/concurrent_events/TestConcurrentManyCrash.py (1416 of 1989)
PASS: lldb-shell :: ObjectFile/PECOFF/dep-modules.yaml (1417 of 1989)
PASS: lldb-shell :: SymbolFile/DWARF/apple-index-is-used.cpp (1418 of 1989)
PASS: lldb-unit :: Process/minidump/./LLDBMinidumpTests/MinidumpParserTest.FindMemoryRangeWithFullMemoryMinidump (1419 of 1989)
PASS: lldb-unit :: Utility/./UtilityTests/FileSpecTest.Equal (1420 of 1989)
PASS: lldb-unit :: Host/./HostTests/FileActionTest.Open (1421 of 1989)
PASS: lldb-unit :: UnwindAssembly/x86/./UnwindAssemblyx86Tests/Testx86AssemblyInspectionEngine.TestPushEDX (1422 of 1989)
PASS: lldb-unit :: Platform/./LLDBPlatformTests/PlatformDarwinTest.TestParseVersionBuildDir (1423 of 1989)
PASS: lldb-api :: functionalities/gdb_remote_client/TestRecognizeBreakpoint.py (1424 of 1989)
PASS: lldb-api :: commands/process/attach/TestProcessAttach.py (1425 of 1989)
PASS: lldb-unit :: Utility/./UtilityTests/StreamTest.PutNHex8 (1426 of 1989)
PASS: lldb-unit :: Utility/./UtilityTests/BroadcasterTest.EventTypeHasListeners (1427 of 1989)
PASS: lldb-api :: lang/mixed/TestMixedLanguages.py (1428 of 1989)
PASS: lldb-api :: commands/expression/issue_11588/Test11588.py (1429 of 1989)
PASS: lldb-unit :: Process/minidump/./LLDBMinidumpTests/MinidumpParserTest.GetMemoryRegionInfo (1430 of 1989)
PASS: lldb-api :: functionalities/breakpoint/breakpoint_options/TestBreakpointOptions.py (1431 of 1989)
PASS: lldb-unit :: Utility/./UtilityTests/VMRange.CollectionContains (1432 of 1989)
PASS: lldb-unit :: tools/lldb-server/tests/./LLDBServerTests/StandardStartupTest.TestStopReplyContainsThreadPcs (1433 of 1989)
PASS: lldb-unit :: ObjectFile/ELF/./ObjectFileELFTests/ObjectFileELFTest.GetModuleSpecifications_EarlySectionHeaders (1434 of 1989)
PASS: lldb-shell :: SymbolFile/NativePDB/disassembly.cpp (1435 of 1989)
PASS: lldb-api :: tools/lldb-server/TestGdbRemoteHostInfo.py (1436 of 1989)
PASS: lldb-api :: commands/expression/import-std-module/vector-bool/TestVectorBoolFromStdModule.py (1437 of 1989)
PASS: lldb-unit :: Utility/./UtilityTests/ArgsTest.TestAppendArg (1438 of 1989)
PASS: lldb-api :: commands/process/launch/TestProcessLaunch.py (1439 of 1989)
PASS: lldb-unit :: Language/Highlighting/./HighlighterTests/HighlighterTest.ClangComments (1440 of 1989)
PASS: lldb-api :: functionalities/data-formatter/boolreference/TestFormattersBoolRefPtr.py (1441 of 1989)
PASS: lldb-api :: commands/watchpoints/multiple_threads/TestWatchpointMultipleThreads.py (1442 of 1989)
PASS: lldb-unit :: Utility/./UtilityTests/ConstStringTest.YAML (1443 of 1989)
PASS: lldb-api :: functionalities/completion/TestCompletion.py (1444 of 1989)
PASS: lldb-unit :: Utility/./UtilityTests/ArgsTest.TestInsertArg (1445 of 1989)
PASS: lldb-shell :: Quit/TestQuitExitCode0.test (1446 of 1989)
PASS: lldb-api :: functionalities/breakpoint/breakpoint_ids/TestBreakpointIDs.py (1447 of 1989)
PASS: lldb-unit :: Utility/./UtilityTests/StringListTest.Join (1448 of 1989)
PASS: lldb-unit :: Language/CPlusPlus/./LanguageCPlusPlusTests/CPlusPlusLanguage.ExtractContextAndIdentifier (1449 of 1989)
UNSUPPORTED: lldb-api :: python_api/disassemble-raw-data/TestDisassemble_VST1_64.py (1450 of 1989)
PASS: lldb-unit :: Utility/./UtilityTests/VMRange.Comparison (1451 of 1989)
PASS: lldb-unit :: UnwindAssembly/x86/./UnwindAssemblyx86Tests/Testx86AssemblyInspectionEngine.TestSimple32bitFrameFunction (1452 of 1989)
PASS: lldb-api :: functionalities/thread/concurrent_events/TestConcurrentTwoWatchpointsOneBreakpoint.py (1453 of 1989)
PASS: lldb-api :: lang/cpp/unicode-literals/TestUnicodeLiterals.py (1454 of 1989)
PASS: lldb-unit :: Language/Highlighting/./HighlighterTests/HighlighterTest.ClangBraces (1455 of 1989)
PASS: lldb-api :: functionalities/unwind/noreturn/TestNoreturnUnwind.py (1456 of 1989)
PASS: lldb-shell :: SymbolFile/DWARF/dir-separator-posix.s (1457 of 1989)
PASS: lldb-shell :: SymbolFile/NativePDB/bitfields.cpp (1458 of 1989)
PASS: lldb-unit :: Utility/./UtilityTests/ProcessInstanceInfo.Yaml (1459 of 1989)
PASS: lldb-api :: functionalities/thread/concurrent_events/TestConcurrentSignalNWatchNBreak.py (1460 of 1989)
PASS: lldb-unit :: Expression/./ExpressionTests/DiagnosticManagerTest.GetStringSeverityLabels (1461 of 1989)
PASS: lldb-unit :: Utility/./UtilityTests/CompletionRequest.TestCompletionOwnership (1462 of 1989)
PASS: lldb-unit :: Utility/./UtilityTests/SubsystemRAIITest.SubsystemWithErrorFailure (1463 of 1989)
PASS: lldb-unit :: Utility/./UtilityTests/StringExtractorTest.GetNameColonValueNoColon (1464 of 1989)
PASS: lldb-api :: functionalities/thread/concurrent_events/TestConcurrentBreakpointDelayBreakpointOneSignal.py (1465 of 1989)
PASS: lldb-unit :: Symbol/./SymbolTests/TestTypeSystemClang.TestGetTypeClassNested (1466 of 1989)
PASS: lldb-api :: tools/lldb-server/commandline/TestStubSetSID.py (1467 of 1989)
UNSUPPORTED: lldb-shell :: SymbolFile/PDB/expressions.test (1468 of 1989)
PASS: lldb-api :: tools/lldb-vscode/stackTrace/TestVSCode_stackTrace.py (1469 of 1989)
PASS: lldb-unit :: SymbolFile/NativePDB/./SymbolFileNativePDBTests/PDBFPOProgramToDWARFExpressionTests.UnresolvedCyclicRegisterAssignmentReference (1470 of 1989)
PASS: lldb-unit :: Utility/./UtilityTests/StringListTest.GetSize (1471 of 1989)
PASS: lldb-unit :: UnwindAssembly/x86/./UnwindAssemblyx86Tests/Testx86AssemblyInspectionEngine.TestDisassemblyJunkBytes (1472 of 1989)
PASS: lldb-api :: functionalities/data-formatter/data-formatter-stl/libcxx/multimap/TestDataFormatterLibccMultiMap.py (1473 of 1989)
PASS: lldb-unit :: Utility/./UtilityTests/StringListTest.AppendList (1474 of 1989)
PASS: lldb-api :: lang/cpp/nsimport/TestCppNsImport.py (1475 of 1989)
PASS: lldb-unit :: Utility/./UtilityTests/StringListTest.RemoveBlankLines (1476 of 1989)
PASS: lldb-unit :: Language/Highlighting/./HighlighterTests/HighlighterTest.ClangCursorPosBeforeOtherToken (1477 of 1989)
PASS: lldb-unit :: Utility/./UtilityTests/StreamTest.PutHex8 (1478 of 1989)
PASS: lldb-api :: lang/objc/modules-cache/TestClangModulesCache.py (1479 of 1989)
PASS: lldb-api :: tools/lldb-server/TestAppleSimulatorOSType.py (1480 of 1989)
PASS: lldb-api :: functionalities/data-formatter/pyobjsynthprovider/TestPyObjSynthProvider.py (1481 of 1989)
PASS: lldb-api :: functionalities/thread/concurrent_events/TestConcurrentSignalWatch.py (1482 of 1989)
PASS: lldb-api :: macosx/lc-note/kern-ver-str/TestKernVerStrLCNOTE.py (1483 of 1989)
PASS: lldb-unit :: Host/./HostTests/FileSystemTest.GetByteSize (1484 of 1989)
PASS: lldb-unit :: Utility/./UtilityTests/LogChannelEnabledTest.LogVerboseThread (1485 of 1989)
PASS: lldb-api :: linux/builtin_trap/TestBuiltinTrap.py (1486 of 1989)
PASS: lldb-unit :: Utility/./UtilityTests/StringListTest.ForRange (1487 of 1989)
PASS: lldb-unit :: Utility/./UtilityTests/NameMatchesTest.Ignore (1488 of 1989)
PASS: lldb-shell :: SymbolFile/DWARF/find-basic-type.cpp (1489 of 1989)
PASS: lldb-api :: lang/cpp/auto/TestCPPAuto.py (1490 of 1989)
PASS: lldb-unit :: Process/gdb-remote/./ProcessGdbRemoteTests/GDBRemoteCommunicationClientTest.GetQOffsets (1491 of 1989)
PASS: lldb-unit :: Language/Highlighting/./HighlighterTests/HighlighterTest.Keywords (1492 of 1989)
UNSUPPORTED: lldb-shell :: Register/aarch64-fp-read.test (1493 of 1989)
PASS: lldb-unit :: Process/gdb-remote/./ProcessGdbRemoteTests/GDBRemoteCommunicationClientTest.WriteRegisterNoSuffix (1494 of 1989)
PASS: lldb-api :: python_api/frame/inlines/TestInlinedFrame.py (1495 of 1989)
PASS: lldb-shell :: Breakpoint/single-file-split-dwarf.test (1496 of 1989)
PASS: lldb-api :: commands/target/create-no-such-arch/TestNoSuchArch.py (1497 of 1989)
PASS: lldb-api :: lang/cpp/class_static/TestStaticVariables.py (1498 of 1989)
PASS: lldb-api :: python_api/debugger/TestDebuggerAPI.py (1499 of 1989)
PASS: lldb-unit :: SymbolFile/NativePDB/./SymbolFileNativePDBTests/PDBFPOProgramToDWARFExpressionTests.DependencyChain (1500 of 1989)
PASS: lldb-api :: functionalities/testid/TestTestId.py (1501 of 1989)
PASS: lldb-unit :: Utility/./UtilityTests/LogChannelEnabledTest.LogGetLogThread (1502 of 1989)
PASS: lldb-unit :: debugserver/./debugserverTests/RNBSocket.LoopBackConnectIPv4 (1503 of 1989)
PASS: lldb-shell :: Driver/LocalLLDBInit.test (1504 of 1989)
PASS: lldb-api :: functionalities/data-formatter/data-formatter-ptr-to-array/TestPtrToArrayFormatting.py (1505 of 1989)
PASS: lldb-unit :: UnwindAssembly/x86/./UnwindAssemblyx86Tests/Testx86AssemblyInspectionEngine.TestPushR12 (1506 of 1989)
PASS: lldb-api :: python_api/breakpoint/TestBreakpointAPI.py (1507 of 1989)
PASS: lldb-unit :: Process/gdb-remote/./ProcessGdbRemoteTests/GDBRemoteClientBaseTest.SendContinueAndInterrupt (1508 of 1989)
PASS: lldb-shell :: SymbolFile/DWARF/debug_line-relative_path.s (1509 of 1989)
PASS: lldb-api :: commands/expression/expr-in-syscall/TestExpressionInSyscall.py (1510 of 1989)
PASS: lldb-api :: macosx/nslog/TestDarwinNSLogOutput.py (1511 of 1989)
UNSUPPORTED: lldb-api :: commands/watchpoints/multi_watchpoint_slots/TestWatchpointMultipleSlots.py (1512 of 1989)
PASS: lldb-api :: functionalities/data-formatter/data-formatter-objc/nsindexpath/TestDataFormatterNSIndexPath.py (1513 of 1989)
PASS: lldb-unit :: Host/./HostTests/NativeProcessProtocolTest.ReadCStringFromMemory_MaxSize (1514 of 1989)
PASS: lldb-unit :: Utility/./UtilityTests/RangeTest.Clear (1515 of 1989)
PASS: lldb-shell :: SymbolFile/DWARF/dwp-separate-debug-file.cpp (1516 of 1989)
UNSUPPORTED: lldb-api :: tools/lldb-vscode/completions/TestVSCode_completions.py (1517 of 1989)
PASS: lldb-api :: python_api/formatters/TestFormattersSBAPI.py (1518 of 1989)
UNSUPPORTED: lldb-api :: functionalities/process_save_core/TestProcessSaveCore.py (1519 of 1989)
PASS: lldb-unit :: Utility/./UtilityTests/SerializationRountripTest.SerializeDeserializePodPointers (1520 of 1989)
PASS: lldb-api :: commands/apropos/with-process/TestAproposWithProcess.py (1521 of 1989)
PASS: lldb-shell :: ObjectFile/MachO/lc_build_version.yaml (1522 of 1989)
PASS: lldb-unit :: Utility/./UtilityTests/StreamTeeTest.SetStreamAtIndexOverwrite (1523 of 1989)
PASS: lldb-api :: commands/expression/deleting-implicit-copy-constructor/TestDeletingImplicitCopyConstructor.py (1524 of 1989)
PASS: lldb-unit :: Utility/./UtilityTests/TimerTest.CategoryTimes (1525 of 1989)
PASS: lldb-api :: commands/frame/recognizer/TestFrameRecognizer.py (1526 of 1989)
PASS: lldb-api :: functionalities/breakpoint/address_breakpoints/TestBadAddressBreakpoints.py (1527 of 1989)
PASS: lldb-unit :: Utility/./UtilityTests/StringListTest.InsertStringAtIndexEnd (1528 of 1989)
PASS: lldb-shell :: SymbolFile/NativePDB/source-list.cpp (1529 of 1989)
PASS: lldb-shell :: ObjectFile/wasm/unified-debug-sections.yaml (1530 of 1989)
PASS: lldb-unit :: Host/./HostTests/MainLoopTest.ReadObject (1531 of 1989)
PASS: lldb-unit :: Platform/./LLDBPlatformTests/PlatformDarwinTest.FindComponentInPath (1532 of 1989)
PASS: lldb-api :: python_api/frame/get-variables/TestGetVariables.py (1533 of 1989)
PASS: lldb-api :: functionalities/breakpoint/breakpoint_command/TestBreakpointCommand.py (1534 of 1989)
PASS: lldb-unit :: ScriptInterpreter/Python/./ScriptInterpreterPythonTests/PythonDataObjectsTest.TestPythonListManipulation (1535 of 1989)
PASS: lldb-api :: lang/c/forward/TestForwardDeclaration.py (1536 of 1989)
PASS: lldb-shell :: Reproducer/TestMultipleTargets.test (1537 of 1989)
PASS: lldb-api :: commands/register/register/register_command/TestRegisters.py (1538 of 1989)
PASS: lldb-api :: commands/command/history/TestCommandHistory.py (1539 of 1989)
PASS: lldb-unit :: Utility/./UtilityTests/OptionsWithRawTest.ArgsButNoLeadingDash (1540 of 1989)
PASS: lldb-unit :: Utility/./UtilityTests/StringListTest.JoinNonSpace (1541 of 1989)
PASS: lldb-shell :: Minidump/disassemble-no-module.yaml (1542 of 1989)
PASS: lldb-unit :: Language/Highlighting/./HighlighterTests/HighlighterTest.HighlighterSelectionPath (1543 of 1989)
PASS: lldb-unit :: Host/./HostTests/SocketAddressTest.Set (1544 of 1989)
PASS: lldb-api :: functionalities/tail_call_frames/thread_step_out_or_return/TestSteppingOutWithArtificialFrames.py (1545 of 1989)
PASS: lldb-api :: functionalities/signal/raise/TestRaise.py (1546 of 1989)
PASS: lldb-api :: commands/expression/result_numbering/TestResultNumbering.py (1547 of 1989)
PASS: lldb-unit :: Utility/./UtilityTests/ConstStringTest.format_provider (1548 of 1989)
PASS: lldb-shell :: Commands/command-source.test (1549 of 1989)
PASS: lldb-api :: functionalities/data-formatter/data-formatter-stl/libcxx/vector/TestDataFormatterLibcxxVector.py (1550 of 1989)
PASS: lldb-unit :: UnwindAssembly/x86/./UnwindAssemblyx86Tests/Testx86AssemblyInspectionEngine.TestPopRBX (1551 of 1989)
UNSUPPORTED: lldb-shell :: Breakpoint/ppc64-localentry.test (1552 of 1989)
PASS: lldb-api :: lang/objc/modules-auto-import/TestModulesAutoImport.py (1553 of 1989)
PASS: lldb-unit :: Language/Highlighting/./HighlighterTests/HighlighterTest.ClangSquareBrackets (1554 of 1989)
UNSUPPORTED: lldb-api :: functionalities/breakpoint/breakpoint_in_delayslot/TestAvoidBreakpointInDelaySlot.py (1555 of 1989)
PASS: lldb-api :: lang/cpp/thread_local/TestThreadLocal.py (1556 of 1989)
PASS: lldb-api :: commands/target/create-deps/TestTargetCreateDeps.py (1557 of 1989)
PASS: lldb-api :: commands/expression/char/TestExprsChar.py (1558 of 1989)
PASS: lldb-unit :: Utility/./UtilityTests/UriParserTest.SchemeHostSeparator2 (1559 of 1989)
PASS: lldb-unit :: Utility/./UtilityTests/StreamTest.PutBytesAsRawHex8ToMixedEndian (1560 of 1989)
PASS: lldb-unit :: Utility/./UtilityTests/StreamTest.SetIndentLevel (1561 of 1989)
PASS: lldb-unit :: Expression/./ExpressionTests/DiagnosticManagerTest.AppendMessageAttachToLastDiag (1562 of 1989)
PASS: lldb-unit :: Utility/./UtilityTests/Flags.IsClear (1563 of 1989)
PASS: lldb-unit :: Host/./HostTests/TaskPoolTest.RunTasks (1564 of 1989)
PASS: lldb-api :: commands/expression/import-std-module/conflicts/TestStdModuleWithConflicts.py (1565 of 1989)
PASS: lldb-api :: macosx/order/TestOrderFile.py (1566 of 1989)
PASS: lldb-api :: lang/cpp/bitfields/TestCppBitfields.py (1567 of 1989)
PASS: lldb-unit :: Utility/./UtilityTests/UriParserTest.BadPort2 (1568 of 1989)
PASS: lldb-shell :: ObjectFile/PECOFF/sections-names.yaml (1569 of 1989)
PASS: lldb-unit :: debugserver/./debugserverTests/JSON.Parse (1570 of 1989)
PASS: lldb-api :: python_api/value/change_values/TestChangeValueAPI.py (1571 of 1989)
PASS: lldb-unit :: Utility/./UtilityTests/StreamTest.AddressSize (1572 of 1989)
PASS: lldb-api :: lang/cpp/namespace_definitions/TestNamespaceDefinitions.py (1573 of 1989)
PASS: lldb-shell :: ObjectFile/ELF/PT_LOAD-overlap-PT_TLS.yaml (1574 of 1989)
PASS: lldb-unit :: SymbolFile/NativePDB/./SymbolFileNativePDBTests/PDBFPOProgramToDWARFExpressionTests.InvalidOpBinary (1575 of 1989)
PASS: lldb-unit :: Utility/./UtilityTests/StreamTeeTest.GetStreamAtIndexOutOfBoundsEmpty (1576 of 1989)
PASS: lldb-api :: functionalities/gdb_remote_client/TestTargetXMLArch.py (1577 of 1989)
PASS: lldb-unit :: Utility/./UtilityTests/StringExtractorTest.GetHexU8_Underflow (1578 of 1989)
PASS: lldb-unit :: Utility/./UtilityTests/ArgsTest.EscapeLLDBCommandArgument (1579 of 1989)
PASS: lldb-unit :: SymbolFile/NativePDB/./SymbolFileNativePDBTests/PDBFPOProgramToDWARFExpressionTests.InvalidAssignmentSingle (1580 of 1989)
PASS: lldb-api :: python_api/frame/TestFrames.py (1581 of 1989)
PASS: lldb-api :: functionalities/thread/concurrent_events/TestConcurrentBreakpointsDelayedBreakpointOneWatchpoint.py (1582 of 1989)
PASS: lldb-shell :: ObjectFile/MachO/lc_version_min.yaml (1583 of 1989)
PASS: lldb-unit :: Utility/./UtilityTests/ArchSpecTest.Compatibility (1584 of 1989)
PASS: lldb-unit :: Utility/./UtilityTests/BinaryStreamTest.PutSLEB128EightBytes (1585 of 1989)
PASS: lldb-unit :: Process/minidump/./LLDBMinidumpTests/MinidumpParserTest.GetExceptionStream (1586 of 1989)
PASS: lldb-unit :: Utility/./UtilityTests/FileSpecTest.EqualDotsPosix (1587 of 1989)
UNSUPPORTED: lldb-api :: linux/mix-dwo-and-regular-objects/TestMixedDwarfBinary.py (1588 of 1989)
PASS: lldb-unit :: Utility/./UtilityTests/AnsiTerminal.AtStart (1589 of 1989)
PASS: lldb-api :: functionalities/data-formatter/setvaluefromcstring/TestSetValueFromCString.py (1590 of 1989)
PASS: lldb-unit :: ScriptInterpreter/Python/./ScriptInterpreterPythonTests/PythonDataObjectsTest.TestPythonIntegerToStr (1591 of 1989)
UNSUPPORTED: lldb-shell :: SymbolFile/PDB/calling-conventions.test (1592 of 1989)
PASS: lldb-shell :: ObjectFile/ELF/basic-info.yaml (1593 of 1989)
PASS: lldb-unit :: Host/./HostTests/MainLoopTest.Signal (1594 of 1989)
PASS: lldb-api :: functionalities/data-formatter/data-formatter-stl/libcxx/variant/TestDataFormatterLibcxxVariant.py (1595 of 1989)
PASS: lldb-unit :: Host/./HostTests/FileSystemTest.FileAndDirectoryComponents (1596 of 1989)
PASS: lldb-unit :: Utility/./UtilityTests/RegularExpression.Empty (1597 of 1989)
PASS: lldb-api :: functionalities/thread/concurrent_events/TestConcurrentWatchBreakDelay.py (1598 of 1989)
PASS: lldb-unit :: Utility/./UtilityTests/StreamTest.PutStringAsRawHex8 (1599 of 1989)
PASS: lldb-api :: python_api/sblaunchinfo/TestSBLaunchInfo.py (1600 of 1989)
PASS: lldb-unit :: Utility/./UtilityTests/CompletionRequest.TryCompleteCurrentArgBad (1601 of 1989)
PASS: lldb-shell :: ObjectFile/PECOFF/section-types.yaml (1602 of 1989)
UNSUPPORTED: lldb-api :: tools/intel-features/intel-pt/test/TestIntelPTSimpleBinary.py (1603 of 1989)
UNSUPPORTED: lldb-shell :: ObjectFile/ELF/minidebuginfo-set-and-hit-breakpoint.test (1604 of 1989)
PASS: lldb-unit :: Utility/./UtilityTests/GeneratorTest.Get (1605 of 1989)
PASS: lldb-unit :: Utility/./UtilityTests/BinaryStreamTest.PutSLEB128TwoBytes (1606 of 1989)
PASS: lldb-api :: functionalities/recursion/TestValueObjectRecursion.py (1607 of 1989)
PASS: lldb-api :: lang/objc/modules-inline-functions/TestModulesInlineFunctions.py (1608 of 1989)
PASS: lldb-api :: functionalities/data-formatter/data-formatter-stl/libcxx/list/TestDataFormatterLibcxxList.py (1609 of 1989)
PASS: lldb-shell :: SymbolFile/DWARF/debug_rnglists.s (1610 of 1989)
PASS: lldb-api :: functionalities/breakpoint/serialize/TestBreakpointSerialization.py (1611 of 1989)
PASS: lldb-unit :: Utility/./UtilityTests/StreamTest.ShiftOperatorStrings (1612 of 1989)
PASS: lldb-unit :: Utility/./UtilityTests/StructuredDataTest.StringDump (1613 of 1989)
PASS: lldb-api :: python_api/watchpoint/TestWatchpointIter.py (1614 of 1989)
PASS: lldb-unit :: Utility/./UtilityTests/StreamTest.AddressSuffix (1615 of 1989)
PASS: lldb-unit :: debugserver/./debugserverTests/RNBSocket.AnyListen (1616 of 1989)
PASS: lldb-api :: lang/c/tls_globals/TestTlsGlobals.py (1617 of 1989)
PASS: lldb-unit :: SymbolFile/DWARF/./SymbolFileDWARFTests/SymbolFileDWARFTests.TestAbbrevOrder1Start1 (1618 of 1989)
PASS: lldb-unit :: Target/./TargetTests/ExecutionContextTest.GetByteOrder (1619 of 1989)
PASS: lldb-unit :: Utility/./UtilityTests/FileSpecTest.GuessPathStyle (1620 of 1989)
PASS: lldb-api :: commands/expression/import-std-module/deque-basic/TestDequeFromStdModule.py (1621 of 1989)
PASS: lldb-unit :: Symbol/./SymbolTests/TestTypeSystemClang.TestDeletingImplicitCopyCstrDueToMoveCStr (1622 of 1989)
PASS: lldb-unit :: Core/./LLDBCoreTests/RichManglingContextTest.Basic (1623 of 1989)
PASS: lldb-unit :: Utility/./UtilityTests/BinaryStreamTest.PutSLEB128NineBytes (1624 of 1989)
PASS: lldb-shell :: ObjectFile/Breakpad/breakpad-identification.test (1625 of 1989)
UNSUPPORTED: lldb-api :: functionalities/thread/multi_break/TestMultipleBreakpoints.py (1626 of 1989)
UNSUPPORTED: lldb-api :: commands/register/register/intel_xtended_registers/mpx_bound_violation/TestBoundViolation.py (1627 of 1989)
PASS: lldb-api :: functionalities/thread/concurrent_events/TestConcurrentManyBreakpoints.py (1628 of 1989)
PASS: lldb-unit :: Utility/./UtilityTests/StringListTest.AppendStringMove (1629 of 1989)
PASS: lldb-unit :: SymbolFile/NativePDB/./SymbolFileNativePDBTests/PDBFPOProgramToDWARFExpressionTests.UnresolvedDependentCyclicRegisterAssignmentReference (1630 of 1989)
PASS: lldb-api :: commands/frame/diagnose/dereference-this/TestDiagnoseDereferenceThis.py (1631 of 1989)
PASS: lldb-shell :: Reproducer/TestSynchronous.test (1632 of 1989)
UNSUPPORTED: lldb-shell :: Register/x86-64-xmm16-read.test (1633 of 1989)
PASS: lldb-api :: commands/expression/import-std-module/no-std-module/TestMissingStdModule.py (1634 of 1989)
PASS: lldb-unit :: Utility/./UtilityTests/StringListTest.InsertStringAtIndexStart (1635 of 1989)
PASS: lldb-shell :: Commands/CommandScriptImmediateOutput/CommandScriptImmediateOutputFile.test (1636 of 1989)
PASS: lldb-api :: lang/cpp/namespace_conflicts/TestNamespaceConflicts.py (1637 of 1989)
PASS: lldb-api :: commands/expression/import-std-module/weak_ptr-dbg-info-content/TestDbgInfoContentWeakPtrFromStdModule.py (1638 of 1989)
PASS: lldb-shell :: SymbolFile/Breakpad/line-table.test (1639 of 1989)
PASS: lldb-api :: functionalities/gdb_remote_client/TestArmRegisterDefinition.py (1640 of 1989)
PASS: lldb-unit :: Host/./HostTests/NativeProcessProtocolTest.SetBreakpointFailRead (1641 of 1989)
UNSUPPORTED: lldb-shell :: SymbolFile/DWARF/debug-types-expressions.test (1642 of 1989)
PASS: lldb-unit :: Core/./LLDBCoreTests/RichManglingContextTest.IPDRealloc (1643 of 1989)
PASS: lldb-api :: functionalities/gdb_remote_client/TestRestartBug.py (1644 of 1989)
PASS: lldb-shell :: ObjectFile/ELF/PT_TLS-overlap-PT_LOAD.yaml (1645 of 1989)
PASS: lldb-shell :: Host/TestCustomShell.test (1646 of 1989)
UNSUPPORTED: lldb-shell :: SymbolFile/PDB/class-layout.test (1647 of 1989)
PASS: lldb-api :: functionalities/data-formatter/data-formatter-proper-plurals/TestFormattersOneIsSingular.py (1648 of 1989)
PASS: lldb-api :: lang/cpp/diamond/TestDiamond.py (1649 of 1989)
UNSUPPORTED: lldb-api :: python_api/event/TestEvents.py (1650 of 1989)
PASS: lldb-api :: macosx/universal/TestUniversal.py (1651 of 1989)
UNSUPPORTED: lldb-api :: functionalities/darwin_log/filter/regex/subsystem/TestDarwinLogFilterRegexSubsystem.py (1652 of 1989)
UNSUPPORTED: lldb-shell :: SymbolFile/PDB/ast-restore.test (1653 of 1989)
PASS: lldb-api :: lang/cpp/llvm-style/TestLLVMStyle.py (1654 of 1989)
PASS: lldb-unit :: Language/Highlighting/./HighlighterTests/HighlighterTest.ClangCursorPosInOtherToken (1655 of 1989)
PASS: lldb-api :: functionalities/data-formatter/var-in-aggregate-misuse/TestVarInAggregateMisuse.py (1656 of 1989)
PASS: lldb-api :: functionalities/dynamic_value_child_count/TestDynamicValueChildCount.py (1657 of 1989)
PASS: lldb-unit :: Utility/./UtilityTests/BinaryStreamTest.PutULEB128SevenBytes (1658 of 1989)
PASS: lldb-api :: functionalities/thread/concurrent_events/TestConcurrentDelaySignalBreak.py (1659 of 1989)
PASS: lldb-unit :: UnwindAssembly/x86/./UnwindAssemblyx86Tests/Testx86AssemblyInspectionEngine.TestSubESP (1660 of 1989)
PASS: lldb-unit :: Utility/./UtilityTests/ProcessInstanceInfo.Dump (1661 of 1989)
UNSUPPORTED: lldb-shell :: ScriptInterpreter/Lua/persistent_state.test (1662 of 1989)
PASS: lldb-unit :: Utility/./UtilityTests/StringExtractorTest.GetU64LittleEndian (1663 of 1989)
PASS: lldb-unit :: Utility/./UtilityTests/StreamTest.AddressPrefixAndSuffix (1664 of 1989)
PASS: lldb-unit :: Utility/./UtilityTests/StringExtractorTest.GetHexBytesAvail_OddPair (1665 of 1989)
UNSUPPORTED: lldb-api :: functionalities/darwin_log/filter/regex/message/TestDarwinLogFilterRegexMessage.py (1666 of 1989)
PASS: lldb-api :: lang/cpp/modules-import/TestCXXModulesImport.py (1667 of 1989)
PASS: lldb-api :: macosx/profile_vrs_detach/TestDetachVrsProfile.py (1668 of 1989)
PASS: lldb-unit :: ScriptInterpreter/Python/./ScriptInterpreterPythonTests/PythonDataObjectsTest.TestPythonString (1669 of 1989)
PASS: lldb-api :: functionalities/postmortem/netbsd-core/TestNetBSDCore.py (1670 of 1989)
PASS: lldb-unit :: tools/lldb-server/tests/./LLDBServerTests/TestBase.DebugserverEnv (1671 of 1989)
UNSUPPORTED: lldb-api :: benchmarks/frame_variable/TestFrameVariableResponse.py (1672 of 1989)
PASS: lldb-unit :: Expression/./ExpressionTests/DiagnosticManagerTest.GetStringPreserveOrder (1673 of 1989)
UNSUPPORTED: lldb-api :: functionalities/unwind/ehframe/TestEhFrameUnwind.py (1674 of 1989)
PASS: lldb-unit :: Utility/./UtilityTests/StringExtractorTest.GetHexBytes_Partial (1675 of 1989)
PASS: lldb-unit :: Utility/./UtilityTests/StringListTest.GetMaxStringLengthIncreasingSize (1676 of 1989)
PASS: lldb-api :: commands/add-dsym/uuid/TestAddDsymCommand.py (1677 of 1989)
PASS: lldb-unit :: Utility/./UtilityTests/RegularExpression.CopyAssignment (1678 of 1989)
PASS: lldb-unit :: ScriptInterpreter/Python/./ScriptInterpreterPythonTests/PythonDataObjectsTest.TestModuleNameResolutionNoDot (1679 of 1989)
PASS: lldb-api :: python_api/value/TestValueAPI.py (1680 of 1989)
PASS: lldb-shell :: Expr/TestMultilineExpr.test (1681 of 1989)
PASS: lldb-api :: functionalities/thread/concurrent_events/TestConcurrentManyWatchpoints.py (1682 of 1989)
PASS: lldb-unit :: Host/./HostTests/FileSystemTest.GetPermissions (1683 of 1989)
PASS: lldb-shell :: Settings/TestStopCommandSourceOnError.test (1684 of 1989)
PASS: lldb-unit :: Language/Highlighting/./HighlighterTests/HighlighterTest.DefaultHighlighterWithCursorOutOfBounds (1685 of 1989)
PASS: lldb-unit :: Process/gdb-remote/./ProcessGdbRemoteTests/GDBRemoteClientBaseTest.SendContinueAndInterrupt2PacketBug (1686 of 1989)
PASS: lldb-unit :: Utility/./UtilityTests/StringListTest.AppendListCStringArray (1687 of 1989)
PASS: lldb-api :: functionalities/thread/concurrent_events/TestConcurrentDelayedCrashWithBreakpointWatchpoint.py (1688 of 1989)
PASS: lldb-api :: lang/objc/objc-super/TestObjCSuper.py (1689 of 1989)
PASS: lldb-shell :: Minidump/dump-all.test (1690 of 1989)
UNSUPPORTED: lldb-shell :: SymbolFile/PDB/func-symbols.test (1691 of 1989)
PASS: lldb-api :: macosx/queues/TestQueues.py (1692 of 1989)
PASS: lldb-unit :: Expression/./ExpressionTests/ClangHostTest.ComputeClangResourceDirectory (1693 of 1989)
PASS: lldb-api :: functionalities/data-formatter/data-formatter-advanced/TestDataFormatterAdv.py (1694 of 1989)
PASS: lldb-unit :: Process/gdb-remote/./ProcessGdbRemoteTests/GDBRemoteCommunicationClientTest.SaveRestoreRegistersNoSuffix (1695 of 1989)
PASS: lldb-unit :: Expression/./ExpressionTests/CppModuleConfigurationTest.MissingUsrInclude (1696 of 1989)
PASS: lldb-shell :: SymbolFile/DWARF/find-variable-dwo.cpp (1697 of 1989)
UNSUPPORTED: lldb-shell :: Breakpoint/case-insensitive.test (1698 of 1989)
PASS: lldb-api :: lang/cpp/offsetof/TestOffsetofCpp.py (1699 of 1989)
PASS: lldb-unit :: Host/./HostTests/NativeProcessProtocolTest.SetBreakpointFailVerify (1700 of 1989)
PASS: lldb-shell :: ObjectFile/PECOFF/basic-info-arm.yaml (1701 of 1989)
PASS: lldb-unit :: Utility/./UtilityTests/StringListTest.ShiftStdString (1702 of 1989)
PASS: lldb-unit :: Utility/./UtilityTests/OptionsWithRawTest.EmptySuffix (1703 of 1989)
PASS: lldb-unit :: Process/minidump/./LLDBMinidumpTests/MinidumpParserTest.GetMiscInfo_no_stream (1704 of 1989)
PASS: lldb-unit :: ScriptInterpreter/Python/./ScriptInterpreterPythonTests/PythonDataObjectsTest.TestPythonIntegerToStructuredInteger (1705 of 1989)
PASS: lldb-api :: lang/cpp/virtual-overload/TestVirtualOverload.py (1706 of 1989)
PASS: lldb-unit :: Target/./TargetTests/ModuleCacheTest.GetAndPut (1707 of 1989)
PASS: lldb-unit :: Utility/./UtilityTests/ArgsTest.TestArgv (1708 of 1989)
PASS: lldb-api :: python_api/watchpoint/watchlocation/TestTargetWatchAddress.py (1709 of 1989)
PASS: lldb-shell :: Minidump/no-process-id.yaml (1710 of 1989)
PASS: lldb-unit :: Utility/./UtilityTests/RangeTest.SlideZero (1711 of 1989)
PASS: lldb-api :: functionalities/tail_call_frames/ambiguous_tail_call_seq2/TestAmbiguousTailCallSeq2.py (1712 of 1989)
FAIL: lldb-api :: lang/objc/ptr_refs/TestPtrRefsObjC.py (1713 of 1989)
******************** TEST 'lldb-api :: lang/objc/ptr_refs/TestPtrRefsObjC.py' FAILED ********************
Script:
--
/usr/local/bin/python /Users/buildslave/jenkins/workspace/lldb-cmake-sanitized/llvm-project/lldb/test/API/dotest.py --arch x86_64 -s /Users/buildslave/jenkins/workspace/lldb-cmake-sanitized/lldb-build/lldb-test-traces -S nm -u CXXFLAGS -u CFLAGS --codesign-identity lldb_codesign --server /Users/buildslave/jenkins/workspace/lldb-cmake-sanitized/lldb-build/./bin/debugserver --arch x86_64 --build-dir /Users/buildslave/jenkins/workspace/lldb-cmake-sanitized/lldb-build/lldb-test-build.noindex -s=/Users/buildslave/jenkins/workspace/lldb-cmake-sanitized/test/logs -t --env TERM=vt100 --env LLVM_LIBS_DIR=/Users/buildslave/jenkins/workspace/lldb-cmake-sanitized/lldb-build/./lib --inferior-env ASAN_OPTIONS=detect_stack_use_after_return=1 --inferior-env DYLD_INSERT_LIBRARIES=/Users/buildslave/jenkins/workspace/lldb-cmake-sanitized/host-compiler/lib/clang/11.0.0/lib/darwin/libclang_rt.asan_osx_dynamic.dylib --build-dir /Users/buildslave/jenkins/workspace/lldb-cmake-sanitized/lldb-build/lldb-test-build.noindex --lldb-module-cache-dir /Users/buildslave/jenkins/workspace/lldb-cmake-sanitized/lldb-build/lldb-test-build.noindex/module-cache-lldb/lldb-api --clang-module-cache-dir /Users/buildslave/jenkins/workspace/lldb-cmake-sanitized/lldb-build/lldb-test-build.noindex/module-cache-clang/lldb-api --executable /Users/buildslave/jenkins/workspace/lldb-cmake-sanitized/lldb-build/./bin/lldb --compiler /Users/buildslave/jenkins/workspace/lldb-cmake-sanitized/lldb-build/./bin/clang --dsymutil /Users/buildslave/jenkins/workspace/lldb-cmake-sanitized/lldb-build/./bin/dsymutil --filecheck /Users/buildslave/jenkins/workspace/lldb-cmake-sanitized/lldb-build/./bin/FileCheck --lldb-libs-dir /Users/buildslave/jenkins/workspace/lldb-cmake-sanitized/lldb-build/./lib /Users/buildslave/jenkins/workspace/lldb-cmake-sanitized/llvm-project/lldb/test/API/lang/objc/ptr_refs -p TestPtrRefsObjC.py
--
Exit Code: 1

Hide Details

Command Output (stdout): -- lldb version 11.0.99 clang revision 8fb7cfcea97af440830d256cc18ccd978f218e1d llvm revision 8fb7cfcea97af440830d256cc18ccd978f218e1d "crashlog" and "save_crashlog" command installed, use the "--help" option for detailed help "malloc_info", "ptr_refs", "cstr_refs", "find_variable", and "objc_refs" commands have been installed, use the "--help" options on these commands for detailed help. LLDB library dir: /Users/buildslave/jenkins/workspace/lldb-cmake-sanitized/lldb-build/bin LLDB import library dir: /Users/buildslave/jenkins/workspace/lldb-cmake-sanitized/lldb-build/./lib libstdcxx tests will not be run because: Don't know how to build with libstdcxx on macosx Skipping following debug info categories: ['dwo'] 0x00007ffeeb22c468: stack in frame #0 of thread #1: tid 0x3cd415 in variable at 0x7ffeeb22c468: (MyClass *) self = 0x00006020000000d0 0x00007ffeeb22c3e0: stack (red zone)

Hide Details

-- Command Output (stderr): -- error: 'ptr_refs' is not a valid command. error: 'ptr_refs' is not a valid command.

Hide Details

Session logs for test failures/errors/unexpected successes will go into directory '/Users/buildslave/jenkins/workspace/lldb-cmake-sanitized/test/logs' Command invoked: /Users/buildslave/jenkins/workspace/lldb-cmake-sanitized/llvm-project/lldb/test/API/dotest.py --arch x86_64 -s /Users/buildslave/jenkins/workspace/lldb-cmake-sanitized/lldb-build/lldb-test-traces -S nm -u CXXFLAGS -u CFLAGS --codesign-identity lldb_codesign --server /Users/buildslave/jenkins/workspace/lldb-cmake-sanitized/lldb-build/./bin/debugserver --arch x86_64 --build-dir /Users/buildslave/jenkins/workspace/lldb-cmake-sanitized/lldb-build/lldb-test-build.noindex -s=/Users/buildslave/jenkins/workspace/lldb-cmake-sanitized/test/logs -t --env TERM=vt100 --env LLVM_LIBS_DIR=/Users/buildslave/jenkins/workspace/lldb-cmake-sanitized/lldb-build/./lib --inferior-env ASAN_OPTIONS=detect_stack_use_after_return=1 --inferior-env DYLD_INSERT_LIBRARIES=/Users/buildslave/jenkins/workspace/lldb-cmake-sanitized/host-compiler/lib/clang/11.0.0/lib/darwin/libclang_rt.asan_osx_dynamic.dylib --build-dir /Users/buildslave/jenkins/workspace/lldb-cmake-sanitized/lldb-build/lldb-test-build.noindex --lldb-module-cache-dir /Users/buildslave/jenkins/workspace/lldb-cmake-sanitized/lldb-build/lldb-test-build.noindex/module-cache-lldb/lldb-api --clang-module-cache-dir /Users/buildslave/jenkins/workspace/lldb-cmake-sanitized/lldb-build/lldb-test-build.noindex/module-cache-clang/lldb-api --executable /Users/buildslave/jenkins/workspace/lldb-cmake-sanitized/lldb-build/./bin/lldb --compiler /Users/buildslave/jenkins/workspace/lldb-cmake-sanitized/lldb-build/./bin/clang --dsymutil /Users/buildslave/jenkins/workspace/lldb-cmake-sanitized/lldb-build/./bin/dsymutil --filecheck /Users/buildslave/jenkins/workspace/lldb-cmake-sanitized/lldb-build/./bin/FileCheck --lldb-libs-dir /Users/buildslave/jenkins/workspace/lldb-cmake-sanitized/lldb-build/./lib /Users/buildslave/jenkins/workspace/lldb-cmake-sanitized/llvm-project/lldb/test/API/lang/objc/ptr_refs -p TestPtrRefsObjC.py Change dir to: /Users/buildslave/jenkins/workspace/lldb-cmake-sanitized/llvm-project/lldb/test/API/lang/objc/ptr_refs runCmd: settings clear -all output:

Hide Details

runCmd: settings set symbols.enable-external-lookup false output:

Hide Details

runCmd: settings set target.auto-apply-fixits false output:

Hide Details

runCmd: settings set plugin.process.gdb-remote.packet-timeout 60 output:

Hide Details

runCmd: settings set symbols.clang-modules-cache-path "/Users/buildslave/jenkins/workspace/lldb-cmake-sanitized/lldb-build/lldb-test-build.noindex/module-cache-lldb/lldb-api" output:

Hide Details

runCmd: settings set use-color false output:

Hide Details

runCmd: setting set target.prefer-dynamic-value no-dynamic-values output:

Hide Details

runCmd: settings set target.env-vars ASAN_OPTIONS=detect_stack_use_after_return=1 DYLD_INSERT_LIBRARIES=/Users/buildslave/jenkins/workspace/lldb-cmake-sanitized/host-compiler/lib/clang/11.0.0/lib/darwin/libclang_rt.asan_osx_dynamic.dylib output:

Hide Details

runCmd: script import lldb.macosx.heap output: "crashlog" and "save_crashlog" command installed, use the "--help" option for detailed help "malloc_info", "ptr_refs", "cstr_refs", "find_variable", and "objc_refs" commands have been installed, use the "--help" options on these commands for detailed help.

Hide Details

Hide Details

runCmd: ptr_refs self output: 0x00007ffeeb22c468: stack in frame #0 of thread #1: tid 0x3cd415 in variable at 0x7ffeeb22c468: (MyClass *) self = 0x00006020000000d0 0x00007ffeeb22c3e0: stack (red zone)

Hide Details

Hide Details

Expecting sub string: malloc Not matched

Hide Details

FAIL: LLDB (/Users/buildslave/jenkins/workspace/lldb-cmake-sanitized/lldb-build/bin/clang-11-x86_64) :: test_ptr_refs_dsym (TestPtrRefsObjC.TestPtrRefsObjC) <bound method SBProcess.Kill of <lldb.SBProcess; proxy of <Swig Object of type 'lldb::SBProcess *' at 0x128526960> >>: success

Hide Details

runCmd: settings clear -all output:

Hide Details

runCmd: settings set symbols.enable-external-lookup false output:

Hide Details

runCmd: settings set target.auto-apply-fixits false output:

Hide Details

runCmd: settings set plugin.process.gdb-remote.packet-timeout 60 output:

Hide Details

runCmd: settings set symbols.clang-modules-cache-path "/Users/buildslave/jenkins/workspace/lldb-cmake-sanitized/lldb-build/lldb-test-build.noindex/module-cache-lldb/lldb-api" output:

Hide Details

runCmd: settings set use-color false output:

Hide Details

runCmd: setting set target.prefer-dynamic-value no-dynamic-values output:

Hide Details

runCmd: settings set target.env-vars ASAN_OPTIONS=detect_stack_use_after_return=1 DYLD_INSERT_LIBRARIES=/Users/buildslave/jenkins/workspace/lldb-cmake-sanitized/host-compiler/lib/clang/11.0.0/lib/darwin/libclang_rt.asan_osx_dynamic.dylib output:

Hide Details

runCmd: script import lldb.macosx.heap output:

Hide Details

runCmd: ptr_refs self runCmd failed! error: 'ptr_refs' is not a valid command.

Hide Details

Hide Details

XFAIL: LLDB (/Users/buildslave/jenkins/workspace/lldb-cmake-sanitized/lldb-build/bin/clang-11-x86_64) :: test_ptr_refs_dwarf (TestPtrRefsObjC.TestPtrRefsObjC) <bound method SBProcess.Kill of <lldb.SBProcess; proxy of <Swig Object of type 'lldb::SBProcess *' at 0x111104a50> >>: success

Hide Details

UNSUPPORTED: LLDB (/Users/buildslave/jenkins/workspace/lldb-cmake-sanitized/lldb-build/bin/clang-11-x86_64) :: test_ptr_refs_dwo (TestPtrRefsObjC.TestPtrRefsObjC) (test case does not fall in any category of interest for this run) runCmd: settings clear -all output:

Hide Details

runCmd: settings set symbols.enable-external-lookup false output:

Hide Details

runCmd: settings set target.auto-apply-fixits false output:

Hide Details

runCmd: settings set plugin.process.gdb-remote.packet-timeout 60 output:

Hide Details

runCmd: settings set symbols.clang-modules-cache-path "/Users/buildslave/jenkins/workspace/lldb-cmake-sanitized/lldb-build/lldb-test-build.noindex/module-cache-lldb/lldb-api" output:

Hide Details

runCmd: settings set use-color false output:

Hide Details

runCmd: setting set target.prefer-dynamic-value no-dynamic-values output:

Hide Details

runCmd: settings set target.env-vars ASAN_OPTIONS=detect_stack_use_after_return=1 DYLD_INSERT_LIBRARIES=/Users/buildslave/jenkins/workspace/lldb-cmake-sanitized/host-compiler/lib/clang/11.0.0/lib/darwin/libclang_rt.asan_osx_dynamic.dylib output:

Hide Details

runCmd: script import lldb.macosx.heap output:

Hide Details

runCmd: ptr_refs self runCmd failed! error: 'ptr_refs' is not a valid command.

Hide Details

Hide Details

XFAIL: LLDB (/Users/buildslave/jenkins/workspace/lldb-cmake-sanitized/lldb-build/bin/clang-11-x86_64) :: test_ptr_refs_gmodules (TestPtrRefsObjC.TestPtrRefsObjC) <bound method SBProcess.Kill of <lldb.SBProcess; proxy of <Swig Object of type 'lldb::SBProcess *' at 0x1285262a0> >>: success

Hide Details

Restore dir to: /Users/buildslave/jenkins/workspace/lldb-cmake-sanitized/lldb-build/tools/lldb/test ====================================================================== FAIL: test_ptr_refs_dsym (TestPtrRefsObjC.TestPtrRefsObjC) Test the ptr_refs tool on Darwin with Objective-C ---------------------------------------------------------------------- Traceback (most recent call last): File "/Users/buildslave/jenkins/workspace/lldb-cmake-sanitized/llvm-project/lldb/packages/Python/lldbsuite/test/lldbtest.py", line 1751, in test_method return attrvalue(self) File "/Users/buildslave/jenkins/workspace/lldb-cmake-sanitized/llvm-project/lldb/packages/Python/lldbsuite/test/decorators.py", line 110, in wrapper func(*args, **kwargs) File "/Users/buildslave/jenkins/workspace/lldb-cmake-sanitized/llvm-project/lldb/test/API/lang/objc/ptr_refs/TestPtrRefsObjC.py", line 47, in test_ptr_refs self.expect("ptr_refs self", substrs=["malloc", "stack"]) File "/Users/buildslave/jenkins/workspace/lldb-cmake-sanitized/llvm-project/lldb/packages/Python/lldbsuite/test/lldbtest.py", line 2391, in expect if msg else EXP_MSG(str, output, exe)) AssertionError: False is not True : 'ptr_refs self' returns expected result, got '0x00007ffeeb22c468: stack in frame #0 of thread #1: tid 0x3cd415 in variable at 0x7ffeeb22c468: (MyClass *) self = 0x00006020000000d0 0x00007ffeeb22c3e0: stack (red zone)' Config=x86_64-/Users/buildslave/jenkins/workspace/lldb-cmake-sanitized/lldb-build/bin/clang-11 ---------------------------------------------------------------------- Ran 4 tests in 34.874s

Hide Details

RESULT: FAILED (0 passes, 1 failures, 0 errors, 1 skipped, 2 expected failures, 0 unexpected successes)

Hide Details

--

Hide Details

******************** PASS: lldb-unit :: Utility/./UtilityTests/BinaryStreamTest.PutULEB128MaxValue (1714 of 1989) PASS: lldb-unit :: UnwindAssembly/x86/./UnwindAssemblyx86Tests/Testx86AssemblyInspectionEngine.TestPushECX (1715 of 1989) PASS: lldb-unit :: Process/gdb-remote/./ProcessGdbRemoteTests/GDBRemoteClientBaseTest.SendContinueAndAsyncPacket (1716 of 1989) PASS: lldb-api :: functionalities/conditional_break/TestConditionalBreak.py (1717 of 1989) PASS: lldb-unit :: Target/./TargetTests/PathMappingListTest.RelativeTests (1718 of 1989) PASS: lldb-unit :: Utility/./UtilityTests/Flags.GetBitSize (1719 of 1989) PASS: lldb-api :: functionalities/data-formatter/data-formatter-objc/TestDataFormatterObjCNSError.py (1720 of 1989) PASS: lldb-unit :: Utility/./UtilityTests/AnsiTerminal.Twice (1721 of 1989) PASS: lldb-shell :: ObjectFile/ELF/PT_LOAD-overlap-section.yaml (1722 of 1989) PASS: lldb-api :: commands/expression/completion-crash-incomplete-record/TestCompletionCrashIncompleteRecord.py (1723 of 1989) PASS: lldb-unit :: UnwindAssembly/x86/./UnwindAssemblyx86Tests/Testx86AssemblyInspectionEngine.TestAddRSP (1724 of 1989) PASS: lldb-shell :: SymbolFile/DWARF/dir-separator-windows.s (1725 of 1989) PASS: lldb-unit :: Expression/./ExpressionTests/DiagnosticManagerTest.PutStringMultiple (1726 of 1989) PASS: lldb-unit :: Utility/./UtilityTests/RegularExpression.Invalid (1727 of 1989) PASS: lldb-unit :: Utility/./UtilityTests/ArgsTest.GetQuotedCommandString (1728 of 1989) PASS: lldb-unit :: Core/./LLDBCoreTests/MangledTest.EmptyForInvalidName (1729 of 1989) PASS: lldb-unit :: Language/Highlighting/./HighlighterTests/HighlighterTest.HighlighterSelectionType (1730 of 1989) PASS: lldb-api :: lang/c/step_over_no_deadlock/TestStepOverDoesntBlock.py (1731 of 1989) PASS: lldb-api :: commands/expression/import-std-module/empty-module/TestEmptyStdModule.py (1732 of 1989) PASS: lldb-unit :: Utility/./UtilityTests/RangeTest.Copy (1733 of 1989) PASS: lldb-unit :: Utility/./UtilityTests/StringListTest.Assignment (1734 of 1989) PASS: lldb-api :: lang/objc/single-entry-dictionary/TestObjCSingleEntryDictionary.py (1735 of 1989) PASS: lldb-unit :: Symbol/./SymbolTests/TestTypeSystemClang.TestBuiltinTypeForEncodingAndBitSize (1736 of 1989) PASS: lldb-unit :: Utility/./UtilityTests/RecordReplayTest.InstrumentedBar (1737 of 1989) PASS: lldb-shell :: Breakpoint/debug_rnglistx_rlex.test (1738 of 1989) PASS: lldb-api :: commands/expression/vector_of_enums/TestVectorOfEnums.py (1739 of 1989) PASS: lldb-shell :: SymbolFile/DWARF/clang-ast-from-dwarf-objc-property.m (1740 of 1989) PASS: lldb-api :: lang/objc/objc-new-syntax/TestObjCNewSyntaxLiteral.py (1741 of 1989) PASS: lldb-unit :: Process/gdb-remote/./ProcessGdbRemoteTests/GDBRemoteClientBaseTest.SendContinueAndAsyncSignal (1742 of 1989) PASS: lldb-unit :: Utility/./UtilityTests/StringLexerTest.AdvanceIf (1743 of 1989) PASS: lldb-unit :: Utility/./UtilityTests/FileSpecTest.IsRelative (1744 of 1989) PASS: lldb-api :: lang/objc/rdar-10967107/TestRdar10967107.py (1745 of 1989) PASS: lldb-api :: python_api/lldbutil/frame/TestFrameUtils.py (1746 of 1989) PASS: lldb-unit :: Utility/./UtilityTests/BinaryStreamTest.PutSLEB128FiveBytes (1747 of 1989) PASS: lldb-unit :: Utility/./UtilityTests/ScalarTest.CastOperations (1748 of 1989) PASS: lldb-unit :: Utility/./UtilityTests/SerializationRountripTest.SerializeDeserializeObjectPointer (1749 of 1989) PASS: lldb-unit :: Utility/./UtilityTests/StatusTest.Formatv (1750 of 1989) PASS: lldb-unit :: Utility/./UtilityTests/UriParserTest.PortOverflow (1751 of 1989) PASS: lldb-api :: commands/command/script_alias/TestCommandScriptAlias.py (1752 of 1989) PASS: lldb-api :: functionalities/load_unload/TestLoadUnload.py (1753 of 1989) PASS: lldb-api :: functionalities/data-formatter/compactvectors/TestCompactVectors.py (1754 of 1989) PASS: lldb-api :: commands/watchpoints/watchpoint_disable/TestWatchpointDisable.py (1755 of 1989) PASS: lldb-unit :: Process/gdb-remote/./ProcessGdbRemoteTests/GDBRemoteCommunicationClientTest.SendStopTracePacket (1756 of 1989) PASS: lldb-api :: functionalities/tail_call_frames/cross_object/TestCrossObjectTailCalls.py (1757 of 1989) PASS: lldb-api :: tools/lldb-vscode/breakpoint-events/TestVSCode_breakpointEvents.py (1758 of 1989) PASS: lldb-shell :: Reproducer/TestDriverOptions.test (1759 of 1989) PASS: lldb-unit :: SymbolFile/NativePDB/./SymbolFileNativePDBTests/PDBFPOProgramToDWARFExpressionTests.UnresolvedRegisterAssignmentReference (1760 of 1989) PASS: lldb-unit :: Utility/./UtilityTests/DataExtractorTest.GetMaxU64_unchecked (1761 of 1989) PASS: lldb-api :: commands/expression/import-std-module/forward_list-dbg-info-content/TestDbgInfoContentForwardListFromStdModule.py (1762 of 1989) UNSUPPORTED: lldb-shell :: Register/aarch64-gp-read.test (1763 of 1989) PASS: lldb-unit :: Utility/./UtilityTests/TimerTest.CategoryTimes2 (1764 of 1989) PASS: lldb-unit :: Utility/./UtilityTests/StructuredDataTest.ParseJSONFromFile (1765 of 1989) UNSUPPORTED: lldb-api :: lang/cpp/function-template-parameter-pack/TestFunctionTemplateParameterPack.py (1766 of 1989) PASS: lldb-unit :: Symbol/./SymbolTests/TestTypeSystemClang.TestDisplayName (1767 of 1989) PASS: lldb-shell :: Breakpoint/implicit_const_form_support.test (1768 of 1989) PASS: lldb-shell :: SymbolFile/NativePDB/function-types-calling-conv.cpp (1769 of 1989) PASS: lldb-unit :: Utility/./UtilityTests/UriParserTest.TypicalPortPathIPv6 (1770 of 1989) PASS: lldb-api :: functionalities/thread/concurrent_events/TestConcurrentBreakpointOneDelayBreakpointThreads.py (1771 of 1989) PASS: lldb-unit :: Utility/./UtilityTests/RecordReplayTest.InstrumentedBarRef (1772 of 1989) PASS: lldb-unit :: Utility/./UtilityTests/SerializationRountripTest.SerializeDeserializeCStringNull (1773 of 1989) PASS: lldb-api :: lang/c/local_variables/TestLocalVariables.py (1774 of 1989) PASS: lldb-unit :: Expression/./ExpressionTests/CppModuleConfigurationTest.Linux (1775 of 1989) PASS: lldb-api :: tools/lldb-vscode/console/TestVSCode_console.py (1776 of 1989) PASS: lldb-unit :: Core/./LLDBCoreTests/RichManglingContextTest.SwitchProvider (1777 of 1989) PASS: lldb-api :: functionalities/data-formatter/data-formatter-synthval/TestDataFormatterSynthVal.py (1778 of 1989) PASS: lldb-api :: python_api/watchpoint/condition/TestWatchpointConditionAPI.py (1779 of 1989) PASS: lldb-shell :: SymbolFile/DWARF/parallel-indexing-stress.s (1780 of 1989) PASS: lldb-unit :: UnwindAssembly/x86/./UnwindAssemblyx86Tests/Testx86AssemblyInspectionEngine.TestSimplex86_64Augmented (1781 of 1989) PASS: lldb-shell :: BuildScript/compiler-full-path.test (1782 of 1989) PASS: lldb-api :: commands/watchpoints/watchpoint_commands/command/TestWatchpointCommandLLDB.py (1783 of 1989) PASS: lldb-api :: functionalities/thread/concurrent_events/TestConcurrentCrashWithWatchpointBreakpointSignal.py (1784 of 1989) PASS: lldb-unit :: Utility/./UtilityTests/StreamTest.PutMaxHex64ByteOrderBig (1785 of 1989) PASS: lldb-unit :: Host/./HostTests/MainLoopTest.DetectsEOF (1786 of 1989) PASS: lldb-api :: commands/expression/rdar44436068/Test128BitsInteger.py (1787 of 1989) PASS: lldb-unit :: Utility/./UtilityTests/ConstStringTest.CompareConstString (1788 of 1989) UNSUPPORTED: lldb-shell :: SymbolFile/Breakpad/stack-cfi-arm.yaml (1789 of 1989) PASS: lldb-api :: functionalities/data-formatter/nssetsynth/TestNSSetSynthetic.py (1790 of 1989) PASS: lldb-unit :: Utility/./UtilityTests/StreamTeeTest.Constructor1Stream (1791 of 1989) PASS: lldb-unit :: UnwindAssembly/x86/./UnwindAssemblyx86Tests/Testx86AssemblyInspectionEngine.TestPopR13 (1792 of 1989) PASS: lldb-api :: functionalities/thread/concurrent_events/TestConcurrentSignalDelayBreak.py (1793 of 1989) PASS: lldb-unit :: Utility/./UtilityTests/VMRange.Clear (1794 of 1989) PASS: lldb-shell :: Minidump/Windows/broken-unwind.test (1795 of 1989) PASS: lldb-unit :: ScriptInterpreter/Python/./ScriptInterpreterPythonTests/PythonDataObjectsTest.TestPythonTupleToStructuredList (1796 of 1989) PASS: lldb-unit :: Utility/./UtilityTests/StreamTest.PutHex64ByteOrderBig (1797 of 1989) PASS: lldb-api :: python_api/symbol-context/two-files/TestSymbolContextTwoFiles.py (1798 of 1989) UNSUPPORTED: lldb-api :: functionalities/tsan/thread_leak/TestTsanThreadLeak.py (1799 of 1989) PASS: lldb-api :: functionalities/thread/concurrent_events/TestConcurrentCrashWithBreak.py (1800 of 1989) PASS: lldb-unit :: Utility/./UtilityTests/StringExtractorTest.GetHexBytesAvail_Partial (1801 of 1989) PASS: lldb-api :: functionalities/thread/concurrent_events/TestConcurrentCrashWithWatchpoint.py (1802 of 1989) PASS: lldb-unit :: Process/gdb-remote/./ProcessGdbRemoteTests/GDBRemoteCommunicationClientTest.GetModulesInfoInvalidResponse (1803 of 1989) PASS: lldb-unit :: UnwindAssembly/x86/./UnwindAssemblyx86Tests/Testx86AssemblyInspectionEngine.TestPushR13 (1804 of 1989) PASS: lldb-unit :: Utility/./UtilityTests/StringExtractorTest.GetHexBytes_FullString (1805 of 1989) PASS: lldb-unit :: debugserver/./debugserverTests/RNBSocket.LoopBackConnectIPv6 (1806 of 1989) PASS: lldb-shell :: ObjectFile/MachO/subsections.yaml (1807 of 1989) PASS: lldb-api :: types/TestIntegerType.py (1808 of 1989) PASS: lldb-shell :: Reproducer/Functionalities/TestDataFormatter.test (1809 of 1989) PASS: lldb-api :: commands/expression/call-function/TestCallStopAndContinue.py (1810 of 1989) PASS: lldb-shell :: Breakpoint/debug_rnglist_rlestartend.test (1811 of 1989) PASS: lldb-api :: functionalities/data-formatter/ptr_ref_typedef/TestPtrRef2Typedef.py (1812 of 1989) UNSUPPORTED: lldb-shell :: ScriptInterpreter/Lua/lua.test (1813 of 1989) PASS: lldb-api :: commands/watchpoints/watchpoint_count/TestWatchpointCount.py (1814 of 1989) PASS: lldb-shell :: Minidump/memory-region.yaml (1815 of 1989) PASS: lldb-api :: lang/cpp/operators/TestCppOperators.py (1816 of 1989) PASS: lldb-api :: python_api/watchpoint/TestWatchpointIgnoreCount.py (1817 of 1989) PASS: lldb-unit :: Utility/./UtilityTests/StreamTest.PutBytesAsRawHex8ToLittleEndian (1818 of 1989) PASS: lldb-unit :: Utility/./UtilityTests/StringExtractorTest.DecodeHexU8_InvalidHex (1819 of 1989) PASS: lldb-api :: commands/expression/dont_allow_jit/TestAllowJIT.py (1820 of 1989) PASS: lldb-api :: functionalities/postmortem/minidump/TestMiniDump.py (1821 of 1989) PASS: lldb-unit :: Utility/./UtilityTests/RangeTest.ContainsEndInclusive (1822 of 1989) PASS: lldb-api :: commands/expression/formatters/TestFormatters.py (1823 of 1989) PASS: lldb-unit :: Utility/./UtilityTests/StreamTest.QuotedCString (1824 of 1989) PASS: lldb-api :: commands/frame/diagnose/dereference-argument/TestDiagnoseDereferenceArgument.py (1825 of 1989) PASS: lldb-unit :: Utility/./UtilityTests/BroadcasterTest.BroadcastEvent (1826 of 1989) PASS: lldb-api :: python_api/sbdata/TestSBData.py (1827 of 1989) PASS: lldb-api :: lang/cpp/static_methods/TestCPPStaticMethods.py (1828 of 1989) PASS: lldb-api :: commands/command/script/import/TestImport.py (1829 of 1989) PASS: lldb-api :: functionalities/data-formatter/data-formatter-objc/TestDataFormatterObjNSException.py (1830 of 1989) PASS: lldb-shell :: ObjectFile/ELF/section-types.yaml (1831 of 1989) PASS: lldb-api :: commands/log/basic/TestLogging.py (1832 of 1989) PASS: lldb-unit :: SymbolFile/DWARF/./SymbolFileDWARFTests/SymbolFileDWARFTests.ParseArangesNonzeroSegmentSize (1833 of 1989) PASS: lldb-unit :: Utility/./UtilityTests/ArgsTest.ReplaceArgumentAtIndexShort (1834 of 1989) PASS: lldb-api :: tools/lldb-server/TestLldbGdbServer.py (1835 of 1989) PASS: lldb-unit :: Symbol/./SymbolTests/DWARFCallFrameInfoTest.Basic_eh (1836 of 1989) PASS: lldb-unit :: Utility/./UtilityTests/CompletionRequest.DuplicateFiltering (1837 of 1989) PASS: lldb-shell :: ObjectFile/MachO/lc_build_version_notools.yaml (1838 of 1989) PASS: lldb-shell :: Reproducer/TestCrash.test (1839 of 1989) PASS: lldb-api :: commands/frame/language/TestGuessLanguage.py (1840 of 1989) PASS: lldb-api :: functionalities/data-formatter/language_category_updates/TestDataFormatterLanguageCategoryUpdates.py (1841 of 1989) PASS: lldb-api :: functionalities/postmortem/elf-core/TestLinuxCore.py (1842 of 1989) PASS: lldb-api :: lang/objc/foundation/TestObjectDescriptionAPI.py (1843 of 1989) PASS: lldb-api :: lang/objc/objc_direct-methods/TestObjCDirectMethods.py (1844 of 1989) PASS: lldb-api :: commands/watchpoints/step_over_watchpoint/TestStepOverWatchpoint.py (1845 of 1989) PASS: lldb-api :: functionalities/data-formatter/dump_dynamic/TestDumpDynamic.py (1846 of 1989) PASS: lldb-shell :: SymbolFile/DWARF/debug-types-missing-signature.test (1847 of 1989) PASS: lldb-unit :: Utility/./UtilityTests/DataExtractorTest.GetCStrEmpty (1848 of 1989) PASS: lldb-unit :: Language/Highlighting/./HighlighterTests/HighlighterTest.ClangCursorPosEndOfLine (1849 of 1989) PASS: lldb-api :: functionalities/data-formatter/type_summary_list_script/TestTypeSummaryListScript.py (1850 of 1989) PASS: lldb-shell :: SymbolFile/NativePDB/ast-functions.cpp (1851 of 1989) PASS: lldb-api :: functionalities/thread/concurrent_events/TestConcurrentDelaySignalWatch.py (1852 of 1989) PASS: lldb-unit :: Utility/./UtilityTests/GeneratorTest.GetOrCreate (1853 of 1989) PASS: lldb-unit :: Process/minidump/./LLDBMinidumpTests/MinidumpParserTest.GetLinuxProcStatus_no_stream (1854 of 1989) PASS: lldb-unit :: Utility/./UtilityTests/StringExtractorTest.InitMisc (1855 of 1989) PASS: lldb-shell :: SymbolFile/DWARF/dwo-type-in-main-file.s (1856 of 1989) PASS: lldb-api :: lang/objc/objc-ivar-offsets/TestObjCIvarOffsets.py (1857 of 1989) PASS: lldb-unit :: Utility/./UtilityTests/ConstStringTest.FromMidOfBufferStringRef (1858 of 1989) PASS: lldb-unit :: UnwindAssembly/x86/./UnwindAssemblyx86Tests/Testx86AssemblyInspectionEngine.Test32BitOnlyInstruction (1859 of 1989) PASS: lldb-shell :: ObjectFile/ELF/minidebuginfo-find-symbols.yaml (1860 of 1989) PASS: lldb-api :: functionalities/breakpoint/breakpoint_by_line_and_column/TestBreakpointByLineAndColumn.py (1861 of 1989) PASS: lldb-unit :: Utility/./UtilityTests/RegisterValueTest.GetSet8 (1862 of 1989) PASS: lldb-api :: functionalities/data-formatter/nsdictionarysynth/TestNSDictionarySynthetic.py (1863 of 1989) PASS: lldb-unit :: Utility/./UtilityTests/ArgsTest.ReplaceArgumentAtIndexFarOutOfRange (1864 of 1989) UNSUPPORTED: lldb-api :: commands/watchpoints/hello_watchlocation/TestWatchLocation.py (1865 of 1989) PASS: lldb-unit :: Host/./HostTests/SocketTest.DomainListenConnectAccept (1866 of 1989) PASS: lldb-unit :: Utility/./UtilityTests/OptionsWithRawTest.ArgsButNoDelimiter (1867 of 1989) PASS: lldb-unit :: UnwindAssembly/x86/./UnwindAssemblyx86Tests/Testx86AssemblyInspectionEngine.TestReturnDetect (1868 of 1989) PASS: lldb-api :: commands/expression/unicode-in-variable/TestUnicodeInVariable.py (1869 of 1989) PASS: lldb-unit :: Utility/./UtilityTests/LogChannelEnabledTest.log_options (1870 of 1989) PASS: lldb-api :: functionalities/breakpoint/breakpoint_command/TestBreakpointCommandsFromPython.py (1871 of 1989) PASS: lldb-unit :: Utility/./UtilityTests/StringExtractorTest.GetHexU8_Extra_NoEof (1872 of 1989) PASS: lldb-unit :: Utility/./UtilityTests/BinaryStreamTest.PutULEB128Zero (1873 of 1989) UNSUPPORTED: lldb-api :: commands/expression/multiline-completion/TestMultilineCompletion.py (1874 of 1989) PASS: lldb-unit :: Utility/./UtilityTests/CompletionRequest.TryCompleteCurrentArgMode (1875 of 1989) PASS: lldb-unit :: Utility/./UtilityTests/ReproducerTest.SetReplay (1876 of 1989) PASS: lldb-unit :: Language/Highlighting/./HighlighterTests/HighlighterTest.ClangTrailingBackslashBeforeNewline (1877 of 1989) PASS: lldb-unit :: Utility/./UtilityTests/StringListTest.SetSize (1878 of 1989) PASS: lldb-api :: python_api/value/linked_list/TestValueAPILinkedList.py (1879 of 1989) PASS: lldb-unit :: Expression/./ExpressionTests/DWARFExpression.DW_OP_piece (1880 of 1989) PASS: lldb-unit :: Host/./HostTests/SocketTest.TCPListen0GetPort (1881 of 1989) PASS: lldb-api :: functionalities/fat_archives/TestFatArchives.py (1882 of 1989) PASS: lldb-unit :: Symbol/./SymbolTests/TestClangASTImporter.RecordLayout (1883 of 1989) PASS: lldb-unit :: UnwindAssembly/x86/./UnwindAssemblyx86Tests/Testx86AssemblyInspectionEngine.TestSimplei386ugmented (1884 of 1989) PASS: lldb-unit :: Process/minidump/./LLDBMinidumpTests/MinidumpParserTest.GetLinuxProcStatus (1885 of 1989) PASS: lldb-api :: functionalities/thread/exit_during_break/TestExitDuringBreak.py (1886 of 1989) PASS: lldb-shell :: SymbolFile/DWARF/split-dwarf-inlining.cpp (1887 of 1989) PASS: lldb-api :: functionalities/data-formatter/varscript_formatting/TestDataFormatterVarScriptFormatting.py (1888 of 1989) PASS: lldb-api :: lang/c/function_types/TestFunctionTypes.py (1889 of 1989) PASS: lldb-api :: tools/lldb-vscode/launch/TestVSCode_launch.py (1890 of 1989) PASS: lldb-api :: commands/log/invalid-args/TestInvalidArgsLog.py (1891 of 1989) PASS: lldb-shell :: SymbolFile/DWARF/dwarf5-index-is-used.cpp (1892 of 1989) UNSUPPORTED: lldb-shell :: ObjectFile/PECOFF/disassemble-thumb.yaml (1893 of 1989) PASS: lldb-unit :: Symbol/./SymbolTests/TestTypeSystemClang.TestGetTypeClassTypeOf (1894 of 1989) PASS: lldb-api :: functionalities/breakpoint/hardware_breakpoints/hardware_breakpoint_on_multiple_threads/TestHWBreakMultiThread.py (1895 of 1989) UNSUPPORTED: lldb-shell :: SymbolFile/NativePDB/typedefs.cpp (1896 of 1989) PASS: lldb-api :: functionalities/source-map/TestTargetSourceMap.py (1897 of 1989) PASS: lldb-api :: lang/objc/objc-ivar-stripped/TestObjCIvarStripped.py (1898 of 1989) PASS: lldb-unit :: Utility/./UtilityTests/UriParserTest.LongPath (1899 of 1989) PASS: lldb-unit :: Language/CPlusPlus/./LanguageCPlusPlusTests/CPlusPlusLanguage.CPlusPlusNameParser (1900 of 1989) PASS: lldb-unit :: ObjectFile/ELF/./ObjectFileELFTests/ObjectFileELFTest.GetSymtab_NoSymEntryPointArmThumbAddressClass (1901 of 1989) PASS: lldb-unit :: Host/./HostTests/NativeProcessProtocolTest.ReadCStringFromMemory_CrossPageBoundary (1902 of 1989) PASS: lldb-unit :: ObjectFile/ELF/./ObjectFileELFTests/ObjectFileELFTest.SectionsResolveConsistently (1903 of 1989) PASS: lldb-api :: tools/lldb-server/commandline/TestStubReverseConnect.py (1904 of 1989) PASS: lldb-unit :: Utility/./UtilityTests/NameMatchesTest.EndsWith (1905 of 1989) UNSUPPORTED: lldb-api :: lang/objc/bitfield_ivars/TestBitfieldIvars.py (1906 of 1989) FAIL: lldb-api :: python_api/thread/TestThreadAPI.py (1907 of 1989) ******************** TEST 'lldb-api :: python_api/thread/TestThreadAPI.py' FAILED ******************** Script: -- /usr/local/bin/python /Users/buildslave/jenkins/workspace/lldb-cmake-sanitized/llvm-project/lldb/test/API/dotest.py --arch x86_64 -s /Users/buildslave/jenkins/workspace/lldb-cmake-sanitized/lldb-build/lldb-test-traces -S nm -u CXXFLAGS -u CFLAGS --codesign-identity lldb_codesign --server /Users/buildslave/jenkins/workspace/lldb-cmake-sanitized/lldb-build/./bin/debugserver --arch x86_64 --build-dir /Users/buildslave/jenkins/workspace/lldb-cmake-sanitized/lldb-build/lldb-test-build.noindex -s=/Users/buildslave/jenkins/workspace/lldb-cmake-sanitized/test/logs -t --env TERM=vt100 --env LLVM_LIBS_DIR=/Users/buildslave/jenkins/workspace/lldb-cmake-sanitized/lldb-build/./lib --inferior-env ASAN_OPTIONS=detect_stack_use_after_return=1 --inferior-env DYLD_INSERT_LIBRARIES=/Users/buildslave/jenkins/workspace/lldb-cmake-sanitized/host-compiler/lib/clang/11.0.0/lib/darwin/libclang_rt.asan_osx_dynamic.dylib --build-dir /Users/buildslave/jenkins/workspace/lldb-cmake-sanitized/lldb-build/lldb-test-build.noindex --lldb-module-cache-dir /Users/buildslave/jenkins/workspace/lldb-cmake-sanitized/lldb-build/lldb-test-build.noindex/module-cache-lldb/lldb-api --clang-module-cache-dir /Users/buildslave/jenkins/workspace/lldb-cmake-sanitized/lldb-build/lldb-test-build.noindex/module-cache-clang/lldb-api --executable /Users/buildslave/jenkins/workspace/lldb-cmake-sanitized/lldb-build/./bin/lldb --compiler /Users/buildslave/jenkins/workspace/lldb-cmake-sanitized/lldb-build/./bin/clang --dsymutil /Users/buildslave/jenkins/workspace/lldb-cmake-sanitized/lldb-build/./bin/dsymutil --filecheck /Users/buildslave/jenkins/workspace/lldb-cmake-sanitized/lldb-build/./bin/FileCheck --lldb-libs-dir /Users/buildslave/jenkins/workspace/lldb-cmake-sanitized/lldb-build/./lib /Users/buildslave/jenkins/workspace/lldb-cmake-sanitized/llvm-project/lldb/test/API/python_api/thread -p TestThreadAPI.py -- Exit Code: 1

Hide Details

Command Output (stdout): -- lldb version 11.0.99 clang revision 8fb7cfcea97af440830d256cc18ccd978f218e1d llvm revision 8fb7cfcea97af440830d256cc18ccd978f218e1d LLDB library dir: /Users/buildslave/jenkins/workspace/lldb-cmake-sanitized/lldb-build/bin LLDB import library dir: /Users/buildslave/jenkins/workspace/lldb-cmake-sanitized/lldb-build/./lib libstdcxx tests will not be run because: Don't know how to build with libstdcxx on macosx Skipping following debug info categories: ['dwo'] start addr: 0x10fc96e66 end addr: 0x10fc96e70 start addr: 0x10b3b1e66 end addr: 0x10b3b1e70 start addr: 0x106a33e66 end addr: 0x106a33e70

Hide Details

-- Command Output (stderr): --

Hide Details

Session logs for test failures/errors/unexpected successes will go into directory '/Users/buildslave/jenkins/workspace/lldb-cmake-sanitized/test/logs' Command invoked: /Users/buildslave/jenkins/workspace/lldb-cmake-sanitized/llvm-project/lldb/test/API/dotest.py --arch x86_64 -s /Users/buildslave/jenkins/workspace/lldb-cmake-sanitized/lldb-build/lldb-test-traces -S nm -u CXXFLAGS -u CFLAGS --codesign-identity lldb_codesign --server /Users/buildslave/jenkins/workspace/lldb-cmake-sanitized/lldb-build/./bin/debugserver --arch x86_64 --build-dir /Users/buildslave/jenkins/workspace/lldb-cmake-sanitized/lldb-build/lldb-test-build.noindex -s=/Users/buildslave/jenkins/workspace/lldb-cmake-sanitized/test/logs -t --env TERM=vt100 --env LLVM_LIBS_DIR=/Users/buildslave/jenkins/workspace/lldb-cmake-sanitized/lldb-build/./lib --inferior-env ASAN_OPTIONS=detect_stack_use_after_return=1 --inferior-env DYLD_INSERT_LIBRARIES=/Users/buildslave/jenkins/workspace/lldb-cmake-sanitized/host-compiler/lib/clang/11.0.0/lib/darwin/libclang_rt.asan_osx_dynamic.dylib --build-dir /Users/buildslave/jenkins/workspace/lldb-cmake-sanitized/lldb-build/lldb-test-build.noindex --lldb-module-cache-dir /Users/buildslave/jenkins/workspace/lldb-cmake-sanitized/lldb-build/lldb-test-build.noindex/module-cache-lldb/lldb-api --clang-module-cache-dir /Users/buildslave/jenkins/workspace/lldb-cmake-sanitized/lldb-build/lldb-test-build.noindex/module-cache-clang/lldb-api --executable /Users/buildslave/jenkins/workspace/lldb-cmake-sanitized/lldb-build/./bin/lldb --compiler /Users/buildslave/jenkins/workspace/lldb-cmake-sanitized/lldb-build/./bin/clang --dsymutil /Users/buildslave/jenkins/workspace/lldb-cmake-sanitized/lldb-build/./bin/dsymutil --filecheck /Users/buildslave/jenkins/workspace/lldb-cmake-sanitized/lldb-build/./bin/FileCheck --lldb-libs-dir /Users/buildslave/jenkins/workspace/lldb-cmake-sanitized/lldb-build/./lib /Users/buildslave/jenkins/workspace/lldb-cmake-sanitized/llvm-project/lldb/test/API/python_api/thread -p TestThreadAPI.py Change dir to: /Users/buildslave/jenkins/workspace/lldb-cmake-sanitized/llvm-project/lldb/test/API/python_api/thread runCmd: settings clear -all output:

Hide Details

runCmd: settings set symbols.enable-external-lookup false output:

Hide Details

runCmd: settings set target.auto-apply-fixits false output:

Hide Details

runCmd: settings set plugin.process.gdb-remote.packet-timeout 60 output:

Hide Details

runCmd: settings set symbols.clang-modules-cache-path "/Users/buildslave/jenkins/workspace/lldb-cmake-sanitized/lldb-build/lldb-test-build.noindex/module-cache-lldb/lldb-api" output:

Hide Details

runCmd: settings set use-color false output:

Hide Details

runCmd: setting set target.prefer-dynamic-value no-dynamic-values output:

Hide Details

runCmd: settings set target.env-vars ASAN_OPTIONS=detect_stack_use_after_return=1 DYLD_INSERT_LIBRARIES=/Users/buildslave/jenkins/workspace/lldb-cmake-sanitized/host-compiler/lib/clang/11.0.0/lib/darwin/libclang_rt.asan_osx_dynamic.dylib output:

Hide Details

runCmd: breakpoint list output: Current breakpoints: 1: file = 'main.cpp', line = 17, exact_match = 0, locations = 1 1.1: where = a.out`main + 115 at main.cpp:17:5, address = a.out[0x0000000100000f53], unresolved, hit count = 0

Hide Details

Hide Details

Hide Details

runCmd: process status output: Process 88307 stopped * thread #1, queue = 'com.apple.main-thread', stop reason = breakpoint 1.1 frame #0: 0x000000010bd9ef53 a.out`main(argc=1, argv=0x00007ffee3e614c8) at main.cpp:17:5 14 15 printf("after the loop: my_char='%c'\n", my_char); // 'my_char' should print out as 'x'. 16 -> 17 return 0; // Set break point at this line and check variable 'my_char'. ^ 18 }

Hide Details

Hide Details

<bound method SBProcess.Kill of <lldb.SBProcess; proxy of <Swig Object of type 'lldb::SBProcess *' at 0x10a6acf90> >>: success

Hide Details

PASS: LLDB (/Users/buildslave/jenkins/workspace/lldb-cmake-sanitized/lldb-build/bin/clang-11-x86_64) :: test_get_process_dsym (TestThreadAPI.ThreadAPITestCase) runCmd: settings clear -all output:

Hide Details

runCmd: settings set symbols.enable-external-lookup false output:

Hide Details

runCmd: settings set target.auto-apply-fixits false output:

Hide Details

runCmd: settings set plugin.process.gdb-remote.packet-timeout 60 output:

Hide Details

runCmd: settings set symbols.clang-modules-cache-path "/Users/buildslave/jenkins/workspace/lldb-cmake-sanitized/lldb-build/lldb-test-build.noindex/module-cache-lldb/lldb-api" output:

Hide Details

runCmd: settings set use-color false output:

Hide Details

runCmd: setting set target.prefer-dynamic-value no-dynamic-values output:

Hide Details

runCmd: settings set target.env-vars ASAN_OPTIONS=detect_stack_use_after_return=1 DYLD_INSERT_LIBRARIES=/Users/buildslave/jenkins/workspace/lldb-cmake-sanitized/host-compiler/lib/clang/11.0.0/lib/darwin/libclang_rt.asan_osx_dynamic.dylib output:

Hide Details

runCmd: breakpoint list output: Current breakpoints: 1: file = 'main.cpp', line = 17, exact_match = 0, locations = 1 1.1: where = a.out`main + 115 at main.cpp:17:5, address = a.out[0x0000000100000f53], unresolved, hit count = 0

Hide Details

Hide Details

Hide Details

runCmd: process status output: Process 88376 stopped * thread #1, queue = 'com.apple.main-thread', stop reason = breakpoint 1.1 frame #0: 0x000000010c3ebf53 a.out`main(argc=1, argv=0x00007ffee3814498) at main.cpp:17:5 14 15 printf("after the loop: my_char='%c'\n", my_char); // 'my_char' should print out as 'x'. 16 -> 17 return 0; // Set break point at this line and check variable 'my_char'. ^ 18 }

Hide Details

Hide Details

<bound method SBProcess.Kill of <lldb.SBProcess; proxy of <Swig Object of type 'lldb::SBProcess *' at 0x109a5ea50> >>: success

Hide Details

PASS: LLDB (/Users/buildslave/jenkins/workspace/lldb-cmake-sanitized/lldb-build/bin/clang-11-x86_64) :: test_get_process_dwarf (TestThreadAPI.ThreadAPITestCase) UNSUPPORTED: LLDB (/Users/buildslave/jenkins/workspace/lldb-cmake-sanitized/lldb-build/bin/clang-11-x86_64) :: test_get_process_dwo (TestThreadAPI.ThreadAPITestCase) (test case does not fall in any category of interest for this run) runCmd: settings clear -all output:

Hide Details

runCmd: settings set symbols.enable-external-lookup false output:

Hide Details

runCmd: settings set target.auto-apply-fixits false output:

Hide Details

runCmd: settings set plugin.process.gdb-remote.packet-timeout 60 output:

Hide Details

runCmd: settings set symbols.clang-modules-cache-path "/Users/buildslave/jenkins/workspace/lldb-cmake-sanitized/lldb-build/lldb-test-build.noindex/module-cache-lldb/lldb-api" output:

Hide Details

runCmd: settings set use-color false output:

Hide Details

runCmd: setting set target.prefer-dynamic-value no-dynamic-values output:

Hide Details

runCmd: settings set target.env-vars ASAN_OPTIONS=detect_stack_use_after_return=1 DYLD_INSERT_LIBRARIES=/Users/buildslave/jenkins/workspace/lldb-cmake-sanitized/host-compiler/lib/clang/11.0.0/lib/darwin/libclang_rt.asan_osx_dynamic.dylib output:

Hide Details

runCmd: breakpoint list output: Current breakpoints: 1: file = 'main.cpp', line = 17, exact_match = 0, locations = 1 1.1: where = a.out`main + 115 at main.cpp:17:5, address = a.out[0x0000000100000f53], unresolved, hit count = 0

Hide Details

Hide Details

Hide Details

runCmd: process status output: Process 88462 stopped * thread #1, queue = 'com.apple.main-thread', stop reason = breakpoint 1.1 frame #0: 0x0000000100870f53 a.out`main(argc=1, argv=0x00007ffeef38f498) at main.cpp:17:5 14 15 printf("after the loop: my_char='%c'\n", my_char); // 'my_char' should print out as 'x'. 16 -> 17 return 0; // Set break point at this line and check variable 'my_char'. ^ 18 }

Hide Details

Hide Details

<bound method SBProcess.Kill of <lldb.SBProcess; proxy of <Swig Object of type 'lldb::SBProcess *' at 0x109f61390> >>: success

Hide Details

PASS: LLDB (/Users/buildslave/jenkins/workspace/lldb-cmake-sanitized/lldb-build/bin/clang-11-x86_64) :: test_get_process_gmodules (TestThreadAPI.ThreadAPITestCase) runCmd: settings clear -all output:

Hide Details

runCmd: settings set symbols.enable-external-lookup false output:

Hide Details

runCmd: settings set target.auto-apply-fixits false output:

Hide Details

runCmd: settings set plugin.process.gdb-remote.packet-timeout 60 output:

Hide Details

runCmd: settings set symbols.clang-modules-cache-path "/Users/buildslave/jenkins/workspace/lldb-cmake-sanitized/lldb-build/lldb-test-build.noindex/module-cache-lldb/lldb-api" output:

Hide Details

runCmd: settings set use-color false output:

Hide Details

runCmd: setting set target.prefer-dynamic-value no-dynamic-values output:

Hide Details

runCmd: settings set target.env-vars ASAN_OPTIONS=detect_stack_use_after_return=1 DYLD_INSERT_LIBRARIES=/Users/buildslave/jenkins/workspace/lldb-cmake-sanitized/host-compiler/lib/clang/11.0.0/lib/darwin/libclang_rt.asan_osx_dynamic.dylib output:

Hide Details

<bound method SBProcess.Kill of <lldb.SBProcess; proxy of <Swig Object of type 'lldb::SBProcess *' at 0x109a5e3c0> >>: success

Hide Details

PASS: LLDB (/Users/buildslave/jenkins/workspace/lldb-cmake-sanitized/lldb-build/bin/clang-11-x86_64) :: test_get_stop_description_dsym (TestThreadAPI.ThreadAPITestCase) runCmd: settings clear -all output:

Hide Details

runCmd: settings set symbols.enable-external-lookup false output:

Hide Details

runCmd: settings set target.auto-apply-fixits false output:

Hide Details

runCmd: settings set plugin.process.gdb-remote.packet-timeout 60 output:

Hide Details

runCmd: settings set symbols.clang-modules-cache-path "/Users/buildslave/jenkins/workspace/lldb-cmake-sanitized/lldb-build/lldb-test-build.noindex/module-cache-lldb/lldb-api" output:

Hide Details

runCmd: settings set use-color false output:

Hide Details

runCmd: setting set target.prefer-dynamic-value no-dynamic-values output:

Hide Details

runCmd: settings set target.env-vars ASAN_OPTIONS=detect_stack_use_after_return=1 DYLD_INSERT_LIBRARIES=/Users/buildslave/jenkins/workspace/lldb-cmake-sanitized/host-compiler/lib/clang/11.0.0/lib/darwin/libclang_rt.asan_osx_dynamic.dylib output:

Hide Details

<bound method SBProcess.Kill of <lldb.SBProcess; proxy of <Swig Object of type 'lldb::SBProcess *' at 0x109f1fea0> >>: success

Hide Details

PASS: LLDB (/Users/buildslave/jenkins/workspace/lldb-cmake-sanitized/lldb-build/bin/clang-11-x86_64) :: test_get_stop_description_dwarf (TestThreadAPI.ThreadAPITestCase) UNSUPPORTED: LLDB (/Users/buildslave/jenkins/workspace/lldb-cmake-sanitized/lldb-build/bin/clang-11-x86_64) :: test_get_stop_description_dwo (TestThreadAPI.ThreadAPITestCase) (test case does not fall in any category of interest for this run) runCmd: settings clear -all output:

Hide Details

runCmd: settings set symbols.enable-external-lookup false output:

Hide Details

runCmd: settings set target.auto-apply-fixits false output:

Hide Details

runCmd: settings set plugin.process.gdb-remote.packet-timeout 60 output:

Hide Details

runCmd: settings set symbols.clang-modules-cache-path "/Users/buildslave/jenkins/workspace/lldb-cmake-sanitized/lldb-build/lldb-test-build.noindex/module-cache-lldb/lldb-api" output:

Hide Details

runCmd: settings set use-color false output:

Hide Details

runCmd: setting set target.prefer-dynamic-value no-dynamic-values output:

Hide Details

runCmd: settings set target.env-vars ASAN_OPTIONS=detect_stack_use_after_return=1 DYLD_INSERT_LIBRARIES=/Users/buildslave/jenkins/workspace/lldb-cmake-sanitized/host-compiler/lib/clang/11.0.0/lib/darwin/libclang_rt.asan_osx_dynamic.dylib output:

Hide Details

<bound method SBProcess.Kill of <lldb.SBProcess; proxy of <Swig Object of type 'lldb::SBProcess *' at 0x109a5ea50> >>: success

Hide Details

PASS: LLDB (/Users/buildslave/jenkins/workspace/lldb-cmake-sanitized/lldb-build/bin/clang-11-x86_64) :: test_get_stop_description_gmodules (TestThreadAPI.ThreadAPITestCase) runCmd: settings clear -all output:

Hide Details

runCmd: settings set symbols.enable-external-lookup false output:

Hide Details

runCmd: settings set target.auto-apply-fixits false output:

Hide Details

runCmd: settings set plugin.process.gdb-remote.packet-timeout 60 output:

Hide Details

runCmd: settings set symbols.clang-modules-cache-path "/Users/buildslave/jenkins/workspace/lldb-cmake-sanitized/lldb-build/lldb-test-build.noindex/module-cache-lldb/lldb-api" output:

Hide Details

runCmd: settings set use-color false output:

Hide Details

runCmd: setting set target.prefer-dynamic-value no-dynamic-values output:

Hide Details

runCmd: settings set target.env-vars ASAN_OPTIONS=detect_stack_use_after_return=1 DYLD_INSERT_LIBRARIES=/Users/buildslave/jenkins/workspace/lldb-cmake-sanitized/host-compiler/lib/clang/11.0.0/lib/darwin/libclang_rt.asan_osx_dynamic.dylib output:

Hide Details

runCmd: breakpoint list output: Current breakpoints: 1: file = 'main2.cpp', line = 21, exact_match = 0, locations = 1 1.1: where = test_run_to_address_dsym`b(int) + 22 at main2.cpp:21:17, address = test_run_to_address_dsym[0x0000000100000e66], unresolved, hit count = 0

Hide Details

Hide Details

Hide Details

runCmd: thread backtrace output: * thread #1, queue = 'com.apple.main-thread', stop reason = breakpoint 1.1 * frame #0: 0x000000010fc96e66 test_run_to_address_dsym`b(val=1) at main2.cpp:21:17 frame #1: 0x000000010fc96e0d test_run_to_address_dsym`a(val=1) at main2.cpp:11:16 frame #2: 0x000000010fc96ee0 test_run_to_address_dsym`main(argc=1, argv=0x00007ffedff69470) at main2.cpp:36:14 frame #3: 0x00007fff777b3085 libdyld.dylib`start + 1

Hide Details

Hide Details

runCmd: breakpoint list output: Current breakpoints: 1: file = 'main2.cpp', line = 21, exact_match = 0, locations = 1 Options: disabled 1.1: where = test_run_to_address_dsym`b(int) + 22 at main2.cpp:21:17, address = 0x000000010fc96e66, unresolved, hit count = 1

Hide Details

Hide Details

Hide Details

runCmd: thread backtrace output: * thread #1, queue = 'com.apple.main-thread', stop reason = step over * frame #0: 0x000000010fc96e9d test_run_to_address_dsym`b(val=1) at main2.cpp:26:12 frame #1: 0x000000010fc96e0d test_run_to_address_dsym`a(val=1) at main2.cpp:11:16 frame #2: 0x000000010fc96ee0 test_run_to_address_dsym`main(argc=1, argv=0x00007ffedff69470) at main2.cpp:36:14 frame #3: 0x00007fff777b3085 libdyld.dylib`start + 1

Hide Details

Hide Details

runCmd: process status output: Process 88846 stopped * thread #1, queue = 'com.apple.main-thread', stop reason = run to address: 0x000000010fc96e66 frame #0: 0x000000010fc96e66 test_run_to_address_dsym`b(val=2) at main2.cpp:21:17 18 int b(int val) 19 { 20 int rc = c(val); -> 21 void *ptr = malloc(1024); // thread step-out of malloc into function b. ^ 22 if (!ptr) 23 return -1; 24 else

Hide Details

Hide Details

<bound method SBProcess.Kill of <lldb.SBProcess; proxy of <Swig Object of type 'lldb::SBProcess *' at 0x109f1fe70> >>: success

Hide Details

PASS: LLDB (/Users/buildslave/jenkins/workspace/lldb-cmake-sanitized/lldb-build/bin/clang-11-x86_64) :: test_run_to_address_dsym (TestThreadAPI.ThreadAPITestCase) runCmd: settings clear -all output:

Hide Details

runCmd: settings set symbols.enable-external-lookup false output:

Hide Details

runCmd: settings set target.auto-apply-fixits false output:

Hide Details

runCmd: settings set plugin.process.gdb-remote.packet-timeout 60 output:

Hide Details

runCmd: settings set symbols.clang-modules-cache-path "/Users/buildslave/jenkins/workspace/lldb-cmake-sanitized/lldb-build/lldb-test-build.noindex/module-cache-lldb/lldb-api" output:

Hide Details

runCmd: settings set use-color false output:

Hide Details

runCmd: setting set target.prefer-dynamic-value no-dynamic-values output:

Hide Details

runCmd: settings set target.env-vars ASAN_OPTIONS=detect_stack_use_after_return=1 DYLD_INSERT_LIBRARIES=/Users/buildslave/jenkins/workspace/lldb-cmake-sanitized/host-compiler/lib/clang/11.0.0/lib/darwin/libclang_rt.asan_osx_dynamic.dylib output:

Hide Details

runCmd: breakpoint list output: Current breakpoints: 1: file = 'main2.cpp', line = 21, exact_match = 0, locations = 1 1.1: where = test_run_to_address_dwarf`b(int) + 22 at main2.cpp:21:17, address = test_run_to_address_dwarf[0x0000000100000e66], unresolved, hit count = 0

Hide Details

Hide Details

Hide Details

runCmd: thread backtrace output: * thread #1, queue = 'com.apple.main-thread', stop reason = breakpoint 1.1 * frame #0: 0x000000010b3b1e66 test_run_to_address_dwarf`b(val=1) at main2.cpp:21:17 frame #1: 0x000000010b3b1e0d test_run_to_address_dwarf`a(val=1) at main2.cpp:11:16 frame #2: 0x000000010b3b1ee0 test_run_to_address_dwarf`main(argc=1, argv=0x00007ffee484e470) at main2.cpp:36:14 frame #3: 0x00007fff777b3085 libdyld.dylib`start + 1

Hide Details

Hide Details

runCmd: breakpoint list output: Current breakpoints: 1: file = 'main2.cpp', line = 21, exact_match = 0, locations = 1 Options: disabled 1.1: where = test_run_to_address_dwarf`b(int) + 22 at main2.cpp:21:17, address = 0x000000010b3b1e66, unresolved, hit count = 1

Hide Details

Hide Details

Hide Details

runCmd: thread backtrace output: * thread #1, queue = 'com.apple.main-thread', stop reason = step over * frame #0: 0x000000010b3b1e9d test_run_to_address_dwarf`b(val=1) at main2.cpp:26:12 frame #1: 0x000000010b3b1e0d test_run_to_address_dwarf`a(val=1) at main2.cpp:11:16 frame #2: 0x000000010b3b1ee0 test_run_to_address_dwarf`main(argc=1, argv=0x00007ffee484e470) at main2.cpp:36:14 frame #3: 0x00007fff777b3085 libdyld.dylib`start + 1

Hide Details

Hide Details

runCmd: process status output: Process 88902 stopped * thread #1, queue = 'com.apple.main-thread', stop reason = run to address: 0x000000010b3b1e66 frame #0: 0x000000010b3b1e66 test_run_to_address_dwarf`b(val=2) at main2.cpp:21:17 18 int b(int val) 19 { 20 int rc = c(val); -> 21 void *ptr = malloc(1024); // thread step-out of malloc into function b. ^ 22 if (!ptr) 23 return -1; 24 else

Hide Details

Hide Details

<bound method SBProcess.Kill of <lldb.SBProcess; proxy of <Swig Object of type 'lldb::SBProcess *' at 0x109a5e3c0> >>: success

Hide Details

PASS: LLDB (/Users/buildslave/jenkins/workspace/lldb-cmake-sanitized/lldb-build/bin/clang-11-x86_64) :: test_run_to_address_dwarf (TestThreadAPI.ThreadAPITestCase) UNSUPPORTED: LLDB (/Users/buildslave/jenkins/workspace/lldb-cmake-sanitized/lldb-build/bin/clang-11-x86_64) :: test_run_to_address_dwo (TestThreadAPI.ThreadAPITestCase) (test case does not fall in any category of interest for this run) runCmd: settings clear -all output:

Hide Details

runCmd: settings set symbols.enable-external-lookup false output:

Hide Details

runCmd: settings set target.auto-apply-fixits false output:

Hide Details

runCmd: settings set plugin.process.gdb-remote.packet-timeout 60 output:

Hide Details

runCmd: settings set symbols.clang-modules-cache-path "/Users/buildslave/jenkins/workspace/lldb-cmake-sanitized/lldb-build/lldb-test-build.noindex/module-cache-lldb/lldb-api" output:

Hide Details

runCmd: settings set use-color false output:

Hide Details

runCmd: setting set target.prefer-dynamic-value no-dynamic-values output:

Hide Details

runCmd: settings set target.env-vars ASAN_OPTIONS=detect_stack_use_after_return=1 DYLD_INSERT_LIBRARIES=/Users/buildslave/jenkins/workspace/lldb-cmake-sanitized/host-compiler/lib/clang/11.0.0/lib/darwin/libclang_rt.asan_osx_dynamic.dylib output:

Hide Details

runCmd: breakpoint list output: Current breakpoints: 1: file = 'main2.cpp', line = 21, exact_match = 0, locations = 1 1.1: where = test_run_to_address_gmodules`b(int) + 22 at main2.cpp:21:17, address = test_run_to_address_gmodules[0x0000000100000e66], unresolved, hit count = 0

Hide Details

Hide Details

Hide Details

runCmd: thread backtrace output: * thread #1, queue = 'com.apple.main-thread', stop reason = breakpoint 1.1 * frame #0: 0x0000000106a33e66 test_run_to_address_gmodules`b(val=1) at main2.cpp:21:17 frame #1: 0x0000000106a33e0d test_run_to_address_gmodules`a(val=1) at main2.cpp:11:16 frame #2: 0x0000000106a33ee0 test_run_to_address_gmodules`main(argc=1, argv=0x00007ffee91cc460) at main2.cpp:36:14 frame #3: 0x00007fff777b3085 libdyld.dylib`start + 1

Hide Details

Hide Details

runCmd: breakpoint list output: Current breakpoints: 1: file = 'main2.cpp', line = 21, exact_match = 0, locations = 1 Options: disabled 1.1: where = test_run_to_address_gmodules`b(int) + 22 at main2.cpp:21:17, address = 0x0000000106a33e66, unresolved, hit count = 1

Hide Details

Hide Details

Hide Details

runCmd: thread backtrace output: * thread #1, queue = 'com.apple.main-thread', stop reason = step over * frame #0: 0x0000000106a33e9d test_run_to_address_gmodules`b(val=1) at main2.cpp:26:12 frame #1: 0x0000000106a33e0d test_run_to_address_gmodules`a(val=1) at main2.cpp:11:16 frame #2: 0x0000000106a33ee0 test_run_to_address_gmodules`main(argc=1, argv=0x00007ffee91cc460) at main2.cpp:36:14 frame #3: 0x00007fff777b3085 libdyld.dylib`start + 1

Hide Details

Hide Details

runCmd: process status output: Process 88961 stopped * thread #1, queue = 'com.apple.main-thread', stop reason = run to address: 0x0000000106a33e66 frame #0: 0x0000000106a33e66 test_run_to_address_gmodules`b(val=2) at main2.cpp:21:17 18 int b(int val) 19 { 20 int rc = c(val); -> 21 void *ptr = malloc(1024); // thread step-out of malloc into function b. ^ 22 if (!ptr) 23 return -1; 24 else

Hide Details

Hide Details

<bound method SBProcess.Kill of <lldb.SBProcess; proxy of <Swig Object of type 'lldb::SBProcess *' at 0x109f1fea0> >>: success

Hide Details

PASS: LLDB (/Users/buildslave/jenkins/workspace/lldb-cmake-sanitized/lldb-build/bin/clang-11-x86_64) :: test_run_to_address_gmodules (TestThreadAPI.ThreadAPITestCase) runCmd: settings clear -all output:

Hide Details

runCmd: settings set symbols.enable-external-lookup false output:

Hide Details

runCmd: settings set target.auto-apply-fixits false output:

Hide Details

runCmd: settings set plugin.process.gdb-remote.packet-timeout 60 output:

Hide Details

runCmd: settings set symbols.clang-modules-cache-path "/Users/buildslave/jenkins/workspace/lldb-cmake-sanitized/lldb-build/lldb-test-build.noindex/module-cache-lldb/lldb-api" output:

Hide Details

runCmd: settings set use-color false output:

Hide Details

runCmd: setting set target.prefer-dynamic-value no-dynamic-values output:

Hide Details

runCmd: settings set target.env-vars ASAN_OPTIONS=detect_stack_use_after_return=1 DYLD_INSERT_LIBRARIES=/Users/buildslave/jenkins/workspace/lldb-cmake-sanitized/host-compiler/lib/clang/11.0.0/lib/darwin/libclang_rt.asan_osx_dynamic.dylib output:

Hide Details

FAIL: LLDB (/Users/buildslave/jenkins/workspace/lldb-cmake-sanitized/lldb-build/bin/clang-11-x86_64) :: test_step_out_of_malloc_into_function_b_dsym (TestThreadAPI.ThreadAPITestCase) <bound method SBProcess.Kill of <lldb.SBProcess; proxy of <Swig Object of type 'lldb::SBProcess *' at 0x109a5ea50> >>: success

Hide Details

runCmd: settings clear -all output:

Hide Details

runCmd: settings set symbols.enable-external-lookup false output:

Hide Details

runCmd: settings set target.auto-apply-fixits false output:

Hide Details

runCmd: settings set plugin.process.gdb-remote.packet-timeout 60 output:

Hide Details

runCmd: settings set symbols.clang-modules-cache-path "/Users/buildslave/jenkins/workspace/lldb-cmake-sanitized/lldb-build/lldb-test-build.noindex/module-cache-lldb/lldb-api" output:

Hide Details

runCmd: settings set use-color false output:

Hide Details

runCmd: setting set target.prefer-dynamic-value no-dynamic-values output:

Hide Details

runCmd: settings set target.env-vars ASAN_OPTIONS=detect_stack_use_after_return=1 DYLD_INSERT_LIBRARIES=/Users/buildslave/jenkins/workspace/lldb-cmake-sanitized/host-compiler/lib/clang/11.0.0/lib/darwin/libclang_rt.asan_osx_dynamic.dylib output:

Hide Details

FAIL: LLDB (/Users/buildslave/jenkins/workspace/lldb-cmake-sanitized/lldb-build/bin/clang-11-x86_64) :: test_step_out_of_malloc_into_function_b_dwarf (TestThreadAPI.ThreadAPITestCase) <bound method SBProcess.Kill of <lldb.SBProcess; proxy of <Swig Object of type 'lldb::SBProcess *' at 0x109f1fe70> >>: success

Hide Details

UNSUPPORTED: LLDB (/Users/buildslave/jenkins/workspace/lldb-cmake-sanitized/lldb-build/bin/clang-11-x86_64) :: test_step_out_of_malloc_into_function_b_dwo (TestThreadAPI.ThreadAPITestCase) (test case does not fall in any category of interest for this run) runCmd: settings clear -all output:

Hide Details

runCmd: settings set symbols.enable-external-lookup false output:

Hide Details

runCmd: settings set target.auto-apply-fixits false output:

Hide Details

runCmd: settings set plugin.process.gdb-remote.packet-timeout 60 output:

Hide Details

runCmd: settings set symbols.clang-modules-cache-path "/Users/buildslave/jenkins/workspace/lldb-cmake-sanitized/lldb-build/lldb-test-build.noindex/module-cache-lldb/lldb-api" output:

Hide Details

runCmd: settings set use-color false output:

Hide Details

runCmd: setting set target.prefer-dynamic-value no-dynamic-values output:

Hide Details

runCmd: settings set target.env-vars ASAN_OPTIONS=detect_stack_use_after_return=1 DYLD_INSERT_LIBRARIES=/Users/buildslave/jenkins/workspace/lldb-cmake-sanitized/host-compiler/lib/clang/11.0.0/lib/darwin/libclang_rt.asan_osx_dynamic.dylib output:

Hide Details

FAIL: LLDB (/Users/buildslave/jenkins/workspace/lldb-cmake-sanitized/lldb-build/bin/clang-11-x86_64) :: test_step_out_of_malloc_into_function_b_gmodules (TestThreadAPI.ThreadAPITestCase) <bound method SBProcess.Kill of <lldb.SBProcess; proxy of <Swig Object of type 'lldb::SBProcess *' at 0x109a5ea50> >>: success

Hide Details

runCmd: settings clear -all output:

Hide Details

runCmd: settings set symbols.enable-external-lookup false output:

Hide Details

runCmd: settings set target.auto-apply-fixits false output:

Hide Details

runCmd: settings set plugin.process.gdb-remote.packet-timeout 60 output:

Hide Details

runCmd: settings set symbols.clang-modules-cache-path "/Users/buildslave/jenkins/workspace/lldb-cmake-sanitized/lldb-build/lldb-test-build.noindex/module-cache-lldb/lldb-api" output:

Hide Details

runCmd: settings set use-color false output:

Hide Details

runCmd: setting set target.prefer-dynamic-value no-dynamic-values output:

Hide Details

runCmd: settings set target.env-vars ASAN_OPTIONS=detect_stack_use_after_return=1 DYLD_INSERT_LIBRARIES=/Users/buildslave/jenkins/workspace/lldb-cmake-sanitized/host-compiler/lib/clang/11.0.0/lib/darwin/libclang_rt.asan_osx_dynamic.dylib output:

Hide Details

runCmd: breakpoint list output: Current breakpoints: 1: file = 'main2.cpp', line = 21, exact_match = 0, locations = 1 1.1: where = test_step_over_3_times_dsym`b(int) + 22 at main2.cpp:21:17, address = test_step_over_3_times_dsym[0x0000000100000e66], unresolved, hit count = 0

Hide Details

Hide Details

Hide Details

runCmd: thread backtrace output: * thread #1, queue = 'com.apple.main-thread', stop reason = breakpoint 1.1 * frame #0: 0x000000010eb84e66 test_step_over_3_times_dsym`b(val=1) at main2.cpp:21:17 frame #1: 0x000000010eb84e0d test_step_over_3_times_dsym`a(val=1) at main2.cpp:11:16 frame #2: 0x000000010eb84ee0 test_step_over_3_times_dsym`main(argc=1, argv=0x00007ffee107b468) at main2.cpp:36:14 frame #3: 0x00007fff777b3085 libdyld.dylib`start + 1 frame #4: 0x00007fff777b3085 libdyld.dylib`start + 1

Hide Details

Hide Details

runCmd: thread backtrace output: * thread #1, queue = 'com.apple.main-thread', stop reason = step over * frame #0: 0x000000010eb84e9d test_step_over_3_times_dsym`b(val=1) at main2.cpp:26:12 frame #1: 0x000000010eb84e0d test_step_over_3_times_dsym`a(val=1) at main2.cpp:11:16 frame #2: 0x000000010eb84ee0 test_step_over_3_times_dsym`main(argc=1, argv=0x00007ffee107b468) at main2.cpp:36:14 frame #3: 0x00007fff777b3085 libdyld.dylib`start + 1 frame #4: 0x00007fff777b3085 libdyld.dylib`start + 1

Hide Details

Hide Details

<bound method SBProcess.Kill of <lldb.SBProcess; proxy of <Swig Object of type 'lldb::SBProcess *' at 0x109f1fe70> >>: success

Hide Details

PASS: LLDB (/Users/buildslave/jenkins/workspace/lldb-cmake-sanitized/lldb-build/bin/clang-11-x86_64) :: test_step_over_3_times_dsym (TestThreadAPI.ThreadAPITestCase) runCmd: settings clear -all output:

Hide Details

runCmd: settings set symbols.enable-external-lookup false output:

Hide Details

runCmd: settings set target.auto-apply-fixits false output:

Hide Details

runCmd: settings set plugin.process.gdb-remote.packet-timeout 60 output:

Hide Details

runCmd: settings set symbols.clang-modules-cache-path "/Users/buildslave/jenkins/workspace/lldb-cmake-sanitized/lldb-build/lldb-test-build.noindex/module-cache-lldb/lldb-api" output:

Hide Details

runCmd: settings set use-color false output:

Hide Details

runCmd: setting set target.prefer-dynamic-value no-dynamic-values output:

Hide Details

runCmd: settings set target.env-vars ASAN_OPTIONS=detect_stack_use_after_return=1 DYLD_INSERT_LIBRARIES=/Users/buildslave/jenkins/workspace/lldb-cmake-sanitized/host-compiler/lib/clang/11.0.0/lib/darwin/libclang_rt.asan_osx_dynamic.dylib output:

Hide Details

runCmd: breakpoint list output: Current breakpoints: 1: file = 'main2.cpp', line = 21, exact_match = 0, locations = 1 1.1: where = test_step_over_3_times_dwarf`b(int) + 22 at main2.cpp:21:17, address = test_step_over_3_times_dwarf[0x0000000100000e66], unresolved, hit count = 0

Hide Details

Hide Details

Hide Details

runCmd: thread backtrace output: * thread #1, queue = 'com.apple.main-thread', stop reason = breakpoint 1.1 * frame #0: 0x0000000107d27e66 test_step_over_3_times_dwarf`b(val=1) at main2.cpp:21:17 frame #1: 0x0000000107d27e0d test_step_over_3_times_dwarf`a(val=1) at main2.cpp:11:16 frame #2: 0x0000000107d27ee0 test_step_over_3_times_dwarf`main(argc=1, argv=0x00007ffee7ed8460) at main2.cpp:36:14 frame #3: 0x00007fff777b3085 libdyld.dylib`start + 1

Hide Details

Hide Details

runCmd: thread backtrace output: * thread #1, queue = 'com.apple.main-thread', stop reason = step over * frame #0: 0x0000000107d27e9d test_step_over_3_times_dwarf`b(val=1) at main2.cpp:26:12 frame #1: 0x0000000107d27e0d test_step_over_3_times_dwarf`a(val=1) at main2.cpp:11:16 frame #2: 0x0000000107d27ee0 test_step_over_3_times_dwarf`main(argc=1, argv=0x00007ffee7ed8460) at main2.cpp:36:14 frame #3: 0x00007fff777b3085 libdyld.dylib`start + 1

Hide Details

Hide Details

<bound method SBProcess.Kill of <lldb.SBProcess; proxy of <Swig Object of type 'lldb::SBProcess *' at 0x109a5ea50> >>: success

Hide Details

PASS: LLDB (/Users/buildslave/jenkins/workspace/lldb-cmake-sanitized/lldb-build/bin/clang-11-x86_64) :: test_step_over_3_times_dwarf (TestThreadAPI.ThreadAPITestCase) UNSUPPORTED: LLDB (/Users/buildslave/jenkins/workspace/lldb-cmake-sanitized/lldb-build/bin/clang-11-x86_64) :: test_step_over_3_times_dwo (TestThreadAPI.ThreadAPITestCase) (test case does not fall in any category of interest for this run) runCmd: settings clear -all output:

Hide Details

runCmd: settings set symbols.enable-external-lookup false output:

Hide Details

runCmd: settings set target.auto-apply-fixits false output:

Hide Details

runCmd: settings set plugin.process.gdb-remote.packet-timeout 60 output:

Hide Details

runCmd: settings set symbols.clang-modules-cache-path "/Users/buildslave/jenkins/workspace/lldb-cmake-sanitized/lldb-build/lldb-test-build.noindex/module-cache-lldb/lldb-api" output:

Hide Details

runCmd: settings set use-color false output:

Hide Details

runCmd: setting set target.prefer-dynamic-value no-dynamic-values output:

Hide Details

runCmd: settings set target.env-vars ASAN_OPTIONS=detect_stack_use_after_return=1 DYLD_INSERT_LIBRARIES=/Users/buildslave/jenkins/workspace/lldb-cmake-sanitized/host-compiler/lib/clang/11.0.0/lib/darwin/libclang_rt.asan_osx_dynamic.dylib output:

Hide Details

runCmd: breakpoint list output: Current breakpoints: 1: file = 'main2.cpp', line = 21, exact_match = 0, locations = 1 1.1: where = test_step_over_3_times_gmodules`b(int) + 22 at main2.cpp:21:17, address = test_step_over_3_times_gmodules[0x0000000100000e66], unresolved, hit count = 0

Hide Details

Hide Details

Hide Details

runCmd: thread backtrace output: * thread #1, queue = 'com.apple.main-thread', stop reason = breakpoint 1.1 * frame #0: 0x000000010863be66 test_step_over_3_times_gmodules`b(val=1) at main2.cpp:21:17 frame #1: 0x000000010863be0d test_step_over_3_times_gmodules`a(val=1) at main2.cpp:11:16 frame #2: 0x000000010863bee0 test_step_over_3_times_gmodules`main(argc=1, argv=0x00007ffee75c4458) at main2.cpp:36:14 frame #3: 0x00007fff777b3085 libdyld.dylib`start + 1 frame #4: 0x00007fff777b3085 libdyld.dylib`start + 1

Hide Details

Hide Details

runCmd: thread backtrace output: * thread #1, queue = 'com.apple.main-thread', stop reason = step over * frame #0: 0x000000010863be9d test_step_over_3_times_gmodules`b(val=1) at main2.cpp:26:12 frame #1: 0x000000010863be0d test_step_over_3_times_gmodules`a(val=1) at main2.cpp:11:16 frame #2: 0x000000010863bee0 test_step_over_3_times_gmodules`main(argc=1, argv=0x00007ffee75c4458) at main2.cpp:36:14 frame #3: 0x00007fff777b3085 libdyld.dylib`start + 1 frame #4: 0x00007fff777b3085 libdyld.dylib`start + 1

Hide Details

Hide Details

<bound method SBProcess.Kill of <lldb.SBProcess; proxy of <Swig Object of type 'lldb::SBProcess *' at 0x109f1fea0> >>: success

Hide Details

PASS: LLDB (/Users/buildslave/jenkins/workspace/lldb-cmake-sanitized/lldb-build/bin/clang-11-x86_64) :: test_step_over_3_times_gmodules (TestThreadAPI.ThreadAPITestCase) Restore dir to: /Users/buildslave/jenkins/workspace/lldb-cmake-sanitized/lldb-build/tools/lldb/test ====================================================================== ERROR: test_step_out_of_malloc_into_function_b_dsym (TestThreadAPI.ThreadAPITestCase) Test Python SBThread.StepOut() API to step out of a malloc call where the call site is at function b(). ---------------------------------------------------------------------- Traceback (most recent call last): File "/Users/buildslave/jenkins/workspace/lldb-cmake-sanitized/llvm-project/lldb/packages/Python/lldbsuite/test/lldbtest.py", line 1751, in test_method return attrvalue(self) File "/Users/buildslave/jenkins/workspace/lldb-cmake-sanitized/llvm-project/lldb/packages/Python/lldbsuite/test/decorators.py", line 110, in wrapper func(*args, **kwargs) File "/Users/buildslave/jenkins/workspace/lldb-cmake-sanitized/llvm-project/lldb/packages/Python/lldbsuite/test/decorators.py", line 110, in wrapper func(*args, **kwargs) File "/Users/buildslave/jenkins/workspace/lldb-cmake-sanitized/llvm-project/lldb/packages/Python/lldbsuite/test/decorators.py", line 110, in wrapper func(*args, **kwargs) File "/Users/buildslave/jenkins/workspace/lldb-cmake-sanitized/llvm-project/lldb/test/API/python_api/thread/TestThreadAPI.py", line 50, in test_step_out_of_malloc_into_function_b self.step_out_of_malloc_into_function_b(self.exe_name) File "/Users/buildslave/jenkins/workspace/lldb-cmake-sanitized/llvm-project/lldb/test/API/python_api/thread/TestThreadAPI.py", line 157, in step_out_of_malloc_into_function_b thread.IsValid(), AttributeError: 'NoneType' object has no attribute 'IsValid' Config=x86_64-/Users/buildslave/jenkins/workspace/lldb-cmake-sanitized/lldb-build/bin/clang-11 ====================================================================== ERROR: test_step_out_of_malloc_into_function_b_dwarf (TestThreadAPI.ThreadAPITestCase) Test Python SBThread.StepOut() API to step out of a malloc call where the call site is at function b(). ---------------------------------------------------------------------- Traceback (most recent call last): File "/Users/buildslave/jenkins/workspace/lldb-cmake-sanitized/llvm-project/lldb/packages/Python/lldbsuite/test/lldbtest.py", line 1751, in test_method return attrvalue(self) File "/Users/buildslave/jenkins/workspace/lldb-cmake-sanitized/llvm-project/lldb/packages/Python/lldbsuite/test/decorators.py", line 110, in wrapper func(*args, **kwargs) File "/Users/buildslave/jenkins/workspace/lldb-cmake-sanitized/llvm-project/lldb/packages/Python/lldbsuite/test/decorators.py", line 110, in wrapper func(*args, **kwargs) File "/Users/buildslave/jenkins/workspace/lldb-cmake-sanitized/llvm-project/lldb/packages/Python/lldbsuite/test/decorators.py", line 110, in wrapper func(*args, **kwargs) File "/Users/buildslave/jenkins/workspace/lldb-cmake-sanitized/llvm-project/lldb/test/API/python_api/thread/TestThreadAPI.py", line 50, in test_step_out_of_malloc_into_function_b self.step_out_of_malloc_into_function_b(self.exe_name) File "/Users/buildslave/jenkins/workspace/lldb-cmake-sanitized/llvm-project/lldb/test/API/python_api/thread/TestThreadAPI.py", line 157, in step_out_of_malloc_into_function_b thread.IsValid(), AttributeError: 'NoneType' object has no attribute 'IsValid' Config=x86_64-/Users/buildslave/jenkins/workspace/lldb-cmake-sanitized/lldb-build/bin/clang-11 ====================================================================== ERROR: test_step_out_of_malloc_into_function_b_gmodules (TestThreadAPI.ThreadAPITestCase) Test Python SBThread.StepOut() API to step out of a malloc call where the call site is at function b(). ---------------------------------------------------------------------- Traceback (most recent call last): File "/Users/buildslave/jenkins/workspace/lldb-cmake-sanitized/llvm-project/lldb/packages/Python/lldbsuite/test/lldbtest.py", line 1751, in test_method return attrvalue(self) File "/Users/buildslave/jenkins/workspace/lldb-cmake-sanitized/llvm-project/lldb/packages/Python/lldbsuite/test/decorators.py", line 110, in wrapper func(*args, **kwargs) File "/Users/buildslave/jenkins/workspace/lldb-cmake-sanitized/llvm-project/lldb/packages/Python/lldbsuite/test/decorators.py", line 110, in wrapper func(*args, **kwargs) File "/Users/buildslave/jenkins/workspace/lldb-cmake-sanitized/llvm-project/lldb/packages/Python/lldbsuite/test/decorators.py", line 110, in wrapper func(*args, **kwargs) File "/Users/buildslave/jenkins/workspace/lldb-cmake-sanitized/llvm-project/lldb/test/API/python_api/thread/TestThreadAPI.py", line 50, in test_step_out_of_malloc_into_function_b self.step_out_of_malloc_into_function_b(self.exe_name) File "/Users/buildslave/jenkins/workspace/lldb-cmake-sanitized/llvm-project/lldb/test/API/python_api/thread/TestThreadAPI.py", line 157, in step_out_of_malloc_into_function_b thread.IsValid(), AttributeError: 'NoneType' object has no attribute 'IsValid' Config=x86_64-/Users/buildslave/jenkins/workspace/lldb-cmake-sanitized/lldb-build/bin/clang-11 ---------------------------------------------------------------------- Ran 20 tests in 57.549s

Hide Details

RESULT: FAILED (12 passes, 0 failures, 3 errors, 5 skipped, 0 expected failures, 0 unexpected successes)

Hide Details

--

Hide Details

******************** PASS: lldb-api :: lang/c/enum_types/TestEnumTypes.py (1908 of 1989) PASS: lldb-unit :: Utility/./UtilityTests/StringExtractorTest.GetHexBytes_OddPair (1909 of 1989) PASS: lldb-unit :: Process/gdb-remote/./ProcessGdbRemoteTests/GDBRemoteClientBaseTest.SendContinueAndWait (1910 of 1989) PASS: lldb-unit :: Utility/./UtilityTests/SerializationRountripTest.SerializeDeserializeCString (1911 of 1989) PASS: lldb-unit :: UnwindAssembly/x86/./UnwindAssemblyx86Tests/Testx86AssemblyInspectionEngine.TestSpArithx86_64Augmented (1912 of 1989) PASS: lldb-api :: functionalities/data-formatter/data-formatter-categories/TestDataFormatterCategories.py (1913 of 1989) UNSUPPORTED: lldb-api :: benchmarks/libcxxlist/TestBenchmarkLibcxxList.py (1914 of 1989) PASS: lldb-api :: commands/expression/options/TestExprOptions.py (1915 of 1989) PASS: lldb-api :: api/multiple-targets/TestMultipleTargets.py (1916 of 1989) PASS: lldb-unit :: Utility/./UtilityTests/BinaryStreamTest.PutSLEB128Zero (1917 of 1989) PASS: lldb-unit :: Utility/./UtilityTests/StringExtractorTest.GetHexU8_Underflow2 (1918 of 1989) PASS: lldb-unit :: Utility/./UtilityTests/BinaryStreamTest.PutULEB128FourBytes (1919 of 1989) PASS: lldb-unit :: Utility/./UtilityTests/ArgsTest.GetArgumentArrayRef (1920 of 1989) UNSUPPORTED: lldb-api :: commands/register/register/intel_xtended_registers/TestMPXRegisters.py (1921 of 1989) PASS: lldb-shell :: SymbolFile/DWARF/find-method.cpp (1922 of 1989) UNSUPPORTED: lldb-shell :: SymbolFile/PDB/type-quals.test (1923 of 1989) PASS: lldb-unit :: Language/Highlighting/./HighlighterTests/HighlighterTest.ClangCommas (1924 of 1989) PASS: lldb-api :: lang/objc/modules-app-update/TestClangModulesAppUpdate.py (1925 of 1989) PASS: lldb-api :: types/TestIntegerTypeExpr.py (1926 of 1989) PASS: lldb-api :: functionalities/thread/create_after_attach/TestCreateAfterAttach.py (1927 of 1989) PASS: lldb-api :: lang/c/const_variables/TestConstVariables.py (1928 of 1989) PASS: lldb-unit :: Utility/./UtilityTests/ArgsTest.ReplaceArgumentAtIndexLonger (1929 of 1989) PASS: lldb-shell :: SymbolFile/DWARF/compilercontext.ll (1930 of 1989) PASS: lldb-unit :: Utility/./UtilityTests/RangeTest.ContainsEndInclusiveInvalid (1931 of 1989) PASS: lldb-api :: lang/c/local_types/TestUseClosestType.py (1932 of 1989) PASS: lldb-unit :: Utility/./UtilityTests/FileSpecTest.EqualDotsPosixRoot (1933 of 1989) PASS: lldb-unit :: ScriptInterpreter/Python/./ScriptInterpreterPythonTests/PythonDataObjectsTest.TestObjectAttributes (1934 of 1989) PASS: lldb-shell :: BuildScript/modes.test (1935 of 1989) PASS: lldb-unit :: Symbol/./SymbolTests/TestTypeSystemClang.TestConvertAccessTypeToAccessSpecifier (1936 of 1989) PASS: lldb-unit :: Utility/./UtilityTests/LogTest.Register (1937 of 1989) PASS: lldb-shell :: Unwind/trap_frame_sym_ctx.test (1938 of 1989) PASS: lldb-unit :: Utility/./UtilityTests/StringListTest.PopBack (1939 of 1989) PASS: lldb-api :: commands/expression/unwind_expression/TestUnwindExpression.py (1940 of 1989) PASS: lldb-unit :: Expression/./ExpressionTests/CppModuleConfigurationTest.AmbiguousLibCpp (1941 of 1989) PASS: lldb-unit :: Process/minidump/./LLDBMinidumpTests/RegisterContextMinidump.ConvertMinidumpContext_x86_32 (1942 of 1989) PASS: lldb-unit :: Utility/./UtilityTests/ArchSpecTest.TestSetTriple (1943 of 1989) PASS: lldb-unit :: ObjectFile/PECOFF/./ObjectFilePECOFFTests/PECallFrameInfoTest.Basic_eh (1944 of 1989) PASS: lldb-api :: lang/cpp/breakpoint-commands/TestCPPBreakpointCommands.py (1945 of 1989) PASS: lldb-api :: commands/expression/import-std-module/vector-dbg-info-content/TestDbgInfoContentVectorFromStdModule.py (1946 of 1989) PASS: lldb-api :: functionalities/float-display/TestFloatDisplay.py (1947 of 1989) PASS: lldb-api :: functionalities/plugins/command_plugin/TestPluginCommands.py (1948 of 1989) PASS: lldb-unit :: Host/./HostTests/TaskPoolTest.TaskMap (1949 of 1989) PASS: lldb-api :: commands/breakpoint/command/list/TestBreakpointCommandList.py (1950 of 1989) PASS: lldb-api :: commands/expression/completion-in-lambda-and-unnamed-class/TestCompletionInLambdaAndUnnamedClass.py (1951 of 1989) PASS: lldb-unit :: Utility/./UtilityTests/StreamTest.PutCStringWithStringRef (1952 of 1989) PASS: lldb-api :: python_api/signals/TestSignalsAPI.py (1953 of 1989) PASS: lldb-unit :: Utility/./UtilityTests/RangeDataVector.FindEntryIndexesThatContain (1954 of 1989) PASS: lldb-unit :: Interpreter/./InterpreterTests/CompletionTest.FileCompletionAbsolute (1955 of 1989) PASS: lldb-shell :: SymbolFile/DWARF/debug_loclists-dwo.s (1956 of 1989) PASS: lldb-unit :: ObjectFile/Breakpad/./ObjectFileBreakpadTests/LineRecord.parse (1957 of 1989) PASS: lldb-api :: lang/objc/objc-optimized/TestObjcOptimized.py (1958 of 1989) PASS: lldb-unit :: Utility/./UtilityTests/FileSpecTest.Yaml (1959 of 1989) PASS: lldb-api :: sample_test/TestSampleTest.py (1960 of 1989) PASS: lldb-shell :: Commands/CommandScriptImmediateOutput/CommandScriptImmediateOutputConsole.test (1961 of 1989) PASS: lldb-api :: commands/watchpoints/watchpoint_size/TestWatchpointSizes.py (1962 of 1989) UNSUPPORTED: lldb-shell :: Register/arm-fp-read.test (1963 of 1989) UNSUPPORTED: lldb-api :: functionalities/breakpoint/breakpoint_callback_command_source/TestBreakpointCallbackCommandSource.py (1964 of 1989) PASS: lldb-api :: lang/objcxx/class-name-clash/TestNameClash.py (1965 of 1989) PASS: lldb-api :: functionalities/data-formatter/data-formatter-smart-array/TestDataFormatterSmartArray.py (1966 of 1989) PASS: lldb-unit :: Utility/./UtilityTests/RangeTest.Equal (1967 of 1989) PASS: lldb-unit :: ScriptInterpreter/Python/./ScriptInterpreterPythonTests/PythonDataObjectsTest.TestPythonBytes (1968 of 1989) PASS: lldb-api :: lang/objc/objc-struct-argument/TestObjCStructArgument.py (1969 of 1989) PASS: lldb-unit :: Expression/./ExpressionTests/CppModuleConfigurationTest.UnrelatedLibrary (1970 of 1989) PASS: lldb-api :: lang/objc/foundation/TestObjCMethods.py (1971 of 1989) UNSUPPORTED: lldb-shell :: Register/x86-zmm-read.test (1972 of 1989) FAIL: lldb-api :: functionalities/ptr_refs/TestPtrRefs.py (1973 of 1989) ******************** TEST 'lldb-api :: functionalities/ptr_refs/TestPtrRefs.py' FAILED ******************** Script: -- /usr/local/bin/python /Users/buildslave/jenkins/workspace/lldb-cmake-sanitized/llvm-project/lldb/test/API/dotest.py --arch x86_64 -s /Users/buildslave/jenkins/workspace/lldb-cmake-sanitized/lldb-build/lldb-test-traces -S nm -u CXXFLAGS -u CFLAGS --codesign-identity lldb_codesign --server /Users/buildslave/jenkins/workspace/lldb-cmake-sanitized/lldb-build/./bin/debugserver --arch x86_64 --build-dir /Users/buildslave/jenkins/workspace/lldb-cmake-sanitized/lldb-build/lldb-test-build.noindex -s=/Users/buildslave/jenkins/workspace/lldb-cmake-sanitized/test/logs -t --env TERM=vt100 --env LLVM_LIBS_DIR=/Users/buildslave/jenkins/workspace/lldb-cmake-sanitized/lldb-build/./lib --inferior-env ASAN_OPTIONS=detect_stack_use_after_return=1 --inferior-env DYLD_INSERT_LIBRARIES=/Users/buildslave/jenkins/workspace/lldb-cmake-sanitized/host-compiler/lib/clang/11.0.0/lib/darwin/libclang_rt.asan_osx_dynamic.dylib --build-dir /Users/buildslave/jenkins/workspace/lldb-cmake-sanitized/lldb-build/lldb-test-build.noindex --lldb-module-cache-dir /Users/buildslave/jenkins/workspace/lldb-cmake-sanitized/lldb-build/lldb-test-build.noindex/module-cache-lldb/lldb-api --clang-module-cache-dir /Users/buildslave/jenkins/workspace/lldb-cmake-sanitized/lldb-build/lldb-test-build.noindex/module-cache-clang/lldb-api --executable /Users/buildslave/jenkins/workspace/lldb-cmake-sanitized/lldb-build/./bin/lldb --compiler /Users/buildslave/jenkins/workspace/lldb-cmake-sanitized/lldb-build/./bin/clang --dsymutil /Users/buildslave/jenkins/workspace/lldb-cmake-sanitized/lldb-build/./bin/dsymutil --filecheck /Users/buildslave/jenkins/workspace/lldb-cmake-sanitized/lldb-build/./bin/FileCheck --lldb-libs-dir /Users/buildslave/jenkins/workspace/lldb-cmake-sanitized/lldb-build/./lib /Users/buildslave/jenkins/workspace/lldb-cmake-sanitized/llvm-project/lldb/test/API/functionalities/ptr_refs -p TestPtrRefs.py -- Exit Code: 1

Hide Details

Command Output (stdout): -- lldb version 11.0.99 clang revision 8fb7cfcea97af440830d256cc18ccd978f218e1d llvm revision 8fb7cfcea97af440830d256cc18ccd978f218e1d "crashlog" and "save_crashlog" command installed, use the "--help" option for detailed help "malloc_info", "ptr_refs", "cstr_refs", "find_variable", and "objc_refs" commands have been installed, use the "--help" options on these commands for detailed help. LLDB library dir: /Users/buildslave/jenkins/workspace/lldb-cmake-sanitized/lldb-build/bin LLDB import library dir: /Users/buildslave/jenkins/workspace/lldb-cmake-sanitized/lldb-build/./lib libstdcxx tests will not be run because: Don't know how to build with libstdcxx on macosx Skipping following debug info categories: ['dwo'] 0x00007ffee7120478: stack in frame #0 of thread #1: tid 0x3d7086 in variable at 0x7ffee7120478: (const char *) my_ptr = 0x00006020000000b0 "hello" 0x00007ffee7120410: stack (red zone)

Hide Details

-- Command Output (stderr): -- error: 'ptr_refs' is not a valid command. error: 'ptr_refs' is not a valid command.

Hide Details

Session logs for test failures/errors/unexpected successes will go into directory '/Users/buildslave/jenkins/workspace/lldb-cmake-sanitized/test/logs' Command invoked: /Users/buildslave/jenkins/workspace/lldb-cmake-sanitized/llvm-project/lldb/test/API/dotest.py --arch x86_64 -s /Users/buildslave/jenkins/workspace/lldb-cmake-sanitized/lldb-build/lldb-test-traces -S nm -u CXXFLAGS -u CFLAGS --codesign-identity lldb_codesign --server /Users/buildslave/jenkins/workspace/lldb-cmake-sanitized/lldb-build/./bin/debugserver --arch x86_64 --build-dir /Users/buildslave/jenkins/workspace/lldb-cmake-sanitized/lldb-build/lldb-test-build.noindex -s=/Users/buildslave/jenkins/workspace/lldb-cmake-sanitized/test/logs -t --env TERM=vt100 --env LLVM_LIBS_DIR=/Users/buildslave/jenkins/workspace/lldb-cmake-sanitized/lldb-build/./lib --inferior-env ASAN_OPTIONS=detect_stack_use_after_return=1 --inferior-env DYLD_INSERT_LIBRARIES=/Users/buildslave/jenkins/workspace/lldb-cmake-sanitized/host-compiler/lib/clang/11.0.0/lib/darwin/libclang_rt.asan_osx_dynamic.dylib --build-dir /Users/buildslave/jenkins/workspace/lldb-cmake-sanitized/lldb-build/lldb-test-build.noindex --lldb-module-cache-dir /Users/buildslave/jenkins/workspace/lldb-cmake-sanitized/lldb-build/lldb-test-build.noindex/module-cache-lldb/lldb-api --clang-module-cache-dir /Users/buildslave/jenkins/workspace/lldb-cmake-sanitized/lldb-build/lldb-test-build.noindex/module-cache-clang/lldb-api --executable /Users/buildslave/jenkins/workspace/lldb-cmake-sanitized/lldb-build/./bin/lldb --compiler /Users/buildslave/jenkins/workspace/lldb-cmake-sanitized/lldb-build/./bin/clang --dsymutil /Users/buildslave/jenkins/workspace/lldb-cmake-sanitized/lldb-build/./bin/dsymutil --filecheck /Users/buildslave/jenkins/workspace/lldb-cmake-sanitized/lldb-build/./bin/FileCheck --lldb-libs-dir /Users/buildslave/jenkins/workspace/lldb-cmake-sanitized/lldb-build/./lib /Users/buildslave/jenkins/workspace/lldb-cmake-sanitized/llvm-project/lldb/test/API/functionalities/ptr_refs -p TestPtrRefs.py Change dir to: /Users/buildslave/jenkins/workspace/lldb-cmake-sanitized/llvm-project/lldb/test/API/functionalities/ptr_refs runCmd: settings clear -all output:

Hide Details

runCmd: settings set symbols.enable-external-lookup false output:

Hide Details

runCmd: settings set target.auto-apply-fixits false output:

Hide Details

runCmd: settings set plugin.process.gdb-remote.packet-timeout 60 output:

Hide Details

runCmd: settings set symbols.clang-modules-cache-path "/Users/buildslave/jenkins/workspace/lldb-cmake-sanitized/lldb-build/lldb-test-build.noindex/module-cache-lldb/lldb-api" output:

Hide Details

runCmd: settings set use-color false output:

Hide Details

runCmd: setting set target.prefer-dynamic-value no-dynamic-values output:

Hide Details

runCmd: settings set target.env-vars ASAN_OPTIONS=detect_stack_use_after_return=1 DYLD_INSERT_LIBRARIES=/Users/buildslave/jenkins/workspace/lldb-cmake-sanitized/host-compiler/lib/clang/11.0.0/lib/darwin/libclang_rt.asan_osx_dynamic.dylib output:

Hide Details

runCmd: script import lldb.macosx.heap output: "crashlog" and "save_crashlog" command installed, use the "--help" option for detailed help "malloc_info", "ptr_refs", "cstr_refs", "find_variable", and "objc_refs" commands have been installed, use the "--help" options on these commands for detailed help.

Hide Details

Hide Details

runCmd: ptr_refs my_ptr output: 0x00007ffee7120478: stack in frame #0 of thread #1: tid 0x3d7086 in variable at 0x7ffee7120478: (const char *) my_ptr = 0x00006020000000b0 "hello" 0x00007ffee7120410: stack (red zone)

Hide Details

Hide Details

Expecting sub string: malloc Not matched

Hide Details

FAIL: LLDB (/Users/buildslave/jenkins/workspace/lldb-cmake-sanitized/lldb-build/bin/clang-11-x86_64) :: test_ptr_refs_dsym (TestPtrRefs.TestPtrRefs) <bound method SBProcess.Kill of <lldb.SBProcess; proxy of <Swig Object of type 'lldb::SBProcess *' at 0x10b792960> >>: success

Hide Details

runCmd: settings clear -all output:

Hide Details

runCmd: settings set symbols.enable-external-lookup false output:

Hide Details

runCmd: settings set target.auto-apply-fixits false output:

Hide Details

runCmd: settings set plugin.process.gdb-remote.packet-timeout 60 output:

Hide Details

runCmd: settings set symbols.clang-modules-cache-path "/Users/buildslave/jenkins/workspace/lldb-cmake-sanitized/lldb-build/lldb-test-build.noindex/module-cache-lldb/lldb-api" output:

Hide Details

runCmd: settings set use-color false output:

Hide Details

runCmd: setting set target.prefer-dynamic-value no-dynamic-values output:

Hide Details

runCmd: settings set target.env-vars ASAN_OPTIONS=detect_stack_use_after_return=1 DYLD_INSERT_LIBRARIES=/Users/buildslave/jenkins/workspace/lldb-cmake-sanitized/host-compiler/lib/clang/11.0.0/lib/darwin/libclang_rt.asan_osx_dynamic.dylib output:

Hide Details

runCmd: script import lldb.macosx.heap output:

Hide Details

runCmd: ptr_refs my_ptr runCmd failed! error: 'ptr_refs' is not a valid command.

Hide Details

Hide Details

XFAIL: LLDB (/Users/buildslave/jenkins/workspace/lldb-cmake-sanitized/lldb-build/bin/clang-11-x86_64) :: test_ptr_refs_dwarf (TestPtrRefs.TestPtrRefs) <bound method SBProcess.Kill of <lldb.SBProcess; proxy of <Swig Object of type 'lldb::SBProcess *' at 0x10ab8ba50> >>: success

Hide Details

UNSUPPORTED: LLDB (/Users/buildslave/jenkins/workspace/lldb-cmake-sanitized/lldb-build/bin/clang-11-x86_64) :: test_ptr_refs_dwo (TestPtrRefs.TestPtrRefs) (test case does not fall in any category of interest for this run) runCmd: settings clear -all output:

Hide Details

runCmd: settings set symbols.enable-external-lookup false output:

Hide Details

runCmd: settings set target.auto-apply-fixits false output:

Hide Details

runCmd: settings set plugin.process.gdb-remote.packet-timeout 60 output:

Hide Details

runCmd: settings set symbols.clang-modules-cache-path "/Users/buildslave/jenkins/workspace/lldb-cmake-sanitized/lldb-build/lldb-test-build.noindex/module-cache-lldb/lldb-api" output:

Hide Details

runCmd: settings set use-color false output:

Hide Details

runCmd: setting set target.prefer-dynamic-value no-dynamic-values output:

Hide Details

runCmd: settings set target.env-vars ASAN_OPTIONS=detect_stack_use_after_return=1 DYLD_INSERT_LIBRARIES=/Users/buildslave/jenkins/workspace/lldb-cmake-sanitized/host-compiler/lib/clang/11.0.0/lib/darwin/libclang_rt.asan_osx_dynamic.dylib output:

Hide Details

runCmd: script import lldb.macosx.heap output:

Hide Details

runCmd: ptr_refs my_ptr runCmd failed! error: 'ptr_refs' is not a valid command.

Hide Details

Hide Details

XFAIL: LLDB (/Users/buildslave/jenkins/workspace/lldb-cmake-sanitized/lldb-build/bin/clang-11-x86_64) :: test_ptr_refs_gmodules (TestPtrRefs.TestPtrRefs) <bound method SBProcess.Kill of <lldb.SBProcess; proxy of <Swig Object of type 'lldb::SBProcess *' at 0x10b7922a0> >>: success

Hide Details

Restore dir to: /Users/buildslave/jenkins/workspace/lldb-cmake-sanitized/lldb-build/tools/lldb/test ====================================================================== FAIL: test_ptr_refs_dsym (TestPtrRefs.TestPtrRefs) Test format string functionality. ---------------------------------------------------------------------- Traceback (most recent call last): File "/Users/buildslave/jenkins/workspace/lldb-cmake-sanitized/llvm-project/lldb/packages/Python/lldbsuite/test/lldbtest.py", line 1751, in test_method return attrvalue(self) File "/Users/buildslave/jenkins/workspace/lldb-cmake-sanitized/llvm-project/lldb/packages/Python/lldbsuite/test/decorators.py", line 110, in wrapper func(*args, **kwargs) File "/Users/buildslave/jenkins/workspace/lldb-cmake-sanitized/llvm-project/lldb/test/API/functionalities/ptr_refs/TestPtrRefs.py", line 47, in test_ptr_refs self.expect("ptr_refs my_ptr", substrs=["malloc", "stack"]) File "/Users/buildslave/jenkins/workspace/lldb-cmake-sanitized/llvm-project/lldb/packages/Python/lldbsuite/test/lldbtest.py", line 2391, in expect if msg else EXP_MSG(str, output, exe)) AssertionError: False is not True : 'ptr_refs my_ptr' returns expected result, got '0x00007ffee7120478: stack in frame #0 of thread #1: tid 0x3d7086 in variable at 0x7ffee7120478: (const char *) my_ptr = 0x00006020000000b0 "hello" 0x00007ffee7120410: stack (red zone)' Config=x86_64-/Users/buildslave/jenkins/workspace/lldb-cmake-sanitized/lldb-build/bin/clang-11 ---------------------------------------------------------------------- Ran 4 tests in 12.313s

Hide Details

RESULT: FAILED (0 passes, 1 failures, 0 errors, 1 skipped, 2 expected failures, 0 unexpected successes)

Hide Details

--

Hide Details

******************** PASS: lldb-shell :: SymbolFile/DWARF/debug-types-address-ranges.s (1974 of 1989) PASS: lldb-unit :: Utility/./UtilityTests/TildeExpressionResolver.ResolveFullPath (1975 of 1989) PASS: lldb-unit :: Utility/./UtilityTests/EventTest.DumpEventDataBytes (1976 of 1989) UNSUPPORTED: lldb-shell :: SymbolFile/PDB/vbases.test (1977 of 1989) UNSUPPORTED: lldb-shell :: ScriptInterpreter/Lua/convenience_variables.test (1978 of 1989) PASS: lldb-unit :: Utility/./UtilityTests/StringListTest.SplitIntoLinesSingleTrailingCR (1979 of 1989) PASS: lldb-unit :: Interpreter/./InterpreterTests/CompletionTest.DirCompletionAbsolute (1980 of 1989) XFAIL: lldb-shell :: Register/x86-64-write.test (1981 of 1989) UNSUPPORTED: lldb-shell :: SymbolFile/PDB/compilands.test (1982 of 1989) PASS: lldb-unit :: Utility/./UtilityTests/StringLexerTest.HasAtLeast (1983 of 1989) PASS: lldb-api :: lang/objc/objc-checker/TestObjCCheckers.py (1984 of 1989) PASS: lldb-unit :: Editline/./EditlineTests/EditlineTestFixture.EditlineReceivesMultiLineText (1985 of 1989) PASS: lldb-api :: functionalities/avoids-fd-leak/TestFdLeak.py (1986 of 1989) PASS: lldb-api :: lang/cpp/multiple-inheritance/TestCppMultipleInheritance.py (1987 of 1989) PASS: lldb-api :: python_api/exprpath_synthetic/TestExprPathSynthetic.py (1988 of 1989) PASS: lldb-api :: lang/objc/foundation/TestRuntimeTypes.py (1989 of 1989)

Hide Details

Testing Time: 6702.02s ******************** Failing Tests (3): lldb-api :: lang/objc/ptr_refs/TestPtrRefsObjC.py lldb-api :: python_api/thread/TestThreadAPI.py lldb-api :: functionalities/ptr_refs/TestPtrRefs.py

Hide Details

Hide Details

Slowest Tests: -------------------------------------------------------------------------- 142.13s: lldb-api :: lang/objc/conflicting-definition/TestConflictingDefinition.py 143.47s: lldb-api :: api/check_public_api_headers/TestPublicAPIHeaders.py 145.23s: lldb-api :: commands/settings/TestSettings.py 147.57s: lldb-api :: functionalities/data-formatter/ostypeformatting/TestFormattersOsType.py 170.51s: lldb-api :: types/TestShortTypeExpr.py 187.22s: lldb-api :: types/TestLongTypesExpr.py 192.86s: lldb-api :: lang/objc/foundation/TestObjCMethodsString.py 199.58s: lldb-api :: lang/objc/objc-new-syntax/TestObjCNewSyntaxArray.py 200.38s: lldb-api :: lang/objc/objc-new-syntax/TestObjCNewSyntaxDictionary.py 227.48s: lldb-api :: lang/objc/exceptions/TestObjCExceptions.py 234.21s: lldb-api :: lang/objc/foundation/TestObjCMethodsNSError.py 234.44s: lldb-api :: lang/objc/real-definition/TestRealDefinition.py 242.72s: lldb-api :: lang/cpp/namespace/TestNamespaceLookup.py 261.09s: lldb-api :: lang/objc/objc-new-syntax/TestObjCNewSyntaxLiteral.py 277.74s: lldb-api :: tools/lldb-server/TestGdbRemoteThreadsInStopReply.py 360.68s: lldb-api :: lang/objc/hidden-ivars/TestHiddenIvars.py 360.94s: lldb-api :: lang/objc/foundation/TestObjCMethods.py 420.82s: lldb-api :: api/multithreaded/TestMultithreaded.py 426.70s: lldb-api :: lang/cpp/enum_types/TestCPP11EnumTypes.py 510.26s: lldb-api :: tools/lldb-server/TestLldbGdbServer.py

Hide Details

Tests Times: -------------------------------------------------------------------------- [ Range ] :: [ Percentage ] :: [ Count ] -------------------------------------------------------------------------- [ 0s, 50s) :: [************************************ ] :: [1819/1989] [ 50s,100s) :: [** ] :: [ 123/1989] [100s,150s) :: [ ] :: [ 27/1989] [150s,200s) :: [ ] :: [ 5/1989] [200s,250s) :: [ ] :: [ 5/1989] [250s,300s) :: [ ] :: [ 5/1989] [300s,350s) :: [ ] :: [ 0/1989] [350s,400s) :: [ ] :: [ 2/1989] [400s,450s) :: [ ] :: [ 0/1989] [450s,500s) :: [ ] :: [ 2/1989] [500s,550s) :: [ ] :: [ 1/1989] Expected Passes : 1812 Expected Failures : 6 Unsupported Tests : 168 Unexpected Failures: 3 FAILED: tools/lldb/test/CMakeFiles/check-lldb-lit cd /Users/buildslave/jenkins/workspace/lldb-cmake-sanitized/lldb-build/tools/lldb/test && /usr/local/bin/python /Users/buildslave/jenkins/workspace/lldb-cmake-sanitized/lldb-build/./bin/llvm-lit -v --time-tests --shuffle --xunit-xml-output=/Users/buildslave/jenkins/workspace/lldb-cmake-sanitized/test/results.xml -v -j 4 --timeout 1200 /Users/buildslave/jenkins/workspace/lldb-cmake-sanitized/lldb-build/tools/lldb/test ninja: build stopped: subcommand failed. Command failed: Command '['/usr/bin/env', 'TERM=vt100', '/usr/local/bin/ninja', '-v', 'check-lldb']' returned non-zero exit status 1. Command: ['/usr/bin/env', 'TERM=vt100', '/usr/local/bin/ninja', '-v', 'check-lldb'] [Pipeline] } [Pipeline] // timeout [Pipeline] } [Pipeline] // stage [Pipeline] stage [Pipeline] { (Declarative: Post Actions) [Pipeline] scanForIssues [Clang (LLVM based)] Sleeping for 5 seconds due to JENKINS-32191... [Clang (LLVM based)] Parsing console log (workspace: '/Users/buildslave/jenkins/workspace/lldb-cmake-sanitized') [Clang (LLVM based)] Successfully parsed console log [Clang (LLVM based)] -> found 8 issues (skipped 8 duplicates) [Clang (LLVM based)] Post processing issues on 'green-dragon-23' with source code encoding 'UTF-8' [Clang (LLVM based)] Creating SCM blamer to obtain author and commit information for affected files [Clang (LLVM based)] Creating SCM miner to obtain statistics for affected repository files [Clang (LLVM based)] Resolving file names for all issues in source directory '/Users/buildslave/jenkins/workspace/lldb-cmake-sanitized' [Clang (LLVM based)] -> resolved paths in source directory (6 found, 0 not found) [Clang (LLVM based)] Resolving module names from module definitions (build.xml, pom.xml, or Manifest.mf files) [Clang (LLVM based)] -> resolved module names for 8 issues [Clang (LLVM based)] Resolving package names (or namespaces) by parsing the affected files [Clang (LLVM based)] -> resolved package names of 6 affected files [Clang (LLVM based)] No filter has been set, publishing all 8 issues [Clang (LLVM based)] Creating fingerprints for all affected code blocks to track issues over different builds [Clang (LLVM based)] -> created fingerprints for 8 issues (skipped 0 issues) [Clang (LLVM based)] Copying affected files to Jenkins' build folder '/Users/Shared/Jenkins/Home/jobs/lldb-cmake-sanitized/builds/1203/files-with-issues' [Clang (LLVM based)] -> 6 copied, 0 not in workspace, 0 not-found, 0 with I/O error [Pipeline] junit Recording test results [Pipeline] } [Pipeline] // stage [Pipeline] } [Pipeline] // withEnv [Pipeline] } [Pipeline] // node [Pipeline] End of Pipeline ERROR: script returned exit code 1 Finished: FAILURE