FailedConsole Output

Skipping 8,097 KB.. Full Log
utput: 

Hide Details

runCmd: settings set target.env-vars ASAN_OPTIONS=detect_stack_use_after_return=1 DYLD_INSERT_LIBRARIES=/Users/buildslave/jenkins/workspace/lldb-cmake-sanitized/host-compiler/lib/clang/11.0.0/lib/darwin/libclang_rt.asan_osx_dynamic.dylib output:

Hide Details

runCmd: breakpoint list output: Current breakpoints: 1: file = 'main.cpp', line = 17, exact_match = 0, locations = 1 1.1: where = a.out`main + 115 at main.cpp:17:5, address = a.out[0x0000000100000f53], unresolved, hit count = 0

Hide Details

Hide Details

Hide Details

runCmd: process status output: Process 38161 stopped * thread #1, queue = 'com.apple.main-thread', stop reason = breakpoint 1.1 frame #0: 0x000000010f2c5f53 a.out`main(argc=1, argv=0x00007ffee093a498) at main.cpp:17:5 14 15 printf("after the loop: my_char='%c'\n", my_char); // 'my_char' should print out as 'x'. 16 -> 17 return 0; // Set break point at this line and check variable 'my_char'. ^ 18 }

Hide Details

Hide Details

<bound method SBProcess.Kill of <lldb.SBProcess; proxy of <Swig Object of type 'lldb::SBProcess *' at 0x10e4b3a50> >>: success

Hide Details

PASS: LLDB (/Users/buildslave/jenkins/workspace/lldb-cmake-sanitized/lldb-build/bin/clang-11-x86_64) :: test_get_process_dwarf (TestThreadAPI.ThreadAPITestCase) UNSUPPORTED: LLDB (/Users/buildslave/jenkins/workspace/lldb-cmake-sanitized/lldb-build/bin/clang-11-x86_64) :: test_get_process_dwo (TestThreadAPI.ThreadAPITestCase) (test case does not fall in any category of interest for this run) runCmd: settings clear -all output:

Hide Details

runCmd: settings set symbols.enable-external-lookup false output:

Hide Details

runCmd: settings set target.auto-apply-fixits false output:

Hide Details

runCmd: settings set plugin.process.gdb-remote.packet-timeout 60 output:

Hide Details

runCmd: settings set symbols.clang-modules-cache-path "/Users/buildslave/jenkins/workspace/lldb-cmake-sanitized/lldb-build/lldb-test-build.noindex/module-cache-lldb/lldb-api" output:

Hide Details

runCmd: settings set use-color false output:

Hide Details

runCmd: setting set target.prefer-dynamic-value no-dynamic-values output:

Hide Details

runCmd: settings set target.env-vars ASAN_OPTIONS=detect_stack_use_after_return=1 DYLD_INSERT_LIBRARIES=/Users/buildslave/jenkins/workspace/lldb-cmake-sanitized/host-compiler/lib/clang/11.0.0/lib/darwin/libclang_rt.asan_osx_dynamic.dylib output:

Hide Details

runCmd: breakpoint list output: Current breakpoints: 1: file = 'main.cpp', line = 17, exact_match = 0, locations = 1 1.1: where = a.out`main + 115 at main.cpp:17:5, address = a.out[0x0000000100000f53], unresolved, hit count = 0

Hide Details

Hide Details

Hide Details

runCmd: process status output: Process 38228 stopped * thread #1, queue = 'com.apple.main-thread', stop reason = breakpoint 1.1 frame #0: 0x00000001003f9f53 a.out`main(argc=1, argv=0x00007ffeef806498) at main.cpp:17:5 14 15 printf("after the loop: my_char='%c'\n", my_char); // 'my_char' should print out as 'x'. 16 -> 17 return 0; // Set break point at this line and check variable 'my_char'. ^ 18 }

Hide Details

Hide Details

<bound method SBProcess.Kill of <lldb.SBProcess; proxy of <Swig Object of type 'lldb::SBProcess *' at 0x10e981390> >>: success

Hide Details

PASS: LLDB (/Users/buildslave/jenkins/workspace/lldb-cmake-sanitized/lldb-build/bin/clang-11-x86_64) :: test_get_process_gmodules (TestThreadAPI.ThreadAPITestCase) runCmd: settings clear -all output:

Hide Details

runCmd: settings set symbols.enable-external-lookup false output:

Hide Details

runCmd: settings set target.auto-apply-fixits false output:

Hide Details

runCmd: settings set plugin.process.gdb-remote.packet-timeout 60 output:

Hide Details

runCmd: settings set symbols.clang-modules-cache-path "/Users/buildslave/jenkins/workspace/lldb-cmake-sanitized/lldb-build/lldb-test-build.noindex/module-cache-lldb/lldb-api" output:

Hide Details

runCmd: settings set use-color false output:

Hide Details

runCmd: setting set target.prefer-dynamic-value no-dynamic-values output:

Hide Details

runCmd: settings set target.env-vars ASAN_OPTIONS=detect_stack_use_after_return=1 DYLD_INSERT_LIBRARIES=/Users/buildslave/jenkins/workspace/lldb-cmake-sanitized/host-compiler/lib/clang/11.0.0/lib/darwin/libclang_rt.asan_osx_dynamic.dylib output:

Hide Details

<bound method SBProcess.Kill of <lldb.SBProcess; proxy of <Swig Object of type 'lldb::SBProcess *' at 0x10e4b33c0> >>: success

Hide Details

PASS: LLDB (/Users/buildslave/jenkins/workspace/lldb-cmake-sanitized/lldb-build/bin/clang-11-x86_64) :: test_get_stop_description_dsym (TestThreadAPI.ThreadAPITestCase) runCmd: settings clear -all output:

Hide Details

runCmd: settings set symbols.enable-external-lookup false output:

Hide Details

runCmd: settings set target.auto-apply-fixits false output:

Hide Details

runCmd: settings set plugin.process.gdb-remote.packet-timeout 60 output:

Hide Details

runCmd: settings set symbols.clang-modules-cache-path "/Users/buildslave/jenkins/workspace/lldb-cmake-sanitized/lldb-build/lldb-test-build.noindex/module-cache-lldb/lldb-api" output:

Hide Details

runCmd: settings set use-color false output:

Hide Details

runCmd: setting set target.prefer-dynamic-value no-dynamic-values output:

Hide Details

runCmd: settings set target.env-vars ASAN_OPTIONS=detect_stack_use_after_return=1 DYLD_INSERT_LIBRARIES=/Users/buildslave/jenkins/workspace/lldb-cmake-sanitized/host-compiler/lib/clang/11.0.0/lib/darwin/libclang_rt.asan_osx_dynamic.dylib output:

Hide Details

<bound method SBProcess.Kill of <lldb.SBProcess; proxy of <Swig Object of type 'lldb::SBProcess *' at 0x10e948ea0> >>: success

Hide Details

PASS: LLDB (/Users/buildslave/jenkins/workspace/lldb-cmake-sanitized/lldb-build/bin/clang-11-x86_64) :: test_get_stop_description_dwarf (TestThreadAPI.ThreadAPITestCase) UNSUPPORTED: LLDB (/Users/buildslave/jenkins/workspace/lldb-cmake-sanitized/lldb-build/bin/clang-11-x86_64) :: test_get_stop_description_dwo (TestThreadAPI.ThreadAPITestCase) (test case does not fall in any category of interest for this run) runCmd: settings clear -all output:

Hide Details

runCmd: settings set symbols.enable-external-lookup false output:

Hide Details

runCmd: settings set target.auto-apply-fixits false output:

Hide Details

runCmd: settings set plugin.process.gdb-remote.packet-timeout 60 output:

Hide Details

runCmd: settings set symbols.clang-modules-cache-path "/Users/buildslave/jenkins/workspace/lldb-cmake-sanitized/lldb-build/lldb-test-build.noindex/module-cache-lldb/lldb-api" output:

Hide Details

runCmd: settings set use-color false output:

Hide Details

runCmd: setting set target.prefer-dynamic-value no-dynamic-values output:

Hide Details

runCmd: settings set target.env-vars ASAN_OPTIONS=detect_stack_use_after_return=1 DYLD_INSERT_LIBRARIES=/Users/buildslave/jenkins/workspace/lldb-cmake-sanitized/host-compiler/lib/clang/11.0.0/lib/darwin/libclang_rt.asan_osx_dynamic.dylib output:

Hide Details

<bound method SBProcess.Kill of <lldb.SBProcess; proxy of <Swig Object of type 'lldb::SBProcess *' at 0x10e4b3a50> >>: success

Hide Details

PASS: LLDB (/Users/buildslave/jenkins/workspace/lldb-cmake-sanitized/lldb-build/bin/clang-11-x86_64) :: test_get_stop_description_gmodules (TestThreadAPI.ThreadAPITestCase) runCmd: settings clear -all output:

Hide Details

runCmd: settings set symbols.enable-external-lookup false output:

Hide Details

runCmd: settings set target.auto-apply-fixits false output:

Hide Details

runCmd: settings set plugin.process.gdb-remote.packet-timeout 60 output:

Hide Details

runCmd: settings set symbols.clang-modules-cache-path "/Users/buildslave/jenkins/workspace/lldb-cmake-sanitized/lldb-build/lldb-test-build.noindex/module-cache-lldb/lldb-api" output:

Hide Details

runCmd: settings set use-color false output:

Hide Details

runCmd: setting set target.prefer-dynamic-value no-dynamic-values output:

Hide Details

runCmd: settings set target.env-vars ASAN_OPTIONS=detect_stack_use_after_return=1 DYLD_INSERT_LIBRARIES=/Users/buildslave/jenkins/workspace/lldb-cmake-sanitized/host-compiler/lib/clang/11.0.0/lib/darwin/libclang_rt.asan_osx_dynamic.dylib output:

Hide Details

runCmd: breakpoint list output: Current breakpoints: 1: file = 'main2.cpp', line = 21, exact_match = 0, locations = 1 1.1: where = test_run_to_address_dsym`b(int) + 22 at main2.cpp:21:17, address = test_run_to_address_dsym[0x0000000100000e66], unresolved, hit count = 0

Hide Details

Hide Details

Hide Details

runCmd: thread backtrace output: * thread #1, queue = 'com.apple.main-thread', stop reason = breakpoint 1.1 * frame #0: 0x0000000108a76e66 test_run_to_address_dsym`b(val=1) at main2.cpp:21:17 frame #1: 0x0000000108a76e0d test_run_to_address_dsym`a(val=1) at main2.cpp:11:16 frame #2: 0x0000000108a76ee0 test_run_to_address_dsym`main(argc=1, argv=0x00007ffee7189470) at main2.cpp:36:14 frame #3: 0x00007fff7d26f085 libdyld.dylib`start + 1

Hide Details

Hide Details

runCmd: breakpoint list output: Current breakpoints: 1: file = 'main2.cpp', line = 21, exact_match = 0, locations = 1 Options: disabled 1.1: where = test_run_to_address_dsym`b(int) + 22 at main2.cpp:21:17, address = 0x0000000108a76e66, unresolved, hit count = 1

Hide Details

Hide Details

Hide Details

runCmd: thread backtrace output: * thread #1, queue = 'com.apple.main-thread', stop reason = step over * frame #0: 0x0000000108a76e9d test_run_to_address_dsym`b(val=1) at main2.cpp:26:12 frame #1: 0x0000000108a76e0d test_run_to_address_dsym`a(val=1) at main2.cpp:11:16 frame #2: 0x0000000108a76ee0 test_run_to_address_dsym`main(argc=1, argv=0x00007ffee7189470) at main2.cpp:36:14 frame #3: 0x00007fff7d26f085 libdyld.dylib`start + 1

Hide Details

Hide Details

runCmd: process status output: Process 38903 stopped * thread #1, queue = 'com.apple.main-thread', stop reason = run to address: 0x0000000108a76e66 frame #0: 0x0000000108a76e66 test_run_to_address_dsym`b(val=2) at main2.cpp:21:17 18 int b(int val) 19 { 20 int rc = c(val); -> 21 void *ptr = malloc(1024); // thread step-out of malloc into function b. ^ 22 if (!ptr) 23 return -1; 24 else

Hide Details

Hide Details

<bound method SBProcess.Kill of <lldb.SBProcess; proxy of <Swig Object of type 'lldb::SBProcess *' at 0x10e981390> >>: success

Hide Details

PASS: LLDB (/Users/buildslave/jenkins/workspace/lldb-cmake-sanitized/lldb-build/bin/clang-11-x86_64) :: test_run_to_address_dsym (TestThreadAPI.ThreadAPITestCase) runCmd: settings clear -all output:

Hide Details

runCmd: settings set symbols.enable-external-lookup false output:

Hide Details

runCmd: settings set target.auto-apply-fixits false output:

Hide Details

runCmd: settings set plugin.process.gdb-remote.packet-timeout 60 output:

Hide Details

runCmd: settings set symbols.clang-modules-cache-path "/Users/buildslave/jenkins/workspace/lldb-cmake-sanitized/lldb-build/lldb-test-build.noindex/module-cache-lldb/lldb-api" output:

Hide Details

runCmd: settings set use-color false output:

Hide Details

runCmd: setting set target.prefer-dynamic-value no-dynamic-values output:

Hide Details

runCmd: settings set target.env-vars ASAN_OPTIONS=detect_stack_use_after_return=1 DYLD_INSERT_LIBRARIES=/Users/buildslave/jenkins/workspace/lldb-cmake-sanitized/host-compiler/lib/clang/11.0.0/lib/darwin/libclang_rt.asan_osx_dynamic.dylib output:

Hide Details

runCmd: breakpoint list output: Current breakpoints: 1: file = 'main2.cpp', line = 21, exact_match = 0, locations = 1 1.1: where = test_run_to_address_dwarf`b(int) + 22 at main2.cpp:21:17, address = test_run_to_address_dwarf[0x0000000100000e66], unresolved, hit count = 0

Hide Details

Hide Details

Hide Details

runCmd: thread backtrace output: * thread #1, queue = 'com.apple.main-thread', stop reason = breakpoint 1.1 * frame #0: 0x000000010663ee66 test_run_to_address_dwarf`b(val=1) at main2.cpp:21:17 frame #1: 0x000000010663ee0d test_run_to_address_dwarf`a(val=1) at main2.cpp:11:16 frame #2: 0x000000010663eee0 test_run_to_address_dwarf`main(argc=1, argv=0x00007ffee95c1470) at main2.cpp:36:14 frame #3: 0x00007fff7d26f085 libdyld.dylib`start + 1

Hide Details

Hide Details

runCmd: breakpoint list output: Current breakpoints: 1: file = 'main2.cpp', line = 21, exact_match = 0, locations = 1 Options: disabled 1.1: where = test_run_to_address_dwarf`b(int) + 22 at main2.cpp:21:17, address = 0x000000010663ee66, unresolved, hit count = 1

Hide Details

Hide Details

Hide Details

runCmd: thread backtrace output: * thread #1, queue = 'com.apple.main-thread', stop reason = step over * frame #0: 0x000000010663ee9d test_run_to_address_dwarf`b(val=1) at main2.cpp:26:12 frame #1: 0x000000010663ee0d test_run_to_address_dwarf`a(val=1) at main2.cpp:11:16 frame #2: 0x000000010663eee0 test_run_to_address_dwarf`main(argc=1, argv=0x00007ffee95c1470) at main2.cpp:36:14 frame #3: 0x00007fff7d26f085 libdyld.dylib`start + 1

Hide Details

Hide Details

runCmd: process status output: Process 39019 stopped * thread #1, queue = 'com.apple.main-thread', stop reason = run to address: 0x000000010663ee66 frame #0: 0x000000010663ee66 test_run_to_address_dwarf`b(val=2) at main2.cpp:21:17 18 int b(int val) 19 { 20 int rc = c(val); -> 21 void *ptr = malloc(1024); // thread step-out of malloc into function b. ^ 22 if (!ptr) 23 return -1; 24 else

Hide Details

Hide Details

<bound method SBProcess.Kill of <lldb.SBProcess; proxy of <Swig Object of type 'lldb::SBProcess *' at 0x10e4b33c0> >>: success

Hide Details

PASS: LLDB (/Users/buildslave/jenkins/workspace/lldb-cmake-sanitized/lldb-build/bin/clang-11-x86_64) :: test_run_to_address_dwarf (TestThreadAPI.ThreadAPITestCase) UNSUPPORTED: LLDB (/Users/buildslave/jenkins/workspace/lldb-cmake-sanitized/lldb-build/bin/clang-11-x86_64) :: test_run_to_address_dwo (TestThreadAPI.ThreadAPITestCase) (test case does not fall in any category of interest for this run) runCmd: settings clear -all output:

Hide Details

runCmd: settings set symbols.enable-external-lookup false output:

Hide Details

runCmd: settings set target.auto-apply-fixits false output:

Hide Details

runCmd: settings set plugin.process.gdb-remote.packet-timeout 60 output:

Hide Details

runCmd: settings set symbols.clang-modules-cache-path "/Users/buildslave/jenkins/workspace/lldb-cmake-sanitized/lldb-build/lldb-test-build.noindex/module-cache-lldb/lldb-api" output:

Hide Details

runCmd: settings set use-color false output:

Hide Details

runCmd: setting set target.prefer-dynamic-value no-dynamic-values output:

Hide Details

runCmd: settings set target.env-vars ASAN_OPTIONS=detect_stack_use_after_return=1 DYLD_INSERT_LIBRARIES=/Users/buildslave/jenkins/workspace/lldb-cmake-sanitized/host-compiler/lib/clang/11.0.0/lib/darwin/libclang_rt.asan_osx_dynamic.dylib output:

Hide Details

runCmd: breakpoint list output: Current breakpoints: 1: file = 'main2.cpp', line = 21, exact_match = 0, locations = 1 1.1: where = test_run_to_address_gmodules`b(int) + 22 at main2.cpp:21:17, address = test_run_to_address_gmodules[0x0000000100000e66], unresolved, hit count = 0

Hide Details

Hide Details

Hide Details

runCmd: thread backtrace output: * thread #1, queue = 'com.apple.main-thread', stop reason = breakpoint 1.1 * frame #0: 0x0000000105dcee66 test_run_to_address_gmodules`b(val=1) at main2.cpp:21:17 frame #1: 0x0000000105dcee0d test_run_to_address_gmodules`a(val=1) at main2.cpp:11:16 frame #2: 0x0000000105dceee0 test_run_to_address_gmodules`main(argc=1, argv=0x00007ffee9e31460) at main2.cpp:36:14 frame #3: 0x00007fff7d26f085 libdyld.dylib`start + 1

Hide Details

Hide Details

runCmd: breakpoint list output: Current breakpoints: 1: file = 'main2.cpp', line = 21, exact_match = 0, locations = 1 Options: disabled 1.1: where = test_run_to_address_gmodules`b(int) + 22 at main2.cpp:21:17, address = 0x0000000105dcee66, unresolved, hit count = 1

Hide Details

Hide Details

Hide Details

runCmd: thread backtrace output: * thread #1, queue = 'com.apple.main-thread', stop reason = step over * frame #0: 0x0000000105dcee9d test_run_to_address_gmodules`b(val=1) at main2.cpp:26:12 frame #1: 0x0000000105dcee0d test_run_to_address_gmodules`a(val=1) at main2.cpp:11:16 frame #2: 0x0000000105dceee0 test_run_to_address_gmodules`main(argc=1, argv=0x00007ffee9e31460) at main2.cpp:36:14 frame #3: 0x00007fff7d26f085 libdyld.dylib`start + 1

Hide Details

Hide Details

runCmd: process status output: Process 39182 stopped * thread #1, queue = 'com.apple.main-thread', stop reason = run to address: 0x0000000105dcee66 frame #0: 0x0000000105dcee66 test_run_to_address_gmodules`b(val=2) at main2.cpp:21:17 18 int b(int val) 19 { 20 int rc = c(val); -> 21 void *ptr = malloc(1024); // thread step-out of malloc into function b. ^ 22 if (!ptr) 23 return -1; 24 else

Hide Details

Hide Details

<bound method SBProcess.Kill of <lldb.SBProcess; proxy of <Swig Object of type 'lldb::SBProcess *' at 0x10e948ea0> >>: success

Hide Details

PASS: LLDB (/Users/buildslave/jenkins/workspace/lldb-cmake-sanitized/lldb-build/bin/clang-11-x86_64) :: test_run_to_address_gmodules (TestThreadAPI.ThreadAPITestCase) runCmd: settings clear -all output:

Hide Details

runCmd: settings set symbols.enable-external-lookup false output:

Hide Details

runCmd: settings set target.auto-apply-fixits false output:

Hide Details

runCmd: settings set plugin.process.gdb-remote.packet-timeout 60 output:

Hide Details

runCmd: settings set symbols.clang-modules-cache-path "/Users/buildslave/jenkins/workspace/lldb-cmake-sanitized/lldb-build/lldb-test-build.noindex/module-cache-lldb/lldb-api" output:

Hide Details

runCmd: settings set use-color false output:

Hide Details

runCmd: setting set target.prefer-dynamic-value no-dynamic-values output:

Hide Details

runCmd: settings set target.env-vars ASAN_OPTIONS=detect_stack_use_after_return=1 DYLD_INSERT_LIBRARIES=/Users/buildslave/jenkins/workspace/lldb-cmake-sanitized/host-compiler/lib/clang/11.0.0/lib/darwin/libclang_rt.asan_osx_dynamic.dylib output:

Hide Details

FAIL: LLDB (/Users/buildslave/jenkins/workspace/lldb-cmake-sanitized/lldb-build/bin/clang-11-x86_64) :: test_step_out_of_malloc_into_function_b_dsym (TestThreadAPI.ThreadAPITestCase) <bound method SBProcess.Kill of <lldb.SBProcess; proxy of <Swig Object of type 'lldb::SBProcess *' at 0x10e4b3a50> >>: success

Hide Details

runCmd: settings clear -all output:

Hide Details

runCmd: settings set symbols.enable-external-lookup false output:

Hide Details

runCmd: settings set target.auto-apply-fixits false output:

Hide Details

runCmd: settings set plugin.process.gdb-remote.packet-timeout 60 output:

Hide Details

runCmd: settings set symbols.clang-modules-cache-path "/Users/buildslave/jenkins/workspace/lldb-cmake-sanitized/lldb-build/lldb-test-build.noindex/module-cache-lldb/lldb-api" output:

Hide Details

runCmd: settings set use-color false output:

Hide Details

runCmd: setting set target.prefer-dynamic-value no-dynamic-values output:

Hide Details

runCmd: settings set target.env-vars ASAN_OPTIONS=detect_stack_use_after_return=1 DYLD_INSERT_LIBRARIES=/Users/buildslave/jenkins/workspace/lldb-cmake-sanitized/host-compiler/lib/clang/11.0.0/lib/darwin/libclang_rt.asan_osx_dynamic.dylib output:

Hide Details

FAIL: LLDB (/Users/buildslave/jenkins/workspace/lldb-cmake-sanitized/lldb-build/bin/clang-11-x86_64) :: test_step_out_of_malloc_into_function_b_dwarf (TestThreadAPI.ThreadAPITestCase) <bound method SBProcess.Kill of <lldb.SBProcess; proxy of <Swig Object of type 'lldb::SBProcess *' at 0x10e981390> >>: success

Hide Details

UNSUPPORTED: LLDB (/Users/buildslave/jenkins/workspace/lldb-cmake-sanitized/lldb-build/bin/clang-11-x86_64) :: test_step_out_of_malloc_into_function_b_dwo (TestThreadAPI.ThreadAPITestCase) (test case does not fall in any category of interest for this run) runCmd: settings clear -all output:

Hide Details

runCmd: settings set symbols.enable-external-lookup false output:

Hide Details

runCmd: settings set target.auto-apply-fixits false output:

Hide Details

runCmd: settings set plugin.process.gdb-remote.packet-timeout 60 output:

Hide Details

runCmd: settings set symbols.clang-modules-cache-path "/Users/buildslave/jenkins/workspace/lldb-cmake-sanitized/lldb-build/lldb-test-build.noindex/module-cache-lldb/lldb-api" output:

Hide Details

runCmd: settings set use-color false output:

Hide Details

runCmd: setting set target.prefer-dynamic-value no-dynamic-values output:

Hide Details

runCmd: settings set target.env-vars ASAN_OPTIONS=detect_stack_use_after_return=1 DYLD_INSERT_LIBRARIES=/Users/buildslave/jenkins/workspace/lldb-cmake-sanitized/host-compiler/lib/clang/11.0.0/lib/darwin/libclang_rt.asan_osx_dynamic.dylib output:

Hide Details

FAIL: LLDB (/Users/buildslave/jenkins/workspace/lldb-cmake-sanitized/lldb-build/bin/clang-11-x86_64) :: test_step_out_of_malloc_into_function_b_gmodules (TestThreadAPI.ThreadAPITestCase) <bound method SBProcess.Kill of <lldb.SBProcess; proxy of <Swig Object of type 'lldb::SBProcess *' at 0x10e4b3a50> >>: success

Hide Details

runCmd: settings clear -all output:

Hide Details

runCmd: settings set symbols.enable-external-lookup false output:

Hide Details

runCmd: settings set target.auto-apply-fixits false output:

Hide Details

runCmd: settings set plugin.process.gdb-remote.packet-timeout 60 output:

Hide Details

runCmd: settings set symbols.clang-modules-cache-path "/Users/buildslave/jenkins/workspace/lldb-cmake-sanitized/lldb-build/lldb-test-build.noindex/module-cache-lldb/lldb-api" output:

Hide Details

runCmd: settings set use-color false output:

Hide Details

runCmd: setting set target.prefer-dynamic-value no-dynamic-values output:

Hide Details

runCmd: settings set target.env-vars ASAN_OPTIONS=detect_stack_use_after_return=1 DYLD_INSERT_LIBRARIES=/Users/buildslave/jenkins/workspace/lldb-cmake-sanitized/host-compiler/lib/clang/11.0.0/lib/darwin/libclang_rt.asan_osx_dynamic.dylib output:

Hide Details

runCmd: breakpoint list output: Current breakpoints: 1: file = 'main2.cpp', line = 21, exact_match = 0, locations = 1 1.1: where = test_step_over_3_times_dsym`b(int) + 22 at main2.cpp:21:17, address = test_step_over_3_times_dsym[0x0000000100000e66], unresolved, hit count = 0

Hide Details

Hide Details

Hide Details

runCmd: thread backtrace output: * thread #1, queue = 'com.apple.main-thread', stop reason = breakpoint 1.1 * frame #0: 0x00000001092b1e66 test_step_over_3_times_dsym`b(val=1) at main2.cpp:21:17 frame #1: 0x00000001092b1e0d test_step_over_3_times_dsym`a(val=1) at main2.cpp:11:16 frame #2: 0x00000001092b1ee0 test_step_over_3_times_dsym`main(argc=1, argv=0x00007ffee694e468) at main2.cpp:36:14 frame #3: 0x00007fff7d26f085 libdyld.dylib`start + 1 frame #4: 0x00007fff7d26f085 libdyld.dylib`start + 1

Hide Details

Hide Details

runCmd: thread backtrace output: * thread #1, queue = 'com.apple.main-thread', stop reason = step over * frame #0: 0x00000001092b1e9d test_step_over_3_times_dsym`b(val=1) at main2.cpp:26:12 frame #1: 0x00000001092b1e0d test_step_over_3_times_dsym`a(val=1) at main2.cpp:11:16 frame #2: 0x00000001092b1ee0 test_step_over_3_times_dsym`main(argc=1, argv=0x00007ffee694e468) at main2.cpp:36:14 frame #3: 0x00007fff7d26f085 libdyld.dylib`start + 1 frame #4: 0x00007fff7d26f085 libdyld.dylib`start + 1

Hide Details

Hide Details

<bound method SBProcess.Kill of <lldb.SBProcess; proxy of <Swig Object of type 'lldb::SBProcess *' at 0x10e981390> >>: success

Hide Details

PASS: LLDB (/Users/buildslave/jenkins/workspace/lldb-cmake-sanitized/lldb-build/bin/clang-11-x86_64) :: test_step_over_3_times_dsym (TestThreadAPI.ThreadAPITestCase) runCmd: settings clear -all output:

Hide Details

runCmd: settings set symbols.enable-external-lookup false output:

Hide Details

runCmd: settings set target.auto-apply-fixits false output:

Hide Details

runCmd: settings set plugin.process.gdb-remote.packet-timeout 60 output:

Hide Details

runCmd: settings set symbols.clang-modules-cache-path "/Users/buildslave/jenkins/workspace/lldb-cmake-sanitized/lldb-build/lldb-test-build.noindex/module-cache-lldb/lldb-api" output:

Hide Details

runCmd: settings set use-color false output:

Hide Details

runCmd: setting set target.prefer-dynamic-value no-dynamic-values output:

Hide Details

runCmd: settings set target.env-vars ASAN_OPTIONS=detect_stack_use_after_return=1 DYLD_INSERT_LIBRARIES=/Users/buildslave/jenkins/workspace/lldb-cmake-sanitized/host-compiler/lib/clang/11.0.0/lib/darwin/libclang_rt.asan_osx_dynamic.dylib output:

Hide Details

runCmd: breakpoint list output: Current breakpoints: 1: file = 'main2.cpp', line = 21, exact_match = 0, locations = 1 1.1: where = test_step_over_3_times_dwarf`b(int) + 22 at main2.cpp:21:17, address = test_step_over_3_times_dwarf[0x0000000100000e66], unresolved, hit count = 0

Hide Details

Hide Details

Hide Details

runCmd: thread backtrace output: * thread #1, queue = 'com.apple.main-thread', stop reason = breakpoint 1.1 * frame #0: 0x00000001025f8e66 test_step_over_3_times_dwarf`b(val=1) at main2.cpp:21:17 frame #1: 0x00000001025f8e0d test_step_over_3_times_dwarf`a(val=1) at main2.cpp:11:16 frame #2: 0x00000001025f8ee0 test_step_over_3_times_dwarf`main(argc=1, argv=0x00007ffeed607460) at main2.cpp:36:14 frame #3: 0x00007fff7d26f085 libdyld.dylib`start + 1

Hide Details

Hide Details

runCmd: thread backtrace output: * thread #1, queue = 'com.apple.main-thread', stop reason = step over * frame #0: 0x00000001025f8e9d test_step_over_3_times_dwarf`b(val=1) at main2.cpp:26:12 frame #1: 0x00000001025f8e0d test_step_over_3_times_dwarf`a(val=1) at main2.cpp:11:16 frame #2: 0x00000001025f8ee0 test_step_over_3_times_dwarf`main(argc=1, argv=0x00007ffeed607460) at main2.cpp:36:14 frame #3: 0x00007fff7d26f085 libdyld.dylib`start + 1

Hide Details

Hide Details

<bound method SBProcess.Kill of <lldb.SBProcess; proxy of <Swig Object of type 'lldb::SBProcess *' at 0x10e4b3a50> >>: success

Hide Details

PASS: LLDB (/Users/buildslave/jenkins/workspace/lldb-cmake-sanitized/lldb-build/bin/clang-11-x86_64) :: test_step_over_3_times_dwarf (TestThreadAPI.ThreadAPITestCase) UNSUPPORTED: LLDB (/Users/buildslave/jenkins/workspace/lldb-cmake-sanitized/lldb-build/bin/clang-11-x86_64) :: test_step_over_3_times_dwo (TestThreadAPI.ThreadAPITestCase) (test case does not fall in any category of interest for this run) runCmd: settings clear -all output:

Hide Details

runCmd: settings set symbols.enable-external-lookup false output:

Hide Details

runCmd: settings set target.auto-apply-fixits false output:

Hide Details

runCmd: settings set plugin.process.gdb-remote.packet-timeout 60 output:

Hide Details

runCmd: settings set symbols.clang-modules-cache-path "/Users/buildslave/jenkins/workspace/lldb-cmake-sanitized/lldb-build/lldb-test-build.noindex/module-cache-lldb/lldb-api" output:

Hide Details

runCmd: settings set use-color false output:

Hide Details

runCmd: setting set target.prefer-dynamic-value no-dynamic-values output:

Hide Details

runCmd: settings set target.env-vars ASAN_OPTIONS=detect_stack_use_after_return=1 DYLD_INSERT_LIBRARIES=/Users/buildslave/jenkins/workspace/lldb-cmake-sanitized/host-compiler/lib/clang/11.0.0/lib/darwin/libclang_rt.asan_osx_dynamic.dylib output:

Hide Details

runCmd: breakpoint list output: Current breakpoints: 1: file = 'main2.cpp', line = 21, exact_match = 0, locations = 1 1.1: where = test_step_over_3_times_gmodules`b(int) + 22 at main2.cpp:21:17, address = test_step_over_3_times_gmodules[0x0000000100000e66], unresolved, hit count = 0

Hide Details

Hide Details

Hide Details

runCmd: thread backtrace output: * thread #1, queue = 'com.apple.main-thread', stop reason = breakpoint 1.1 * frame #0: 0x000000010a09ee66 test_step_over_3_times_gmodules`b(val=1) at main2.cpp:21:17 frame #1: 0x000000010a09ee0d test_step_over_3_times_gmodules`a(val=1) at main2.cpp:11:16 frame #2: 0x000000010a09eee0 test_step_over_3_times_gmodules`main(argc=1, argv=0x00007ffee5b61458) at main2.cpp:36:14 frame #3: 0x00007fff7d26f085 libdyld.dylib`start + 1 frame #4: 0x00007fff7d26f085 libdyld.dylib`start + 1

Hide Details

Hide Details

runCmd: thread backtrace output: * thread #1, queue = 'com.apple.main-thread', stop reason = step over * frame #0: 0x000000010a09ee9d test_step_over_3_times_gmodules`b(val=1) at main2.cpp:26:12 frame #1: 0x000000010a09ee0d test_step_over_3_times_gmodules`a(val=1) at main2.cpp:11:16 frame #2: 0x000000010a09eee0 test_step_over_3_times_gmodules`main(argc=1, argv=0x00007ffee5b61458) at main2.cpp:36:14 frame #3: 0x00007fff7d26f085 libdyld.dylib`start + 1 frame #4: 0x00007fff7d26f085 libdyld.dylib`start + 1

Hide Details

Hide Details

<bound method SBProcess.Kill of <lldb.SBProcess; proxy of <Swig Object of type 'lldb::SBProcess *' at 0x10e948ea0> >>: success

Hide Details

PASS: LLDB (/Users/buildslave/jenkins/workspace/lldb-cmake-sanitized/lldb-build/bin/clang-11-x86_64) :: test_step_over_3_times_gmodules (TestThreadAPI.ThreadAPITestCase) Restore dir to: /Users/buildslave/jenkins/workspace/lldb-cmake-sanitized/lldb-build/tools/lldb/test ====================================================================== ERROR: test_step_out_of_malloc_into_function_b_dsym (TestThreadAPI.ThreadAPITestCase) Test Python SBThread.StepOut() API to step out of a malloc call where the call site is at function b(). ---------------------------------------------------------------------- Traceback (most recent call last): File "/Users/buildslave/jenkins/workspace/lldb-cmake-sanitized/llvm-project/lldb/packages/Python/lldbsuite/test/lldbtest.py", line 1751, in test_method return attrvalue(self) File "/Users/buildslave/jenkins/workspace/lldb-cmake-sanitized/llvm-project/lldb/packages/Python/lldbsuite/test/decorators.py", line 110, in wrapper func(*args, **kwargs) File "/Users/buildslave/jenkins/workspace/lldb-cmake-sanitized/llvm-project/lldb/packages/Python/lldbsuite/test/decorators.py", line 110, in wrapper func(*args, **kwargs) File "/Users/buildslave/jenkins/workspace/lldb-cmake-sanitized/llvm-project/lldb/packages/Python/lldbsuite/test/decorators.py", line 110, in wrapper func(*args, **kwargs) File "/Users/buildslave/jenkins/workspace/lldb-cmake-sanitized/llvm-project/lldb/test/API/python_api/thread/TestThreadAPI.py", line 50, in test_step_out_of_malloc_into_function_b self.step_out_of_malloc_into_function_b(self.exe_name) File "/Users/buildslave/jenkins/workspace/lldb-cmake-sanitized/llvm-project/lldb/test/API/python_api/thread/TestThreadAPI.py", line 157, in step_out_of_malloc_into_function_b thread.IsValid(), AttributeError: 'NoneType' object has no attribute 'IsValid' Config=x86_64-/Users/buildslave/jenkins/workspace/lldb-cmake-sanitized/lldb-build/bin/clang-11 ====================================================================== ERROR: test_step_out_of_malloc_into_function_b_dwarf (TestThreadAPI.ThreadAPITestCase) Test Python SBThread.StepOut() API to step out of a malloc call where the call site is at function b(). ---------------------------------------------------------------------- Traceback (most recent call last): File "/Users/buildslave/jenkins/workspace/lldb-cmake-sanitized/llvm-project/lldb/packages/Python/lldbsuite/test/lldbtest.py", line 1751, in test_method return attrvalue(self) File "/Users/buildslave/jenkins/workspace/lldb-cmake-sanitized/llvm-project/lldb/packages/Python/lldbsuite/test/decorators.py", line 110, in wrapper func(*args, **kwargs) File "/Users/buildslave/jenkins/workspace/lldb-cmake-sanitized/llvm-project/lldb/packages/Python/lldbsuite/test/decorators.py", line 110, in wrapper func(*args, **kwargs) File "/Users/buildslave/jenkins/workspace/lldb-cmake-sanitized/llvm-project/lldb/packages/Python/lldbsuite/test/decorators.py", line 110, in wrapper func(*args, **kwargs) File "/Users/buildslave/jenkins/workspace/lldb-cmake-sanitized/llvm-project/lldb/test/API/python_api/thread/TestThreadAPI.py", line 50, in test_step_out_of_malloc_into_function_b self.step_out_of_malloc_into_function_b(self.exe_name) File "/Users/buildslave/jenkins/workspace/lldb-cmake-sanitized/llvm-project/lldb/test/API/python_api/thread/TestThreadAPI.py", line 157, in step_out_of_malloc_into_function_b thread.IsValid(), AttributeError: 'NoneType' object has no attribute 'IsValid' Config=x86_64-/Users/buildslave/jenkins/workspace/lldb-cmake-sanitized/lldb-build/bin/clang-11 ====================================================================== ERROR: test_step_out_of_malloc_into_function_b_gmodules (TestThreadAPI.ThreadAPITestCase) Test Python SBThread.StepOut() API to step out of a malloc call where the call site is at function b(). ---------------------------------------------------------------------- Traceback (most recent call last): File "/Users/buildslave/jenkins/workspace/lldb-cmake-sanitized/llvm-project/lldb/packages/Python/lldbsuite/test/lldbtest.py", line 1751, in test_method return attrvalue(self) File "/Users/buildslave/jenkins/workspace/lldb-cmake-sanitized/llvm-project/lldb/packages/Python/lldbsuite/test/decorators.py", line 110, in wrapper func(*args, **kwargs) File "/Users/buildslave/jenkins/workspace/lldb-cmake-sanitized/llvm-project/lldb/packages/Python/lldbsuite/test/decorators.py", line 110, in wrapper func(*args, **kwargs) File "/Users/buildslave/jenkins/workspace/lldb-cmake-sanitized/llvm-project/lldb/packages/Python/lldbsuite/test/decorators.py", line 110, in wrapper func(*args, **kwargs) File "/Users/buildslave/jenkins/workspace/lldb-cmake-sanitized/llvm-project/lldb/test/API/python_api/thread/TestThreadAPI.py", line 50, in test_step_out_of_malloc_into_function_b self.step_out_of_malloc_into_function_b(self.exe_name) File "/Users/buildslave/jenkins/workspace/lldb-cmake-sanitized/llvm-project/lldb/test/API/python_api/thread/TestThreadAPI.py", line 157, in step_out_of_malloc_into_function_b thread.IsValid(), AttributeError: 'NoneType' object has no attribute 'IsValid' Config=x86_64-/Users/buildslave/jenkins/workspace/lldb-cmake-sanitized/lldb-build/bin/clang-11 ---------------------------------------------------------------------- Ran 20 tests in 42.028s

Hide Details

RESULT: FAILED (12 passes, 0 failures, 3 errors, 5 skipped, 0 expected failures, 0 unexpected successes)

Hide Details

--

Hide Details

******************** PASS: lldb-shell :: Register/x86-64-ymm-read.test (929 of 1995) PASS: lldb-unit :: Utility/./UtilityTests/RecordReplayTest.InstrumentedBarRef (930 of 1995) PASS: lldb-api :: functionalities/thread/concurrent_events/TestConcurrentDelayedCrashWithBreakpointSignal.py (931 of 1995) PASS: lldb-api :: functionalities/data-formatter/data-formatter-disabling/TestDataFormatterDisabling.py (932 of 1995) PASS: lldb-api :: commands/expression/import-std-module/forward_list-dbg-info-content/TestDbgInfoContentForwardListFromStdModule.py (933 of 1995) PASS: lldb-shell :: Minidump/disassemble-no-module.yaml (934 of 1995) PASS: lldb-unit :: Expression/./ExpressionTests/DiagnosticManagerTest.GetStringPreserveOrder (935 of 1995) PASS: lldb-unit :: Utility/./UtilityTests/FileSpecTest.EqualDotsPosixRoot (936 of 1995) PASS: lldb-unit :: Expression/./ExpressionTests/CppModuleConfigurationTest.LinuxLocalLibCpp (937 of 1995) PASS: lldb-api :: lang/cpp/global_variables/TestCPPGlobalVariables.py (938 of 1995) PASS: lldb-unit :: Utility/./UtilityTests/ArgsTest.TestOverwriteArgs (939 of 1995) PASS: lldb-api :: functionalities/data-formatter/stringprinter/TestStringPrinter.py (940 of 1995) UNSUPPORTED: lldb-api :: lang/objc/foundation/TestFoundationDisassembly.py (941 of 1995) UNSUPPORTED: lldb-api :: tools/lldb-server/TestGdbRemoteAuxvSupport.py (942 of 1995) PASS: lldb-shell :: Driver/TestConvenienceVariables.test (943 of 1995) PASS: lldb-api :: commands/expression/po_verbosity/TestPoVerbosity.py (944 of 1995) PASS: lldb-api :: functionalities/breakpoint/breakpoint_conditions/TestBreakpointConditions.py (945 of 1995) PASS: lldb-shell :: Breakpoint/debug_addrx.test (946 of 1995) PASS: lldb-shell :: SymbolFile/DWARF/debug-types-signature-loop.s (947 of 1995) PASS: lldb-unit :: Utility/./UtilityTests/VMRange.ContainsRange (948 of 1995) PASS: lldb-api :: commands/expression/context-object/TestContextObject.py (949 of 1995) PASS: lldb-api :: functionalities/data-formatter/cstring-utf8-summary/TestCstringUnicode.py (950 of 1995) PASS: lldb-api :: commands/expression/invalid-args/TestInvalidArgsExpression.py (951 of 1995) PASS: lldb-api :: macosx/load-kext/TestLoadKext.py (952 of 1995) PASS: lldb-unit :: Utility/./UtilityTests/ArgsTest.ReplaceArgumentAtIndexLonger (953 of 1995) UNSUPPORTED: lldb-shell :: ObjectFile/PECOFF/disassemble-thumb.yaml (954 of 1995) PASS: lldb-api :: functionalities/thread/concurrent_events/TestConcurrentBreakpointOneDelayBreakpointThreads.py (955 of 1995) PASS: lldb-api :: lang/c/blocks/TestBlocks.py (956 of 1995) PASS: lldb-api :: functionalities/breakpoint/address_breakpoints/TestBadAddressBreakpoints.py (957 of 1995) PASS: lldb-unit :: UnwindAssembly/x86/./UnwindAssemblyx86Tests/Testx86AssemblyInspectionEngine.TestPushECX (958 of 1995) PASS: lldb-api :: functionalities/backticks/TestBackticksWithoutATarget.py (959 of 1995) PASS: lldb-unit :: Utility/./UtilityTests/DataExtractorTest.GetMaxU64_unchecked (960 of 1995) PASS: lldb-api :: tools/lldb-vscode/console/TestVSCode_console.py (961 of 1995) PASS: lldb-unit :: Symbol/./SymbolTests/TestTypeSystemClang.TestGetEnumIntegerTypeBasicTypes (962 of 1995) PASS: lldb-unit :: Utility/./UtilityTests/StructuredDataTest.ParseJSONFromFile (963 of 1995) PASS: lldb-api :: lang/objc/objc++/TestObjCXX.py (964 of 1995) PASS: lldb-unit :: Expression/./ExpressionTests/CppModuleConfigurationTest.AmbiguousCLib (965 of 1995) PASS: lldb-unit :: Utility/./UtilityTests/UUIDTest.Validity (966 of 1995) PASS: lldb-api :: python_api/frame/get-variables/TestGetVariables.py (967 of 1995) PASS: lldb-shell :: SymbolFile/Breakpad/unwind-via-stack-cfi.test (968 of 1995) PASS: lldb-unit :: Host/./HostTests/SocketTest.UDPGetConnectURI (969 of 1995) PASS: lldb-shell :: Breakpoint/debug_rnglist_basic.test (970 of 1995) PASS: lldb-unit :: ObjectFile/ELF/./ObjectFileELFTests/ObjectFileELFTest.GetSymtab_NoSymEntryPointArmAddressClass (971 of 1995) PASS: lldb-api :: commands/platform/basic/TestPlatformCommand.py (972 of 1995) PASS: lldb-api :: commands/expression/import-std-module/vector-bool/TestVectorBoolFromStdModule.py (973 of 1995) PASS: lldb-unit :: Language/Highlighting/./HighlighterTests/HighlighterTest.ClangCursorPosAfterOtherToken (974 of 1995) PASS: lldb-unit :: UnwindAssembly/x86/./UnwindAssemblyx86Tests/Testx86AssemblyInspectionEngine.TestDisassemblyJunkBytes (975 of 1995) PASS: lldb-unit :: Symbol/./SymbolTests/TestClangASTImporter.MetadataPropagationAfterCopying (976 of 1995) PASS: lldb-unit :: UnwindAssembly/x86/./UnwindAssemblyx86Tests/Testx86AssemblyInspectionEngine.TestPushR12 (977 of 1995) PASS: lldb-api :: functionalities/data-formatter/data-formatter-objc/TestDataFormatterObjCPlain.py (978 of 1995) PASS: lldb-unit :: Utility/./UtilityTests/StreamTest.PutPtr (979 of 1995) PASS: lldb-unit :: ScriptInterpreter/Python/./ScriptInterpreterPythonTests/PythonDataObjectsTest.TestPythonBytes (980 of 1995) PASS: lldb-unit :: debugserver/./debugserverTests/RNBSocket.LoopBackListenIPv4 (981 of 1995) PASS: lldb-unit :: SymbolFile/NativePDB/./SymbolFileNativePDBTests/PDBFPOProgramToDWARFExpressionTests.UnresolvedDependentCyclicRegisterAssignmentReference (982 of 1995) PASS: lldb-unit :: Utility/./UtilityTests/UriParserTest.Empty (983 of 1995) PASS: lldb-shell :: SymbolFile/Breakpad/symtab-macho.test (984 of 1995) PASS: lldb-api :: lang/objc/rdar-11355592/TestRdar11355592.py (985 of 1995) PASS: lldb-unit :: Utility/./UtilityTests/RangeTest.ContainsEndInclusiveInvalid (986 of 1995) PASS: lldb-api :: lang/objc/hidden-ivars/TestHiddenIvars.py (987 of 1995) PASS: lldb-unit :: UnwindAssembly/x86/./UnwindAssemblyx86Tests/Testx86AssemblyInspectionEngine.TestSimple32bitFrameFunction (988 of 1995) PASS: lldb-unit :: UnwindAssembly/x86/./UnwindAssemblyx86Tests/Testx86AssemblyInspectionEngine.TestPushEBX (989 of 1995) PASS: lldb-unit :: Utility/./UtilityTests/StringListTest.GetMaxStringLengthIncreasingSize (990 of 1995) PASS: lldb-unit :: Language/Highlighting/./HighlighterTests/HighlighterTest.DefaultHighlighterWithCursor (991 of 1995) PASS: lldb-unit :: UnwindAssembly/x86/./UnwindAssemblyx86Tests/Testx86AssemblyInspectionEngine.TestPushRBP (992 of 1995) PASS: lldb-api :: functionalities/mtc/simple/TestMTCSimple.py (993 of 1995) PASS: lldb-unit :: Target/./TargetTests/StackFrameRecognizerTest.NullModuleRegex (994 of 1995) PASS: lldb-api :: commands/expression/diagnostics/TestExprDiagnostics.py (995 of 1995) UNSUPPORTED: lldb-shell :: SymbolFile/PDB/variables-locations.test (996 of 1995) PASS: lldb-api :: commands/expression/import-std-module/weak_ptr-dbg-info-content/TestDbgInfoContentWeakPtrFromStdModule.py (997 of 1995) UNSUPPORTED: lldb-api :: benchmarks/libcxxlist/TestBenchmarkLibcxxList.py (998 of 1995) PASS: lldb-api :: python_api/value/change_values/TestChangeValueAPI.py (999 of 1995) PASS: lldb-api :: functionalities/breakpoint/comp_dir_symlink/TestCompDirSymLink.py (1000 of 1995) PASS: lldb-unit :: Process/minidump/./LLDBMinidumpTests/MinidumpParserTest.GetExceptionStream (1001 of 1995) PASS: lldb-unit :: Signals/./SignalsTests/UnixSignalsTest.GetFilteredSignals (1002 of 1995) PASS: lldb-unit :: ObjectFile/ELF/./ObjectFileELFTests/ObjectFileELFTest.GetSymtab_NoSymEntryPointArmThumbAddressClass (1003 of 1995) PASS: lldb-api :: lang/cpp/incomplete-types/TestCppIncompleteTypes.py (1004 of 1995) PASS: lldb-unit :: Utility/./UtilityTests/CompletionRequest.TestCompletionOwnership (1005 of 1995) PASS: lldb-shell :: Reproducer/TestMultipleTargets.test (1006 of 1995) PASS: lldb-unit :: Utility/./UtilityTests/IndexToObjectTest.ObjectForIndex (1007 of 1995) PASS: lldb-api :: commands/expression/import-std-module/unique_ptr/TestUniquePtrFromStdModule.py (1008 of 1995) PASS: lldb-unit :: UnwindAssembly/x86/./UnwindAssemblyx86Tests/Testx86AssemblyInspectionEngine.TestSimplei386ugmented (1009 of 1995) PASS: lldb-api :: commands/watchpoints/watchpoint_commands/command/TestWatchpointCommandPython.py (1010 of 1995) PASS: lldb-shell :: Driver/TestProcessAttach.test (1011 of 1995) PASS: lldb-api :: commands/command/history/TestCommandHistory.py (1012 of 1995) PASS: lldb-unit :: Utility/./UtilityTests/SerializationRountripTest.SerializeDeserializeCStringArrayNullptrElem (1013 of 1995) PASS: lldb-api :: commands/expression/formatters/TestFormatters.py (1014 of 1995) PASS: lldb-unit :: Utility/./UtilityTests/StringExtractorTest.GetHexU8_Extra (1015 of 1995) PASS: lldb-api :: functionalities/breakpoint/debugbreak/TestDebugBreak.py (1016 of 1995) PASS: lldb-shell :: SymbolFile/DWARF/dwarf5-partial-index.cpp (1017 of 1995) PASS: lldb-unit :: Utility/./UtilityTests/ProcessInstanceInfo.DumpTable (1018 of 1995) PASS: lldb-api :: commands/frame/diagnose/inheritance/TestDiagnoseInheritance.py (1019 of 1995) PASS: lldb-unit :: Process/gdb-remote/./ProcessGdbRemoteTests/GDBRemoteClientBaseTest.SendContinueDelegateInterface (1020 of 1995) PASS: lldb-unit :: Utility/./UtilityTests/ArgsTest.TestSingleArg (1021 of 1995) PASS: lldb-api :: commands/expression/entry-bp/TestExprEntryBP.py (1022 of 1995) XFAIL: lldb-shell :: Register/x86-mm-xmm-write.test (1023 of 1995) PASS: lldb-shell :: ObjectFile/PECOFF/sections.yaml (1024 of 1995) PASS: lldb-unit :: Target/./TargetTests/ModuleCacheTest.GetAndPutStrangeHostname (1025 of 1995) PASS: lldb-unit :: Language/Highlighting/./HighlighterTests/HighlighterTest.ClangCursorOutOfBounds (1026 of 1995) PASS: lldb-unit :: Expression/./ExpressionTests/DiagnosticManagerTest.HasFixits (1027 of 1995) PASS: lldb-shell :: SymbolFile/DWARF/debug-line-basic.s (1028 of 1995) UNSUPPORTED: lldb-shell :: Register/x86-64-xmm16-read.test (1029 of 1995) UNSUPPORTED: lldb-api :: functionalities/data-formatter/data-formatter-stl/libstdcpp/iterator/TestDataFormatterStdIterator.py (1030 of 1995) UNSUPPORTED: lldb-api :: lang/cpp/static_members/TestCPPStaticMembers.py (1031 of 1995) PASS: lldb-unit :: Process/gdb-remote/./ProcessGdbRemoteTests/GDBRemoteCommunicationServerTest.SendErrorResponse_UnimplementedError (1032 of 1995) PASS: lldb-api :: functionalities/breakpoint/breakpoint_command/TestBreakpointCommand.py (1033 of 1995) PASS: lldb-unit :: debugserver/./debugserverTests/RNBSocket.AnyListen (1034 of 1995) PASS: lldb-api :: lang/objc/objc-struct-argument/TestObjCStructArgument.py (1035 of 1995) XFAIL: lldb-shell :: Register/x86-64-write.test (1036 of 1995) PASS: lldb-shell :: SymbolFile/DWARF/debug_loc.s (1037 of 1995) PASS: lldb-unit :: ScriptInterpreter/Python/./ScriptInterpreterPythonTests/PythonDataObjectsTest.TestPythonCallableCheck (1038 of 1995) PASS: lldb-api :: lang/c/strings/TestCStrings.py (1039 of 1995) PASS: lldb-api :: commands/quit/TestQuit.py (1040 of 1995) PASS: lldb-api :: functionalities/process_group/TestChangeProcessGroup.py (1041 of 1995) PASS: lldb-api :: functionalities/gdb_remote_client/TestThreadSelectionBug.py (1042 of 1995) PASS: lldb-api :: api/multiple-targets/TestMultipleTargets.py (1043 of 1995) PASS: lldb-shell :: ObjectFile/wasm/embedded-debug-sections.yaml (1044 of 1995) PASS: lldb-shell :: Driver/TestNoUseColor.test (1045 of 1995) PASS: lldb-unit :: Utility/./UtilityTests/StatusTest.ErrorConstructor (1046 of 1995) PASS: lldb-api :: functionalities/data-formatter/compactvectors/TestCompactVectors.py (1047 of 1995) PASS: lldb-unit :: Utility/./UtilityTests/ReproducerTest.SetCapture (1048 of 1995) PASS: lldb-shell :: Watchpoint/SetErrorCases.test (1049 of 1995) PASS: lldb-shell :: Minidump/breakpad-symbols.test (1050 of 1995) PASS: lldb-api :: commands/expression/save_jit_objects/TestSaveJITObjects.py (1051 of 1995) PASS: lldb-api :: lang/objc/foundation/TestObjectDescriptionAPI.py (1052 of 1995) PASS: lldb-api :: commands/expression/persistent_variables/TestPersistentVariables.py (1053 of 1995) PASS: lldb-unit :: Utility/./UtilityTests/XcodeSDKTest.ParseTest (1054 of 1995) PASS: lldb-api :: functionalities/tail_call_frames/ambiguous_tail_call_seq2/TestAmbiguousTailCallSeq2.py (1055 of 1995) PASS: lldb-shell :: ScriptInterpreter/Python/crashlog.test (1056 of 1995) PASS: lldb-unit :: Utility/./UtilityTests/StringListTest.LongestCommonPrefixNoPrefix (1057 of 1995) PASS: lldb-unit :: ScriptInterpreter/Python/./ScriptInterpreterPythonTests/PythonDataObjectsTest.TestPythonDictionaryValueEquality (1058 of 1995) PASS: lldb-unit :: Utility/./UtilityTests/StringExtractorTest.GetHexBytes_Underflow (1059 of 1995) PASS: lldb-unit :: Utility/./UtilityTests/ConstStringTest.CompareStringRef (1060 of 1995) PASS: lldb-unit :: Symbol/./SymbolTests/TestClangASTImporter.CopyDeclTagDecl (1061 of 1995) PASS: lldb-unit :: Utility/./UtilityTests/StateTest.Formatv (1062 of 1995) UNSUPPORTED: lldb-api :: tools/intel-features/intel-pt/test/TestIntelPTSimpleBinary.py (1063 of 1995) PASS: lldb-api :: commands/expression/anonymous-struct/TestCallUserAnonTypedef.py (1064 of 1995) UNSUPPORTED: lldb-api :: functionalities/darwin_log/filter/exact_match/subsystem/TestDarwinLogFilterMatchSubsystem.py (1065 of 1995) UNSUPPORTED: lldb-shell :: SymbolFile/PDB/enums-layout.test (1066 of 1995) PASS: lldb-api :: functionalities/jitloader_gdb/TestJITLoaderGDB.py (1067 of 1995) PASS: lldb-unit :: Utility/./UtilityTests/RangeTest.SlideZero (1068 of 1995) UNSUPPORTED: lldb-shell :: Reproducer/TestLuaImport.test (1069 of 1995) PASS: lldb-shell :: Settings/TestLineMarkerColor.test (1070 of 1995) PASS: lldb-shell :: ObjectFile/PECOFF/dep-modules.yaml (1071 of 1995) UNSUPPORTED: lldb-api :: functionalities/breakpoint/breakpoint_in_delayslot/TestAvoidBreakpointInDelaySlot.py (1072 of 1995) PASS: lldb-unit :: Utility/./UtilityTests/Flags.AllSet (1073 of 1995) PASS: lldb-api :: commands/platform/basic/TestPlatformPython.py (1074 of 1995) PASS: lldb-api :: lang/objc/modules-hash-mismatch/TestClangModulesHashMismatch.py (1075 of 1995) PASS: lldb-unit :: UnwindAssembly/x86/./UnwindAssemblyx86Tests/Testx86AssemblyInspectionEngine.TestSpillRegToStackViaMOVi386 (1076 of 1995) PASS: lldb-api :: commands/expression/import_builtin_fileid/TestImportBuiltinFileID.py (1077 of 1995) PASS: lldb-api :: functionalities/gdb_remote_client/TestRecognizeBreakpoint.py (1078 of 1995) PASS: lldb-api :: commands/apropos/with-process/TestAproposWithProcess.py (1079 of 1995) PASS: lldb-api :: functionalities/breakpoint/source_regexp/TestSourceRegexBreakpoints.py (1080 of 1995) PASS: lldb-api :: lang/c/step-target/TestStepTarget.py (1081 of 1995) PASS: lldb-unit :: Utility/./UtilityTests/StringListTest.GetMaxStringLengthEqualSize (1082 of 1995) PASS: lldb-shell :: SymbolFile/DWARF/find-method.cpp (1083 of 1995) PASS: lldb-api :: python_api/sblaunchinfo/TestSBLaunchInfo.py (1084 of 1995) PASS: lldb-unit :: Process/minidump/./LLDBMinidumpTests/MinidumpParserTest.GetMemoryRegionInfoLinuxMaps (1085 of 1995) UNSUPPORTED: lldb-api :: functionalities/data-formatter/data-formatter-stl/libstdcpp/vector/TestDataFormatterStdVector.py (1086 of 1995) PASS: lldb-api :: commands/version/TestVersion.py (1087 of 1995) PASS: lldb-unit :: UnwindAssembly/x86/./UnwindAssemblyx86Tests/Testx86AssemblyInspectionEngine.TestPopESI (1088 of 1995) PASS: lldb-shell :: SymbolFile/DWARF/dwarf5-atomic.s (1089 of 1995) PASS: lldb-api :: lang/objc/single-entry-dictionary/TestObjCSingleEntryDictionary.py (1090 of 1995) PASS: lldb-unit :: Utility/./UtilityTests/SerializationRountripTest.SerializeDeserializeCStringArrayNullptr (1091 of 1995) PASS: lldb-unit :: Utility/./UtilityTests/AnsiTerminal.WhiteSpace (1092 of 1995) PASS: lldb-api :: commands/watchpoints/hello_watchpoint/TestMyFirstWatchpoint.py (1093 of 1995) PASS: lldb-unit :: Utility/./UtilityTests/StringExtractorTest.GetHexBytes_Partial (1094 of 1995) PASS: lldb-unit :: UnwindAssembly/x86/./UnwindAssemblyx86Tests/Testx86AssemblyInspectionEngine.TestPushRBPWithREX (1095 of 1995) PASS: lldb-api :: commands/expression/function_template_specialization_temp_args/TestFunctionTemplateSpecializationTempArgs.py (1096 of 1995) PASS: lldb-api :: commands/expression/unicode-in-variable/TestUnicodeInVariable.py (1097 of 1995) PASS: lldb-unit :: Utility/./UtilityTests/StreamTest.PutHex8 (1098 of 1995) PASS: lldb-unit :: Utility/./UtilityTests/Flags.AnyClear (1099 of 1995) PASS: lldb-api :: types/TestDoubleTypesExpr.py (1100 of 1995) PASS: lldb-shell :: SymbolFile/DWARF/forward-declarations.s (1101 of 1995) PASS: lldb-unit :: Utility/./UtilityTests/NameMatchesTest.StartsWith (1102 of 1995) UNSUPPORTED: lldb-api :: functionalities/tty/TestTerminal.py (1103 of 1995) PASS: lldb-api :: functionalities/gdb_remote_client/TestPlatformClient.py (1104 of 1995) PASS: lldb-shell :: ObjectFile/ELF/PT_TLS-overlap-PT_LOAD.yaml (1105 of 1995) PASS: lldb-api :: functionalities/data-formatter/data-formatter-advanced/TestDataFormatterAdv.py (1106 of 1995) PASS: lldb-unit :: Language/Highlighting/./HighlighterTests/HighlighterTest.ClangCursorPosInOtherToken (1107 of 1995) PASS: lldb-unit :: Host/./HostTests/TaskPoolTest.AddTask (1108 of 1995) PASS: lldb-unit :: Utility/./UtilityTests/VASprintfTest.NoBufferResize (1109 of 1995) PASS: lldb-unit :: Utility/./UtilityTests/OptionsWithRawTest.ArgsButNoDelimiter (1110 of 1995) PASS: lldb-unit :: Process/minidump/./LLDBMinidumpTests/MinidumpParserTest.GetMemoryRegionInfo (1111 of 1995) PASS: lldb-unit :: UnwindAssembly/x86/./UnwindAssemblyx86Tests/Testx86AssemblyInspectionEngine.TestPopRBP (1112 of 1995) UNSUPPORTED: lldb-api :: benchmarks/turnaround/TestCompileRunToBreakpointTurnaround.py (1113 of 1995) PASS: lldb-unit :: Process/gdb-remote/./ProcessGdbRemoteTests/GDBRemoteClientBaseTest.SendContinueAndInterrupt (1114 of 1995) PASS: lldb-unit :: Process/gdb-remote/./ProcessGdbRemoteTests/GDBRemoteCommunicationClientTest.TestPacketSpeedJSON (1115 of 1995) PASS: lldb-unit :: Language/Highlighting/./HighlighterTests/HighlighterTest.ClangSquareBrackets (1116 of 1995) PASS: lldb-shell :: SymbolFile/NativePDB/bitfields.cpp (1117 of 1995) PASS: lldb-unit :: Utility/./UtilityTests/ArgsTest.TestSingleArgWithQuotedSpace (1118 of 1995) PASS: lldb-api :: python_api/frame/TestFrames.py (1119 of 1995) PASS: lldb-shell :: SymbolFile/DWARF/debug_ranges-missing-section.s (1120 of 1995) PASS: lldb-api :: functionalities/memory/read/TestMemoryRead.py (1121 of 1995) PASS: lldb-api :: functionalities/inferior-crashing/recursive-inferior/TestRecursiveInferiorStep.py (1122 of 1995) PASS: lldb-unit :: Utility/./UtilityTests/StructuredDataTest.StringDump (1123 of 1995) PASS: lldb-api :: commands/process/attach-resume/TestAttachResume.py (1124 of 1995) PASS: lldb-api :: functionalities/process_crash_info/TestProcessCrashInfo.py (1125 of 1995) PASS: lldb-api :: commands/expression/import-std-module/shared_ptr/TestSharedPtrFromStdModule.py (1126 of 1995) PASS: lldb-unit :: Utility/./UtilityTests/StreamTest.PutSLEB128 (1127 of 1995) PASS: lldb-unit :: Utility/./UtilityTests/StringExtractorTest.DecodeHexU8_Extra (1128 of 1995) PASS: lldb-unit :: Utility/./UtilityTests/AnsiTerminal.KnownPrefix (1129 of 1995) PASS: lldb-unit :: Utility/./UtilityTests/VMRange.ContainsAddr (1130 of 1995) UNSUPPORTED: lldb-api :: linux/add-symbols/TestTargetSymbolsAddCommand.py (1131 of 1995) UNSUPPORTED: lldb-api :: functionalities/darwin_log/filter/regex/category/TestDarwinLogFilterRegexCategory.py (1132 of 1995) PASS: lldb-api :: functionalities/load_using_paths/TestLoadUsingPaths.py (1133 of 1995) PASS: lldb-api :: functionalities/thread/concurrent_events/TestConcurrentTwoBreakpointThreads.py (1134 of 1995) PASS: lldb-api :: macosx/queues/TestQueues.py (1135 of 1995) PASS: lldb-api :: functionalities/thread/concurrent_events/TestConcurrentDelaySignalWatch.py (1136 of 1995) UNSUPPORTED: lldb-api :: functionalities/darwin_log/filter/regex/activity/TestDarwinLogFilterRegexActivity.py (1137 of 1995) PASS: lldb-api :: lang/objcxx/cxx-bridged-po/TestObjCXXBridgedPO.py (1138 of 1995) PASS: lldb-unit :: Utility/./UtilityTests/StringListTest.SplitIntoLines (1139 of 1995) PASS: lldb-api :: commands/settings/quoting/TestQuoting.py (1140 of 1995) PASS: lldb-unit :: Symbol/./SymbolTests/TestTypeSystemClang.TestFunctionTemplateInRecordConstruction (1141 of 1995) PASS: lldb-api :: functionalities/data-formatter/data-formatter-caching/TestDataFormatterCaching.py (1142 of 1995) PASS: lldb-unit :: Utility/./UtilityTests/ScalarTest.GetBytes (1143 of 1995) PASS: lldb-shell :: Commands/command-regex-unalias.test (1144 of 1995) PASS: lldb-unit :: Utility/./UtilityTests/AnsiTerminal.Incomplete (1145 of 1995) PASS: lldb-unit :: SymbolFile/DWARF/./SymbolFileDWARFTests/SymbolFileDWARFTests.TestAbbrevInvalidNULLTag (1146 of 1995) UNSUPPORTED: lldb-api :: benchmarks/expression/TestExpressionCmd.py (1147 of 1995) PASS: lldb-api :: functionalities/data-formatter/parray/TestPrintArray.py (1148 of 1995) PASS: lldb-unit :: Utility/./UtilityTests/RangeTest.Clear (1149 of 1995) PASS: lldb-api :: functionalities/data-formatter/hexcaps/TestDataFormatterHexCaps.py (1150 of 1995) PASS: lldb-api :: functionalities/data-formatter/data-formatter-stl/libcxx/list/TestDataFormatterLibcxxList.py (1151 of 1995) PASS: lldb-unit :: UnwindAssembly/x86/./UnwindAssemblyx86Tests/Testx86AssemblyInspectionEngine.Test64bitFramelessBigStackFrame (1152 of 1995) PASS: lldb-api :: commands/expression/scoped_enums/TestScopedEnumType.py (1153 of 1995) UNSUPPORTED: lldb-api :: commands/watchpoints/hello_watchlocation/TestWatchLocation.py (1154 of 1995) PASS: lldb-unit :: Utility/./UtilityTests/UriParserTest.BadPort (1155 of 1995) PASS: lldb-api :: commands/expression/import-std-module/basic/TestImportStdModule.py (1156 of 1995) PASS: lldb-unit :: Utility/./UtilityTests/StringExtractorTest.DecodeHexU8_InvalidHex (1157 of 1995) UNSUPPORTED: lldb-api :: benchmarks/frame_variable/TestFrameVariableResponse.py (1158 of 1995) UNSUPPORTED: lldb-api :: lang/objc/bitfield_ivars/TestBitfieldIvars.py (1159 of 1995) PASS: lldb-unit :: tools/lldb-server/tests/./LLDBServerTests/TestBase.DebugserverEnv (1160 of 1995) PASS: lldb-shell :: SymbolFile/DWARF/anon_class_w_and_wo_export_symbols.ll (1161 of 1995) PASS: lldb-shell :: Quit/TestQuitExitCodeHex0.test (1162 of 1995) PASS: lldb-api :: python_api/get-value-32bit-int/TestGetValue32BitInt.py (1163 of 1995) PASS: lldb-unit :: Utility/./UtilityTests/StringListTest.GetMaxStringLengthEmpty (1164 of 1995) PASS: lldb-unit :: Host/./HostTests/FileSystemTest.OpenErrno (1165 of 1995) PASS: lldb-api :: lang/objc/modules-auto-import/TestModulesAutoImport.py (1166 of 1995) PASS: lldb-api :: macosx/function-starts/TestFunctionStarts.py (1167 of 1995) PASS: lldb-api :: lang/objc/objc-runtime-ivars/TestRuntimeIvars.py (1168 of 1995) PASS: lldb-shell :: SymbolFile/DWARF/apple-index-is-used.cpp (1169 of 1995) PASS: lldb-shell :: SymbolFile/NativePDB/function-types-classes.cpp (1170 of 1995) PASS: lldb-api :: types/TestLongTypes.py (1171 of 1995) PASS: lldb-unit :: ScriptInterpreter/Python/./ScriptInterpreterPythonTests/PythonDataObjectsTest.TestPythonListManipulation (1172 of 1995) PASS: lldb-shell :: Driver/LocalLLDBInit.test (1173 of 1995) PASS: lldb-api :: commands/expression/two-files/TestObjCTypeQueryFromOtherCompileUnit.py (1174 of 1995) PASS: lldb-api :: functionalities/data-formatter/data-formatter-objc/TestDataFormatterObjCCF.py (1175 of 1995) PASS: lldb-api :: functionalities/data-formatter/synthupdate/TestSyntheticFilterRecompute.py (1176 of 1995) UNSUPPORTED: lldb-shell :: Breakpoint/ppc64-localentry.test (1177 of 1995) PASS: lldb-api :: lang/c/array_types/TestArrayTypes.py (1178 of 1995) PASS: lldb-api :: functionalities/data-formatter/boolreference/TestFormattersBoolRefPtr.py (1179 of 1995) PASS: lldb-api :: functionalities/breakpoint/hardware_breakpoints/hardware_breakpoint_on_multiple_threads/TestHWBreakMultiThread.py (1180 of 1995) UNSUPPORTED: lldb-shell :: Minidump/Windows/arm-fp-unwind.test (1181 of 1995) PASS: lldb-api :: python_api/sbtype_typeclass/TestSBTypeTypeClass.py (1182 of 1995) PASS: lldb-shell :: ObjectFile/Breakpad/sections-trailing-func.test (1183 of 1995) PASS: lldb-unit :: UnwindAssembly/x86/./UnwindAssemblyx86Tests/Testx86AssemblyInspectionEngine.TestPushEBP (1184 of 1995) PASS: lldb-api :: commands/expression/import-std-module/no-std-module/TestMissingStdModule.py (1185 of 1995) PASS: lldb-api :: python_api/file_handle/TestFileHandle.py (1186 of 1995) PASS: lldb-api :: tools/lldb-server/TestGdbRemoteKill.py (1187 of 1995) PASS: lldb-unit :: Utility/./UtilityTests/TimeoutTest.Construction (1188 of 1995) PASS: lldb-unit :: Utility/./UtilityTests/StringListTest.SplitIntoLinesEmpty (1189 of 1995) PASS: lldb-api :: lang/c/shared_lib/TestSharedLib.py (1190 of 1995) PASS: lldb-shell :: SymbolFile/DWARF/dwp-debug-types.s (1191 of 1995) PASS: lldb-shell :: SymbolFile/DWARF/dwarf5_locations.s (1192 of 1995) UNSUPPORTED: lldb-shell :: SymbolFile/NativePDB/stack_unwinding01.cpp (1193 of 1995) PASS: lldb-api :: commands/watchpoints/watchpoint_commands/command/TestWatchpointCommandLLDB.py (1194 of 1995) PASS: lldb-api :: commands/reproducer/invalid-args/TestInvalidArgsReproducer.py (1195 of 1995) PASS: lldb-api :: lang/objc/variadic_methods/TestVariadicMethods.py (1196 of 1995) PASS: lldb-unit :: Utility/./UtilityTests/EnvironmentTest.EnvpConstruction (1197 of 1995) PASS: lldb-api :: python_api/sbstructureddata/TestStructuredDataAPI.py (1198 of 1995) PASS: lldb-api :: commands/disassemble/basic/TestDisassembleBreakpoint.py (1199 of 1995) PASS: lldb-shell :: Settings/TestDisableColor.test (1200 of 1995) PASS: lldb-api :: functionalities/inline-stepping/TestInlineStepping.py (1201 of 1995) PASS: lldb-shell :: ObjectFile/PECOFF/symbol.yaml (1202 of 1995) PASS: lldb-api :: commands/command/source/TestCommandSource.py (1203 of 1995) PASS: lldb-unit :: Utility/./UtilityTests/Flags.AllClear (1204 of 1995) PASS: lldb-api :: functionalities/data-formatter/ostypeformatting/TestFormattersOsType.py (1205 of 1995) PASS: lldb-api :: functionalities/data-formatter/data-formatter-stl/libcxx/unique_ptr/TestDataFormatterLibcxxUniquePtr.py (1206 of 1995) PASS: lldb-unit :: Utility/./UtilityTests/UriParserTest.BracketedHostnameWithPortIPv6 (1207 of 1995) PASS: lldb-api :: functionalities/avoids-fd-leak/TestFdLeak.py (1208 of 1995) PASS: lldb-api :: commands/expression/import-std-module/empty-module/TestEmptyStdModule.py (1209 of 1995) PASS: lldb-api :: lang/cpp/diamond/TestDiamond.py (1210 of 1995) PASS: lldb-unit :: Utility/./UtilityTests/NameMatchesTest.Ignore (1211 of 1995) PASS: lldb-unit :: Host/./HostTests/NativeProcessProtocolTest.SetBreakpointFailWrite (1212 of 1995) PASS: lldb-shell :: ObjectFile/ELF/basic-info.yaml (1213 of 1995) PASS: lldb-unit :: Utility/./UtilityTests/StreamTest.PutHex64ByteOrderLittle (1214 of 1995) PASS: lldb-api :: commands/expression/call-function/TestCallStopAndContinue.py (1215 of 1995) PASS: lldb-unit :: Utility/./UtilityTests/StreamTest.AddressSize (1216 of 1995) PASS: lldb-unit :: Signals/./SignalsTests/UnixSignalsTest.GetInfo (1217 of 1995) PASS: lldb-api :: lang/cpp/unicode-literals/TestUnicodeLiterals.py (1218 of 1995) PASS: lldb-unit :: Language/Highlighting/./HighlighterTests/HighlighterTest.ClangBraces (1219 of 1995) PASS: lldb-api :: lang/objc/objc_direct-methods/TestObjCDirectMethods.py (1220 of 1995) PASS: lldb-unit :: Utility/./UtilityTests/VMRange.SetEndAddress (1221 of 1995) PASS: lldb-unit :: Process/minidump/./LLDBMinidumpTests/MinidumpParserTest.InvalidMinidump (1222 of 1995) PASS: lldb-shell :: Heap/heap-cstr.test (1223 of 1995) XFAIL: lldb-shell :: Unwind/prefer-debug-over-eh-frame.test (1224 of 1995) PASS: lldb-api :: functionalities/data-formatter/data-formatter-stl/libcxx/iterator/TestDataFormatterLibccIterator.py (1225 of 1995) PASS: lldb-api :: functionalities/thread/step_out/TestThreadStepOut.py (1226 of 1995) UNSUPPORTED: lldb-api :: functionalities/data-formatter/data-formatter-stl/libstdcpp/list/TestDataFormatterStdList.py (1227 of 1995) PASS: lldb-unit :: Utility/./UtilityTests/StringListTest.PopBack (1228 of 1995) PASS: lldb-unit :: Utility/./UtilityTests/LogChannelEnabledTest.LogVerboseThread (1229 of 1995) PASS: lldb-unit :: ObjectFile/PECOFF/./ObjectFilePECOFFTests/PECallFrameInfoTest.Chained_eh (1230 of 1995) PASS: lldb-unit :: Utility/./UtilityTests/ArgsTest.BareSingleQuote (1231 of 1995) PASS: lldb-unit :: Utility/./UtilityTests/ListenerTest.GetEventImmediate (1232 of 1995) PASS: lldb-unit :: Utility/./UtilityTests/ArgsTest.TestQuotedUnknownEscape (1233 of 1995) PASS: lldb-unit :: Utility/./UtilityTests/SerializationRountripTest.SerializeDeserializeCStringArray (1234 of 1995) PASS: lldb-unit :: UnwindAssembly/x86/./UnwindAssemblyx86Tests/Testx86AssemblyInspectionEngine.TestAddESP (1235 of 1995) PASS: lldb-unit :: Utility/./UtilityTests/StreamTeeTest.Constructor1Stream (1236 of 1995) PASS: lldb-api :: sample_test/TestSampleInlineTest.py (1237 of 1995) PASS: lldb-api :: functionalities/thread/concurrent_events/TestConcurrentTwoWatchpointThreads.py (1238 of 1995) PASS: lldb-api :: commands/expression/persistent_ptr_update/TestPersistentPtrUpdate.py (1239 of 1995) UNSUPPORTED: lldb-api :: lang/c/typedef/Testtypedef.py (1240 of 1995) PASS: lldb-unit :: Utility/./UtilityTests/ConstStringTest.YAML (1241 of 1995) PASS: lldb-shell :: Settings/TestSettingsSet.test (1242 of 1995) PASS: lldb-shell :: Reproducer/Functionalities/TestImageList.test (1243 of 1995) PASS: lldb-api :: commands/expression/test/TestExprs2.py (1244 of 1995) PASS: lldb-shell :: Commands/command-regex-delete.test (1245 of 1995) PASS: lldb-api :: functionalities/data-formatter/data-formatter-skip-summary/TestDataFormatterSkipSummary.py (1246 of 1995) PASS: lldb-unit :: Utility/./UtilityTests/StreamTest.PutMaxHex64ByteOrderLittle (1247 of 1995) UNSUPPORTED: lldb-api :: functionalities/data-formatter/data-formatter-stl/libstdcpp/smart_ptr/TestDataFormatterStdSmartPtr.py (1248 of 1995) PASS: lldb-unit :: SymbolFile/DWARF/./SymbolFileDWARFTests/SymbolFileDWARFTests.TestAbbrevOrder1Start5 (1249 of 1995) PASS: lldb-shell :: SymbolFile/DWARF/find-variable-dwo.cpp (1250 of 1995) UNSUPPORTED: lldb-api :: functionalities/darwin_log/format/TestDarwinLogMessageFormat.py (1251 of 1995) PASS: lldb-shell :: Reproducer/TestSynchronous.test (1252 of 1995) PASS: lldb-shell :: ObjectFile/MachO/lc_build_version.yaml (1253 of 1995) PASS: lldb-shell :: SymbolFile/DWARF/parallel-indexing-stress.s (1254 of 1995) PASS: lldb-api :: functionalities/data-formatter/pyobjsynthprovider/TestPyObjSynthProvider.py (1255 of 1995) PASS: lldb-unit :: Breakpoint/./LLDBBreakpointTests/BreakpointIDTest.StringIsBreakpointName (1256 of 1995) PASS: lldb-api :: commands/frame/var/TestFrameVar.py (1257 of 1995) PASS: lldb-unit :: Utility/./UtilityTests/RecordReplayTest.InstrumentedBarPtr (1258 of 1995) PASS: lldb-unit :: Utility/./UtilityTests/RegularExpression.Invalid (1259 of 1995) UNSUPPORTED: lldb-shell :: Register/x86-gp-write.test (1260 of 1995) PASS: lldb-api :: commands/expression/pr35310/TestExprsBug35310.py (1261 of 1995) PASS: lldb-shell :: SymbolFile/DWARF/find-basic-function.cpp (1262 of 1995) PASS: lldb-unit :: ObjectFile/PECOFF/./ObjectFilePECOFFTests/PECallFrameInfoTest.Frame_reg_eh (1263 of 1995) PASS: lldb-shell :: SymbolFile/DWARF/dwp.s (1264 of 1995) PASS: lldb-shell :: Settings/TestFrameFormatColor.test (1265 of 1995) PASS: lldb-shell :: ObjectFile/ELF/section-types.yaml (1266 of 1995) PASS: lldb-api :: linux/builtin_trap/TestBuiltinTrap.py (1267 of 1995) PASS: lldb-unit :: Utility/./UtilityTests/FileSpecTest.RemoveLastPathComponent (1268 of 1995) PASS: lldb-unit :: SymbolFile/NativePDB/./SymbolFileNativePDBTests/PDBFPOProgramToDWARFExpressionTests.MultipleDependentAssignments (1269 of 1995) PASS: lldb-unit :: Utility/./UtilityTests/UriParserTest.MinimalPort (1270 of 1995) PASS: lldb-unit :: Utility/./UtilityTests/StringExtractorTest.GetHexBytes_OddPair2 (1271 of 1995) PASS: lldb-unit :: Utility/./UtilityTests/UriParserTest.BracketedHostname (1272 of 1995) PASS: lldb-api :: lang/objc/objc-new-syntax/TestObjCNewSyntaxArray.py (1273 of 1995) PASS: lldb-api :: commands/expression/import-std-module/weak_ptr/TestWeakPtrFromStdModule.py (1274 of 1995) PASS: lldb-api :: functionalities/thread/backtrace_limit/TestBacktraceLimit.py (1275 of 1995) PASS: lldb-unit :: Utility/./UtilityTests/StringListTest.LongestCommonPrefix (1276 of 1995) PASS: lldb-api :: functionalities/abbreviation/TestCommonShortSpellings.py (1277 of 1995) PASS: lldb-unit :: Language/Highlighting/./HighlighterTests/HighlighterTest.ClangComments (1278 of 1995) PASS: lldb-api :: functionalities/data-formatter/synthcapping/TestSyntheticCapping.py (1279 of 1995) PASS: lldb-unit :: Expression/./ExpressionTests/DiagnosticManagerTest.GetStringSeverityLabels (1280 of 1995) PASS: lldb-unit :: Process/gdb-remote/./ProcessGdbRemoteTests/GDBRemoteClientBaseTest.SendPacketAndReceiveResponseWithOutputSupport (1281 of 1995) PASS: lldb-shell :: Unwind/eh-frame-dwarf-unwind.test (1282 of 1995) UNSUPPORTED: lldb-api :: functionalities/darwin_log/source/debug/TestDarwinLogSourceDebug.py (1283 of 1995) UNSUPPORTED: lldb-api :: functionalities/thread/concurrent_events/TestConcurrentManySignals.py (1284 of 1995) PASS: lldb-shell :: SymbolFile/DWARF/deterministic-build.cpp (1285 of 1995) PASS: lldb-shell :: SymbolFile/DWARF/debug-names-compressed.cpp (1286 of 1995) PASS: lldb-unit :: UnwindAssembly/x86/./UnwindAssemblyx86Tests/Testx86AssemblyInspectionEngine.TestPopR15 (1287 of 1995) PASS: lldb-unit :: Symbol/./SymbolTests/LineEntryTest.GetSameLineContiguousAddressRangeNestedInline (1288 of 1995) PASS: lldb-shell :: SymbolFile/DWARF/debug-types-dwo-cross-reference.cpp (1289 of 1995) PASS: lldb-api :: functionalities/completion/TestCompletion.py (1290 of 1995) PASS: lldb-api :: python_api/default-constructor/TestDefaultConstructorForAPIObjects.py (1291 of 1995) PASS: lldb-unit :: SymbolFile/NativePDB/./SymbolFileNativePDBTests/PDBFPOProgramToDWARFExpressionTests.UnresolvedRegisterAssignmentReference (1292 of 1995) PASS: lldb-unit :: Utility/./UtilityTests/StringListTest.InsertStringAtIndexMove (1293 of 1995) PASS: lldb-unit :: Utility/./UtilityTests/FileSpecTest.IsRelative (1294 of 1995) PASS: lldb-unit :: Expression/./ExpressionTests/CppModuleConfigurationTest.MissingUsrInclude (1295 of 1995) PASS: lldb-api :: lang/c/conflicting-symbol/TestConflictingSymbol.py (1296 of 1995) UNSUPPORTED: lldb-api :: functionalities/tsan/multiple/TestTsanMultiple.py (1297 of 1995) UNSUPPORTED: lldb-shell :: Breakpoint/case-insensitive.test (1298 of 1995) PASS: lldb-api :: functionalities/data-formatter/data-formatter-objc/TestDataFormatterObjCExpr.py (1299 of 1995) PASS: lldb-unit :: Utility/./UtilityTests/Predicate.WaitForValueEqualTo (1300 of 1995) PASS: lldb-unit :: Process/gdb-remote/./ProcessGdbRemoteTests/GDBRemoteCommunicationClientTest.GetMemoryRegionInfoInvalidResponse (1301 of 1995) PASS: lldb-unit :: UnwindAssembly/x86/./UnwindAssemblyx86Tests/Testx86AssemblyInspectionEngine.TestPushEDX (1302 of 1995) PASS: lldb-unit :: Utility/./UtilityTests/ArgsTest.ReplaceArgumentAtIndexOutOfRange (1303 of 1995) PASS: lldb-unit :: Utility/./UtilityTests/StreamTeeTest.Constructor2Streams (1304 of 1995) PASS: lldb-api :: commands/expression/issue_11588/Test11588.py (1305 of 1995) PASS: lldb-unit :: Utility/./UtilityTests/RangeDataVector.FindEntryIndexesThatContain_Overlap (1306 of 1995) PASS: lldb-api :: functionalities/breakpoint/cpp/TestCPPBreakpointLocations.py (1307 of 1995) PASS: lldb-unit :: Interpreter/./InterpreterTests/CompletionTest.DirCompletionAbsolute (1308 of 1995) UNSUPPORTED: lldb-api :: commands/expression/multiline-navigation/TestMultilineNavigation.py (1309 of 1995) UNSUPPORTED: lldb-api :: lang/objc/rdar-12408181/TestRdar12408181.py (1310 of 1995) PASS: lldb-api :: lang/c/struct_types/TestStructTypes.py (1311 of 1995) UNSUPPORTED: lldb-api :: tools/lldb-server/signal-filtering/TestGdbRemote_QPassSignals.py (1312 of 1995) PASS: lldb-shell :: SymbolFile/symbol-binding.test (1313 of 1995) PASS: lldb-api :: lang/cpp/rvalue-references/TestRvalueReferences.py (1314 of 1995) PASS: lldb-unit :: Utility/./UtilityTests/RangeDataVector.FindEntryThatContains_Overlap (1315 of 1995) PASS: lldb-unit :: Utility/./UtilityTests/RangeTest.ContainsAddrInvalid (1316 of 1995) PASS: lldb-api :: lang/c/shared_lib_stripped_symbols/TestSharedLibStrippedSymbols.py (1317 of 1995) PASS: lldb-shell :: Register/x86-64-read.test (1318 of 1995) PASS: lldb-unit :: Utility/./UtilityTests/ArchSpecTest.TripleComponentsWereSpecified (1319 of 1995) PASS: lldb-unit :: Utility/./UtilityTests/UriParserTest.BadPort2 (1320 of 1995) PASS: lldb-unit :: Utility/./UtilityTests/RegularExpression.Match (1321 of 1995) PASS: lldb-unit :: Utility/./UtilityTests/StreamTest.PutBytesAsRawHex8ToMixedEndian (1322 of 1995) PASS: lldb-unit :: UnwindAssembly/x86/./UnwindAssemblyx86Tests/Testx86AssemblyInspectionEngine.TestSimplex86_64Augmented (1323 of 1995) PASS: lldb-unit :: Utility/./UtilityTests/FileSpecTest.Equal (1324 of 1995) PASS: lldb-unit :: Utility/./UtilityTests/StreamTest.PutRawBytesToBigEndian (1325 of 1995) PASS: lldb-unit :: Target/./TargetTests/ModuleCacheTest.GetAndPutUuidExists (1326 of 1995) PASS: lldb-unit :: Utility/./UtilityTests/StreamTest.PutHex32ByteOrderBig (1327 of 1995) PASS: lldb-unit :: Utility/./UtilityTests/StringExtractorTest.GetHexBytes_FullString (1328 of 1995) PASS: lldb-api :: functionalities/thread/crash_during_step/TestCrashDuringStep.py (1329 of 1995) PASS: lldb-api :: types/TestDoubleTypes.py (1330 of 1995) PASS: lldb-unit :: Process/minidump/./LLDBMinidumpTests/MinidumpParserTest.GetPidWow64 (1331 of 1995) PASS: lldb-api :: commands/expression/unwind_expression/TestUnwindExpression.py (1332 of 1995) PASS: lldb-unit :: Utility/./UtilityTests/StringListTest.GetMaxStringLengthMixed (1333 of 1995) PASS: lldb-api :: functionalities/tail_call_frames/disambiguate_paths_to_common_sink/TestDisambiguatePathsToCommonSink.py (1334 of 1995) PASS: lldb-shell :: SymbolFile/NativePDB/function-types-builtins.cpp (1335 of 1995) PASS: lldb-api :: functionalities/data-formatter/nssetsynth/TestNSSetSynthetic.py (1336 of 1995) PASS: lldb-api :: lang/cpp/symbols/TestSymbols.py (1337 of 1995) PASS: lldb-unit :: Utility/./UtilityTests/ArgsTest.ReplaceArgumentAtIndexShort (1338 of 1995) PASS: lldb-api :: commands/expression/import-std-module/queue/TestQueueFromStdModule.py (1339 of 1995) UNSUPPORTED: lldb-api :: lang/objc/objc-dynamic-value/TestObjCDynamicValue.py (1340 of 1995) PASS: lldb-api :: commands/expression/import-std-module/vector/TestVectorFromStdModule.py (1341 of 1995) PASS: lldb-shell :: Settings/TestSettingsWrite.test (1342 of 1995) PASS: lldb-unit :: Utility/./UtilityTests/GeneratorTest.Create (1343 of 1995) PASS: lldb-api :: commands/frame/select/TestFrameSelect.py (1344 of 1995) PASS: lldb-unit :: SymbolFile/NativePDB/./SymbolFileNativePDBTests/PDBFPOProgramToDWARFExpressionTests.DependencyChain (1345 of 1995) PASS: lldb-unit :: Utility/./UtilityTests/BroadcasterTest.BroadcastEvent (1346 of 1995) PASS: lldb-api :: commands/watchpoints/watchpoint_on_vectors/TestValueOfVectorVariable.py (1347 of 1995) PASS: lldb-shell :: SymbolFile/DWARF/debug_loc-aslr.s (1348 of 1995) PASS: lldb-unit :: Process/gdb-remote/./ProcessGdbRemoteTests/GDBRemoteCommunicationClientTest.GetQOffsets (1349 of 1995) PASS: lldb-shell :: Breakpoint/jitbp_elf.test (1350 of 1995) PASS: lldb-api :: commands/command/script/import/rdar-12586188/TestRdar12586188.py (1351 of 1995) PASS: lldb-unit :: Utility/./UtilityTests/ProcessInstanceInfo.Dump (1352 of 1995) PASS: lldb-unit :: Host/./HostTests/NativeProcessProtocolTest.ReadCStringFromMemory_MaxSize (1353 of 1995) PASS: lldb-unit :: Process/gdb-remote/./ProcessGdbRemoteTests/GDBRemoteClientBaseTest.SendContinueAndLateInterrupt (1354 of 1995) PASS: lldb-shell :: SymbolFile/Breakpad/line-table-mixed-path-styles.test (1355 of 1995) PASS: lldb-api :: macosx/order/TestOrderFile.py (1356 of 1995) PASS: lldb-unit :: Utility/./UtilityTests/RangeTest.DoesAdjoinOrIntersect (1357 of 1995) PASS: lldb-unit :: debugserver/./debugserverTests/RNBSocket.LoopBackConnectIPv4 (1358 of 1995) PASS: lldb-unit :: Utility/./UtilityTests/ConstStringTest.CompareConstString (1359 of 1995) PASS: lldb-shell :: SymbolFile/DWARF/debug_rnglists-dwo.s (1360 of 1995) PASS: lldb-api :: macosx/thread-names/TestInterruptThreadNames.py (1361 of 1995) PASS: lldb-unit :: Utility/./UtilityTests/EventTest.DumpEventDataBytes (1362 of 1995) UNSUPPORTED: lldb-shell :: Register/aarch64-gp-read.test (1363 of 1995) PASS: lldb-api :: python_api/watchpoint/TestWatchpointIter.py (1364 of 1995) PASS: lldb-unit :: Utility/./UtilityTests/StringListTest.Assignment (1365 of 1995) PASS: lldb-unit :: Utility/./UtilityTests/StreamTest.AddressRange (1366 of 1995) PASS: lldb-api :: lang/objcxx/class-name-clash/TestNameClash.py (1367 of 1995) PASS: lldb-unit :: Utility/./UtilityTests/LogChannelEnabledTest.LogThread (1368 of 1995) PASS: lldb-shell :: ObjectFile/PECOFF/basic-info-arm64.yaml (1369 of 1995) PASS: lldb-api :: commands/expression/ir-interpreter-phi-nodes/TestIRInterpreterPHINodes.py (1370 of 1995) PASS: lldb-unit :: Expression/./ExpressionTests/ClangHostTest.MacOSX (1371 of 1995) PASS: lldb-unit :: Utility/./UtilityTests/StreamTest.SetIndentLevel (1372 of 1995) PASS: lldb-unit :: Expression/./ExpressionTests/DiagnosticManagerTest.FixedExpression (1373 of 1995) PASS: lldb-unit :: Utility/./UtilityTests/OptionsWithRawTest.WhitespaceSuffix (1374 of 1995) PASS: lldb-shell :: ObjectFile/ELF/section-permissions.yaml (1375 of 1995) PASS: lldb-unit :: ScriptInterpreter/Python/./ScriptInterpreterPythonTests/PythonDataObjectsTest.TestGlobalNameResolutionWithDot (1376 of 1995) PASS: lldb-api :: functionalities/breakpoint/consecutive_breakpoints/TestConsecutiveBreakpoints.py (1377 of 1995) PASS: lldb-unit :: Utility/./UtilityTests/ArgsTest.TestQuotedTrailingBackslash (1378 of 1995) PASS: lldb-unit :: Utility/./UtilityTests/StreamTeeTest.GetStreamAtIndexOutOfBounds (1379 of 1995) PASS: lldb-unit :: Process/gdb-remote/./ProcessGdbRemoteTests/GDBRemoteCommunicationClientTest.SendStopTracePacket (1380 of 1995) PASS: lldb-shell :: SymbolFile/DWARF/debug_rnglists.s (1381 of 1995) PASS: lldb-api :: functionalities/plugins/python_os_plugin/TestPythonOSPlugin.py (1382 of 1995) PASS: lldb-unit :: tools/lldb-server/tests/./LLDBServerTests/TestBase.LaunchModePreservesEnvironment (1383 of 1995) PASS: lldb-api :: functionalities/signal/raise/TestRaise.py (1384 of 1995) PASS: lldb-api :: commands/frame/diagnose/virtual-method-call/TestDiagnoseDereferenceVirtualMethodCall.py (1385 of 1995) PASS: lldb-unit :: Process/minidump/./LLDBMinidumpTests/RegisterContextMinidump.CheckRegisterContextMinidump_ARM (1386 of 1995) PASS: lldb-api :: functionalities/thread/exit_during_step/TestExitDuringStep.py (1387 of 1995) PASS: lldb-unit :: ObjectFile/Breakpad/./ObjectFileBreakpadTests/StackCFIRecord.parse (1388 of 1995) PASS: lldb-unit :: Utility/./UtilityTests/StringListTest.AppendListCStringArrayEmpty (1389 of 1995) PASS: lldb-api :: functionalities/thread/step_until/TestStepUntil.py (1390 of 1995) PASS: lldb-shell :: ObjectFile/ELF/avr-basic-info.yaml (1391 of 1995) PASS: lldb-unit :: Utility/./UtilityTests/SerializationRountripTest.SerializeDeserializeCString (1392 of 1995) PASS: lldb-shell :: Quit/TestQuitExitCode-30.test (1393 of 1995) PASS: lldb-unit :: Utility/./UtilityTests/ArgsTest.TestMultipleArgs (1394 of 1995) PASS: lldb-shell :: Reproducer/Functionalities/TestExpressionEvaluation.test (1395 of 1995) PASS: lldb-api :: commands/expression/fixits/TestFixIts.py (1396 of 1995) PASS: lldb-api :: python_api/function_symbol/TestDisasmAPI.py (1397 of 1995) PASS: lldb-unit :: Target/./TargetTests/ModuleCacheTest.GetAndPut (1398 of 1995) PASS: lldb-unit :: Target/./TargetTests/ExecutionContextTest.GetByteOrderProcess (1399 of 1995) PASS: lldb-api :: lang/c/anonymous/TestAnonymous.py (1400 of 1995) PASS: lldb-shell :: Quit/TestQuitExitCodeNonInt.test (1401 of 1995) PASS: lldb-api :: tools/lldb-server/TestGdbRemoteExitCode.py (1402 of 1995) PASS: lldb-unit :: Utility/./UtilityTests/GeneratorTest.GetOrCreate (1403 of 1995) PASS: lldb-api :: functionalities/thread/concurrent_events/TestConcurrentTwoWatchpointsOneBreakpoint.py (1404 of 1995) PASS: lldb-unit :: Expression/./ExpressionTests/ClangExpressionDeclMapTest.TestUnknownIdentifierLookup (1405 of 1995) PASS: lldb-api :: functionalities/data-formatter/data-formatter-stl/libstdcpp/unique_ptr/invalid/TestDataFormatterInvalidStdUniquePtr.py (1406 of 1995) PASS: lldb-api :: commands/watchpoints/watchpoint_events/TestWatchpointEvents.py (1407 of 1995) PASS: lldb-api :: commands/watchpoints/multiple_threads/TestWatchpointMultipleThreads.py (1408 of 1995) PASS: lldb-api :: api/multithreaded/TestMultithreaded.py (1409 of 1995) PASS: lldb-unit :: Utility/./UtilityTests/ArgsTest.ReplaceArgumentAtIndexFarOutOfRange (1410 of 1995) PASS: lldb-shell :: SymbolFile/Breakpad/stack-cfi-parsing.test (1411 of 1995) PASS: lldb-unit :: Expression/./ExpressionTests/CppModuleConfigurationTest.UnknownLibCppFile (1412 of 1995) PASS: lldb-api :: lang/c/modules/TestCModules.py (1413 of 1995) UNSUPPORTED: lldb-api :: functionalities/data-formatter/data-formatter-stl/libstdcpp/map/TestDataFormatterStdMap.py (1414 of 1995) PASS: lldb-api :: tools/lldb-server/commandline/TestStubReverseConnect.py (1415 of 1995) PASS: lldb-api :: commands/frame/diagnose/array/TestArray.py (1416 of 1995) PASS: lldb-unit :: Utility/./UtilityTests/TimerTest.CategoryTimesStats (1417 of 1995) PASS: lldb-unit :: Process/minidump/./LLDBMinidumpTests/RegisterContextMinidump.ConvertMinidumpContext_x86_32 (1418 of 1995) PASS: lldb-unit :: Utility/./UtilityTests/RangeTest.ClearWithStarAddress (1419 of 1995) PASS: lldb-unit :: Process/minidump/./LLDBMinidumpTests/MinidumpParserTest.GetPidWindows (1420 of 1995) PASS: lldb-api :: functionalities/lazy-loading/TestLazyLoading.py (1421 of 1995) PASS: lldb-unit :: Utility/./UtilityTests/StringExtractorTest.GetHexU8_Extra_NoEof (1422 of 1995) PASS: lldb-unit :: Process/gdb-remote/./ProcessGdbRemoteTests/GDBRemoteCommunicationClientTest.GetMemoryRegionInfo (1423 of 1995) PASS: lldb-unit :: Utility/./UtilityTests/BinaryStreamTest.PutULEB128MaxValue (1424 of 1995) PASS: lldb-unit :: Utility/./UtilityTests/CompletionRequest.ShiftArguments (1425 of 1995) PASS: lldb-unit :: Utility/./UtilityTests/VMRange.IsValid (1426 of 1995) PASS: lldb-unit :: Utility/./UtilityTests/ArgsTest.StringListConstructor (1427 of 1995) PASS: lldb-unit :: Utility/./UtilityTests/StringExtractorTest.GetNameColonValueSuccess (1428 of 1995) PASS: lldb-unit :: UnwindAssembly/x86/./UnwindAssemblyx86Tests/Testx86AssemblyInspectionEngine.TestPopR12 (1429 of 1995) PASS: lldb-unit :: Utility/./UtilityTests/UserIDResolver.GetUserName (1430 of 1995) PASS: lldb-unit :: Utility/./UtilityTests/StringExtractorTest.GetNameColonValueContainsColon (1431 of 1995) PASS: lldb-unit :: Symbol/./SymbolTests/DWARFCallFrameInfoTest.Basic_dwarf4 (1432 of 1995) PASS: lldb-api :: functionalities/postmortem/wow64_minidump/TestWow64MiniDump.py (1433 of 1995) PASS: lldb-unit :: Utility/./UtilityTests/ScalarTest.ExtractBitfield (1434 of 1995) PASS: lldb-api :: functionalities/data-formatter/data-formatter-stl/libcxx/vbool/TestDataFormatterLibcxxVBool.py (1435 of 1995) UNSUPPORTED: lldb-api :: functionalities/data-formatter/data-formatter-stl/libstdcpp/unique_ptr/TestDataFormatterStdUniquePtr.py (1436 of 1995) PASS: lldb-unit :: UnwindAssembly/x86/./UnwindAssemblyx86Tests/Testx86AssemblyInspectionEngine.TestAddRSP (1437 of 1995) PASS: lldb-unit :: Utility/./UtilityTests/VASprintfTest.EncodingError (1438 of 1995) PASS: lldb-unit :: ScriptInterpreter/Python/./ScriptInterpreterPythonTests/PythonDataObjectsTest.TestPythonStringToStructuredString (1439 of 1995) PASS: lldb-unit :: Host/./HostTests/FileSystemTest.EnumerateDirectory (1440 of 1995) PASS: lldb-api :: lang/cpp/modules-import/TestCXXModulesImport.py (1441 of 1995) PASS: lldb-api :: functionalities/value_md5_crash/TestValueMD5Crash.py (1442 of 1995) PASS: lldb-api :: commands/expression/radar_9531204/TestPrintfAfterUp.py (1443 of 1995) PASS: lldb-shell :: Reproducer/TestVersionCheck.test (1444 of 1995) PASS: lldb-unit :: ScriptInterpreter/Python/./ScriptInterpreterPythonTests/PythonDataObjectsTest.TestResetting (1445 of 1995) PASS: lldb-unit :: Symbol/./SymbolTests/TestClangASTImporter.DeportTypeTagDecl (1446 of 1995) PASS: lldb-shell :: ObjectFile/ELF/PT_LOAD-overlap-PT_TLS.yaml (1447 of 1995) PASS: lldb-unit :: Utility/./UtilityTests/RangeTest.Constructor (1448 of 1995) PASS: lldb-api :: functionalities/postmortem/minidump-new/TestMiniDumpNew.py (1449 of 1995) PASS: lldb-api :: lang/objc/foundation/TestSymbolTable.py (1450 of 1995) PASS: lldb-unit :: Utility/./UtilityTests/StringExtractorTest.GetHexU8_InvalidHex_NoEof (1451 of 1995) PASS: lldb-api :: lang/objc/objc-dyn-sbtype/TestObjCDynamicSBType.py (1452 of 1995) PASS: lldb-unit :: Language/Highlighting/./HighlighterTests/HighlighterTest.ClangScalarLiterals (1453 of 1995) PASS: lldb-shell :: BuildScript/compiler-full-path.test (1454 of 1995) UNSUPPORTED: lldb-shell :: Register/x86-zmm-write.test (1455 of 1995) PASS: lldb-unit :: Process/gdb-remote/./ProcessGdbRemoteTests/GDBRemoteCommunicationClientTest.WriteRegisterNoSuffix (1456 of 1995) PASS: lldb-api :: types/TestFloatTypes.py (1457 of 1995) PASS: lldb-unit :: Expression/./ExpressionTests/DWARFExpression.DW_OP_piece (1458 of 1995) PASS: lldb-api :: functionalities/breakpoint/breakpoint_ignore_count/TestBreakpointIgnoreCount.py (1459 of 1995) PASS: lldb-shell :: ObjectFile/ELF/minidebuginfo-find-symbols.yaml (1460 of 1995) PASS: lldb-api :: lang/cpp/multiple-inheritance/TestCppMultipleInheritance.py (1461 of 1995) PASS: lldb-api :: functionalities/thread/concurrent_events/TestConcurrentCrashWithWatchpointBreakpointSignal.py (1462 of 1995) PASS: lldb-api :: commands/process/launch/TestProcessLaunch.py (1463 of 1995) PASS: lldb-unit :: Process/gdb-remote/./ProcessGdbRemoteTests/GDBRemoteCommunicationServerTest.SendErrorResponse_ErrorNumber (1464 of 1995) PASS: lldb-unit :: Expression/./ExpressionTests/CppModuleConfigurationTest.AmbiguousLibCpp (1465 of 1995) PASS: lldb-api :: lang/cpp/this/TestCPPThis.py (1466 of 1995) PASS: lldb-api :: functionalities/breakpoint/objc/TestObjCBreakpoints.py (1467 of 1995) PASS: lldb-shell :: ObjectFile/MachO/symtab.yaml (1468 of 1995) PASS: lldb-unit :: ScriptInterpreter/Python/./ScriptInterpreterPythonTests/PythonDataObjectsTest.TestPythonTupleToStructuredList (1469 of 1995) PASS: lldb-api :: functionalities/memory/find/TestMemoryFind.py (1470 of 1995) PASS: lldb-unit :: Host/./HostTests/ProcessLaunchInfoTest.Constructor (1471 of 1995) PASS: lldb-unit :: Utility/./UtilityTests/UriParserTest.BracketedHostnameWithColon (1472 of 1995) PASS: lldb-shell :: ScriptInterpreter/Python/scripted_breakpoint.test (1473 of 1995) PASS: lldb-unit :: Process/minidump/./LLDBMinidumpTests/MinidumpParserTest.GetLinuxProcStatus_no_stream (1474 of 1995) PASS: lldb-api :: lang/objc/objc-static-method-stripped/TestObjCStaticMethodStripped.py (1475 of 1995) PASS: lldb-unit :: Utility/./UtilityTests/StringExtractorTest.InitMisc (1476 of 1995) PASS: lldb-api :: lang/cpp/gmodules-templates/TestGModules.py (1477 of 1995) PASS: lldb-unit :: Utility/./UtilityTests/RangeTest.Slide (1478 of 1995) PASS: lldb-shell :: SymbolFile/DWARF/dir-separator-no-comp-dir-relative-name.s (1479 of 1995) PASS: lldb-api :: functionalities/thread/concurrent_events/TestConcurrentWatchpointDelayWatchpointOneBreakpoint.py (1480 of 1995) PASS: lldb-api :: python_api/debugger/TestDebuggerAPI.py (1481 of 1995) PASS: lldb-unit :: Utility/./UtilityTests/StreamTest.AddressRangeInvalidRange (1482 of 1995) UNSUPPORTED: lldb-api :: functionalities/darwin_log/filter/exact_match/activity/TestDarwinLogFilterMatchActivity.py (1483 of 1995) PASS: lldb-api :: lang/objcxx/hide-runtime-values/TestObjCXXHideRuntimeValues.py (1484 of 1995) PASS: lldb-api :: tools/lldb-server/TestGdbRemote_qThreadStopInfo.py (1485 of 1995) PASS: lldb-unit :: Utility/./UtilityTests/RangeTest.NotEqual (1486 of 1995) PASS: lldb-unit :: Utility/./UtilityTests/OptionsWithRawTest.WhitespaceInput (1487 of 1995) UNSUPPORTED: lldb-shell :: Expr/TestIRMemoryMapWindows.test (1488 of 1995) PASS: lldb-unit :: Language/CPlusPlus/./LanguageCPlusPlusTests/CPlusPlusLanguage.CPlusPlusNameParser (1489 of 1995) PASS: lldb-api :: functionalities/breakpoint/breakpoint_command/TestRegexpBreakCommand.py (1490 of 1995) PASS: lldb-unit :: Process/gdb-remote/./ProcessGdbRemoteTests/GDBRemoteCommunicationServerTest.SendErrorResponse_Status (1491 of 1995) PASS: lldb-unit :: Utility/./UtilityTests/StringListTest.JoinNonSpace (1492 of 1995) PASS: lldb-unit :: Utility/./UtilityTests/StringExtractorTest.GetHexU8_Exact_NoEof (1493 of 1995) UNSUPPORTED: lldb-api :: lang/cpp/function-template-parameter-pack/TestFunctionTemplateParameterPack.py (1494 of 1995) UNSUPPORTED: lldb-shell :: SymbolFile/PDB/variables.test (1495 of 1995) PASS: lldb-shell :: SymbolFile/DWARF/debug-types-missing-signature.test (1496 of 1995) UNSUPPORTED: lldb-shell :: Register/x86-64-zmm-write.test (1497 of 1995) PASS: lldb-unit :: Utility/./UtilityTests/UriParserTest.BracketedHostnamePort (1498 of 1995) PASS: lldb-api :: commands/disassemble/basic/TestFrameDisassemble.py (1499 of 1995) PASS: lldb-unit :: Core/./LLDBCoreTests/RichManglingContextTest.Basic (1500 of 1995) PASS: lldb-api :: functionalities/gdb_remote_client/TestRestartBug.py (1501 of 1995) PASS: lldb-unit :: Symbol/./SymbolTests/TestTypeSystemClang.TestDeletingImplicitCopyCstrDueToMoveCStr (1502 of 1995) PASS: lldb-unit :: Utility/./UtilityTests/BinaryStreamTest.PutULEB128One (1503 of 1995) PASS: lldb-unit :: Utility/./UtilityTests/StringExtractorTest.GetU32LittleEndian (1504 of 1995) PASS: lldb-api :: lang/objc/modules-non-objc-target/TestObjCModulesNonObjCTarget.py (1505 of 1995) PASS: lldb-api :: functionalities/tail_call_frames/cross_object/TestCrossObjectTailCalls.py (1506 of 1995) PASS: lldb-unit :: Utility/./UtilityTests/UriParserTest.MinimalPortPath (1507 of 1995) PASS: lldb-unit :: Utility/./UtilityTests/ArchSpecTest.TestParseMachCPUDashSubtypeTripleExtra (1508 of 1995) PASS: lldb-api :: python_api/section/TestSectionAPI.py (1509 of 1995) PASS: lldb-unit :: Process/minidump/./LLDBMinidumpTests/MinidumpParserTest.FindMemoryRange (1510 of 1995) PASS: lldb-unit :: Utility/./UtilityTests/DataExtractorTest.GetBitfield (1511 of 1995) UNSUPPORTED: lldb-shell :: SymbolFile/PDB/function-level-linking.test (1512 of 1995) PASS: lldb-api :: python_api/lldbutil/frame/TestFrameUtils.py (1513 of 1995) PASS: lldb-api :: lang/cpp/const_this/TestConstThis.py (1514 of 1995) PASS: lldb-api :: lang/objc/print-obj/TestPrintObj.py (1515 of 1995) PASS: lldb-api :: lang/c/inlines/TestRedefinitionsInInlines.py (1516 of 1995) PASS: lldb-api :: functionalities/non-overlapping-index-variable-i/TestIndexVariable.py (1517 of 1995) PASS: lldb-unit :: Utility/./UtilityTests/Flags.Clear (1518 of 1995) PASS: lldb-unit :: Core/./LLDBCoreTests/MangledTest.ResultForBlockInvocation (1519 of 1995) PASS: lldb-unit :: debugserver/./debugserverTests/RNBSocket.LoopBackListenIPv6 (1520 of 1995) PASS: lldb-unit :: Host/./HostTests/FileSystemTest.EmptyTest (1521 of 1995) PASS: lldb-api :: lang/objc/foundation/TestObjCMethodsNSError.py (1522 of 1995) PASS: lldb-api :: lang/c/stepping/TestThreadStepping.py (1523 of 1995) PASS: lldb-unit :: Utility/./UtilityTests/BinaryStreamTest.PutSLEB128FiveBytes (1524 of 1995) PASS: lldb-unit :: Utility/./UtilityTests/StreamTeeTest.Assignment (1525 of 1995) PASS: lldb-api :: functionalities/data-formatter/data-formatter-proper-plurals/TestFormattersOneIsSingular.py (1526 of 1995) UNSUPPORTED: lldb-shell :: ScriptInterpreter/Lua/bindings.test (1527 of 1995) PASS: lldb-api :: lang/c/set_values/TestSetValues.py (1528 of 1995) PASS: lldb-shell :: SymbolFile/DWARF/module-ownership.mm (1529 of 1995) UNSUPPORTED: lldb-api :: benchmarks/continue/TestBenchmarkContinue.py (1530 of 1995) PASS: lldb-api :: functionalities/unwind/zeroth_frame/TestZerothFrame.py (1531 of 1995) PASS: lldb-shell :: Settings/TestFrameFormatNoColor.test (1532 of 1995) PASS: lldb-unit :: Utility/./UtilityTests/UriParserTest.TypicalPortPathIPv4 (1533 of 1995) PASS: lldb-api :: functionalities/gdb_remote_client/TestNoGPacketSupported.py (1534 of 1995) PASS: lldb-unit :: Utility/./UtilityTests/StreamTeeTest.Write (1535 of 1995) PASS: lldb-unit :: Utility/./UtilityTests/SubsystemRAIITest.NormalSubsystem (1536 of 1995) PASS: lldb-api :: macosx/version_zero/TestGetVersionZeroVersion.py (1537 of 1995) PASS: lldb-shell :: SymbolFile/DWARF/find-basic-type.cpp (1538 of 1995) PASS: lldb-api :: lang/cpp/char8_t/TestCxxChar8_t.py (1539 of 1995) PASS: lldb-shell :: SymbolFile/DWARF/compilercontext.ll (1540 of 1995) PASS: lldb-unit :: Utility/./UtilityTests/StringListTest.JoinMultiCharSeparator (1541 of 1995) PASS: lldb-unit :: Utility/./UtilityTests/UriParserTest.SchemeHostSeparator3 (1542 of 1995) PASS: lldb-api :: lang/cpp/dynamic-value/TestCppValueCast.py (1543 of 1995) UNSUPPORTED: lldb-api :: functionalities/ubsan/basic/TestUbsanBasic.py (1544 of 1995) PASS: lldb-unit :: Process/gdb-remote/./ProcessGdbRemoteTests/GDBRemoteCommunicationClientTest.SendStartTracePacket (1545 of 1995) PASS: lldb-unit :: Utility/./UtilityTests/StringExtractorTest.GetHexU8_InvalidHex (1546 of 1995) PASS: lldb-api :: lang/objc/modules/TestObjCModules.py (1547 of 1995) PASS: lldb-unit :: Utility/./UtilityTests/ListenerTest.GetEventWait (1548 of 1995) PASS: lldb-unit :: Utility/./UtilityTests/XcodeSDKTest.MergeTest (1549 of 1995) PASS: lldb-api :: lang/cpp/trivial_abi/TestTrivialABI.py (1550 of 1995) UNSUPPORTED: lldb-shell :: ExecControl/StopHook/stop-hook-threads.test (1551 of 1995) PASS: lldb-unit :: Utility/./UtilityTests/OptionsWithRawTest.LeadingSpaceArgs (1552 of 1995) PASS: lldb-api :: tools/lldb-server/register-reading/TestGdbRemoteGPacket.py (1553 of 1995) PASS: lldb-unit :: ScriptInterpreter/Python/./ScriptInterpreterPythonTests/PythonDataObjectsTest.TestTypeNameResolutionNoDot (1554 of 1995) PASS: lldb-api :: lang/cpp/template-function/TestTemplateFunctions.py (1555 of 1995) PASS: lldb-api :: functionalities/tail_call_frames/thread_step_out_message/TestArtificialFrameStepOutMessage.py (1556 of 1995) PASS: lldb-api :: functionalities/thread/thread_exit/TestThreadExit.py (1557 of 1995) PASS: lldb-api :: functionalities/data-formatter/dump_dynamic/TestDumpDynamic.py (1558 of 1995) PASS: lldb-unit :: Core/./LLDBCoreTests/MangledTest.NameIndexes_FindFunctionSymbols (1559 of 1995) PASS: lldb-api :: functionalities/type_completion/TestTypeCompletion.py (1560 of 1995) PASS: lldb-shell :: SymbolFile/NativePDB/s_constant.cpp (1561 of 1995) PASS: lldb-api :: tools/lldb-vscode/step/TestVSCode_step.py (1562 of 1995) PASS: lldb-api :: python_api/type/TestTypeList.py (1563 of 1995) PASS: lldb-api :: commands/expression/import-std-module/vector-dbg-info-content/TestDbgInfoContentVectorFromStdModule.py (1564 of 1995) PASS: lldb-api :: functionalities/data-formatter/data-formatter-ptr-to-array/TestPtrToArrayFormatting.py (1565 of 1995) PASS: lldb-api :: lang/cpp/unique-types/TestUniqueTypes.py (1566 of 1995) PASS: lldb-shell :: SymbolFile/Breakpad/symtab.test (1567 of 1995) PASS: lldb-unit :: Process/gdb-remote/./ProcessGdbRemoteTests/GDBRemoteCommunicationClientTest.WriteRegister (1568 of 1995) PASS: lldb-api :: functionalities/data-formatter/data-formatter-stl/libcxx/atomic/TestLibCxxAtomic.py (1569 of 1995) PASS: lldb-shell :: SymbolFile/NativePDB/ast-methods.cpp (1570 of 1995) PASS: lldb-api :: lang/c/vla/TestVLA.py (1571 of 1995) UNSUPPORTED: lldb-shell :: Watchpoint/netbsd-nouserdbregs.test (1572 of 1995) PASS: lldb-api :: functionalities/breakpoint/breakpoint_set_restart/TestBreakpointSetRestart.py (1573 of 1995) PASS: lldb-unit :: Utility/./UtilityTests/StreamTeeTest.CopyConstructor (1574 of 1995) PASS: lldb-api :: lang/objc/foundation/TestObjCMethods.py (1575 of 1995) PASS: lldb-shell :: Unwind/trap_frame_sym_ctx.test (1576 of 1995) PASS: lldb-api :: lang/cpp/constructors/TestCppConstructors.py (1577 of 1995) PASS: lldb-shell :: SymbolFile/DWARF/debug-types-basic.test (1578 of 1995) PASS: lldb-unit :: Host/./HostTests/MainLoopTest.UnmonitoredSignal (1579 of 1995) PASS: lldb-api :: lang/objc/objc-baseclass-sbtype/TestObjCBaseClassSBType.py (1580 of 1995) PASS: lldb-api :: commands/expression/import-std-module/forward_list/TestForwardListFromStdModule.py (1581 of 1995) PASS: lldb-unit :: Utility/./UtilityTests/BinaryStreamTest.PutSLEB128TwoBytes (1582 of 1995) PASS: lldb-unit :: Utility/./UtilityTests/RangeTest.Union (1583 of 1995) PASS: lldb-api :: functionalities/data-formatter/data-formatter-objc/TestDataFormatterObjCNSData.py (1584 of 1995) UNSUPPORTED: lldb-shell :: ScriptInterpreter/Lua/lua.test (1585 of 1995) PASS: lldb-unit :: UnwindAssembly/x86/./UnwindAssemblyx86Tests/Testx86AssemblyInspectionEngine.TestStackRealign8BitDisp_i386 (1586 of 1995) PASS: lldb-api :: driver/batch_mode/TestBatchMode.py (1587 of 1995) UNSUPPORTED: lldb-api :: functionalities/tsan/cpp_global_location/TestTsanCPPGlobalLocation.py (1588 of 1995) PASS: lldb-api :: lang/c/find_struct_type/TestFindStructTypes.py (1589 of 1995) PASS: lldb-api :: lang/c/step_over_no_deadlock/TestStepOverDoesntBlock.py (1590 of 1995) PASS: lldb-api :: commands/watchpoints/step_over_watchpoint/TestStepOverWatchpoint.py (1591 of 1995) PASS: lldb-unit :: Utility/./UtilityTests/StatusTest.ErrorConversion (1592 of 1995) PASS: lldb-api :: commands/help/TestHelp.py (1593 of 1995) PASS: lldb-shell :: Breakpoint/debug_rnglistx_rlex.test (1594 of 1995) PASS: lldb-api :: commands/expression/result_numbering/TestResultNumbering.py (1595 of 1995) PASS: lldb-unit :: UnwindAssembly/x86/./UnwindAssemblyx86Tests/Testx86AssemblyInspectionEngine.TestMovRSPtoRBP (1596 of 1995) PASS: lldb-unit :: Utility/./UtilityTests/BinaryStreamTest.PutULEB128NineBytes (1597 of 1995) PASS: lldb-shell :: Reproducer/Functionalities/TestStepping.test (1598 of 1995) PASS: lldb-unit :: Utility/./UtilityTests/SubsystemRAIITest.SubsystemWithErrorSuccess (1599 of 1995) PASS: lldb-unit :: Language/Highlighting/./HighlighterTests/HighlighterTest.DefaultHighlighterWithCursorOutOfBounds (1600 of 1995) PASS: lldb-unit :: ScriptInterpreter/Python/./ScriptInterpreterPythonTests/PythonDataObjectsTest.TestPythonDictionaryToStructuredDictionary (1601 of 1995) PASS: lldb-unit :: Symbol/./SymbolTests/SymbolsTest.TerminateLocateExecutableSymbolFileForUnknownExecutableAndUnknownSymbolFile (1602 of 1995) PASS: lldb-unit :: Language/Highlighting/./HighlighterTests/HighlighterTest.ClangUnterminatedString (1603 of 1995) PASS: lldb-unit :: Symbol/./SymbolTests/TestTypeSystemClang.TestUnifyAccessSpecifiers (1604 of 1995) FAIL: lldb-api :: lang/objc/ptr_refs/TestPtrRefsObjC.py (1605 of 1995) ******************** TEST 'lldb-api :: lang/objc/ptr_refs/TestPtrRefsObjC.py' FAILED ******************** Script: -- /usr/local/bin/python /Users/buildslave/jenkins/workspace/lldb-cmake-sanitized/llvm-project/lldb/test/API/dotest.py --arch x86_64 -s /Users/buildslave/jenkins/workspace/lldb-cmake-sanitized/lldb-build/lldb-test-traces -S nm -u CXXFLAGS -u CFLAGS --codesign-identity lldb_codesign --server /Users/buildslave/jenkins/workspace/lldb-cmake-sanitized/lldb-build/./bin/debugserver --arch x86_64 --build-dir /Users/buildslave/jenkins/workspace/lldb-cmake-sanitized/lldb-build/lldb-test-build.noindex -s=/Users/buildslave/jenkins/workspace/lldb-cmake-sanitized/test/logs -t --env TERM=vt100 --env LLVM_LIBS_DIR=/Users/buildslave/jenkins/workspace/lldb-cmake-sanitized/lldb-build/./lib --inferior-env ASAN_OPTIONS=detect_stack_use_after_return=1 --inferior-env DYLD_INSERT_LIBRARIES=/Users/buildslave/jenkins/workspace/lldb-cmake-sanitized/host-compiler/lib/clang/11.0.0/lib/darwin/libclang_rt.asan_osx_dynamic.dylib --build-dir /Users/buildslave/jenkins/workspace/lldb-cmake-sanitized/lldb-build/lldb-test-build.noindex --lldb-module-cache-dir /Users/buildslave/jenkins/workspace/lldb-cmake-sanitized/lldb-build/lldb-test-build.noindex/module-cache-lldb/lldb-api --clang-module-cache-dir /Users/buildslave/jenkins/workspace/lldb-cmake-sanitized/lldb-build/lldb-test-build.noindex/module-cache-clang/lldb-api --executable /Users/buildslave/jenkins/workspace/lldb-cmake-sanitized/lldb-build/./bin/lldb --compiler /Users/buildslave/jenkins/workspace/lldb-cmake-sanitized/lldb-build/./bin/clang --dsymutil /Users/buildslave/jenkins/workspace/lldb-cmake-sanitized/lldb-build/./bin/dsymutil --filecheck /Users/buildslave/jenkins/workspace/lldb-cmake-sanitized/lldb-build/./bin/FileCheck --lldb-libs-dir /Users/buildslave/jenkins/workspace/lldb-cmake-sanitized/lldb-build/./lib /Users/buildslave/jenkins/workspace/lldb-cmake-sanitized/llvm-project/lldb/test/API/lang/objc/ptr_refs -p TestPtrRefsObjC.py -- Exit Code: 1

Hide Details

Command Output (stdout): -- lldb version 11.0.99 clang revision bbeeb35c1ffaf7aeb3241bdfcb69bf4708370ac1 llvm revision bbeeb35c1ffaf7aeb3241bdfcb69bf4708370ac1 "crashlog" and "save_crashlog" command installed, use the "--help" option for detailed help "malloc_info", "ptr_refs", "cstr_refs", "find_variable", and "objc_refs" commands have been installed, use the "--help" options on these commands for detailed help. LLDB library dir: /Users/buildslave/jenkins/workspace/lldb-cmake-sanitized/lldb-build/bin LLDB import library dir: /Users/buildslave/jenkins/workspace/lldb-cmake-sanitized/lldb-build/./lib libstdcxx tests will not be run because: Don't know how to build with libstdcxx on macosx Skipping following debug info categories: ['dwo'] 0x00007ffee3a58468: stack in frame #0 of thread #1: tid 0x15ebaf in variable at 0x7ffee3a58468: (MyClass *) self = 0x00006020000000d0 0x00007ffee3a583e0: stack (red zone)

Hide Details

-- Command Output (stderr): -- error: 'ptr_refs' is not a valid command. error: 'ptr_refs' is not a valid command.

Hide Details

Session logs for test failures/errors/unexpected successes will go into directory '/Users/buildslave/jenkins/workspace/lldb-cmake-sanitized/test/logs' Command invoked: /Users/buildslave/jenkins/workspace/lldb-cmake-sanitized/llvm-project/lldb/test/API/dotest.py --arch x86_64 -s /Users/buildslave/jenkins/workspace/lldb-cmake-sanitized/lldb-build/lldb-test-traces -S nm -u CXXFLAGS -u CFLAGS --codesign-identity lldb_codesign --server /Users/buildslave/jenkins/workspace/lldb-cmake-sanitized/lldb-build/./bin/debugserver --arch x86_64 --build-dir /Users/buildslave/jenkins/workspace/lldb-cmake-sanitized/lldb-build/lldb-test-build.noindex -s=/Users/buildslave/jenkins/workspace/lldb-cmake-sanitized/test/logs -t --env TERM=vt100 --env LLVM_LIBS_DIR=/Users/buildslave/jenkins/workspace/lldb-cmake-sanitized/lldb-build/./lib --inferior-env ASAN_OPTIONS=detect_stack_use_after_return=1 --inferior-env DYLD_INSERT_LIBRARIES=/Users/buildslave/jenkins/workspace/lldb-cmake-sanitized/host-compiler/lib/clang/11.0.0/lib/darwin/libclang_rt.asan_osx_dynamic.dylib --build-dir /Users/buildslave/jenkins/workspace/lldb-cmake-sanitized/lldb-build/lldb-test-build.noindex --lldb-module-cache-dir /Users/buildslave/jenkins/workspace/lldb-cmake-sanitized/lldb-build/lldb-test-build.noindex/module-cache-lldb/lldb-api --clang-module-cache-dir /Users/buildslave/jenkins/workspace/lldb-cmake-sanitized/lldb-build/lldb-test-build.noindex/module-cache-clang/lldb-api --executable /Users/buildslave/jenkins/workspace/lldb-cmake-sanitized/lldb-build/./bin/lldb --compiler /Users/buildslave/jenkins/workspace/lldb-cmake-sanitized/lldb-build/./bin/clang --dsymutil /Users/buildslave/jenkins/workspace/lldb-cmake-sanitized/lldb-build/./bin/dsymutil --filecheck /Users/buildslave/jenkins/workspace/lldb-cmake-sanitized/lldb-build/./bin/FileCheck --lldb-libs-dir /Users/buildslave/jenkins/workspace/lldb-cmake-sanitized/lldb-build/./lib /Users/buildslave/jenkins/workspace/lldb-cmake-sanitized/llvm-project/lldb/test/API/lang/objc/ptr_refs -p TestPtrRefsObjC.py Change dir to: /Users/buildslave/jenkins/workspace/lldb-cmake-sanitized/llvm-project/lldb/test/API/lang/objc/ptr_refs runCmd: settings clear -all output:

Hide Details

runCmd: settings set symbols.enable-external-lookup false output:

Hide Details

runCmd: settings set target.auto-apply-fixits false output:

Hide Details

runCmd: settings set plugin.process.gdb-remote.packet-timeout 60 output:

Hide Details

runCmd: settings set symbols.clang-modules-cache-path "/Users/buildslave/jenkins/workspace/lldb-cmake-sanitized/lldb-build/lldb-test-build.noindex/module-cache-lldb/lldb-api" output:

Hide Details

runCmd: settings set use-color false output:

Hide Details

runCmd: setting set target.prefer-dynamic-value no-dynamic-values output:

Hide Details

runCmd: settings set target.env-vars ASAN_OPTIONS=detect_stack_use_after_return=1 DYLD_INSERT_LIBRARIES=/Users/buildslave/jenkins/workspace/lldb-cmake-sanitized/host-compiler/lib/clang/11.0.0/lib/darwin/libclang_rt.asan_osx_dynamic.dylib output:

Hide Details

runCmd: script import lldb.macosx.heap output: "crashlog" and "save_crashlog" command installed, use the "--help" option for detailed help "malloc_info", "ptr_refs", "cstr_refs", "find_variable", and "objc_refs" commands have been installed, use the "--help" options on these commands for detailed help.

Hide Details

Hide Details

runCmd: ptr_refs self output: 0x00007ffee3a58468: stack in frame #0 of thread #1: tid 0x15ebaf in variable at 0x7ffee3a58468: (MyClass *) self = 0x00006020000000d0 0x00007ffee3a583e0: stack (red zone)

Hide Details

Hide Details

Expecting sub string: malloc Not matched

Hide Details

FAIL: LLDB (/Users/buildslave/jenkins/workspace/lldb-cmake-sanitized/lldb-build/bin/clang-11-x86_64) :: test_ptr_refs_dsym (TestPtrRefsObjC.TestPtrRefsObjC) <bound method SBProcess.Kill of <lldb.SBProcess; proxy of <Swig Object of type 'lldb::SBProcess *' at 0x129aae960> >>: success

Hide Details

runCmd: settings clear -all output:

Hide Details

runCmd: settings set symbols.enable-external-lookup false output:

Hide Details

runCmd: settings set target.auto-apply-fixits false output:

Hide Details

runCmd: settings set plugin.process.gdb-remote.packet-timeout 60 output:

Hide Details

runCmd: settings set symbols.clang-modules-cache-path "/Users/buildslave/jenkins/workspace/lldb-cmake-sanitized/lldb-build/lldb-test-build.noindex/module-cache-lldb/lldb-api" output:

Hide Details

runCmd: settings set use-color false output:

Hide Details

runCmd: setting set target.prefer-dynamic-value no-dynamic-values output:

Hide Details

runCmd: settings set target.env-vars ASAN_OPTIONS=detect_stack_use_after_return=1 DYLD_INSERT_LIBRARIES=/Users/buildslave/jenkins/workspace/lldb-cmake-sanitized/host-compiler/lib/clang/11.0.0/lib/darwin/libclang_rt.asan_osx_dynamic.dylib output:

Hide Details

runCmd: script import lldb.macosx.heap output:

Hide Details

runCmd: ptr_refs self runCmd failed! error: 'ptr_refs' is not a valid command.

Hide Details

Hide Details

XFAIL: LLDB (/Users/buildslave/jenkins/workspace/lldb-cmake-sanitized/lldb-build/bin/clang-11-x86_64) :: test_ptr_refs_dwarf (TestPtrRefsObjC.TestPtrRefsObjC) <bound method SBProcess.Kill of <lldb.SBProcess; proxy of <Swig Object of type 'lldb::SBProcess *' at 0x1125cea50> >>: success

Hide Details

UNSUPPORTED: LLDB (/Users/buildslave/jenkins/workspace/lldb-cmake-sanitized/lldb-build/bin/clang-11-x86_64) :: test_ptr_refs_dwo (TestPtrRefsObjC.TestPtrRefsObjC) (test case does not fall in any category of interest for this run) runCmd: settings clear -all output:

Hide Details

runCmd: settings set symbols.enable-external-lookup false output:

Hide Details

runCmd: settings set target.auto-apply-fixits false output:

Hide Details

runCmd: settings set plugin.process.gdb-remote.packet-timeout 60 output:

Hide Details

runCmd: settings set symbols.clang-modules-cache-path "/Users/buildslave/jenkins/workspace/lldb-cmake-sanitized/lldb-build/lldb-test-build.noindex/module-cache-lldb/lldb-api" output:

Hide Details

runCmd: settings set use-color false output:

Hide Details

runCmd: setting set target.prefer-dynamic-value no-dynamic-values output:

Hide Details

runCmd: settings set target.env-vars ASAN_OPTIONS=detect_stack_use_after_return=1 DYLD_INSERT_LIBRARIES=/Users/buildslave/jenkins/workspace/lldb-cmake-sanitized/host-compiler/lib/clang/11.0.0/lib/darwin/libclang_rt.asan_osx_dynamic.dylib output:

Hide Details

runCmd: script import lldb.macosx.heap output:

Hide Details

runCmd: ptr_refs self runCmd failed! error: 'ptr_refs' is not a valid command.

Hide Details

Hide Details

XFAIL: LLDB (/Users/buildslave/jenkins/workspace/lldb-cmake-sanitized/lldb-build/bin/clang-11-x86_64) :: test_ptr_refs_gmodules (TestPtrRefsObjC.TestPtrRefsObjC) <bound method SBProcess.Kill of <lldb.SBProcess; proxy of <Swig Object of type 'lldb::SBProcess *' at 0x129aae2a0> >>: success

Hide Details

Restore dir to: /Users/buildslave/jenkins/workspace/lldb-cmake-sanitized/lldb-build/tools/lldb/test ====================================================================== FAIL: test_ptr_refs_dsym (TestPtrRefsObjC.TestPtrRefsObjC) Test the ptr_refs tool on Darwin with Objective-C ---------------------------------------------------------------------- Traceback (most recent call last): File "/Users/buildslave/jenkins/workspace/lldb-cmake-sanitized/llvm-project/lldb/packages/Python/lldbsuite/test/lldbtest.py", line 1751, in test_method return attrvalue(self) File "/Users/buildslave/jenkins/workspace/lldb-cmake-sanitized/llvm-project/lldb/packages/Python/lldbsuite/test/decorators.py", line 110, in wrapper func(*args, **kwargs) File "/Users/buildslave/jenkins/workspace/lldb-cmake-sanitized/llvm-project/lldb/test/API/lang/objc/ptr_refs/TestPtrRefsObjC.py", line 47, in test_ptr_refs self.expect("ptr_refs self", substrs=["malloc", "stack"]) File "/Users/buildslave/jenkins/workspace/lldb-cmake-sanitized/llvm-project/lldb/packages/Python/lldbsuite/test/lldbtest.py", line 2391, in expect if msg else EXP_MSG(str, output, exe)) AssertionError: False is not True : 'ptr_refs self' returns expected result, got '0x00007ffee3a58468: stack in frame #0 of thread #1: tid 0x15ebaf in variable at 0x7ffee3a58468: (MyClass *) self = 0x00006020000000d0 0x00007ffee3a583e0: stack (red zone)' Config=x86_64-/Users/buildslave/jenkins/workspace/lldb-cmake-sanitized/lldb-build/bin/clang-11 ---------------------------------------------------------------------- Ran 4 tests in 23.379s

Hide Details

RESULT: FAILED (0 passes, 1 failures, 0 errors, 1 skipped, 2 expected failures, 0 unexpected successes)

Hide Details

--

Hide Details

******************** PASS: lldb-api :: functionalities/plugins/command_plugin/TestPluginCommands.py (1606 of 1995) PASS: lldb-shell :: Settings/TestDisassemblyFormat.test (1607 of 1995) PASS: lldb-shell :: Reproducer/TestGDBRemoteRepro.test (1608 of 1995) PASS: lldb-api :: python_api/hello_world/TestHelloWorld.py (1609 of 1995) PASS: lldb-api :: lang/cpp/dynamic-value/TestDynamicValue.py (1610 of 1995) PASS: lldb-unit :: Target/./TargetTests/ExecutionContextTest.GetByteOrderTarget (1611 of 1995) UNSUPPORTED: lldb-api :: functionalities/param_entry_vals/basic_entry_values_x86_64/TestBasicEntryValuesX86_64.py (1612 of 1995) PASS: lldb-api :: lang/cpp/offsetof/TestOffsetofCpp.py (1613 of 1995) PASS: lldb-api :: functionalities/testid/TestTestId.py (1614 of 1995) PASS: lldb-api :: python_api/watchpoint/watchlocation/TestTargetWatchAddress.py (1615 of 1995) PASS: lldb-unit :: Utility/./UtilityTests/OptionsWithRawTest.EmptyInput (1616 of 1995) PASS: lldb-unit :: Process/gdb-remote/./ProcessGdbRemoteTests/GDBRemoteCommunicationClientTest.GetModulesInfoInvalidResponse (1617 of 1995) PASS: lldb-api :: functionalities/data-formatter/data-formatter-stl/libcxx/function/TestLibCxxFunction.py (1618 of 1995) PASS: lldb-api :: macosx/thread_suspend/TestInternalThreadSuspension.py (1619 of 1995) PASS: lldb-api :: api/command-return-object/TestSBCommandReturnObject.py (1620 of 1995) PASS: lldb-api :: commands/frame/diagnose/bad-reference/TestBadReference.py (1621 of 1995) PASS: lldb-api :: tools/lldb-vscode/launch/TestVSCode_launch.py (1622 of 1995) PASS: lldb-api :: lang/cpp/nested-class-other-compilation-unit/TestNestedClassWithParentInAnotherCU.py (1623 of 1995) PASS: lldb-unit :: UnwindAssembly/x86/./UnwindAssemblyx86Tests/Testx86AssemblyInspectionEngine.TestDisassemblyMidFunctionEpilogues (1624 of 1995) PASS: lldb-unit :: Utility/./UtilityTests/OptionsWithRawTest.ArgsButNoLeadingDash (1625 of 1995) PASS: lldb-unit :: Utility/./UtilityTests/VMRange.CollectionContains (1626 of 1995) PASS: lldb-api :: macosx/profile_vrs_detach/TestDetachVrsProfile.py (1627 of 1995) PASS: lldb-unit :: Utility/./UtilityTests/StringExtractorTest.DecodeHexU8_InvalidHex2 (1628 of 1995) PASS: lldb-unit :: Target/./TargetTests/MemoryRegionInfoTest.Formatv (1629 of 1995) PASS: lldb-shell :: SymbolFile/DWARF/debug_loclists-dwo.s (1630 of 1995) PASS: lldb-unit :: Language/Highlighting/./HighlighterTests/HighlighterTest.ClangTrailingBackslashWithWhitespace (1631 of 1995) PASS: lldb-unit :: UnwindAssembly/x86/./UnwindAssemblyx86Tests/Testx86AssemblyInspectionEngine.TestPushRBX (1632 of 1995) PASS: lldb-unit :: Symbol/./SymbolTests/TestTypeSystemClang.TestRecordHasFields (1633 of 1995) PASS: lldb-unit :: Editline/./EditlineTests/EditlineTestFixture.EditlineReceivesSingleLineText (1634 of 1995) PASS: lldb-unit :: Process/minidump/./LLDBMinidumpTests/MinidumpParserTest.GetFilteredModuleList (1635 of 1995) PASS: lldb-unit :: Host/./HostTests/ConnectionFileDescriptorTest.TCPGetURIv4 (1636 of 1995) PASS: lldb-api :: functionalities/data-formatter/data-formatter-objc/nsindexpath/TestDataFormatterNSIndexPath.py (1637 of 1995) PASS: lldb-unit :: Utility/./UtilityTests/SerializationRountripTest.SerializeDeserializeObjectPointer (1638 of 1995) PASS: lldb-api :: functionalities/data-formatter/type_summary_list_arg/TestTypeSummaryListArg.py (1639 of 1995) PASS: lldb-unit :: UnwindAssembly/x86/./UnwindAssemblyx86Tests/Testx86AssemblyInspectionEngine.TestPushESI (1640 of 1995) PASS: lldb-unit :: Utility/./UtilityTests/FileSpecTest.GuessPathStyle (1641 of 1995) PASS: lldb-api :: python_api/frame/inlines/TestInlinedFrame.py (1642 of 1995) PASS: lldb-api :: types/TestCharTypeExpr.py (1643 of 1995) PASS: lldb-shell :: Breakpoint/implicit_const_form_support.test (1644 of 1995) PASS: lldb-unit :: Utility/./UtilityTests/BinaryStreamTest.PutSLEB128SixBytes (1645 of 1995) PASS: lldb-api :: commands/expression/regression-access-function-template-in-record/TestRegressionAccessFunctionTemplateInRecord.py (1646 of 1995) PASS: lldb-unit :: Utility/./UtilityTests/VMRange.Reset (1647 of 1995) PASS: lldb-unit :: Utility/./UtilityTests/ScalarTest.ComparisonFloat (1648 of 1995) PASS: lldb-api :: python_api/function_symbol/TestSymbolAPI.py (1649 of 1995) PASS: lldb-unit :: Utility/./UtilityTests/StringExtractorTest.GetHexU8_Underflow2_NoEof (1650 of 1995) PASS: lldb-api :: functionalities/load_unload/TestLoadUnload.py (1651 of 1995) XFAIL: lldb-shell :: SymbolFile/DWARF/find-type-in-function.cpp (1652 of 1995) PASS: lldb-unit :: Process/gdb-remote/./ProcessGdbRemoteTests/GDBRemoteCommunicationClientTest.SendSignalsToIgnore (1653 of 1995) PASS: lldb-api :: commands/expression/namespace_local_var_same_name_obj_c/TestNamespaceLocalVarSameNameObjC.py (1654 of 1995) PASS: lldb-unit :: Core/./LLDBCoreTests/StreamCallbackTest.Callback (1655 of 1995) PASS: lldb-api :: functionalities/breakpoint/address_breakpoints/TestAddressBreakpoints.py (1656 of 1995) PASS: lldb-shell :: ObjectFile/wasm/basic.yaml (1657 of 1995) PASS: lldb-unit :: Utility/./UtilityTests/RecordReplayTest.InstrumentedFoo (1658 of 1995) PASS: lldb-shell :: Breakpoint/case-sensitive.test (1659 of 1995) PASS: lldb-unit :: UnwindAssembly/x86/./UnwindAssemblyx86Tests/Testx86AssemblyInspectionEngine.TestSpillRegToStackViaMOVx86_64 (1660 of 1995) PASS: lldb-api :: functionalities/data-formatter/data-formatter-synth/TestDataFormatterSynth.py (1661 of 1995) PASS: lldb-api :: lang/objc/objc-property/TestObjCProperty.py (1662 of 1995) PASS: lldb-unit :: Utility/./UtilityTests/BinaryStreamTest.PutSLEB128EightBytes (1663 of 1995) PASS: lldb-api :: functionalities/conditional_break/TestConditionalBreak.py (1664 of 1995) PASS: lldb-api :: functionalities/data-formatter/data-formatter-objc/cmtime/TestDataFormatterCMTime.py (1665 of 1995) PASS: lldb-unit :: Language/CPlusPlus/./LanguageCPlusPlusTests/CPlusPlusLanguage.MethodNameParsing (1666 of 1995) PASS: lldb-api :: tools/lldb-server/TestGdbRemoteSingleStep.py (1667 of 1995) PASS: lldb-api :: functionalities/gdb_remote_client/TestNestedRegDefinitions.py (1668 of 1995) PASS: lldb-api :: functionalities/postmortem/elf-core/TestLinuxCore.py (1669 of 1995) PASS: lldb-api :: lang/cpp/namespace/TestNamespace.py (1670 of 1995) PASS: lldb-unit :: UnwindAssembly/x86/./UnwindAssemblyx86Tests/Testx86AssemblyInspectionEngine.TestPushR15 (1671 of 1995) PASS: lldb-api :: commands/expression/import-std-module/deque-basic/TestDequeFromStdModule.py (1672 of 1995) PASS: lldb-api :: types/TestRecursiveTypes.py (1673 of 1995) PASS: lldb-unit :: UnwindAssembly/x86/./UnwindAssemblyx86Tests/Testx86AssemblyInspectionEngine.TestSubESP (1674 of 1995) PASS: lldb-unit :: Utility/./UtilityTests/StringExtractorTest.GetHexBytesAvail (1675 of 1995) UNSUPPORTED: lldb-api :: functionalities/darwin_log/filter/regex/activity-chain/TestDarwinLogFilterRegexActivityChain.py (1676 of 1995) PASS: lldb-api :: python_api/sbvalue_persist/TestSBValuePersist.py (1677 of 1995) PASS: lldb-api :: functionalities/data-formatter/data-formatter-stl/libcxx/forward_list/TestDataFormatterLibcxxForwardList.py (1678 of 1995) PASS: lldb-unit :: Utility/./UtilityTests/StringExtractorTest.InitEmpty (1679 of 1995) PASS: lldb-api :: functionalities/dynamic_value_child_count/TestDynamicValueChildCount.py (1680 of 1995) PASS: lldb-unit :: Utility/./UtilityTests/RangeTest.DoesIntersect (1681 of 1995) PASS: lldb-unit :: Symbol/./SymbolTests/TestTypeSystemClang.TestGetTypeClassDeclType (1682 of 1995) PASS: lldb-api :: commands/expression/import-std-module/vector-of-vectors/TestVectorOfVectorsFromStdModule.py (1683 of 1995) PASS: lldb-api :: functionalities/data-formatter/array_typedef/TestArrayTypedef.py (1684 of 1995) PASS: lldb-shell :: SymbolFile/NativePDB/function-types-calling-conv.cpp (1685 of 1995) PASS: lldb-unit :: Utility/./UtilityTests/StreamTeeTest.DefaultConstructor (1686 of 1995) UNSUPPORTED: lldb-api :: functionalities/tsan/thread_leak/TestTsanThreadLeak.py (1687 of 1995) PASS: lldb-unit :: Utility/./UtilityTests/ScalarTest.APIntConstructor (1688 of 1995) PASS: lldb-unit :: Utility/./UtilityTests/LogTest.Register (1689 of 1995) PASS: lldb-unit :: Utility/./UtilityTests/NameMatchesTest.Contains (1690 of 1995) PASS: lldb-api :: functionalities/signal/handle-abrt/TestHandleAbort.py (1691 of 1995) PASS: lldb-api :: lang/cpp/inlines/TestInlines.py (1692 of 1995) PASS: lldb-unit :: Utility/./UtilityTests/CompletionRequest.TryCompleteCurrentArgBad (1693 of 1995) PASS: lldb-unit :: Expression/./ExpressionTests/CppModuleConfigurationTest.Sysroot (1694 of 1995) PASS: lldb-unit :: Host/./HostTests/NativeProcessProtocolTest.ReadMemoryWithoutTrap (1695 of 1995) UNSUPPORTED: lldb-shell :: ScriptInterpreter/Lua/persistent_state.test (1696 of 1995) PASS: lldb-api :: functionalities/breakpoint/breakpoint_command/TestBreakpointCommandsFromPython.py (1697 of 1995) PASS: lldb-api :: functionalities/paths/TestPaths.py (1698 of 1995) UNSUPPORTED: lldb-api :: functionalities/darwin_log/filter/regex/message/TestDarwinLogFilterRegexMessage.py (1699 of 1995) PASS: lldb-api :: functionalities/breakpoint/move_nearest/TestMoveNearest.py (1700 of 1995) PASS: lldb-api :: functionalities/deleted-executable/TestDeletedExecutable.py (1701 of 1995) PASS: lldb-unit :: ScriptInterpreter/Python/./ScriptInterpreterPythonTests/PythonDataObjectsTest.TestBorrowedReferences (1702 of 1995) PASS: lldb-api :: functionalities/thread/concurrent_events/TestConcurrentCrashWithWatchpoint.py (1703 of 1995) PASS: lldb-api :: python_api/symbol-context/TestSymbolContext.py (1704 of 1995) PASS: lldb-unit :: Utility/./UtilityTests/StringListTest.LongestCommonPrefixEmpty (1705 of 1995) PASS: lldb-shell :: Quit/TestQuitExitCodeImplicit0.test (1706 of 1995) PASS: lldb-unit :: Expression/./ExpressionTests/CppModuleConfigurationTest.UnrelatedLibrary (1707 of 1995) UNSUPPORTED: lldb-shell :: Register/x86-64-gp-write.test (1708 of 1995) PASS: lldb-unit :: UnwindAssembly/x86/./UnwindAssemblyx86Tests/Testx86AssemblyInspectionEngine.TestPopEDI (1709 of 1995) PASS: lldb-shell :: Commands/CommandScriptImmediateOutput/CommandScriptImmediateOutputFile.test (1710 of 1995) PASS: lldb-api :: commands/expression/expr-in-syscall/TestExpressionInSyscall.py (1711 of 1995) PASS: lldb-api :: lang/cpp/class_types/TestClassTypesDisassembly.py (1712 of 1995) PASS: lldb-shell :: ObjectFile/ELF/PT_LOAD-overlap-section.yaml (1713 of 1995) PASS: lldb-unit :: Utility/./UtilityTests/StringListTest.JoinSingle (1714 of 1995) PASS: lldb-api :: commands/expression/dollar-in-variable/TestDollarInVariable.py (1715 of 1995) PASS: lldb-unit :: Utility/./UtilityTests/StreamTest.PutHex16ByteOrderBig (1716 of 1995) PASS: lldb-api :: commands/expression/inline-namespace/TestInlineNamespace.py (1717 of 1995) PASS: lldb-unit :: Utility/./UtilityTests/FileSpecTest.GetPath (1718 of 1995) UNSUPPORTED: lldb-api :: functionalities/darwin_log/filter/exact_match/activity-chain/TestDarwinLogFilterMatchActivityChain.py (1719 of 1995) PASS: lldb-unit :: UnwindAssembly/x86/./UnwindAssemblyx86Tests/Testx86AssemblyInspectionEngine.Test32bitFramelessSmallStackFrame (1720 of 1995) UNSUPPORTED: lldb-api :: benchmarks/stepping/TestSteppingSpeed.py (1721 of 1995) PASS: lldb-unit :: Utility/./UtilityTests/StreamTest.AddressEmptyPrefix (1722 of 1995) PASS: lldb-api :: python_api/breakpoint/TestBreakpointAPI.py (1723 of 1995) PASS: lldb-unit :: Utility/./UtilityTests/UUIDTest.StringConverion (1724 of 1995) PASS: lldb-api :: commands/expression/timeout/TestCallWithTimeout.py (1725 of 1995) PASS: lldb-api :: commands/add-dsym/uuid/TestAddDsymCommand.py (1726 of 1995) PASS: lldb-shell :: ObjectFile/ELF/aarch64-relocations.yaml (1727 of 1995) PASS: lldb-unit :: Utility/./UtilityTests/VASprintfTest.BufferResize (1728 of 1995) PASS: lldb-api :: macosx/dyld-trie-symbols/TestDyldTrieSymbols.py (1729 of 1995) PASS: lldb-shell :: BuildScript/modes.test (1730 of 1995) PASS: lldb-api :: tools/lldb-vscode/breakpoint/TestVSCode_setBreakpoints.py (1731 of 1995) PASS: lldb-unit :: Utility/./UtilityTests/StringExtractorTest.DecodeHexU8_Underflow2 (1732 of 1995) PASS: lldb-unit :: Utility/./UtilityTests/SerializationRountripTest.SerializeDeserializeObjectReference (1733 of 1995) PASS: lldb-api :: functionalities/breakpoint/global_constructor/TestBreakpointInGlobalConstructor.py (1734 of 1995) PASS: lldb-unit :: Utility/./UtilityTests/StreamTest.PutCStringWithStringRef (1735 of 1995) PASS: lldb-unit :: Utility/./UtilityTests/ArgsTest.GetArgumentArrayRef (1736 of 1995) PASS: lldb-unit :: Utility/./UtilityTests/ArgsTest.ReplaceArgumentAtIndexEqual (1737 of 1995) PASS: lldb-api :: commands/expression/vector_of_enums/TestVectorOfEnums.py (1738 of 1995) PASS: lldb-unit :: Utility/./UtilityTests/RangeTest.SizeTypes (1739 of 1995) PASS: lldb-unit :: Expression/./ExpressionTests/CppModuleConfigurationTest.MissingLibCpp (1740 of 1995) PASS: lldb-api :: functionalities/thread/concurrent_events/TestConcurrentCrashWithBreak.py (1741 of 1995) PASS: lldb-shell :: SymbolFile/NativePDB/break-by-function.cpp (1742 of 1995) PASS: lldb-api :: lang/c/local_types/TestUseClosestType.py (1743 of 1995) PASS: lldb-unit :: Expression/./ExpressionTests/DiagnosticManagerTest.AppendMessageNoDiag (1744 of 1995) PASS: lldb-unit :: Utility/./UtilityTests/BroadcasterTest.EventTypeHasListeners (1745 of 1995) PASS: lldb-api :: lang/cpp/auto/TestCPPAuto.py (1746 of 1995) PASS: lldb-unit :: Utility/./UtilityTests/StringListTest.JoinEmpty (1747 of 1995) PASS: lldb-api :: commands/expression/completion-crash-incomplete-record/TestCompletionCrashIncompleteRecord.py (1748 of 1995) PASS: lldb-shell :: Reproducer/Modules/TestModuleCXX.test (1749 of 1995) PASS: lldb-api :: lang/cpp/class_types/TestClassTypes.py (1750 of 1995) PASS: lldb-unit :: Utility/./UtilityTests/ArgsTest.TestInsertArg (1751 of 1995) PASS: lldb-api :: macosx/find-app-in-bundle/TestFindAppInBundle.py (1752 of 1995) PASS: lldb-unit :: Process/minidump/./LLDBMinidumpTests/MinidumpParserTest.GetMiscInfo_no_stream (1753 of 1995) PASS: lldb-unit :: Utility/./UtilityTests/StreamTeeTest.GetStreamAtIndexOutOfBoundsEmpty (1754 of 1995) PASS: lldb-api :: functionalities/breakpoint/breakpoint_by_line_and_column/TestBreakpointByLineAndColumn.py (1755 of 1995) PASS: lldb-unit :: ObjectFile/Breakpad/./ObjectFileBreakpadTests/FileRecord.parse (1756 of 1995) PASS: lldb-shell :: SymbolFile/Breakpad/unwind-via-stack-win.test (1757 of 1995) UNSUPPORTED: lldb-shell :: SymbolFile/PDB/compilands.test (1758 of 1995) PASS: lldb-unit :: Utility/./UtilityTests/ArchSpecTest.Compatibility (1759 of 1995) PASS: lldb-shell :: Breakpoint/split-dwarf-5-addrbase.test (1760 of 1995) PASS: lldb-unit :: Utility/./UtilityTests/StringListTest.Join (1761 of 1995) PASS: lldb-api :: functionalities/thread/concurrent_events/TestConcurrentTwoWatchpointsOneDelayBreakpoint.py (1762 of 1995) PASS: lldb-api :: lang/cpp/class-template-parameter-pack/TestClassTemplateParameterPack.py (1763 of 1995) PASS: lldb-api :: functionalities/thread/concurrent_events/TestConcurrentSignalWatchBreak.py (1764 of 1995) PASS: lldb-unit :: Utility/./UtilityTests/StringListTest.ForRange (1765 of 1995) PASS: lldb-shell :: Reproducer/TestReuseDirectory.test (1766 of 1995) PASS: lldb-api :: lang/objc/self/TestObjCSelf.py (1767 of 1995) PASS: lldb-api :: api/log/TestAPILog.py (1768 of 1995) PASS: lldb-shell :: ObjectFile/MachO/lc_build_version_notools.yaml (1769 of 1995) PASS: lldb-unit :: Utility/./UtilityTests/OptionsWithRawTest.MultiWordSuffix (1770 of 1995) PASS: lldb-shell :: SymbolFile/DWARF/dir-separator-windows.s (1771 of 1995) PASS: lldb-shell :: SymbolFile/NativePDB/break-by-line.cpp (1772 of 1995) PASS: lldb-api :: functionalities/thread/concurrent_events/TestConcurrentSignalDelayWatch.py (1773 of 1995) PASS: lldb-shell :: ObjectFile/ELF/PT_LOAD.yaml (1774 of 1995) PASS: lldb-unit :: Utility/./UtilityTests/StringListTest.SplitIntoLinesSingleTrailingCR (1775 of 1995) PASS: lldb-api :: functionalities/gdb_remote_client/TestNoWatchpointSupportInfo.py (1776 of 1995) PASS: lldb-unit :: Utility/./UtilityTests/AnsiTerminal.AtEnd (1777 of 1995) PASS: lldb-unit :: Utility/./UtilityTests/LogChannelEnabledTest.log_options (1778 of 1995) PASS: lldb-unit :: Utility/./UtilityTests/StringListTest.InsertStringAtIndexStart (1779 of 1995) PASS: lldb-unit :: Utility/./UtilityTests/StreamTest.ShiftOperatorChars (1780 of 1995) PASS: lldb-shell :: ObjectFile/MachO/lc_version_min.yaml (1781 of 1995) PASS: lldb-api :: commands/expression/rdar42038760/TestScalarURem.py (1782 of 1995) PASS: lldb-unit :: Process/minidump/./LLDBMinidumpTests/MinidumpParserTest.GetMiscInfoWindows (1783 of 1995) PASS: lldb-api :: commands/watchpoints/watchpoint_commands/condition/TestWatchpointConditionCmd.py (1784 of 1995) PASS: lldb-shell :: BuildScript/script-args.test (1785 of 1995) PASS: lldb-unit :: ScriptInterpreter/Python/./ScriptInterpreterPythonTests/PythonDataObjectsTest.TestPythonListValueEquality (1786 of 1995) PASS: lldb-unit :: Utility/./UtilityTests/FileSpecTest.PrependPathComponent (1787 of 1995) PASS: lldb-unit :: Utility/./UtilityTests/SharedCluster.ClusterManager (1788 of 1995) PASS: lldb-unit :: SymbolFile/DWARF/./SymbolFileDWARFTests/SymbolFileDWARFTests.TestAbilitiesForDWARF (1789 of 1995) PASS: lldb-api :: tools/lldb-vscode/breakpoint/TestVSCode_setFunctionBreakpoints.py (1790 of 1995) PASS: lldb-unit :: Utility/./UtilityTests/StringExtractorTest.GetHexBytesAvail_FullString (1791 of 1995) PASS: lldb-api :: commands/command/script_alias/TestCommandScriptAlias.py (1792 of 1995) UNSUPPORTED: lldb-shell :: Register/x86-64-ymm16-write.test (1793 of 1995) UNSUPPORTED: lldb-shell :: ScriptInterpreter/Lua/watchpoint_callback.test (1794 of 1995) PASS: lldb-api :: commands/target/dump-symtab-demangle/TestDumpSymtabDemangle.py (1795 of 1995) PASS: lldb-unit :: Process/gdb-remote/./ProcessGdbRemoteTests/GDBRemoteCommunicationTest.ReadPacket_checksum (1796 of 1995) PASS: lldb-api :: functionalities/thread/concurrent_events/TestConcurrentManyWatchpoints.py (1797 of 1995) PASS: lldb-unit :: Utility/./UtilityTests/SerializationRountripTest.SerializeDeserializePod (1798 of 1995) PASS: lldb-shell :: Breakpoint/split-dwarf5-debug-stroffsets.test (1799 of 1995) PASS: lldb-unit :: UnwindAssembly/x86/./UnwindAssemblyx86Tests/Testx86AssemblyInspectionEngine.TestPushEAX (1800 of 1995) PASS: lldb-unit :: Utility/./UtilityTests/ArgsTest.TestUnknownEscape (1801 of 1995) PASS: lldb-unit :: Utility/./UtilityTests/SubsystemRAIITest.SubsystemWithErrorFailure (1802 of 1995) UNSUPPORTED: lldb-api :: terminal/TestEditline.py (1803 of 1995) PASS: lldb-shell :: ObjectFile/PECOFF/basic-info.yaml (1804 of 1995) PASS: lldb-api :: functionalities/data-formatter/format-propagation/TestFormatPropagation.py (1805 of 1995) PASS: lldb-unit :: Utility/./UtilityTests/StringListTest.GetSize (1806 of 1995) PASS: lldb-unit :: Utility/./UtilityTests/StreamTest.ChangingByteOrder (1807 of 1995) PASS: lldb-unit :: Host/./HostTests/FileActionTest.Open (1808 of 1995) PASS: lldb-api :: types/TestIntegerType.py (1809 of 1995) PASS: lldb-unit :: Utility/./UtilityTests/Flags.IsClear (1810 of 1995) PASS: lldb-shell :: Minidump/memory-region.yaml (1811 of 1995) PASS: lldb-api :: lang/objc/ivar-IMP/TestObjCiVarIMP.py (1812 of 1995) PASS: lldb-api :: python_api/class_members/TestSBTypeClassMembers.py (1813 of 1995) PASS: lldb-unit :: UnwindAssembly/x86/./UnwindAssemblyx86Tests/Testx86AssemblyInspectionEngine.Test64bitFramelessSmallStackFrame (1814 of 1995) PASS: lldb-unit :: Host/./HostTests/NativeProcessProtocolTest.SetBreakpointFailVerify (1815 of 1995) UNSUPPORTED: lldb-api :: api/multiple-debuggers/TestMultipleDebuggers.py (1816 of 1995) PASS: lldb-unit :: Utility/./UtilityTests/AnsiTerminal.Twice (1817 of 1995) PASS: lldb-unit :: ScriptInterpreter/Python/./ScriptInterpreterPythonTests/PythonDataObjectsTest.TestDictionaryResolutionWithDot (1818 of 1995) PASS: lldb-unit :: Symbol/./SymbolTests/DWARFCallFrameInfoTest.Basic_eh (1819 of 1995) PASS: lldb-shell :: SymbolFile/DWARF/DW_OP_piece-smaller-than-struct.s (1820 of 1995) PASS: lldb-api :: functionalities/breakpoint/serialize/TestBreakpointSerialization.py (1821 of 1995) PASS: lldb-api :: functionalities/gdb_remote_client/TestIOSSimulator.py (1822 of 1995) PASS: lldb-api :: lang/cpp/covariant-return-types/TestCovariantReturnTypes.py (1823 of 1995) PASS: lldb-shell :: Recognizer/assert.test (1824 of 1995) UNSUPPORTED: lldb-shell :: SymbolFile/target-symbols-add-unwind.test (1825 of 1995) PASS: lldb-api :: commands/expression/options/TestExprOptions.py (1826 of 1995) PASS: lldb-unit :: Utility/./UtilityTests/FileSpecTest.FormatFileSpec (1827 of 1995) PASS: lldb-api :: lang/objc/unicode-string/TestUnicodeString.py (1828 of 1995) PASS: lldb-api :: commands/command/script/TestCommandScript.py (1829 of 1995) PASS: lldb-unit :: Utility/./UtilityTests/UriParserTest.SchemeHostSeparator2 (1830 of 1995) PASS: lldb-api :: lang/cpp/call-function/TestCallCPPFunction.py (1831 of 1995) PASS: lldb-api :: lang/cpp/stl/TestSTL.py (1832 of 1995) PASS: lldb-unit :: DataFormatter/./LLDBFormatterTests/FormatManagerTests.CompatibleLangs (1833 of 1995) PASS: lldb-unit :: UnwindAssembly/x86/./UnwindAssemblyx86Tests/Testx86AssemblyInspectionEngine.TestReturnDetect (1834 of 1995) PASS: lldb-unit :: ScriptInterpreter/Python/./ScriptInterpreterPythonTests/PythonDataObjectsTest.TestPythonCallableInvoke (1835 of 1995) PASS: lldb-api :: commands/expression/call-function/TestCallStdStringFunction.py (1836 of 1995) PASS: lldb-api :: python_api/findvalue_duplist/TestSBFrameFindValue.py (1837 of 1995) PASS: lldb-api :: tools/lldb-vscode/breakpoint-events/TestVSCode_breakpointEvents.py (1838 of 1995) PASS: lldb-unit :: Utility/./UtilityTests/StringListTest.InsertStringAtIndexStdString (1839 of 1995) PASS: lldb-unit :: UnwindAssembly/x86/./UnwindAssemblyx86Tests/Testx86AssemblyInspectionEngine.TestPushEDI (1840 of 1995) PASS: lldb-unit :: Host/./HostTests/SocketAddressTest.GetAddressInfo (1841 of 1995) PASS: lldb-api :: commands/target/basic/TestTargetCommand.py (1842 of 1995) PASS: lldb-unit :: Expression/./ExpressionTests/DiagnosticManagerTest.PutStringMultiple (1843 of 1995) PASS: lldb-unit :: Process/minidump/./LLDBMinidumpTests/MinidumpParserTest.GetThreadContext_x86_32 (1844 of 1995) PASS: lldb-api :: functionalities/postmortem/mach-core/TestMachCore.py (1845 of 1995) PASS: lldb-api :: commands/expression/static-initializers/TestStaticInitializers.py (1846 of 1995) PASS: lldb-api :: functionalities/breakpoint/scripted_bkpt/TestScriptedResolver.py (1847 of 1995) PASS: lldb-api :: functionalities/thread/jump/TestThreadJump.py (1848 of 1995) PASS: lldb-shell :: SymbolFile/Breakpad/unwind-via-stack-win-no-memory-info.yaml (1849 of 1995) PASS: lldb-api :: commands/statistics/basic/TestStats.py (1850 of 1995) PASS: lldb-unit :: Utility/./UtilityTests/ArgsTest.TestAppendArg (1851 of 1995) PASS: lldb-unit :: SymbolFile/NativePDB/./SymbolFileNativePDBTests/PDBFPOProgramToDWARFExpressionTests.UnsupportedRASearch (1852 of 1995) PASS: lldb-api :: lang/cpp/namespace_conflicts/TestNamespaceConflicts.py (1853 of 1995) PASS: lldb-unit :: Utility/./UtilityTests/LogChannelEnabledTest.LLDB_LOG_ERROR (1854 of 1995) PASS: lldb-api :: functionalities/stats_api/TestStatisticsAPI.py (1855 of 1995) PASS: lldb-api :: commands/expression/import-std-module/shared_ptr-dbg-info-content/TestSharedPtrDbgInfoContentFromStdModule.py (1856 of 1995) UNSUPPORTED: lldb-shell :: Register/x86-gp-read.test (1857 of 1995) PASS: lldb-api :: functionalities/data-formatter/language_category_updates/TestDataFormatterLanguageCategoryUpdates.py (1858 of 1995) PASS: lldb-api :: lang/objc/modules-app-update/TestClangModulesAppUpdate.py (1859 of 1995) PASS: lldb-api :: types/TestShortType.py (1860 of 1995) PASS: lldb-unit :: Host/./HostTests/FileSystemTest.GetByteSize (1861 of 1995) PASS: lldb-shell :: Minidump/fb-dump.test (1862 of 1995) PASS: lldb-unit :: UnwindAssembly/x86/./UnwindAssemblyx86Tests/Testx86AssemblyInspectionEngine.TestPushR14 (1863 of 1995) PASS: lldb-unit :: Utility/./UtilityTests/XcodeSDKTest.GetSDKNameForType (1864 of 1995) PASS: lldb-unit :: ObjectFile/ELF/./ObjectFileELFTests/ObjectFileELFTest.GetModuleSpecifications_EarlySectionHeaders (1865 of 1995) PASS: lldb-unit :: Symbol/./SymbolTests/LineEntryTest.GetSameLineContiguousAddressRangeOneInline (1866 of 1995) PASS: lldb-api :: python_api/sbvalue_const_addrof/TestSBValueConstAddrOf.py (1867 of 1995) PASS: lldb-api :: functionalities/data-formatter/summary-string-onfail/Test-rdar-9974002.py (1868 of 1995) PASS: lldb-api :: commands/breakpoint/command/list/TestBreakpointCommandList.py (1869 of 1995) PASS: lldb-api :: functionalities/thread/concurrent_events/TestConcurrentWatchBreak.py (1870 of 1995) PASS: lldb-unit :: Utility/./UtilityTests/UriParserTest.TypicalPortPathIPv6 (1871 of 1995) PASS: lldb-unit :: ScriptInterpreter/Python/./ScriptInterpreterPythonTests/PythonDataObjectsTest.TestPythonString (1872 of 1995) PASS: lldb-shell :: ObjectFile/ELF/section-addresses.yaml (1873 of 1995) PASS: lldb-unit :: Host/./HostTests/File.GetWaitableHandleFileno (1874 of 1995) UNSUPPORTED: lldb-shell :: SymbolFile/NativePDB/typedefs.cpp (1875 of 1995) PASS: lldb-unit :: Utility/./UtilityTests/StringLexerTest.AdvanceIf (1876 of 1995) PASS: lldb-unit :: Utility/./UtilityTests/ProcessInstanceInfoMatch.Name (1877 of 1995) PASS: lldb-api :: functionalities/thread/thread_specific_break/TestThreadSpecificBreakpoint.py (1878 of 1995) PASS: lldb-unit :: SymbolFile/DWARF/./SymbolFileDWARFTests/SymbolFileDWARFTests.ParseArangesNonzeroSegmentSize (1879 of 1995) PASS: lldb-unit :: SymbolFile/NativePDB/./SymbolFileNativePDBTests/PDBFPOProgramToDWARFExpressionTests.MultipleIndependentAssignments (1880 of 1995) PASS: lldb-api :: functionalities/history/TestHistoryRecall.py (1881 of 1995) PASS: lldb-api :: python_api/sbplatform/TestSBPlatform.py (1882 of 1995) PASS: lldb-unit :: Language/Highlighting/./HighlighterTests/HighlighterTest.FallbackHighlighter (1883 of 1995) PASS: lldb-unit :: Utility/./UtilityTests/UriParserTest.SchemeHostSeparator (1884 of 1995) PASS: lldb-unit :: UnwindAssembly/x86/./UnwindAssemblyx86Tests/Testx86AssemblyInspectionEngine.TestSpArithx86_64Augmented (1885 of 1995) PASS: lldb-api :: functionalities/postmortem/minidump-new/TestMiniDumpUUID.py (1886 of 1995) PASS: lldb-shell :: SymbolFile/NativePDB/source-list.cpp (1887 of 1995) PASS: lldb-shell :: SymbolFile/NativePDB/ast-functions.cpp (1888 of 1995) PASS: lldb-unit :: Host/./HostTests/FileSystemTest.Exists (1889 of 1995) PASS: lldb-shell :: SymbolFile/DWARF/dir-separator-no-comp-dir.s (1890 of 1995) PASS: lldb-unit :: UnwindAssembly/x86/./UnwindAssemblyx86Tests/Testx86AssemblyInspectionEngine.TestStackRealignMSVC_i386 (1891 of 1995) PASS: lldb-api :: commands/watchpoints/multiple_hits/TestMultipleHits.py (1892 of 1995) UNSUPPORTED: lldb-shell :: BuildScript/toolchain-msvc.test (1893 of 1995) PASS: lldb-unit :: Host/./HostTests/SocketTest.UDPConnect (1894 of 1995) PASS: lldb-unit :: Utility/./UtilityTests/StringListTest.SetSize (1895 of 1995) UNSUPPORTED: lldb-api :: tools/lldb-vscode/completions/TestVSCode_completions.py (1896 of 1995) PASS: lldb-unit :: Host/./HostTests/MainLoopTest.TerminatesImmediately (1897 of 1995) PASS: lldb-api :: functionalities/plugins/python_os_plugin/stepping_plugin_threads/TestOSPluginStepping.py (1898 of 1995) PASS: lldb-unit :: Utility/./UtilityTests/StreamTeeTest.Flush (1899 of 1995) PASS: lldb-unit :: Language/Highlighting/./HighlighterTests/HighlighterTest.ClangStringLiterals (1900 of 1995) UNSUPPORTED: lldb-shell :: ScriptInterpreter/Lua/convenience_variables.test (1901 of 1995) PASS: lldb-unit :: Utility/./UtilityTests/StringExtractorTest.GetHexU8_Exact (1902 of 1995) PASS: lldb-api :: functionalities/data-formatter/data-formatter-objc/TestDataFormatterObjCNSURL.py (1903 of 1995) PASS: lldb-api :: functionalities/set-data/TestSetData.py (1904 of 1995) PASS: lldb-api :: functionalities/gdb_remote_client/TestGDBRemoteLoad.py (1905 of 1995) PASS: lldb-unit :: API/./APITests/TestSBCommandInterpreterTest.MultiWordCommand (1906 of 1995) PASS: lldb-unit :: Process/gdb-remote/./ProcessGdbRemoteTests/GDBRemoteClientBaseTest.SendContinueAndWait (1907 of 1995) PASS: lldb-shell :: SymbolFile/DWARF/dwarf5-debug_line.s (1908 of 1995) PASS: lldb-api :: functionalities/thread/concurrent_events/TestConcurrentSignalWatch.py (1909 of 1995) PASS: lldb-unit :: Utility/./UtilityTests/DataExtractorTest.GetCStrAtNullOffset (1910 of 1995) PASS: lldb-api :: python_api/signals/TestSignalsAPI.py (1911 of 1995) PASS: lldb-unit :: Utility/./UtilityTests/RangeTest.Equal (1912 of 1995) PASS: lldb-unit :: ScriptInterpreter/Python/./ScriptInterpreterPythonTests/PythonDataObjectsTest.TestPythonTupleSize (1913 of 1995) PASS: lldb-api :: functionalities/data-formatter/nsdictionarysynth/TestNSDictionarySynthetic.py (1914 of 1995) PASS: lldb-unit :: Host/./HostTests/ConnectionFileDescriptorTest.TCPGetURIv6 (1915 of 1995) PASS: lldb-unit :: Editline/./EditlineTests/EditlineTestFixture.EditlineReceivesMultiLineText (1916 of 1995) PASS: lldb-api :: functionalities/data-formatter/var-in-aggregate-misuse/TestVarInAggregateMisuse.py (1917 of 1995) PASS: lldb-api :: lang/cpp/lambdas/TestLambdas.py (1918 of 1995) PASS: lldb-unit :: ObjectFile/ELF/./ObjectFileELFTests/ObjectFileELFTest.SectionsResolveConsistently (1919 of 1995) PASS: lldb-api :: functionalities/breakpoint/breakpoint_names/TestBreakpointNames.py (1920 of 1995) PASS: lldb-unit :: Utility/./UtilityTests/OptionsWithRawTest.SingleWhitespaceInput (1921 of 1995) PASS: lldb-unit :: Utility/./UtilityTests/DeserializerTest.HasData (1922 of 1995) UNSUPPORTED: lldb-shell :: BuildScript/toolchain-clang-cl.test (1923 of 1995) PASS: lldb-unit :: Utility/./UtilityTests/StringListTest.ShiftMove (1924 of 1995) PASS: lldb-api :: commands/expression/persist_objc_pointeetype/TestPersistObjCPointeeType.py (1925 of 1995) PASS: lldb-unit :: tools/lldb-server/tests/./LLDBServerTests/StandardStartupTest.TestStopReplyContainsThreadPcs (1926 of 1995) PASS: lldb-api :: types/TestCharType.py (1927 of 1995) PASS: lldb-shell :: SymbolFile/DWARF/find-method-local-struct.cpp (1928 of 1995) PASS: lldb-unit :: Utility/./UtilityTests/StringListTest.DefaultConstructor (1929 of 1995) PASS: lldb-api :: functionalities/breakpoint/cpp_exception/TestCPPExceptionBreakpoint.py (1930 of 1995) PASS: lldb-unit :: Interpreter/./InterpreterTests/OptionArgParserTest.toBoolean (1931 of 1995) PASS: lldb-unit :: Utility/./UtilityTests/DataExtractorTest.GetCStrUnterminated (1932 of 1995) PASS: lldb-shell :: SymbolFile/DWARF/gnu-style-compression.cpp (1933 of 1995) PASS: lldb-unit :: Utility/./UtilityTests/FileSpecTest.Match (1934 of 1995) PASS: lldb-shell :: SymbolFile/DWARF/find-basic-namespace.cpp (1935 of 1995) PASS: lldb-unit :: Symbol/./SymbolTests/TestClangASTImporter.MetadataPropagationIndirectImport (1936 of 1995) PASS: lldb-api :: functionalities/gdb_remote_client/TestqOffsets.py (1937 of 1995) PASS: lldb-shell :: ObjectFile/ELF/compressed-sections.yaml (1938 of 1995) PASS: lldb-unit :: Symbol/./SymbolTests/TestTypeSystemClang.TestGetTypeClassTypeOf (1939 of 1995) PASS: lldb-unit :: Utility/./UtilityTests/BinaryStreamTest.PutULEB128EightBytes (1940 of 1995) PASS: lldb-unit :: UnwindAssembly/x86/./UnwindAssemblyx86Tests/Testx86AssemblyInspectionEngine.TestPopRBPWithREX (1941 of 1995) PASS: lldb-shell :: SymbolFile/DWARF/dir-separator-posix.s (1942 of 1995) PASS: lldb-unit :: Utility/./UtilityTests/RangeTest.Copy (1943 of 1995) PASS: lldb-shell :: Driver/TestSingleQuote.test (1944 of 1995) PASS: lldb-unit :: Utility/./UtilityTests/BinaryStreamTest.PutULEB128SevenBytes (1945 of 1995) PASS: lldb-unit :: Utility/./UtilityTests/StringExtractorTest.GetHexBytes (1946 of 1995) PASS: lldb-unit :: Symbol/./SymbolTests/TestTypeSystemClang.TestGetBasicTypeFromName (1947 of 1995) PASS: lldb-shell :: Reproducer/TestRelativePath.test (1948 of 1995) PASS: lldb-unit :: Utility/./UtilityTests/ScalarTest.Equality (1949 of 1995) PASS: lldb-unit :: Host/./HostTests/SocketTest.DomainListenConnectAccept (1950 of 1995) PASS: lldb-unit :: SymbolFile/NativePDB/./SymbolFileNativePDBTests/PDBFPOProgramToDWARFExpressionTests.SingleAssignmentRegisterRef (1951 of 1995) PASS: lldb-unit :: Utility/./UtilityTests/StreamTest.PutHex32ByteOrderLittle (1952 of 1995) PASS: lldb-unit :: Process/gdb-remote/./ProcessGdbRemoteTests/GDBRemoteClientBaseTest.InterruptNoResponse (1953 of 1995) PASS: lldb-api :: functionalities/data-formatter/poarray/TestPrintObjectArray.py (1954 of 1995) PASS: lldb-api :: commands/process/attach/attach_denied/TestAttachDenied.py (1955 of 1995) PASS: lldb-unit :: Utility/./UtilityTests/StreamTeeTest.AppendStream (1956 of 1995) PASS: lldb-api :: functionalities/tail_call_frames/disambiguate_tail_call_seq/TestDisambiguateTailCallSeq.py (1957 of 1995) PASS: lldb-unit :: ScriptInterpreter/Python/./ScriptInterpreterPythonTests/PythonDataObjectsTest.TestPythonIntegerToStr (1958 of 1995) PASS: lldb-api :: lang/cpp/bitfields/TestCppBitfields.py (1959 of 1995) PASS: lldb-unit :: ObjectFile/Breakpad/./ObjectFileBreakpadTests/PublicRecord.parse (1960 of 1995) PASS: lldb-shell :: Minidump/dump-all.test (1961 of 1995) PASS: lldb-api :: functionalities/thread/concurrent_events/TestConcurrentDelaySignalBreak.py (1962 of 1995) PASS: lldb-unit :: Utility/./UtilityTests/BinaryStreamTest.PutSLEB128SevenBytes (1963 of 1995) PASS: lldb-unit :: Utility/./UtilityTests/FileSpecTest.EqualDotsWindows (1964 of 1995) PASS: lldb-api :: python_api/sbdata/TestSBData.py (1965 of 1995) PASS: lldb-unit :: Utility/./UtilityTests/StreamTest.AddressNoSuffix (1966 of 1995) PASS: lldb-unit :: Utility/./UtilityTests/ConstStringTest.MangledCounterpart (1967 of 1995) PASS: lldb-unit :: ScriptInterpreter/Python/./ScriptInterpreterPythonTests/PythonDataObjectsTest.TestOwnedReferences (1968 of 1995) PASS: lldb-api :: lang/cpp/breakpoint_in_member_func_w_non_primitive_params/TestBreakpointInMemberFuncWNonPrimitiveParams.py (1969 of 1995) PASS: lldb-unit :: Utility/./UtilityTests/OptionsWithRawTest.EmptyArgsOnlySuffix (1970 of 1995) PASS: lldb-api :: functionalities/data-formatter/varscript_formatting/TestDataFormatterVarScriptFormatting.py (1971 of 1995) PASS: lldb-shell :: Driver/TestCommands.test (1972 of 1995) UNSUPPORTED: lldb-api :: benchmarks/libcxxmap/TestBenchmarkLibcxxMap.py (1973 of 1995) PASS: lldb-unit :: ScriptInterpreter/Python/./ScriptInterpreterPythonTests/PythonDataObjectsTest.TestGlobalNameResolutionNoDot (1974 of 1995) PASS: lldb-unit :: Utility/./UtilityTests/StringExtractorTest.GetHexU8_Underflow2 (1975 of 1995) PASS: lldb-api :: lang/cpp/extern_c/TestExternCSymbols.py (1976 of 1995) PASS: lldb-shell :: SymbolFile/DWARF/debug_aranges-empty-section.s (1977 of 1995) PASS: lldb-api :: functionalities/source-map/TestTargetSourceMap.py (1978 of 1995) PASS: lldb-unit :: Platform/./LLDBPlatformTests/PlatformDarwinTest.FindComponentInPath (1979 of 1995) PASS: lldb-api :: functionalities/tail_call_frames/inlining_and_tail_calls/TestInliningAndTailCalls.py (1980 of 1995) PASS: lldb-api :: sample_test/TestSampleTest.py (1981 of 1995) PASS: lldb-unit :: Host/./HostTests/FileSystemTest.FileAndDirectoryComponents (1982 of 1995) UNSUPPORTED: lldb-shell :: SymbolFile/PDB/pointers.test (1983 of 1995) PASS: lldb-api :: functionalities/rerun/TestRerun.py (1984 of 1995) PASS: lldb-api :: commands/watchpoints/watchpoint_count/TestWatchpointCount.py (1985 of 1995) UNSUPPORTED: lldb-shell :: Register/x86-64-xmm16-write.test (1986 of 1995) PASS: lldb-unit :: Symbol/./SymbolTests/PostfixExpression.ParseOneExpression (1987 of 1995) PASS: lldb-api :: lang/c/unions/TestUnionMembers.py (1988 of 1995) UNSUPPORTED: lldb-shell :: ScriptInterpreter/Lua/nested_sessions.test (1989 of 1995) PASS: lldb-api :: functionalities/thread/concurrent_events/TestConcurrentSignalDelayBreak.py (1990 of 1995) UNSUPPORTED: lldb-api :: functionalities/thread/break_after_join/TestBreakAfterJoin.py (1991 of 1995) PASS: lldb-api :: functionalities/data-formatter/data-formatter-smart-array/TestDataFormatterSmartArray.py (1992 of 1995) PASS: lldb-api :: lang/objc/objc-new-syntax/TestObjCNewSyntaxDictionary.py (1993 of 1995) PASS: lldb-api :: lang/objc/foundation/TestConstStrings.py (1994 of 1995) PASS: lldb-api :: functionalities/recursion/TestValueObjectRecursion.py (1995 of 1995) Slowest Tests: -------------------------------------------------------------------------- 370.76s: lldb-api :: tools/lldb-server/TestLldbGdbServer.py 274.24s: lldb-api :: lang/cpp/enum_types/TestCPP11EnumTypes.py 266.78s: lldb-api :: api/multithreaded/TestMultithreaded.py 248.78s: lldb-api :: tools/lldb-server/TestGdbRemoteThreadsInStopReply.py 228.13s: lldb-api :: lang/objc/hidden-ivars/TestHiddenIvars.py 225.59s: lldb-api :: lang/objc/foundation/TestObjCMethods.py 182.65s: lldb-api :: types/TestLongTypesExpr.py 155.99s: lldb-api :: lang/objc/objc-new-syntax/TestObjCNewSyntaxLiteral.py 155.26s: lldb-api :: lang/cpp/namespace/TestNamespaceLookup.py 145.17s: lldb-api :: lang/objc/exceptions/TestObjCExceptions.py 144.99s: lldb-api :: lang/objc/real-definition/TestRealDefinition.py 123.51s: lldb-api :: lang/objc/objc-new-syntax/TestObjCNewSyntaxArray.py 122.13s: lldb-api :: lang/objc/objc-new-syntax/TestObjCNewSyntaxDictionary.py 121.18s: lldb-api :: lang/objc/foundation/TestObjCMethodsString.py 120.79s: lldb-api :: tools/lldb-server/TestGdbRemote_qThreadStopInfo.py 115.79s: lldb-api :: lang/objc/foundation/TestObjCMethodsNSError.py 109.35s: lldb-api :: python_api/lldbutil/iter/TestLLDBIterator.py 104.63s: lldb-api :: python_api/exprpath_synthetic/TestExprPathSynthetic.py 100.37s: lldb-api :: lang/objc/forward-decl/TestForwardDecl.py 96.90s: lldb-api :: commands/settings/TestSettings.py

Hide Details

Tests Times: -------------------------------------------------------------------------- [ Range ] :: [ Percentage ] :: [ Count ] -------------------------------------------------------------------------- [360s,380s) :: [ ] :: [ 1/1995] [340s,360s) :: [ ] :: [ 0/1995] [320s,340s) :: [ ] :: [ 0/1995] [300s,320s) :: [ ] :: [ 0/1995] [280s,300s) :: [ ] :: [ 1/1995] [260s,280s) :: [ ] :: [ 1/1995] [240s,260s) :: [ ] :: [ 1/1995] [220s,240s) :: [ ] :: [ 2/1995] [200s,220s) :: [ ] :: [ 0/1995] [180s,200s) :: [ ] :: [ 1/1995] [160s,180s) :: [ ] :: [ 0/1995] [140s,160s) :: [ ] :: [ 4/1995] [120s,140s) :: [ ] :: [ 4/1995] [100s,120s) :: [ ] :: [ 4/1995] [ 80s,100s) :: [ ] :: [ 7/1995] [ 60s, 80s) :: [ ] :: [ 28/1995] [ 40s, 60s) :: [* ] :: [ 91/1995] [ 20s, 40s) :: [** ] :: [ 108/1995] [ 0s, 20s) :: [********************************** ] :: [1742/1995] -------------------------------------------------------------------------- ******************** Failing Tests (3): lldb-api :: functionalities/ptr_refs/TestPtrRefs.py lldb-api :: python_api/thread/TestThreadAPI.py lldb-api :: lang/objc/ptr_refs/TestPtrRefsObjC.py

Hide Details

Hide Details

Testing Time: 4472.96s Unsupported Tests : 168 Expected Passes : 1818 Expected Failures : 6 Unexpected Failures: 3 FAILED: tools/lldb/test/CMakeFiles/check-lldb-lit cd /Users/buildslave/jenkins/workspace/lldb-cmake-sanitized/lldb-build/tools/lldb/test && /usr/local/bin/python /Users/buildslave/jenkins/workspace/lldb-cmake-sanitized/lldb-build/./bin/llvm-lit -v --time-tests --shuffle --xunit-xml-output=/Users/buildslave/jenkins/workspace/lldb-cmake-sanitized/test/results.xml -v -j 4 --timeout 1200 /Users/buildslave/jenkins/workspace/lldb-cmake-sanitized/lldb-build/tools/lldb/test ninja: build stopped: subcommand failed. Command failed: Command '['/usr/bin/env', 'TERM=vt100', '/usr/local/bin/ninja', '-v', 'check-lldb']' returned non-zero exit status 1. Command: ['/usr/bin/env', 'TERM=vt100', '/usr/local/bin/ninja', '-v', 'check-lldb'] [Pipeline] } [Pipeline] // timeout [Pipeline] } [Pipeline] // stage [Pipeline] stage [Pipeline] { (Declarative: Post Actions) [Pipeline] scanForIssues [Clang (LLVM based)] Sleeping for 5 seconds due to JENKINS-32191... [Clang (LLVM based)] Parsing console log (workspace: '/Users/buildslave/jenkins/workspace/lldb-cmake-sanitized') [Clang (LLVM based)] Successfully parsed console log [Clang (LLVM based)] -> found 7 issues (skipped 0 duplicates) [Clang (LLVM based)] Post processing issues on 'green-dragon-23' with source code encoding 'UTF-8' [Clang (LLVM based)] Creating SCM blamer to obtain author and commit information for affected files [Clang (LLVM based)] Creating SCM miner to obtain statistics for affected repository files [Clang (LLVM based)] Resolving file names for all issues in source directory '/Users/buildslave/jenkins/workspace/lldb-cmake-sanitized' [Clang (LLVM based)] -> resolved paths in source directory (5 found, 0 not found) [Clang (LLVM based)] Resolving module names from module definitions (build.xml, pom.xml, or Manifest.mf files) [Clang (LLVM based)] -> resolved module names for 7 issues [Clang (LLVM based)] Resolving package names (or namespaces) by parsing the affected files [Clang (LLVM based)] -> resolved package names of 5 affected files [Clang (LLVM based)] No filter has been set, publishing all 7 issues [Clang (LLVM based)] Creating fingerprints for all affected code blocks to track issues over different builds [Clang (LLVM based)] -> created fingerprints for 7 issues (skipped 0 issues) [Clang (LLVM based)] Copying affected files to Jenkins' build folder '/Users/Shared/Jenkins/Home/jobs/lldb-cmake-sanitized/builds/1211/files-with-issues' [Clang (LLVM based)] -> 5 copied, 0 not in workspace, 0 not-found, 0 with I/O error [Pipeline] junit Recording test results [Pipeline] } [Pipeline] // stage [Pipeline] } [Pipeline] // withEnv [Pipeline] } [Pipeline] // node [Pipeline] End of Pipeline ERROR: script returned exit code 1 Finished: FAILURE