Regression

lldb-api.functionalities/tail_call_frames/disambiguate_tail_call_seq.TestDisambiguateTailCallSeq.py (from lldb-api)

Failing for the past 1 build (Since Failed#1501 )
Took 20 sec.

Stacktrace

Script:
--
/Users/buildslave/jenkins/workspace/lldb-cmake-sanitized/lldb-build/lldb-test-build.noindex/copied-system-python /Users/buildslave/jenkins/workspace/lldb-cmake-sanitized/llvm-project/lldb/test/API/dotest.py --arch x86_64 -s /Users/buildslave/jenkins/workspace/lldb-cmake-sanitized/lldb-build/lldb-test-traces -S nm -u CXXFLAGS -u CFLAGS --codesign-identity lldb_codesign --server /Users/buildslave/jenkins/workspace/lldb-cmake-sanitized/lldb-build/./bin/debugserver --arch x86_64 --build-dir /Users/buildslave/jenkins/workspace/lldb-cmake-sanitized/lldb-build/lldb-test-build.noindex -s=/Users/buildslave/jenkins/workspace/lldb-cmake-sanitized/test/logs -t --env TERM=vt100 --env LLVM_LIBS_DIR=/Users/buildslave/jenkins/workspace/lldb-cmake-sanitized/lldb-build/./lib --inferior-env ASAN_OPTIONS=detect_stack_use_after_return=1 --inferior-env DYLD_INSERT_LIBRARIES=/Users/buildslave/jenkins/workspace/lldb-cmake-sanitized/host-compiler/lib/clang/11.0.0/lib/darwin/libclang_rt.asan_osx_dynamic.dylib --build-dir /Users/buildslave/jenkins/workspace/lldb-cmake-sanitized/lldb-build/lldb-test-build.noindex --lldb-module-cache-dir /Users/buildslave/jenkins/workspace/lldb-cmake-sanitized/lldb-build/lldb-test-build.noindex/module-cache-lldb/lldb-api --clang-module-cache-dir /Users/buildslave/jenkins/workspace/lldb-cmake-sanitized/lldb-build/lldb-test-build.noindex/module-cache-clang/lldb-api --executable /Users/buildslave/jenkins/workspace/lldb-cmake-sanitized/lldb-build/./bin/lldb --compiler /Users/buildslave/jenkins/workspace/lldb-cmake-sanitized/lldb-build/./bin/clang --dsymutil /Users/buildslave/jenkins/workspace/lldb-cmake-sanitized/lldb-build/./bin/dsymutil --filecheck /Users/buildslave/jenkins/workspace/lldb-cmake-sanitized/lldb-build/./bin/FileCheck --lldb-libs-dir /Users/buildslave/jenkins/workspace/lldb-cmake-sanitized/lldb-build/./lib /Users/buildslave/jenkins/workspace/lldb-cmake-sanitized/llvm-project/lldb/test/API/functionalities/tail_call_frames/disambiguate_tail_call_seq -p TestDisambiguateTailCallSeq.py
--
Exit Code: 1

Command Output (stdout):
--
lldb version 11.0.99
  clang revision bff0c56ff92106afad22b54a90e1c612da4d6f99
  llvm revision bff0c56ff92106afad22b54a90e1c612da4d6f99
LLDB library dir: /Users/buildslave/jenkins/workspace/lldb-cmake-sanitized/lldb-build/bin
LLDB import library dir: /Users/buildslave/jenkins/workspace/lldb-cmake-sanitized/lldb-build/./lib
libstdcxx tests will not be run because: Don't know how to build with libstdcxx on macosx
Skipping following debug info categories: ['dwo']
a.out was compiled with optimization - stepping may behave oddly; variables may not be available.
a.out was compiled with optimization - stepping may behave oddly; variables may not be available.
a.out was compiled with optimization - stepping may behave oddly; variables may not be available.

--
Command Output (stderr):
--

Session logs for test failures/errors/unexpected successes will go into directory '/Users/buildslave/jenkins/workspace/lldb-cmake-sanitized/test/logs'
Command invoked: /Users/buildslave/jenkins/workspace/lldb-cmake-sanitized/llvm-project/lldb/test/API/dotest.py --arch x86_64 -s /Users/buildslave/jenkins/workspace/lldb-cmake-sanitized/lldb-build/lldb-test-traces -S nm -u CXXFLAGS -u CFLAGS --codesign-identity lldb_codesign --server /Users/buildslave/jenkins/workspace/lldb-cmake-sanitized/lldb-build/./bin/debugserver --arch x86_64 --build-dir /Users/buildslave/jenkins/workspace/lldb-cmake-sanitized/lldb-build/lldb-test-build.noindex -s=/Users/buildslave/jenkins/workspace/lldb-cmake-sanitized/test/logs -t --env TERM=vt100 --env LLVM_LIBS_DIR=/Users/buildslave/jenkins/workspace/lldb-cmake-sanitized/lldb-build/./lib --inferior-env ASAN_OPTIONS=detect_stack_use_after_return=1 --inferior-env DYLD_INSERT_LIBRARIES=/Users/buildslave/jenkins/workspace/lldb-cmake-sanitized/host-compiler/lib/clang/11.0.0/lib/darwin/libclang_rt.asan_osx_dynamic.dylib --build-dir /Users/buildslave/jenkins/workspace/lldb-cmake-sanitized/lldb-build/lldb-test-build.noindex --lldb-module-cache-dir /Users/buildslave/jenkins/workspace/lldb-cmake-sanitized/lldb-build/lldb-test-build.noindex/module-cache-lldb/lldb-api --clang-module-cache-dir /Users/buildslave/jenkins/workspace/lldb-cmake-sanitized/lldb-build/lldb-test-build.noindex/module-cache-clang/lldb-api --executable /Users/buildslave/jenkins/workspace/lldb-cmake-sanitized/lldb-build/./bin/lldb --compiler /Users/buildslave/jenkins/workspace/lldb-cmake-sanitized/lldb-build/./bin/clang --dsymutil /Users/buildslave/jenkins/workspace/lldb-cmake-sanitized/lldb-build/./bin/dsymutil --filecheck /Users/buildslave/jenkins/workspace/lldb-cmake-sanitized/lldb-build/./bin/FileCheck --lldb-libs-dir /Users/buildslave/jenkins/workspace/lldb-cmake-sanitized/lldb-build/./lib /Users/buildslave/jenkins/workspace/lldb-cmake-sanitized/llvm-project/lldb/test/API/functionalities/tail_call_frames/disambiguate_tail_call_seq -p TestDisambiguateTailCallSeq.py
Change dir to: /Users/buildslave/jenkins/workspace/lldb-cmake-sanitized/llvm-project/lldb/test/API/functionalities/tail_call_frames/disambiguate_tail_call_seq
runCmd: settings clear -all
output: 

runCmd: settings set symbols.enable-external-lookup false
output: 

runCmd: settings set target.auto-apply-fixits false
output: 

runCmd: settings set plugin.process.gdb-remote.packet-timeout 60
output: 

runCmd: settings set symbols.clang-modules-cache-path "/Users/buildslave/jenkins/workspace/lldb-cmake-sanitized/lldb-build/lldb-test-build.noindex/module-cache-lldb/lldb-api"
output: 

runCmd: settings set use-color false
output: 

runCmd: setting set target.prefer-dynamic-value no-dynamic-values
output: 

runCmd: settings set target.env-vars ASAN_OPTIONS=detect_stack_use_after_return=1 DYLD_INSERT_LIBRARIES=/Users/buildslave/jenkins/workspace/lldb-cmake-sanitized/host-compiler/lib/clang/11.0.0/lib/darwin/libclang_rt.asan_osx_dynamic.dylib
output: 

runCmd: bt
output: * thread #1, queue = 'com.apple.main-thread', stop reason = breakpoint 1.1
  * frame #0: 0x0000000109cdaf64 a.out`sink() at main.cpp:4:4
    frame #1: 0x0000000109cdafa9 a.out`main(argc=<unavailable>, (null)=<unavailable>) at main.cpp:20:3
    frame #2: 0x00007fff5962a085 libdyld.dylib`start + 1
    frame #3: 0x00007fff5962a085 libdyld.dylib`start + 1



--- FileCheck trace (code=1) ---
/Users/buildslave/jenkins/workspace/lldb-cmake-sanitized/lldb-build/bin/FileCheck /Users/buildslave/jenkins/workspace/lldb-cmake-sanitized/llvm-project/lldb/test/API/functionalities/tail_call_frames/disambiguate_tail_call_seq/main.cpp -implicit-check-not=artificial

FileCheck input:
* thread #1, queue = 'com.apple.main-thread', stop reason = breakpoint 1.1
  * frame #0: 0x0000000109cdaf64 a.out`sink() at main.cpp:4:4
    frame #1: 0x0000000109cdafa9 a.out`main(argc=<unavailable>, (null)=<unavailable>) at main.cpp:20:3
    frame #2: 0x00007fff5962a085 libdyld.dylib`start + 1
    frame #3: 0x00007fff5962a085 libdyld.dylib`start + 1


FileCheck output:

/Users/buildslave/jenkins/workspace/lldb-cmake-sanitized/llvm-project/lldb/test/API/functionalities/tail_call_frames/disambiguate_tail_call_seq/main.cpp:6:17: error: CHECK-NEXT: expected string not found in input
 // CHECK-NEXT: func3{{.*}} [artificial]
                ^
<stdin>:3:2: note: scanning from here
 frame #1: 0x0000000109cdafa9 a.out`main(argc=<unavailable>, (null)=<unavailable>) at main.cpp:20:3
 ^
<stdin>:3:21: note: possible intended match here
 frame #1: 0x0000000109cdafa9 a.out`main(argc=<unavailable>, (null)=<unavailable>) at main.cpp:20:3
                    ^



FAIL: LLDB (/Users/buildslave/jenkins/workspace/lldb-cmake-sanitized/lldb-build/bin/clang-11-x86_64) :: test_dsym (lldbsuite.test.lldbtest.DisambiguateTailCallSeq_GNU)
<bound method SBProcess.Kill of <lldb.SBProcess; proxy of <Swig Object of type 'lldb::SBProcess *' at 0x10ffc8960> >>: success

runCmd: settings clear -all
output: 

runCmd: settings set symbols.enable-external-lookup false
output: 

runCmd: settings set target.auto-apply-fixits false
output: 

runCmd: settings set plugin.process.gdb-remote.packet-timeout 60
output: 

runCmd: settings set symbols.clang-modules-cache-path "/Users/buildslave/jenkins/workspace/lldb-cmake-sanitized/lldb-build/lldb-test-build.noindex/module-cache-lldb/lldb-api"
output: 

runCmd: settings set use-color false
output: 

runCmd: setting set target.prefer-dynamic-value no-dynamic-values
output: 

runCmd: settings set target.env-vars ASAN_OPTIONS=detect_stack_use_after_return=1 DYLD_INSERT_LIBRARIES=/Users/buildslave/jenkins/workspace/lldb-cmake-sanitized/host-compiler/lib/clang/11.0.0/lib/darwin/libclang_rt.asan_osx_dynamic.dylib
output: 

runCmd: bt
output: * thread #1, queue = 'com.apple.main-thread', stop reason = breakpoint 1.1
  * frame #0: 0x0000000104d9af64 a.out`sink() at main.cpp:4:4
    frame #1: 0x0000000104d9af79 a.out`func3() at main.cpp:11:42 [artificial]
    frame #2: 0x0000000104d9af99 a.out`func1() at main.cpp:15:42 [artificial]
    frame #3: 0x0000000104d9afa9 a.out`main(argc=<unavailable>, (null)=<unavailable>) at main.cpp:20:3
    frame #4: 0x00007fff5962a085 libdyld.dylib`start + 1
    frame #5: 0x00007fff5962a085 libdyld.dylib`start + 1



--- FileCheck trace (code=0) ---
/Users/buildslave/jenkins/workspace/lldb-cmake-sanitized/lldb-build/bin/FileCheck /Users/buildslave/jenkins/workspace/lldb-cmake-sanitized/llvm-project/lldb/test/API/functionalities/tail_call_frames/disambiguate_tail_call_seq/main.cpp -implicit-check-not=artificial

FileCheck input:
* thread #1, queue = 'com.apple.main-thread', stop reason = breakpoint 1.1
  * frame #0: 0x0000000104d9af64 a.out`sink() at main.cpp:4:4
    frame #1: 0x0000000104d9af79 a.out`func3() at main.cpp:11:42 [artificial]
    frame #2: 0x0000000104d9af99 a.out`func1() at main.cpp:15:42 [artificial]
    frame #3: 0x0000000104d9afa9 a.out`main(argc=<unavailable>, (null)=<unavailable>) at main.cpp:20:3
    frame #4: 0x00007fff5962a085 libdyld.dylib`start + 1
    frame #5: 0x00007fff5962a085 libdyld.dylib`start + 1


FileCheck output:




<bound method SBProcess.Kill of <lldb.SBProcess; proxy of <Swig Object of type 'lldb::SBProcess *' at 0x10f30dc90> >>: success

PASS: LLDB (/Users/buildslave/jenkins/workspace/lldb-cmake-sanitized/lldb-build/bin/clang-11-x86_64) :: test_dwarf (lldbsuite.test.lldbtest.DisambiguateTailCallSeq_GNU)
UNSUPPORTED: LLDB (/Users/buildslave/jenkins/workspace/lldb-cmake-sanitized/lldb-build/bin/clang-11-x86_64) :: test_dwo (lldbsuite.test.lldbtest.DisambiguateTailCallSeq_GNU) (test case does not fall in any category of interest for this run) 
runCmd: settings clear -all
output: 

runCmd: settings set symbols.enable-external-lookup false
output: 

runCmd: settings set target.auto-apply-fixits false
output: 

runCmd: settings set plugin.process.gdb-remote.packet-timeout 60
output: 

runCmd: settings set symbols.clang-modules-cache-path "/Users/buildslave/jenkins/workspace/lldb-cmake-sanitized/lldb-build/lldb-test-build.noindex/module-cache-lldb/lldb-api"
output: 

runCmd: settings set use-color false
output: 

runCmd: setting set target.prefer-dynamic-value no-dynamic-values
output: 

runCmd: settings set target.env-vars ASAN_OPTIONS=detect_stack_use_after_return=1 DYLD_INSERT_LIBRARIES=/Users/buildslave/jenkins/workspace/lldb-cmake-sanitized/host-compiler/lib/clang/11.0.0/lib/darwin/libclang_rt.asan_osx_dynamic.dylib
output: 

runCmd: bt
output: * thread #1, queue = 'com.apple.main-thread', stop reason = breakpoint 1.1
  * frame #0: 0x000000010cc6af64 a.out`sink() at main.cpp:4:4
    frame #1: 0x000000010cc6af79 a.out`func3() at main.cpp:11:42 [artificial]
    frame #2: 0x000000010cc6af99 a.out`func1() at main.cpp:15:42 [artificial]
    frame #3: 0x000000010cc6afa9 a.out`main(argc=<unavailable>, (null)=<unavailable>) at main.cpp:20:3
    frame #4: 0x00007fff5962a085 libdyld.dylib`start + 1
    frame #5: 0x00007fff5962a085 libdyld.dylib`start + 1



--- FileCheck trace (code=0) ---
/Users/buildslave/jenkins/workspace/lldb-cmake-sanitized/lldb-build/bin/FileCheck /Users/buildslave/jenkins/workspace/lldb-cmake-sanitized/llvm-project/lldb/test/API/functionalities/tail_call_frames/disambiguate_tail_call_seq/main.cpp -implicit-check-not=artificial

FileCheck input:
* thread #1, queue = 'com.apple.main-thread', stop reason = breakpoint 1.1
  * frame #0: 0x000000010cc6af64 a.out`sink() at main.cpp:4:4
    frame #1: 0x000000010cc6af79 a.out`func3() at main.cpp:11:42 [artificial]
    frame #2: 0x000000010cc6af99 a.out`func1() at main.cpp:15:42 [artificial]
    frame #3: 0x000000010cc6afa9 a.out`main(argc=<unavailable>, (null)=<unavailable>) at main.cpp:20:3
    frame #4: 0x00007fff5962a085 libdyld.dylib`start + 1
    frame #5: 0x00007fff5962a085 libdyld.dylib`start + 1


FileCheck output:




<bound method SBProcess.Kill of <lldb.SBProcess; proxy of <Swig Object of type 'lldb::SBProcess *' at 0x10ffc8870> >>: success

PASS: LLDB (/Users/buildslave/jenkins/workspace/lldb-cmake-sanitized/lldb-build/bin/clang-11-x86_64) :: test_gmodules (lldbsuite.test.lldbtest.DisambiguateTailCallSeq_GNU)
Restore dir to: /Users/buildslave/jenkins/workspace/lldb-cmake-sanitized/lldb-build/tools/lldb/test
Change dir to: /Users/buildslave/jenkins/workspace/lldb-cmake-sanitized/llvm-project/lldb/test/API/functionalities/tail_call_frames/disambiguate_tail_call_seq
runCmd: settings clear -all
output: 

runCmd: settings set symbols.enable-external-lookup false
output: 

runCmd: settings set target.auto-apply-fixits false
output: 

runCmd: settings set plugin.process.gdb-remote.packet-timeout 60
output: 

runCmd: settings set symbols.clang-modules-cache-path "/Users/buildslave/jenkins/workspace/lldb-cmake-sanitized/lldb-build/lldb-test-build.noindex/module-cache-lldb/lldb-api"
output: 

runCmd: settings set use-color false
output: 

runCmd: setting set target.prefer-dynamic-value no-dynamic-values
output: 

runCmd: settings set target.env-vars ASAN_OPTIONS=detect_stack_use_after_return=1 DYLD_INSERT_LIBRARIES=/Users/buildslave/jenkins/workspace/lldb-cmake-sanitized/host-compiler/lib/clang/11.0.0/lib/darwin/libclang_rt.asan_osx_dynamic.dylib
output: 

runCmd: bt
output: * thread #1, queue = 'com.apple.main-thread', stop reason = breakpoint 1.1
  * frame #0: 0x000000010d4f3f64 a.out`sink() at main.cpp:4:4 [opt]
    frame #1: 0x000000010d4f3f75 a.out`func3() at main.cpp:11:42 [opt] [artificial]
    frame #2: 0x000000010d4f3f95 a.out`func1() at main.cpp:15:42 [opt] [artificial]
    frame #3: 0x000000010d4f3fa9 a.out`main(argc=<unavailable>, (null)=<unavailable>) at main.cpp:20:3 [opt]
    frame #4: 0x00007fff5962a085 libdyld.dylib`start + 1



--- FileCheck trace (code=0) ---
/Users/buildslave/jenkins/workspace/lldb-cmake-sanitized/lldb-build/bin/FileCheck /Users/buildslave/jenkins/workspace/lldb-cmake-sanitized/llvm-project/lldb/test/API/functionalities/tail_call_frames/disambiguate_tail_call_seq/main.cpp -implicit-check-not=artificial

FileCheck input:
* thread #1, queue = 'com.apple.main-thread', stop reason = breakpoint 1.1
  * frame #0: 0x000000010d4f3f64 a.out`sink() at main.cpp:4:4 [opt]
    frame #1: 0x000000010d4f3f75 a.out`func3() at main.cpp:11:42 [opt] [artificial]
    frame #2: 0x000000010d4f3f95 a.out`func1() at main.cpp:15:42 [opt] [artificial]
    frame #3: 0x000000010d4f3fa9 a.out`main(argc=<unavailable>, (null)=<unavailable>) at main.cpp:20:3 [opt]
    frame #4: 0x00007fff5962a085 libdyld.dylib`start + 1


FileCheck output:




<bound method SBProcess.Kill of <lldb.SBProcess; proxy of <Swig Object of type 'lldb::SBProcess *' at 0x10f30dc60> >>: success

PASS: LLDB (/Users/buildslave/jenkins/workspace/lldb-cmake-sanitized/lldb-build/bin/clang-11-x86_64) :: test_dsym (lldbsuite.test.lldbtest.DisambiguateTailCallSeq_V5)
runCmd: settings clear -all
output: 

runCmd: settings set symbols.enable-external-lookup false
output: 

runCmd: settings set target.auto-apply-fixits false
output: 

runCmd: settings set plugin.process.gdb-remote.packet-timeout 60
output: 

runCmd: settings set symbols.clang-modules-cache-path "/Users/buildslave/jenkins/workspace/lldb-cmake-sanitized/lldb-build/lldb-test-build.noindex/module-cache-lldb/lldb-api"
output: 

runCmd: settings set use-color false
output: 

runCmd: setting set target.prefer-dynamic-value no-dynamic-values
output: 

runCmd: settings set target.env-vars ASAN_OPTIONS=detect_stack_use_after_return=1 DYLD_INSERT_LIBRARIES=/Users/buildslave/jenkins/workspace/lldb-cmake-sanitized/host-compiler/lib/clang/11.0.0/lib/darwin/libclang_rt.asan_osx_dynamic.dylib
output: 

runCmd: bt
output: * thread #1, queue = 'com.apple.main-thread', stop reason = breakpoint 1.1
  * frame #0: 0x000000010fd44f64 a.out`sink() at main.cpp:4:4 [opt]
    frame #1: 0x000000010fd44f75 a.out`func3() at main.cpp:11:42 [opt] [artificial]
    frame #2: 0x000000010fd44f95 a.out`func1() at main.cpp:15:42 [opt] [artificial]
    frame #3: 0x000000010fd44fa9 a.out`main(argc=<unavailable>, (null)=<unavailable>) at main.cpp:20:3 [opt]
    frame #4: 0x00007fff5962a085 libdyld.dylib`start + 1
    frame #5: 0x00007fff5962a085 libdyld.dylib`start + 1



--- FileCheck trace (code=0) ---
/Users/buildslave/jenkins/workspace/lldb-cmake-sanitized/lldb-build/bin/FileCheck /Users/buildslave/jenkins/workspace/lldb-cmake-sanitized/llvm-project/lldb/test/API/functionalities/tail_call_frames/disambiguate_tail_call_seq/main.cpp -implicit-check-not=artificial

FileCheck input:
* thread #1, queue = 'com.apple.main-thread', stop reason = breakpoint 1.1
  * frame #0: 0x000000010fd44f64 a.out`sink() at main.cpp:4:4 [opt]
    frame #1: 0x000000010fd44f75 a.out`func3() at main.cpp:11:42 [opt] [artificial]
    frame #2: 0x000000010fd44f95 a.out`func1() at main.cpp:15:42 [opt] [artificial]
    frame #3: 0x000000010fd44fa9 a.out`main(argc=<unavailable>, (null)=<unavailable>) at main.cpp:20:3 [opt]
    frame #4: 0x00007fff5962a085 libdyld.dylib`start + 1
    frame #5: 0x00007fff5962a085 libdyld.dylib`start + 1


FileCheck output:




<bound method SBProcess.Kill of <lldb.SBProcess; proxy of <Swig Object of type 'lldb::SBProcess *' at 0x10ffc8960> >>: success

PASS: LLDB (/Users/buildslave/jenkins/workspace/lldb-cmake-sanitized/lldb-build/bin/clang-11-x86_64) :: test_dwarf (lldbsuite.test.lldbtest.DisambiguateTailCallSeq_V5)
UNSUPPORTED: LLDB (/Users/buildslave/jenkins/workspace/lldb-cmake-sanitized/lldb-build/bin/clang-11-x86_64) :: test_dwo (lldbsuite.test.lldbtest.DisambiguateTailCallSeq_V5) (test case does not fall in any category of interest for this run) 
runCmd: settings clear -all
output: 

runCmd: settings set symbols.enable-external-lookup false
output: 

runCmd: settings set target.auto-apply-fixits false
output: 

runCmd: settings set plugin.process.gdb-remote.packet-timeout 60
output: 

runCmd: settings set symbols.clang-modules-cache-path "/Users/buildslave/jenkins/workspace/lldb-cmake-sanitized/lldb-build/lldb-test-build.noindex/module-cache-lldb/lldb-api"
output: 

runCmd: settings set use-color false
output: 

runCmd: setting set target.prefer-dynamic-value no-dynamic-values
output: 

runCmd: settings set target.env-vars ASAN_OPTIONS=detect_stack_use_after_return=1 DYLD_INSERT_LIBRARIES=/Users/buildslave/jenkins/workspace/lldb-cmake-sanitized/host-compiler/lib/clang/11.0.0/lib/darwin/libclang_rt.asan_osx_dynamic.dylib
output: 

runCmd: bt
output: * thread #1, queue = 'com.apple.main-thread', stop reason = breakpoint 1.1
  * frame #0: 0x000000010249ef64 a.out`sink() at main.cpp:4:4 [opt]
    frame #1: 0x000000010249ef75 a.out`func3() at main.cpp:11:42 [opt] [artificial]
    frame #2: 0x000000010249ef95 a.out`func1() at main.cpp:15:42 [opt] [artificial]
    frame #3: 0x000000010249efa9 a.out`main(argc=<unavailable>, (null)=<unavailable>) at main.cpp:20:3 [opt]
    frame #4: 0x00007fff5962a085 libdyld.dylib`start + 1
    frame #5: 0x00007fff5962a085 libdyld.dylib`start + 1



--- FileCheck trace (code=0) ---
/Users/buildslave/jenkins/workspace/lldb-cmake-sanitized/lldb-build/bin/FileCheck /Users/buildslave/jenkins/workspace/lldb-cmake-sanitized/llvm-project/lldb/test/API/functionalities/tail_call_frames/disambiguate_tail_call_seq/main.cpp -implicit-check-not=artificial

FileCheck input:
* thread #1, queue = 'com.apple.main-thread', stop reason = breakpoint 1.1
  * frame #0: 0x000000010249ef64 a.out`sink() at main.cpp:4:4 [opt]
    frame #1: 0x000000010249ef75 a.out`func3() at main.cpp:11:42 [opt] [artificial]
    frame #2: 0x000000010249ef95 a.out`func1() at main.cpp:15:42 [opt] [artificial]
    frame #3: 0x000000010249efa9 a.out`main(argc=<unavailable>, (null)=<unavailable>) at main.cpp:20:3 [opt]
    frame #4: 0x00007fff5962a085 libdyld.dylib`start + 1
    frame #5: 0x00007fff5962a085 libdyld.dylib`start + 1


FileCheck output:




<bound method SBProcess.Kill of <lldb.SBProcess; proxy of <Swig Object of type 'lldb::SBProcess *' at 0x10f30dc90> >>: success

PASS: LLDB (/Users/buildslave/jenkins/workspace/lldb-cmake-sanitized/lldb-build/bin/clang-11-x86_64) :: test_gmodules (lldbsuite.test.lldbtest.DisambiguateTailCallSeq_V5)
Restore dir to: /Users/buildslave/jenkins/workspace/lldb-cmake-sanitized/lldb-build/tools/lldb/test
======================================================================
FAIL: test_dsym (lldbsuite.test.lldbtest.DisambiguateTailCallSeq_GNU)
----------------------------------------------------------------------
Traceback (most recent call last):
  File "/Users/buildslave/jenkins/workspace/lldb-cmake-sanitized/llvm-project/lldb/packages/Python/lldbsuite/test/lldbtest.py", line 1768, in test_method
    return attrvalue(self)
  File "/Users/buildslave/jenkins/workspace/lldb-cmake-sanitized/llvm-project/lldb/packages/Python/lldbsuite/test/decorators.py", line 140, in wrapper
    func(*args, **kwargs)
  File "/Users/buildslave/jenkins/workspace/lldb-cmake-sanitized/llvm-project/lldb/packages/Python/lldbsuite/test/decorators.py", line 140, in wrapper
    func(*args, **kwargs)
  File "/Users/buildslave/jenkins/workspace/lldb-cmake-sanitized/llvm-project/lldb/packages/Python/lldbsuite/test/lldbinline.py", line 124, in _test
    self.do_test()
  File "/Users/buildslave/jenkins/workspace/lldb-cmake-sanitized/llvm-project/lldb/packages/Python/lldbsuite/test/lldbinline.py", line 156, in do_test
    parser.handle_breakpoint(self, bp_id)
  File "/Users/buildslave/jenkins/workspace/lldb-cmake-sanitized/llvm-project/lldb/packages/Python/lldbsuite/test/lldbinline.py", line 80, in handle_breakpoint
    test.execute_user_command(breakpoint['command'])
  File "/Users/buildslave/jenkins/workspace/lldb-cmake-sanitized/llvm-project/lldb/packages/Python/lldbsuite/test/lldbinline.py", line 127, in execute_user_command
    exec(__command, globals(), locals())
  File "<string>", line 1, in <module>
  File "/Users/buildslave/jenkins/workspace/lldb-cmake-sanitized/llvm-project/lldb/packages/Python/lldbsuite/test/lldbtest.py", line 2313, in filecheck
    self.assertTrue(cmd_status == 0)
AssertionError: False is not True
Config=x86_64-/Users/buildslave/jenkins/workspace/lldb-cmake-sanitized/lldb-build/bin/clang-11
----------------------------------------------------------------------
Ran 8 tests in 18.530s

RESULT: FAILED (5 passes, 1 failures, 0 errors, 2 skipped, 0 expected failures, 0 unexpected successes)

--