AbortedConsole Output

Skipping 8,645 KB.. Full Log

Hide Details

PASS: lldb-shell :: SymbolFile/DWARF/dwp-debug-types.s (753 of 2138) UNSUPPORTED: lldb-api :: functionalities/thread/create_during_step/TestCreateDuringStep.py (754 of 2138) PASS: lldb-unit :: Language/Highlighting/./HighlighterTests/HighlighterTest.ClangTrailingBackslashWithWhitespace (755 of 2138) PASS: lldb-api :: tools/lldb-vscode/breakpoint/TestVSCode_setFunctionBreakpoints.py (756 of 2138) PASS: lldb-api :: lang/cpp/unique-types/TestUniqueTypes.py (757 of 2138) PASS: lldb-shell :: Reproducer/TestPythonImport.test (758 of 2138) UNSUPPORTED: lldb-shell :: Breakpoint/case-insensitive.test (759 of 2138) PASS: lldb-api :: commands/platform/basic/TestPlatformCommand.py (760 of 2138) PASS: lldb-api :: commands/expression/import-std-module/shared_ptr-dbg-info-content/TestSharedPtrDbgInfoContentFromStdModule.py (761 of 2138) PASS: lldb-unit :: Process/minidump/./LLDBMinidumpTests/MinidumpParserTest.GetThreadContext_x86_32 (762 of 2138) PASS: lldb-api :: functionalities/data-formatter/data-formatter-smart-array/TestDataFormatterSmartArray.py (763 of 2138) PASS: lldb-api :: functionalities/gdb_remote_client/TestNoWatchpointSupportInfo.py (764 of 2138) PASS: lldb-unit :: Utility/./UtilityTests/SerializationRountripTest.SerializeDeserializePodReferences (765 of 2138) PASS: lldb-unit :: Process/./ProcessEventDataTests/ProcessEventDataTest.DoOnRemoval (766 of 2138) PASS: lldb-shell :: Process/TestEnvironment.test (767 of 2138) UNSUPPORTED: lldb-api :: commands/trace/TestTraceSchema.py (768 of 2138) PASS: lldb-api :: commands/expression/import-std-module/basic/TestImportStdModule.py (769 of 2138) PASS: lldb-api :: lang/cpp/this_class_type_mixing/TestThisClassTypeMixing.py (770 of 2138) PASS: lldb-api :: lang/cpp/std-function-step-into-callable/TestStdFunctionStepIntoCallable.py (771 of 2138) PASS: lldb-unit :: Utility/./UtilityTests/ArchSpecTest.TripleComponentsWereSpecified (772 of 2138) UNSUPPORTED: lldb-api :: functionalities/thread/multi_break/TestMultipleBreakpoints.py (773 of 2138) PASS: lldb-shell :: SymbolFile/NativePDB/ast-types.cpp (774 of 2138) PASS: lldb-unit :: Utility/./UtilityTests/OptionsWithRawTest.EmptySuffixSingleWhitespace (775 of 2138) PASS: lldb-unit :: Expression/./ExpressionTests/DiagnosticManagerTest.GetStringBasic (776 of 2138) PASS: lldb-unit :: Utility/./UtilityTests/UriParserTest.SchemeHostSeparator3 (777 of 2138) PASS: lldb-api :: commands/watchpoints/watchpoint_events/TestWatchpointEvents.py (778 of 2138) PASS: lldb-api :: functionalities/data-formatter/cstring-utf8-summary/TestCstringUnicode.py (779 of 2138) PASS: lldb-api :: api/multithreaded/TestMultithreaded.py (780 of 2138) UNSUPPORTED: lldb-shell :: SymbolFile/PDB/variables.test (781 of 2138) UNSUPPORTED: lldb-shell :: Breakpoint/ppc64-localentry.test (782 of 2138) PASS: lldb-api :: functionalities/data-formatter/data-formatter-synthtype/TestDataFormatterSynthType.py (783 of 2138) PASS: lldb-api :: commands/expression/import-std-module/forward_list-dbg-info-content/TestDbgInfoContentForwardListFromStdModule.py (784 of 2138) PASS: lldb-unit :: Expression/./ExpressionTests/ClangHostTest.ComputeClangResourceDirectory (785 of 2138) PASS: lldb-shell :: ObjectFile/ELF/PT_LOAD-empty.yaml (786 of 2138) PASS: lldb-unit :: Symbol/./SymbolTests/TestTypeSystemClang.TestIsClangType (787 of 2138) PASS: lldb-unit :: Host/./HostTests/NativeProcessProtocolTest.SetBreakpointFailRead (788 of 2138) PASS: lldb-api :: tools/lldb-server/TestGdbRemoteRegisterState.py (789 of 2138) PASS: lldb-unit :: Utility/./UtilityTests/OptionsWithRawTest.SingleWhitespaceInput (790 of 2138) PASS: lldb-unit :: Expression/./ExpressionTests/CppModuleConfigurationTest.Linux (791 of 2138) PASS: lldb-shell :: Reproducer/TestVerify.test (792 of 2138) PASS: lldb-unit :: Symbol/./SymbolTests/DWARFCallFrameInfoTest.Basic_dwarf3 (793 of 2138) PASS: lldb-unit :: Utility/./UtilityTests/StringExtractorTest.GetHexU8_Extra_NoEof (794 of 2138) PASS: lldb-api :: lang/objc/modules-hash-mismatch/TestClangModulesHashMismatch.py (795 of 2138) PASS: lldb-unit :: UnwindAssembly/x86/./UnwindAssemblyx86Tests/Testx86AssemblyInspectionEngine.TestSimple64bitFrameFunction (796 of 2138) UNSUPPORTED: lldb-api :: functionalities/asan/TestMemoryHistory.py (797 of 2138) PASS: lldb-shell :: SymbolFile/DWARF/clang-ast-from-dwarf-objc-property.m (798 of 2138) PASS: lldb-api :: lang/objc/exceptions/TestObjCExceptions.py (799 of 2138) PASS: lldb-api :: functionalities/gdb_remote_client/TestGDBRemoteLoad.py (800 of 2138) PASS: lldb-api :: types/TestShortTypeExpr.py (801 of 2138) UNSUPPORTED: lldb-api :: functionalities/data-formatter/data-formatter-stl/libstdcpp/map/TestDataFormatterStdMap.py (802 of 2138) PASS: lldb-unit :: SymbolFile/NativePDB/./SymbolFileNativePDBTests/PDBFPOProgramToDWARFExpressionTests.MultipleIndependentAssignments (803 of 2138) PASS: lldb-unit :: Utility/./UtilityTests/StringLexerTest.Next (804 of 2138) PASS: lldb-shell :: Reproducer/TestDiscard.test (805 of 2138) PASS: lldb-shell :: SymbolFile/DWARF/find-function-regex.cpp (806 of 2138) PASS: lldb-unit :: Expression/./ExpressionTests/DWARFExpression.DW_OP_stack_value (807 of 2138) PASS: lldb-api :: lang/cpp/operators/TestCppOperators.py (808 of 2138) PASS: lldb-unit :: Utility/./UtilityTests/ArgsTest.BareSingleQuote (809 of 2138) PASS: lldb-unit :: Utility/./UtilityTests/GeneratorTest.YamlMultiProvider (810 of 2138) PASS: lldb-api :: functionalities/breakpoint/breakpoint_by_file_colon_line/TestBreakpointByFileColonLine.py (811 of 2138) PASS: lldb-unit :: Utility/./UtilityTests/GeneratorTest.Create (812 of 2138) PASS: lldb-api :: lang/cpp/signed_types/TestSignedTypes.py (813 of 2138) PASS: lldb-shell :: SymbolFile/Breakpad/unwind-via-stack-win-no-memory-info.yaml (814 of 2138) UNSUPPORTED: lldb-api :: functionalities/darwin_log/basic/TestDarwinLogBasic.py (815 of 2138) PASS: lldb-unit :: SymbolFile/DWARF/./SymbolFileDWARFTests/SymbolFileDWARFTests.ParseArangesNonzeroSegmentSize (816 of 2138) PASS: lldb-unit :: Symbol/./SymbolTests/TestTypeSystemClang.TemplateArguments (817 of 2138) PASS: lldb-unit :: Utility/./UtilityTests/StreamTest.ShiftOperatorStrings (818 of 2138) PASS: lldb-unit :: Utility/./UtilityTests/StringLexerTest.Peek (819 of 2138) PASS: lldb-api :: lang/c/complex_int/TestComplexInt.py (820 of 2138) PASS: lldb-shell :: SymbolFile/DWARF/dir-separator-no-comp-dir.s (821 of 2138) PASS: lldb-unit :: SymbolFile/NativePDB/./SymbolFileNativePDBTests/PDBFPOProgramToDWARFExpressionTests.UnresolvedRegisterAssignmentReference (822 of 2138) PASS: lldb-shell :: Driver/TestCore.test (823 of 2138) PASS: lldb-unit :: Language/Highlighting/./HighlighterTests/HighlighterTest.ClangCursorPos (824 of 2138) PASS: lldb-unit :: Utility/./UtilityTests/StreamTest.AddressSize (825 of 2138) PASS: lldb-shell :: ObjectFile/ELF/many-sections.s (826 of 2138) UNSUPPORTED: lldb-api :: lang/cpp/function-template-parameter-pack/TestFunctionTemplateParameterPack.py (827 of 2138) PASS: lldb-unit :: Target/./TargetTests/PathMappingListTest.AbsoluteTests (828 of 2138) PASS: lldb-unit :: Process/gdb-remote/./ProcessGdbRemoteTests/GDBRemoteCommunicationClientTest.SendSignalsToIgnore (829 of 2138) PASS: lldb-api :: functionalities/completion/TestCompletion.py (830 of 2138) UNSUPPORTED: lldb-api :: functionalities/breakpoint/hardware_breakpoints/hardware_breakpoint_on_multiple_threads/TestHWBreakMultiThread.py (831 of 2138) PASS: lldb-unit :: Utility/./UtilityTests/StringListTest.SplitIntoLines (832 of 2138) PASS: lldb-shell :: SymbolFile/DWARF/win-i386-line-table.s (833 of 2138) PASS: lldb-unit :: Expression/./ExpressionTests/CppModuleConfigurationTest.UnknownLibCppFile (834 of 2138) PASS: lldb-unit :: Target/./TargetTests/MCBasedABI.MapRegisterName (835 of 2138) PASS: lldb-unit :: ScriptInterpreter/Python/./ScriptInterpreterPythonTests/PythonDataObjectsTest.TestPythonDictionaryToStructuredDictionary (836 of 2138) PASS: lldb-unit :: Utility/./UtilityTests/RangeVector.CombineConsecutiveRanges (837 of 2138) PASS: lldb-api :: functionalities/reproducers/attach/TestReproducerAttach.py (838 of 2138) PASS: lldb-unit :: debugserver/./debugserverTests/RNBSocket.LoopBackListenIPv4 (839 of 2138) PASS: lldb-unit :: Process/minidump/./LLDBMinidumpTests/MinidumpParserTest.GetMemoryRegionInfo (840 of 2138) PASS: lldb-unit :: Utility/./UtilityTests/RangeTest.ContainsEndInclusive (841 of 2138) PASS: lldb-unit :: Utility/./UtilityTests/DataExtractorTest.GetCStrUnterminated (842 of 2138) PASS: lldb-unit :: Utility/./UtilityTests/UriParserTest.SchemeHostSeparator (843 of 2138) PASS: lldb-api :: functionalities/data-formatter/data-formatter-stl/libcxx/forward_list/TestDataFormatterLibcxxForwardList.py (844 of 2138) PASS: lldb-shell :: ObjectFile/Breakpad/sections.test (845 of 2138) PASS: lldb-api :: lang/objc/foundation/TestObjCMethods.py (846 of 2138) PASS: lldb-unit :: Utility/./UtilityTests/StringExtractorTest.DecodeHexU8_Extra (847 of 2138) PASS: lldb-unit :: Utility/./UtilityTests/UriParserTest.LongPath (848 of 2138) PASS: lldb-api :: lang/cpp/constructors/TestCppConstructors.py (849 of 2138) PASS: lldb-unit :: Process/gdb-remote/./ProcessGdbRemoteTests/GDBRemoteClientBaseTest.SendContinueAndInterrupt2PacketBug (850 of 2138) PASS: lldb-unit :: Utility/./UtilityTests/DataExtractorTest.GetCStrEmpty (851 of 2138) PASS: lldb-api :: functionalities/gdb_remote_client/TestJLink6Armv7RegisterDefinition.py (852 of 2138) UNSUPPORTED: lldb-api :: commands/target/auto-install-main-executable/TestAutoInstallMainExecutable.py (853 of 2138) PASS: lldb-api :: functionalities/data-formatter/hexcaps/TestDataFormatterHexCaps.py (854 of 2138) PASS: lldb-api :: commands/expression/dollar-in-variable/TestDollarInVariable.py (855 of 2138) PASS: lldb-unit :: Utility/./UtilityTests/StringListTest.CopyListEmpty (856 of 2138) PASS: lldb-unit :: Utility/./UtilityTests/OptionsWithRawTest.QuotedSuffix (857 of 2138) PASS: lldb-unit :: Utility/./UtilityTests/StreamTest.PutBytesAsRawHex8ToMixedEndian (858 of 2138) PASS: lldb-unit :: Process/gdb-remote/./ProcessGdbRemoteTests/GDBRemoteClientBaseTest.SendContinueAndInterrupt (859 of 2138) PASS: lldb-unit :: Utility/./UtilityTests/Flags.GetBitSize (860 of 2138) PASS: lldb-unit :: Language/Highlighting/./HighlighterTests/HighlighterTest.Keywords (861 of 2138) PASS: lldb-shell :: SymbolFile/Breakpad/unwind-via-stack-win.test (862 of 2138) PASS: lldb-shell :: ObjectFile/PECOFF/uuid.yaml (863 of 2138) PASS: lldb-api :: functionalities/thread/concurrent_events/TestConcurrentDelayedCrashWithBreakpointSignal.py (864 of 2138) PASS: lldb-api :: functionalities/inferior-assert/TestInferiorAssert.py (865 of 2138) PASS: lldb-shell :: SymbolFile/DWARF/debug-names-compressed.cpp (866 of 2138) PASS: lldb-unit :: Process/gdb-remote/./ProcessGdbRemoteTests/GDBRemoteCommunicationClientTest.ReadRegister (867 of 2138) UNSUPPORTED: lldb-api :: functionalities/gdb_remote_client/TestWasm.py (868 of 2138) PASS: lldb-api :: python_api/lldbutil/frame/TestFrameUtils.py (869 of 2138) UNSUPPORTED: lldb-api :: functionalities/tsan/basic/TestTsanBasic.py (870 of 2138) PASS: lldb-shell :: Driver/TestFile.test (871 of 2138) PASS: lldb-unit :: Utility/./UtilityTests/BinaryStreamTest.PutULEB128NineBytes (872 of 2138) PASS: lldb-api :: commands/expression/radar_9673664/TestExprHelpExamples.py (873 of 2138) PASS: lldb-unit :: Utility/./UtilityTests/IndexToObjectTest.ObjectForIndex (874 of 2138) PASS: lldb-unit :: SymbolFile/NativePDB/./SymbolFileNativePDBTests/PDBFPOProgramToDWARFExpressionTests.MissingTargetRegister (875 of 2138) PASS: lldb-api :: commands/expression/import-std-module/shared_ptr/TestSharedPtrFromStdModule.py (876 of 2138) PASS: lldb-api :: commands/command/script/import/rdar-12586188/TestRdar12586188.py (877 of 2138) PASS: lldb-api :: functionalities/param_entry_vals/basic_entry_values/TestBasicEntryValues.py (878 of 2138) PASS: lldb-unit :: Utility/./UtilityTests/StreamTeeTest.DefaultConstructor (879 of 2138) XFAIL: lldb-shell :: Register/x86-mm-xmm-read.test (880 of 2138) PASS: lldb-unit :: Process/minidump/./LLDBMinidumpTests/RegisterContextMinidump.CheckRegisterContextMinidump_ARM (881 of 2138) UNSUPPORTED: lldb-api :: commands/expression/macros/TestMacros.py (882 of 2138) PASS: lldb-unit :: Process/minidump/./LLDBMinidumpTests/MinidumpParserTest.GetMemoryRegionInfoLinuxMaps (883 of 2138) PASS: lldb-api :: functionalities/step_scripted/TestStepScripted.py (884 of 2138) PASS: lldb-unit :: Utility/./UtilityTests/VMRange.ContainsAddr (885 of 2138) PASS: lldb-unit :: Utility/./UtilityTests/ConstStringTest.format_provider (886 of 2138) PASS: lldb-api :: lang/objc/objc-foundation-dictionary-empty/TestNSDictionary0.py (887 of 2138) PASS: lldb-unit :: Utility/./UtilityTests/StringExtractorTest.GetHexU8_Underflow_NoEof (888 of 2138) PASS: lldb-unit :: Utility/./UtilityTests/DataExtractorTest.GetDouble (889 of 2138) PASS: lldb-shell :: BuildScript/toolchain-clang.test (890 of 2138) XFAIL: lldb-shell :: Register/x86-64-write.test (891 of 2138) PASS: lldb-unit :: Utility/./UtilityTests/RegularExpression.CopyAssignment (892 of 2138) PASS: lldb-unit :: Utility/./UtilityTests/Flags.Reset (893 of 2138) PASS: lldb-shell :: Minidump/fb-dump.test (894 of 2138) PASS: lldb-api :: commands/expression/char/TestExprsChar.py (895 of 2138) PASS: lldb-unit :: Utility/./UtilityTests/ScalarTest.Scalar_512 (896 of 2138) PASS: lldb-unit :: Utility/./UtilityTests/GeneratorTest.GetOrCreate (897 of 2138) PASS: lldb-unit :: Utility/./UtilityTests/DataExtractorTest.PeekData (898 of 2138) PASS: lldb-api :: functionalities/inferior-crashing/recursive-inferior/TestRecursiveInferior.py (899 of 2138) PASS: lldb-api :: commands/source/info/TestSourceInfo.py (900 of 2138) PASS: lldb-api :: tools/lldb-vscode/module/TestVSCode_module.py (901 of 2138) PASS: lldb-unit :: Utility/./UtilityTests/BinaryStreamTest.PutULEB128ThreeBytes (902 of 2138) PASS: lldb-unit :: Language/Highlighting/./HighlighterTests/HighlighterTest.ClangTrailingBackslashBeforeNewline (903 of 2138) UNSUPPORTED: lldb-api :: functionalities/tsan/multiple/TestTsanMultiple.py (904 of 2138) PASS: lldb-api :: lang/c/inlines/TestRedefinitionsInInlines.py (905 of 2138) PASS: lldb-shell :: SymbolFile/DWARF/DW_AT_declaration-with-children.s (906 of 2138) PASS: lldb-api :: functionalities/breakpoint/breakpoint_ids/TestBreakpointIDs.py (907 of 2138) PASS: lldb-unit :: Symbol/./SymbolTests/SymbolsTest.TerminateLocateExecutableSymbolFileForUnknownExecutableAndUnknownSymbolFile (908 of 2138) PASS: lldb-unit :: Symbol/./SymbolTests/TestTypeSystemClang.TestGetTypeClassTypeOfExpr (909 of 2138) PASS: lldb-shell :: Breakpoint/split-dwarf-5-addrbase.test (910 of 2138) PASS: lldb-unit :: Utility/./UtilityTests/ArgsTest.ReplaceArgumentAtIndexFarOutOfRange (911 of 2138) PASS: lldb-unit :: Process/gdb-remote/./ProcessGdbRemoteTests/GDBRemoteCommunicationClientTest.GetMemoryRegionInfo (912 of 2138) PASS: lldb-api :: functionalities/data-formatter/data-formatter-python-synth/TestDataFormatterPythonSynth.py (913 of 2138) PASS: lldb-shell :: SymbolFile/NativePDB/break-by-line.cpp (914 of 2138) PASS: lldb-api :: python_api/name_lookup/TestNameLookup.py (915 of 2138) PASS: lldb-api :: functionalities/thread/concurrent_events/TestConcurrentDelaySignalWatch.py (916 of 2138) PASS: lldb-shell :: SymbolFile/NativePDB/function-types-builtins.cpp (917 of 2138) PASS: lldb-unit :: Utility/./UtilityTests/StreamTeeTest.GetStreamAtIndexOutOfBoundsEmpty (918 of 2138) PASS: lldb-unit :: Utility/./UtilityTests/UserIDResolver.GetUserName (919 of 2138) PASS: lldb-unit :: Utility/./UtilityTests/StringExtractorTest.GetHexBytesAvail_FullString (920 of 2138) PASS: lldb-unit :: Utility/./UtilityTests/StringExtractorTest.GetHexU8_Underflow2 (921 of 2138) PASS: lldb-api :: python_api/value/linked_list/TestValueAPILinkedList.py (922 of 2138) UNSUPPORTED: lldb-shell :: ScriptInterpreter/Lua/persistent_state.test (923 of 2138) UNSUPPORTED: lldb-api :: lang/objc/foundation/TestFoundationDisassembly.py (924 of 2138) UNSUPPORTED: lldb-api :: python_api/disassemble-raw-data/TestDisassemble_VST1_64.py (925 of 2138) PASS: lldb-unit :: Host/./HostTests/Host.GetEnvironment (926 of 2138) PASS: lldb-api :: functionalities/gdb_remote_client/TestThreadSelectionBug.py (927 of 2138) PASS: lldb-unit :: Utility/./UtilityTests/RecordReplayTest.InstrumentedFooSameThis (928 of 2138) PASS: lldb-api :: lang/c/complex/TestComplexC99.py (929 of 2138) PASS: lldb-shell :: SymbolFile/symbol-binding.test (930 of 2138) PASS: lldb-shell :: SymbolFile/DWARF/array-sizes.s (931 of 2138) PASS: lldb-api :: lang/objc/modules-update/TestClangModulesUpdate.py (932 of 2138) PASS: lldb-unit :: Language/Highlighting/./HighlighterTests/HighlighterTest.ClangCursorPosInOtherToken (933 of 2138) PASS: lldb-unit :: Expression/./ExpressionTests/DiagnosticManagerTest.AddDiagnostic (934 of 2138) PASS: lldb-shell :: SymbolFile/DWARF/debug_rnglists.s (935 of 2138) UNSUPPORTED: lldb-shell :: Register/x86-64-xmm16-write.test (936 of 2138) PASS: lldb-api :: commands/log/basic/TestLogging.py (937 of 2138) PASS: lldb-unit :: Utility/./UtilityTests/UUIDTest.StringConverion (938 of 2138) PASS: lldb-api :: functionalities/breakpoint/inlined_breakpoints/TestInlinedBreakpoints.py (939 of 2138) PASS: lldb-api :: functionalities/data-formatter/summary-string-onfail/Test-rdar-9974002.py (940 of 2138) PASS: lldb-api :: functionalities/thread/concurrent_events/TestConcurrentSignalWatchBreak.py (941 of 2138) PASS: lldb-unit :: Utility/./UtilityTests/SerializationRountripTest.SerializeDeserializeCStringArrayNullptrElem (942 of 2138) UNSUPPORTED: lldb-api :: android/platform/TestDefaultCacheLineSize.py (943 of 2138) PASS: lldb-unit :: Host/./HostTests/FileSystemTest.FileAndDirectoryComponents (944 of 2138) PASS: lldb-unit :: Utility/./UtilityTests/OptionsWithRawTest.ArgsButNoLeadingDash (945 of 2138) PASS: lldb-unit :: Utility/./UtilityTests/ReproducerTest.SetCapture (946 of 2138) PASS: lldb-shell :: Commands/CommandScriptImmediateOutput/CommandScriptImmediateOutputConsole.test (947 of 2138) PASS: lldb-api :: functionalities/thread/concurrent_events/TestConcurrentCrashWithWatchpoint.py (948 of 2138) PASS: lldb-api :: lang/objc/objc-optimized/TestObjcOptimized.py (949 of 2138) PASS: lldb-api :: lang/cpp/member-and-local-vars-with-same-name/TestMembersAndLocalsWithSameName.py (950 of 2138) PASS: lldb-unit :: Utility/./UtilityTests/StringExtractorTest.DecodeHexU8_InvalidHex2 (951 of 2138) PASS: lldb-api :: lang/objc/modules-cache/TestClangModulesCache.py (952 of 2138) PASS: lldb-api :: lang/cpp/class_types/TestClassTypes.py (953 of 2138) PASS: lldb-api :: functionalities/thread/thread_exit/TestThreadExit.py (954 of 2138) PASS: lldb-api :: python_api/process/TestProcessAPI.py (955 of 2138) PASS: lldb-api :: commands/expression/import-std-module/weak_ptr-dbg-info-content/TestDbgInfoContentWeakPtrFromStdModule.py (956 of 2138) PASS: lldb-api :: commands/expression/persistent_types/TestNestedPersistentTypes.py (957 of 2138) PASS: lldb-api :: functionalities/data-formatter/data-formatter-stl/libstdcpp/unique_ptr/invalid/TestDataFormatterInvalidStdUniquePtr.py (958 of 2138) PASS: lldb-unit :: UnwindAssembly/x86/./UnwindAssemblyx86Tests/Testx86AssemblyInspectionEngine.TestPushEAX (959 of 2138) PASS: lldb-unit :: DataFormatter/./LLDBFormatterTests/TypeMatcherTests.CreatedBySameMatchStringExactNamePrefixes (960 of 2138) PASS: lldb-unit :: Expression/./ExpressionTests/DiagnosticManagerTest.PutStringSeverities (961 of 2138) PASS: lldb-api :: commands/expression/entry-bp/TestExprEntryBP.py (962 of 2138) PASS: lldb-unit :: Utility/./UtilityTests/LogChannelTest.Enable (963 of 2138) PASS: lldb-unit :: Utility/./UtilityTests/StreamTest.PutRawBytesToMixedEndian (964 of 2138) PASS: lldb-unit :: UnwindAssembly/x86/./UnwindAssemblyx86Tests/Testx86AssemblyInspectionEngine.TestPushRBPWithREX (965 of 2138) PASS: lldb-unit :: ScriptInterpreter/Python/./ScriptInterpreterPythonTests/PythonDataObjectsTest.TestObjectAttributes (966 of 2138) PASS: lldb-api :: commands/command/nested_alias/TestNestedAlias.py (967 of 2138) PASS: lldb-unit :: Expression/./ExpressionTests/DWARFExpression.DW_OP_pick (968 of 2138) PASS: lldb-shell :: SymbolFile/DWARF/DW_TAG_basic_type_DW_ATE_UTF_nonC.ll (969 of 2138) PASS: lldb-api :: lang/c/global_variables/TestGlobalVariables.py (970 of 2138) PASS: lldb-unit :: Utility/./UtilityTests/RegisterValueTest.GetSet8 (971 of 2138) PASS: lldb-unit :: Utility/./UtilityTests/StringExtractorTest.GetHexBytesAvail_Underflow (972 of 2138) PASS: lldb-unit :: Language/CPlusPlus/./LanguageCPlusPlusTests/CPlusPlusLanguage.ExtractContextAndIdentifier (973 of 2138) PASS: lldb-shell :: Quit/TestQuitExitCodeNonInt.test (974 of 2138) PASS: lldb-unit :: Utility/./UtilityTests/ArgsTest.Yaml (975 of 2138) PASS: lldb-unit :: Utility/./UtilityTests/StringListTest.GetMaxStringLengthEmpty (976 of 2138) PASS: lldb-api :: macosx/thread_suspend/TestInternalThreadSuspension.py (977 of 2138) PASS: lldb-api :: tools/lldb-vscode/coreFile/TestVSCode_coreFile.py (978 of 2138) PASS: lldb-api :: commands/expression/codegen-crash-typedefdecl-not-in_declcontext/TestCodegenCrashTypedefDeclNotInDeclContext.py (979 of 2138) PASS: lldb-api :: functionalities/data-formatter/data-formatter-stl/libcxx/variant/TestDataFormatterLibcxxVariant.py (980 of 2138) PASS: lldb-unit :: Expression/./ExpressionTests/DiagnosticManagerTest.GetStringMultiline (981 of 2138) PASS: lldb-unit :: Utility/./UtilityTests/StreamTest.ShiftOperatorPtr (982 of 2138) PASS: lldb-shell :: Settings/TestSettingsWrite.test (983 of 2138) PASS: lldb-unit :: Utility/./UtilityTests/SubsystemRAIITest.SubsystemWithErrorSuccess (984 of 2138) PASS: lldb-unit :: Utility/./UtilityTests/StreamTest.SetIndentLevel (985 of 2138) PASS: lldb-api :: functionalities/breakpoint/objc/TestObjCBreakpoints.py (986 of 2138) PASS: lldb-unit :: Utility/./UtilityTests/StreamTest.PutBytesAsRawHex8ToBigEndian (987 of 2138) PASS: lldb-unit :: Utility/./UtilityTests/DataExtractorTest.GetSLEB128_bit63 (988 of 2138) PASS: lldb-api :: commands/watchpoints/watchpoint_commands/command/TestWatchpointCommandLLDB.py (989 of 2138) PASS: lldb-shell :: Register/x86-64-ymm-read.test (990 of 2138) PASS: lldb-shell :: SymbolFile/DWARF/find-variable-dwo.cpp (991 of 2138) PASS: lldb-shell :: SymbolFile/DWARF/DW_AT_location-DW_AT_const_value.s (992 of 2138) PASS: lldb-api :: lang/c/strings/TestCStrings.py (993 of 2138) PASS: lldb-api :: commands/watchpoints/watchpoint_commands/condition/TestWatchpointConditionCmd.py (994 of 2138) PASS: lldb-unit :: Utility/./UtilityTests/StringExtractorTest.InitMisc (995 of 2138) PASS: lldb-unit :: Utility/./UtilityTests/UserIDResolver.GetGroupName (996 of 2138) PASS: lldb-unit :: Host/./HostTests/FileSystemTest.MakeAbsolute (997 of 2138) PASS: lldb-api :: commands/expression/two-files/TestObjCTypeQueryFromOtherCompileUnit.py (998 of 2138) PASS: lldb-api :: commands/expression/import-std-module/no-std-module/TestMissingStdModule.py (999 of 2138) PASS: lldb-unit :: Utility/./UtilityTests/PassiveReplayTest.InstrumentedBarRef (1000 of 2138) PASS: lldb-api :: assert_messages_test/TestAssertMessages.py (1001 of 2138) PASS: lldb-unit :: Platform/./LLDBPlatformTests/PlatformDarwinTest.FindComponentInPath (1002 of 2138) PASS: lldb-api :: functionalities/data-formatter/data-formatter-stl/libcxx/tuple/TestDataFormatterLibcxxTuple.py (1003 of 2138) PASS: lldb-shell :: SymbolFile/DWARF/dwo-type-in-main-file.s (1004 of 2138) PASS: lldb-unit :: Utility/./UtilityTests/RegularExpression.Match (1005 of 2138) PASS: lldb-shell :: SymbolFile/DWARF/dwarf5-atomic.s (1006 of 2138) PASS: lldb-api :: functionalities/breakpoint/step_over_breakpoint/TestStepOverBreakpoint.py (1007 of 2138) PASS: lldb-api :: sample_test/TestSampleTest.py (1008 of 2138) PASS: lldb-unit :: Language/Highlighting/./HighlighterTests/HighlighterTest.ClangCursorOutOfBounds (1009 of 2138) FAIL: lldb-api :: lang/c/vla/TestVLA.py (1010 of 2138) ******************** TEST 'lldb-api :: lang/c/vla/TestVLA.py' FAILED ******************** Script: -- /Users/buildslave/jenkins/workspace/lldb-cmake-sanitized/lldb-build/lldb-test-build.noindex/copied-python /Users/buildslave/jenkins/workspace/lldb-cmake-sanitized/llvm-project/lldb/test/API/dotest.py -s /Users/buildslave/jenkins/workspace/lldb-cmake-sanitized/lldb-build/lldb-test-traces -S nm -u CXXFLAGS -u CFLAGS --codesign-identity lldb_codesign --server /Users/buildslave/jenkins/workspace/lldb-cmake-sanitized/lldb-build/./bin/debugserver --arch x86_64 --build-dir /Users/buildslave/jenkins/workspace/lldb-cmake-sanitized/lldb-build/lldb-test-build.noindex -s=/Users/buildslave/jenkins/workspace/lldb-cmake-sanitized/test/logs -t --env TERM=vt100 --env LLVM_LIBS_DIR=/Users/buildslave/jenkins/workspace/lldb-cmake-sanitized/lldb-build/./lib --inferior-env ASAN_OPTIONS=detect_stack_use_after_return=1 --inferior-env DYLD_INSERT_LIBRARIES=/Users/buildslave/jenkins/workspace/lldb-cmake-sanitized/host-compiler/lib/clang/12.0.0/lib/darwin/libclang_rt.asan_osx_dynamic.dylib --arch x86_64 --build-dir /Users/buildslave/jenkins/workspace/lldb-cmake-sanitized/lldb-build/lldb-test-build.noindex --lldb-module-cache-dir /Users/buildslave/jenkins/workspace/lldb-cmake-sanitized/lldb-build/lldb-test-build.noindex/module-cache-lldb/lldb-api --clang-module-cache-dir /Users/buildslave/jenkins/workspace/lldb-cmake-sanitized/lldb-build/lldb-test-build.noindex/module-cache-clang/lldb-api --executable /Users/buildslave/jenkins/workspace/lldb-cmake-sanitized/lldb-build/./bin/lldb --compiler /Users/buildslave/jenkins/workspace/lldb-cmake-sanitized/lldb-build/./bin/clang --dsymutil /Users/buildslave/jenkins/workspace/lldb-cmake-sanitized/lldb-build/./bin/dsymutil --filecheck /Users/buildslave/jenkins/workspace/lldb-cmake-sanitized/lldb-build/./bin/FileCheck --yaml2obj /Users/buildslave/jenkins/workspace/lldb-cmake-sanitized/lldb-build/./bin/yaml2obj --lldb-libs-dir /Users/buildslave/jenkins/workspace/lldb-cmake-sanitized/lldb-build/./lib /Users/buildslave/jenkins/workspace/lldb-cmake-sanitized/llvm-project/lldb/test/API/lang/c/vla -p TestVLA.py -- Exit Code: 1

Hide Details

Command Output (stdout): -- lldb version 12.0.99 clang revision 5502cfa091e0f6b35a6d96435b2ec15a43a324eb llvm revision 5502cfa091e0f6b35a6d96435b2ec15a43a324eb libstdcxx tests will not be run because: Don't know how to build with libstdcxx on macosx Skipping following debug info categories: ['dwo']

Hide Details

-- Command Output (stderr): --

Hide Details

Session logs for test failures/errors/unexpected successes will go into directory '/Users/buildslave/jenkins/workspace/lldb-cmake-sanitized/test/logs' Change dir to: /Users/buildslave/jenkins/workspace/lldb-cmake-sanitized/llvm-project/lldb/test/API/lang/c/vla runCmd: settings clear -all output:

Hide Details

runCmd: settings set symbols.enable-external-lookup false output:

Hide Details

runCmd: settings set target.inherit-tcc true output:

Hide Details

runCmd: settings set target.auto-apply-fixits false output:

Hide Details

runCmd: settings set plugin.process.gdb-remote.packet-timeout 60 output:

Hide Details

runCmd: settings set symbols.clang-modules-cache-path "/Users/buildslave/jenkins/workspace/lldb-cmake-sanitized/lldb-build/lldb-test-build.noindex/module-cache-lldb/lldb-api" output:

Hide Details

runCmd: settings set use-color false output:

Hide Details

runCmd: setting set target.prefer-dynamic-value no-dynamic-values output:

Hide Details

runCmd: settings set target.env-vars ASAN_OPTIONS=detect_stack_use_after_return=1 DYLD_INSERT_LIBRARIES=/Users/buildslave/jenkins/workspace/lldb-cmake-sanitized/host-compiler/lib/clang/12.0.0/lib/darwin/libclang_rt.asan_osx_dynamic.dylib output:

Hide Details

runCmd: settings set target.env-vars ASAN_OPTIONS=detect_stack_use_after_return=1 DYLD_INSERT_LIBRARIES=/Users/buildslave/jenkins/workspace/lldb-cmake-sanitized/host-compiler/lib/clang/12.0.0/lib/darwin/libclang_rt.asan_osx_dynamic.dylib output:

Hide Details

<bound method SBProcess.Kill of <lldb.SBProcess; proxy of <Swig Object of type 'lldb::SBProcess *' at 0x106e2aa20> >>: success

Hide Details

PASS: LLDB (/Users/buildslave/jenkins/workspace/lldb-cmake-sanitized/lldb-build/bin/clang-x86_64) :: test_variable_list_dsym (TestVLA.TestVLA) runCmd: settings clear -all output:

Hide Details

runCmd: settings set symbols.enable-external-lookup false output:

Hide Details

runCmd: settings set target.inherit-tcc true output:

Hide Details

runCmd: settings set target.auto-apply-fixits false output:

Hide Details

runCmd: settings set plugin.process.gdb-remote.packet-timeout 60 output:

Hide Details

runCmd: settings set symbols.clang-modules-cache-path "/Users/buildslave/jenkins/workspace/lldb-cmake-sanitized/lldb-build/lldb-test-build.noindex/module-cache-lldb/lldb-api" output:

Hide Details

runCmd: settings set use-color false output:

Hide Details

runCmd: setting set target.prefer-dynamic-value no-dynamic-values output:

Hide Details

runCmd: settings set target.env-vars ASAN_OPTIONS=detect_stack_use_after_return=1 DYLD_INSERT_LIBRARIES=/Users/buildslave/jenkins/workspace/lldb-cmake-sanitized/host-compiler/lib/clang/12.0.0/lib/darwin/libclang_rt.asan_osx_dynamic.dylib output:

Hide Details

runCmd: settings set target.env-vars ASAN_OPTIONS=detect_stack_use_after_return=1 DYLD_INSERT_LIBRARIES=/Users/buildslave/jenkins/workspace/lldb-cmake-sanitized/host-compiler/lib/clang/12.0.0/lib/darwin/libclang_rt.asan_osx_dynamic.dylib output:

Hide Details

<bound method SBProcess.Kill of <lldb.SBProcess; proxy of <Swig Object of type 'lldb::SBProcess *' at 0x1061ba960> >>: success

Hide Details

PASS: LLDB (/Users/buildslave/jenkins/workspace/lldb-cmake-sanitized/lldb-build/bin/clang-x86_64) :: test_variable_list_dwarf (TestVLA.TestVLA) UNSUPPORTED: LLDB (/Users/buildslave/jenkins/workspace/lldb-cmake-sanitized/lldb-build/bin/clang-x86_64) :: test_variable_list_dwo (TestVLA.TestVLA) (test case does not fall in any category of interest for this run) runCmd: settings clear -all output:

Hide Details

runCmd: settings set symbols.enable-external-lookup false output:

Hide Details

runCmd: settings set target.inherit-tcc true output:

Hide Details

runCmd: settings set target.auto-apply-fixits false output:

Hide Details

runCmd: settings set plugin.process.gdb-remote.packet-timeout 60 output:

Hide Details

runCmd: settings set symbols.clang-modules-cache-path "/Users/buildslave/jenkins/workspace/lldb-cmake-sanitized/lldb-build/lldb-test-build.noindex/module-cache-lldb/lldb-api" output:

Hide Details

runCmd: settings set use-color false output:

Hide Details

runCmd: setting set target.prefer-dynamic-value no-dynamic-values output:

Hide Details

runCmd: settings set target.env-vars ASAN_OPTIONS=detect_stack_use_after_return=1 DYLD_INSERT_LIBRARIES=/Users/buildslave/jenkins/workspace/lldb-cmake-sanitized/host-compiler/lib/clang/12.0.0/lib/darwin/libclang_rt.asan_osx_dynamic.dylib output:

Hide Details

runCmd: settings set target.env-vars ASAN_OPTIONS=detect_stack_use_after_return=1 DYLD_INSERT_LIBRARIES=/Users/buildslave/jenkins/workspace/lldb-cmake-sanitized/host-compiler/lib/clang/12.0.0/lib/darwin/libclang_rt.asan_osx_dynamic.dylib output:

Hide Details

<bound method SBProcess.Kill of <lldb.SBProcess; proxy of <Swig Object of type 'lldb::SBProcess *' at 0x1066a99f0> >>: success

Hide Details

PASS: LLDB (/Users/buildslave/jenkins/workspace/lldb-cmake-sanitized/lldb-build/bin/clang-x86_64) :: test_variable_list_gmodules (TestVLA.TestVLA) runCmd: settings clear -all output:

Hide Details

runCmd: settings set symbols.enable-external-lookup false output:

Hide Details

runCmd: settings set target.inherit-tcc true output:

Hide Details

runCmd: settings set target.auto-apply-fixits false output:

Hide Details

runCmd: settings set plugin.process.gdb-remote.packet-timeout 60 output:

Hide Details

runCmd: settings set symbols.clang-modules-cache-path "/Users/buildslave/jenkins/workspace/lldb-cmake-sanitized/lldb-build/lldb-test-build.noindex/module-cache-lldb/lldb-api" output:

Hide Details

runCmd: settings set use-color false output:

Hide Details

runCmd: setting set target.prefer-dynamic-value no-dynamic-values output:

Hide Details

runCmd: settings set target.env-vars ASAN_OPTIONS=detect_stack_use_after_return=1 DYLD_INSERT_LIBRARIES=/Users/buildslave/jenkins/workspace/lldb-cmake-sanitized/host-compiler/lib/clang/12.0.0/lib/darwin/libclang_rt.asan_osx_dynamic.dylib output:

Hide Details

runCmd: settings set target.env-vars ASAN_OPTIONS=detect_stack_use_after_return=1 DYLD_INSERT_LIBRARIES=/Users/buildslave/jenkins/workspace/lldb-cmake-sanitized/host-compiler/lib/clang/12.0.0/lib/darwin/libclang_rt.asan_osx_dynamic.dylib output:

Hide Details

runCmd: fr v vla[0] output: (int) vla[0] = <parent failed to evaluate: variable not available>

Hide Details

Hide Details

Hide Details

Ran command: "fr v vla[0]"

Hide Details

Got output: (int) vla[0] = <parent failed to evaluate: variable not available>

Hide Details

Hide Details

Expecting sub string: "int" (was found) Expecting sub string: "2" (was not found)

Hide Details

FAIL: LLDB (/Users/buildslave/jenkins/workspace/lldb-cmake-sanitized/lldb-build/bin/clang-x86_64) :: test_vla_dsym (TestVLA.TestVLA) <bound method SBProcess.Kill of <lldb.SBProcess; proxy of <Swig Object of type 'lldb::SBProcess *' at 0x1061ba450> >>: success

Hide Details

runCmd: settings clear -all output:

Hide Details

runCmd: settings set symbols.enable-external-lookup false output:

Hide Details

runCmd: settings set target.inherit-tcc true output:

Hide Details

runCmd: settings set target.auto-apply-fixits false output:

Hide Details

runCmd: settings set plugin.process.gdb-remote.packet-timeout 60 output:

Hide Details

runCmd: settings set symbols.clang-modules-cache-path "/Users/buildslave/jenkins/workspace/lldb-cmake-sanitized/lldb-build/lldb-test-build.noindex/module-cache-lldb/lldb-api" output:

Hide Details

runCmd: settings set use-color false output:

Hide Details

runCmd: setting set target.prefer-dynamic-value no-dynamic-values output:

Hide Details

runCmd: settings set target.env-vars ASAN_OPTIONS=detect_stack_use_after_return=1 DYLD_INSERT_LIBRARIES=/Users/buildslave/jenkins/workspace/lldb-cmake-sanitized/host-compiler/lib/clang/12.0.0/lib/darwin/libclang_rt.asan_osx_dynamic.dylib output:

Hide Details

runCmd: settings set target.env-vars ASAN_OPTIONS=detect_stack_use_after_return=1 DYLD_INSERT_LIBRARIES=/Users/buildslave/jenkins/workspace/lldb-cmake-sanitized/host-compiler/lib/clang/12.0.0/lib/darwin/libclang_rt.asan_osx_dynamic.dylib output:

Hide Details

runCmd: fr v vla[0] output: (int) vla[0] = <parent failed to evaluate: variable not available>

Hide Details

Hide Details

Hide Details

Ran command: "fr v vla[0]"

Hide Details

Got output: (int) vla[0] = <parent failed to evaluate: variable not available>

Hide Details

Hide Details

Expecting sub string: "int" (was found) Expecting sub string: "2" (was not found)

Hide Details

FAIL: LLDB (/Users/buildslave/jenkins/workspace/lldb-cmake-sanitized/lldb-build/bin/clang-x86_64) :: test_vla_dwarf (TestVLA.TestVLA) <bound method SBProcess.Kill of <lldb.SBProcess; proxy of <Swig Object of type 'lldb::SBProcess *' at 0x1066a99f0> >>: success

Hide Details

UNSUPPORTED: LLDB (/Users/buildslave/jenkins/workspace/lldb-cmake-sanitized/lldb-build/bin/clang-x86_64) :: test_vla_dwo (TestVLA.TestVLA) (test case does not fall in any category of interest for this run) runCmd: settings clear -all output:

Hide Details

runCmd: settings set symbols.enable-external-lookup false output:

Hide Details

runCmd: settings set target.inherit-tcc true output:

Hide Details

runCmd: settings set target.auto-apply-fixits false output:

Hide Details

runCmd: settings set plugin.process.gdb-remote.packet-timeout 60 output:

Hide Details

runCmd: settings set symbols.clang-modules-cache-path "/Users/buildslave/jenkins/workspace/lldb-cmake-sanitized/lldb-build/lldb-test-build.noindex/module-cache-lldb/lldb-api" output:

Hide Details

runCmd: settings set use-color false output:

Hide Details

runCmd: setting set target.prefer-dynamic-value no-dynamic-values output:

Hide Details

runCmd: settings set target.env-vars ASAN_OPTIONS=detect_stack_use_after_return=1 DYLD_INSERT_LIBRARIES=/Users/buildslave/jenkins/workspace/lldb-cmake-sanitized/host-compiler/lib/clang/12.0.0/lib/darwin/libclang_rt.asan_osx_dynamic.dylib output:

Hide Details

runCmd: settings set target.env-vars ASAN_OPTIONS=detect_stack_use_after_return=1 DYLD_INSERT_LIBRARIES=/Users/buildslave/jenkins/workspace/lldb-cmake-sanitized/host-compiler/lib/clang/12.0.0/lib/darwin/libclang_rt.asan_osx_dynamic.dylib output:

Hide Details

runCmd: fr v vla[0] output: (int) vla[0] = <parent failed to evaluate: variable not available>

Hide Details

Hide Details

Hide Details

Ran command: "fr v vla[0]"

Hide Details

Got output: (int) vla[0] = <parent failed to evaluate: variable not available>

Hide Details

Hide Details

Expecting sub string: "int" (was found) Expecting sub string: "2" (was not found)

Hide Details

FAIL: LLDB (/Users/buildslave/jenkins/workspace/lldb-cmake-sanitized/lldb-build/bin/clang-x86_64) :: test_vla_gmodules (TestVLA.TestVLA) <bound method SBProcess.Kill of <lldb.SBProcess; proxy of <Swig Object of type 'lldb::SBProcess *' at 0x1061ba960> >>: success

Hide Details

Restore dir to: /Users/buildslave/jenkins/workspace/lldb-cmake-sanitized/lldb-build/tools/lldb/test ====================================================================== FAIL: test_vla_dsym (TestVLA.TestVLA) ---------------------------------------------------------------------- Traceback (most recent call last): File "/Users/buildslave/jenkins/workspace/lldb-cmake-sanitized/llvm-project/lldb/packages/Python/lldbsuite/test/lldbtest.py", line 1823, in test_method return attrvalue(self) File "/Users/buildslave/jenkins/workspace/lldb-cmake-sanitized/llvm-project/lldb/packages/Python/lldbsuite/test/decorators.py", line 134, in wrapper return func(*args, **kwargs) File "/Users/buildslave/jenkins/workspace/lldb-cmake-sanitized/llvm-project/lldb/test/API/lang/c/vla/TestVLA.py", line 42, in test_vla test(2, ["int []", "[0] = 2, [1] = 1"]) File "/Users/buildslave/jenkins/workspace/lldb-cmake-sanitized/llvm-project/lldb/test/API/lang/c/vla/TestVLA.py", line 37, in test self.expect("fr v vla[%d]"%i, substrs=["int", "%d"%(a-i)]) File "/Users/buildslave/jenkins/workspace/lldb-cmake-sanitized/llvm-project/lldb/packages/Python/lldbsuite/test/lldbtest.py", line 2526, in expect self.fail(log_msg) AssertionError: Ran command: "fr v vla[0]"

Hide Details

Got output: (int) vla[0] = <parent failed to evaluate: variable not available>

Hide Details

Hide Details

Expecting sub string: "int" (was found) Expecting sub string: "2" (was not found) Config=x86_64-/Users/buildslave/jenkins/workspace/lldb-cmake-sanitized/lldb-build/bin/clang ====================================================================== FAIL: test_vla_dwarf (TestVLA.TestVLA) ---------------------------------------------------------------------- Traceback (most recent call last): File "/Users/buildslave/jenkins/workspace/lldb-cmake-sanitized/llvm-project/lldb/packages/Python/lldbsuite/test/lldbtest.py", line 1823, in test_method return attrvalue(self) File "/Users/buildslave/jenkins/workspace/lldb-cmake-sanitized/llvm-project/lldb/packages/Python/lldbsuite/test/decorators.py", line 134, in wrapper return func(*args, **kwargs) File "/Users/buildslave/jenkins/workspace/lldb-cmake-sanitized/llvm-project/lldb/test/API/lang/c/vla/TestVLA.py", line 42, in test_vla test(2, ["int []", "[0] = 2, [1] = 1"]) File "/Users/buildslave/jenkins/workspace/lldb-cmake-sanitized/llvm-project/lldb/test/API/lang/c/vla/TestVLA.py", line 37, in test self.expect("fr v vla[%d]"%i, substrs=["int", "%d"%(a-i)]) File "/Users/buildslave/jenkins/workspace/lldb-cmake-sanitized/llvm-project/lldb/packages/Python/lldbsuite/test/lldbtest.py", line 2526, in expect self.fail(log_msg) AssertionError: Ran command: "fr v vla[0]"

Hide Details

Got output: (int) vla[0] = <parent failed to evaluate: variable not available>

Hide Details

Hide Details

Expecting sub string: "int" (was found) Expecting sub string: "2" (was not found) Config=x86_64-/Users/buildslave/jenkins/workspace/lldb-cmake-sanitized/lldb-build/bin/clang ====================================================================== FAIL: test_vla_gmodules (TestVLA.TestVLA) ---------------------------------------------------------------------- Traceback (most recent call last): File "/Users/buildslave/jenkins/workspace/lldb-cmake-sanitized/llvm-project/lldb/packages/Python/lldbsuite/test/lldbtest.py", line 1823, in test_method return attrvalue(self) File "/Users/buildslave/jenkins/workspace/lldb-cmake-sanitized/llvm-project/lldb/packages/Python/lldbsuite/test/decorators.py", line 134, in wrapper return func(*args, **kwargs) File "/Users/buildslave/jenkins/workspace/lldb-cmake-sanitized/llvm-project/lldb/test/API/lang/c/vla/TestVLA.py", line 42, in test_vla test(2, ["int []", "[0] = 2, [1] = 1"]) File "/Users/buildslave/jenkins/workspace/lldb-cmake-sanitized/llvm-project/lldb/test/API/lang/c/vla/TestVLA.py", line 37, in test self.expect("fr v vla[%d]"%i, substrs=["int", "%d"%(a-i)]) File "/Users/buildslave/jenkins/workspace/lldb-cmake-sanitized/llvm-project/lldb/packages/Python/lldbsuite/test/lldbtest.py", line 2526, in expect self.fail(log_msg) AssertionError: Ran command: "fr v vla[0]"

Hide Details

Got output: (int) vla[0] = <parent failed to evaluate: variable not available>

Hide Details

Hide Details

Expecting sub string: "int" (was found) Expecting sub string: "2" (was not found) Config=x86_64-/Users/buildslave/jenkins/workspace/lldb-cmake-sanitized/lldb-build/bin/clang ---------------------------------------------------------------------- Ran 8 tests in 13.058s

Hide Details

RESULT: FAILED (3 passes, 3 failures, 0 errors, 2 skipped, 0 expected failures, 0 unexpected successes)

Hide Details

--

Hide Details

******************** PASS: lldb-api :: python_api/interpreter/TestRunCommandInterpreterAPI.py (1011 of 2138) PASS: lldb-api :: lang/objc/foundation/TestConstStrings.py (1012 of 2138) PASS: lldb-shell :: Reproducer/TestDump.test (1013 of 2138) UNSUPPORTED: lldb-api :: functionalities/darwin_log/filter/regex/category/TestDarwinLogFilterRegexCategory.py (1014 of 2138) PASS: lldb-unit :: Host/./HostTests/ConnectionFileDescriptorTest.TCPGetURIv6 (1015 of 2138) PASS: lldb-api :: types/TestFloatTypesExpr.py (1016 of 2138) PASS: lldb-shell :: ObjectFile/PECOFF/sections.yaml (1017 of 2138) PASS: lldb-unit :: Utility/./UtilityTests/StringLexerTest.AdvanceIf (1018 of 2138) PASS: lldb-unit :: Process/gdb-remote/./ProcessGdbRemoteTests/GDBRemoteCommunicationClientTest.SendGetMetaDataPacket (1019 of 2138) PASS: lldb-api :: lang/cpp/subst_template_type_param/TestSubstTemplateTypeParam.py (1020 of 2138) PASS: lldb-api :: commands/expression/rdar42038760/TestScalarURem.py (1021 of 2138) UNSUPPORTED: lldb-api :: functionalities/thread/state/TestThreadStates.py (1022 of 2138) PASS: lldb-api :: lang/cpp/nested-class-other-compilation-unit/TestNestedClassWithParentInAnotherCU.py (1023 of 2138) PASS: lldb-api :: commands/frame/diagnose/complicated-expression/TestComplicatedExpression.py (1024 of 2138) PASS: lldb-unit :: Utility/./UtilityTests/RangeTest.DoesIntersect (1025 of 2138) PASS: lldb-api :: functionalities/thread/concurrent_events/TestConcurrentTwoBreakpointsOneWatchpoint.py (1026 of 2138) PASS: lldb-unit :: ScriptInterpreter/Python/./ScriptInterpreterPythonTests/PythonDataObjectsTest.TestPythonStringToStr (1027 of 2138) UNSUPPORTED: lldb-api :: macosx/macCatalystAppMacOSFramework/TestMacCatalystAppWithMacOSFramework.py (1028 of 2138) XFAIL: lldb-shell :: Unwind/prefer-debug-over-eh-frame.test (1029 of 2138) PASS: lldb-api :: lang/objc/objc-baseclass-sbtype/TestObjCBaseClassSBType.py (1030 of 2138) PASS: lldb-unit :: Utility/./UtilityTests/BinaryStreamTest.PutULEB128FiveBytes (1031 of 2138) PASS: lldb-unit :: Symbol/./SymbolTests/TestClangASTImporter.RecordLayout (1032 of 2138) PASS: lldb-unit :: Utility/./UtilityTests/OptionsWithRawTest.EmptySuffix (1033 of 2138) PASS: lldb-api :: functionalities/postmortem/minidump/TestMiniDump.py (1034 of 2138) PASS: lldb-unit :: DataFormatter/./LLDBFormatterTests/FormatManagerTests.CompatibleLangs (1035 of 2138) PASS: lldb-api :: commands/breakpoint/command/list/TestBreakpointCommandList.py (1036 of 2138) UNSUPPORTED: lldb-api :: functionalities/gdb_remote_client/TestQemuAArch64TargetXml.py (1037 of 2138) PASS: lldb-unit :: Utility/./UtilityTests/ConstStringTest.NullAndEmptyStates (1038 of 2138) PASS: lldb-api :: commands/platform/file/read/TestPlatformFileRead.py (1039 of 2138) PASS: lldb-unit :: Core/./LLDBCoreTests/SourceFileCache.FindSourceFileNotFound (1040 of 2138) PASS: lldb-api :: lang/cpp/class_static/TestStaticVariables.py (1041 of 2138) PASS: lldb-unit :: Utility/./UtilityTests/StreamTest.AddressRangeSize (1042 of 2138) PASS: lldb-shell :: SymbolFile/DWARF/find-method-local-struct.cpp (1043 of 2138) PASS: lldb-unit :: Utility/./UtilityTests/UriParserTest.BadPort2 (1044 of 2138) PASS: lldb-api :: commands/frame/diagnose/local-variable/TestLocalVariable.py (1045 of 2138) PASS: lldb-api :: lang/objc/objc-static-method-stripped/TestObjCStaticMethodStripped.py (1046 of 2138) PASS: lldb-api :: macosx/dyld-trie-symbols/TestDyldTrieSymbols.py (1047 of 2138) PASS: lldb-unit :: Expression/./ExpressionTests/DiagnosticManagerTest.AppendMessageNoDiag (1048 of 2138) PASS: lldb-unit :: Core/./LLDBCoreTests/RichManglingContextTest.FromCxxMethodName (1049 of 2138) PASS: lldb-unit :: Utility/./UtilityTests/StreamTest.PutRawBytesToLittleEndian (1050 of 2138) PASS: lldb-api :: functionalities/data-formatter/synthupdate/TestSyntheticFilterRecompute.py (1051 of 2138) PASS: lldb-unit :: ScriptInterpreter/Python/./ScriptInterpreterPythonTests/PythonDataObjectsTest.TestGlobalNameResolutionWithDot (1052 of 2138) PASS: lldb-api :: lang/c/unicode/TestUnicodeSymbols.py (1053 of 2138) UNSUPPORTED: lldb-shell :: Register/aarch64-gp-read.test (1054 of 2138) PASS: lldb-unit :: Utility/./UtilityTests/NameMatchesTest.Ignore (1055 of 2138) PASS: lldb-api :: api/listeners/TestListener.py (1056 of 2138) PASS: lldb-unit :: SymbolFile/DWARF/./SymbolFileDWARFTests/SymbolFileDWARFTests.TestAbbrevOrder1Start5 (1057 of 2138) PASS: lldb-unit :: Utility/./UtilityTests/StringExtractorTest.GetHexU8_InvalidHex (1058 of 2138) PASS: lldb-unit :: Utility/./UtilityTests/RangeDataVector.FindEntryIndexesThatContain (1059 of 2138) UNSUPPORTED: lldb-api :: functionalities/data-formatter/data-formatter-stl/libstdcpp/unique_ptr/TestDataFormatterStdUniquePtr.py (1060 of 2138) UNSUPPORTED: lldb-api :: tools/lldb-server/TestGdbRemoteAuxvSupport.py (1061 of 2138) PASS: lldb-shell :: Reproducer/TestDebugSymbols.test (1062 of 2138) PASS: lldb-api :: functionalities/inferior-changed/TestInferiorChanged.py (1063 of 2138) PASS: lldb-unit :: Utility/./UtilityTests/StringExtractorTest.GetHexU8_Exact (1064 of 2138) PASS: lldb-api :: commands/expression/call-throws/TestCallThatThrows.py (1065 of 2138) PASS: lldb-unit :: Interpreter/./InterpreterTests/CompletionTest.DirCompletionAbsolute (1066 of 2138) UNSUPPORTED: lldb-shell :: Minidump/Windows/arm-fp-unwind.test (1067 of 2138) PASS: lldb-api :: functionalities/tail_call_frames/inlining_and_tail_calls/TestInliningAndTailCalls.py (1068 of 2138) PASS: lldb-unit :: UnwindAssembly/x86/./UnwindAssemblyx86Tests/Testx86AssemblyInspectionEngine.TestPopEBX (1069 of 2138) PASS: lldb-api :: functionalities/memory/find/TestMemoryFind.py (1070 of 2138) PASS: lldb-api :: functionalities/breakpoint/breakpoint_options/TestBreakpointOptions.py (1071 of 2138) UNSUPPORTED: lldb-api :: functionalities/data-formatter/data-formatter-stl/libstdcpp/string/TestDataFormatterStdString.py (1072 of 2138) PASS: lldb-unit :: Utility/./UtilityTests/AnsiTerminal.Incomplete (1073 of 2138) PASS: lldb-unit :: Utility/./UtilityTests/StringListTest.Join (1074 of 2138) PASS: lldb-api :: macosx/universal/TestUniversal.py (1075 of 2138) UNSUPPORTED: lldb-shell :: SymbolFile/PDB/compilands.test (1076 of 2138) PASS: lldb-unit :: Utility/./UtilityTests/Flags.AnyClear (1077 of 2138) PASS: lldb-api :: functionalities/tail_call_frames/thread_step_out_or_return/TestSteppingOutWithArtificialFrames.py (1078 of 2138) PASS: lldb-api :: macosx/order/TestOrderFile.py (1079 of 2138) PASS: lldb-unit :: Utility/./UtilityTests/StringLexerTest.PutBack (1080 of 2138) PASS: lldb-api :: commands/watchpoints/hello_watchpoint/TestMyFirstWatchpoint.py (1081 of 2138) PASS: lldb-unit :: Utility/./UtilityTests/StreamTest.AddressSuffix (1082 of 2138) PASS: lldb-api :: commands/expression/import_base_class_when_class_has_derived_member/TestImportBaseClassWhenClassHasDerivedMember.py (1083 of 2138) PASS: lldb-api :: commands/expression/unwind_expression/TestUnwindExpression.py (1084 of 2138) PASS: lldb-api :: python_api/get-value-32bit-int/TestGetValue32BitInt.py (1085 of 2138) PASS: lldb-unit :: Utility/./UtilityTests/StreamTeeTest.AppendStream (1086 of 2138) PASS: lldb-unit :: Utility/./UtilityTests/StreamTeeTest.GetStreamAtIndexOutOfBounds (1087 of 2138) PASS: lldb-api :: functionalities/data-formatter/data-formatter-objc/TestDataFormatterObjNSException.py (1088 of 2138) PASS: lldb-unit :: Target/./TargetTests/ModuleCacheTest.GetAndPutUuidExists (1089 of 2138) PASS: lldb-api :: functionalities/type_completion/TestTypeCompletion.py (1090 of 2138) PASS: lldb-unit :: Utility/./UtilityTests/FileSpecTest.Yaml (1091 of 2138) PASS: lldb-unit :: Utility/./UtilityTests/Flags.AnySet (1092 of 2138) PASS: lldb-unit :: Utility/./UtilityTests/StringExtractorTest.GetHexBytes (1093 of 2138) PASS: lldb-unit :: Utility/./UtilityTests/StringListTest.GetMaxStringLengthDecreasingSize (1094 of 2138) UNSUPPORTED: lldb-api :: functionalities/ptr_refs/TestPtrRefs.py (1095 of 2138) PASS: lldb-unit :: Symbol/./SymbolTests/DWARFCallFrameInfoTest.Basic_dwarf4 (1096 of 2138) PASS: lldb-unit :: ScriptInterpreter/Python/./ScriptInterpreterPythonTests/PythonDataObjectsTest.TestResetting (1097 of 2138) PASS: lldb-unit :: Utility/./UtilityTests/EnvironmentTest.EnvpConversion (1098 of 2138) PASS: lldb-api :: commands/expression/codegen-crash-import-def-arraytype-element/TestImportDefinitionArrayType.py (1099 of 2138) PASS: lldb-unit :: Interpreter/./InterpreterTests/CompletionTest.FileCompletionAbsolute (1100 of 2138) PASS: lldb-unit :: Utility/./UtilityTests/XcodeSDKTest.FindXcodeContentsDirectoryInPath (1101 of 2138) PASS: lldb-api :: lang/c/stepping/TestStepAndBreakpoints.py (1102 of 2138) PASS: lldb-api :: functionalities/optimized_code/TestNoASanExceptionAfterEvalOP_piece.py (1103 of 2138) PASS: lldb-api :: sample_test/TestSampleInlineTest.py (1104 of 2138) UNSUPPORTED: lldb-shell :: Register/x86-gp-write.test (1105 of 2138) PASS: lldb-api :: tools/lldb-server/commandline/TestStubReverseConnect.py (1106 of 2138) UNSUPPORTED: lldb-api :: tools/lldb-server/TestGdbRemote_vContThreads.py (1107 of 2138) PASS: lldb-shell :: ObjectFile/Breakpad/discontiguous-sections.test (1108 of 2138) PASS: lldb-shell :: SymbolFile/Breakpad/unwind-via-raSearch.test (1109 of 2138) PASS: lldb-api :: commands/expression/import-std-module/empty-module/TestEmptyStdModule.py (1110 of 2138) PASS: lldb-unit :: Language/Highlighting/./HighlighterTests/HighlighterTest.ClangSquareBrackets (1111 of 2138) PASS: lldb-shell :: SymbolFile/NativePDB/bitfields.cpp (1112 of 2138) PASS: lldb-api :: commands/target/basic/TestTargetCommand.py (1113 of 2138) PASS: lldb-api :: lang/objcxx/hide-runtime-values/TestObjCXXHideRuntimeValues.py (1114 of 2138) PASS: lldb-api :: functionalities/recursion/TestValueObjectRecursion.py (1115 of 2138) UNSUPPORTED: lldb-api :: commands/trace/TestTraceLoad.py (1116 of 2138) PASS: lldb-api :: functionalities/thread/concurrent_events/TestConcurrentSignalWatch.py (1117 of 2138) PASS: lldb-unit :: Utility/./UtilityTests/SerializationRountripTest.SerializeDeserializeCString (1118 of 2138) PASS: lldb-api :: iohandler/resize/TestIOHandlerResizeNoEditline.py (1119 of 2138) PASS: lldb-unit :: Process/gdb-remote/./ProcessGdbRemoteTests/GDBRemoteClientBaseTest.SendContinueAndWait (1120 of 2138) PASS: lldb-api :: python_api/frame/get-variables/TestGetVariables.py (1121 of 2138) PASS: lldb-api :: functionalities/memory-region/TestMemoryRegion.py (1122 of 2138) PASS: lldb-unit :: Utility/./UtilityTests/TildeExpressionResolver.ResolveFullPath (1123 of 2138) PASS: lldb-unit :: Utility/./UtilityTests/UUIDTest.Validity (1124 of 2138) PASS: lldb-shell :: ObjectFile/PECOFF/dep-modules.yaml (1125 of 2138) PASS: lldb-unit :: Host/./HostTests/MainLoopTest.ReadObject (1126 of 2138) PASS: lldb-unit :: Language/Highlighting/./HighlighterTests/HighlighterTest.Colons (1127 of 2138) PASS: lldb-api :: lang/cpp/frame-var-anon-unions/TestFrameVariableAnonymousUnions.py (1128 of 2138) PASS: lldb-api :: functionalities/target_var/TestTargetVar.py (1129 of 2138) PASS: lldb-unit :: Core/./LLDBCoreTests/ModuleSpecTest.InvalidInMemoryBufferValidFile (1130 of 2138) PASS: lldb-unit :: Utility/./UtilityTests/ArgsTest.AppendArguments (1131 of 2138) PASS: lldb-unit :: UnwindAssembly/x86/./UnwindAssemblyx86Tests/Testx86AssemblyInspectionEngine.TestPushR12 (1132 of 2138) PASS: lldb-api :: commands/watchpoints/watchpoint_commands/TestWatchpointCommands.py (1133 of 2138) PASS: lldb-unit :: Utility/./UtilityTests/RangeTest.NotEqual (1134 of 2138) PASS: lldb-unit :: Utility/./UtilityTests/BroadcasterTest.EventTypeHasListeners (1135 of 2138) PASS: lldb-api :: functionalities/breakpoint/breakpoint_hit_count/TestBreakpointHitCount.py (1136 of 2138) UNSUPPORTED: lldb-api :: functionalities/darwin_log/filter/exact_match/activity/TestDarwinLogFilterMatchActivity.py (1137 of 2138) PASS: lldb-api :: functionalities/data-formatter/varscript_formatting/TestDataFormatterVarScriptFormatting.py (1138 of 2138) PASS: lldb-api :: lang/cpp/trivial_abi/TestTrivialABI.py (1139 of 2138) PASS: lldb-unit :: UnwindAssembly/x86/./UnwindAssemblyx86Tests/Testx86AssemblyInspectionEngine.TestPopESI (1140 of 2138) PASS: lldb-api :: commands/expression/cast_int_to_anonymous_enum/TestCastIntToAnonymousEnum.py (1141 of 2138) PASS: lldb-api :: lang/cpp/gmodules/TestWithModuleDebugging.py (1142 of 2138) PASS: lldb-unit :: Interpreter/./InterpreterTests/OptionArgParserTest.toBoolean (1143 of 2138) PASS: lldb-shell :: Host/TestCustomShell.test (1144 of 2138) PASS: lldb-unit :: Utility/./UtilityTests/BinaryStreamTest.PutULEB128OneByte (1145 of 2138) PASS: lldb-unit :: Utility/./UtilityTests/LogChannelEnabledTest.LogThread (1146 of 2138) PASS: lldb-unit :: Utility/./UtilityTests/CompletionRequest.FakeLastArg (1147 of 2138) PASS: lldb-unit :: Utility/./UtilityTests/Flags.IsClear (1148 of 2138) PASS: lldb-unit :: Utility/./UtilityTests/Predicate.WaitForValueEqualTo (1149 of 2138) PASS: lldb-api :: lang/cpp/incomplete-types/TestCppIncompleteTypes.py (1150 of 2138) PASS: lldb-unit :: Symbol/./SymbolTests/SymbolsTest.LocateExecutableSymbolFileForUnknownExecutableAndMissingSymbolFile (1151 of 2138) PASS: lldb-shell :: Driver/TestProcessAttach.test (1152 of 2138) PASS: lldb-unit :: ObjectFile/Breakpad/./ObjectFileBreakpadTests/PublicRecord.parse (1153 of 2138) PASS: lldb-api :: commands/watchpoints/step_over_watchpoint/TestStepOverWatchpoint.py (1154 of 2138) PASS: lldb-unit :: Language/Highlighting/./HighlighterTests/HighlighterTest.FallbackHighlighter (1155 of 2138) PASS: lldb-unit :: Utility/./UtilityTests/DataExtractorTest.GetFloat (1156 of 2138) PASS: lldb-api :: lang/cpp/dynamic-value/TestDynamicValue.py (1157 of 2138) PASS: lldb-shell :: ObjectFile/PECOFF/basic-info-arm64.yaml (1158 of 2138) PASS: lldb-unit :: Process/minidump/./LLDBMinidumpTests/MinidumpParserTest.GetLinuxProcStatus_no_stream (1159 of 2138) UNSUPPORTED: lldb-api :: functionalities/exec/TestExec.py (1160 of 2138) PASS: lldb-api :: commands/target/stop-hook/disable/TestTargetStopHookDisable.py (1161 of 2138) PASS: lldb-unit :: Utility/./UtilityTests/RangeTest.SetRangeBase (1162 of 2138) UNSUPPORTED: lldb-api :: commands/register/register/intel_xtended_registers/TestMPXRegisters.py (1163 of 2138) PASS: lldb-api :: lang/cpp/extern_c/TestExternCSymbols.py (1164 of 2138) PASS: lldb-unit :: Utility/./UtilityTests/StructuredDataTest.ParseJSONFromFile (1165 of 2138) PASS: lldb-api :: python_api/hello_world/TestHelloWorld.py (1166 of 2138) PASS: lldb-shell :: Register/x86-64-gp-read.test (1167 of 2138) PASS: lldb-api :: functionalities/data-formatter/data-formatter-synth/TestDataFormatterSynth.py (1168 of 2138) PASS: lldb-unit :: SymbolFile/NativePDB/./SymbolFileNativePDBTests/PDBFPOProgramToDWARFExpressionTests.SingleAssignmentRegisterRef (1169 of 2138) PASS: lldb-unit :: Utility/./UtilityTests/ScalarTest.ComparisonFloat (1170 of 2138) PASS: lldb-api :: commands/thread/select/TestThreadSelect.py (1171 of 2138) PASS: lldb-api :: python_api/watchpoint/watchlocation/TestTargetWatchAddress.py (1172 of 2138) UNSUPPORTED: lldb-api :: iohandler/resize/TestIOHandlerResize.py (1173 of 2138) PASS: lldb-api :: functionalities/thread/concurrent_events/TestConcurrentTwoWatchpointThreads.py (1174 of 2138) PASS: lldb-api :: lang/cpp/namespace/TestNamespace.py (1175 of 2138) PASS: lldb-api :: functionalities/wrong_commands/TestWrongCommands.py (1176 of 2138) PASS: lldb-unit :: Signals/./SignalsTests/UnixSignalsTest.GetInfo (1177 of 2138) PASS: lldb-api :: python_api/file_handle/TestFileHandle.py (1178 of 2138) PASS: lldb-shell :: Minidump/no-process-id.yaml (1179 of 2138) UNSUPPORTED: lldb-api :: functionalities/asan/TestReportData.py (1180 of 2138) PASS: lldb-unit :: Utility/./UtilityTests/StreamTest.AddressPrefix (1181 of 2138) PASS: lldb-shell :: SymbolFile/DWARF/childless-compile-unit.s (1182 of 2138) PASS: lldb-shell :: ObjectFile/Breakpad/uuid-matching-mac.test (1183 of 2138) PASS: lldb-unit :: Utility/./UtilityTests/RecordReplayTest.InstrumentedBarPtr (1184 of 2138) PASS: lldb-api :: functionalities/process_crash_info/TestProcessCrashInfo.py (1185 of 2138) UNSUPPORTED: lldb-shell :: SymbolFile/PDB/pointers.test (1186 of 2138) PASS: lldb-api :: python_api/watchpoint/TestWatchpointIter.py (1187 of 2138) PASS: lldb-unit :: ObjectFile/ELF/./ObjectFileELFTests/ObjectFileELFTest.GetModuleSpecifications_EarlySectionHeaders (1188 of 2138) PASS: lldb-shell :: Settings/TestSettingsSet.test (1189 of 2138) PASS: lldb-shell :: SymbolFile/Breakpad/unwind-via-stack-cfi.test (1190 of 2138) UNSUPPORTED: lldb-api :: functionalities/unwind/standard/TestStandardUnwind.py (1191 of 2138) PASS: lldb-shell :: SymbolFile/DWARF/debug_ranges-missing-section.s (1192 of 2138) PASS: lldb-unit :: SymbolFile/NativePDB/./SymbolFileNativePDBTests/PDBFPOProgramToDWARFExpressionTests.InvalidOpUnary (1193 of 2138) PASS: lldb-unit :: Process/minidump/./LLDBMinidumpTests/MinidumpParserTest.MinidumpDuplicateModuleMappedSecond (1194 of 2138) PASS: lldb-shell :: SymbolFile/DWARF/find-basic-function.cpp (1195 of 2138) PASS: lldb-unit :: Utility/./UtilityTests/StringListTest.Clear (1196 of 2138) PASS: lldb-unit :: Utility/./UtilityTests/StringListTest.LongestCommonPrefixNoPrefix (1197 of 2138) PASS: lldb-unit :: Utility/./UtilityTests/CompletionRequest.Constructor (1198 of 2138) PASS: lldb-shell :: SymbolFile/DWARF/DW_AT_low_pc-addrx.s (1199 of 2138) PASS: lldb-shell :: ObjectFile/MachO/lc_build_version.yaml (1200 of 2138) PASS: lldb-unit :: Utility/./UtilityTests/StreamTest.AddressRangeInvalidRange (1201 of 2138) PASS: lldb-unit :: Host/./HostTests/FileSystemTest.EnumerateDirectory (1202 of 2138) PASS: lldb-unit :: Utility/./UtilityTests/ScalarTest.ExtractBitfield (1203 of 2138) UNSUPPORTED: lldb-api :: functionalities/darwin_log/filter/regex/activity/TestDarwinLogFilterRegexActivity.py (1204 of 2138) UNSUPPORTED: lldb-api :: commands/expression/completion-crash-invalid-iterator/TestInvalidIteratorCompletionCrash.py (1205 of 2138) PASS: lldb-api :: python_api/value/empty_class/TestValueAPIEmptyClass.py (1206 of 2138) PASS: lldb-unit :: Utility/./UtilityTests/StringListTest.InsertStringAtIndexStdString (1207 of 2138) PASS: lldb-api :: lang/objc/radar-9691614/TestObjCMethodReturningBOOL.py (1208 of 2138) PASS: lldb-shell :: SymbolFile/Breakpad/symtab.test (1209 of 2138) PASS: lldb-unit :: Utility/./UtilityTests/DataExtractorTest.GetCStrAtNullOffset (1210 of 2138) PASS: lldb-unit :: Host/./HostTests/NativeProcessProtocolTest.ReadMemoryWithoutTrap (1211 of 2138) UNSUPPORTED: lldb-shell :: BuildScript/toolchain-msvc.test (1212 of 2138) UNSUPPORTED: lldb-shell :: SymbolFile/NativePDB/stack_unwinding01.cpp (1213 of 2138) PASS: lldb-unit :: Process/minidump/./LLDBMinidumpTests/MinidumpParserTest.GetMemoryRegionInfoFromMemory64List (1214 of 2138) PASS: lldb-api :: lang/objc/objc-class-method/TestObjCClassMethod.py (1215 of 2138) PASS: lldb-unit :: Target/./TargetTests/ModuleCacheTest.GetAndPut (1216 of 2138) PASS: lldb-api :: lang/c/struct_types/TestStructTypes.py (1217 of 2138) PASS: lldb-unit :: Process/minidump/./LLDBMinidumpTests/MinidumpParserTest.GetMemoryRegionInfoFromMemoryList (1218 of 2138) PASS: lldb-api :: functionalities/thread/concurrent_events/TestConcurrentSignalDelayWatch.py (1219 of 2138) PASS: lldb-unit :: Utility/./UtilityTests/StringLexerTest.HasAtLeast (1220 of 2138) PASS: lldb-unit :: Utility/./UtilityTests/VMRange.Ordering (1221 of 2138) PASS: lldb-api :: lang/cpp/template-function/TestTemplateFunctions.py (1222 of 2138) PASS: lldb-shell :: SymbolFile/DWARF/clang-ast-from-dwarf-unamed-and-anon-structs.cpp (1223 of 2138) PASS: lldb-unit :: Utility/./UtilityTests/LogChannelEnabledTest.LogGetLogThread (1224 of 2138) PASS: lldb-unit :: Utility/./UtilityTests/StringListTest.AppendStringCString (1225 of 2138) PASS: lldb-unit :: Utility/./UtilityTests/FileSpecTest.GetPath (1226 of 2138) PASS: lldb-shell :: SymbolFile/DWARF/deterministic-build.cpp (1227 of 2138) PASS: lldb-api :: functionalities/postmortem/elf-core/TestLinuxCore.py (1228 of 2138) PASS: lldb-unit :: Utility/./UtilityTests/StringListTest.GetMaxStringLengthIncreasingSize (1229 of 2138) PASS: lldb-shell :: ObjectFile/ELF/minidebuginfo-corrupt-xz.yaml (1230 of 2138) PASS: lldb-shell :: ObjectFile/PECOFF/symbol.yaml (1231 of 2138) PASS: lldb-unit :: Utility/./UtilityTests/StringListTest.JoinNonSpace (1232 of 2138) PASS: lldb-unit :: Utility/./UtilityTests/RangeTest.DefaultConstructor (1233 of 2138) PASS: lldb-api :: functionalities/value_md5_crash/TestValueMD5Crash.py (1234 of 2138) PASS: lldb-unit :: Process/minidump/./LLDBMinidumpTests/MinidumpParserTest.FindMemoryRange (1235 of 2138) PASS: lldb-unit :: UnwindAssembly/x86/./UnwindAssemblyx86Tests/Testx86AssemblyInspectionEngine.TestSpillRegToStackViaMOVx86_64 (1236 of 2138) UNSUPPORTED: lldb-api :: commands/watchpoints/hello_watchlocation/TestWatchLocation.py (1237 of 2138) PASS: lldb-api :: functionalities/inferior-crashing/recursive-inferior/TestRecursiveInferiorStep.py (1238 of 2138) UNSUPPORTED: lldb-shell :: Register/x86-64-gp-write.test (1239 of 2138) PASS: lldb-api :: commands/expression/ir-interpreter-phi-nodes/TestIRInterpreterPHINodes.py (1240 of 2138) PASS: lldb-unit :: Utility/./UtilityTests/ScalarTest.SetValueFromData (1241 of 2138) PASS: lldb-api :: functionalities/data-formatter/data-formatter-objc/nsstring/TestDataFormatterNSString.py (1242 of 2138) PASS: lldb-api :: lang/objc/objc-static-method/TestObjCStaticMethod.py (1243 of 2138) PASS: lldb-unit :: Utility/./UtilityTests/DataExtractorTest.GetULEB128_bit63 (1244 of 2138) UNSUPPORTED: lldb-shell :: ScriptInterpreter/Lua/independent_state.test (1245 of 2138) PASS: lldb-api :: python_api/symbol-context/TestSymbolContext.py (1246 of 2138) PASS: lldb-unit :: ScriptInterpreter/Python/./ScriptInterpreterPythonTests/PythonDataObjectsTest.TestPythonIntegerToStructuredInteger (1247 of 2138) PASS: lldb-api :: functionalities/data-formatter/data-formatter-ptr-to-array/TestPtrToArrayFormatting.py (1248 of 2138) PASS: lldb-api :: commands/add-dsym/uuid/TestAddDsymCommand.py (1249 of 2138) PASS: lldb-shell :: ExecControl/StopHook/stop-hook.test (1250 of 2138) PASS: lldb-unit :: Utility/./UtilityTests/StringListTest.InsertStringAtIndexStart (1251 of 2138) PASS: lldb-unit :: Utility/./UtilityTests/StreamTest.PutPtr (1252 of 2138) PASS: lldb-shell :: ObjectFile/PECOFF/export-dllfunc.yaml (1253 of 2138) PASS: lldb-api :: lang/objc/objc_direct-methods/TestObjCDirectMethods.py (1254 of 2138) PASS: lldb-shell :: SymbolFile/NativePDB/globals-fundamental.cpp (1255 of 2138) PASS: lldb-unit :: UnwindAssembly/x86/./UnwindAssemblyx86Tests/Testx86AssemblyInspectionEngine.Test32bitFramelessBigStackFrame (1256 of 2138) PASS: lldb-api :: macosx/safe-to-func-call/TestSafeFuncCalls.py (1257 of 2138) PASS: lldb-unit :: Expression/./ExpressionTests/DWARFExpression.DW_OP_piece (1258 of 2138) PASS: lldb-api :: functionalities/gdb_remote_client/TestRegDefinitionInParts.py (1259 of 2138) PASS: lldb-api :: lang/cpp/this/TestCPPThis.py (1260 of 2138) PASS: lldb-api :: functionalities/thread/jump/TestThreadJump.py (1261 of 2138) PASS: lldb-api :: functionalities/unwind/noreturn/TestNoreturnUnwind.py (1262 of 2138) PASS: lldb-api :: lang/cpp/const_this/TestConstThis.py (1263 of 2138) PASS: lldb-unit :: Process/gdb-remote/./ProcessGdbRemoteTests/GDBRemoteClientBaseTest.SendContinueAndAsyncPacket (1264 of 2138) PASS: lldb-unit :: Utility/./UtilityTests/StreamTest.PutRawBytesToBigEndian (1265 of 2138) PASS: lldb-shell :: Driver/TestPositionalArgs.test (1266 of 2138) PASS: lldb-api :: functionalities/gdb_remote_client/TestNestedRegDefinitions.py (1267 of 2138) PASS: lldb-api :: tools/lldb-vscode/attach/TestVSCode_attach.py (1268 of 2138) PASS: lldb-unit :: Utility/./UtilityTests/StringExtractorTest.GetHexU8_Underflow2_NoEof (1269 of 2138) PASS: lldb-api :: commands/expression/no-deadlock/TestExprDoesntBlock.py (1270 of 2138) PASS: lldb-unit :: Symbol/./SymbolTests/PostfixExpression.ToDWARF (1271 of 2138) PASS: lldb-shell :: ObjectFile/ELF/build-id-case.yaml (1272 of 2138) PASS: lldb-unit :: Utility/./UtilityTests/DataExtractorTest.GetMaxU64_unchecked (1273 of 2138) PASS: lldb-unit :: Utility/./UtilityTests/StreamTest.AddressEmptyPrefix (1274 of 2138) PASS: lldb-api :: python_api/sbdata/TestSBData.py (1275 of 2138) PASS: lldb-unit :: Interpreter/./InterpreterTests/OptionValueFileColonLine.setFromString (1276 of 2138) PASS: lldb-unit :: Utility/./UtilityTests/ArgsTest.DoubleQuotedItem (1277 of 2138) PASS: lldb-unit :: Language/Highlighting/./HighlighterTests/HighlighterTest.ClangCommas (1278 of 2138) PASS: lldb-api :: lang/c/tls_globals/TestTlsGlobals.py (1279 of 2138) PASS: lldb-api :: lang/c/record_decl_in_expr/TestRecordDeclInExpr.py (1280 of 2138) PASS: lldb-unit :: Utility/./UtilityTests/RangeTest.ContainsEndInclusiveInvalid (1281 of 2138) UNSUPPORTED: lldb-shell :: ScriptInterpreter/Lua/watchpoint_callback.test (1282 of 2138) PASS: lldb-shell :: Watchpoint/SetErrorCases.test (1283 of 2138) PASS: lldb-unit :: Process/minidump/./LLDBMinidumpTests/MinidumpParserTest.MinidumpDuplicateModuleMappedFirst (1284 of 2138) PASS: lldb-api :: functionalities/data-formatter/boolreference/TestFormattersBoolRefPtr.py (1285 of 2138) PASS: lldb-unit :: Utility/./UtilityTests/ArgsTest.ReplaceArgumentAtIndexOutOfRange (1286 of 2138) PASS: lldb-api :: functionalities/data-formatter/data-formatter-objc/TestDataFormatterObjCNSDate.py (1287 of 2138) PASS: lldb-api :: commands/target/stop-hook/enable/TestTargetStopHookEnable.py (1288 of 2138) PASS: lldb-unit :: Utility/./UtilityTests/LogChannelEnabledTest.log_options (1289 of 2138) PASS: lldb-api :: functionalities/thread/concurrent_events/TestConcurrentTwoBreakpointThreads.py (1290 of 2138) PASS: lldb-unit :: Host/./HostTests/HostInfoTest.GetAugmentedArchSpec (1291 of 2138) PASS: lldb-api :: lang/objc/modules-auto-import/TestModulesAutoImport.py (1292 of 2138) PASS: lldb-api :: lang/cpp/covariant-return-types/TestCovariantReturnTypes.py (1293 of 2138) UNSUPPORTED: lldb-api :: tools/lldb-server/libraries-svr4/TestGdbRemoteLibrariesSvr4Support.py (1294 of 2138) UNSUPPORTED: lldb-api :: benchmarks/libcxxlist/TestBenchmarkLibcxxList.py (1295 of 2138) PASS: lldb-shell :: SymbolFile/NativePDB/disassembly.cpp (1296 of 2138) PASS: lldb-unit :: Utility/./UtilityTests/SharedCluster.ClusterManager (1297 of 2138) PASS: lldb-api :: lang/cpp/template-specialization-type/TestTemplateSpecializationType.py (1298 of 2138) PASS: lldb-unit :: Language/Highlighting/./HighlighterTests/HighlighterTest.ClangEmptyInput (1299 of 2138) PASS: lldb-unit :: Utility/./UtilityTests/ScalarTest.TruncOrExtendTo (1300 of 2138) UNSUPPORTED: lldb-shell :: Expr/TestIRMemoryMapWindows.test (1301 of 2138) PASS: lldb-unit :: Utility/./UtilityTests/ScalarTest.Equality (1302 of 2138) PASS: lldb-api :: functionalities/gdb_remote_client/TestNoGPacketSupported.py (1303 of 2138) PASS: lldb-api :: tools/lldb-vscode/breakpoint-events/TestVSCode_breakpointEvents.py (1304 of 2138) PASS: lldb-unit :: Utility/./UtilityTests/StringListTest.JoinMultiCharSeparator (1305 of 2138) PASS: lldb-shell :: Quit/TestQuitExitCode0.test (1306 of 2138) PASS: lldb-unit :: Utility/./UtilityTests/ArchSpecTest.MergeFromMachOUnknown (1307 of 2138) PASS: lldb-unit :: Expression/./ExpressionTests/DiagnosticManagerTest.PutStringMultiple (1308 of 2138) PASS: lldb-api :: python_api/interpreter/TestCommandInterpreterAPI.py (1309 of 2138) UNSUPPORTED: lldb-api :: commands/expression/multiline-completion/TestMultilineCompletion.py (1310 of 2138) PASS: lldb-api :: api/log/TestAPILog.py (1311 of 2138) PASS: lldb-shell :: ObjectFile/PECOFF/basic-info-arm.yaml (1312 of 2138) PASS: lldb-api :: functionalities/abbreviation/TestAbbreviations.py (1313 of 2138) PASS: lldb-api :: functionalities/data-formatter/setvaluefromcstring/TestSetValueFromCString.py (1314 of 2138) PASS: lldb-shell :: SymbolFile/DWARF/debug-types-line-tables.s (1315 of 2138) PASS: lldb-shell :: SymbolFile/NativePDB/tag-types.cpp (1316 of 2138) PASS: lldb-unit :: UnwindAssembly/x86/./UnwindAssemblyx86Tests/Testx86AssemblyInspectionEngine.TestPushR15 (1317 of 2138) PASS: lldb-unit :: Utility/./UtilityTests/StreamTest.PutHex64ByteOrderBig (1318 of 2138) UNSUPPORTED: lldb-api :: functionalities/tsan/global_location/TestTsanGlobalLocation.py (1319 of 2138) UNSUPPORTED: lldb-api :: benchmarks/stepping/TestSteppingSpeed.py (1320 of 2138) PASS: lldb-api :: functionalities/breakpoint/global_constructor/TestBreakpointInGlobalConstructor.py (1321 of 2138) PASS: lldb-unit :: Utility/./UtilityTests/StringListTest.AppendStringStdString (1322 of 2138) PASS: lldb-unit :: ScriptInterpreter/Python/./ScriptInterpreterPythonTests/PythonDataObjectsTest.TestGlobalNameResolutionNoDot (1323 of 2138) PASS: lldb-api :: commands/frame/select/TestFrameSelect.py (1324 of 2138) PASS: lldb-api :: lang/cpp/char8_t/TestCxxChar8_t.py (1325 of 2138) PASS: lldb-unit :: Host/./HostTests/NativeProcessProtocolTest.ReadCStringFromMemory_MaxSize (1326 of 2138) PASS: lldb-unit :: Utility/./UtilityTests/SerializationRountripTest.SerializeDeserializeCStringArrayNullptr (1327 of 2138) PASS: lldb-api :: commands/expression/calculator_mode/TestCalculatorMode.py (1328 of 2138) PASS: lldb-api :: functionalities/tail_call_frames/disambiguate_paths_to_common_sink/TestDisambiguatePathsToCommonSink.py (1329 of 2138) PASS: lldb-unit :: Platform/./LLDBPlatformTests/PlatformAppleSimulatorTest.TestHostPlatformToSim (1330 of 2138) PASS: lldb-shell :: Settings/TestLineMarkerColor.test (1331 of 2138) UNSUPPORTED: lldb-shell :: SymbolFile/PDB/enums-layout.test (1332 of 2138) PASS: lldb-api :: functionalities/data-formatter/nssetsynth/TestNSSetSynthetic.py (1333 of 2138) PASS: lldb-shell :: SymbolFile/DWARF/debug_line-tombstone.s (1334 of 2138) PASS: lldb-unit :: Utility/./UtilityTests/OptionsWithRawTest.ArgsButNoDelimiter (1335 of 2138) PASS: lldb-api :: commands/expression/options/TestExprOptions.py (1336 of 2138) PASS: lldb-api :: functionalities/breakpoint/debugbreak/TestDebugBreak.py (1337 of 2138) PASS: lldb-unit :: Symbol/./SymbolTests/TestTypeSystemClang.TestDisplayNameEmpty (1338 of 2138) UNSUPPORTED: lldb-api :: functionalities/process_save_core/TestProcessSaveCore.py (1339 of 2138) PASS: lldb-api :: tools/lldb-server/TestGdbRemoteExitCode.py (1340 of 2138) PASS: lldb-api :: lang/objc/ivar-IMP/TestObjCiVarIMP.py (1341 of 2138) PASS: lldb-unit :: Utility/./UtilityTests/RegularExpression.Empty (1342 of 2138) PASS: lldb-unit :: Utility/./UtilityTests/ArchSpecTest.Compatibility (1343 of 2138) PASS: lldb-api :: tools/lldb-server/commandline/TestStubSetSID.py (1344 of 2138) UNSUPPORTED: lldb-api :: functionalities/data-formatter/data-formatter-stl/libstdcpp/iterator/TestDataFormatterStdIterator.py (1345 of 2138) PASS: lldb-unit :: Utility/./UtilityTests/UriParserTest.PortOverflow (1346 of 2138) PASS: lldb-unit :: Expression/./ExpressionTests/DWARFExpression.DW_OP_convert (1347 of 2138) PASS: lldb-unit :: Utility/./UtilityTests/ScalarTest.RightShiftOperator (1348 of 2138) PASS: lldb-unit :: SymbolFile/NativePDB/./SymbolFileNativePDBTests/PDBFPOProgramToDWARFExpressionTests.DependencyChain (1349 of 2138) PASS: lldb-unit :: ScriptInterpreter/Python/./ScriptInterpreterPythonTests/PythonDataObjectsTest.TestPythonCallableCheck (1350 of 2138) PASS: lldb-api :: commands/expression/import-std-module/weak_ptr/TestWeakPtrFromStdModule.py (1351 of 2138) PASS: lldb-unit :: Utility/./UtilityTests/UriParserTest.BracketedHostnamePort (1352 of 2138) PASS: lldb-api :: functionalities/data-formatter/data-formatter-objc/TestDataFormatterObjCNSURL.py (1353 of 2138) PASS: lldb-api :: lang/objc/foundation/TestRuntimeTypes.py (1354 of 2138) UNSUPPORTED: lldb-shell :: Unwind/eh-frame-augment-noop.test (1355 of 2138) PASS: lldb-shell :: SymbolFile/Breakpad/symtab-macho.test (1356 of 2138) UNSUPPORTED: lldb-api :: arm/breakpoint-it/TestBreakpointIt.py (1357 of 2138) PASS: lldb-unit :: SymbolFile/DWARF/./SymbolFileDWARFTests/SymbolFileDWARFTests.TestAbbrevMissingTerminator (1358 of 2138) UNSUPPORTED: lldb-api :: functionalities/data-formatter/data-formatter-stl/libstdcpp/vbool/TestDataFormatterStdVBool.py (1359 of 2138) PASS: lldb-unit :: ObjectFile/PECOFF/./ObjectFilePECOFFTests/PECallFrameInfoTest.Basic_eh (1360 of 2138) PASS: lldb-unit :: Utility/./UtilityTests/StringExtractorTest.GetNameColonValueNoColon (1361 of 2138) PASS: lldb-unit :: Utility/./UtilityTests/AnsiTerminal.WhiteSpace (1362 of 2138) PASS: lldb-shell :: Minidump/Windows/Sigsegv/sigsegv.test (1363 of 2138) PASS: lldb-unit :: Utility/./UtilityTests/RangeTest.Constructor (1364 of 2138) PASS: lldb-unit :: Utility/./UtilityTests/UriParserTest.BadPort (1365 of 2138) PASS: lldb-api :: functionalities/mtc/simple/TestMTCSimple.py (1366 of 2138) PASS: lldb-unit :: Utility/./UtilityTests/OptionsWithRawTest.WhitespaceInput (1367 of 2138) PASS: lldb-unit :: Symbol/./SymbolTests/TestTypeSystemClang.TestFunctionTemplateInRecordConstruction (1368 of 2138) PASS: lldb-api :: functionalities/breakpoint/cpp_exception/TestCPPExceptionBreakpoint.py (1369 of 2138) PASS: lldb-api :: python_api/default-constructor/TestDefaultConstructorForAPIObjects.py (1370 of 2138) PASS: lldb-api :: lang/cpp/overloaded-functions/TestOverloadedFunctions.py (1371 of 2138) PASS: lldb-api :: lang/cpp/gmodules-templates/TestGModules.py (1372 of 2138) PASS: lldb-unit :: Utility/./UtilityTests/StringListTest.ShiftCString (1373 of 2138) PASS: lldb-api :: commands/target/select/TestTargetSelect.py (1374 of 2138) UNSUPPORTED: lldb-api :: commands/gui/basic/TestGuiBasic.py (1375 of 2138) PASS: lldb-api :: functionalities/show_location/TestShowLocationDwarf5.py (1376 of 2138) PASS: lldb-api :: functionalities/thread/state_after_expression/TestStateAfterExpression.py (1377 of 2138) PASS: lldb-unit :: debugserver/./debugserverTests/JSON.Parse (1378 of 2138) PASS: lldb-shell :: SymbolFile/DWARF/apple-index-is-used.cpp (1379 of 2138) PASS: lldb-unit :: UnwindAssembly/x86/./UnwindAssemblyx86Tests/Testx86AssemblyInspectionEngine.TestSimplex86_64Augmented (1380 of 2138) PASS: lldb-api :: lang/c/step-target/TestStepTarget.py (1381 of 2138) PASS: lldb-api :: lang/cpp/dynamic-value-same-basename/TestDynamicValueSameBase.py (1382 of 2138) PASS: lldb-api :: functionalities/memory/read/TestMemoryRead.py (1383 of 2138) PASS: lldb-shell :: SymbolFile/DWARF/inline-function-address-shared.test (1384 of 2138) PASS: lldb-api :: commands/frame/diagnose/dereference-argument/TestDiagnoseDereferenceArgument.py (1385 of 2138) UNSUPPORTED: lldb-api :: arm/breakpoint-thumb-codesection/TestBreakpointThumbCodesection.py (1386 of 2138) PASS: lldb-api :: commands/expression/result_numbering/TestResultNumbering.py (1387 of 2138) PASS: lldb-unit :: Utility/./UtilityTests/StringExtractorTest.DecodeHexU8_Underflow (1388 of 2138) PASS: lldb-unit :: Host/./HostTests/NativeProcessProtocolTest.ReadCStringFromMemory_CrossPageBoundary (1389 of 2138) PASS: lldb-api :: functionalities/data-formatter/data-formatter-skip-summary/TestDataFormatterSkipSummary.py (1390 of 2138) PASS: lldb-api :: functionalities/data-formatter/data-formatter-enum-format/TestDataFormatterEnumFormat.py (1391 of 2138) PASS: lldb-unit :: Process/gdb-remote/./ProcessGdbRemoteTests/GDBRemoteClientBaseTest.SendPacketAndReceiveResponseWithOutputSupport (1392 of 2138) UNSUPPORTED: lldb-api :: functionalities/thread/thread_specific_break_plus_condition/TestThreadSpecificBpPlusCondition.py (1393 of 2138) PASS: lldb-api :: functionalities/thread/concurrent_events/TestConcurrentCrashWithSignal.py (1394 of 2138) PASS: lldb-api :: functionalities/fat_archives/TestFatArchives.py (1395 of 2138) PASS: lldb-unit :: ScriptInterpreter/Python/./ScriptInterpreterPythonTests/PythonDataObjectsTest.TestPythonListManipulation (1396 of 2138) PASS: lldb-api :: commands/expression/regression-access-function-template-in-record/TestRegressionAccessFunctionTemplateInRecord.py (1397 of 2138) PASS: lldb-api :: commands/command/delete/TestCommandDelete.py (1398 of 2138) PASS: lldb-unit :: Language/Highlighting/./HighlighterTests/HighlighterTest.ClangPPDirectives (1399 of 2138) PASS: lldb-shell :: ObjectFile/ELF/section-types.yaml (1400 of 2138) PASS: lldb-api :: functionalities/data-formatter/builtin-formats/TestBuiltinFormats.py (1401 of 2138) PASS: lldb-unit :: Symbol/./SymbolTests/TestTypeSystemClang.TestGetTypeClassNested (1402 of 2138) PASS: lldb-unit :: Symbol/./SymbolTests/Type.CompilerContextPattern (1403 of 2138) UNSUPPORTED: lldb-shell :: ScriptInterpreter/Lua/convenience_variables.test (1404 of 2138) PASS: lldb-unit :: Process/gdb-remote/./ProcessGdbRemoteTests/GDBRemoteClientBaseTest.SendContinueAndLateInterrupt (1405 of 2138) PASS: lldb-unit :: Symbol/./SymbolTests/TestClangASTImporter.MetadataPropagationIndirectImport (1406 of 2138) PASS: lldb-unit :: Utility/./UtilityTests/UUIDTest.RelationalOperators (1407 of 2138) PASS: lldb-unit :: Utility/./UtilityTests/OptionsWithRawTest.EmptyInput (1408 of 2138) PASS: lldb-api :: functionalities/postmortem/netbsd-core/TestNetBSDCore.py (1409 of 2138) PASS: lldb-api :: python_api/exprpath_synthetic/TestExprPathSynthetic.py (1410 of 2138) PASS: lldb-api :: functionalities/thread/create_after_attach/TestCreateAfterAttach.py (1411 of 2138) PASS: lldb-shell :: VSCode/TestOptions.test (1412 of 2138) PASS: lldb-api :: commands/help/TestHelp.py (1413 of 2138) PASS: lldb-api :: functionalities/gdb_remote_client/TestArmRegisterDefinition.py (1414 of 2138) PASS: lldb-unit :: Utility/./UtilityTests/FileSpecTest.Equal (1415 of 2138) PASS: lldb-unit :: Utility/./UtilityTests/RangeDataVector.FindEntryThatContains (1416 of 2138) PASS: lldb-api :: lang/objc/objc-new-syntax/TestObjCNewSyntaxLiteral.py (1417 of 2138) PASS: lldb-unit :: Utility/./UtilityTests/UriParserTest.MinimalPath (1418 of 2138) PASS: lldb-unit :: Symbol/./SymbolTests/TestTypeSystemClang.TestUnifyAccessSpecifiers (1419 of 2138) PASS: lldb-shell :: Commands/command-breakpoint-col.test (1420 of 2138) PASS: lldb-shell :: SymbolFile/DWARF/DW_AT_data_bit_offset-DW_OP_stack_value.s (1421 of 2138) PASS: lldb-unit :: Symbol/./SymbolTests/TestTypeSystemClang.TestFunctionTemplateConstruction (1422 of 2138) UNSUPPORTED: lldb-api :: iohandler/unicode/TestUnicode.py (1423 of 2138) PASS: lldb-api :: commands/frame/diagnose/array/TestArray.py (1424 of 2138) PASS: lldb-api :: lang/objc/objc-new-syntax/TestObjCNewSyntaxArray.py (1425 of 2138) PASS: lldb-unit :: Host/./HostTests/File.GetWaitableHandleFileno (1426 of 2138) PASS: lldb-api :: lang/objc/bitfield_ivars/TestBitfieldIvars.py (1427 of 2138) PASS: lldb-unit :: Symbol/./SymbolTests/TestTypeSystemClang.TestGetEnumIntegerTypeInvalid (1428 of 2138) UNSUPPORTED: lldb-shell :: Unwind/unwind-plan-dwarf-dump.test (1429 of 2138) PASS: lldb-unit :: Utility/./UtilityTests/CompletionRequest.DuplicateFilteringWithComments (1430 of 2138) PASS: lldb-unit :: Utility/./UtilityTests/ScalarTest.APIntConstructor (1431 of 2138) PASS: lldb-api :: functionalities/memory/cache/TestMemoryCache.py (1432 of 2138) PASS: lldb-unit :: Utility/./UtilityTests/BinaryStreamTest.PutULEB128SixBytes (1433 of 2138) PASS: lldb-shell :: ObjectFile/ELF/section-overlap.yaml (1434 of 2138) PASS: lldb-unit :: ScriptInterpreter/Python/./ScriptInterpreterPythonTests/PythonDataObjectsTest.TestBorrowedReferences (1435 of 2138) PASS: lldb-unit :: Utility/./UtilityTests/CompletionRequest.DuplicateFiltering (1436 of 2138) PASS: lldb-unit :: Symbol/./SymbolTests/TestTypeSystemClang.TestGetBasicTypeFromEnum (1437 of 2138) PASS: lldb-unit :: ScriptInterpreter/Python/./ScriptInterpreterPythonTests/PythonDataObjectsTest.TestPythonListToStructuredList (1438 of 2138) PASS: lldb-unit :: Utility/./UtilityTests/StateTest.Formatv (1439 of 2138) PASS: lldb-api :: functionalities/unwind/noreturn/module-end/TestNoReturnModuleEnd.py (1440 of 2138) PASS: lldb-unit :: Core/./LLDBCoreTests/SourceFileCache.FindSourceFileFound (1441 of 2138) PASS: lldb-api :: functionalities/postmortem/elf-core/thread_crash/TestLinuxCoreThreads.py (1442 of 2138) PASS: lldb-unit :: Language/Highlighting/./HighlighterTests/HighlighterTest.DefaultHighlighter (1443 of 2138) PASS: lldb-api :: commands/process/launch/TestProcessLaunch.py (1444 of 2138) PASS: lldb-unit :: Utility/./UtilityTests/ConstStringTest.YAML (1445 of 2138) PASS: lldb-api :: commands/frame/diagnose/dereference-this/TestDiagnoseDereferenceThis.py (1446 of 2138) PASS: lldb-api :: functionalities/breakpoint/breakpoint_locations/TestBreakpointLocations.py (1447 of 2138) PASS: lldb-api :: lang/objc/real-definition/TestRealDefinition.py (1448 of 2138) UNSUPPORTED: lldb-shell :: ObjectFile/ELF/minidebuginfo-no-lzma.yaml (1449 of 2138) PASS: lldb-api :: functionalities/data-formatter/data-formatter-stl/libcxx/bitset/TestDataFormatterLibcxxBitset.py (1450 of 2138) PASS: lldb-shell :: Minidump/Windows/broken-unwind.test (1451 of 2138) PASS: lldb-api :: functionalities/postmortem/wow64_minidump/TestWow64MiniDump.py (1452 of 2138) PASS: lldb-api :: functionalities/inline-stepping/TestInlineStepping.py (1453 of 2138) PASS: lldb-unit :: Utility/./UtilityTests/XcodeSDKTest.GetSDKTypeForTriple (1454 of 2138) PASS: lldb-unit :: ScriptInterpreter/Python/./ScriptInterpreterPythonTests/PythonDataObjectsTest.TestModuleNameResolutionNoDot (1455 of 2138) UNSUPPORTED: lldb-shell :: Register/arm-fp-read.test (1456 of 2138) PASS: lldb-unit :: Process/gdb-remote/./ProcessGdbRemoteTests/GDBRemoteCommunicationClientTest.GetQOffsets (1457 of 2138) PASS: lldb-api :: types/TestCharTypeExpr.py (1458 of 2138) PASS: lldb-shell :: Quit/TestQuitExitCodeHexA.test (1459 of 2138) PASS: lldb-unit :: Utility/./UtilityTests/StreamTest.PutHex8 (1460 of 2138) PASS: lldb-api :: macosx/save_crashlog/TestSaveCrashlog.py (1461 of 2138) PASS: lldb-api :: functionalities/tail_call_frames/sbapi_support/TestTailCallFrameSBAPI.py (1462 of 2138) PASS: lldb-unit :: ObjectFile/Breakpad/./ObjectFileBreakpadTests/LineRecord.parse (1463 of 2138) PASS: lldb-unit :: ScriptInterpreter/Python/./ScriptInterpreterPythonTests/PythonDataObjectsTest.TestPythonByteArray (1464 of 2138) UNSUPPORTED: lldb-shell :: Register/x86-64-xmm16-read.test (1465 of 2138) PASS: lldb-unit :: ScriptInterpreter/Python/./ScriptInterpreterPythonTests/PythonDataObjectsTest.TestPythonTupleValues (1466 of 2138) PASS: lldb-unit :: Utility/./UtilityTests/DataExtractorTest.GetBitfield (1467 of 2138) PASS: lldb-api :: commands/watchpoints/multiple_threads/TestWatchpointMultipleThreads.py (1468 of 2138) UNSUPPORTED: lldb-api :: commands/expression/call-restarts/TestCallThatRestarts.py (1469 of 2138) PASS: lldb-api :: commands/platform/basic/TestPlatformPython.py (1470 of 2138) PASS: lldb-api :: commands/expression/completion-crash-incomplete-record/TestCompletionCrashIncompleteRecord.py (1471 of 2138) UNSUPPORTED: lldb-shell :: SymbolFile/NativePDB/local-variables.cpp (1472 of 2138) PASS: lldb-unit :: Host/./HostTests/FileSystemTest.Exists (1473 of 2138) PASS: lldb-api :: commands/expression/import-std-module/vector-dbg-info-content/TestDbgInfoContentVectorFromStdModule.py (1474 of 2138) PASS: lldb-unit :: Core/./LLDBCoreTests/ModuleSpecTest.TestCOFFFile (1475 of 2138) PASS: lldb-api :: lang/objc/single-entry-dictionary/TestObjCSingleEntryDictionary.py (1476 of 2138) PASS: lldb-unit :: UnwindAssembly/x86/./UnwindAssemblyx86Tests/Testx86AssemblyInspectionEngine.TestPushESI (1477 of 2138) PASS: lldb-api :: commands/expression/completion-in-lambda-and-unnamed-class/TestCompletionInLambdaAndUnnamedClass.py (1478 of 2138) PASS: lldb-unit :: Utility/./UtilityTests/XcodeSDKTest.MergeTest (1479 of 2138) PASS: lldb-unit :: Utility/./UtilityTests/StreamTest.QuotedCString (1480 of 2138) PASS: lldb-unit :: Utility/./UtilityTests/BinaryStreamTest.PutULEB128EightBytes (1481 of 2138) PASS: lldb-unit :: Utility/./UtilityTests/VMRange.Clear (1482 of 2138) PASS: lldb-unit :: Utility/./UtilityTests/UriParserTest.MinimalPort (1483 of 2138) PASS: lldb-api :: commands/expression/weak_symbols/TestWeakSymbols.py (1484 of 2138) PASS: lldb-shell :: Settings/TestEchoCommands.test (1485 of 2138) PASS: lldb-api :: functionalities/data-formatter/data-formatter-stl/libcxx/vbool/TestDataFormatterLibcxxVBool.py (1486 of 2138) PASS: lldb-unit :: Target/./TargetTests/ModuleCacheTest.GetAndPutStrangeHostname (1487 of 2138) PASS: lldb-unit :: Utility/./UtilityTests/ArgsTest.TestMultipleArgs (1488 of 2138) PASS: lldb-unit :: Utility/./UtilityTests/RecordReplayTest.InstrumentedBarRef (1489 of 2138) PASS: lldb-unit :: SymbolFile/DWARF/./SymbolFileDWARFTests/XcodeSDKModuleTests.TestModuleGetXcodeSDK (1490 of 2138) PASS: lldb-api :: python_api/function_symbol/TestSymbolAPI.py (1491 of 2138) PASS: lldb-shell :: Driver/TestRepl.test (1492 of 2138) PASS: lldb-api :: python_api/watchpoint/condition/TestWatchpointConditionAPI.py (1493 of 2138) PASS: lldb-api :: python_api/lldbutil/TestSwigVersion.py (1494 of 2138) PASS: lldb-shell :: ObjectFile/ELF/PT_TLS-overlap-PT_LOAD.yaml (1495 of 2138) PASS: lldb-api :: tools/lldb-server/TestGdbRemoteExpeditedRegisters.py (1496 of 2138) PASS: lldb-unit :: Utility/./UtilityTests/FileSpecTest.FileAndDirectoryComponents (1497 of 2138) UNSUPPORTED: lldb-shell :: Register/arm-gp-read.test (1498 of 2138) PASS: lldb-api :: functionalities/lazy-loading/TestLazyLoading.py (1499 of 2138) PASS: lldb-api :: commands/expression/ir-interpreter/TestIRInterpreter.py (1500 of 2138) PASS: lldb-unit :: Utility/./UtilityTests/ProcessInstanceInfo.Dump (1501 of 2138) PASS: lldb-api :: commands/expression/save_jit_objects/TestSaveJITObjects.py (1502 of 2138) PASS: lldb-shell :: Commands/command-backtrace.test (1503 of 2138) PASS: lldb-unit :: Utility/./UtilityTests/StringListTest.ShiftStdString (1504 of 2138) PASS: lldb-unit :: Utility/./UtilityTests/VASprintfTest.NoBufferResize (1505 of 2138) PASS: lldb-unit :: Utility/./UtilityTests/ArgsTest.GetArgumentArrayRef (1506 of 2138) PASS: lldb-unit :: Utility/./UtilityTests/StringListTest.GetMaxStringLengthEqualSize (1507 of 2138) PASS: lldb-unit :: Expression/./ExpressionTests/CppModuleConfigurationTest.LinuxLocalLibCpp (1508 of 2138) PASS: lldb-unit :: Utility/./UtilityTests/StringListTest.InsertStringAtIndexEnd (1509 of 2138) PASS: lldb-api :: functionalities/thread/ignore_suspended/TestIgnoreSuspendedThread.py (1510 of 2138) PASS: lldb-unit :: Utility/./UtilityTests/StringExtractorTest.GetNameColonValueContainsColon (1511 of 2138) PASS: lldb-unit :: Host/./HostTests/SocketTest.UDPConnect (1512 of 2138) PASS: lldb-api :: lang/objc/modules-inline-functions/TestModulesInlineFunctions.py (1513 of 2138) PASS: lldb-api :: commands/expression/static-initializers/TestStaticInitializers.py (1514 of 2138) PASS: lldb-unit :: Utility/./UtilityTests/StatusTest.Formatv (1515 of 2138) PASS: lldb-api :: commands/command/script/import/TestImport.py (1516 of 2138) PASS: lldb-unit :: Process/gdb-remote/./ProcessGdbRemoteTests/GDBRemoteCommunicationClientTest.SyncThreadState (1517 of 2138) PASS: lldb-unit :: ObjectFile/PECOFF/./ObjectFilePECOFFTests/PECallFrameInfoTest.Frame_reg_eh (1518 of 2138) PASS: lldb-unit :: Utility/./UtilityTests/RecordReplayTest.InstrumentedBar (1519 of 2138) PASS: lldb-unit :: Target/./TargetTests/PathMappingListTest.RemapRoot (1520 of 2138) UNSUPPORTED: lldb-shell :: ObjectFile/PECOFF/disassemble-thumb.yaml (1521 of 2138) PASS: lldb-unit :: UnwindAssembly/x86/./UnwindAssemblyx86Tests/Testx86AssemblyInspectionEngine.TestPopR12 (1522 of 2138) PASS: lldb-unit :: Utility/./UtilityTests/FileSpecTest.EqualDotsPosix (1523 of 2138) PASS: lldb-shell :: ObjectFile/ELF/short-build-id.yaml (1524 of 2138) PASS: lldb-unit :: Utility/./UtilityTests/Flags.AllSet (1525 of 2138) PASS: lldb-api :: functionalities/data-formatter/data-formatter-objc/TestDataFormatterObjCPlain.py (1526 of 2138) PASS: lldb-unit :: Interpreter/./InterpreterTests/OptionArgParserTest.toChar (1527 of 2138) PASS: lldb-api :: commands/process/signal/TestProcessSignal.py (1528 of 2138) PASS: lldb-api :: functionalities/breakpoint/breakpoint_names/TestBreakpointNames.py (1529 of 2138) PASS: lldb-api :: commands/watchpoints/multiple_hits/TestMultipleHits.py (1530 of 2138) UNSUPPORTED: lldb-api :: lang/cpp/printf/TestPrintf.py (1531 of 2138) PASS: lldb-api :: lang/c/set_values/TestSetValues.py (1532 of 2138) PASS: lldb-shell :: ObjectFile/ELF/PT_LOAD.yaml (1533 of 2138) PASS: lldb-shell :: SymbolFile/Breakpad/line-table-edgecases.test (1534 of 2138) PASS: lldb-shell :: ObjectFile/ELF/section-addresses.yaml (1535 of 2138) PASS: lldb-api :: commands/expression/inline-namespace/TestInlineNamespace.py (1536 of 2138) PASS: lldb-unit :: Utility/./UtilityTests/FileSpecTest.FormatFileSpec (1537 of 2138) UNSUPPORTED: lldb-shell :: Unwind/eh-frame-small-fde.test (1538 of 2138) PASS: lldb-unit :: ScriptInterpreter/Python/./ScriptInterpreterPythonTests/PythonDataObjectsTest.TestTypeNameResolutionNoDot (1539 of 2138) UNSUPPORTED: lldb-shell :: ScriptInterpreter/Lua/lua-python.test (1540 of 2138) PASS: lldb-unit :: UnwindAssembly/x86/./UnwindAssemblyx86Tests/Testx86AssemblyInspectionEngine.TestPushRBX (1541 of 2138) PASS: lldb-unit :: ObjectFile/ELF/./ObjectFileELFTests/ObjectFileELFTest.SectionsResolveConsistently (1542 of 2138) PASS: lldb-shell :: SymbolFile/DWARF/debug-types-missing-signature.test (1543 of 2138) PASS: lldb-api :: commands/expression/anonymous-struct/TestCallUserAnonTypedef.py (1544 of 2138) PASS: lldb-api :: lang/cpp/unicode-literals/TestUnicodeLiterals.py (1545 of 2138) PASS: lldb-unit :: Expression/./ExpressionTests/DWARFExpression.DW_OP_unknown (1546 of 2138) PASS: lldb-shell :: SymbolFile/DWARF/module-ownership.mm (1547 of 2138) PASS: lldb-unit :: Utility/./UtilityTests/StringExtractorTest.GetNameColonValueNoSemicolon (1548 of 2138) PASS: lldb-api :: terminal/TestSTTYBeforeAndAfter.py (1549 of 2138) PASS: lldb-unit :: Utility/./UtilityTests/StringListTest.SplitIntoLinesSingleTrailingCR (1550 of 2138) PASS: lldb-unit :: Host/./HostTests/SocketTest.DecodeHostAndPort (1551 of 2138) PASS: lldb-api :: commands/expression/test/TestExprs.py (1552 of 2138) PASS: lldb-api :: functionalities/data-formatter/data-formatter-stl/libcxx/optional/TestDataFormatterLibcxxOptional.py (1553 of 2138) PASS: lldb-unit :: Utility/./UtilityTests/OptionsWithRawTest.SingleWordSuffix (1554 of 2138) PASS: lldb-api :: lang/cpp/multiple-inheritance/TestCppMultipleInheritance.py (1555 of 2138) UNSUPPORTED: lldb-shell :: SymbolFile/PDB/vbases.test (1556 of 2138) PASS: lldb-unit :: Utility/./UtilityTests/StatusTest.ErrorCodeConstructor (1557 of 2138) PASS: lldb-api :: commands/frame/diagnose/dereference-function-return/TestDiagnoseDereferenceFunctionReturn.py (1558 of 2138) PASS: lldb-unit :: Utility/./UtilityTests/DataExtractorTest.GetDoubleUnaligned (1559 of 2138) PASS: lldb-api :: types/TestShortType.py (1560 of 2138) UNSUPPORTED: lldb-api :: functionalities/data-formatter/data-formatter-stl/libstdcpp/tuple/TestDataFormatterStdTuple.py (1561 of 2138) PASS: lldb-api :: lang/cpp/inlines/TestInlines.py (1562 of 2138) PASS: lldb-api :: tools/lldb-vscode/launch/TestVSCode_launch.py (1563 of 2138) PASS: lldb-shell :: Commands/command-target-modules-dump-sections.yaml (1564 of 2138) PASS: lldb-unit :: Process/minidump/./LLDBMinidumpTests/MinidumpParserTest.GetArchitecture (1565 of 2138) PASS: lldb-unit :: SymbolFile/NativePDB/./SymbolFileNativePDBTests/PDBFPOProgramToDWARFExpressionTests.InvalidAssignmentMultiple (1566 of 2138) PASS: lldb-api :: tools/lldb-vscode/breakpoint/TestVSCode_setBreakpoints.py (1567 of 2138) PASS: lldb-api :: lang/cpp/chained-calls/TestCppChainedCalls.py (1568 of 2138) PASS: lldb-unit :: Utility/./UtilityTests/RangeTest.Copy (1569 of 2138) PASS: lldb-shell :: ObjectFile/ELF/netbsd-exec-8.99.30-amd64.yaml (1570 of 2138) UNSUPPORTED: lldb-api :: tools/lldb-server/thread-name/TestGdbRemoteThreadName.py (1571 of 2138) PASS: lldb-unit :: Utility/./UtilityTests/RangeTest.DoesAdjoinOrIntersect (1572 of 2138) PASS: lldb-api :: commands/expression/import-std-module/deque-basic/TestDequeFromStdModule.py (1573 of 2138) UNSUPPORTED: lldb-shell :: Process/Windows/exception_access_violation.cpp (1574 of 2138) PASS: lldb-shell :: ObjectFile/MachO/symtab.yaml (1575 of 2138) PASS: lldb-unit :: UnwindAssembly/x86/./UnwindAssemblyx86Tests/Testx86AssemblyInspectionEngine.TestSubRSP (1576 of 2138) PASS: lldb-api :: commands/process/attach/TestProcessAttach.py (1577 of 2138) PASS: lldb-shell :: SymbolFile/DWARF/debug-types-basic.test (1578 of 2138) PASS: lldb-api :: lang/c/find_struct_type/TestFindStructTypes.py (1579 of 2138) PASS: lldb-api :: functionalities/var_path/TestVarPath.py (1580 of 2138) PASS: lldb-unit :: Utility/./UtilityTests/TimeoutTest.Format (1581 of 2138) PASS: lldb-unit :: Utility/./UtilityTests/BinaryStreamTest.PutSLEB128Zero (1582 of 2138) PASS: lldb-unit :: Utility/./UtilityTests/StreamTeeTest.SetStreamAtIndexOverwrite (1583 of 2138) PASS: lldb-unit :: SymbolFile/DWARF/./SymbolFileDWARFTests/SymbolFileDWARFTests.TestAbbrevNullAttrValidForm (1584 of 2138) PASS: lldb-unit :: Utility/./UtilityTests/Flags.AllClear (1585 of 2138) UNSUPPORTED: lldb-shell :: SymbolFile/PDB/class-layout.test (1586 of 2138) PASS: lldb-api :: python_api/function_symbol/TestDisasmAPI.py (1587 of 2138) PASS: lldb-unit :: Utility/./UtilityTests/NameMatchesTest.StartsWith (1588 of 2138) PASS: lldb-unit :: Utility/./UtilityTests/StringExtractorTest.GetHexBytesAvail_OddPair (1589 of 2138) PASS: lldb-api :: commands/target/create-deps/TestTargetCreateDeps.py (1590 of 2138) PASS: lldb-api :: lang/objc/rdar-10967107/TestRdar10967107.py (1591 of 2138) PASS: lldb-unit :: Utility/./UtilityTests/BinaryStreamTest.PutSLEB128FourBytes (1592 of 2138) PASS: lldb-unit :: Utility/./UtilityTests/RangeDataVector.FindEntryIndexesThatContain_Overlap (1593 of 2138) PASS: lldb-api :: functionalities/data-formatter/data-formatter-stl/libcxx/iterator/TestDataFormatterLibccIterator.py (1594 of 2138) PASS: lldb-shell :: ObjectFile/PECOFF/basic-info.yaml (1595 of 2138) UNSUPPORTED: lldb-shell :: SymbolFile/DWARF/debug-types-expressions.test (1596 of 2138) PASS: lldb-unit :: UnwindAssembly/x86/./UnwindAssemblyx86Tests/Testx86AssemblyInspectionEngine.TestPopR14 (1597 of 2138) PASS: lldb-api :: functionalities/dlopen_other_executable/TestDlopenOtherExecutable.py (1598 of 2138) PASS: lldb-api :: functionalities/data-formatter/data-formatter-stl/libcxx/multimap/TestDataFormatterLibccMultiMap.py (1599 of 2138) PASS: lldb-unit :: Symbol/./SymbolTests/TestTypeSystemClang.TestGetBasicTypeFromName (1600 of 2138) PASS: lldb-unit :: Utility/./UtilityTests/StringListTest.InsertStringAtIndexOutOfBounds (1601 of 2138) PASS: lldb-shell :: SymbolFile/NativePDB/s_constant.cpp (1602 of 2138) PASS: lldb-unit :: Utility/./UtilityTests/RangeTest.LessThan (1603 of 2138) PASS: lldb-unit :: ScriptInterpreter/Python/./ScriptInterpreterPythonTests/PythonDataObjectsTest.TestPythonStringToStructuredString (1604 of 2138) PASS: lldb-api :: functionalities/thread/concurrent_events/TestConcurrentWatchBreakDelay.py (1605 of 2138) UNSUPPORTED: lldb-api :: functionalities/darwin_log/filter/exact_match/subsystem/TestDarwinLogFilterMatchSubsystem.py (1606 of 2138) PASS: lldb-shell :: SymbolFile/DWARF/dwarf5_locations.s (1607 of 2138) PASS: lldb-unit :: Utility/./UtilityTests/StringListTest.Assignment (1608 of 2138) PASS: lldb-unit :: Utility/./UtilityTests/ScalarTest.Comparison (1609 of 2138) PASS: lldb-unit :: ObjectFile/Breakpad/./ObjectFileBreakpadTests/StackCFIRecord.parse (1610 of 2138) PASS: lldb-unit :: Process/gdb-remote/./ProcessGdbRemoteTests/GDBRemoteCommunicationServerTest.SendErrorResponse_Status (1611 of 2138) PASS: lldb-api :: types/TestLongTypesExpr.py (1612 of 2138) PASS: lldb-unit :: SymbolFile/NativePDB/./SymbolFileNativePDBTests/PDBFPOProgramToDWARFExpressionTests.UnknownOp (1613 of 2138) PASS: lldb-unit :: Utility/./UtilityTests/BinaryStreamTest.PutSLEB128NineBytes (1614 of 2138) PASS: lldb-api :: python_api/lldbutil/iter/TestLLDBIterator.py (1615 of 2138) PASS: lldb-api :: lang/objc/modules/TestObjCModules.py (1616 of 2138) PASS: lldb-unit :: Process/minidump/./LLDBMinidumpTests/MinidumpParserTest.GetThreadContext_x86_64 (1617 of 2138) PASS: lldb-api :: lang/cpp/modules-import/TestCXXModulesImport.py (1618 of 2138) PASS: lldb-unit :: Symbol/./SymbolTests/TestTypeSystemClang.TestRecordHasFields (1619 of 2138) PASS: lldb-shell :: SymbolFile/DWARF/compilercontext.ll (1620 of 2138) PASS: lldb-unit :: UnwindAssembly/x86/./UnwindAssemblyx86Tests/Testx86AssemblyInspectionEngine.TestAddRSP (1621 of 2138) PASS: lldb-unit :: Platform/Android/./AdbClientTests/AdbClientTest.CreateByDeviceId (1622 of 2138) PASS: lldb-unit :: Utility/./UtilityTests/ConstStringTest.FromMidOfBufferStringRef (1623 of 2138) PASS: lldb-api :: python_api/sblaunchinfo/TestSBLaunchInfo.py (1624 of 2138) PASS: lldb-api :: functionalities/thread/concurrent_events/TestConcurrentDelaySignalBreak.py (1625 of 2138) PASS: lldb-unit :: Utility/./UtilityTests/AnsiTerminal.Empty (1626 of 2138) UNSUPPORTED: lldb-shell :: SymbolFile/DWARF/split-dwarf-expression-eval-bug.cpp (1627 of 2138) PASS: lldb-unit :: Utility/./UtilityTests/RecordReplayTest.InstrumentedFoo (1628 of 2138) PASS: lldb-api :: lang/c/bitfields/TestBitfields.py (1629 of 2138) PASS: lldb-shell :: SymbolFile/Breakpad/line-table-mixed-path-styles.test (1630 of 2138) PASS: lldb-unit :: UnwindAssembly/x86/./UnwindAssemblyx86Tests/Testx86AssemblyInspectionEngine.TestPushExtended (1631 of 2138) PASS: lldb-unit :: Symbol/./SymbolTests/TestTypeSystemClang.TestNotDeletingUserCopyCstrDueToMoveCStr (1632 of 2138) PASS: lldb-unit :: Utility/./UtilityTests/RangeTest.LessThanInvalid (1633 of 2138) PASS: lldb-unit :: Core/./LLDBCoreTests/ModuleSpecTest.TestMachOFile (1634 of 2138) PASS: lldb-unit :: Core/./LLDBCoreTests/UniqueCStringMap.NoDefaultConstructor (1635 of 2138) PASS: lldb-unit :: ScriptInterpreter/Python/./ScriptInterpreterPythonTests/PythonDataObjectsTest.TestExtractingUInt64ThroughStructuredData (1636 of 2138) UNSUPPORTED: lldb-shell :: SymbolFile/NativePDB/typedefs.cpp (1637 of 2138) PASS: lldb-api :: lang/objc/print-obj/TestPrintObj.py (1638 of 2138) PASS: lldb-unit :: Expression/./ExpressionTests/CppModuleConfigurationTest.AmbiguousLibCpp (1639 of 2138) PASS: lldb-shell :: Unwind/thread-step-out-ret-addr-check.test (1640 of 2138) PASS: lldb-unit :: Expression/./ExpressionTests/CppModuleConfigurationTest.Sysroot (1641 of 2138) PASS: lldb-api :: tools/lldb-server/TestGdbRemoteProcessInfo.py (1642 of 2138) PASS: lldb-api :: commands/version/TestVersion.py (1643 of 2138) PASS: lldb-unit :: Process/gdb-remote/./ProcessGdbRemoteTests/GDBRemoteCommunicationTest.ReadPacket_checksum (1644 of 2138) PASS: lldb-shell :: Commands/command-thread-select.test (1645 of 2138) PASS: lldb-api :: tools/lldb-server/TestGdbRemoteThreadsInStopReply.py (1646 of 2138) PASS: lldb-unit :: Utility/./UtilityTests/GeneratorTest.Get (1647 of 2138) PASS: lldb-api :: python_api/class_members/TestSBTypeClassMembers.py (1648 of 2138) UNSUPPORTED: lldb-api :: iohandler/autosuggestion/TestAutosuggestion.py (1649 of 2138) PASS: lldb-unit :: Process/gdb-remote/./ProcessGdbRemoteTests/GDBRemoteClientBaseTest.SendContinueAndAsyncSignal (1650 of 2138) PASS: lldb-unit :: UnwindAssembly/x86/./UnwindAssemblyx86Tests/Testx86AssemblyInspectionEngine.Test64bitFramelessSmallStackFrame (1651 of 2138) PASS: lldb-api :: macosx/load-kext/TestLoadKext.py (1652 of 2138) PASS: lldb-api :: python_api/watchpoint/watchlocation/TestSetWatchlocation.py (1653 of 2138) PASS: lldb-unit :: Editline/./EditlineTests/EditlineTestFixture.EditlineReceivesSingleLineText (1654 of 2138) PASS: lldb-unit :: Utility/./UtilityTests/StreamTeeTest.SetStreamAtIndexOutOfBounds (1655 of 2138) PASS: lldb-api :: lang/objc/hidden-ivars/TestHiddenIvars.py (1656 of 2138) PASS: lldb-api :: commands/target/dump-symtab-demangle/TestDumpSymtabDemangle.py (1657 of 2138) PASS: lldb-api :: commands/process/attach/attach_denied/TestAttachDenied.py (1658 of 2138) PASS: lldb-api :: functionalities/target-new-solib-notifications/TestModuleLoadedNotifys.py (1659 of 2138) PASS: lldb-api :: commands/expression/import-std-module/sysroot/TestStdModuleSysroot.py (1660 of 2138) PASS: lldb-unit :: Utility/./UtilityTests/OptionsWithRawTest.TerminatedQuote (1661 of 2138) PASS: lldb-api :: lang/objc/forward-decl/TestForwardDecl.py (1662 of 2138) PASS: lldb-api :: functionalities/data-formatter/data-formatter-objc/TestDataFormatterObjCNSBundle.py (1663 of 2138) PASS: lldb-shell :: SymbolFile/DWARF/split-dwarf-inlining.cpp (1664 of 2138) PASS: lldb-unit :: UnwindAssembly/x86/./UnwindAssemblyx86Tests/Testx86AssemblyInspectionEngine.TestStackRealignMSVC_i386 (1665 of 2138) PASS: lldb-unit :: Target/./TargetTests/RemoteAwarePlatformTest.TestResolveExecutabelOnClientByPlatform (1666 of 2138) UNSUPPORTED: lldb-api :: functionalities/unwind/ehframe/TestEhFrameUnwind.py (1667 of 2138) PASS: lldb-api :: commands/disassemble/basic/TestDisassembleBreakpoint.py (1668 of 2138) PASS: lldb-unit :: Utility/./UtilityTests/StreamTest.PutMaxHex64ByteOrderBig (1669 of 2138) PASS: lldb-shell :: Reproducer/Functionalities/TestStepping.test (1670 of 2138) PASS: lldb-api :: commands/expression/invalid-args/TestInvalidArgsExpression.py (1671 of 2138) PASS: lldb-api :: lang/cpp/operator-overload/TestOperatorOverload.py (1672 of 2138) PASS: lldb-unit :: Utility/./UtilityTests/StreamTest.PutHex32ByteOrderBig (1673 of 2138) PASS: lldb-api :: functionalities/thread/concurrent_events/TestConcurrentManyCrash.py (1674 of 2138) PASS: lldb-unit :: Utility/./UtilityTests/ArgsTest.GetQuotedCommandString (1675 of 2138) PASS: lldb-api :: lang/cpp/class-template-parameter-pack/TestClassTemplateParameterPack.py (1676 of 2138) PASS: lldb-unit :: Host/./HostTests/SocketAddressTest.Set (1677 of 2138) PASS: lldb-unit :: UnwindAssembly/x86/./UnwindAssemblyx86Tests/Testx86AssemblyInspectionEngine.Testi386IgnoredRegisters (1678 of 2138) PASS: lldb-unit :: Process/minidump/./LLDBMinidumpTests/MinidumpParserTest.GetPidWindows (1679 of 2138) PASS: lldb-api :: functionalities/return-value/TestReturnValue.py (1680 of 2138) PASS: lldb-unit :: Utility/./UtilityTests/FileSpecTest.GuessPathStyle (1681 of 2138) PASS: lldb-unit :: Symbol/./SymbolTests/TestClangASTImporter.CopyDeclTagDecl (1682 of 2138) PASS: lldb-api :: lang/cpp/exceptions/TestCPPExceptionBreakpoints.py (1683 of 2138) PASS: lldb-unit :: Utility/./UtilityTests/BinaryStreamTest.PutSLEB128OneByte (1684 of 2138) PASS: lldb-api :: functionalities/load_unload/TestLoadUnload.py (1685 of 2138) PASS: lldb-api :: commands/process/launch-with-shellexpand/TestLaunchWithShellExpand.py (1686 of 2138) PASS: lldb-api :: python_api/sbplatform/TestSBPlatform.py (1687 of 2138) PASS: lldb-api :: functionalities/non-overlapping-index-variable-i/TestIndexVariable.py (1688 of 2138) PASS: lldb-api :: lang/objc/objc-stepping/TestObjCStepping.py (1689 of 2138) PASS: lldb-unit :: Utility/./UtilityTests/ProcessInstanceInfoList.Yaml (1690 of 2138) PASS: lldb-unit :: Utility/./UtilityTests/StreamTeeTest.Flush (1691 of 2138) PASS: lldb-unit :: Process/gdb-remote/./ProcessGdbRemoteTests/GDBRemoteCommunicationClientTest.GetMemoryRegionInfoInvalidResponse (1692 of 2138) PASS: lldb-api :: python_api/formatters/TestFormattersSBAPI.py (1693 of 2138) PASS: lldb-shell :: Quit/TestQuitExitCodeImplicit0.test (1694 of 2138) PASS: lldb-shell :: Quit/TestQuitExitCodeHex0.test (1695 of 2138) PASS: lldb-shell :: SymbolFile/DWARF/debug_rnglists-dwo.s (1696 of 2138) PASS: lldb-unit :: Core/./LLDBCoreTests/MangledTest.EmptyForInvalidName (1697 of 2138) PASS: lldb-unit :: Utility/./UtilityTests/StringExtractorTest.GetHexBytes_OddPair2 (1698 of 2138) PASS: lldb-unit :: Core/./LLDBCoreTests/RichManglingContextTest.IPDRealloc (1699 of 2138) PASS: lldb-unit :: Host/./HostTests/FileSystemTest.EmptyTest (1700 of 2138) PASS: lldb-shell :: SymbolFile/DWARF/debug_ranges_and_rnglists.test (1701 of 2138) PASS: lldb-unit :: Host/./HostTests/FileSystemTest.OpenErrno (1702 of 2138) PASS: lldb-unit :: Utility/./UtilityTests/StringLexerTest.NextIfList (1703 of 2138) PASS: lldb-unit :: SymbolFile/NativePDB/./SymbolFileNativePDBTests/PDBFPOProgramToDWARFExpressionTests.MultipleDependentAssignments (1704 of 2138) PASS: lldb-shell :: SymbolFile/DWARF/debug_loc-aslr.s (1705 of 2138) PASS: lldb-api :: commands/expression/import-std-module/queue/TestQueueFromStdModule.py (1706 of 2138) PASS: lldb-shell :: BuildScript/modes.test (1707 of 2138) PASS: lldb-unit :: Utility/./UtilityTests/StringListTest.ForRange (1708 of 2138) PASS: lldb-shell :: ObjectFile/ELF/PT_LOAD-overlap-PT_INTERP.yaml (1709 of 2138) PASS: lldb-api :: commands/expression/import-std-module/unique_ptr-dbg-info-content/TestUniquePtrDbgInfoContent.py (1710 of 2138) PASS: lldb-shell :: ScriptInterpreter/Python/crashlog.test (1711 of 2138) PASS: lldb-shell :: SymbolFile/DWARF/split-dwarf-multiple-cu.ll (1712 of 2138) PASS: lldb-unit :: Utility/./UtilityTests/FileSpecTest.EqualDotsPosixRoot (1713 of 2138) PASS: lldb-unit :: Utility/./UtilityTests/StringListTest.LongestCommonPrefixSingleElement (1714 of 2138) PASS: lldb-shell :: Commands/command-source.test (1715 of 2138) PASS: lldb-unit :: Utility/./UtilityTests/XcodeSDKTest.SDKSupportsSwift (1716 of 2138) PASS: lldb-unit :: Utility/./UtilityTests/TimerTest.CategoryTimesNested (1717 of 2138) PASS: lldb-unit :: Expression/./ExpressionTests/CppModuleConfigurationTest.MissingLibCpp (1718 of 2138) PASS: lldb-api :: functionalities/object-file/TestImageListMultiArchitecture.py (1719 of 2138) PASS: lldb-api :: python_api/findvalue_duplist/TestSBFrameFindValue.py (1720 of 2138) PASS: lldb-api :: macosx/DBGSourcePathRemapping/TestDSYMSourcePathRemapping.py (1721 of 2138) PASS: lldb-shell :: Reproducer/TestSynchronous.test (1722 of 2138) PASS: lldb-api :: functionalities/breakpoint/breakpoint_command/TestBreakpointCommand.py (1723 of 2138) PASS: lldb-api :: commands/watchpoints/watchpoint_disable/TestWatchpointDisable.py (1724 of 2138) PASS: lldb-unit :: Utility/./UtilityTests/StringExtractorTest.GetHexBytesAvail (1725 of 2138) UNSUPPORTED: lldb-shell :: Register/x86-ymm-write.test (1726 of 2138) PASS: lldb-unit :: Core/./LLDBCoreTests/StreamCallbackTest.Callback (1727 of 2138) PASS: lldb-api :: functionalities/plugins/python_os_plugin/TestPythonOSPlugin.py (1728 of 2138) PASS: lldb-unit :: ScriptInterpreter/Python/./ScriptInterpreterPythonTests/PythonDataObjectsTest.TestPythonBytes (1729 of 2138) PASS: lldb-unit :: Utility/./UtilityTests/VASprintfTest.EncodingError (1730 of 2138) PASS: lldb-shell :: Settings/TestFrameFormatNoColor.test (1731 of 2138) PASS: lldb-api :: functionalities/thread/concurrent_events/TestConcurrentBreakpointOneDelayBreakpointThreads.py (1732 of 2138) PASS: lldb-api :: functionalities/tail_call_frames/cross_object/TestCrossObjectTailCalls.py (1733 of 2138) PASS: lldb-unit :: UnwindAssembly/x86/./UnwindAssemblyx86Tests/Testx86AssemblyInspectionEngine.TestPushR14 (1734 of 2138) PASS: lldb-api :: lang/c/register_variables/TestRegisterVariables.py (1735 of 2138) PASS: lldb-shell :: SymbolFile/DWARF/debug_ranges.s (1736 of 2138) PASS: lldb-shell :: ObjectFile/wasm/unified-debug-sections.yaml (1737 of 2138) PASS: lldb-unit :: Process/gdb-remote/./ProcessGdbRemoteTests/GDBRemoteCommunicationClientTest.WriteRegisterNoSuffix (1738 of 2138) PASS: lldb-shell :: ObjectFile/Breakpad/breakpad-identification.test (1739 of 2138) PASS: lldb-unit :: Utility/./UtilityTests/ProcessInstanceInfo.DumpTable (1740 of 2138) PASS: lldb-unit :: Symbol/./SymbolTests/TestClangASTImporter.DeportDeclTagDecl (1741 of 2138) PASS: lldb-api :: commands/expression/ignore-artificial-constructors/TestIgnoreArtificialConstructors.py (1742 of 2138) PASS: lldb-unit :: UnwindAssembly/x86/./UnwindAssemblyx86Tests/Testx86AssemblyInspectionEngine.Test64bitFramelessBigStackFrame (1743 of 2138) PASS: lldb-unit :: Symbol/./SymbolTests/TestTypeSystemClang.TestGetEnumIntegerTypeBasicTypes (1744 of 2138) PASS: lldb-unit :: Utility/./UtilityTests/UriParserTest.SchemeHostSeparator4 (1745 of 2138) PASS: lldb-unit :: Platform/./LLDBPlatformTests/PlatformDarwinTest.TestParseVersionBuildDir (1746 of 2138) PASS: lldb-api :: lang/c/offsetof/TestOffsetof.py (1747 of 2138) PASS: lldb-unit :: Host/./HostTests/NativeProcessProtocolTest.ReadCStringFromMemory (1748 of 2138) PASS: lldb-api :: functionalities/gdb_remote_client/TestProcessConnect.py (1749 of 2138) PASS: lldb-api :: lang/cpp/char1632_t/TestChar1632T.py (1750 of 2138) PASS: lldb-api :: functionalities/data-formatter/data-formatter-disabling/TestDataFormatterDisabling.py (1751 of 2138) PASS: lldb-shell :: Reproducer/Functionalities/TestImageList.test (1752 of 2138) PASS: lldb-api :: functionalities/gdb_remote_client/TestTargetXMLArch.py (1753 of 2138) PASS: lldb-unit :: Expression/./ExpressionTests/CppModuleConfigurationTest.LibCppV2 (1754 of 2138) PASS: lldb-api :: types/TestLongTypes.py (1755 of 2138) PASS: lldb-shell :: Quit/TestQuitExitCodeTooManyArgs.test (1756 of 2138) PASS: lldb-shell :: Breakpoint/debug_addrx.test (1757 of 2138) PASS: lldb-api :: functionalities/dead-strip/TestDeadStrip.py (1758 of 2138) PASS: lldb-unit :: SymbolFile/DWARF/./SymbolFileDWARFTests/SymbolFileDWARFTests.TestAbbrevValidAttrNullForm (1759 of 2138) PASS: lldb-unit :: Utility/./UtilityTests/RangeTest.Equal (1760 of 2138) PASS: lldb-unit :: Utility/./UtilityTests/NameMatchesTest.Equals (1761 of 2138) PASS: lldb-unit :: Utility/./UtilityTests/UriParserTest.BracketedHostnameWithPortIPv6 (1762 of 2138) PASS: lldb-unit :: Utility/./UtilityTests/StringListTest.LongestCommonPrefix (1763 of 2138) PASS: lldb-unit :: Host/./HostTests/FileActionTest.Open (1764 of 2138) PASS: lldb-api :: lang/cpp/diamond/TestDiamond.py (1765 of 2138) PASS: lldb-api :: lang/cpp/static_methods/TestCPPStaticMethods.py (1766 of 2138) PASS: lldb-api :: lang/cpp/class_types/TestClassTypesDisassembly.py (1767 of 2138) PASS: lldb-api :: tools/lldb-vscode/breakpoint/TestVSCode_setExceptionBreakpoints.py (1768 of 2138) PASS: lldb-shell :: Minidump/dump-all.test (1769 of 2138) PASS: lldb-api :: lang/cpp/accelerator-table/TestCPPAccelerator.py (1770 of 2138) PASS: lldb-shell :: Reproducer/Modules/TestModuleCXX.test (1771 of 2138) PASS: lldb-shell :: SymbolFile/DWARF/dwarf5-debug_line.s (1772 of 2138) PASS: lldb-unit :: Utility/./UtilityTests/FileSpecTest.EqualSeparator (1773 of 2138) PASS: lldb-unit :: Utility/./UtilityTests/DataExtractorTest.GetMaxU64 (1774 of 2138) PASS: lldb-unit :: Utility/./UtilityTests/StreamTest.PutChar (1775 of 2138) PASS: lldb-api :: commands/log/invalid-args/TestInvalidArgsLog.py (1776 of 2138) PASS: lldb-unit :: Language/Highlighting/./HighlighterTests/HighlighterTest.HighlighterSelectionPath (1777 of 2138) UNSUPPORTED: lldb-shell :: Register/x86-64-ymm16-write.test (1778 of 2138) PASS: lldb-api :: lang/objc/modules-incomplete/TestIncompleteModules.py (1779 of 2138) PASS: lldb-unit :: Utility/./UtilityTests/ArgsTest.StringListConstructor (1780 of 2138) PASS: lldb-shell :: Reproducer/Functionalities/TestDataFormatter.test (1781 of 2138) PASS: lldb-unit :: ScriptInterpreter/Python/./ScriptInterpreterPythonTests/PythonDataObjectsTest.TestDictionaryResolutionWithDot (1782 of 2138) PASS: lldb-unit :: Utility/./UtilityTests/StringLexerTest.NextIf (1783 of 2138) PASS: lldb-api :: macosx/find-dsym/bundle-with-dot-in-filename/TestBundleWithDotInFilename.py (1784 of 2138) PASS: lldb-api :: functionalities/inferior-crashing/TestInferiorCrashingStep.py (1785 of 2138) PASS: lldb-unit :: Utility/./UtilityTests/StringExtractorTest.GetHexBytesAvail_Partial (1786 of 2138) PASS: lldb-shell :: SymbolFile/DWARF/debug-types-address-ranges.s (1787 of 2138) PASS: lldb-unit :: Utility/./UtilityTests/DataExtractorTest.GetCStr (1788 of 2138) PASS: lldb-api :: functionalities/data-formatter/type_summary_list_arg/TestTypeSummaryListArg.py (1789 of 2138) PASS: lldb-api :: functionalities/breakpoint/breakpoint_command/TestBreakpointCommandsFromPython.py (1790 of 2138) PASS: lldb-api :: python_api/sbenvironment/TestSBEnvironment.py (1791 of 2138) PASS: lldb-api :: lang/cpp/stl/TestSTL.py (1792 of 2138) PASS: lldb-unit :: Utility/./UtilityTests/StringExtractorTest.GetHexBytes_Partial (1793 of 2138) PASS: lldb-shell :: SymbolFile/DWARF/find-qualified-variable.cpp (1794 of 2138) PASS: lldb-unit :: UnwindAssembly/x86/./UnwindAssemblyx86Tests/Testx86AssemblyInspectionEngine.TestPushEBX (1795 of 2138) PASS: lldb-api :: functionalities/data-formatter/synthcapping/TestSyntheticCapping.py (1796 of 2138) PASS: lldb-api :: functionalities/data-formatter/data-formatter-script/TestDataFormatterScript.py (1797 of 2138) PASS: lldb-unit :: Utility/./UtilityTests/ScalarTest.Promotion (1798 of 2138) PASS: lldb-api :: source-manager/TestSourceManager.py (1799 of 2138) PASS: lldb-shell :: ObjectFile/MachO/lc_build_version_notools.yaml (1800 of 2138) PASS: lldb-shell :: Minidump/breakpad-symbols.test (1801 of 2138) PASS: lldb-unit :: Utility/./UtilityTests/StringListTest.CopyListSingle (1802 of 2138) PASS: lldb-shell :: SymbolFile/DWARF/dwarf5-index-is-used.cpp (1803 of 2138) PASS: lldb-unit :: Utility/./UtilityTests/EventTest.DumpEventDataBytes (1804 of 2138) PASS: lldb-shell :: SymbolFile/DWARF/anon_class_w_and_wo_export_symbols.ll (1805 of 2138) PASS: lldb-unit :: Utility/./UtilityTests/LogChannelEnabledTest.LogVerboseThread (1806 of 2138) PASS: lldb-shell :: SymbolFile/NativePDB/source-list.cpp (1807 of 2138) PASS: lldb-api :: functionalities/thread/backtrace_limit/TestBacktraceLimit.py (1808 of 2138) UNSUPPORTED: lldb-shell :: Register/x86-64-ymm16-read.test (1809 of 2138) PASS: lldb-api :: functionalities/data-formatter/data-formatter-stl/libcxx/function/TestLibCxxFunction.py (1810 of 2138) PASS: lldb-api :: commands/target/create-no-such-arch/TestNoSuchArch.py (1811 of 2138) PASS: lldb-api :: commands/expression/call-function/TestCallUserDefinedFunction.py (1812 of 2138) PASS: lldb-shell :: Commands/command-script-import.test (1813 of 2138) PASS: lldb-api :: commands/expression/rdar44436068/Test128BitsInteger.py (1814 of 2138) PASS: lldb-unit :: UnwindAssembly/x86/./UnwindAssemblyx86Tests/Testx86AssemblyInspectionEngine.TestPushECX (1815 of 2138) PASS: lldb-unit :: SymbolFile/NativePDB/./SymbolFileNativePDBTests/PDBFPOProgramToDWARFExpressionTests.UnresolvedDependentCyclicRegisterAssignmentReference (1816 of 2138) PASS: lldb-api :: functionalities/data-formatter/data-formatter-objc/TestDataFormatterObjCKVO.py (1817 of 2138) PASS: lldb-unit :: Interpreter/./InterpreterTests/CompletionTest.DirCompletionUsername (1818 of 2138) PASS: lldb-api :: lang/objc/rdar-11355592/TestRdar11355592.py (1819 of 2138) PASS: lldb-shell :: SymbolFile/DWARF/DW_OP_piece-struct.s (1820 of 2138) PASS: lldb-unit :: Process/gdb-remote/./ProcessGdbRemoteTests/GDBRemoteCommunicationServerTest.SendErrorResponse_ErrorNumber (1821 of 2138) PASS: lldb-api :: lang/cpp/type_lookup/TestCppTypeLookup.py (1822 of 2138) PASS: lldb-shell :: ObjectFile/ELF/PT_LOAD-overlap-PT_TLS.yaml (1823 of 2138) PASS: lldb-api :: lang/c/local_variables/TestLocalVariables.py (1824 of 2138) PASS: lldb-shell :: SymbolFile/NativePDB/locate-pdb.cpp (1825 of 2138) PASS: lldb-shell :: Reproducer/TestFileRepro.test (1826 of 2138) PASS: lldb-unit :: Utility/./UtilityTests/RangeTest.EqualInvalid (1827 of 2138) PASS: lldb-api :: functionalities/data-formatter/type_summary_list_script/TestTypeSummaryListScript.py (1828 of 2138) PASS: lldb-shell :: Breakpoint/debug_rnglist_rlestartend.test (1829 of 2138) PASS: lldb-api :: functionalities/data-formatter/dump_dynamic/TestDumpDynamic.py (1830 of 2138) PASS: lldb-unit :: Process/minidump/./LLDBMinidumpTests/MinidumpParserTest.GetThreadContext_x86_32_wow64 (1831 of 2138) PASS: lldb-unit :: Utility/./UtilityTests/StreamTest.PutHex16ByteOrderLittle (1832 of 2138) PASS: lldb-api :: macosx/macCatalyst/TestMacCatalyst.py (1833 of 2138) PASS: lldb-shell :: Reproducer/TestGDBRemoteRepro.test (1834 of 2138) UNSUPPORTED: lldb-api :: commands/gui/breakpoints/TestGuiBreakpoints.py (1835 of 2138) PASS: lldb-api :: functionalities/plugins/python_os_plugin/stepping_plugin_threads/TestOSPluginStepping.py (1836 of 2138) PASS: lldb-api :: functionalities/gdb_remote_client/TestWriteMemory.py (1837 of 2138) PASS: lldb-unit :: Language/CPlusPlus/./LanguageCPlusPlusTests/CPlusPlusLanguage.FindAlternateFunctionManglings (1838 of 2138) PASS: lldb-unit :: Utility/./UtilityTests/TimerTest.CategoryTimesStats (1839 of 2138) PASS: lldb-shell :: SymbolFile/DWARF/DW_TAG_variable-invalid_location.s (1840 of 2138) PASS: lldb-api :: python_api/breakpoint/TestBreakpointAPI.py (1841 of 2138) UNSUPPORTED: lldb-api :: functionalities/breakpoint/breakpoint_in_delayslot/TestAvoidBreakpointInDelaySlot.py (1842 of 2138) PASS: lldb-api :: commands/expression/import-std-module/list/TestListFromStdModule.py (1843 of 2138) UNSUPPORTED: lldb-shell :: Register/x86-zmm-read.test (1844 of 2138) PASS: lldb-unit :: Breakpoint/./LLDBBreakpointTests/BreakpointIDTest.StringIsBreakpointName (1845 of 2138) PASS: lldb-api :: commands/expression/completion/TestExprCompletion.py (1846 of 2138) PASS: lldb-api :: types/TestIntegerType.py (1847 of 2138) PASS: lldb-api :: lang/objc/direct-dispatch-step/TestObjCDirectDispatchStepping.py (1848 of 2138) PASS: lldb-unit :: Utility/./UtilityTests/BinaryStreamTest.PutSLEB128SixBytes (1849 of 2138) PASS: lldb-unit :: SymbolFile/DWARF/./SymbolFileDWARFTests/SymbolFileDWARFTests.TestAbbrevOutOfOrder (1850 of 2138) PASS: lldb-api :: lang/cpp/namespace_definitions/TestNamespaceDefinitions.py (1851 of 2138) PASS: lldb-unit :: Expression/./ExpressionTests/CppModuleConfigurationTest.Xcode (1852 of 2138) PASS: lldb-unit :: Utility/./UtilityTests/StringExtractorTest.GetNameColonValueSuccess (1853 of 2138) PASS: lldb-api :: tools/lldb-server/TestGdbRemoteHostInfo.py (1854 of 2138) PASS: lldb-unit :: Host/./HostTests/MainLoopTest.DetectsEOF (1855 of 2138) PASS: lldb-unit :: Utility/./UtilityTests/ScalarTest.Division (1856 of 2138) PASS: lldb-api :: functionalities/postmortem/minidump-new/TestMiniDumpNew.py (1857 of 2138) PASS: lldb-api :: functionalities/data-formatter/data-formatter-stl/libcxx/initializerlist/TestInitializerList.py (1858 of 2138) PASS: lldb-api :: commands/watchpoints/watchpoint_commands/command/TestWatchpointCommandPython.py (1859 of 2138) PASS: lldb-shell :: SymbolFile/DWARF/DW_OP_piece-smaller-than-struct.s (1860 of 2138) PASS: lldb-unit :: Utility/./UtilityTests/SerializationRountripTest.SerializeDeserializePodPointers (1861 of 2138) PASS: lldb-unit :: Utility/./UtilityTests/StringListTest.LongestCommonPrefixDuplicateElement (1862 of 2138) PASS: lldb-unit :: UnwindAssembly/x86/./UnwindAssemblyx86Tests/Testx86AssemblyInspectionEngine.TestCALLNextInsn (1863 of 2138) PASS: lldb-shell :: Reproducer/TestCrash.test (1864 of 2138) PASS: lldb-unit :: Utility/./UtilityTests/TimerTest.CategoryTimes (1865 of 2138) PASS: lldb-api :: python_api/sbvalue_persist/TestSBValuePersist.py (1866 of 2138) PASS: lldb-shell :: SymbolFile/DWARF/debug_aranges-empty-section.s (1867 of 2138) PASS: lldb-api :: functionalities/thread/concurrent_events/TestConcurrentWatchpointDelayWatchpointOneBreakpoint.py (1868 of 2138) PASS: lldb-unit :: Utility/./UtilityTests/StreamTest.AddressPrefixAndSuffix (1869 of 2138) PASS: lldb-api :: lang/c/stepping/TestThreadStepping.py (1870 of 2138) PASS: lldb-api :: lang/c/unions/TestUnionMembers.py (1871 of 2138) PASS: lldb-api :: lang/objc/foundation/TestObjCMethods2.py (1872 of 2138) PASS: lldb-api :: python_api/debugger/TestDebuggerAPI.py (1873 of 2138) PASS: lldb-api :: functionalities/data-formatter/data-formatter-objc/TestDataFormatterObjCExpr.py (1874 of 2138) UNSUPPORTED: lldb-shell :: ScriptInterpreter/Lua/nested_sessions.test (1875 of 2138) PASS: lldb-api :: functionalities/thread/exit_during_step/TestExitDuringStep.py (1876 of 2138) PASS: lldb-shell :: Process/TestAbortExitCode.test (1877 of 2138) PASS: lldb-unit :: Utility/./UtilityTests/ConstStringTest.CompareStringRef (1878 of 2138) PASS: lldb-api :: lang/objc/orderedset/TestOrderedSet.py (1879 of 2138) PASS: lldb-api :: macosx/lc-note/kern-ver-str/TestKernVerStrLCNOTE.py (1880 of 2138) PASS: lldb-unit :: UnwindAssembly/x86/./UnwindAssemblyx86Tests/Testx86AssemblyInspectionEngine.TestPopRBPWithREX (1881 of 2138) PASS: lldb-api :: tools/lldb-vscode/stackTrace/TestVSCode_stackTrace.py (1882 of 2138) PASS: lldb-unit :: Utility/./UtilityTests/StringLexerTest.GetUnlexed (1883 of 2138) PASS: lldb-unit :: Utility/./UtilityTests/ProcessInstanceInfo.DumpTable_invalidUID (1884 of 2138) PASS: lldb-api :: functionalities/deleted-executable/TestDeletedExecutable.py (1885 of 2138) UNSUPPORTED: lldb-api :: tools/lldb-vscode/disconnect/TestVSCode_disconnect.py (1886 of 2138) PASS: lldb-api :: api/multiple-debuggers/TestMultipleDebuggers.py (1887 of 2138) PASS: lldb-unit :: ObjectFile/PECOFF/./ObjectFilePECOFFTests/PECallFrameInfoTest.Chained_eh (1888 of 2138) PASS: lldb-unit :: UnwindAssembly/x86/./UnwindAssemblyx86Tests/Testx86AssemblyInspectionEngine.TestAddESP (1889 of 2138) PASS: lldb-api :: commands/expression/call-function/TestCallStdStringFunction.py (1890 of 2138) UNSUPPORTED: lldb-shell :: SymbolFile/PDB/calling-conventions.test (1891 of 2138) PASS: lldb-unit :: Language/Highlighting/./HighlighterTests/HighlighterTest.ClangScalarLiterals (1892 of 2138) PASS: lldb-api :: functionalities/breakpoint/consecutive_breakpoints/TestConsecutiveBreakpoints.py (1893 of 2138) UNSUPPORTED: lldb-api :: lang/objc/rdar-12408181/TestRdar12408181.py (1894 of 2138) PASS: lldb-unit :: Utility/./UtilityTests/UriParserTest.BracketedHostnameWithPortIPv4 (1895 of 2138) PASS: lldb-unit :: UnwindAssembly/x86/./UnwindAssemblyx86Tests/Testx86AssemblyInspectionEngine.TestSimplei386ugmented (1896 of 2138) PASS: lldb-unit :: Utility/./UtilityTests/StreamTest.Indent (1897 of 2138) PASS: lldb-unit :: Target/./TargetTests/MemoryRegionInfoTest.Formatv (1898 of 2138) PASS: lldb-api :: functionalities/postmortem/mach-core/TestMachCore.py (1899 of 2138) UNSUPPORTED: lldb-shell :: SymbolFile/PDB/variables-locations.test (1900 of 2138) PASS: lldb-api :: commands/expression/persist_objc_pointeetype/TestPersistObjCPointeeType.py (1901 of 2138) PASS: lldb-api :: lang/cpp/lambdas/TestLambdas.py (1902 of 2138) PASS: lldb-api :: commands/frame/var/TestFrameVar.py (1903 of 2138) PASS: lldb-api :: commands/command/script/TestCommandScript.py (1904 of 2138) PASS: lldb-unit :: Language/Highlighting/./HighlighterTests/HighlighterTest.DefaultHighlighterWithCursor (1905 of 2138) PASS: lldb-api :: functionalities/process_group/TestChangeProcessGroup.py (1906 of 2138) PASS: lldb-api :: functionalities/conditional_break/TestConditionalBreak.py (1907 of 2138) PASS: lldb-unit :: Symbol/./SymbolTests/TestTypeSystemClang.TestGetTypeClassDeclType (1908 of 2138) PASS: lldb-unit :: Symbol/./SymbolTests/TestTypeSystemClang.TestBuiltinTypeForEncodingAndBitSize (1909 of 2138) PASS: lldb-api :: commands/frame/diagnose/virtual-method-call/TestDiagnoseDereferenceVirtualMethodCall.py (1910 of 2138) PASS: lldb-api :: python_api/watchpoint/TestWatchpointIgnoreCount.py (1911 of 2138) PASS: lldb-api :: functionalities/breakpoint/breakpoint_conditions/TestBreakpointConditions.py (1912 of 2138) PASS: lldb-shell :: SymbolFile/DWARF/find-variable-file.cpp (1913 of 2138) PASS: lldb-unit :: Symbol/./SymbolTests/PostfixExpression.ParseOneExpression (1914 of 2138) PASS: lldb-api :: functionalities/jitloader_gdb/TestJITLoaderGDB.py (1915 of 2138) PASS: lldb-api :: commands/expression/expr-in-syscall/TestExpressionInSyscall.py (1916 of 2138) PASS: lldb-api :: sanity/TestSettingSkipping.py (1917 of 2138) PASS: lldb-api :: driver/batch_mode/TestBatchMode.py (1918 of 2138) PASS: lldb-api :: commands/expression/formatters/TestFormatters.py (1919 of 2138) PASS: lldb-unit :: UnwindAssembly/x86/./UnwindAssemblyx86Tests/Testx86AssemblyInspectionEngine.TestMovRSPtoRBP (1920 of 2138) PASS: lldb-unit :: Target/./TargetTests/StackFrameRecognizerTest.NullModuleRegex (1921 of 2138) PASS: lldb-unit :: UnwindAssembly/x86/./UnwindAssemblyx86Tests/Testx86AssemblyInspectionEngine.TestLEAVE (1922 of 2138) PASS: lldb-api :: functionalities/data-formatter/data-formatter-globals/TestDataFormatterGlobals.py (1923 of 2138) PASS: lldb-unit :: SymbolFile/NativePDB/./SymbolFileNativePDBTests/PDBFPOProgramToDWARFExpressionTests.InvalidAssignmentSingle (1924 of 2138) PASS: lldb-api :: commands/platform/process/list/TestProcessList.py (1925 of 2138) UNSUPPORTED: lldb-api :: functionalities/darwin_log/filter/regex/activity-chain/TestDarwinLogFilterRegexActivityChain.py (1926 of 2138) PASS: lldb-api :: functionalities/thread/concurrent_events/TestConcurrentDelayWatchBreak.py (1927 of 2138) PASS: lldb-unit :: Language/Highlighting/./HighlighterTests/HighlighterTest.ClangOperators (1928 of 2138) UNSUPPORTED: lldb-shell :: SymbolFile/PDB/expressions.test (1929 of 2138) PASS: lldb-shell :: Breakpoint/jitbp_elf.test (1930 of 2138) PASS: lldb-api :: functionalities/data-formatter/var-in-aggregate-misuse/TestVarInAggregateMisuse.py (1931 of 2138) PASS: lldb-unit :: ScriptInterpreter/Python/./ScriptInterpreterPythonTests/PythonDataObjectsTest.TestPythonTupleInitializerList (1932 of 2138) PASS: lldb-unit :: Utility/./UtilityTests/ArgsTest.TestSingleQuotedArgWithSpace (1933 of 2138) PASS: lldb-shell :: ObjectFile/wasm/stripped-debug-sections.yaml (1934 of 2138) PASS: lldb-shell :: ObjectFile/ELF/netbsd-core-amd64.test (1935 of 2138) PASS: lldb-api :: functionalities/plugins/command_plugin/TestPluginCommands.py (1936 of 2138) PASS: lldb-api :: tools/lldb-server/inferior-crash/TestGdbRemoteSegFault.py (1937 of 2138) PASS: lldb-shell :: Driver/TestNoUseColor.test (1938 of 2138) PASS: lldb-api :: lang/cpp/virtual-functions/TestCppVirtualFunctions.py (1939 of 2138) PASS: lldb-api :: commands/session/history/TestSessionHistory.py (1940 of 2138) PASS: lldb-api :: functionalities/breakpoint/breakpoint_command/TestRegexpBreakCommand.py (1941 of 2138) PASS: lldb-unit :: Editline/./EditlineTests/EditlineTestFixture.EditlineReceivesMultiLineText (1942 of 2138) PASS: lldb-shell :: ObjectFile/ELF/avr-basic-info.yaml (1943 of 2138) PASS: lldb-api :: lang/objc/unicode-string/TestUnicodeString.py (1944 of 2138) PASS: lldb-api :: commands/apropos/with-process/TestAproposWithProcess.py (1945 of 2138) PASS: lldb-api :: python_api/sbstructureddata/TestStructuredDataAPI.py (1946 of 2138) PASS: lldb-unit :: UnwindAssembly/x86/./UnwindAssemblyx86Tests/Testx86AssemblyInspectionEngine.TestSpArithx86_64Augmented (1947 of 2138) PASS: lldb-shell :: SymbolFile/DWARF/debug-line-basic.s (1948 of 2138) PASS: lldb-unit :: Symbol/./SymbolTests/TestClangASTImporter.CompleteFwdDeclWithOtherOrigin (1949 of 2138) PASS: lldb-unit :: Utility/./UtilityTests/StringExtractorTest.GetU32BigEndian (1950 of 2138) PASS: lldb-unit :: Target/./TargetTests/PathMappingListTest.RelativeTests (1951 of 2138) PASS: lldb-unit :: UnwindAssembly/x86/./UnwindAssemblyx86Tests/Testx86AssemblyInspectionEngine.TestDisassemblyJunkBytes (1952 of 2138) PASS: lldb-shell :: SymbolFile/DWARF/dir-separator-posix.s (1953 of 2138) PASS: lldb-unit :: Utility/./UtilityTests/ProcessInstanceInfoMatch.Name (1954 of 2138) PASS: lldb-api :: lang/objc/objc-checker/TestObjCCheckers.py (1955 of 2138) PASS: lldb-unit :: Utility/./UtilityTests/StringExtractorTest.GetHexU8_Underflow (1956 of 2138) PASS: lldb-api :: macosx/function-starts/TestFunctionStarts.py (1957 of 2138) PASS: lldb-unit :: Utility/./UtilityTests/AnsiTerminal.Basic (1958 of 2138) PASS: lldb-unit :: Utility/./UtilityTests/ArgsTest.TestAppendArg (1959 of 2138) UNSUPPORTED: lldb-api :: tools/lldb-server/signal-filtering/TestGdbRemote_QPassSignals.py (1960 of 2138) PASS: lldb-unit :: ScriptInterpreter/Python/./ScriptInterpreterPythonTests/PythonDataObjectsTest.TestPythonBoolean (1961 of 2138) PASS: lldb-unit :: ObjectFile/Breakpad/./ObjectFileBreakpadTests/FileRecord.parse (1962 of 2138) PASS: lldb-api :: functionalities/float-display/TestFloatDisplay.py (1963 of 2138) PASS: lldb-unit :: UnwindAssembly/x86/./UnwindAssemblyx86Tests/Testx86AssemblyInspectionEngine.TestPushEDX (1964 of 2138) PASS: lldb-api :: lang/cpp/auto/TestCPPAuto.py (1965 of 2138) UNSUPPORTED: lldb-api :: commands/gui/basicdebug/TestGuiBasicDebug.py (1966 of 2138) PASS: lldb-shell :: Quit/TestQuitExitCode-30.test (1967 of 2138) PASS: lldb-api :: lang/objc/objc-super/TestObjCSuper.py (1968 of 2138) UNSUPPORTED: lldb-api :: functionalities/breakpoint/hardware_breakpoints/write_memory_with_hw_breakpoint/TestWriteMemoryWithHWBreakpoint.py (1969 of 2138) PASS: lldb-unit :: Utility/./UtilityTests/DataExtractorTest.GetMaxS64 (1970 of 2138) PASS: lldb-api :: commands/expression/import-std-module/forward_decl_from_module/TestForwardDeclFromStdModule.py (1971 of 2138) PASS: lldb-api :: functionalities/thread/concurrent_events/TestConcurrentCrashWithWatchpointBreakpointSignal.py (1972 of 2138) UNSUPPORTED: lldb-shell :: SymbolFile/NativePDB/ast-functions-msvc.cpp (1973 of 2138) PASS: lldb-api :: lang/cpp/global_variables/TestCPPGlobalVariables.py (1974 of 2138) PASS: lldb-shell :: SymbolFile/DWARF/find-inline-method.s (1975 of 2138) PASS: lldb-unit :: UnwindAssembly/x86/./UnwindAssemblyx86Tests/Testx86AssemblyInspectionEngine.TestPopEDI (1976 of 2138) PASS: lldb-unit :: Host/./HostTests/File.GetStreamFromDescriptor (1977 of 2138) UNSUPPORTED: lldb-api :: functionalities/data-formatter/data-formatter-stl/libstdcpp/list/TestDataFormatterStdList.py (1978 of 2138) PASS: lldb-unit :: Utility/./UtilityTests/BinaryStreamTest.PutSLEB128One (1979 of 2138) PASS: lldb-api :: tools/lldb-server/TestGdbRemoteAttach.py (1980 of 2138) PASS: lldb-unit :: Utility/./UtilityTests/DataExtractorTest.GetFloatUnaligned (1981 of 2138) PASS: lldb-unit :: Language/Highlighting/./HighlighterTests/HighlighterTest.ClangCursorPosEndOfLine (1982 of 2138) PASS: lldb-api :: lang/cpp/function_refs/TestFunctionRefs.py (1983 of 2138) PASS: lldb-unit :: Utility/./UtilityTests/StringListTest.ShiftMove (1984 of 2138) PASS: lldb-api :: functionalities/thread/crash_during_step/TestCrashDuringStep.py (1985 of 2138) PASS: lldb-unit :: Utility/./UtilityTests/ScalarTest.GetValue (1986 of 2138) UNSUPPORTED: lldb-shell :: ScriptInterpreter/Lua/command_script_import.test (1987 of 2138) PASS: lldb-unit :: Expression/./ExpressionTests/CppModuleConfigurationTest.AmbiguousCLib (1988 of 2138) PASS: lldb-shell :: ObjectFile/ELF/section-types-edgecases.yaml (1989 of 2138) PASS: lldb-unit :: Expression/./ExpressionTests/DiagnosticManagerTest.GetStringNoDiags (1990 of 2138) PASS: lldb-shell :: Driver/LocalLLDBInit.test (1991 of 2138) PASS: lldb-unit :: Target/./TargetTests/ExecutionContextTest.GetByteOrderProcess (1992 of 2138) PASS: lldb-unit :: Utility/./UtilityTests/UriParserTest.TypicalPortPathIPv6 (1993 of 2138) PASS: lldb-api :: functionalities/thread/concurrent_events/TestConcurrentSignalDelayBreak.py (1994 of 2138) PASS: lldb-api :: functionalities/data-formatter/compactvectors/TestCompactVectors.py (1995 of 2138) PASS: lldb-unit :: Host/./HostTests/SocketAddressTest.GetAddressInfo (1996 of 2138) PASS: lldb-shell :: SymbolFile/NativePDB/nested-types.cpp (1997 of 2138) PASS: lldb-api :: commands/platform/file/close/TestPlatformFileClose.py (1998 of 2138) PASS: lldb-api :: lang/cpp/rvalue-references/TestRvalueReferences.py (1999 of 2138) PASS: lldb-unit :: UnwindAssembly/x86/./UnwindAssemblyx86Tests/Testx86AssemblyInspectionEngine.TestPopRBP (2000 of 2138) PASS: lldb-unit :: Language/Highlighting/./HighlighterTests/HighlighterTest.DefaultHighlighterWithCursorOutOfBounds (2001 of 2138) PASS: lldb-unit :: API/./APITests/SBCommandInterpreterTest.MultiWordCommand (2002 of 2138) PASS: lldb-api :: functionalities/gdb_remote_client/TestRestartBug.py (2003 of 2138) PASS: lldb-api :: functionalities/thread/step_until/TestStepUntil.py (2004 of 2138) PASS: lldb-shell :: ScriptInterpreter/None/import_module.test (2005 of 2138) PASS: lldb-unit :: Process/gdb-remote/./ProcessGdbRemoteTests/GDBRemoteClientBaseTest.SendContinueDelegateInterface (2006 of 2138) PASS: lldb-unit :: Utility/./UtilityTests/AnsiTerminal.AtStart (2007 of 2138) PASS: lldb-unit :: DataFormatter/./LLDBFormatterTests/TypeMatcherTests.RegexMatchPart (2008 of 2138) PASS: lldb-api :: functionalities/thread/concurrent_events/TestConcurrentBreakpointDelayBreakpointOneSignal.py (2009 of 2138) PASS: lldb-api :: python_api/sbtype_typeclass/TestSBTypeTypeClass.py (2010 of 2138) UNSUPPORTED: lldb-api :: iohandler/completion/TestIOHandlerCompletion.py (2011 of 2138) PASS: lldb-api :: commands/expression/import-std-module/forward_list/TestForwardListFromStdModule.py (2012 of 2138) PASS: lldb-unit :: Host/./HostTests/SocketTest.TCPListen0GetPort (2013 of 2138) UNSUPPORTED: lldb-shell :: ExecControl/StopHook/stop-hook-threads.test (2014 of 2138) PASS: lldb-shell :: ObjectFile/ELF/gnu-debuglink.yaml (2015 of 2138) PASS: lldb-shell :: Settings/TestStopCommandSourceOnError.test (2016 of 2138) PASS: lldb-api :: python_api/value/change_values/TestChangeValueAPI.py (2017 of 2138) PASS: lldb-api :: commands/expression/import_builtin_fileid/TestImportBuiltinFileID.py (2018 of 2138) PASS: lldb-unit :: Symbol/./SymbolTests/TestTypeSystemClang.AddMethodToObjCObjectType (2019 of 2138) PASS: lldb-api :: commands/settings/quoting/TestQuoting.py (2020 of 2138) PASS: lldb-unit :: Utility/./UtilityTests/ArchSpecTest.TestSetTriple (2021 of 2138) PASS: lldb-api :: commands/register/register/register_command/TestRegisters.py (2022 of 2138) UNSUPPORTED: lldb-shell :: ScriptInterpreter/Lua/quit.test (2023 of 2138) PASS: lldb-api :: functionalities/breakpoint/auto_continue/TestBreakpointAutoContinue.py (2024 of 2138) PASS: lldb-unit :: DataFormatter/./LLDBFormatterTests/TypeMatcherTests.ExactName (2025 of 2138) UNSUPPORTED: lldb-api :: commands/register/register/aarch64_sve_registers/rw_access_static_config/TestSVERegisters.py (2026 of 2138) PASS: lldb-api :: tools/lldb-server/TestGdbRemoteKill.py (2027 of 2138) PASS: lldb-shell :: SymbolFile/DWARF/parallel-indexing-stress.s (2028 of 2138) PASS: lldb-shell :: Commands/command-regex-delete.test (2029 of 2138) PASS: lldb-api :: functionalities/archives/TestBSDArchives.py (2030 of 2138) PASS: lldb-unit :: Process/gdb-remote/./ProcessGdbRemoteTests/GDBRemoteCommunicationClientTest.SaveRestoreRegistersNoSuffix (2031 of 2138) PASS: lldb-api :: functionalities/thread/step_out/TestThreadStepOut.py (2032 of 2138) PASS: lldb-api :: commands/watchpoints/watchpoint_count/TestWatchpointCount.py (2033 of 2138) PASS: lldb-api :: lang/objc/foundation/TestObjCMethodsNSError.py (2034 of 2138) PASS: lldb-api :: lang/objc/modules-compile-error/TestModulesCompileError.py (2035 of 2138) PASS: lldb-shell :: ScriptInterpreter/None/none.test (2036 of 2138) PASS: lldb-api :: lang/mixed/TestMixedLanguages.py (2037 of 2138) UNSUPPORTED: lldb-api :: tools/lldb-vscode/completions/TestVSCode_completions.py (2038 of 2138) PASS: lldb-shell :: SymbolFile/Breakpad/line-table-missing-file.test (2039 of 2138) PASS: lldb-unit :: Platform/./LLDBPlatformTests/PlatformAppleSimulatorTest.TestSimHasSimEnvionament (2040 of 2138) PASS: lldb-unit :: Process/minidump/./LLDBMinidumpTests/MinidumpParserTest.GetArchitectureWindows (2041 of 2138) PASS: lldb-api :: python_api/signals/TestSignalsAPI.py (2042 of 2138) PASS: lldb-api :: lang/cpp/unsigned_types/TestUnsignedTypes.py (2043 of 2138) PASS: lldb-unit :: Utility/./UtilityTests/StatusTest.ErrorConversion (2044 of 2138) PASS: lldb-unit :: Utility/./UtilityTests/ArgsTest.ReplaceArgumentAtIndexEqual (2045 of 2138) UNSUPPORTED: lldb-api :: functionalities/tty/TestTerminal.py (2046 of 2138) PASS: lldb-unit :: Utility/./UtilityTests/RegularExpression.Invalid (2047 of 2138) PASS: lldb-unit :: Process/gdb-remote/./ProcessGdbRemoteTests/GDBRemoteCommunicationClientTest.SendStopTracePacket (2048 of 2138) PASS: lldb-unit :: Symbol/./SymbolTests/TestTypeSystemClang.TestGetTypeClassTypeOf (2049 of 2138) PASS: lldb-api :: functionalities/data-formatter/data-formatter-stl/libcxx/unique_ptr/TestDataFormatterLibcxxUniquePtr.py (2050 of 2138) PASS: lldb-unit :: Utility/./UtilityTests/RangeTest.Slide (2051 of 2138) PASS: lldb-unit :: Core/./LLDBCoreTests/CommunicationTest.SynchronizeWhileClosing (2052 of 2138) PASS: lldb-api :: lang/cpp/global_operators/TestCppGlobalOperators.py (2053 of 2138) PASS: lldb-unit :: Utility/./UtilityTests/ArchSpecTest.TestParseMachCPUDashSubtypeTripleExtra (2054 of 2138) PASS: lldb-unit :: Utility/./UtilityTests/ScalarTest.CastOperations (2055 of 2138) PASS: lldb-unit :: UnwindAssembly/x86/./UnwindAssemblyx86Tests/Testx86AssemblyInspectionEngine.TestStackRealign8BitDisp_i386 (2056 of 2138) PASS: lldb-unit :: Host/./HostTests/SocketTest.TCPListen0ConnectAccept (2057 of 2138) UNSUPPORTED: lldb-shell :: Register/x86-ymm-read.test (2058 of 2138) PASS: lldb-unit :: Language/Highlighting/./HighlighterTests/HighlighterTest.ClangBraces (2059 of 2138) PASS: lldb-api :: functionalities/data-formatter/ptr_ref_typedef/TestPtrRef2Typedef.py (2060 of 2138) PASS: lldb-unit :: Utility/./UtilityTests/StreamTest.AddressRange (2061 of 2138) PASS: lldb-unit :: ScriptInterpreter/Python/./ScriptInterpreterPythonTests/PythonDataObjectsTest.TestPythonString (2062 of 2138) PASS: lldb-unit :: Utility/./UtilityTests/BinaryStreamTest.PutULEB128FourBytes (2063 of 2138) PASS: lldb-shell :: Settings/TestFrameFormatMangling.test (2064 of 2138) PASS: lldb-unit :: Host/./HostTests/FileSystemTest.Resolve (2065 of 2138) PASS: lldb-api :: functionalities/history/TestHistoryRecall.py (2066 of 2138) PASS: lldb-unit :: debugserver/./debugserverTests/RNBSocket.LoopBackConnectIPv4 (2067 of 2138) UNSUPPORTED: lldb-api :: functionalities/darwin_log/filter/exact_match/activity-chain/TestDarwinLogFilterMatchActivityChain.py (2068 of 2138) PASS: lldb-unit :: Utility/./UtilityTests/LogTest.Register (2069 of 2138) PASS: lldb-unit :: DataFormatter/./LLDBFormatterTests/TypeMatcherTests.RegexName (2070 of 2138) PASS: lldb-api :: commands/expression/call-function/TestCallBuiltinFunction.py (2071 of 2138) PASS: lldb-unit :: Host/./HostTests/ProcessLaunchInfoTest.Constructor (2072 of 2138) PASS: lldb-shell :: Reproducer/TestReuseDirectory.test (2073 of 2138) PASS: lldb-unit :: Utility/./UtilityTests/SerializationRountripTest.SerializeDeserializeObjectPointer (2074 of 2138) PASS: lldb-unit :: ObjectFile/Breakpad/./ObjectFileBreakpadTests/StackWinRecord.parse (2075 of 2138) PASS: lldb-unit :: Expression/./ExpressionTests/DiagnosticManagerTest.HasFixits (2076 of 2138) PASS: lldb-api :: python_api/frame/inlines/TestInlinedFrame.py (2077 of 2138) PASS: lldb-unit :: Process/gdb-remote/./ProcessGdbRemoteTests/GDBRemoteCommunicationServerTest.SendErrorResponse_ErrorList (2078 of 2138) UNSUPPORTED: lldb-shell :: Register/x86-zmm-write.test (2079 of 2138) PASS: lldb-api :: functionalities/data-formatter/vector-types/TestVectorTypesFormatting.py (2080 of 2138) PASS: lldb-api :: python_api/type/TestTypeList.py (2081 of 2138) PASS: lldb-unit :: Utility/./UtilityTests/UriParserTest.Minimal (2082 of 2138) UNSUPPORTED: lldb-shell :: SymbolFile/DWARF/DW_TAG_GNU_call_site-DW_AT_low_pc.s (2083 of 2138) PASS: lldb-api :: functionalities/data-formatter/format-propagation/TestFormatPropagation.py (2084 of 2138) UNSUPPORTED: lldb-shell :: BuildScript/toolchain-clang-cl.test (2085 of 2138) PASS: lldb-api :: lang/objc/foundation/TestObjCMethodsNSArray.py (2086 of 2138) PASS: lldb-shell :: ObjectFile/ELF/PT_LOAD-overlap-section.yaml (2087 of 2138) PASS: lldb-api :: python_api/process/read-mem-cstring/TestReadMemCString.py (2088 of 2138) PASS: lldb-shell :: Process/Optimization.test (2089 of 2138) PASS: lldb-unit :: Expression/./ExpressionTests/CppModuleConfigurationTest.IgnoreLibStdCpp (2090 of 2138) PASS: lldb-unit :: UnwindAssembly/x86/./UnwindAssemblyx86Tests/Testx86AssemblyInspectionEngine.TestDisassemblyMidFunctionEpilogues (2091 of 2138) PASS: lldb-api :: functionalities/data-formatter/data-formatter-stl/libcxx/string/TestDataFormatterLibcxxString.py (2092 of 2138) PASS: lldb-api :: commands/expression/radar_8638051/Test8638051.py (2093 of 2138) UNSUPPORTED: lldb-api :: benchmarks/expression/TestExpressionCmd.py (2094 of 2138) PASS: lldb-unit :: Process/gdb-remote/./ProcessGdbRemoteTests/GDBRemoteCommunicationServerTest.SendErrorResponse_StringError (2095 of 2138) PASS: lldb-api :: functionalities/limit-debug-info/TestLimitDebugInfo.py (2096 of 2138) PASS: lldb-unit :: Host/./HostTests/MainLoopTest.UnmonitoredSignal (2097 of 2138) PASS: lldb-api :: macosx/version_zero/TestGetVersionZeroVersion.py (2098 of 2138) UNSUPPORTED: lldb-shell :: Register/aarch64-fp-read.test (2099 of 2138) PASS: lldb-shell :: Commands/command-regex-unalias.test (2100 of 2138) PASS: lldb-unit :: Utility/./UtilityTests/StringListTest.DefaultConstructor (2101 of 2138) PASS: lldb-unit :: Host/./HostTests/FileSystemTest.GetPermissions (2102 of 2138) PASS: lldb-unit :: Host/./HostTests/SocketTest.UDPGetConnectURI (2103 of 2138) UNSUPPORTED: lldb-shell :: Register/x86-64-zmm-read.test (2104 of 2138) PASS: lldb-unit :: Utility/./UtilityTests/StringListTest.JoinThree (2105 of 2138) PASS: lldb-unit :: Signals/./SignalsTests/UnixSignalsTest.VersionChange (2106 of 2138) PASS: lldb-shell :: SymbolFile/DWARF/debug_loc_and_loclists.s (2107 of 2138) PASS: lldb-unit :: Core/./LLDBCoreTests/RichManglingContextTest.SwitchProvider (2108 of 2138) PASS: lldb-api :: functionalities/thread/concurrent_events/TestConcurrentTwoWatchpointsOneSignal.py (2109 of 2138) PASS: lldb-unit :: Utility/./UtilityTests/VMRange.Comparison (2110 of 2138) PASS: lldb-unit :: Utility/./UtilityTests/StreamTest.AddressRangeEmptyRange (2111 of 2138) PASS: lldb-unit :: Utility/./UtilityTests/Predicate.WaitForValueNotEqualTo (2112 of 2138) PASS: lldb-api :: functionalities/source-map/TestTargetSourceMap.py (2113 of 2138) PASS: lldb-api :: functionalities/gdb_remote_client/TestGDBRemoteClient.py (2114 of 2138) PASS: lldb-api :: functionalities/gdb_remote_client/TestqOffsets.py (2115 of 2138) PASS: lldb-unit :: Utility/./UtilityTests/StreamTest.PutHex32ByteOrderLittle (2116 of 2138) PASS: lldb-unit :: DataFormatter/./LLDBFormatterTests/StringPrinterTests.CxxASCII (2117 of 2138) PASS: lldb-unit :: Process/minidump/./LLDBMinidumpTests/MinidumpParserTest.InvalidMinidump (2118 of 2138) PASS: lldb-shell :: Breakpoint/dummy-target.test (2119 of 2138) PASS: lldb-shell :: ObjectFile/wasm/embedded-debug-sections.yaml (2120 of 2138) PASS: lldb-unit :: Host/./HostTests/NativeProcessProtocolTest.SetBreakpointFailWrite (2121 of 2138) PASS: lldb-api :: functionalities/thread/concurrent_events/TestConcurrentTwoBreakpointsOneSignal.py (2122 of 2138) PASS: lldb-api :: commands/watchpoints/watchpoint_on_vectors/TestValueOfVectorVariable.py (2123 of 2138) UNSUPPORTED: lldb-api :: functionalities/tsan/cpp_global_location/TestTsanCPPGlobalLocation.py (2124 of 2138) PASS: lldb-api :: functionalities/tail_call_frames/unambiguous_sequence/TestUnambiguousTailCalls.py (2125 of 2138) PASS: lldb-api :: lang/c/modules/TestCModules.py (2126 of 2138) PASS: lldb-unit :: Utility/./UtilityTests/PassiveReplayTest.InstrumentedFooInvalid (2127 of 2138) PASS: lldb-shell :: Reproducer/TestRelativePath.test (2128 of 2138) PASS: lldb-unit :: Utility/./UtilityTests/LogTest.LLDB_LOG_nullptr (2129 of 2138) PASS: lldb-unit :: Symbol/./SymbolTests/TestClangASTImporter.MetadataPropagationAfterCopying (2130 of 2138) PASS: lldb-api :: macosx/find-app-in-bundle/TestFindAppInBundle.py (2131 of 2138) PASS: lldb-api :: functionalities/data-formatter/data-formatter-caching/TestDataFormatterCaching.py (2132 of 2138) PASS: lldb-shell :: ObjectFile/ELF/section-permissions.yaml (2133 of 2138) PASS: lldb-api :: functionalities/data-formatter/data-formatter-proper-plurals/TestFormattersOneIsSingular.py (2134 of 2138) PASS: lldb-unit :: Language/Highlighting/./HighlighterTests/HighlighterTest.ClangUnterminatedString (2135 of 2138) PASS: lldb-api :: lang/cpp/namespace/TestNamespaceLookup.py (2136 of 2138) PASS: lldb-api :: functionalities/target_var/no_vars/TestTargetVarNoVars.py (2137 of 2138) Cancelling nested steps due to timeout Sending interrupt signal to process ninja: build stopped: interrupted by user. script returned exit code 143 [Pipeline] } [Pipeline] // timeout [Pipeline] } [Pipeline] // stage [Pipeline] stage [Pipeline] { (Declarative: Post Actions) [Pipeline] scanForIssues [Clang (LLVM based)] Sleeping for 5 seconds due to JENKINS-32191... [Clang (LLVM based)] Parsing console log (workspace: '/Users/buildslave/jenkins/workspace/lldb-cmake-sanitized') [Clang (LLVM based)] Successfully parsed console log [Clang (LLVM based)] -> found 1 issue (skipped 0 duplicates) [Clang (LLVM based)] Post processing issues on 'green-dragon-23' with source code encoding 'UTF-8' [Clang (LLVM based)] Creating SCM blamer to obtain author and commit information for affected files [Clang (LLVM based)] Creating SCM miner to obtain statistics for affected repository files [Clang (LLVM based)] Resolving file names for all issues in source directory '/Users/buildslave/jenkins/workspace/lldb-cmake-sanitized' [Clang (LLVM based)] -> resolved paths in source directory (1 found, 0 not found) [Clang (LLVM based)] Resolving module names from module definitions (build.xml, pom.xml, or Manifest.mf files) [Clang (LLVM based)] -> resolved module names for 1 issues [Clang (LLVM based)] Resolving package names (or namespaces) by parsing the affected files [Clang (LLVM based)] -> resolved package names of 1 affected files [Clang (LLVM based)] No filter has been set, publishing all 1 issues [Clang (LLVM based)] Creating fingerprints for all affected code blocks to track issues over different builds [Clang (LLVM based)] -> created fingerprints for 1 issues (skipped 0 issues) [Clang (LLVM based)] Copying affected files to Jenkins' build folder '/Users/Shared/Jenkins/Home/jobs/lldb-cmake-sanitized/builds/1809/files-with-issues' [Clang (LLVM based)] -> 1 copied, 0 not in workspace, 0 not-found, 0 with I/O error [Pipeline] junit Recording test results No test report files were found. Configuration error? Error when executing always post condition: Also: hudson.remoting.Channel$CallSiteStackTrace: Remote call to green-dragon-23 at hudson.remoting.Channel.attachCallSiteStackTrace(Channel.java:1788) at hudson.remoting.UserRequest$ExceptionResponse.retrieve(UserRequest.java:356) at hudson.remoting.Channel.call(Channel.java:998) at hudson.FilePath.act(FilePath.java:1069) at hudson.FilePath.act(FilePath.java:1058) at hudson.tasks.junit.JUnitParser.parseResult(JUnitParser.java:114) at hudson.tasks.junit.JUnitResultArchiver.parse(JUnitResultArchiver.java:137) at hudson.tasks.junit.JUnitResultArchiver.parseAndAttach(JUnitResultArchiver.java:167) at hudson.tasks.junit.pipeline.JUnitResultsStepExecution.run(JUnitResultsStepExecution.java:52) at hudson.tasks.junit.pipeline.JUnitResultsStepExecution.run(JUnitResultsStepExecution.java:25) at org.jenkinsci.plugins.workflow.steps.SynchronousNonBlockingStepExecution.lambda$start$0(SynchronousNonBlockingStepExecution.java:47) at java.util.concurrent.Executors$RunnableAdapter.call(Executors.java:511) hudson.AbortException: No test report files were found. Configuration error? at hudson.tasks.junit.JUnitParser$ParseResultCallable.invoke(JUnitParser.java:154) at hudson.tasks.junit.JUnitParser$ParseResultCallable.invoke(JUnitParser.java:118) at hudson.FilePath$FileCallableWrapper.call(FilePath.java:3073) at hudson.remoting.UserRequest.perform(UserRequest.java:211) at hudson.remoting.UserRequest.perform(UserRequest.java:54) at hudson.remoting.Request$2.run(Request.java:369) at hudson.remoting.InterceptingExecutorService$1.call(InterceptingExecutorService.java:72) at java.util.concurrent.FutureTask.run(FutureTask.java:266) at java.util.concurrent.ThreadPoolExecutor.runWorker(ThreadPoolExecutor.java:1149) at java.util.concurrent.ThreadPoolExecutor$Worker.run(ThreadPoolExecutor.java:624) at java.lang.Thread.run(Thread.java:748)

Hide Details

[Pipeline] } [Pipeline] // stage [Pipeline] } [Pipeline] // withEnv [Pipeline] } [Pipeline] // node [Pipeline] End of Pipeline Timeout has been exceeded Finished: ABORTED