FailedConsole Output

Skipping 3,595 KB.. Full Log
PASS: lldb-api :: functionalities/jitloader_gdb/TestJITLoaderGDB.py (545 of 1935)
PASS: lldb-unit :: Utility/./UtilityTests/Flags.Reset (546 of 1935)
PASS: lldb-unit :: Utility/./UtilityTests/StringListTest.Assignment (547 of 1935)
PASS: lldb-unit :: Utility/./UtilityTests/StreamTeeTest.Flush (548 of 1935)
PASS: lldb-api :: commands/expression/import-std-module/forward_list/TestForwardListFromStdModule.py (549 of 1935)
PASS: lldb-unit :: UnwindAssembly/x86/./UnwindAssemblyx86Tests/Testx86AssemblyInspectionEngine.TestPush0 (550 of 1935)
PASS: lldb-unit :: ObjectFile/Breakpad/./ObjectFileBreakpadTests/FileRecord.parse (551 of 1935)
PASS: lldb-api :: python_api/signals/TestSignalsAPI.py (552 of 1935)
PASS: lldb-unit :: debugserver/./debugserverTests/RNBSocket.LoopBackListenIPv4 (553 of 1935)
PASS: lldb-shell :: ObjectFile/ELF/base-address.yaml (554 of 1935)
PASS: lldb-shell :: SymbolFile/NativePDB/ast-functions.cpp (555 of 1935)
PASS: lldb-unit :: Host/./HostTests/MainLoopTest.DetectsEOF (556 of 1935)
PASS: lldb-api :: commands/expression/namespace_local_var_same_name_cpp_and_c/TestNamespaceLocalVarSameNameCppAndC.py (557 of 1935)
PASS: lldb-unit :: Utility/./UtilityTests/ScalarTest.Division (558 of 1935)
PASS: lldb-api :: tools/lldb-vscode/breakpoint/TestVSCode_setFunctionBreakpoints.py (559 of 1935)
PASS: lldb-api :: functionalities/tail_call_frames/sbapi_support/TestTailCallFrameSBAPI.py (560 of 1935)
PASS: lldb-unit :: Utility/./UtilityTests/GeneratorTest.Create (561 of 1935)
PASS: lldb-api :: lang/c/register_variables/TestRegisterVariables.py (562 of 1935)
PASS: lldb-api :: python_api/function_symbol/TestDisasmAPI.py (563 of 1935)
PASS: lldb-api :: commands/frame/var/TestFrameVar.py (564 of 1935)
PASS: lldb-api :: commands/command/script_alias/TestCommandScriptAlias.py (565 of 1935)
PASS: lldb-unit :: Utility/./UtilityTests/DataExtractorTest.GetCStrEmpty (566 of 1935)
PASS: lldb-api :: functionalities/gdb_remote_client/TestTargetXMLArch.py (567 of 1935)
PASS: lldb-unit :: Utility/./UtilityTests/RangeDataVector.FindEntryThatContains (568 of 1935)
PASS: lldb-api :: functionalities/backticks/TestBackticksWithoutATarget.py (569 of 1935)
PASS: lldb-api :: tools/lldb-server/TestGdbRemoteExitCode.py (570 of 1935)
PASS: lldb-unit :: Process/minidump/./LLDBMinidumpTests/RegisterContextMinidump.ConvertMinidumpContext_x86_64 (571 of 1935)
PASS: lldb-unit :: Utility/./UtilityTests/StringListTest.InsertStringAtIndexOutOfBounds (572 of 1935)
PASS: lldb-api :: lang/objc/exceptions/TestObjCExceptions.py (573 of 1935)
PASS: lldb-unit :: Utility/./UtilityTests/ScalarTest.ComparisonFloat (574 of 1935)
PASS: lldb-shell :: Settings/TestEchoCommands.test (575 of 1935)
PASS: lldb-unit :: UnwindAssembly/x86/./UnwindAssemblyx86Tests/Testx86AssemblyInspectionEngine.Testi386IgnoredRegisters (576 of 1935)
PASS: lldb-api :: commands/watchpoints/step_over_watchpoint/TestStepOverWatchpoint.py (577 of 1935)
XFAIL: lldb-shell :: SymbolFile/DWARF/find-type-in-function.cpp (578 of 1935)
PASS: lldb-unit :: Utility/./UtilityTests/StreamTest.PutBytesAsRawHex8ToBigEndian (579 of 1935)
PASS: lldb-api :: lang/objc/modules-app-update/TestClangModulesAppUpdate.py (580 of 1935)
PASS: lldb-unit :: ObjectFile/ELF/./ObjectFileELFTests/ObjectFileELFTest.GetModuleSpecifications_EarlySectionHeaders (581 of 1935)
UNSUPPORTED: lldb-shell :: ScriptInterpreter/Lua/persistent_state.test (582 of 1935)
PASS: lldb-unit :: Host/./HostTests/NativeProcessProtocolTest.SetBreakpointFailVerify (583 of 1935)
PASS: lldb-api :: lang/cpp/bool/TestCPPBool.py (584 of 1935)
UNSUPPORTED: lldb-api :: functionalities/breakpoint/breakpoint_in_delayslot/TestAvoidBreakpointInDelaySlot.py (585 of 1935)
PASS: lldb-api :: lang/objc/objc++/TestObjCXX.py (586 of 1935)
PASS: lldb-unit :: UnwindAssembly/x86/./UnwindAssemblyx86Tests/Testx86AssemblyInspectionEngine.TestCALLNextInsn (587 of 1935)
PASS: lldb-unit :: Utility/./UtilityTests/StreamTest.PutHex16ByteOrderLittle (588 of 1935)
PASS: lldb-unit :: ScriptInterpreter/Python/./ScriptInterpreterPythonTests/PythonDataObjectsTest.TestPythonListValueEquality (589 of 1935)
UNSUPPORTED: lldb-api :: functionalities/darwin_log/source/info/TestDarwinLogSourceInfo.py (590 of 1935)
PASS: lldb-unit :: Utility/./UtilityTests/ArgsTest.TestUnknownEscape (591 of 1935)
UNSUPPORTED: lldb-api :: functionalities/thread/create_during_step/TestCreateDuringStep.py (592 of 1935)
PASS: lldb-unit :: Symbol/./SymbolTests/TestClangASTImporter.ImportInvalidType (593 of 1935)
PASS: lldb-shell :: BuildScript/toolchain-clang.test (594 of 1935)
UNSUPPORTED: lldb-shell :: ScriptInterpreter/Lua/bindings.test (595 of 1935)
PASS: lldb-api :: commands/command/nested_alias/TestNestedAlias.py (596 of 1935)
PASS: lldb-api :: lang/objc/rdar-10967107/TestRdar10967107.py (597 of 1935)
PASS: lldb-unit :: Utility/./UtilityTests/ArgsTest.TestTrailingBackslash (598 of 1935)
PASS: lldb-shell :: ObjectFile/Breakpad/sections-trailing-func.test (599 of 1935)
PASS: lldb-shell :: Register/x86-64-ymm-read.test (600 of 1935)
PASS: lldb-shell :: ObjectFile/ELF/section-types.yaml (601 of 1935)
PASS: lldb-unit :: Expression/./ExpressionTests/DiagnosticManagerTest.GetStringPreserveOrder (602 of 1935)
PASS: lldb-api :: commands/expression/import-std-module/deque-dbg-info-content/TestDbgInfoContentDequeFromStdModule.py (603 of 1935)
PASS: lldb-unit :: Process/gdb-remote/./ProcessGdbRemoteTests/GDBRemoteCommunicationClientTest.GetModulesInfo_UUID20 (604 of 1935)
PASS: lldb-shell :: SymbolFile/DWARF/find-qualified-variable.cpp (605 of 1935)
PASS: lldb-api :: lang/objc/objc-new-syntax/TestObjCNewSyntaxDictionary.py (606 of 1935)
PASS: lldb-api :: functionalities/thread/concurrent_events/TestConcurrentSignalNWatchNBreak.py (607 of 1935)
PASS: lldb-unit :: Core/./LLDBCoreTests/MangledTest.NameIndexes_FindFunctionSymbols (608 of 1935)
PASS: lldb-unit :: Utility/./UtilityTests/StringListTest.JoinThree (609 of 1935)
PASS: lldb-unit :: Expression/./ExpressionTests/DWARFExpression.DW_OP_pick (610 of 1935)
PASS: lldb-api :: functionalities/data-formatter/data-formatter-objc/TestDataFormatterObjCNSError.py (611 of 1935)
PASS: lldb-unit :: Expression/./ExpressionTests/DiagnosticManagerTest.GetStringMultiline (612 of 1935)
PASS: lldb-unit :: Utility/./UtilityTests/StringExtractorTest.GetHexBytesAvail_OddPair (613 of 1935)
PASS: lldb-unit :: SymbolFile/NativePDB/./SymbolFileNativePDBTests/PDBFPOProgramToDWARFExpressionTests.InvalidOpUnary (614 of 1935)
PASS: lldb-unit :: Utility/./UtilityTests/StringExtractorTest.DecodeHexU8_Underflow2 (615 of 1935)
PASS: lldb-unit :: Utility/./UtilityTests/DataExtractorTest.GetMaxS64 (616 of 1935)
PASS: lldb-shell :: ObjectFile/ELF/netbsd-core-amd64.test (617 of 1935)
PASS: lldb-api :: functionalities/multidebugger_commands/TestMultipleDebuggersCommands.py (618 of 1935)
PASS: lldb-unit :: Expression/./ExpressionTests/DWARFExpression.DW_OP_piece (619 of 1935)
PASS: lldb-api :: functionalities/target-new-solib-notifications/TestModuleLoadedNotifys.py (620 of 1935)
PASS: lldb-api :: lang/cpp/stl/TestSTL.py (621 of 1935)
PASS: lldb-shell :: SymbolFile/NativePDB/global-classes.cpp (622 of 1935)
PASS: lldb-api :: functionalities/data-formatter/varscript_formatting/TestDataFormatterVarScriptFormatting.py (623 of 1935)
PASS: lldb-unit :: Target/./TargetTests/ModuleCacheTest.GetAndPutStrangeHostname (624 of 1935)
PASS: lldb-shell :: SymbolFile/DWARF/find-method-local-struct.cpp (625 of 1935)
UNSUPPORTED: lldb-api :: functionalities/data-formatter/data-formatter-stl/libstdcpp/map/TestDataFormatterStdMap.py (626 of 1935)
PASS: lldb-api :: python_api/sbvalue_const_addrof/TestSBValueConstAddrOf.py (627 of 1935)
PASS: lldb-api :: lang/objc/foundation/TestObjCMethods.py (628 of 1935)
PASS: lldb-unit :: Utility/./UtilityTests/LogTest.Unregister (629 of 1935)
PASS: lldb-api :: python_api/process/io/TestProcessIO.py (630 of 1935)
PASS: lldb-api :: functionalities/memory/cache/TestMemoryCache.py (631 of 1935)
PASS: lldb-shell :: ObjectFile/PECOFF/basic-info-arm64.yaml (632 of 1935)
PASS: lldb-unit :: Utility/./UtilityTests/DataExtractorTest.GetCStr (633 of 1935)
UNSUPPORTED: lldb-api :: functionalities/darwin_log/basic/TestDarwinLogBasic.py (634 of 1935)
PASS: lldb-api :: tools/lldb-vscode/step/TestVSCode_step.py (635 of 1935)
UNSUPPORTED: lldb-api :: linux/thread/create_during_instruction_step/TestCreateDuringInstructionStep.py (636 of 1935)
PASS: lldb-unit :: Host/./HostTests/NativeProcessProtocolTest.SetBreakpointFailWrite (637 of 1935)
PASS: lldb-api :: lang/cpp/wchar_t/TestCxxWCharT.py (638 of 1935)
PASS: lldb-api :: lang/c/struct_types/TestStructTypes.py (639 of 1935)
PASS: lldb-unit :: Process/minidump/./LLDBMinidumpTests/MinidumpParserTest.FindMemoryRangeWithFullMemoryMinidump (640 of 1935)
PASS: lldb-unit :: Utility/./UtilityTests/StatusTest.ErrorConstructor (641 of 1935)
PASS: lldb-api :: functionalities/testid/TestTestId.py (642 of 1935)
PASS: lldb-unit :: Utility/./UtilityTests/Flags.Test (643 of 1935)
PASS: lldb-api :: api/command-return-object/TestSBCommandReturnObject.py (644 of 1935)
PASS: lldb-api :: functionalities/data-formatter/data-formatter-synthval/TestDataFormatterSynthVal.py (645 of 1935)
PASS: lldb-unit :: Utility/./UtilityTests/StreamTest.PutRawBytesToMixedEndian (646 of 1935)
UNSUPPORTED: lldb-shell :: Register/x86-64-xmm16-write.test (647 of 1935)
PASS: lldb-unit :: ScriptInterpreter/Python/./ScriptInterpreterPythonTests/PythonDataObjectsTest.TestPythonListToStructuredList (648 of 1935)
PASS: lldb-shell :: SymbolFile/DWARF/debug_loc_and_loclists.s (649 of 1935)
PASS: lldb-unit :: ScriptInterpreter/Python/./ScriptInterpreterPythonTests/PythonDataObjectsTest.TestPythonTupleToStructuredList (650 of 1935)
PASS: lldb-shell :: Minidump/memory-region-from-module.yaml (651 of 1935)
PASS: lldb-api :: functionalities/data-formatter/data-formatter-stl/libcxx/optional/TestDataFormatterLibcxxOptional.py (652 of 1935)
PASS: lldb-shell :: Breakpoint/debug_rnglist_rlestartend.test (653 of 1935)
PASS: lldb-api :: tools/lldb-server/TestGdbRemoteSingleStep.py (654 of 1935)
PASS: lldb-unit :: Utility/./UtilityTests/CompletionRequest.TryCompleteCurrentArgMode (655 of 1935)
PASS: lldb-api :: arm/emulation/TestEmulations.py (656 of 1935)
PASS: lldb-unit :: UnwindAssembly/x86/./UnwindAssemblyx86Tests/Testx86AssemblyInspectionEngine.TestPushR15 (657 of 1935)
PASS: lldb-api :: functionalities/data-formatter/data-formatter-python-synth/TestDataFormatterPythonSynth.py (658 of 1935)
PASS: lldb-unit :: Expression/./ExpressionTests/DWARFExpression.DW_OP_convert (659 of 1935)
PASS: lldb-unit :: Utility/./UtilityTests/StreamTest.PutCString (660 of 1935)
PASS: lldb-unit :: ObjectFile/Breakpad/./ObjectFileBreakpadTests/StackCFIRecord.parse (661 of 1935)
PASS: lldb-api :: functionalities/data-formatter/format-propagation/TestFormatPropagation.py (662 of 1935)
UNSUPPORTED: lldb-shell :: Expr/TestIRMemoryMapWindows.test (663 of 1935)
PASS: lldb-unit :: Utility/./UtilityTests/UriParserTest.SchemeHostSeparator4 (664 of 1935)
PASS: lldb-shell :: Driver/TestRepl.test (665 of 1935)
PASS: lldb-unit :: Utility/./UtilityTests/VASprintfTest.NoBufferResize (666 of 1935)
PASS: lldb-shell :: SymbolFile/DWARF/dwarf5-index-is-used.cpp (667 of 1935)
PASS: lldb-unit :: ScriptInterpreter/Python/./ScriptInterpreterPythonTests/PythonDataObjectsTest.TestPythonBoolean (668 of 1935)
PASS: lldb-api :: commands/version/TestVersion.py (669 of 1935)
PASS: lldb-unit :: Target/./TargetTests/ModuleCacheTest.GetAndPutUuidExists (670 of 1935)
PASS: lldb-unit :: Utility/./UtilityTests/StringListTest.JoinEmpty (671 of 1935)
PASS: lldb-api :: commands/expression/import-std-module/list-dbg-info-content/TestDbgInfoContentListFromStdModule.py (672 of 1935)
PASS: lldb-unit :: Utility/./UtilityTests/StringExtractorTest.DecodeHexU8_Exact (673 of 1935)
UNSUPPORTED: lldb-api :: functionalities/darwin_log/source/debug/TestDarwinLogSourceDebug.py (674 of 1935)
PASS: lldb-unit :: Symbol/./SymbolTests/TestClangASTImporter.DeportDeclTagDecl (675 of 1935)
PASS: lldb-shell :: SymbolFile/DWARF/inline-function-address.ll (676 of 1935)
UNSUPPORTED: lldb-shell :: ScriptInterpreter/Lua/watchpoint_callback.test (677 of 1935)
PASS: lldb-unit :: debugserver/./debugserverTests/RNBSocket.LoopBackListenIPv6 (678 of 1935)
PASS: lldb-api :: lang/objc/radar-9691614/TestObjCMethodReturningBOOL.py (679 of 1935)
PASS: lldb-api :: lang/c/const_variables/TestConstVariables.py (680 of 1935)
PASS: lldb-unit :: SymbolFile/NativePDB/./SymbolFileNativePDBTests/PDBFPOProgramToDWARFExpressionTests.InvalidAssignmentMultiple (681 of 1935)
PASS: lldb-api :: functionalities/thread/concurrent_events/TestConcurrentTwoBreakpointsOneDelaySignal.py (682 of 1935)
PASS: lldb-unit :: UnwindAssembly/x86/./UnwindAssemblyx86Tests/Testx86AssemblyInspectionEngine.Test32BitOnlyInstruction (683 of 1935)
PASS: lldb-api :: commands/expression/rdar42038760/TestScalarURem.py (684 of 1935)
PASS: lldb-unit :: Host/./HostTests/ConnectionFileDescriptorTest.TCPGetURIv6 (685 of 1935)
PASS: lldb-shell :: SymbolFile/NativePDB/ast-methods.cpp (686 of 1935)
PASS: lldb-api :: lang/c/inlines/TestRedefinitionsInInlines.py (687 of 1935)
PASS: lldb-unit :: Interpreter/./InterpreterTests/CompletionTest.DirCompletionUsername (688 of 1935)
PASS: lldb-unit :: Process/gdb-remote/./ProcessGdbRemoteTests/GDBRemoteCommunicationClientTest.ReadRegister (689 of 1935)
PASS: lldb-unit :: Utility/./UtilityTests/VMRange.Ordering (690 of 1935)
PASS: lldb-unit :: ObjectFile/ELF/./ObjectFileELFTests/ObjectFileELFTest.GetSymtab_NoSymEntryPointArmAddressClass (691 of 1935)
PASS: lldb-shell :: SymbolFile/DWARF/debug-types-dwarf5.s (692 of 1935)
PASS: lldb-api :: functionalities/data-formatter/typedef_array/TestTypedefArray.py (693 of 1935)
PASS: lldb-unit :: ObjectFile/Breakpad/./ObjectFileBreakpadTests/Record.classify (694 of 1935)
PASS: lldb-api :: lang/cpp/operator-overload/TestOperatorOverload.py (695 of 1935)
PASS: lldb-api :: functionalities/tail_call_frames/ambiguous_tail_call_seq2/TestAmbiguousTailCallSeq2.py (696 of 1935)
PASS: lldb-shell :: Minidump/fb-dump.test (697 of 1935)
PASS: lldb-shell :: SymbolFile/DWARF/dwarf5-atomic.s (698 of 1935)
PASS: lldb-unit :: Utility/./UtilityTests/TimerTest.CategoryTimes2 (699 of 1935)
PASS: lldb-shell :: SymbolFile/DWARF/deterministic-build.cpp (700 of 1935)
PASS: lldb-unit :: UnwindAssembly/x86/./UnwindAssemblyx86Tests/Testx86AssemblyInspectionEngine.TestDisassemblyJunkBytes (701 of 1935)
PASS: lldb-api :: functionalities/return-value/TestReturnValue.py (702 of 1935)
PASS: lldb-unit :: SymbolFile/NativePDB/./SymbolFileNativePDBTests/PDBFPOProgramToDWARFExpressionTests.SingleAssignmentRegisterRef (703 of 1935)
PASS: lldb-unit :: Utility/./UtilityTests/SerializationRountripTest.SerializeDeserializeCStringArrayNullptr (704 of 1935)
PASS: lldb-unit :: Utility/./UtilityTests/StringListTest.DefaultConstructor (705 of 1935)
PASS: lldb-unit :: SymbolFile/NativePDB/./SymbolFileNativePDBTests/PDBFPOProgramToDWARFExpressionTests.UnresolvedCyclicRegisterAssignmentReference (706 of 1935)
UNSUPPORTED: lldb-api :: functionalities/tsan/cpp_global_location/TestTsanCPPGlobalLocation.py (707 of 1935)
PASS: lldb-unit :: Utility/./UtilityTests/SerializationRountripTest.SerializeDeserializePod (708 of 1935)
PASS: lldb-api :: macosx/order/TestOrderFile.py (709 of 1935)
PASS: lldb-unit :: Expression/./ExpressionTests/CppModuleConfigurationTest.LinuxLocalLibCpp (710 of 1935)
PASS: lldb-unit :: Host/./HostTests/TaskPoolTest.AddTask (711 of 1935)
PASS: lldb-unit :: Utility/./UtilityTests/TimerTest.CategoryTimesNested (712 of 1935)
PASS: lldb-unit :: Utility/./UtilityTests/VASprintfTest.EncodingError (713 of 1935)
PASS: lldb-unit :: ScriptInterpreter/Python/./ScriptInterpreterPythonTests/PythonDataObjectsTest.TestPythonTupleSize (714 of 1935)
PASS: lldb-unit :: Process/minidump/./LLDBMinidumpTests/RegisterContextMinidump.ConvertMinidumpContext_x86_32 (715 of 1935)
PASS: lldb-api :: lang/cpp/gmodules-templates/TestGModules.py (716 of 1935)
PASS: lldb-api :: lang/objc/objc-ivar-offsets/TestObjCIvarOffsets.py (717 of 1935)
PASS: lldb-api :: lang/cpp/class_types/TestClassTypesDisassembly.py (718 of 1935)
PASS: lldb-api :: lang/c/modules/TestCModules.py (719 of 1935)
PASS: lldb-unit :: Utility/./UtilityTests/StreamTest.PutHex64ByteOrderLittle (720 of 1935)
PASS: lldb-unit :: Utility/./UtilityTests/AnsiTerminal.Basic (721 of 1935)
PASS: lldb-shell :: SymbolFile/DWARF/dir-separator-no-comp-dir.s (722 of 1935)
PASS: lldb-shell :: Reproducer/TestGDBRemoteRepro.test (723 of 1935)
PASS: lldb-shell :: SymbolFile/Breakpad/line-table-discontinuous-file-ids.test (724 of 1935)
PASS: lldb-unit :: Expression/./ExpressionTests/CppModuleConfigurationTest.AmbiguousCLib (725 of 1935)
PASS: lldb-unit :: Host/./HostTests/SocketTest.UDPGetConnectURI (726 of 1935)
PASS: lldb-unit :: Utility/./UtilityTests/StringListTest.CopyListEmpty (727 of 1935)
PASS: lldb-unit :: Utility/./UtilityTests/ArchSpecTest.Compatibility (728 of 1935)
PASS: lldb-unit :: Host/./HostTests/MainLoopTest.UnmonitoredSignal (729 of 1935)
PASS: lldb-unit :: Utility/./UtilityTests/StringListTest.GetMaxStringLengthIncreasingSize (730 of 1935)
PASS: lldb-unit :: ScriptInterpreter/Python/./ScriptInterpreterPythonTests/PythonDataObjectsTest.TestPythonInteger (731 of 1935)
PASS: lldb-unit :: UnwindAssembly/x86/./UnwindAssemblyx86Tests/Testx86AssemblyInspectionEngine.TestPopRBPWithREX (732 of 1935)
PASS: lldb-unit :: tools/lldb-server/tests/./LLDBServerTests/TestBase.LaunchModePreservesEnvironment (733 of 1935)
PASS: lldb-unit :: Utility/./UtilityTests/StringListTest.ShiftCString (734 of 1935)
PASS: lldb-api :: functionalities/thread/concurrent_events/TestConcurrentCrashWithBreak.py (735 of 1935)
PASS: lldb-unit :: Language/CPlusPlus/./LanguageCPlusPlusTests/CPlusPlusLanguage.CPlusPlusNameParser (736 of 1935)
PASS: lldb-api :: python_api/module_section/TestModuleAndSection.py (737 of 1935)
PASS: lldb-api :: functionalities/thread/backtrace_all/TestBacktraceAll.py (738 of 1935)
PASS: lldb-api :: driver/batch_mode/TestBatchMode.py (739 of 1935)
PASS: lldb-api :: functionalities/data-formatter/data-formatter-stl/libcxx/forward_list/TestDataFormatterLibcxxForwardList.py (740 of 1935)
PASS: lldb-shell :: Driver/TestFile.test (741 of 1935)
PASS: lldb-unit :: Utility/./UtilityTests/NameMatchesTest.Contains (742 of 1935)
PASS: lldb-api :: functionalities/breakpoint/breakpoint_locations/TestBreakpointLocations.py (743 of 1935)
PASS: lldb-shell :: SymbolFile/DWARF/anon_class_w_and_wo_export_symbols.ll (744 of 1935)
PASS: lldb-unit :: Utility/./UtilityTests/StringListTest.Join (745 of 1935)
PASS: lldb-shell :: SymbolFile/NativePDB/function-types-classes.cpp (746 of 1935)
PASS: lldb-api :: lang/cpp/std-function-step-into-callable/TestStdFunctionStepIntoCallable.py (747 of 1935)
PASS: lldb-unit :: Process/gdb-remote/./ProcessGdbRemoteTests/GDBRemoteCommunicationClientTest.WriteRegister (748 of 1935)
PASS: lldb-api :: functionalities/data-formatter/data-formatter-stl/libcxx/map/TestDataFormatterLibccMap.py (749 of 1935)
PASS: lldb-unit :: Utility/./UtilityTests/UUIDTest.SetFromStringRef (750 of 1935)
PASS: lldb-unit :: ScriptInterpreter/Python/./ScriptInterpreterPythonTests/PythonDataObjectsTest.TestObjectAttributes (751 of 1935)
PASS: lldb-api :: functionalities/deleted-executable/TestDeletedExecutable.py (752 of 1935)
PASS: lldb-api :: functionalities/data-formatter/boolreference/TestFormattersBoolRefPtr.py (753 of 1935)
PASS: lldb-api :: python_api/lldbutil/iter/TestRegistersIterator.py (754 of 1935)
PASS: lldb-unit :: Process/minidump/./LLDBMinidumpTests/MinidumpParserTest.GetFilteredModuleList (755 of 1935)
PASS: lldb-unit :: Utility/./UtilityTests/RangeTest.SizeTypes (756 of 1935)
PASS: lldb-api :: commands/watchpoints/multiple_hits/TestMultipleHits.py (757 of 1935)
PASS: lldb-api :: commands/watchpoints/watchpoint_commands/command/TestWatchpointCommandLLDB.py (758 of 1935)
PASS: lldb-unit :: Expression/./ExpressionTests/CppModuleConfigurationTest.Linux (759 of 1935)
PASS: lldb-unit :: SymbolFile/DWARF/./SymbolFileDWARFTests/SymbolFileDWARFTests.TestAbbrevOrder1Start1 (760 of 1935)
PASS: lldb-shell :: SymbolFile/DWARF/debug_loc-aslr.s (761 of 1935)
PASS: lldb-api :: functionalities/gdb_remote_client/TestRestartBug.py (762 of 1935)
PASS: lldb-unit :: Utility/./UtilityTests/ArgsTest.StringListConstructor (763 of 1935)
PASS: lldb-unit :: Utility/./UtilityTests/UriParserTest.Empty (764 of 1935)
PASS: lldb-unit :: ScriptInterpreter/Python/./ScriptInterpreterPythonTests/PythonDataObjectsTest.TestPythonCallableInvoke (765 of 1935)
PASS: lldb-unit :: Utility/./UtilityTests/RangeTest.ContainsAddrInvalid (766 of 1935)
PASS: lldb-unit :: Signals/./SignalsTests/UnixSignalsTest.GetFilteredSignals (767 of 1935)
PASS: lldb-api :: python_api/exprpath_synthetic/TestExprPathSynthetic.py (768 of 1935)
PASS: lldb-shell :: SymbolFile/NativePDB/disassembly.cpp (769 of 1935)
UNSUPPORTED: lldb-shell :: SymbolFile/PDB/function-level-linking.test (770 of 1935)
PASS: lldb-api :: lang/objc/orderedset/TestOrderedSet.py (771 of 1935)
PASS: lldb-api :: lang/objc/modules-auto-import/TestModulesAutoImport.py (772 of 1935)
PASS: lldb-unit :: Expression/./ExpressionTests/DiagnosticManagerTest.AppendMessageAttachToLastDiag (773 of 1935)
PASS: lldb-api :: commands/platform/basic/TestPlatformCommand.py (774 of 1935)
PASS: lldb-api :: commands/expression/test/TestExprs2.py (775 of 1935)
PASS: lldb-unit :: Target/./TargetTests/ExecutionContextTest.GetByteOrder (776 of 1935)
UNSUPPORTED: lldb-api :: linux/sepdebugsymlink/TestTargetSymbolsSepDebugSymlink.py (777 of 1935)
PASS: lldb-api :: lang/c/set_values/TestSetValues.py (778 of 1935)
PASS: lldb-unit :: ObjectFile/Breakpad/./ObjectFileBreakpadTests/ModuleRecord.parse (779 of 1935)
PASS: lldb-api :: commands/frame/diagnose/local-variable/TestLocalVariable.py (780 of 1935)
PASS: lldb-api :: lang/cpp/nested-class-other-compilation-unit/TestNestedClassWithParentInAnotherCU.py (781 of 1935)
PASS: lldb-unit :: Symbol/./SymbolTests/TestTypeSystemClang.TestGetEnumIntegerTypeBasicTypes (782 of 1935)
PASS: lldb-api :: commands/expression/import-std-module/conflicts/TestStdModuleWithConflicts.py (783 of 1935)
UNSUPPORTED: lldb-shell :: Register/x86-64-zmm-write.test (784 of 1935)
UNSUPPORTED: lldb-shell :: SymbolFile/PDB/compilands.test (785 of 1935)
PASS: lldb-unit :: Utility/./UtilityTests/RangeTest.Slide (786 of 1935)
PASS: lldb-api :: python_api/default-constructor/TestDefaultConstructorForAPIObjects.py (787 of 1935)
PASS: lldb-api :: functionalities/breakpoint/breakpoint_hit_count/TestBreakpointHitCount.py (788 of 1935)
UNSUPPORTED: lldb-api :: functionalities/data-formatter/data-formatter-stl/libstdcpp/tuple/TestDataFormatterStdTuple.py (789 of 1935)
PASS: lldb-api :: commands/command/source/TestCommandSource.py (790 of 1935)
PASS: lldb-api :: tools/lldb-server/TestGdbRemoteRegisterState.py (791 of 1935)
UNSUPPORTED: lldb-api :: functionalities/process_save_core/TestProcessSaveCore.py (792 of 1935)
PASS: lldb-unit :: Utility/./UtilityTests/ReproducerTest.SetCapture (793 of 1935)
PASS: lldb-unit :: Process/gdb-remote/./ProcessGdbRemoteTests/GDBRemoteCommunicationServerTest.SendErrorResponse_UnimplementedError (794 of 1935)
PASS: lldb-shell :: Reproducer/TestDriverOptions.test (795 of 1935)
PASS: lldb-unit :: Target/./TargetTests/ExecutionContextTest.GetByteOrderProcess (796 of 1935)
PASS: lldb-api :: lang/cpp/class-template-parameter-pack/TestClassTemplateParameterPack.py (797 of 1935)
PASS: lldb-api :: commands/watchpoints/watchpoint_commands/command/TestWatchpointCommandPython.py (798 of 1935)
PASS: lldb-unit :: Utility/./UtilityTests/RegularExpression.Invalid (799 of 1935)
PASS: lldb-api :: commands/expression/codegen-crash-typedefdecl-not-in_declcontext/TestCodegenCrashTypedefDeclNotInDeclContext.py (800 of 1935)
PASS: lldb-unit :: Utility/./UtilityTests/UriParserTest.BadPort (801 of 1935)
UNSUPPORTED: lldb-shell :: SymbolFile/target-symbols-add-unwind.test (802 of 1935)
PASS: lldb-unit :: Utility/./UtilityTests/StringExtractorTest.DecodeHexU8_InvalidHex2 (803 of 1935)
PASS: lldb-unit :: Utility/./UtilityTests/BinaryStreamTest.PutSLEB128EightBytes (804 of 1935)
PASS: lldb-unit :: Utility/./UtilityTests/OptionsWithRawTest.SingleWhitespaceInput (805 of 1935)
PASS: lldb-api :: lang/cpp/exceptions/TestCPPExceptionBreakpoints.py (806 of 1935)
PASS: lldb-api :: lang/cpp/dynamic-value/TestDynamicValue.py (807 of 1935)
PASS: lldb-shell :: Quit/TestQuitExitCode30.test (808 of 1935)
PASS: lldb-shell :: SymbolFile/DWARF/dwp.s (809 of 1935)
PASS: lldb-unit :: Utility/./UtilityTests/StringListTest.JoinNonSpace (810 of 1935)
PASS: lldb-shell :: SymbolFile/DWARF/split-dwarf-multiple-cu.ll (811 of 1935)
UNSUPPORTED: lldb-shell :: Register/x86-64-xmm16-read.test (812 of 1935)
PASS: lldb-unit :: Process/gdb-remote/./ProcessGdbRemoteTests/GDBRemoteClientBaseTest.SendPacketAndReceiveResponseWithOutputSupport (813 of 1935)
PASS: lldb-shell :: SymbolFile/DWARF/debug-types-signature-loop.s (814 of 1935)
PASS: lldb-unit :: ScriptInterpreter/Python/./ScriptInterpreterPythonTests/PythonDataObjectsTest.TestPythonDictionaryToStructuredDictionary (815 of 1935)
PASS: lldb-api :: lang/cpp/class_static/TestStaticVariables.py (816 of 1935)
PASS: lldb-shell :: ObjectFile/ELF/PT_LOAD.yaml (817 of 1935)
PASS: lldb-shell :: Reproducer/Functionalities/TestExpressionEvaluation.test (818 of 1935)
PASS: lldb-unit :: Host/./HostTests/FileSystemTest.Exists (819 of 1935)
PASS: lldb-api :: lang/cpp/member-and-local-vars-with-same-name/TestMembersAndLocalsWithSameName.py (820 of 1935)
PASS: lldb-unit :: Language/Highlighting/./HighlighterTests/HighlighterTest.ClangCursorPosAfterOtherToken (821 of 1935)
PASS: lldb-unit :: Utility/./UtilityTests/UriParserTest.MinimalPath (822 of 1935)
PASS: lldb-shell :: Minidump/no-process-id.yaml (823 of 1935)
UNSUPPORTED: lldb-api :: functionalities/unwind/ehframe/TestEhFrameUnwind.py (824 of 1935)
PASS: lldb-unit :: Language/Highlighting/./HighlighterTests/HighlighterTest.DefaultHighlighterWithCursor (825 of 1935)
PASS: lldb-api :: commands/register/register/register_command/TestRegisters.py (826 of 1935)
PASS: lldb-unit :: Utility/./UtilityTests/FileSpecTest.CopyByAppendingPathComponent (827 of 1935)
PASS: lldb-api :: functionalities/data-formatter/array_typedef/TestArrayTypedef.py (828 of 1935)
PASS: lldb-shell :: Quit/TestQuitExitCode-30.test (829 of 1935)
PASS: lldb-api :: lang/cpp/chained-calls/TestCppChainedCalls.py (830 of 1935)
PASS: lldb-api :: functionalities/thread/concurrent_events/TestConcurrentSignalWatch.py (831 of 1935)
PASS: lldb-unit :: Language/Highlighting/./HighlighterTests/HighlighterTest.ClangTrailingBackslashMissingNewLine (832 of 1935)
PASS: lldb-unit :: UnwindAssembly/x86/./UnwindAssemblyx86Tests/Testx86AssemblyInspectionEngine.TestPushRBP (833 of 1935)
PASS: lldb-shell :: Process/TestEnvironment.test (834 of 1935)
PASS: lldb-unit :: Host/./HostTests/HostInfoTest.GetHostname (835 of 1935)
PASS: lldb-api :: macosx/find-dsym/deep-bundle/TestDeepBundle.py (836 of 1935)
PASS: lldb-shell :: SymbolFile/DWARF/debug_rnglists.s (837 of 1935)
PASS: lldb-api :: commands/expression/import-std-module/unique_ptr/TestUniquePtrFromStdModule.py (838 of 1935)
PASS: lldb-shell :: ObjectFile/PECOFF/sections-names.yaml (839 of 1935)
PASS: lldb-api :: commands/watchpoints/watchpoint_on_vectors/TestValueOfVectorVariable.py (840 of 1935)
PASS: lldb-api :: functionalities/signal/raise/TestRaise.py (841 of 1935)
PASS: lldb-api :: commands/expression/context-object-objc/TestContextObjectObjc.py (842 of 1935)
UNSUPPORTED: lldb-api :: functionalities/darwin_log/filter/exact_match/message/TestDarwinLogFilterMatchMessage.py (843 of 1935)
PASS: lldb-unit :: Utility/./UtilityTests/StringExtractorTest.GetHexU8_Underflow_NoEof (844 of 1935)
PASS: lldb-api :: commands/expression/import-std-module/vector-dbg-info-content/TestDbgInfoContentVectorFromStdModule.py (845 of 1935)
PASS: lldb-unit :: UnwindAssembly/x86/./UnwindAssemblyx86Tests/Testx86AssemblyInspectionEngine.TestPopEBP (846 of 1935)
PASS: lldb-unit :: ObjectFile/ELF/./ObjectFileELFTests/ObjectFileELFTest.GetSymtab_NoSymEntryPointArmThumbAddressClass (847 of 1935)
PASS: lldb-unit :: Utility/./UtilityTests/NameMatchesTest.StartsWith (848 of 1935)
PASS: lldb-unit :: Utility/./UtilityTests/BinaryStreamTest.PutULEB128OneByte (849 of 1935)
PASS: lldb-api :: commands/statistics/basic/TestStats.py (850 of 1935)
PASS: lldb-api :: commands/frame/select/TestFrameSelect.py (851 of 1935)
PASS: lldb-shell :: SymbolFile/DWARF/find-function-regex.cpp (852 of 1935)
PASS: lldb-unit :: Process/minidump/./LLDBMinidumpTests/MinidumpParserTest.GetThreadContext_x86_32 (853 of 1935)
PASS: lldb-api :: commands/help/TestHelp.py (854 of 1935)
PASS: lldb-unit :: Utility/./UtilityTests/Flags.AllClear (855 of 1935)
PASS: lldb-api :: lang/objc/foundation/TestObjCMethodsNSArray.py (856 of 1935)
PASS: lldb-unit :: Utility/./UtilityTests/ArgsTest.TestMultipleArgs (857 of 1935)
PASS: lldb-api :: functionalities/data-formatter/dump_dynamic/TestDumpDynamic.py (858 of 1935)
PASS: lldb-unit :: Utility/./UtilityTests/StreamTest.PutBytesAsRawHex8ToMixedEndian (859 of 1935)
PASS: lldb-shell :: Breakpoint/single-file-split-dwarf.test (860 of 1935)
PASS: lldb-unit :: ObjectFile/Breakpad/./ObjectFileBreakpadTests/FuncRecord.parse (861 of 1935)
PASS: lldb-api :: lang/objc/objc-class-method/TestObjCClassMethod.py (862 of 1935)
PASS: lldb-api :: functionalities/data-formatter/data-formatter-script/TestDataFormatterScript.py (863 of 1935)
PASS: lldb-unit :: Utility/./UtilityTests/StreamTest.SetIndentLevel (864 of 1935)
PASS: lldb-unit :: ScriptInterpreter/Python/./ScriptInterpreterPythonTests/PythonDataObjectsTest.TestPythonListManipulation (865 of 1935)
PASS: lldb-api :: lang/c/array_types/TestArrayTypes.py (866 of 1935)
PASS: lldb-unit :: Utility/./UtilityTests/ProcessInstanceInfo.Dump (867 of 1935)
PASS: lldb-unit :: Host/./HostTests/FileSystemTest.Readable (868 of 1935)
PASS: lldb-api :: types/TestFloatTypesExpr.py (869 of 1935)
PASS: lldb-api :: functionalities/plugins/command_plugin/TestPluginCommands.py (870 of 1935)
PASS: lldb-shell :: SymbolFile/DWARF/childless-compile-unit.s (871 of 1935)
UNSUPPORTED: lldb-api :: lang/cpp/static_members/TestCPPStaticMembers.py (872 of 1935)
PASS: lldb-unit :: Utility/./UtilityTests/SerializationRountripTest.SerializeDeserializePodReferences (873 of 1935)
UNSUPPORTED: lldb-shell :: BuildScript/toolchain-msvc.test (874 of 1935)
PASS: lldb-unit :: UnwindAssembly/x86/./UnwindAssemblyx86Tests/Testx86AssemblyInspectionEngine.TestSimplei386ugmented (875 of 1935)
PASS: lldb-unit :: Expression/./ExpressionTests/DiagnosticManagerTest.GetStringBasic (876 of 1935)
PASS: lldb-api :: functionalities/data-formatter/type_summary_list_arg/TestTypeSummaryListArg.py (877 of 1935)
PASS: lldb-unit :: Language/CPlusPlus/./LanguageCPlusPlusTests/CPlusPlusLanguage.MethodNameParsing (878 of 1935)
PASS: lldb-unit :: SymbolFile/NativePDB/./SymbolFileNativePDBTests/PDBFPOProgramToDWARFExpressionTests.UnsupportedRASearch (879 of 1935)
PASS: lldb-unit :: Utility/./UtilityTests/StringExtractorTest.GetHexU8_Underflow2 (880 of 1935)
PASS: lldb-shell :: ObjectFile/ELF/avr-basic-info.yaml (881 of 1935)
PASS: lldb-shell :: Expr/TestTypeOfDeclTypeExpr.test (882 of 1935)
PASS: lldb-api :: commands/command/invalid-args/TestInvalidArgsCommand.py (883 of 1935)
UNSUPPORTED: lldb-shell :: Register/x86-64-gp-write.test (884 of 1935)
UNSUPPORTED: lldb-api :: functionalities/data-formatter/data-formatter-stl/libstdcpp/string/TestDataFormatterStdString.py (885 of 1935)
PASS: lldb-api :: lang/cpp/enum_types/TestCPP11EnumTypes.py (886 of 1935)
PASS: lldb-api :: functionalities/data-formatter/data-formatter-proper-plurals/TestFormattersOneIsSingular.py (887 of 1935)
PASS: lldb-unit :: ScriptInterpreter/Python/./ScriptInterpreterPythonTests/PythonDataObjectsTest.TestPythonStringToStructuredString (888 of 1935)
PASS: lldb-unit :: Utility/./UtilityTests/VMRange.IsValid (889 of 1935)
PASS: lldb-api :: functionalities/breakpoint/breakpoint_conditions/TestBreakpointConditions.py (890 of 1935)
PASS: lldb-unit :: Utility/./UtilityTests/StreamTest.PutMaxHex64ByteOrderBig (891 of 1935)
PASS: lldb-unit :: Utility/./UtilityTests/StreamTest.ShiftOperatorChars (892 of 1935)
PASS: lldb-api :: functionalities/thread/concurrent_events/TestConcurrentTwoWatchpointsOneSignal.py (893 of 1935)
PASS: lldb-unit :: SymbolFile/NativePDB/./SymbolFileNativePDBTests/PDBFPOProgramToDWARFExpressionTests.MultipleIndependentAssignments (894 of 1935)
PASS: lldb-api :: lang/cpp/type_lookup/TestCppTypeLookup.py (895 of 1935)
UNSUPPORTED: lldb-shell :: SymbolFile/PDB/pointers.test (896 of 1935)
PASS: lldb-unit :: Language/Highlighting/./HighlighterTests/HighlighterTest.ClangSquareBrackets (897 of 1935)
PASS: lldb-api :: functionalities/inferior-crashing/TestInferiorCrashingStep.py (898 of 1935)
PASS: lldb-unit :: Symbol/./SymbolTests/TestClangASTImporter.MetadataPropagationIndirectImport (899 of 1935)
PASS: lldb-api :: python_api/value/TestValueAPI.py (900 of 1935)
UNSUPPORTED: lldb-shell :: Register/x86-ymm-write.test (901 of 1935)
PASS: lldb-unit :: Utility/./UtilityTests/ArgsTest.TestSingleArgWithQuotedSpace (902 of 1935)
PASS: lldb-unit :: Utility/./UtilityTests/StringListTest.AppendStringStdString (903 of 1935)
PASS: lldb-unit :: Utility/./UtilityTests/OptionsWithRawTest.TerminatedQuote (904 of 1935)
PASS: lldb-unit :: Host/./HostTests/FileActionTest.Open (905 of 1935)
PASS: lldb-api :: functionalities/data-formatter/data-formatter-stl/libcxx/set/TestDataFormatterLibcxxSet.py (906 of 1935)
PASS: lldb-api :: python_api/frame/get-variables/TestGetVariables.py (907 of 1935)
PASS: lldb-api :: functionalities/data-formatter/summary-string-onfail/Test-rdar-9974002.py (908 of 1935)
PASS: lldb-api :: lang/objcxx/objcxx-ivar-vector/TestIvarVector.py (909 of 1935)
PASS: lldb-unit :: Language/Highlighting/./HighlighterTests/HighlighterTest.ClangComments (910 of 1935)
PASS: lldb-api :: tools/lldb-server/TestGdbRemote_vCont.py (911 of 1935)
PASS: lldb-shell :: SymbolFile/NativePDB/source-list.cpp (912 of 1935)
PASS: lldb-api :: lang/cpp/unique-types/TestUniqueTypes.py (913 of 1935)
PASS: lldb-unit :: Utility/./UtilityTests/RecordReplayTest.InstrumentedFooSameThis (914 of 1935)
PASS: lldb-api :: functionalities/show_location/TestShowLocationDwarf5.py (915 of 1935)
PASS: lldb-unit :: Symbol/./SymbolTests/TestTypeSystemClang.TestGetTypeClassTypeOf (916 of 1935)
PASS: lldb-api :: functionalities/data-formatter/data-formatter-stl/libcxx/atomic/TestLibCxxAtomic.py (917 of 1935)
PASS: lldb-api :: functionalities/data-formatter/pyobjsynthprovider/TestPyObjSynthProvider.py (918 of 1935)
PASS: lldb-api :: commands/expression/import-std-module/weak_ptr-dbg-info-content/TestDbgInfoContentWeakPtrFromStdModule.py (919 of 1935)
PASS: lldb-api :: lang/objc/objc-dyn-sbtype/TestObjCDynamicSBType.py (920 of 1935)
UNSUPPORTED: lldb-api :: functionalities/darwin_log/filter/regex/activity/TestDarwinLogFilterRegexActivity.py (921 of 1935)
PASS: lldb-shell :: BuildScript/script-args.test (922 of 1935)
PASS: lldb-api :: functionalities/signal/handle-abrt/TestHandleAbort.py (923 of 1935)
PASS: lldb-api :: functionalities/data-formatter/setvaluefromcstring/TestSetValueFromCString.py (924 of 1935)
PASS: lldb-api :: lang/objc/unicode-string/TestUnicodeString.py (925 of 1935)
PASS: lldb-api :: commands/expression/context-object/TestContextObject.py (926 of 1935)
PASS: lldb-shell :: SymbolFile/NativePDB/s_constant.cpp (927 of 1935)
PASS: lldb-api :: python_api/get-value-32bit-int/TestGetValue32BitInt.py (928 of 1935)
PASS: lldb-unit :: Utility/./UtilityTests/StringLexerTest.Next (929 of 1935)
PASS: lldb-shell :: Settings/TestFrameFormatColor.test (930 of 1935)
PASS: lldb-api :: lang/cpp/limit-debug-info/TestWithLimitDebugInfo.py (931 of 1935)
PASS: lldb-shell :: Quit/TestQuitExitCodeHexA.test (932 of 1935)
XFAIL: lldb-shell :: Unwind/prefer-debug-over-eh-frame.test (933 of 1935)
UNSUPPORTED: lldb-shell :: SymbolFile/NativePDB/ast-functions-msvc.cpp (934 of 1935)
UNSUPPORTED: lldb-api :: functionalities/param_entry_vals/basic_entry_values_x86_64/TestBasicEntryValuesX86_64.py (935 of 1935)
PASS: lldb-api :: commands/expression/rdar44436068/Test128BitsInteger.py (936 of 1935)
PASS: lldb-unit :: Host/./HostTests/FileSystemTest.EnumerateDirectory (937 of 1935)
PASS: lldb-unit :: Utility/./UtilityTests/ConstStringTest.MangledCounterpart (938 of 1935)
PASS: lldb-shell :: SymbolFile/DWARF/parallel-indexing-stress.s (939 of 1935)
PASS: lldb-unit :: Utility/./UtilityTests/RangeTest.NotEqualInvalid (940 of 1935)
PASS: lldb-api :: types/TestIntegerType.py (941 of 1935)
PASS: lldb-shell :: SymbolFile/NativePDB/nested-types.cpp (942 of 1935)
UNSUPPORTED: lldb-api :: arm/breakpoint-it/TestBreakpointIt.py (943 of 1935)
PASS: lldb-shell :: Settings/TestDisassemblyFormat.test (944 of 1935)
PASS: lldb-api :: lang/objc/single-entry-dictionary/TestObjCSingleEntryDictionary.py (945 of 1935)
PASS: lldb-unit :: Symbol/./SymbolTests/TestTypeSystemClang.TestGetEnumIntegerTypeUnexpectedType (946 of 1935)
PASS: lldb-unit :: UnwindAssembly/x86/./UnwindAssemblyx86Tests/Testx86AssemblyInspectionEngine.TestPushImm (947 of 1935)
PASS: lldb-unit :: Utility/./UtilityTests/StringListTest.GetSize (948 of 1935)
PASS: lldb-api :: lang/objc/objc-stepping/TestObjCStepping.py (949 of 1935)
PASS: lldb-unit :: Utility/./UtilityTests/StringLexerTest.Peek (950 of 1935)
PASS: lldb-unit :: Process/gdb-remote/./ProcessGdbRemoteTests/GDBRemoteClientBaseTest.SendContinueDelegateInterface (951 of 1935)
PASS: lldb-shell :: Reproducer/TestDiscard.test (952 of 1935)
PASS: lldb-api :: lang/cpp/template/TestTemplateArgs.py (953 of 1935)
PASS: lldb-api :: tools/lldb-vscode/stackTrace/TestVSCode_stackTrace.py (954 of 1935)
PASS: lldb-api :: lang/cpp/dynamic-value/TestCppValueCast.py (955 of 1935)
PASS: lldb-unit :: Expression/./ExpressionTests/DiagnosticManagerTest.GetStringSeverityLabels (956 of 1935)
PASS: lldb-unit :: Utility/./UtilityTests/ArgsTest.TestArgv (957 of 1935)
PASS: lldb-unit :: Utility/./UtilityTests/TimeoutTest.Format (958 of 1935)
PASS: lldb-api :: functionalities/data-formatter/stringprinter/TestStringPrinter.py (959 of 1935)
PASS: lldb-api :: lang/c/step_over_no_deadlock/TestStepOverDoesntBlock.py (960 of 1935)
PASS: lldb-unit :: Process/minidump/./LLDBMinidumpTests/MinidumpParserTest.GetMemory (961 of 1935)
PASS: lldb-api :: functionalities/breakpoint/breakpoint_options/TestBreakpointOptions.py (962 of 1935)
PASS: lldb-api :: functionalities/tail_call_frames/cross_object/TestCrossObjectTailCalls.py (963 of 1935)
PASS: lldb-shell :: SymbolFile/DWARF/dir-separator-windows.s (964 of 1935)
PASS: lldb-api :: lang/cpp/template-function/TestTemplateFunctions.py (965 of 1935)
PASS: lldb-api :: commands/expression/function_template_specialization_temp_args/TestFunctionTemplateSpecializationTempArgs.py (966 of 1935)
PASS: lldb-shell :: ObjectFile/PECOFF/basic-info.yaml (967 of 1935)
PASS: lldb-api :: functionalities/breakpoint/comp_dir_symlink/TestCompDirSymLink.py (968 of 1935)
PASS: lldb-unit :: Host/./HostTests/NativeProcessProtocolTest.ReadCStringFromMemory_CrossPageBoundary (969 of 1935)
PASS: lldb-unit :: ScriptInterpreter/Python/./ScriptInterpreterPythonTests/PythonDataObjectsTest.TestGlobalNameResolutionNoDot (970 of 1935)
UNSUPPORTED: lldb-shell :: ScriptInterpreter/Lua/breakpoint_callback.test (971 of 1935)
PASS: lldb-api :: functionalities/data-formatter/parray/TestPrintArray.py (972 of 1935)
PASS: lldb-unit :: Utility/./UtilityTests/EnvironmentTest.EnvpConversion (973 of 1935)
PASS: lldb-unit :: Utility/./UtilityTests/OptionsWithRawTest.EmptySuffixSingleWhitespace (974 of 1935)
PASS: lldb-unit :: Utility/./UtilityTests/StringListTest.GetMaxStringLengthDecreasingSize (975 of 1935)
PASS: lldb-api :: lang/cpp/class_types/TestClassTypes.py (976 of 1935)
PASS: lldb-unit :: Utility/./UtilityTests/UriParserTest.SchemeHostSeparator2 (977 of 1935)
PASS: lldb-api :: python_api/sbtype_typeclass/TestSBTypeTypeClass.py (978 of 1935)
UNSUPPORTED: lldb-shell :: ObjectFile/PECOFF/disassemble-thumb.yaml (979 of 1935)
PASS: lldb-unit :: UnwindAssembly/x86/./UnwindAssemblyx86Tests/Testx86AssemblyInspectionEngine.TestPopESI (980 of 1935)
PASS: lldb-api :: functionalities/gdb_remote_client/TestGDBRemoteLoad.py (981 of 1935)
PASS: lldb-unit :: Utility/./UtilityTests/VMRange.Comparison (982 of 1935)
PASS: lldb-unit :: Utility/./UtilityTests/SerializationRountripTest.SerializeDeserializeObjectPointer (983 of 1935)
PASS: lldb-unit :: Utility/./UtilityTests/TimeoutTest.Construction (984 of 1935)
PASS: lldb-unit :: ObjectFile/Breakpad/./ObjectFileBreakpadTests/LineRecord.parse (985 of 1935)
PASS: lldb-shell :: Reproducer/Modules/TestModuleCXX.test (986 of 1935)
PASS: lldb-unit :: Utility/./UtilityTests/ArchSpecTest.MergeFromMachOUnknown (987 of 1935)
PASS: lldb-api :: functionalities/data-formatter/data-formatter-stl/libcxx/function/TestLibCxxFunction.py (988 of 1935)
UNSUPPORTED: lldb-shell :: SymbolFile/DWARF/debug-types-expressions.test (989 of 1935)
UNSUPPORTED: lldb-api :: tools/lldb-vscode/completions/TestVSCode_completions.py (990 of 1935)
PASS: lldb-unit :: Process/gdb-remote/./ProcessGdbRemoteTests/GDBRemoteClientBaseTest.SendContinueAndAsyncPacket (991 of 1935)
PASS: lldb-api :: functionalities/inferior-assert/TestInferiorAssert.py (992 of 1935)
PASS: lldb-api :: functionalities/data-formatter/data-formatter-stl/libcxx/list/TestDataFormatterLibcxxList.py (993 of 1935)
PASS: lldb-shell :: SymbolFile/Breakpad/line-table-mixed-path-styles.test (994 of 1935)
PASS: lldb-api :: lang/cpp/covariant-return-types/TestCovariantReturnTypes.py (995 of 1935)
PASS: lldb-unit :: UnwindAssembly/x86/./UnwindAssemblyx86Tests/Testx86AssemblyInspectionEngine.TestAddESP (996 of 1935)
PASS: lldb-api :: commands/expression/entry-bp/TestExprEntryBP.py (997 of 1935)
PASS: lldb-unit :: Utility/./UtilityTests/ScalarTest.GetBytes (998 of 1935)
PASS: lldb-shell :: Quit/TestQuitExitCodeNonInt.test (999 of 1935)
PASS: lldb-api :: functionalities/gdb_remote_client/TestPlatformClient.py (1000 of 1935)
PASS: lldb-unit :: Process/gdb-remote/./ProcessGdbRemoteTests/GDBRemoteCommunicationTest.ReadPacket_checksum (1001 of 1935)
PASS: lldb-api :: functionalities/history/TestHistoryRecall.py (1002 of 1935)
PASS: lldb-shell :: BuildScript/compiler-full-path.test (1003 of 1935)
PASS: lldb-unit :: Host/./HostTests/NativeProcessProtocolTest.ReadCStringFromMemory_MaxSize (1004 of 1935)
PASS: lldb-unit :: ScriptInterpreter/Python/./ScriptInterpreterPythonTests/PythonDataObjectsTest.TestPythonBytes (1005 of 1935)
PASS: lldb-api :: functionalities/data-formatter/data-formatter-objc/TestDataFormatterObjCNSURL.py (1006 of 1935)
PASS: lldb-api :: commands/expression/persistent_types/TestPersistentTypes.py (1007 of 1935)
PASS: lldb-api :: lang/cpp/modules-import/TestCXXModulesImport.py (1008 of 1935)
UNSUPPORTED: lldb-shell :: SymbolFile/PDB/udt-layout.test (1009 of 1935)
PASS: lldb-api :: functionalities/thread/concurrent_events/TestConcurrentDelayedCrashWithBreakpointWatchpoint.py (1010 of 1935)
UNSUPPORTED: lldb-api :: commands/expression/macros/TestMacros.py (1011 of 1935)
PASS: lldb-unit :: Utility/./UtilityTests/ScalarTest.ExtractBitfield (1012 of 1935)
PASS: lldb-api :: functionalities/tail_call_frames/thread_step_out_or_return/TestSteppingOutWithArtificialFrames.py (1013 of 1935)
PASS: lldb-api :: functionalities/breakpoint/address_breakpoints/TestBadAddressBreakpoints.py (1014 of 1935)
UNSUPPORTED: lldb-api :: functionalities/asan/TestMemoryHistory.py (1015 of 1935)
PASS: lldb-api :: functionalities/thread/concurrent_events/TestConcurrentSignalDelayBreak.py (1016 of 1935)
PASS: lldb-api :: functionalities/archives/TestBSDArchives.py (1017 of 1935)
PASS: lldb-unit :: Utility/./UtilityTests/RangeTest.SlideZero (1018 of 1935)
PASS: lldb-api :: lang/objc/objc-runtime-ivars/TestRuntimeIvars.py (1019 of 1935)
PASS: lldb-unit :: debugserver/./debugserverTests/RNBSocket.LoopBackConnectIPv4 (1020 of 1935)
PASS: lldb-unit :: Language/Highlighting/./HighlighterTests/HighlighterTest.ClangBraces (1021 of 1935)
PASS: lldb-shell :: Expr/TestIRMemoryMap.test (1022 of 1935)
PASS: lldb-api :: commands/expression/radar_9673664/TestExprHelpExamples.py (1023 of 1935)
PASS: lldb-shell :: SymbolFile/NativePDB/break-by-line.cpp (1024 of 1935)
PASS: lldb-shell :: SymbolFile/Breakpad/line-table-edgecases.test (1025 of 1935)
UNRESOLVED: lldb-api :: functionalities/gdb_remote_client/TestWasm.py (1026 of 1935)
******************** TEST 'lldb-api :: functionalities/gdb_remote_client/TestWasm.py' FAILED ********************
Script:
--
/usr/local/bin/python /Users/buildslave/jenkins/workspace/lldb-cmake-sanitized/llvm-project/lldb/test/API/dotest.py --arch x86_64 -s /Users/buildslave/jenkins/workspace/lldb-cmake-sanitized/lldb-build/lldb-test-traces -S nm -u CXXFLAGS -u CFLAGS --codesign-identity lldb_codesign --server /Users/buildslave/jenkins/workspace/lldb-cmake-sanitized/lldb-build/./bin/debugserver --arch x86_64 --build-dir /Users/buildslave/jenkins/workspace/lldb-cmake-sanitized/lldb-build/lldb-test-build.noindex -s=/Users/buildslave/jenkins/workspace/lldb-cmake-sanitized/test/logs -t --env TERM=vt100 --env LLVM_LIBS_DIR=/Users/buildslave/jenkins/workspace/lldb-cmake-sanitized/lldb-build/./lib --inferior-env ASAN_OPTIONS=detect_stack_use_after_return=1 --inferior-env DYLD_INSERT_LIBRARIES=/Users/buildslave/jenkins/workspace/lldb-cmake-sanitized/host-compiler/lib/clang/11.0.0/lib/darwin/libclang_rt.asan_osx_dynamic.dylib --build-dir /Users/buildslave/jenkins/workspace/lldb-cmake-sanitized/lldb-build/lldb-test-build.noindex --lldb-module-cache-dir /Users/buildslave/jenkins/workspace/lldb-cmake-sanitized/lldb-build/lldb-test-build.noindex/module-cache-lldb/lldb-api --clang-module-cache-dir /Users/buildslave/jenkins/workspace/lldb-cmake-sanitized/lldb-build/lldb-test-build.noindex/module-cache-clang/lldb-api --executable /Users/buildslave/jenkins/workspace/lldb-cmake-sanitized/lldb-build/./bin/lldb --compiler /Users/buildslave/jenkins/workspace/lldb-cmake-sanitized/lldb-build/./bin/clang --dsymutil /Users/buildslave/jenkins/workspace/lldb-cmake-sanitized/lldb-build/./bin/dsymutil --filecheck /Users/buildslave/jenkins/workspace/lldb-cmake-sanitized/lldb-build/./bin/FileCheck --lldb-libs-dir /Users/buildslave/jenkins/workspace/lldb-cmake-sanitized/lldb-build/./lib /Users/buildslave/jenkins/workspace/lldb-cmake-sanitized/llvm-project/lldb/test/API/functionalities/gdb_remote_client -p TestWasm.py
--
Exit Code: -6

Hide Details

Command Output (stdout): -- lldb version 11.0.99 clang revision 14d7b802db4fd0c8124b0a58ad405fb52f44956d llvm revision 14d7b802db4fd0c8124b0a58ad405fb52f44956d

Hide Details

-- Command Output (stderr): -- ================================================================= ==83084==ERROR: AddressSanitizer: container-overflow on address 0x615000016404 at pc 0x00010ae718e3 bp 0x7ffee4dd0130 sp 0x7ffee4dcf8f8 READ of size 512 at 0x615000016404 thread T0 #0 0x10ae718e2 in __asan_memcpy+0x1b2 (libclang_rt.asan_osx_dynamic.dylib:x86_64+0x418e2) #1 0x11a744fd5 in lldb_private::MemoryCache::Read(unsigned long long, void*, unsigned long, lldb_private::Status&) Memory.cpp:189 #2 0x11a2999e9 in lldb_private::Module::GetMemoryObjectFile(std::__1::shared_ptr<lldb_private::Process> const&, unsigned long long, lldb_private::Status&, unsigned long) Module.cpp:298 #3 0x11a79b7ef in lldb_private::Process::ReadModuleFromMemory(lldb_private::FileSpec const&, unsigned long long, unsigned long) Process.cpp:2402 #4 0x11a22fc7b in lldb_private::DynamicLoader::LoadModuleAtAddress(lldb_private::FileSpec const&, unsigned long long, unsigned long long, bool) DynamicLoader.cpp:212 #5 0x11afcb72a in lldb_private::process_gdb_remote::ProcessGDBRemote::LoadModuleAtAddress(lldb_private::FileSpec const&, unsigned long long, unsigned long long, bool) ProcessGDBRemote.cpp:4767 #6 0x11afcbd08 in lldb_private::process_gdb_remote::ProcessGDBRemote::LoadModules() ProcessGDBRemote.cpp:4801 #7 0x11aac22ba in lldb_private::wasm::DynamicLoaderWasmDYLD::DidAttach() DynamicLoaderWasmDYLD.cpp:63 #8 0x11a7a0397 in lldb_private::Process::CompleteAttach() Process.cpp:2930 #9 0x11a7a34df in lldb_private::Process::ConnectRemote(lldb_private::Stream*, llvm::StringRef) Process.cpp:3015 #10 0x119b33d8e in lldb::SBTarget::ConnectRemote(lldb::SBListener&, char const*, char const*, lldb::SBError&) SBTarget.cpp:559 #11 0x11a020c31 in _wrap_SBTarget_ConnectRemote(_object*, _object*) LLDBWrapPython.cpp:52799 #12 0x10bbcf226 in _PyMethodDef_RawFastCallKeywords+0xeb (Python:x86_64+0x1a226) #13 0x10bbce8c6 in _PyCFunction_FastCallKeywords+0x2b (Python:x86_64+0x198c6) #14 0x10bc64905 in call_function+0x1de (Python:x86_64+0xaf905) #15 0x10bc5d5ee in _PyEval_EvalFrameDefault+0x1b51 (Python:x86_64+0xa85ee) #16 0x10bbceca1 in function_code_fastcall+0x6f (Python:x86_64+0x19ca1) #17 0x10bc6497d in call_function+0x256 (Python:x86_64+0xaf97d) #18 0x10bc5d5d5 in _PyEval_EvalFrameDefault+0x1b38 (Python:x86_64+0xa85d5) #19 0x10bbceca1 in function_code_fastcall+0x6f (Python:x86_64+0x19ca1) #20 0x10bc6497d in call_function+0x256 (Python:x86_64+0xaf97d) #21 0x10bc5d5d5 in _PyEval_EvalFrameDefault+0x1b38 (Python:x86_64+0xa85d5) #22 0x10bbceca1 in function_code_fastcall+0x6f (Python:x86_64+0x19ca1) #23 0x10bc6497d in call_function+0x256 (Python:x86_64+0xaf97d) #24 0x10bc5d68c in _PyEval_EvalFrameDefault+0x1bef (Python:x86_64+0xa868c) #25 0x10bbceca1 in function_code_fastcall+0x6f (Python:x86_64+0x19ca1) #26 0x10bc6497d in call_function+0x256 (Python:x86_64+0xaf97d) #27 0x10bc5d5d5 in _PyEval_EvalFrameDefault+0x1b38 (Python:x86_64+0xa85d5) #28 0x10bc652da in _PyEval_EvalCodeWithName+0x72a (Python:x86_64+0xb02da) #29 0x10bbce4f4 in _PyFunction_FastCallDict+0x1b8 (Python:x86_64+0x194f4) #30 0x10bbcf624 in _PyObject_Call_Prepend+0x95 (Python:x86_64+0x1a624) #31 0x10bbce9d4 in PyObject_Call+0x87 (Python:x86_64+0x199d4) #32 0x10bc5d905 in _PyEval_EvalFrameDefault+0x1e68 (Python:x86_64+0xa8905) #33 0x10bc652da in _PyEval_EvalCodeWithName+0x72a (Python:x86_64+0xb02da) #34 0x10bbce4f4 in _PyFunction_FastCallDict+0x1b8 (Python:x86_64+0x194f4) #35 0x10bbcf624 in _PyObject_Call_Prepend+0x95 (Python:x86_64+0x1a624) #36 0x10bc0c4af in slot_tp_call+0x46 (Python:x86_64+0x574af) #37 0x10bbce72c in _PyObject_FastCallKeywords+0x166 (Python:x86_64+0x1972c) #38 0x10bc64976 in call_function+0x24f (Python:x86_64+0xaf976) #39 0x10bc5d68c in _PyEval_EvalFrameDefault+0x1bef (Python:x86_64+0xa868c) #40 0x10bc652da in _PyEval_EvalCodeWithName+0x72a (Python:x86_64+0xb02da) #41 0x10bbce88b in _PyFunction_FastCallKeywords+0xe0 (Python:x86_64+0x1988b) #42 0x10bc6497d in call_function+0x256 (Python:x86_64+0xaf97d) #43 0x10bc5d5d5 in _PyEval_EvalFrameDefault+0x1b38 (Python:x86_64+0xa85d5) #44 0x10bc652da in _PyEval_EvalCodeWithName+0x72a (Python:x86_64+0xb02da) #45 0x10bbce88b in _PyFunction_FastCallKeywords+0xe0 (Python:x86_64+0x1988b) #46 0x10bc6497d in call_function+0x256 (Python:x86_64+0xaf97d) #47 0x10bc5d5d5 in _PyEval_EvalFrameDefault+0x1b38 (Python:x86_64+0xa85d5) #48 0x10bbceca1 in function_code_fastcall+0x6f (Python:x86_64+0x19ca1) #49 0x10bbcf624 in _PyObject_Call_Prepend+0x95 (Python:x86_64+0x1a624) #50 0x10bbce9d4 in PyObject_Call+0x87 (Python:x86_64+0x199d4) #51 0x10bc5d905 in _PyEval_EvalFrameDefault+0x1e68 (Python:x86_64+0xa8905) #52 0x10bc652da in _PyEval_EvalCodeWithName+0x72a (Python:x86_64+0xb02da) #53 0x10bbce4f4 in _PyFunction_FastCallDict+0x1b8 (Python:x86_64+0x194f4) #54 0x10bbcf624 in _PyObject_Call_Prepend+0x95 (Python:x86_64+0x1a624) #55 0x10bc0c4af in slot_tp_call+0x46 (Python:x86_64+0x574af) #56 0x10bbce72c in _PyObject_FastCallKeywords+0x166 (Python:x86_64+0x1972c) #57 0x10bc64976 in call_function+0x24f (Python:x86_64+0xaf976) #58 0x10bc5d68c in _PyEval_EvalFrameDefault+0x1bef (Python:x86_64+0xa868c) #59 0x10bbceca1 in function_code_fastcall+0x6f (Python:x86_64+0x19ca1) #60 0x10bc6497d in call_function+0x256 (Python:x86_64+0xaf97d) #61 0x10bc5d5d5 in _PyEval_EvalFrameDefault+0x1b38 (Python:x86_64+0xa85d5) #62 0x10bbceca1 in function_code_fastcall+0x6f (Python:x86_64+0x19ca1) #63 0x10bc6497d in call_function+0x256 (Python:x86_64+0xaf97d) #64 0x10bc5d5ee in _PyEval_EvalFrameDefault+0x1b51 (Python:x86_64+0xa85ee) #65 0x10bc652da in _PyEval_EvalCodeWithName+0x72a (Python:x86_64+0xb02da) #66 0x10bc5ba14 in PyEval_EvalCode+0x29 (Python:x86_64+0xa6a14) #67 0x10bc8a2aa in run_mod+0x35 (Python:x86_64+0xd52aa) #68 0x10bc892c5 in PyRun_FileExFlags+0xa3 (Python:x86_64+0xd42c5) #69 0x10bc889a4 in PyRun_SimpleFileExFlags+0x114 (Python:x86_64+0xd39a4) #70 0x10bca0010 in pymain_main+0x13de (Python:x86_64+0xeb010) #71 0x10bca07b7 in _Py_UnixMain+0x67 (Python:x86_64+0xeb7b7) #72 0x7fff7d1de084 in start+0x0 (libdyld.dylib:x86_64+0x17084)

Hide Details

0x615000016580 is located 0 bytes to the right of 512-byte region [0x615000016380,0x615000016580) allocated by thread T0 here: #0 0x10ae8060d in wrap__Znwm+0x7d (libclang_rt.asan_osx_dynamic.dylib:x86_64+0x5060d) #1 0x11a975440 in std::__1::vector<unsigned char, std::__1::allocator<unsigned char> >::__vallocate(unsigned long) new:253 #2 0x11a970fef in std::__1::vector<unsigned char, std::__1::allocator<unsigned char> >::assign(unsigned long, unsigned char const&) vector:1481 #3 0x11a970e3a in lldb_private::DataBufferHeap::DataBufferHeap(unsigned long long, unsigned char) DataBufferHeap.cpp:20 #4 0x11a74537d in lldb_private::MemoryCache::Read(unsigned long long, void*, unsigned long, lldb_private::Status&) Memory.cpp:228 #5 0x11a2999e9 in lldb_private::Module::GetMemoryObjectFile(std::__1::shared_ptr<lldb_private::Process> const&, unsigned long long, lldb_private::Status&, unsigned long) Module.cpp:298 #6 0x11a79b7ef in lldb_private::Process::ReadModuleFromMemory(lldb_private::FileSpec const&, unsigned long long, unsigned long) Process.cpp:2402 #7 0x11a22fc7b in lldb_private::DynamicLoader::LoadModuleAtAddress(lldb_private::FileSpec const&, unsigned long long, unsigned long long, bool) DynamicLoader.cpp:212 #8 0x11afcb72a in lldb_private::process_gdb_remote::ProcessGDBRemote::LoadModuleAtAddress(lldb_private::FileSpec const&, unsigned long long, unsigned long long, bool) ProcessGDBRemote.cpp:4767 #9 0x11afcbd08 in lldb_private::process_gdb_remote::ProcessGDBRemote::LoadModules() ProcessGDBRemote.cpp:4801 #10 0x11aac22ba in lldb_private::wasm::DynamicLoaderWasmDYLD::DidAttach() DynamicLoaderWasmDYLD.cpp:63 #11 0x11a7a0397 in lldb_private::Process::CompleteAttach() Process.cpp:2930 #12 0x11a7a34df in lldb_private::Process::ConnectRemote(lldb_private::Stream*, llvm::StringRef) Process.cpp:3015 #13 0x119b33d8e in lldb::SBTarget::ConnectRemote(lldb::SBListener&, char const*, char const*, lldb::SBError&) SBTarget.cpp:559 #14 0x11a020c31 in _wrap_SBTarget_ConnectRemote(_object*, _object*) LLDBWrapPython.cpp:52799 #15 0x10bbcf226 in _PyMethodDef_RawFastCallKeywords+0xeb (Python:x86_64+0x1a226) #16 0x10bbce8c6 in _PyCFunction_FastCallKeywords+0x2b (Python:x86_64+0x198c6) #17 0x10bc64905 in call_function+0x1de (Python:x86_64+0xaf905) #18 0x10bc5d5ee in _PyEval_EvalFrameDefault+0x1b51 (Python:x86_64+0xa85ee) #19 0x10bbceca1 in function_code_fastcall+0x6f (Python:x86_64+0x19ca1) #20 0x10bc6497d in call_function+0x256 (Python:x86_64+0xaf97d) #21 0x10bc5d5d5 in _PyEval_EvalFrameDefault+0x1b38 (Python:x86_64+0xa85d5) #22 0x10bbceca1 in function_code_fastcall+0x6f (Python:x86_64+0x19ca1) #23 0x10bc6497d in call_function+0x256 (Python:x86_64+0xaf97d) #24 0x10bc5d5d5 in _PyEval_EvalFrameDefault+0x1b38 (Python:x86_64+0xa85d5) #25 0x10bbceca1 in function_code_fastcall+0x6f (Python:x86_64+0x19ca1) #26 0x10bc6497d in call_function+0x256 (Python:x86_64+0xaf97d) #27 0x10bc5d68c in _PyEval_EvalFrameDefault+0x1bef (Python:x86_64+0xa868c) #28 0x10bbceca1 in function_code_fastcall+0x6f (Python:x86_64+0x19ca1) #29 0x10bc6497d in call_function+0x256 (Python:x86_64+0xaf97d)

Hide Details

HINT: if you don't care about these errors you may set ASAN_OPTIONS=detect_container_overflow=0. If you suspect a false positive see also: https://github.com/google/sanitizers/wiki/AddressSanitizerContainerOverflow. SUMMARY: AddressSanitizer: container-overflow (libclang_rt.asan_osx_dynamic.dylib:x86_64+0x418e2) in __asan_memcpy+0x1b2 Shadow bytes around the buggy address: 0x1c2a00002c30: 00 00 00 00 00 00 00 00 00 00 00 00 00 00 00 00 0x1c2a00002c40: 00 00 00 00 00 00 00 00 00 00 00 00 00 00 00 00 0x1c2a00002c50: 00 00 00 00 00 00 00 00 00 00 00 00 00 00 00 00 0x1c2a00002c60: fa fa fa fa fa fa fa fa fa fa fa fa fa fa fa fa 0x1c2a00002c70: 00 00 00 00 00 00 00 00 00 00 00 00 00 00 00 00 =>0x1c2a00002c80:[04]fc fc fc fc fc fc fc fc fc fc fc fc fc fc fc 0x1c2a00002c90: fc fc fc fc fc fc fc fc fc fc fc fc fc fc fc fc 0x1c2a00002ca0: fc fc fc fc fc fc fc fc fc fc fc fc fc fc fc fc 0x1c2a00002cb0: fa fa fa fa fa fa fa fa fa fa fa fa fa fa fa fa 0x1c2a00002cc0: fd fd fd fd fd fd fd fd fd fd fd fd fd fd fd fd 0x1c2a00002cd0: fd fd fd fd fd fd fd fd fd fd fd fd fd fd fd fd Shadow byte legend (one shadow byte represents 8 application bytes): Addressable: 00 Partially addressable: 01 02 03 04 05 06 07 Heap left redzone: fa Freed heap region: fd Stack left redzone: f1 Stack mid redzone: f2 Stack right redzone: f3 Stack after return: f5 Stack use after scope: f8 Global redzone: f9 Global init order: f6 Poisoned by user: f7 Container overflow: fc Array cookie: ac Intra object redzone: bb ASan internal: fe Left alloca redzone: ca Right alloca redzone: cb Shadow gap: cc ==83084==ABORTING

Hide Details

--

Hide Details

******************** PASS: lldb-unit :: Utility/./UtilityTests/LogChannelTest.Disable (1027 of 1935) PASS: lldb-unit :: ObjectFile/PECOFF/./ObjectFilePECOFFTests/PECallFrameInfoTest.Basic_eh (1028 of 1935) PASS: lldb-api :: functionalities/data-formatter/data-formatter-stl/libcxx/multiset/TestDataFormatterLibcxxMultiSet.py (1029 of 1935) PASS: lldb-unit :: Process/gdb-remote/./ProcessGdbRemoteTests/GDBRemoteCommunicationServerTest.SendErrorResponse_StringError (1030 of 1935) PASS: lldb-unit :: Target/./TargetTests/StackFrameRecognizerTest.NullModuleRegex (1031 of 1935) PASS: lldb-unit :: Core/./LLDBCoreTests/StreamCallbackTest.Callback (1032 of 1935) PASS: lldb-unit :: Process/gdb-remote/./ProcessGdbRemoteTests/GDBRemoteClientBaseTest.InterruptNoResponse (1033 of 1935) PASS: lldb-unit :: Utility/./UtilityTests/UriParserTest.LongPath (1034 of 1935) PASS: lldb-shell :: Reproducer/TestFileRepro.test (1035 of 1935) PASS: lldb-unit :: Language/CPlusPlus/./LanguageCPlusPlusTests/CPlusPlusLanguage.ExtractContextAndIdentifier (1036 of 1935) PASS: lldb-unit :: Utility/./UtilityTests/LogChannelEnabledTest.LLDB_LOG_ERROR (1037 of 1935) XFAIL: lldb-shell :: Register/x86-64-write.test (1038 of 1935) PASS: lldb-unit :: Symbol/./SymbolTests/TestClangASTImporter.CompleteFwdDeclWithOtherOrigin (1039 of 1935) PASS: lldb-shell :: Settings/TestFrameFormatMangling.test (1040 of 1935) PASS: lldb-unit :: Host/./HostTests/SocketTest.UDPConnect (1041 of 1935) PASS: lldb-api :: commands/frame/diagnose/complicated-expression/TestComplicatedExpression.py (1042 of 1935) PASS: lldb-api :: lang/objc/variadic_methods/TestVariadicMethods.py (1043 of 1935) PASS: lldb-unit :: Symbol/./SymbolTests/DWARFCallFrameInfoTest.Basic_dwarf3 (1044 of 1935) PASS: lldb-unit :: Expression/./ExpressionTests/ClangHostTest.MacOSX (1045 of 1935) PASS: lldb-api :: commands/expression/call-throws/TestCallThatThrows.py (1046 of 1935) PASS: lldb-api :: macosx/safe-to-func-call/TestSafeFuncCalls.py (1047 of 1935) PASS: lldb-api :: lang/cpp/namespace_definitions/TestNamespaceDefinitions.py (1048 of 1935) PASS: lldb-unit :: Utility/./UtilityTests/LogChannelTest.List (1049 of 1935) UNSUPPORTED: lldb-api :: functionalities/darwin_log/filter/regex/category/TestDarwinLogFilterRegexCategory.py (1050 of 1935) PASS: lldb-api :: commands/target/create-no-such-arch/TestNoSuchArch.py (1051 of 1935) PASS: lldb-unit :: Utility/./UtilityTests/StringExtractorTest.GetHexU8_Underflow2_NoEof (1052 of 1935) PASS: lldb-unit :: Utility/./UtilityTests/ArgsTest.EscapeLLDBCommandArgument (1053 of 1935) PASS: lldb-api :: types/TestDoubleTypesExpr.py (1054 of 1935) PASS: lldb-unit :: SymbolFile/NativePDB/./SymbolFileNativePDBTests/PDBFPOProgramToDWARFExpressionTests.UnresolvedRegisterReference (1055 of 1935) PASS: lldb-unit :: Symbol/./SymbolTests/TestTypeSystemClang.TestRemoveFastQualifiers (1056 of 1935) PASS: lldb-api :: functionalities/thread/concurrent_events/TestConcurrentNWatchNBreak.py (1057 of 1935) PASS: lldb-unit :: Language/Highlighting/./HighlighterTests/HighlighterTest.ClangTrailingBackslashWithWhitespace (1058 of 1935) PASS: lldb-unit :: UnwindAssembly/x86/./UnwindAssemblyx86Tests/Testx86AssemblyInspectionEngine.Test64bitFramelessSmallStackFrame (1059 of 1935) PASS: lldb-unit :: Utility/./UtilityTests/StreamTest.PutHex64ByteOrderBig (1060 of 1935) UNSUPPORTED: lldb-api :: python_api/disassemble-raw-data/TestDisassemble_VST1_64.py (1061 of 1935) PASS: lldb-unit :: Utility/./UtilityTests/StringListTest.JoinMultiCharSeparator (1062 of 1935) PASS: lldb-api :: lang/cpp/namespace_conflicts/TestNamespaceConflicts.py (1063 of 1935) PASS: lldb-unit :: UnwindAssembly/x86/./UnwindAssemblyx86Tests/Testx86AssemblyInspectionEngine.TestSubRSP (1064 of 1935) PASS: lldb-api :: python_api/file_handle/TestFileHandle.py (1065 of 1935) PASS: lldb-unit :: Utility/./UtilityTests/RangeTest.DefaultConstructor (1066 of 1935) PASS: lldb-unit :: Utility/./UtilityTests/StringLexerTest.NextIf (1067 of 1935) PASS: lldb-unit :: Host/./HostTests/MainLoopTest.Signal (1068 of 1935) PASS: lldb-unit :: Language/Highlighting/./HighlighterTests/HighlighterTest.Colons (1069 of 1935) UNSUPPORTED: lldb-shell :: Watchpoint/netbsd-nouserdbregs.test (1070 of 1935) PASS: lldb-api :: functionalities/breakpoint/debugbreak/TestDebugBreak.py (1071 of 1935) UNSUPPORTED: lldb-api :: tools/lldb-server/TestGdbRemoteAuxvSupport.py (1072 of 1935) UNSUPPORTED: lldb-api :: functionalities/thread/break_after_join/TestBreakAfterJoin.py (1073 of 1935) PASS: lldb-shell :: Breakpoint/split-dwarf5-debug-stroffsets.test (1074 of 1935) PASS: lldb-api :: commands/expression/import-std-module/vector/TestVectorFromStdModule.py (1075 of 1935) PASS: lldb-unit :: Utility/./UtilityTests/StringListTest.InsertStringAtIndexEnd (1076 of 1935) PASS: lldb-unit :: Utility/./UtilityTests/StringExtractorTest.GetHexBytes_OddPair (1077 of 1935) PASS: lldb-unit :: Utility/./UtilityTests/BinaryStreamTest.PutULEB128MaxValue (1078 of 1935) PASS: lldb-shell :: ObjectFile/Breakpad/sections.test (1079 of 1935) PASS: lldb-api :: functionalities/thread/concurrent_events/TestConcurrentBreakpointOneDelayBreakpointThreads.py (1080 of 1935) PASS: lldb-api :: lang/objc/objc-ivar-protocols/TestIvarProtocols.py (1081 of 1935) UNSUPPORTED: lldb-shell :: Breakpoint/case-insensitive.test (1082 of 1935) PASS: lldb-api :: lang/c/anonymous/TestAnonymous.py (1083 of 1935) PASS: lldb-api :: commands/apropos/with-process/TestAproposWithProcess.py (1084 of 1935) PASS: lldb-api :: functionalities/data-formatter/refpointer-recursion/TestDataFormatterRefPtrRecursion.py (1085 of 1935) PASS: lldb-unit :: Utility/./UtilityTests/UriParserTest.PortOverflow (1086 of 1935) PASS: lldb-unit :: Expression/./ExpressionTests/DiagnosticManagerTest.AddDiagnostic (1087 of 1935) UNSUPPORTED: lldb-shell :: SymbolFile/PDB/class-layout.test (1088 of 1935) PASS: lldb-api :: functionalities/thread/concurrent_events/TestConcurrentTwoWatchpointsOneDelayBreakpoint.py (1089 of 1935) PASS: lldb-shell :: Reproducer/TestVersionCheck.test (1090 of 1935) PASS: lldb-api :: functionalities/thread/concurrent_events/TestConcurrentCrashWithWatchpointBreakpointSignal.py (1091 of 1935) PASS: lldb-api :: lang/cpp/namespace/TestNamespaceLookup.py (1092 of 1935) PASS: lldb-api :: commands/log/basic/TestLogging.py (1093 of 1935) PASS: lldb-api :: functionalities/thread/concurrent_events/TestConcurrentManyBreakpoints.py (1094 of 1935) PASS: lldb-api :: commands/frame/diagnose/inheritance/TestDiagnoseInheritance.py (1095 of 1935) PASS: lldb-api :: functionalities/data-formatter/data-formatter-stl/libcxx/variant/TestDataFormatterLibcxxVariant.py (1096 of 1935) PASS: lldb-unit :: Utility/./UtilityTests/BinaryStreamTest.PutSLEB128SixBytes (1097 of 1935) PASS: lldb-unit :: Utility/./UtilityTests/LogChannelEnabledTest.log_options (1098 of 1935) PASS: lldb-api :: functionalities/thread/concurrent_events/TestConcurrentDelaySignalWatch.py (1099 of 1935) PASS: lldb-unit :: Utility/./UtilityTests/RangeTest.Copy (1100 of 1935) PASS: lldb-unit :: Utility/./UtilityTests/RangeTest.LessThanInvalid (1101 of 1935) PASS: lldb-unit :: ScriptInterpreter/Python/./ScriptInterpreterPythonTests/PythonDataObjectsTest.TestPythonString (1102 of 1935) PASS: lldb-api :: functionalities/postmortem/wow64_minidump/TestWow64MiniDump.py (1103 of 1935) PASS: lldb-api :: functionalities/tail_call_frames/ambiguous_tail_call_seq1/TestAmbiguousTailCallSeq1.py (1104 of 1935) UNSUPPORTED: lldb-api :: lang/objc/foundation/TestFoundationDisassembly.py (1105 of 1935) PASS: lldb-api :: functionalities/data-formatter/ostypeformatting/TestFormattersOsType.py (1106 of 1935) PASS: lldb-api :: lang/cpp/offsetof/TestOffsetofCpp.py (1107 of 1935) UNSUPPORTED: lldb-shell :: Register/aarch64-fp-read.test (1108 of 1935) PASS: lldb-unit :: Language/Highlighting/./HighlighterTests/HighlighterTest.FallbackHighlighter (1109 of 1935) PASS: lldb-unit :: Utility/./UtilityTests/StreamTest.ShiftOperatorStrings (1110 of 1935) PASS: lldb-shell :: Settings/TestSettingsWrite.test (1111 of 1935) PASS: lldb-api :: functionalities/tail_call_frames/disambiguate_paths_to_common_sink/TestDisambiguatePathsToCommonSink.py (1112 of 1935) PASS: lldb-unit :: Utility/./UtilityTests/RangeTest.ContainsAddr (1113 of 1935) PASS: lldb-api :: functionalities/data-formatter/user-format-vs-summary/TestUserFormatVsSummary.py (1114 of 1935) PASS: lldb-api :: lang/cpp/accelerator-table/TestCPPAccelerator.py (1115 of 1935) PASS: lldb-unit :: Process/gdb-remote/./ProcessGdbRemoteTests/GDBRemoteCommunicationClientTest.SendGetMetaDataPacket (1116 of 1935) UNSUPPORTED: lldb-shell :: BuildScript/toolchain-clang-cl.test (1117 of 1935) PASS: lldb-api :: lang/cpp/namespace/TestNamespace.py (1118 of 1935) UNSUPPORTED: lldb-api :: api/multiple-debuggers/TestMultipleDebuggers.py (1119 of 1935) PASS: lldb-unit :: Utility/./UtilityTests/StringLexerTest.GetUnlexed (1120 of 1935) PASS: lldb-api :: python_api/target/TestTargetAPI.py (1121 of 1935) PASS: lldb-unit :: Utility/./UtilityTests/ArgsTest.TestQuotedUnknownEscape (1122 of 1935) PASS: lldb-unit :: ScriptInterpreter/Python/./ScriptInterpreterPythonTests/PythonDataObjectsTest.TestPythonDictionaryValueEquality (1123 of 1935) PASS: lldb-shell :: Reproducer/Functionalities/TestImageList.test (1124 of 1935) PASS: lldb-unit :: Utility/./UtilityTests/StreamTest.ShiftOperatorPtr (1125 of 1935) PASS: lldb-api :: lang/c/unions/TestUnionMembers.py (1126 of 1935) PASS: lldb-unit :: Interpreter/./InterpreterTests/CompletionTest.DirCompletionAbsolute (1127 of 1935) PASS: lldb-unit :: ScriptInterpreter/Python/./ScriptInterpreterPythonTests/PythonDataObjectsTest.TestGlobalNameResolutionWithDot (1128 of 1935) PASS: lldb-shell :: ScriptInterpreter/None/import_module.test (1129 of 1935) PASS: lldb-unit :: debugserver/./debugserverTests/JSON.Parse (1130 of 1935) PASS: lldb-api :: linux/builtin_trap/TestBuiltinTrap.py (1131 of 1935) PASS: lldb-unit :: Utility/./UtilityTests/SubsystemRAIITest.SubsystemWithErrorFailure (1132 of 1935) PASS: lldb-shell :: ObjectFile/ELF/minidebuginfo-find-symbols.yaml (1133 of 1935) PASS: lldb-unit :: Utility/./UtilityTests/StringExtractorTest.GetHexU8_InvalidHex_NoEof (1134 of 1935) PASS: lldb-api :: lang/objc/modules-hash-mismatch/TestClangModulesHashMismatch.py (1135 of 1935) PASS: lldb-unit :: Utility/./UtilityTests/StringExtractorTest.GetHexBytes_OddPair2 (1136 of 1935) UNSUPPORTED: lldb-api :: tools/lldb-server/TestGdbRemote_vContThreads.py (1137 of 1935) PASS: lldb-api :: types/TestDoubleTypes.py (1138 of 1935) PASS: lldb-unit :: Utility/./UtilityTests/ScalarTest.SetValueFromCString (1139 of 1935) PASS: lldb-shell :: ObjectFile/ELF/basic-info.yaml (1140 of 1935) PASS: lldb-unit :: Utility/./UtilityTests/Flags.AnyClear (1141 of 1935) PASS: lldb-api :: functionalities/gdb_remote_client/TestGDBRemoteClient.py (1142 of 1935) UNSUPPORTED: lldb-api :: functionalities/tsan/thread_numbers/TestTsanThreadNumbers.py (1143 of 1935) PASS: lldb-unit :: Utility/./UtilityTests/StringListTest.Clear (1144 of 1935) PASS: lldb-shell :: Breakpoint/debug_addrx.test (1145 of 1935) PASS: lldb-shell :: SymbolFile/DWARF/inline-function-address-shared.test (1146 of 1935) PASS: lldb-shell :: Minidump/Windows/Sigsegv/sigsegv.test (1147 of 1935) UNSUPPORTED: lldb-shell :: Register/x86-gp-write.test (1148 of 1935) PASS: lldb-api :: lang/cpp/function-qualifiers/TestCppFunctionQualifiers.py (1149 of 1935) PASS: lldb-shell :: Commands/CommandScriptImmediateOutput/CommandScriptImmediateOutputConsole.test (1150 of 1935) PASS: lldb-unit :: Utility/./UtilityTests/BinaryStreamTest.PutULEB128ThreeBytes (1151 of 1935) UNSUPPORTED: lldb-shell :: Process/Windows/exception_access_violation.cpp (1152 of 1935) PASS: lldb-shell :: Reproducer/TestRelativePath.test (1153 of 1935) PASS: lldb-unit :: Symbol/./SymbolTests/DWARFCallFrameInfoTest.Basic_eh (1154 of 1935) PASS: lldb-unit :: Utility/./UtilityTests/OptionsWithRawTest.EmptyInput (1155 of 1935) PASS: lldb-unit :: Utility/./UtilityTests/StructuredDataTest.ParseJSONFromFile (1156 of 1935) PASS: lldb-shell :: Commands/CommandScriptImmediateOutput/CommandScriptImmediateOutputFile.test (1157 of 1935) PASS: lldb-api :: functionalities/gdb_remote_client/TestNoGPacketSupported.py (1158 of 1935) PASS: lldb-unit :: Utility/./UtilityTests/CompletionRequest.TryCompleteCurrentArgGood (1159 of 1935) PASS: lldb-unit :: Utility/./UtilityTests/BinaryStreamTest.PutSLEB128ThreeBytes (1160 of 1935) PASS: lldb-unit :: Process/minidump/./LLDBMinidumpTests/MinidumpParserTest.GetLinuxProcStatus_no_stream (1161 of 1935) PASS: lldb-unit :: UnwindAssembly/x86/./UnwindAssemblyx86Tests/Testx86AssemblyInspectionEngine.TestPushRBPWithREX (1162 of 1935) PASS: lldb-unit :: Expression/./ExpressionTests/DiagnosticManagerTest.GetStringMultipleDiags (1163 of 1935) PASS: lldb-unit :: Language/Highlighting/./HighlighterTests/HighlighterTest.ClangPreserveNewLine (1164 of 1935) PASS: lldb-unit :: Utility/./UtilityTests/StringListTest.LongestCommonPrefixDuplicateElement (1165 of 1935) UNSUPPORTED: lldb-api :: functionalities/thread/concurrent_events/TestConcurrentManySignals.py (1166 of 1935) PASS: lldb-api :: functionalities/abbreviation/TestCommonShortSpellings.py (1167 of 1935) PASS: lldb-api :: lang/objc/objc-baseclass-sbtype/TestObjCBaseClassSBType.py (1168 of 1935) PASS: lldb-unit :: SymbolFile/NativePDB/./SymbolFileNativePDBTests/PDBFPOProgramToDWARFExpressionTests.UnresolvedRegisterAssignmentReference (1169 of 1935) PASS: lldb-unit :: Utility/./UtilityTests/TimerTest.CategoryTimesStats (1170 of 1935) PASS: lldb-api :: macosx/load-kext/TestLoadKext.py (1171 of 1935) PASS: lldb-api :: commands/frame/diagnose/dereference-argument/TestDiagnoseDereferenceArgument.py (1172 of 1935) PASS: lldb-unit :: Utility/./UtilityTests/LogTest.Register (1173 of 1935) PASS: lldb-api :: commands/expression/persistent_variables/TestPersistentVariables.py (1174 of 1935) PASS: lldb-api :: commands/expression/import-std-module/shared_ptr/TestSharedPtrFromStdModule.py (1175 of 1935) PASS: lldb-unit :: Utility/./UtilityTests/RangeDataVector.CustomSort (1176 of 1935) PASS: lldb-shell :: Register/x86-64-gp-read.test (1177 of 1935) PASS: lldb-api :: lang/cpp/char1632_t/TestChar1632T.py (1178 of 1935) PASS: lldb-api :: functionalities/abbreviation/TestAbbreviations.py (1179 of 1935) PASS: lldb-unit :: UnwindAssembly/x86/./UnwindAssemblyx86Tests/Testx86AssemblyInspectionEngine.TestPushR13 (1180 of 1935) PASS: lldb-unit :: ScriptInterpreter/Python/./ScriptInterpreterPythonTests/PythonDataObjectsTest.TestTypeNameResolutionNoDot (1181 of 1935) PASS: lldb-shell :: ObjectFile/ELF/PT_LOAD-overlap-PT_INTERP.yaml (1182 of 1935) PASS: lldb-unit :: Utility/./UtilityTests/StringListTest.AppendList (1183 of 1935) PASS: lldb-unit :: Signals/./SignalsTests/UnixSignalsTest.VersionChange (1184 of 1935) PASS: lldb-unit :: Utility/./UtilityTests/FileSpecTest.Match (1185 of 1935) PASS: lldb-shell :: ExecControl/StopHook/stop-hook.test (1186 of 1935) PASS: lldb-api :: functionalities/data-formatter/var-in-aggregate-misuse/TestVarInAggregateMisuse.py (1187 of 1935) UNSUPPORTED: lldb-shell :: Register/arm-gp-read.test (1188 of 1935) PASS: lldb-unit :: Expression/./ExpressionTests/DiagnosticManagerTest.PutStringMultiple (1189 of 1935) PASS: lldb-unit :: Utility/./UtilityTests/DeserializerTest.HasData (1190 of 1935) PASS: lldb-unit :: Utility/./UtilityTests/StringListTest.JoinSingle (1191 of 1935) PASS: lldb-api :: lang/cpp/dynamic-value-same-basename/TestDynamicValueSameBase.py (1192 of 1935) PASS: lldb-api :: commands/process/attach/attach_denied/TestAttachDenied.py (1193 of 1935) PASS: lldb-unit :: Utility/./UtilityTests/StringExtractorTest.GetNameColonValueNoColon (1194 of 1935) PASS: lldb-api :: types/TestShortTypeExpr.py (1195 of 1935) PASS: lldb-api :: functionalities/thread/concurrent_events/TestConcurrentManyCrash.py (1196 of 1935) PASS: lldb-unit :: Utility/./UtilityTests/SharedCluster.ClusterManager (1197 of 1935) UNSUPPORTED: lldb-api :: functionalities/thread/multi_break/TestMultipleBreakpoints.py (1198 of 1935) PASS: lldb-api :: functionalities/inferior-crashing/recursive-inferior/TestRecursiveInferiorStep.py (1199 of 1935) PASS: lldb-api :: functionalities/thread/exit_during_step/TestExitDuringStep.py (1200 of 1935) PASS: lldb-unit :: Host/./HostTests/Host.GetEnvironment (1201 of 1935) PASS: lldb-unit :: UnwindAssembly/x86/./UnwindAssemblyx86Tests/Testx86AssemblyInspectionEngine.TestDisassemblyMidFunctionEpilogues (1202 of 1935) PASS: lldb-api :: functionalities/breakpoint/breakpoint_ids/TestBreakpointIDs.py (1203 of 1935) PASS: lldb-api :: functionalities/data-formatter/data-formatter-globals/TestDataFormatterGlobals.py (1204 of 1935) PASS: lldb-api :: functionalities/data-formatter/data-formatter-synthtype/TestDataFormatterSynthType.py (1205 of 1935) PASS: lldb-unit :: UnwindAssembly/x86/./UnwindAssemblyx86Tests/Testx86AssemblyInspectionEngine.TestSpArithx86_64Augmented (1206 of 1935) PASS: lldb-api :: functionalities/thread/concurrent_events/TestConcurrentTwoBreakpointsOneWatchpoint.py (1207 of 1935) PASS: lldb-unit :: Utility/./UtilityTests/StreamTest.PutCharNull (1208 of 1935) UNSUPPORTED: lldb-api :: python_api/event/TestEvents.py (1209 of 1935) PASS: lldb-api :: functionalities/lazy-loading/TestLazyLoading.py (1210 of 1935) PASS: lldb-unit :: ObjectFile/Breakpad/./ObjectFileBreakpadTests/PublicRecord.parse (1211 of 1935) PASS: lldb-shell :: Breakpoint/debug_rnglistx_rlex.test (1212 of 1935) PASS: lldb-unit :: Core/./LLDBCoreTests/MangledTest.ResultForBlockInvocation (1213 of 1935) PASS: lldb-unit :: Utility/./UtilityTests/AnsiTerminal.Incomplete (1214 of 1935) PASS: lldb-shell :: Reproducer/TestCrash.test (1215 of 1935) PASS: lldb-unit :: Language/Highlighting/./HighlighterTests/HighlighterTest.HighlighterSelectionType (1216 of 1935) PASS: lldb-api :: tools/lldb-server/TestGdbRemote_qThreadStopInfo.py (1217 of 1935) PASS: lldb-shell :: ScriptInterpreter/None/none.test (1218 of 1935) PASS: lldb-api :: lang/cpp/diamond/TestDiamond.py (1219 of 1935) UNSUPPORTED: lldb-shell :: ScriptInterpreter/Lua/independent_state.test (1220 of 1935) PASS: lldb-api :: tools/lldb-server/commandline/TestStubSetSID.py (1221 of 1935) PASS: lldb-api :: commands/watchpoints/hello_watchpoint/TestMyFirstWatchpoint.py (1222 of 1935) PASS: lldb-unit :: Host/./HostTests/FileSystemTest.Resolve (1223 of 1935) PASS: lldb-shell :: ObjectFile/MachO/lc_version_min.yaml (1224 of 1935) PASS: lldb-api :: functionalities/thread/concurrent_events/TestConcurrentDelayWatchBreak.py (1225 of 1935) PASS: lldb-unit :: Utility/./UtilityTests/ArgsTest.TestQuotedTrailingBackslash (1226 of 1935) PASS: lldb-unit :: UnwindAssembly/x86/./UnwindAssemblyx86Tests/Testx86AssemblyInspectionEngine.TestPushExtended (1227 of 1935) PASS: lldb-shell :: ObjectFile/Breakpad/breakpad-identification.test (1228 of 1935) PASS: lldb-api :: lang/objc/foundation/TestRuntimeTypes.py (1229 of 1935) PASS: lldb-api :: python_api/debugger/TestDebuggerAPI.py (1230 of 1935) PASS: lldb-shell :: Reproducer/Functionalities/TestDataFormatter.test (1231 of 1935) PASS: lldb-unit :: Symbol/./SymbolTests/TestClangASTImporter.DeportTypeTagDecl (1232 of 1935) PASS: lldb-api :: commands/command/script/TestCommandScript.py (1233 of 1935) PASS: lldb-unit :: Utility/./UtilityTests/NameMatchesTest.EndsWith (1234 of 1935) PASS: lldb-api :: functionalities/mtc/simple/TestMTCSimple.py (1235 of 1935) PASS: lldb-api :: commands/watchpoints/multiple_threads/TestWatchpointMultipleThreads.py (1236 of 1935) PASS: lldb-unit :: UnwindAssembly/x86/./UnwindAssemblyx86Tests/Testx86AssemblyInspectionEngine.TestPushR14 (1237 of 1935) PASS: lldb-api :: functionalities/set-data/TestSetData.py (1238 of 1935) UNSUPPORTED: lldb-api :: commands/expression/completion-crash-invalid-iterator/TestInvalidIteratorCompletionCrash.py (1239 of 1935) PASS: lldb-unit :: Host/./HostTests/ConnectionFileDescriptorTest.TCPGetURIv4 (1240 of 1935) PASS: lldb-api :: python_api/watchpoint/TestSetWatchpoint.py (1241 of 1935) PASS: lldb-api :: functionalities/thread/concurrent_events/TestConcurrentManyWatchpoints.py (1242 of 1935) PASS: lldb-shell :: SymbolFile/DWARF/find-basic-variable.cpp (1243 of 1935) PASS: lldb-api :: lang/cpp/this/TestCPPThis.py (1244 of 1935) PASS: lldb-api :: tools/lldb-server/TestGdbRemoteExpeditedRegisters.py (1245 of 1935) PASS: lldb-unit :: UnwindAssembly/x86/./UnwindAssemblyx86Tests/Testx86AssemblyInspectionEngine.TestPopR12 (1246 of 1935) PASS: lldb-api :: macosx/indirect_symbol/TestIndirectSymbols.py (1247 of 1935) PASS: lldb-unit :: ScriptInterpreter/Python/./ScriptInterpreterPythonTests/PythonDataObjectsTest.TestOwnedReferences (1248 of 1935) UNSUPPORTED: lldb-api :: functionalities/data-formatter/data-formatter-stl/libstdcpp/vector/TestDataFormatterStdVector.py (1249 of 1935) PASS: lldb-unit :: Utility/./UtilityTests/FileSpecTest.Equal (1250 of 1935) UNSUPPORTED: lldb-api :: benchmarks/expression/TestExpressionCmd.py (1251 of 1935) PASS: lldb-api :: commands/frame/diagnose/array/TestArray.py (1252 of 1935) PASS: lldb-unit :: Utility/./UtilityTests/SerializationRountripTest.SerializeDeserializeCStringArray (1253 of 1935) XFAIL: lldb-shell :: Register/x86-mm-xmm-read.test (1254 of 1935) PASS: lldb-api :: lang/cpp/virtual-overload/TestVirtualOverload.py (1255 of 1935) UNSUPPORTED: lldb-shell :: Unwind/unwind-plan-dwarf-dump.test (1256 of 1935) PASS: lldb-api :: types/TestCharTypeExpr.py (1257 of 1935) PASS: lldb-unit :: Utility/./UtilityTests/BinaryStreamTest.PutULEB128SixBytes (1258 of 1935) PASS: lldb-unit :: Target/./TargetTests/MemoryRegionInfoTest.Formatv (1259 of 1935) PASS: lldb-api :: tools/lldb-server/TestGdbRemoteHostInfo.py (1260 of 1935) PASS: lldb-shell :: SymbolFile/DWARF/find-basic-function.cpp (1261 of 1935) PASS: lldb-shell :: ObjectFile/PECOFF/sections.yaml (1262 of 1935) PASS: lldb-unit :: Language/Highlighting/./HighlighterTests/HighlighterTest.ClangTrailingBackslashBeforeNewline (1263 of 1935) PASS: lldb-api :: python_api/frame/inlines/TestInlinedFrame.py (1264 of 1935) PASS: lldb-unit :: Process/gdb-remote/./ProcessGdbRemoteTests/GDBRemoteClientBaseTest.SendContinueAndInterrupt2PacketBug (1265 of 1935) PASS: lldb-api :: functionalities/tail_call_frames/cross_dso/TestCrossDSOTailCalls.py (1266 of 1935) PASS: lldb-api :: functionalities/data-formatter/nssetsynth/TestNSSetSynthetic.py (1267 of 1935) PASS: lldb-api :: commands/watchpoints/watchpoint_size/TestWatchpointSizes.py (1268 of 1935) PASS: lldb-unit :: UnwindAssembly/x86/./UnwindAssemblyx86Tests/Testx86AssemblyInspectionEngine.TestSpillRegToStackViaMOVx86_64 (1269 of 1935) PASS: lldb-api :: commands/expression/timeout/TestCallWithTimeout.py (1270 of 1935) PASS: lldb-unit :: Utility/./UtilityTests/LogChannelEnabledTest.LogThread (1271 of 1935) PASS: lldb-shell :: Watchpoint/SetErrorCases.test (1272 of 1935) PASS: lldb-unit :: Utility/./UtilityTests/StringExtractorTest.GetHexBytesAvail_Underflow (1273 of 1935) PASS: lldb-api :: functionalities/data-formatter/data-formatter-stl/libstdcpp/unique_ptr/invalid/TestDataFormatterInvalidStdUniquePtr.py (1274 of 1935) UNSUPPORTED: lldb-api :: functionalities/tsan/multiple/TestTsanMultiple.py (1275 of 1935) PASS: lldb-unit :: Utility/./UtilityTests/StreamTeeTest.DefaultConstructor (1276 of 1935) PASS: lldb-shell :: Driver/LocalLLDBInit.test (1277 of 1935) PASS: lldb-unit :: Utility/./UtilityTests/FileSpecTest.EqualDotsWindows (1278 of 1935) PASS: lldb-api :: functionalities/thread/step_out/TestThreadStepOut.py (1279 of 1935) PASS: lldb-unit :: Symbol/./SymbolTests/TestTypeSystemClang.TestFunctionTemplateConstruction (1280 of 1935) PASS: lldb-api :: functionalities/tail_call_frames/inlining_and_tail_calls/TestInliningAndTailCalls.py (1281 of 1935) PASS: lldb-shell :: SymbolFile/DWARF/DW_OP_piece-struct.s (1282 of 1935) PASS: lldb-api :: functionalities/breakpoint/breakpoint_command/TestBreakpointCommandsFromPython.py (1283 of 1935) PASS: lldb-api :: functionalities/unwind/noreturn/TestNoreturnUnwind.py (1284 of 1935) PASS: lldb-shell :: SymbolFile/symbol-binding.test (1285 of 1935) PASS: lldb-unit :: Process/minidump/./LLDBMinidumpTests/MinidumpParserTest.GetMemoryRegionInfoFromMemoryList (1286 of 1935) PASS: lldb-shell :: Host/TestCustomShell.test (1287 of 1935) PASS: lldb-api :: functionalities/data-formatter/data-formatter-stl/libcxx/vector/TestDataFormatterLibcxxVector.py (1288 of 1935) PASS: lldb-api :: lang/objc/modules-incomplete/TestIncompleteModules.py (1289 of 1935) PASS: lldb-unit :: Process/gdb-remote/./ProcessGdbRemoteTests/GDBRemoteCommunicationClientTest.TestPacketSpeedJSON (1290 of 1935) PASS: lldb-api :: tools/lldb-server/TestGdbRemoteKill.py (1291 of 1935) PASS: lldb-api :: lang/objc/objc-optimized/TestObjcOptimized.py (1292 of 1935) PASS: lldb-shell :: Minidump/disassemble-no-module.yaml (1293 of 1935) PASS: lldb-api :: python_api/interpreter/TestCommandInterpreterAPI.py (1294 of 1935) PASS: lldb-unit :: Process/gdb-remote/./ProcessGdbRemoteTests/GDBRemoteCommunicationClientTest.SendStopTracePacket (1295 of 1935) PASS: lldb-unit :: Utility/./UtilityTests/StreamTest.AddressSuffix (1296 of 1935) PASS: lldb-api :: commands/expression/formatters/TestFormatters.py (1297 of 1935) PASS: lldb-shell :: Recognizer/assert.test (1298 of 1935) PASS: lldb-unit :: Utility/./UtilityTests/StringListTest.SplitIntoLinesEmpty (1299 of 1935) UNSUPPORTED: lldb-shell :: SymbolFile/PDB/function-nested-block.test (1300 of 1935) PASS: lldb-api :: commands/disassemble/basic/TestDisassembleBreakpoint.py (1301 of 1935) PASS: lldb-api :: tools/lldb-server/inferior-crash/TestGdbRemoteAbort.py (1302 of 1935) PASS: lldb-unit :: Language/Highlighting/./HighlighterTests/HighlighterTest.HighlighterSelectionPath (1303 of 1935) PASS: lldb-api :: tools/lldb-server/register-reading/TestGdbRemoteGPacket.py (1304 of 1935) PASS: lldb-shell :: SymbolFile/Breakpad/symtab-macho.test (1305 of 1935) PASS: lldb-unit :: Utility/./UtilityTests/BinaryStreamTest.PutULEB128NineBytes (1306 of 1935) PASS: lldb-unit :: Utility/./UtilityTests/StringExtractorTest.GetHexBytesAvail_FullString (1307 of 1935) PASS: lldb-unit :: Utility/./UtilityTests/UriParserTest.SchemeHostSeparator3 (1308 of 1935) PASS: lldb-api :: lang/cpp/llvm-style/TestLLVMStyle.py (1309 of 1935) PASS: lldb-shell :: Settings/TestStopCommandSourceOnError.test (1310 of 1935) PASS: lldb-api :: commands/watchpoints/watchpoint_commands/TestWatchpointCommands.py (1311 of 1935) PASS: lldb-shell :: SymbolFile/NativePDB/globals-fundamental.cpp (1312 of 1935) PASS: lldb-shell :: SymbolFile/DWARF/find-method.cpp (1313 of 1935) PASS: lldb-unit :: Utility/./UtilityTests/Flags.AllSet (1314 of 1935) PASS: lldb-api :: lang/objc/foundation/TestObjCMethods2.py (1315 of 1935) PASS: lldb-unit :: tools/lldb-server/tests/./LLDBServerTests/TestBase.DebugserverEnv (1316 of 1935) PASS: lldb-shell :: Minidump/Windows/broken-unwind.test (1317 of 1935) PASS: lldb-api :: functionalities/recursion/TestValueObjectRecursion.py (1318 of 1935) PASS: lldb-api :: functionalities/gdb_remote_client/TestThreadSelectionBug.py (1319 of 1935) PASS: lldb-api :: functionalities/breakpoint/dummy_target_breakpoints/TestBreakpointsWithNoTargets.py (1320 of 1935) PASS: lldb-unit :: Symbol/./SymbolTests/LineEntryTest.GetSameLineContiguousAddressRangeNoInlines (1321 of 1935) PASS: lldb-unit :: Utility/./UtilityTests/FileSpecTest.FileAndDirectoryComponents (1322 of 1935) PASS: lldb-api :: functionalities/data-formatter/hexcaps/TestDataFormatterHexCaps.py (1323 of 1935) PASS: lldb-unit :: Utility/./UtilityTests/AnsiTerminal.Twice (1324 of 1935) PASS: lldb-unit :: Utility/./UtilityTests/StringListTest.SetSize (1325 of 1935) PASS: lldb-api :: functionalities/step_scripted/TestStepScripted.py (1326 of 1935) PASS: lldb-api :: functionalities/target_var/TestTargetVar.py (1327 of 1935) PASS: lldb-unit :: Utility/./UtilityTests/VMRange.CollectionContains (1328 of 1935) PASS: lldb-shell :: Heap/heap-cstr.test (1329 of 1935) PASS: lldb-api :: commands/watchpoints/watchpoint_set_command/TestWatchLocationWithWatchSet.py (1330 of 1935) PASS: lldb-api :: commands/expression/call-function/TestCallStopAndContinue.py (1331 of 1935) PASS: lldb-unit :: Target/./TargetTests/PathMappingListTest.RemapRoot (1332 of 1935) PASS: lldb-unit :: Utility/./UtilityTests/ArchSpecTest.TestSetTriple (1333 of 1935) PASS: lldb-api :: functionalities/data-formatter/data-formatter-synth/TestDataFormatterSynth.py (1334 of 1935) PASS: lldb-unit :: Host/./HostTests/FileSystemTest.GetPermissions (1335 of 1935) UNSUPPORTED: lldb-api :: iohandler/unicode/TestUnicode.py (1336 of 1935) PASS: lldb-unit :: Symbol/./SymbolTests/TestClangASTImporter.MetadataPropagation (1337 of 1935) PASS: lldb-api :: functionalities/thread/concurrent_events/TestConcurrentCrashWithSignal.py (1338 of 1935) PASS: lldb-unit :: Utility/./UtilityTests/RangeTest.ContainsEndInclusiveInvalid (1339 of 1935) PASS: lldb-unit :: Host/./HostTests/MainLoopTest.ReadObject (1340 of 1935) PASS: lldb-shell :: SymbolFile/DWARF/debug_ranges.s (1341 of 1935) PASS: lldb-unit :: Process/minidump/./LLDBMinidumpTests/MinidumpParserTest.GetThreadsAndGetThreadContext (1342 of 1935) PASS: lldb-api :: commands/expression/import-std-module/empty-module/TestEmptyStdModule.py (1343 of 1935) PASS: lldb-shell :: Reproducer/TestReuseDirectory.test (1344 of 1935) PASS: lldb-unit :: Utility/./UtilityTests/UriParserTest.Minimal (1345 of 1935) PASS: lldb-shell :: Driver/TestNoUseColor.test (1346 of 1935) PASS: lldb-unit :: Utility/./UtilityTests/StringExtractorTest.GetU32BigEndian (1347 of 1935) UNSUPPORTED: lldb-api :: functionalities/thread/thread_specific_break_plus_condition/TestThreadSpecificBpPlusCondition.py (1348 of 1935) PASS: lldb-api :: commands/expression/argument_passing_restrictions/TestArgumentPassingRestrictions.py (1349 of 1935) PASS: lldb-api :: lang/objc/objc-ivar-stripped/TestObjCIvarStripped.py (1350 of 1935) PASS: lldb-api :: functionalities/data-formatter/data-formatter-disabling/TestDataFormatterDisabling.py (1351 of 1935) PASS: lldb-unit :: UnwindAssembly/x86/./UnwindAssemblyx86Tests/Testx86AssemblyInspectionEngine.TestPopEBX (1352 of 1935) PASS: lldb-unit :: Utility/./UtilityTests/OptionsWithRawTest.UnterminatedQuote (1353 of 1935) PASS: lldb-api :: lang/cpp/overloaded-functions/TestOverloadedFunctions.py (1354 of 1935) PASS: lldb-api :: functionalities/thread/concurrent_events/TestConcurrentTwoBreakpointsOneSignal.py (1355 of 1935) UNSUPPORTED: lldb-api :: functionalities/darwin_log/filter/exact_match/category/TestDarwinLogFilterMatchCategory.py (1356 of 1935) PASS: lldb-shell :: ObjectFile/ELF/section-overlap.yaml (1357 of 1935) UNSUPPORTED: lldb-shell :: Breakpoint/ppc64-localentry.test (1358 of 1935) PASS: lldb-unit :: Utility/./UtilityTests/CompletionRequest.TryCompleteCurrentArgBad (1359 of 1935) PASS: lldb-shell :: Driver/TestSingleQuote.test (1360 of 1935) PASS: lldb-unit :: Utility/./UtilityTests/StreamTest.AddressRange (1361 of 1935) PASS: lldb-unit :: Utility/./UtilityTests/ArchSpecTest.TestParseMachCPUDashSubtypeTripleExtra (1362 of 1935) PASS: lldb-unit :: Utility/./UtilityTests/Flags.Clear (1363 of 1935) PASS: lldb-api :: functionalities/thread/concurrent_events/TestConcurrentDelaySignalBreak.py (1364 of 1935) PASS: lldb-unit :: Language/Highlighting/./HighlighterTests/HighlighterTest.ClangCursorOutOfBounds (1365 of 1935) PASS: lldb-api :: functionalities/thread/crash_during_step/TestCrashDuringStep.py (1366 of 1935) PASS: lldb-unit :: Process/minidump/./LLDBMinidumpTests/MinidumpParserTest.GetArchitectureWindows (1367 of 1935) PASS: lldb-unit :: Core/./LLDBCoreTests/UniqueCStringMap.NoDefaultConstructor (1368 of 1935) PASS: lldb-api :: commands/command/delete/TestCommandDelete.py (1369 of 1935) PASS: lldb-unit :: Platform/./LLDBPlatformTests/PlatformDarwinTest.TestParseVersionBuildDir (1370 of 1935) PASS: lldb-api :: commands/expression/persistent_ptr_update/TestPersistentPtrUpdate.py (1371 of 1935) PASS: lldb-shell :: SymbolFile/DWARF/dwarf5-debug_line.s (1372 of 1935) PASS: lldb-api :: lang/objc/blocks/TestObjCIvarsInBlocks.py (1373 of 1935) PASS: lldb-unit :: Utility/./UtilityTests/BinaryStreamTest.PutULEB128FiveBytes (1374 of 1935) PASS: lldb-api :: functionalities/data-formatter/data-formatter-objc/nsstring/TestDataFormatterNSString.py (1375 of 1935) PASS: lldb-unit :: Utility/./UtilityTests/FileSpecTest.GuessPathStyle (1376 of 1935) PASS: lldb-unit :: Utility/./UtilityTests/BinaryStreamTest.PutSLEB128OneByte (1377 of 1935) PASS: lldb-unit :: Symbol/./SymbolTests/TestClangASTImporter.MetadataPropagationAfterCopying (1378 of 1935) PASS: lldb-api :: functionalities/postmortem/minidump/TestMiniDump.py (1379 of 1935) PASS: lldb-shell :: Settings/TestModuleCacheSanity.test (1380 of 1935) UNSUPPORTED: lldb-shell :: SymbolFile/PDB/func-symbols.test (1381 of 1935) PASS: lldb-unit :: Interpreter/./InterpreterTests/OptionArgParserTest.toBoolean (1382 of 1935) PASS: lldb-unit :: Process/gdb-remote/./ProcessGdbRemoteTests/GDBRemoteCommunicationServerTest.SendErrorResponse_ErrorList (1383 of 1935) PASS: lldb-unit :: Utility/./UtilityTests/VMRange.ContainsAddr (1384 of 1935) PASS: lldb-unit :: Utility/./UtilityTests/StringListTest.AppendListCStringArray (1385 of 1935) PASS: lldb-api :: commands/expression/fixits/TestFixIts.py (1386 of 1935) XFAIL: lldb-shell :: Register/x86-64-ymm-write.test (1387 of 1935) PASS: lldb-unit :: Process/minidump/./LLDBMinidumpTests/MinidumpParserTest.MinidumpModuleOrder (1388 of 1935) PASS: lldb-shell :: Commands/command-backtrace.test (1389 of 1935) PASS: lldb-api :: lang/objc/self/TestObjCSelf.py (1390 of 1935) UNSUPPORTED: lldb-api :: benchmarks/frame_variable/TestFrameVariableResponse.py (1391 of 1935) PASS: lldb-api :: python_api/symbol-context/TestSymbolContext.py (1392 of 1935) PASS: lldb-unit :: SymbolFile/NativePDB/./SymbolFileNativePDBTests/PDBFPOProgramToDWARFExpressionTests.InvalidAssignmentSingle (1393 of 1935) PASS: lldb-unit :: Utility/./UtilityTests/RecordReplayTest.InstrumentedBarPtr (1394 of 1935) PASS: lldb-api :: commands/process/attach-resume/TestAttachResume.py (1395 of 1935) PASS: lldb-unit :: Utility/./UtilityTests/StringExtractorTest.GetHexBytesAvail_OddPair2 (1396 of 1935) PASS: lldb-api :: commands/expression/regression-access-function-template-in-record/TestRegressionAccessFunctionTemplateInRecord.py (1397 of 1935) PASS: lldb-api :: tools/lldb-vscode/breakpoint/TestVSCode_setExceptionBreakpoints.py (1398 of 1935) PASS: lldb-api :: python_api/disassemble-raw-data/TestDisassembleRawData.py (1399 of 1935) PASS: lldb-api :: functionalities/thread/concurrent_events/TestConcurrentBreakpointDelayBreakpointOneSignal.py (1400 of 1935) PASS: lldb-api :: commands/expression/unwind_expression/TestUnwindExpression.py (1401 of 1935) PASS: lldb-api :: functionalities/breakpoint/hardware_breakpoints/hardware_breakpoint_on_multiple_threads/TestHWBreakMultiThread.py (1402 of 1935) PASS: lldb-shell :: ObjectFile/ELF/build-id-case.yaml (1403 of 1935) PASS: lldb-unit :: Utility/./UtilityTests/StreamTest.QuotedCString (1404 of 1935) PASS: lldb-unit :: Utility/./UtilityTests/BroadcasterTest.BroadcastEvent (1405 of 1935) PASS: lldb-unit :: Utility/./UtilityTests/UriParserTest.TypicalPortPath (1406 of 1935) PASS: lldb-unit :: Utility/./UtilityTests/ProcessInstanceInfoMatch.Name (1407 of 1935) PASS: lldb-api :: python_api/watchpoint/TestWatchpointIgnoreCount.py (1408 of 1935) PASS: lldb-unit :: Host/./HostTests/SocketTest.TCPListen0GetPort (1409 of 1935) UNSUPPORTED: lldb-shell :: SymbolFile/PDB/ast-restore.test (1410 of 1935) PASS: lldb-shell :: Register/x86-64-read.test (1411 of 1935) PASS: lldb-api :: commands/expression/persistent_types/TestNestedPersistentTypes.py (1412 of 1935) PASS: lldb-api :: lang/cpp/breakpoint_in_member_func_w_non_primitive_params/TestBreakpointInMemberFuncWNonPrimitiveParams.py (1413 of 1935) PASS: lldb-shell :: ObjectFile/ELF/PT_LOAD-overlap-PT_TLS.yaml (1414 of 1935) PASS: lldb-api :: functionalities/unwind/noreturn/module-end/TestNoReturnModuleEnd.py (1415 of 1935) PASS: lldb-api :: functionalities/inferior-crashing/TestInferiorCrashing.py (1416 of 1935) PASS: lldb-api :: lang/cpp/frame-var-anon-unions/TestFrameVariableAnonymousUnions.py (1417 of 1935) PASS: lldb-api :: functionalities/thread/concurrent_events/TestConcurrentWatchpointDelayWatchpointOneBreakpoint.py (1418 of 1935) PASS: lldb-unit :: Process/minidump/./LLDBMinidumpTests/MinidumpParserTest.GetPidWow64 (1419 of 1935) UNSUPPORTED: lldb-api :: functionalities/ubsan/basic/TestUbsanBasic.py (1420 of 1935) PASS: lldb-shell :: SymbolFile/DWARF/split-dwarf-inlining.cpp (1421 of 1935) PASS: lldb-api :: commands/expression/call-function/TestCallStdStringFunction.py (1422 of 1935) PASS: lldb-unit :: Symbol/./SymbolTests/TestTypeSystemClang.TestIsClangType (1423 of 1935) PASS: lldb-shell :: Driver/TestProcessAttach.test (1424 of 1935) PASS: lldb-api :: functionalities/data-formatter/compactvectors/TestCompactVectors.py (1425 of 1935) PASS: lldb-unit :: Utility/./UtilityTests/AnsiTerminal.AtEnd (1426 of 1935) PASS: lldb-api :: functionalities/postmortem/minidump-new/TestMiniDumpUUID.py (1427 of 1935) PASS: lldb-api :: commands/expression/scoped_enums/TestScopedEnumType.py (1428 of 1935) UNSUPPORTED: lldb-shell :: Register/x86-zmm-read.test (1429 of 1935) PASS: lldb-shell :: ObjectFile/PECOFF/symbol.yaml (1430 of 1935) PASS: lldb-unit :: Utility/./UtilityTests/StringListTest.InsertStringAtIndexStart (1431 of 1935) PASS: lldb-api :: lang/c/step-target/TestStepTarget.py (1432 of 1935) PASS: lldb-unit :: Utility/./UtilityTests/FileSpecTest.FormatFileSpec (1433 of 1935) PASS: lldb-unit :: Expression/./ExpressionTests/CppModuleConfigurationTest.UnknownLibCppFile (1434 of 1935) PASS: lldb-unit :: Host/./HostTests/File.GetStreamFromDescriptor (1435 of 1935) PASS: lldb-api :: commands/expression/pr35310/TestExprsBug35310.py (1436 of 1935) PASS: lldb-unit :: Utility/./UtilityTests/StreamTest.PutRawBytesToBigEndian (1437 of 1935) PASS: lldb-unit :: ObjectFile/PECOFF/./ObjectFilePECOFFTests/PECallFrameInfoTest.Chained_eh (1438 of 1935) PASS: lldb-shell :: SymbolFile/Breakpad/unwind-via-stack-win.test (1439 of 1935) PASS: lldb-api :: functionalities/process_group/TestChangeProcessGroup.py (1440 of 1935) PASS: lldb-api :: commands/expression/import-std-module/stack/TestStackFromStdModule.py (1441 of 1935) UNSUPPORTED: lldb-shell :: Register/aarch64-gp-read.test (1442 of 1935) PASS: lldb-shell :: ObjectFile/ELF/section-addresses.yaml (1443 of 1935) PASS: lldb-unit :: Utility/./UtilityTests/ScalarTest.Scalar_512 (1444 of 1935) PASS: lldb-unit :: Host/./HostTests/SocketAddressTest.Set (1445 of 1935) PASS: lldb-api :: types/TestShortType.py (1446 of 1935) PASS: lldb-unit :: Utility/./UtilityTests/StreamTeeTest.GetStreamAtIndexOutOfBounds (1447 of 1935) PASS: lldb-shell :: SymbolFile/DWARF/debug_rnglists-dwo.s (1448 of 1935) PASS: lldb-unit :: Utility/./UtilityTests/GeneratorTest.Get (1449 of 1935) PASS: lldb-shell :: Minidump/dump-all.test (1450 of 1935) PASS: lldb-api :: tools/lldb-server/TestAppleSimulatorOSType.py (1451 of 1935) PASS: lldb-unit :: Utility/./UtilityTests/Predicate.WaitForValueNotEqualTo (1452 of 1935) PASS: lldb-unit :: Utility/./UtilityTests/StreamTest.PutCharWhitespace (1453 of 1935) PASS: lldb-unit :: UnwindAssembly/x86/./UnwindAssemblyx86Tests/Testx86AssemblyInspectionEngine.TestPopR13 (1454 of 1935) PASS: lldb-shell :: Unwind/eh-frame-dwarf-unwind.test (1455 of 1935) PASS: lldb-api :: functionalities/gdb_remote_client/TestJLink6Armv7RegisterDefinition.py (1456 of 1935) PASS: lldb-unit :: Utility/./UtilityTests/StringExtractorTest.InitMisc (1457 of 1935) PASS: lldb-api :: commands/command/script/import/rdar-12586188/TestRdar12586188.py (1458 of 1935) PASS: lldb-api :: functionalities/data-formatter/data-formatter-objc/TestDataFormatterObjCNSData.py (1459 of 1935) PASS: lldb-unit :: Utility/./UtilityTests/ArgsTest.DoubleQuotedItem (1460 of 1935) PASS: lldb-api :: functionalities/gdb_remote_client/TestNestedRegDefinitions.py (1461 of 1935) PASS: lldb-unit :: Utility/./UtilityTests/RangeTest.LessThan (1462 of 1935) PASS: lldb-unit :: Utility/./UtilityTests/ScalarTest.Promotion (1463 of 1935) PASS: lldb-unit :: Utility/./UtilityTests/RangeTest.Union (1464 of 1935) PASS: lldb-unit :: SymbolFile/NativePDB/./SymbolFileNativePDBTests/PDBFPOProgramToDWARFExpressionTests.MissingTargetRegister (1465 of 1935) PASS: lldb-unit :: Expression/./ExpressionTests/CppModuleConfigurationTest.IgnoreLibStdCpp (1466 of 1935) PASS: lldb-shell :: SymbolFile/Breakpad/line-table-missing-file.test (1467 of 1935) UNSUPPORTED: lldb-api :: benchmarks/libcxxmap/TestBenchmarkLibcxxMap.py (1468 of 1935) PASS: lldb-api :: tools/lldb-vscode/breakpoint/TestVSCode_setBreakpoints.py (1469 of 1935) PASS: lldb-unit :: Utility/./UtilityTests/RangeTest.ContainsEndInclusive (1470 of 1935) PASS: lldb-api :: functionalities/thread/concurrent_events/TestConcurrentWatchBreakDelay.py (1471 of 1935) PASS: lldb-unit :: Utility/./UtilityTests/ScalarTest.APIntConstructor (1472 of 1935) PASS: lldb-unit :: Utility/./UtilityTests/LogChannelTest.EnableOptions (1473 of 1935) PASS: lldb-unit :: Target/./TargetTests/MCBasedABI.MapRegisterName (1474 of 1935) PASS: lldb-unit :: Target/./TargetTests/ModuleCacheTest.GetAndPut (1475 of 1935) PASS: lldb-api :: sanity/TestModuleCacheSanity.py (1476 of 1935) PASS: lldb-api :: functionalities/data-formatter/data-formatter-enum-format/TestDataFormatterEnumFormat.py (1477 of 1935) UNSUPPORTED: lldb-shell :: Register/x86-zmm-write.test (1478 of 1935) PASS: lldb-api :: functionalities/data-formatter/data-formatter-cpp/TestDataFormatterCpp.py (1479 of 1935) PASS: lldb-unit :: ScriptInterpreter/Python/./ScriptInterpreterPythonTests/PythonDataObjectsTest.TestPythonDictionaryManipulation (1480 of 1935) PASS: lldb-api :: commands/command/script/import/TestImport.py (1481 of 1935) PASS: lldb-shell :: Expr/TestMultilineExpr.test (1482 of 1935) PASS: lldb-unit :: Process/gdb-remote/./ProcessGdbRemoteTests/GDBRemoteCommunicationServerTest.SendErrorResponse_ErrorNumber (1483 of 1935) PASS: lldb-api :: functionalities/tail_call_frames/unambiguous_sequence/TestUnambiguousTailCalls.py (1484 of 1935) PASS: lldb-unit :: UnwindAssembly/x86/./UnwindAssemblyx86Tests/Testx86AssemblyInspectionEngine.TestSimple32bitFrameFunction (1485 of 1935) UNSUPPORTED: lldb-api :: functionalities/darwin_log/filter/regex/activity-chain/TestDarwinLogFilterRegexActivityChain.py (1486 of 1935) PASS: lldb-api :: commands/expression/diagnostics/TestExprDiagnostics.py (1487 of 1935) PASS: lldb-api :: lang/cpp/nsimport/TestCppNsImport.py (1488 of 1935) PASS: lldb-api :: macosx/add-dsym/TestAddDsymMidExecutionCommand.py (1489 of 1935) PASS: lldb-api :: functionalities/breakpoint/step_over_breakpoint/TestStepOverBreakpoint.py (1490 of 1935) PASS: lldb-shell :: Quit/TestQuitExitCodeImplicit0.test (1491 of 1935) UNSUPPORTED: lldb-api :: functionalities/darwin_log/filter/exact_match/activity-chain/TestDarwinLogFilterMatchActivityChain.py (1492 of 1935) PASS: lldb-unit :: Signals/./SignalsTests/UnixSignalsTest.GetInfo (1493 of 1935) PASS: lldb-shell :: ObjectFile/Breakpad/uuid-matching-mac.test (1494 of 1935) PASS: lldb-api :: functionalities/data-formatter/data-formatter-stl/libcxx/string/TestDataFormatterLibcxxString.py (1495 of 1935) UNSUPPORTED: lldb-api :: lang/objc/bitfield_ivars/TestBitfieldIvars.py (1496 of 1935) PASS: lldb-shell :: Commands/command-breakpoint-col.test (1497 of 1935) PASS: lldb-api :: lang/cpp/const_this/TestConstThis.py (1498 of 1935) PASS: lldb-api :: python_api/findvalue_duplist/TestSBFrameFindValue.py (1499 of 1935) PASS: lldb-shell :: ObjectFile/ELF/gnu-debuglink.yaml (1500 of 1935) PASS: lldb-unit :: Target/./TargetTests/PathMappingListTest.RelativeTests (1501 of 1935) UNSUPPORTED: lldb-shell :: SymbolFile/PDB/calling-conventions.test (1502 of 1935) PASS: lldb-api :: commands/expression/import_builtin_fileid/TestImportBuiltinFileID.py (1503 of 1935) PASS: lldb-api :: lang/mixed/TestMixedLanguages.py (1504 of 1935) PASS: lldb-unit :: Language/Highlighting/./HighlighterTests/HighlighterTest.ClangUnterminatedString (1505 of 1935) PASS: lldb-api :: python_api/lldbutil/TestSwigVersion.py (1506 of 1935) PASS: lldb-unit :: Utility/./UtilityTests/StringLexerTest.NextIfList (1507 of 1935) PASS: lldb-unit :: UnwindAssembly/x86/./UnwindAssemblyx86Tests/Testx86AssemblyInspectionEngine.TestPopRBX (1508 of 1935) PASS: lldb-api :: python_api/breakpoint/TestBreakpointAPI.py (1509 of 1935) PASS: lldb-unit :: Process/gdb-remote/./ProcessGdbRemoteTests/GDBRemoteClientBaseTest.SendContinueAndAsyncSignal (1510 of 1935) PASS: lldb-unit :: Utility/./UtilityTests/StringExtractorTest.GetNameColonValueSuccess (1511 of 1935) PASS: lldb-api :: lang/objc/modules-inline-functions/TestModulesInlineFunctions.py (1512 of 1935) PASS: lldb-api :: python_api/watchpoint/TestWatchpointIter.py (1513 of 1935) PASS: lldb-unit :: Symbol/./SymbolTests/TestTypeSystemClang.TestGetTypeClassDeclType (1514 of 1935) PASS: lldb-shell :: SymbolFile/Breakpad/symtab.test (1515 of 1935) PASS: lldb-api :: functionalities/thread/backtrace_limit/TestBacktraceLimit.py (1516 of 1935) UNSUPPORTED: lldb-shell :: SymbolFile/NativePDB/stack_unwinding01.cpp (1517 of 1935) PASS: lldb-unit :: Utility/./UtilityTests/BinaryStreamTest.PutSLEB128Zero (1518 of 1935) PASS: lldb-unit :: Process/gdb-remote/./ProcessGdbRemoteTests/GDBRemoteClientBaseTest.SendContinueDelegateStructuredDataReceipt (1519 of 1935) UNSUPPORTED: lldb-api :: tools/lldb-server/signal-filtering/TestGdbRemote_QPassSignals.py (1520 of 1935) PASS: lldb-unit :: ScriptInterpreter/Python/./ScriptInterpreterPythonTests/PythonDataObjectsTest.TestPythonByteArray (1521 of 1935) PASS: lldb-api :: commands/expression/call-function/TestCallUserDefinedFunction.py (1522 of 1935) UNSUPPORTED: lldb-shell :: Register/x86-gp-read.test (1523 of 1935) PASS: lldb-unit :: Process/minidump/./LLDBMinidumpTests/MinidumpParserTest.GetThreadContext_x86_64 (1524 of 1935) PASS: lldb-shell :: Reproducer/Functionalities/TestStepping.test (1525 of 1935) PASS: lldb-api :: functionalities/data-formatter/data-formatter-objc/TestDataFormatterObjCPlain.py (1526 of 1935) PASS: lldb-unit :: Target/./TargetTests/PathMappingListTest.AbsoluteTests (1527 of 1935) PASS: lldb-unit :: Utility/./UtilityTests/OptionsWithRawTest.EmptySuffix (1528 of 1935) PASS: lldb-unit :: Utility/./UtilityTests/StringExtractorTest.DecodeHexU8_InvalidHex (1529 of 1935) PASS: lldb-shell :: SymbolFile/DWARF/debug-types-address-ranges.s (1530 of 1935) PASS: lldb-unit :: Utility/./UtilityTests/OptionsWithRawTest.QuotedSuffix (1531 of 1935) UNSUPPORTED: lldb-api :: commands/expression/call-restarts/TestCallThatRestarts.py (1532 of 1935) PASS: lldb-unit :: Language/Highlighting/./HighlighterTests/HighlighterTest.ClangScalarLiterals (1533 of 1935) PASS: lldb-unit :: SymbolFile/NativePDB/./SymbolFileNativePDBTests/PDBFPOProgramToDWARFExpressionTests.UnknownOp (1534 of 1935) PASS: lldb-api :: functionalities/memory/read/TestMemoryRead.py (1535 of 1935) PASS: lldb-unit :: Symbol/./SymbolTests/TestTypeSystemClang.TestGetEnumIntegerTypeInvalid (1536 of 1935) PASS: lldb-unit :: Utility/./UtilityTests/StringListTest.GetMaxStringLengthMixed (1537 of 1935) UNSUPPORTED: lldb-api :: functionalities/darwin_log/format/TestDarwinLogMessageFormat.py (1538 of 1935) PASS: lldb-unit :: Utility/./UtilityTests/StringExtractorTest.GetHexU8_Underflow (1539 of 1935) PASS: lldb-api :: sample_test/TestSampleInlineTest.py (1540 of 1935) PASS: lldb-shell :: SymbolFile/DWARF/DW_OP_piece-smaller-than-struct.s (1541 of 1935) PASS: lldb-shell :: Driver/TestTarget.test (1542 of 1935) PASS: lldb-api :: lang/c/stepping/TestStepAndBreakpoints.py (1543 of 1935) PASS: lldb-api :: lang/cpp/extern_c/TestExternCSymbols.py (1544 of 1935) PASS: lldb-shell :: SymbolFile/DWARF/debug-names-compressed.cpp (1545 of 1935) PASS: lldb-shell :: Unwind/trap_frame_sym_ctx.test (1546 of 1935) PASS: lldb-api :: lang/objc/forward-decl/TestForwardDecl.py (1547 of 1935) PASS: lldb-api :: commands/expression/issue_11588/Test11588.py (1548 of 1935) PASS: lldb-unit :: SymbolFile/DWARF/./SymbolFileDWARFTests/DWARFASTParserClangTests.EnsureAllDIEsInDeclContextHaveBeenParsedParsesOnlyMatchingEntries (1549 of 1935) PASS: lldb-api :: commands/watchpoints/watchpoint_events/TestWatchpointEvents.py (1550 of 1935) PASS: lldb-api :: lang/c/local_types/TestUseClosestType.py (1551 of 1935) PASS: lldb-unit :: Utility/./UtilityTests/StreamTeeTest.Constructor2Streams (1552 of 1935) UNSUPPORTED: lldb-api :: functionalities/data-formatter/data-formatter-stl/libstdcpp/smart_ptr/TestDataFormatterStdSmartPtr.py (1553 of 1935) PASS: lldb-unit :: Process/gdb-remote/./ProcessGdbRemoteTests/GDBRemoteClientBaseTest.SendContinueAndInterrupt (1554 of 1935) PASS: lldb-shell :: SymbolFile/NativePDB/break-by-function.cpp (1555 of 1935) PASS: lldb-unit :: Symbol/./SymbolTests/TestTypeSystemClang.TestGetTypeClassTypeOfExpr (1556 of 1935) PASS: lldb-api :: commands/expression/dollar-in-variable/TestDollarInVariable.py (1557 of 1935) PASS: lldb-api :: python_api/name_lookup/TestNameLookup.py (1558 of 1935) PASS: lldb-api :: commands/expression/import-std-module/deque-basic/TestDequeFromStdModule.py (1559 of 1935) PASS: lldb-unit :: Utility/./UtilityTests/RangeTest.ContainsRange (1560 of 1935) PASS: lldb-unit :: Utility/./UtilityTests/StringExtractorTest.GetHexU8_Extra_NoEof (1561 of 1935) PASS: lldb-api :: lang/cpp/lambdas/TestLambdas.py (1562 of 1935) PASS: lldb-unit :: Utility/./UtilityTests/SerializationRountripTest.SerializeDeserializeCStringArrayNullptrElem (1563 of 1935) PASS: lldb-unit :: Utility/./UtilityTests/StringExtractorTest.GetU64BigEndian (1564 of 1935) PASS: lldb-unit :: Utility/./UtilityTests/CompletionRequest.FakeLastArg (1565 of 1935) PASS: lldb-api :: functionalities/data-formatter/data-formatter-advanced/TestDataFormatterAdv.py (1566 of 1935) PASS: lldb-unit :: UnwindAssembly/x86/./UnwindAssemblyx86Tests/Testx86AssemblyInspectionEngine.TestPushR12 (1567 of 1935) PASS: lldb-unit :: Language/Highlighting/./HighlighterTests/HighlighterTest.ClangOperators (1568 of 1935) PASS: lldb-api :: macosx/find-app-in-bundle/TestFindAppInBundle.py (1569 of 1935) PASS: lldb-unit :: Utility/./UtilityTests/ArgsTest.ReplaceArgumentAtIndexOutOfRange (1570 of 1935) PASS: lldb-unit :: Utility/./UtilityTests/FileSpecTest.AppendPathComponent (1571 of 1935) PASS: lldb-api :: python_api/symbol-context/two-files/TestSymbolContextTwoFiles.py (1572 of 1935) PASS: lldb-unit :: Utility/./UtilityTests/ArgsTest.TestAppendArg (1573 of 1935) PASS: lldb-api :: lang/c/strings/TestCStrings.py (1574 of 1935) PASS: lldb-unit :: Core/./LLDBCoreTests/RichManglingContextTest.SwitchProvider (1575 of 1935) UNSUPPORTED: lldb-api :: functionalities/thread/state/TestThreadStates.py (1576 of 1935) PASS: lldb-shell :: Quit/TestQuitExitCodeTooManyArgs.test (1577 of 1935) PASS: lldb-api :: functionalities/breakpoint/cpp_exception/TestCPPExceptionBreakpoint.py (1578 of 1935) PASS: lldb-shell :: SymbolFile/DWARF/debug-types-line-tables.s (1579 of 1935) PASS: lldb-shell :: Minidump/Windows/find-module.test (1580 of 1935) UNSUPPORTED: lldb-api :: macosx/macabi/TestMacABImacOSFramework.py (1581 of 1935) UNSUPPORTED: lldb-shell :: SymbolFile/PDB/variables-locations.test (1582 of 1935) PASS: lldb-api :: functionalities/breakpoint/cpp/TestCPPBreakpointLocations.py (1583 of 1935) PASS: lldb-unit :: Utility/./UtilityTests/OptionsWithRawTest.ArgsButNoLeadingDash (1584 of 1935) PASS: lldb-unit :: Utility/./UtilityTests/ArgsTest.TestOverwriteArgs (1585 of 1935) PASS: lldb-unit :: Expression/./ExpressionTests/DiagnosticManagerTest.AppendMessageNoDiag (1586 of 1935) PASS: lldb-api :: commands/expression/dont_allow_jit/TestAllowJIT.py (1587 of 1935) PASS: lldb-unit :: Host/./HostTests/MainLoopTest.TerminatesImmediately (1588 of 1935) PASS: lldb-unit :: Language/Highlighting/./HighlighterTests/HighlighterTest.ClangEmptyInput (1589 of 1935) PASS: lldb-unit :: Utility/./UtilityTests/RangeTest.Equal (1590 of 1935) PASS: lldb-api :: lang/objc/conflicting-definition/TestConflictingDefinition.py (1591 of 1935) PASS: lldb-api :: commands/expression/completion/TestExprCompletion.py (1592 of 1935) PASS: lldb-api :: lang/cpp/auto/TestCPPAuto.py (1593 of 1935) PASS: lldb-api :: lang/objc/modules-update/TestClangModulesUpdate.py (1594 of 1935) PASS: lldb-unit :: Core/./LLDBCoreTests/RichManglingContextTest.IPDRealloc (1595 of 1935) PASS: lldb-unit :: Utility/./UtilityTests/StreamTeeTest.Assignment (1596 of 1935) PASS: lldb-unit :: Utility/./UtilityTests/FileSpecTest.PrependPathComponent (1597 of 1935) PASS: lldb-shell :: SymbolFile/DWARF/find-basic-type.cpp (1598 of 1935) PASS: lldb-api :: lang/objc/objc_direct-methods/TestObjCDirectMethods.py (1599 of 1935) PASS: lldb-unit :: Editline/./EditlineTests/EditlineTestFixture.EditlineReceivesSingleLineText (1600 of 1935) PASS: lldb-api :: commands/expression/class_template_specialization_empty_pack/TestClassTemplateSpecializationParametersHandling.py (1601 of 1935) PASS: lldb-unit :: Utility/./UtilityTests/BinaryStreamTest.PutULEB128EightBytes (1602 of 1935) PASS: lldb-unit :: Core/./LLDBCoreTests/RichManglingContextTest.Basic (1603 of 1935) PASS: lldb-shell :: ObjectFile/PECOFF/invalid-export-table.yaml (1604 of 1935) PASS: lldb-unit :: Process/minidump/./LLDBMinidumpTests/MinidumpParserTest.MinidumpDuplicateModuleMinAddress (1605 of 1935) PASS: lldb-unit :: Symbol/./SymbolTests/TestTypeSystemClang.TemplateArguments (1606 of 1935) PASS: lldb-unit :: Utility/./UtilityTests/StringListTest.ForRangeEmpty (1607 of 1935) PASS: lldb-api :: functionalities/dead-strip/TestDeadStrip.py (1608 of 1935) PASS: lldb-shell :: ObjectFile/ELF/PT_LOAD-empty.yaml (1609 of 1935) PASS: lldb-unit :: Utility/./UtilityTests/FileSpecTest.GetPath (1610 of 1935) PASS: lldb-unit :: Utility/./UtilityTests/StringLexerTest.AdvanceIf (1611 of 1935) PASS: lldb-unit :: Utility/./UtilityTests/LogChannelEnabledTest.LogGetLogThread (1612 of 1935) PASS: lldb-shell :: SymbolFile/DWARF/forward-declarations.s (1613 of 1935) UNSUPPORTED: lldb-api :: commands/gui/basic/TestGuiBasic.py (1614 of 1935) PASS: lldb-unit :: Symbol/./SymbolTests/TestClangASTImporter.CopyDeclTagDecl (1615 of 1935) PASS: lldb-api :: functionalities/optimized_code/TestNoASanExceptionAfterEvalOP_piece.py (1616 of 1935) PASS: lldb-shell :: SymbolFile/DWARF/dir-separator-posix.s (1617 of 1935) PASS: lldb-unit :: Expression/./ExpressionTests/DiagnosticManagerTest.HasFixits (1618 of 1935) PASS: lldb-api :: commands/breakpoint/command/list/TestBreakpointCommandList.py (1619 of 1935) PASS: lldb-api :: commands/frame/diagnose/virtual-method-call/TestDiagnoseDereferenceVirtualMethodCall.py (1620 of 1935) PASS: lldb-api :: functionalities/load_unload/TestLoadUnload.py (1621 of 1935) PASS: lldb-api :: commands/expression/test/TestExprs.py (1622 of 1935) PASS: lldb-unit :: Host/./HostTests/SocketTest.DomainGetConnectURI (1623 of 1935) PASS: lldb-unit :: Utility/./UtilityTests/StreamTest.PutHex8 (1624 of 1935) UNSUPPORTED: lldb-shell :: Register/arm-fp-read.test (1625 of 1935) PASS: lldb-unit :: Utility/./UtilityTests/BinaryStreamTest.PutULEB128Zero (1626 of 1935) PASS: lldb-api :: commands/expression/import-std-module/no-std-module/TestMissingStdModule.py (1627 of 1935) PASS: lldb-unit :: Language/Highlighting/./HighlighterTests/HighlighterTest.ClangCursorPosInOtherToken (1628 of 1935) PASS: lldb-unit :: Host/./HostTests/HostInfoTest.GetAugmentedArchSpec (1629 of 1935) PASS: lldb-unit :: Utility/./UtilityTests/UUIDTest.StringConverion (1630 of 1935) UNSUPPORTED: lldb-api :: functionalities/breakpoint/breakpoint_callback_command_source/TestBreakpointCallbackCommandSource.py (1631 of 1935) PASS: lldb-unit :: Utility/./UtilityTests/ScalarTest.Comparison (1632 of 1935) PASS: lldb-unit :: Process/gdb-remote/./ProcessGdbRemoteTests/GDBRemoteCommunicationClientTest.SendGetDataPacket (1633 of 1935) PASS: lldb-api :: lang/cpp/gmodules/TestWithModuleDebugging.py (1634 of 1935) UNSUPPORTED: lldb-shell :: ScriptInterpreter/Lua/command_script_import.test (1635 of 1935) PASS: lldb-api :: macosx/queues/TestQueues.py (1636 of 1935) PASS: lldb-unit :: Utility/./UtilityTests/StatusTest.Formatv (1637 of 1935) PASS: lldb-api :: functionalities/ptr_refs/TestPtrRefs.py (1638 of 1935) PASS: lldb-unit :: Utility/./UtilityTests/FileSpecTest.EqualDotsPosix (1639 of 1935) PASS: lldb-unit :: Utility/./UtilityTests/ArgsTest.TestSingleArg (1640 of 1935) PASS: lldb-unit :: UnwindAssembly/x86/./UnwindAssemblyx86Tests/Testx86AssemblyInspectionEngine.TestPushEDX (1641 of 1935) PASS: lldb-unit :: ScriptInterpreter/Python/./ScriptInterpreterPythonTests/PythonDataObjectsTest.TestExceptions (1642 of 1935) PASS: lldb-unit :: Utility/./UtilityTests/BinaryStreamTest.PutSLEB128TwoBytes (1643 of 1935) PASS: lldb-unit :: Utility/./UtilityTests/ArgsTest.TestSingleQuotedArgWithSpace (1644 of 1935) PASS: lldb-api :: functionalities/thread/exit_during_break/TestExitDuringBreak.py (1645 of 1935) PASS: lldb-api :: functionalities/data-formatter/data-formatter-ptr-to-array/TestPtrToArrayFormatting.py (1646 of 1935) UNSUPPORTED: lldb-shell :: SymbolFile/dissassemble-entry-point.s (1647 of 1935) PASS: lldb-unit :: ScriptInterpreter/Python/./ScriptInterpreterPythonTests/PythonDataObjectsTest.TestPythonTupleInitializerList2 (1648 of 1935) PASS: lldb-unit :: Utility/./UtilityTests/StreamTest.PutNHex8 (1649 of 1935) PASS: lldb-api :: python_api/class_members/TestSBTypeClassMembers.py (1650 of 1935) PASS: lldb-unit :: Utility/./UtilityTests/StreamTest.AddressSize (1651 of 1935) PASS: lldb-api :: functionalities/breakpoint/breakpoint_command/TestRegexpBreakCommand.py (1652 of 1935) PASS: lldb-shell :: ObjectFile/wasm/embedded-debug-sections.yaml (1653 of 1935) PASS: lldb-api :: commands/process/attach/TestProcessAttach.py (1654 of 1935) PASS: lldb-api :: functionalities/data-formatter/ptr_ref_typedef/TestPtrRef2Typedef.py (1655 of 1935) PASS: lldb-api :: lang/cpp/scope/TestCppScope.py (1656 of 1935) PASS: lldb-unit :: Process/gdb-remote/./ProcessGdbRemoteTests/GDBRemoteCommunicationServerTest.SendErrorResponse_Status (1657 of 1935) UNSUPPORTED: lldb-api :: functionalities/tsan/thread_leak/TestTsanThreadLeak.py (1658 of 1935) PASS: lldb-unit :: Host/./HostTests/NativeProcessProtocolTest.ReadMemoryWithoutTrap (1659 of 1935) PASS: lldb-unit :: Utility/./UtilityTests/StringListTest.AppendStringMove (1660 of 1935) PASS: lldb-unit :: Utility/./UtilityTests/StringLexerTest.PutBack (1661 of 1935) PASS: lldb-api :: python_api/lldbutil/iter/TestLLDBIterator.py (1662 of 1935) PASS: lldb-api :: functionalities/pre_run_dylibs/TestPreRunDylibs.py (1663 of 1935) PASS: lldb-api :: functionalities/data-formatter/data-formatter-stl/libcxx/multimap/TestDataFormatterLibccMultiMap.py (1664 of 1935) PASS: lldb-api :: commands/expression/persist_objc_pointeetype/TestPersistObjCPointeeType.py (1665 of 1935) PASS: lldb-unit :: Utility/./UtilityTests/AnsiTerminal.Unknown (1666 of 1935) PASS: lldb-unit :: Utility/./UtilityTests/StructuredDataTest.StringDump (1667 of 1935) PASS: lldb-api :: functionalities/memory-region/TestMemoryRegion.py (1668 of 1935) PASS: lldb-shell :: SymbolFile/DWARF/dwarf5_locations.s (1669 of 1935) PASS: lldb-shell :: ScriptInterpreter/Python/crashlog.test (1670 of 1935) PASS: lldb-api :: commands/expression/ir-interpreter/TestIRInterpreter.py (1671 of 1935) PASS: lldb-unit :: ScriptInterpreter/Python/./ScriptInterpreterPythonTests/PythonDataObjectsTest.TestModuleNameResolutionNoDot (1672 of 1935) PASS: lldb-api :: functionalities/breakpoint/auto_continue/TestBreakpointAutoContinue.py (1673 of 1935) PASS: lldb-unit :: Host/./HostTests/FileSystemTest.GetByteSize (1674 of 1935) PASS: lldb-api :: functionalities/data-formatter/data-formatter-stl/libcxx/tuple/TestDataFormatterLibcxxTuple.py (1675 of 1935) PASS: lldb-api :: tools/lldb-vscode/launch/TestVSCode_launch.py (1676 of 1935) PASS: lldb-unit :: Utility/./UtilityTests/StringExtractorTest.InitEmpty (1677 of 1935) PASS: lldb-api :: lang/objc/foundation/TestObjCMethodsString.py (1678 of 1935) PASS: lldb-shell :: SymbolFile/DWARF/win-i386-line-table.s (1679 of 1935) PASS: lldb-api :: functionalities/breakpoint/consecutive_breakpoints/TestConsecutiveBreakpoints.py (1680 of 1935) PASS: lldb-api :: functionalities/thread/concurrent_events/TestConcurrentWatchpointWithDelayWatchpointThreads.py (1681 of 1935) PASS: lldb-api :: commands/watchpoints/watchpoint_disable/TestWatchpointDisable.py (1682 of 1935) PASS: lldb-api :: functionalities/breakpoint/breakpoint_set_restart/TestBreakpointSetRestart.py (1683 of 1935) PASS: lldb-api :: commands/expression/completion-crash-incomplete-record/TestCompletionCrashIncompleteRecord.py (1684 of 1935) UNSUPPORTED: lldb-shell :: SymbolFile/PDB/expressions.test (1685 of 1935) PASS: lldb-unit :: UnwindAssembly/x86/./UnwindAssemblyx86Tests/Testx86AssemblyInspectionEngine.TestMovRSPtoRBP (1686 of 1935) PASS: lldb-api :: python_api/section/TestSectionAPI.py (1687 of 1935) PASS: lldb-unit :: UnwindAssembly/x86/./UnwindAssemblyx86Tests/Testx86AssemblyInspectionEngine.TestLEAVE (1688 of 1935) PASS: lldb-unit :: Utility/./UtilityTests/BinaryStreamTest.PutSLEB128FourBytes (1689 of 1935) PASS: lldb-unit :: SymbolFile/NativePDB/./SymbolFileNativePDBTests/PDBFPOProgramToDWARFExpressionTests.UnresolvedDependentCyclicRegisterAssignmentReference (1690 of 1935) PASS: lldb-shell :: SymbolFile/NativePDB/tag-types.cpp (1691 of 1935) UNSUPPORTED: lldb-api :: functionalities/tsan/global_location/TestTsanGlobalLocation.py (1692 of 1935) PASS: lldb-api :: lang/objc/foundation/TestSymbolTable.py (1693 of 1935) PASS: lldb-api :: lang/objc/print-obj/TestPrintObj.py (1694 of 1935) PASS: lldb-unit :: Process/minidump/./LLDBMinidumpTests/MinidumpParserTest.GetMiscInfoWindows (1695 of 1935) PASS: lldb-unit :: Expression/./ExpressionTests/ClangHostTest.ComputeClangResourceDirectory (1696 of 1935) PASS: lldb-api :: commands/expression/static-initializers/TestStaticInitializers.py (1697 of 1935) PASS: lldb-api :: lang/cpp/symbols/TestSymbols.py (1698 of 1935) PASS: lldb-shell :: Driver/TestCore.test (1699 of 1935) PASS: lldb-api :: commands/expression/radar_8638051/Test8638051.py (1700 of 1935) UNSUPPORTED: lldb-api :: iohandler/completion/TestIOHandlerCompletion.py (1701 of 1935) PASS: lldb-unit :: Process/gdb-remote/./ProcessGdbRemoteTests/GDBRemoteCommunicationClientTest.WriteRegisterNoSuffix (1702 of 1935) PASS: lldb-unit :: Expression/./ExpressionTests/CppModuleConfigurationTest.UnrelatedLibrary (1703 of 1935) PASS: lldb-shell :: SymbolFile/DWARF/find-variable-dwo.cpp (1704 of 1935) PASS: lldb-unit :: Utility/./UtilityTests/NameMatchesTest.RegularExpression (1705 of 1935) PASS: lldb-api :: lang/c/bitfields/TestBitfields.py (1706 of 1935) PASS: lldb-api :: lang/objc/objc-new-syntax/TestObjCNewSyntaxLiteral.py (1707 of 1935) PASS: lldb-api :: commands/expression/expr-in-syscall/TestExpressionInSyscall.py (1708 of 1935) PASS: lldb-unit :: Utility/./UtilityTests/StreamTest.PutCStringWithStringRef (1709 of 1935) UNSUPPORTED: lldb-shell :: SymbolFile/PDB/enums-layout.test (1710 of 1935) PASS: lldb-api :: functionalities/postmortem/elf-core/thread_crash/TestLinuxCoreThreads.py (1711 of 1935) PASS: lldb-unit :: Utility/./UtilityTests/StringListTest.CopyListSingle (1712 of 1935) PASS: lldb-api :: lang/cpp/signed_types/TestSignedTypes.py (1713 of 1935) PASS: lldb-api :: python_api/function_symbol/TestSymbolAPI.py (1714 of 1935) PASS: lldb-unit :: Utility/./UtilityTests/RangeTest.NotEqual (1715 of 1935) PASS: lldb-api :: functionalities/data-formatter/data-formatter-skip-summary/TestDataFormatterSkipSummary.py (1716 of 1935) PASS: lldb-unit :: Process/minidump/./LLDBMinidumpTests/MinidumpParserTest.GetArchitecture (1717 of 1935) PASS: lldb-unit :: SymbolFile/DWARF/./SymbolFileDWARFTests/SymbolFileDWARFTests.TestAbbrevValidAttrNullForm (1718 of 1935) PASS: lldb-shell :: SymbolFile/DWARF/DW_AT_loclists_base.s (1719 of 1935) PASS: lldb-shell :: SymbolFile/NativePDB/function-types-builtins.cpp (1720 of 1935) PASS: lldb-api :: commands/expression/calculator_mode/TestCalculatorMode.py (1721 of 1935) PASS: lldb-unit :: Utility/./UtilityTests/StreamTeeTest.SetStreamAtIndexOutOfBounds (1722 of 1935) PASS: lldb-api :: python_api/hello_world/TestHelloWorld.py (1723 of 1935) PASS: lldb-api :: functionalities/thread/concurrent_events/TestConcurrentTwoWatchpointsOneBreakpoint.py (1724 of 1935) PASS: lldb-unit :: UnwindAssembly/x86/./UnwindAssemblyx86Tests/Testx86AssemblyInspectionEngine.TestPushEBP (1725 of 1935) PASS: lldb-shell :: SymbolFile/DWARF/debug_ranges-missing-section.s (1726 of 1935) PASS: lldb-unit :: Editline/./EditlineTests/EditlineTestFixture.EditlineReceivesMultiLineText (1727 of 1935) PASS: lldb-unit :: Utility/./UtilityTests/StreamTeeTest.AppendStream (1728 of 1935) PASS: lldb-shell :: SymbolFile/DWARF/debug_line-relative_path.s (1729 of 1935) PASS: lldb-api :: functionalities/inferior-changed/TestInferiorChanged.py (1730 of 1935) PASS: lldb-unit :: Utility/./UtilityTests/ConstStringTest.CompareStringRef (1731 of 1935) PASS: lldb-unit :: UnwindAssembly/x86/./UnwindAssemblyx86Tests/Testx86AssemblyInspectionEngine.TestPopR15 (1732 of 1935) PASS: lldb-api :: functionalities/inline-stepping/TestInlineStepping.py (1733 of 1935) PASS: lldb-shell :: Settings/TestSettingsSet.test (1734 of 1935) PASS: lldb-api :: functionalities/data-formatter/data-formatter-objc/TestDataFormatterObjCKVO.py (1735 of 1935) UNSUPPORTED: lldb-shell :: Register/x86-64-ymm16-read.test (1736 of 1935) PASS: lldb-unit :: Utility/./UtilityTests/StringExtractorTest.GetHexBytes (1737 of 1935) PASS: lldb-unit :: Process/gdb-remote/./ProcessGdbRemoteTests/GDBRemoteCommunicationClientTest.GetModulesInfo (1738 of 1935) PASS: lldb-unit :: SymbolFile/DWARF/./SymbolFileDWARFTests/SymbolFileDWARFTests.TestAbbrevOutOfOrder (1739 of 1935) PASS: lldb-api :: functionalities/data-formatter/data-formatter-stl/libcxx/list/loop/TestDataFormatterLibcxxListLoop.py (1740 of 1935) PASS: lldb-api :: functionalities/tail_call_frames/disambiguate_call_site/TestDisambiguateCallSite.py (1741 of 1935) PASS: lldb-unit :: ScriptInterpreter/Python/./ScriptInterpreterPythonTests/PythonDataObjectsTest.TestPythonIntegerToStructuredInteger (1742 of 1935) PASS: lldb-unit :: Utility/./UtilityTests/StringExtractorTest.GetNameColonValueContainsColon (1743 of 1935) PASS: lldb-api :: functionalities/non-overlapping-index-variable-i/TestIndexVariable.py (1744 of 1935) PASS: lldb-api :: functionalities/thread/concurrent_events/TestConcurrentDelayedCrashWithBreakpointSignal.py (1745 of 1935) PASS: lldb-unit :: Utility/./UtilityTests/StringListTest.LongestCommonPrefixEmpty (1746 of 1935) PASS: lldb-shell :: Settings/TestFrameFormatNoColor.test (1747 of 1935) PASS: lldb-api :: python_api/sbdata/TestSBData.py (1748 of 1935) PASS: lldb-shell :: SymbolFile/DWARF/debug-types-basic.test (1749 of 1935) PASS: lldb-api :: functionalities/data-formatter/data-formatter-stl/libcxx/queue/TestDataFormatterLibcxxQueue.py (1750 of 1935) PASS: lldb-unit :: Symbol/./SymbolTests/TestTypeSystemClang.TestUnifyAccessSpecifiers (1751 of 1935) PASS: lldb-unit :: Utility/./UtilityTests/VMRange.ContainsRange (1752 of 1935) PASS: lldb-api :: lang/cpp/unsigned_types/TestUnsignedTypes.py (1753 of 1935) PASS: lldb-shell :: SymbolFile/NativePDB/function-types-calling-conv.cpp (1754 of 1935) PASS: lldb-api :: functionalities/data-formatter/data-formatter-objc/TestDataFormatterObjCNSContainer.py (1755 of 1935) PASS: lldb-unit :: Utility/./UtilityTests/StringListTest.RemoveBlankLines (1756 of 1935) PASS: lldb-unit :: Language/Highlighting/./HighlighterTests/HighlighterTest.ClangCursorPos (1757 of 1935) PASS: lldb-api :: functionalities/thread/concurrent_events/TestConcurrentSignalWatchBreak.py (1758 of 1935) PASS: lldb-unit :: Utility/./UtilityTests/VMRange.Reset (1759 of 1935) PASS: lldb-api :: macosx/thread_suspend/TestInternalThreadSuspension.py (1760 of 1935) PASS: lldb-shell :: Commands/command-source.test (1761 of 1935) PASS: lldb-unit :: Utility/./UtilityTests/Predicate.WaitForValueEqualTo (1762 of 1935) PASS: lldb-shell :: SymbolFile/DWARF/debug_loclists-dwo.s (1763 of 1935) PASS: lldb-api :: lang/objc/ptr_refs/TestPtrRefsObjC.py (1764 of 1935) PASS: lldb-api :: python_api/value/linked_list/TestValueAPILinkedList.py (1765 of 1935) UNSUPPORTED: lldb-api :: commands/register/register/intel_xtended_registers/mpx_offset_intersection/TestMPXOffsetIntersection.py (1766 of 1935) PASS: lldb-api :: lang/cpp/virtual-functions/TestCppVirtualFunctions.py (1767 of 1935) PASS: lldb-unit :: debugserver/./debugserverTests/RNBSocket.AnyListen (1768 of 1935) PASS: lldb-unit :: Expression/./ExpressionTests/DiagnosticManagerTest.PutString (1769 of 1935) PASS: lldb-unit :: Utility/./UtilityTests/StreamTeeTest.SetStreamAtIndexOverwrite (1770 of 1935) PASS: lldb-api :: commands/expression/unicode-in-variable/TestUnicodeInVariable.py (1771 of 1935) PASS: lldb-unit :: Process/gdb-remote/./ProcessGdbRemoteTests/GDBRemoteCommunicationClientTest.SendGetTraceConfigPacket (1772 of 1935) PASS: lldb-api :: lang/c/blocks/TestBlocks.py (1773 of 1935) UNSUPPORTED: lldb-shell :: SymbolFile/NativePDB/local-variables.cpp (1774 of 1935) PASS: lldb-shell :: ObjectFile/ELF/section-types-edgecases.yaml (1775 of 1935) PASS: lldb-unit :: Language/Highlighting/./HighlighterTests/HighlighterTest.ClangCursorPosBeforeOtherToken (1776 of 1935) PASS: lldb-unit :: Utility/./UtilityTests/ArchSpecTest.MergeFrom (1777 of 1935) PASS: lldb-unit :: Utility/./UtilityTests/Flags.GetBitSize (1778 of 1935) PASS: lldb-api :: macosx/nslog/TestDarwinNSLogOutput.py (1779 of 1935) PASS: lldb-api :: lang/objc/objc-checker/TestObjCCheckers.py (1780 of 1935) PASS: lldb-unit :: ScriptInterpreter/Python/./ScriptInterpreterPythonTests/PythonDataObjectsTest.TestRun (1781 of 1935) PASS: lldb-unit :: ScriptInterpreter/Python/./ScriptInterpreterPythonTests/PythonDataObjectsTest.TestDictionaryResolutionWithDot (1782 of 1935) PASS: lldb-shell :: Quit/TestQuitExitCode0.test (1783 of 1935) PASS: lldb-unit :: Utility/./UtilityTests/RecordReplayTest.InstrumentedBarRef (1784 of 1935) PASS: lldb-unit :: Utility/./UtilityTests/StringExtractorTest.DecodeHexU8_Underflow (1785 of 1935) PASS: lldb-unit :: Utility/./UtilityTests/CompletionRequest.DuplicateFilteringWithComments (1786 of 1935) PASS: lldb-api :: macosx/duplicate-archive-members/TestDuplicateMembers.py (1787 of 1935) PASS: lldb-unit :: Utility/./UtilityTests/StringExtractorTest.GetHexU8_Exact (1788 of 1935) PASS: lldb-unit :: Language/Highlighting/./HighlighterTests/HighlighterTest.DefaultHighlighter (1789 of 1935) PASS: lldb-api :: functionalities/data-formatter/data-formatter-stl/libcxx/initializerlist/TestInitializerList.py (1790 of 1935) PASS: lldb-api :: python_api/sbstructureddata/TestStructuredDataAPI.py (1791 of 1935) PASS: lldb-unit :: UnwindAssembly/x86/./UnwindAssemblyx86Tests/Testx86AssemblyInspectionEngine.TestPushEDI (1792 of 1935) PASS: lldb-unit :: Utility/./UtilityTests/UriParserTest.BracketedHostnameWithColon (1793 of 1935) PASS: lldb-api :: functionalities/data-formatter/data-formatter-objc/TestDataFormatterObjCCF.py (1794 of 1935) PASS: lldb-unit :: ScriptInterpreter/Python/./ScriptInterpreterPythonTests/PythonDataObjectsTest.TestResetting (1795 of 1935) PASS: lldb-unit :: Utility/./UtilityTests/ArgsTest.GetQuotedCommandString (1796 of 1935) PASS: lldb-unit :: Utility/./UtilityTests/StreamTest.PutChar (1797 of 1935) PASS: lldb-unit :: Host/./HostTests/SocketAddressTest.GetAddressInfo (1798 of 1935) PASS: lldb-api :: lang/objc/objc-struct-argument/TestObjCStructArgument.py (1799 of 1935) UNSUPPORTED: lldb-shell :: SymbolFile/PDB/type-quals.test (1800 of 1935) PASS: lldb-api :: functionalities/multiword-commands/TestMultiWordCommands.py (1801 of 1935) PASS: lldb-shell :: ScriptInterpreter/Python/scripted_breakpoint.test (1802 of 1935) PASS: lldb-api :: functionalities/data-formatter/data-formatter-stl/libcxx/bitset/TestDataFormatterLibcxxBitset.py (1803 of 1935) PASS: lldb-shell :: SymbolFile/DWARF/DW_AT_low_pc-addrx.s (1804 of 1935) PASS: lldb-unit :: Symbol/./SymbolTests/TestTypeSystemClang.TestGetBasicTypeFromName (1805 of 1935) PASS: lldb-unit :: Utility/./UtilityTests/OptionsWithRawTest.EmptyArgsOnlySuffix (1806 of 1935) PASS: lldb-api :: functionalities/data-formatter/nsdictionarysynth/TestNSDictionarySynthetic.py (1807 of 1935) PASS: lldb-unit :: Utility/./UtilityTests/ArgsTest.TestInsertArg (1808 of 1935) PASS: lldb-unit :: Utility/./UtilityTests/RangeTest.ContainsRangeStartingFromZero (1809 of 1935) PASS: lldb-unit :: Utility/./UtilityTests/StreamTeeTest.Write (1810 of 1935) PASS: lldb-unit :: Utility/./UtilityTests/ListenerTest.GetEventImmediate (1811 of 1935) PASS: lldb-api :: lang/cpp/incomplete-types/TestCppIncompleteTypes.py (1812 of 1935) PASS: lldb-api :: functionalities/postmortem/elf-core/gcore/TestGCore.py (1813 of 1935) PASS: lldb-unit :: Utility/./UtilityTests/FileSpecTest.EqualDotsPosixRoot (1814 of 1935) PASS: lldb-api :: functionalities/breakpoint/breakpoint_language/TestBreakpointLanguage.py (1815 of 1935) PASS: lldb-shell :: ObjectFile/PECOFF/basic-info-arm.yaml (1816 of 1935) PASS: lldb-unit :: Utility/./UtilityTests/TildeExpressionResolver.ResolveFullPath (1817 of 1935) PASS: lldb-api :: python_api/watchpoint/watchlocation/TestSetWatchlocation.py (1818 of 1935) PASS: lldb-api :: commands/settings/TestSettings.py (1819 of 1935) PASS: lldb-unit :: Utility/./UtilityTests/StringExtractorTest.GetHexU8_Extra (1820 of 1935) PASS: lldb-unit :: Utility/./UtilityTests/StreamTest.PutHex32ByteOrderLittle (1821 of 1935) UNSUPPORTED: lldb-shell :: SymbolFile/PDB/typedefs.test (1822 of 1935) PASS: lldb-unit :: Utility/./UtilityTests/StringListTest.ShiftMove (1823 of 1935) PASS: lldb-unit :: Symbol/./SymbolTests/TestTypeSystemClang.TestGetTypeClassNested (1824 of 1935) UNSUPPORTED: lldb-api :: linux/mix-dwo-and-regular-objects/TestMixedDwarfBinary.py (1825 of 1935) UNSUPPORTED: lldb-api :: functionalities/ubsan/user-expression/TestUbsanUserExpression.py (1826 of 1935) UNSUPPORTED: lldb-api :: functionalities/signal/handle-segv/TestHandleSegv.py (1827 of 1935) PASS: lldb-unit :: Utility/./UtilityTests/RangeTest.SetRangeBase (1828 of 1935) PASS: lldb-api :: lang/objcxx/cxx-bridged-po/TestObjCXXBridgedPO.py (1829 of 1935) PASS: lldb-unit :: Utility/./UtilityTests/StringListTest.LongestCommonPrefixNoPrefix (1830 of 1935) PASS: lldb-unit :: Utility/./UtilityTests/ArgsTest.AppendArguments (1831 of 1935) PASS: lldb-api :: commands/disassemble/basic/TestFrameDisassemble.py (1832 of 1935) PASS: lldb-api :: functionalities/thread/thread_exit/TestThreadExit.py (1833 of 1935) PASS: lldb-unit :: Utility/./UtilityTests/RegularExpression.Match (1834 of 1935) PASS: lldb-api :: types/TestRecursiveTypes.py (1835 of 1935) PASS: lldb-unit :: Utility/./UtilityTests/DataExtractorTest.GetCStrAtEnd (1836 of 1935) PASS: lldb-api :: lang/objc/foundation/TestObjectDescriptionAPI.py (1837 of 1935) PASS: lldb-unit :: Symbol/./SymbolTests/TestTypeSystemClang.TestBuiltinTypeForEncodingAndBitSize (1838 of 1935) PASS: lldb-unit :: Expression/./ExpressionTests/CppModuleConfigurationTest.Xcode (1839 of 1935) PASS: lldb-api :: commands/command/history/TestCommandHistory.py (1840 of 1935) PASS: lldb-unit :: Host/./HostTests/FileSystemTest.FileAndDirectoryComponents (1841 of 1935) PASS: lldb-unit :: Symbol/./SymbolTests/Type.GetTypeScopeAndBasename (1842 of 1935) PASS: lldb-api :: functionalities/data-formatter/nsarraysynth/TestNSArraySynthetic.py (1843 of 1935) PASS: lldb-unit :: Utility/./UtilityTests/ReproducerTest.SetReplay (1844 of 1935) PASS: lldb-unit :: ScriptInterpreter/Python/./ScriptInterpreterPythonTests/PythonDataObjectsTest.TestPythonCallableCheck (1845 of 1935) PASS: lldb-unit :: Utility/./UtilityTests/DataExtractorTest.GetCStrUnterminated (1846 of 1935) PASS: lldb-api :: functionalities/type_lookup/TestTypeLookup.py (1847 of 1935) PASS: lldb-api :: functionalities/data-formatter/poarray/TestPrintObjectArray.py (1848 of 1935) PASS: lldb-shell :: Breakpoint/debug_rnglist_offset_pair.test (1849 of 1935) PASS: lldb-unit :: Utility/./UtilityTests/VMRange.SetEndAddress (1850 of 1935) PASS: lldb-unit :: UnwindAssembly/x86/./UnwindAssemblyx86Tests/Testx86AssemblyInspectionEngine.TestStackRealignMSVC_i386 (1851 of 1935) PASS: lldb-api :: lang/cpp/inlines/TestInlines.py (1852 of 1935) PASS: lldb-shell :: ObjectFile/PECOFF/uuid.yaml (1853 of 1935) PASS: lldb-unit :: UnwindAssembly/x86/./UnwindAssemblyx86Tests/Testx86AssemblyInspectionEngine.TestReturnDetect (1854 of 1935) PASS: lldb-api :: commands/frame/recognizer/TestFrameRecognizer.py (1855 of 1935) PASS: lldb-unit :: Utility/./UtilityTests/ConstStringTest.NullAndEmptyStates (1856 of 1935) PASS: lldb-unit :: Utility/./UtilityTests/AnsiTerminal.WhiteSpace (1857 of 1935) PASS: lldb-unit :: Language/Highlighting/./HighlighterTests/HighlighterTest.ClangStringLiterals (1858 of 1935) PASS: lldb-unit :: Expression/./ExpressionTests/ClangExpressionDeclMapTest.TestUnknownIdentifierLookup (1859 of 1935) PASS: lldb-shell :: ObjectFile/wasm/basic.yaml (1860 of 1935) PASS: lldb-unit :: Utility/./UtilityTests/StringListTest.CopyList (1861 of 1935) PASS: lldb-api :: functionalities/data-formatter/type_summary_list_script/TestTypeSummaryListScript.py (1862 of 1935) PASS: lldb-unit :: Process/minidump/./LLDBMinidumpTests/MinidumpParserTest.GetMiscInfo_no_stream (1863 of 1935) PASS: lldb-api :: commands/frame/diagnose/dereference-function-return/TestDiagnoseDereferenceFunctionReturn.py (1864 of 1935) PASS: lldb-api :: commands/source/info/TestSourceInfo.py (1865 of 1935) PASS: lldb-api :: commands/expression/char/TestExprsChar.py (1866 of 1935) PASS: lldb-unit :: Expression/./ExpressionTests/CppModuleConfigurationTest.MissingUsrInclude (1867 of 1935) UNSUPPORTED: lldb-api :: benchmarks/stepping/TestSteppingSpeed.py (1868 of 1935) PASS: lldb-shell :: Driver/TestConvenienceVariables.test (1869 of 1935) PASS: lldb-api :: functionalities/completion/TestCompletion.py (1870 of 1935) PASS: lldb-api :: functionalities/data-formatter/data-formatter-objc/nsindexpath/TestDataFormatterNSIndexPath.py (1871 of 1935) PASS: lldb-unit :: Utility/./UtilityTests/DataExtractorTest.PeekData (1872 of 1935) PASS: lldb-unit :: Utility/./UtilityTests/Flags.IsClear (1873 of 1935) PASS: lldb-shell :: Commands/command-regex-delete.test (1874 of 1935) PASS: lldb-unit :: Utility/./UtilityTests/SerializationRountripTest.SerializeDeserializePodPointers (1875 of 1935) PASS: lldb-api :: functionalities/step-avoids-no-debug/TestStepNoDebug.py (1876 of 1935) PASS: lldb-unit :: Host/./HostTests/SocketTest.DomainListenConnectAccept (1877 of 1935) PASS: lldb-unit :: Utility/./UtilityTests/BroadcasterTest.EventTypeHasListeners (1878 of 1935) PASS: lldb-api :: functionalities/data-formatter/data-formatter-stl/libcxx/unordered/TestDataFormatterUnordered.py (1879 of 1935) PASS: lldb-api :: functionalities/breakpoint/objc/TestObjCBreakpoints.py (1880 of 1935) PASS: lldb-unit :: Utility/./UtilityTests/OptionsWithRawTest.SingleWordSuffix (1881 of 1935) PASS: lldb-api :: lang/objc/objc-property/TestObjCProperty.py (1882 of 1935) PASS: lldb-unit :: Utility/./UtilityTests/RegularExpression.CopyAssignment (1883 of 1935) PASS: lldb-api :: lang/objc/objc-new-syntax/TestObjCNewSyntaxArray.py (1884 of 1935) UNSUPPORTED: lldb-shell :: ExecControl/StopHook/stop-hook-threads.test (1885 of 1935) PASS: lldb-unit :: SymbolFile/DWARF/./SymbolFileDWARFTests/SymbolFileDWARFTests.TestAbbrevOrder1Start5 (1886 of 1935) PASS: lldb-api :: python_api/sbvalue_persist/TestSBValuePersist.py (1887 of 1935) PASS: lldb-unit :: Utility/./UtilityTests/RangeDataVector.FindEntryThatContains_Overlap (1888 of 1935) PASS: lldb-api :: commands/expression/import-std-module/shared_ptr-dbg-info-content/TestSharedPtrDbgInfoContentFromStdModule.py (1889 of 1935) PASS: lldb-unit :: Host/./HostTests/FileSystemTest.MakeAbsolute (1890 of 1935) PASS: lldb-api :: macosx/lc-note/kern-ver-str/TestKernVerStrLCNOTE.py (1891 of 1935) PASS: lldb-unit :: Utility/./UtilityTests/ConstStringTest.UpdateMangledCounterpart (1892 of 1935) PASS: lldb-api :: python_api/value_var_update/TestValueVarUpdate.py (1893 of 1935) PASS: lldb-api :: commands/expression/import-std-module/forward_list-dbg-info-content/TestDbgInfoContentForwardListFromStdModule.py (1894 of 1935) UNSUPPORTED: lldb-api :: functionalities/darwin_log/filter/exact_match/subsystem/TestDarwinLogFilterMatchSubsystem.py (1895 of 1935) PASS: lldb-api :: lang/objc/global_ptrs/TestGlobalObjects.py (1896 of 1935) PASS: lldb-unit :: Utility/./UtilityTests/StringListTest.LongestCommonPrefix (1897 of 1935) PASS: lldb-api :: python_api/lldbutil/process/TestPrintStackTraces.py (1898 of 1935) PASS: lldb-api :: source-manager/TestSourceManager.py (1899 of 1935) PASS: lldb-unit :: Expression/./ExpressionTests/ClangExpressionDeclMapTest.TestPersistentDeclLookup (1900 of 1935) PASS: lldb-unit :: UnwindAssembly/x86/./UnwindAssemblyx86Tests/Testx86AssemblyInspectionEngine.Test64bitFramelessBigStackFrame (1901 of 1935) PASS: lldb-unit :: Utility/./UtilityTests/BinaryStreamTest.PutULEB128FourBytes (1902 of 1935) PASS: lldb-api :: functionalities/float-display/TestFloatDisplay.py (1903 of 1935) PASS: lldb-api :: lang/c/offsetof/TestOffsetof.py (1904 of 1935) PASS: lldb-api :: commands/target/stop-hooks/TestStopHooks.py (1905 of 1935) PASS: lldb-shell :: ObjectFile/ELF/PT_LOAD-overlap-section.yaml (1906 of 1935) PASS: lldb-shell :: ObjectFile/PECOFF/dep-modules.yaml (1907 of 1935) PASS: lldb-api :: functionalities/data-formatter/data-formatter-objc/TestDataFormatterObjCExpr.py (1908 of 1935) UNSUPPORTED: lldb-shell :: Register/x86-64-zmm-read.test (1909 of 1935) PASS: lldb-api :: macosx/universal/TestUniversal.py (1910 of 1935) PASS: lldb-unit :: Utility/./UtilityTests/StreamTest.PutRawBytesToLittleEndian (1911 of 1935) UNSUPPORTED: lldb-api :: functionalities/tty/TestTerminal.py (1912 of 1935) PASS: lldb-shell :: SymbolFile/Breakpad/line-table.test (1913 of 1935) PASS: lldb-api :: functionalities/plugins/python_os_plugin/TestPythonOSPlugin.py (1914 of 1935) PASS: lldb-api :: commands/expression/inline-namespace/TestInlineNamespace.py (1915 of 1935) PASS: lldb-shell :: SymbolFile/NativePDB/bitfields.cpp (1916 of 1935) PASS: lldb-unit :: Symbol/./SymbolTests/PostfixExpression.ParseFPOProgram (1917 of 1935) PASS: lldb-unit :: Utility/./UtilityTests/ScalarTest.GetValue (1918 of 1935) PASS: lldb-api :: commands/expression/ir-interpreter-phi-nodes/TestIRInterpreterPHINodes.py (1919 of 1935) PASS: lldb-shell :: SymbolFile/DWARF/apple-index-is-used.cpp (1920 of 1935) PASS: lldb-api :: commands/expression/weak_symbols/TestWeakSymbols.py (1921 of 1935) PASS: lldb-unit :: Utility/./UtilityTests/BinaryStreamTest.PutSLEB128SevenBytes (1922 of 1935) PASS: lldb-api :: tools/lldb-server/TestLldbGdbServer.py (1923 of 1935) PASS: lldb-api :: commands/frame/var-scope/TestFrameVariableScope.py (1924 of 1935) PASS: lldb-shell :: Reproducer/TestSynchronous.test (1925 of 1935) PASS: lldb-api :: lang/objcxx/class-name-clash/TestNameClash.py (1926 of 1935) UNSUPPORTED: lldb-api :: benchmarks/startup/TestStartupDelays.py (1927 of 1935) PASS: lldb-api :: lang/cpp/rvalue-references/TestRvalueReferences.py (1928 of 1935) PASS: lldb-shell :: SymbolFile/DWARF/find-inline-method.s (1929 of 1935) UNSUPPORTED: lldb-api :: commands/watchpoints/variable_out_of_scope/TestWatchedVarHitWhenInScope.py (1930 of 1935) PASS: lldb-unit :: Utility/./UtilityTests/StreamTest.AddressEmptyPrefix (1931 of 1935) PASS: lldb-shell :: Commands/command-regex-unalias.test (1932 of 1935) UNSUPPORTED: lldb-api :: functionalities/data-formatter/data-formatter-stl/libstdcpp/unique_ptr/TestDataFormatterStdUniquePtr.py (1933 of 1935) PASS: lldb-api :: lang/objc/foundation/TestObjCMethodsNSError.py (1934 of 1935) PASS: lldb-api :: tools/lldb-server/TestGdbRemoteThreadsInStopReply.py (1935 of 1935)

Hide Details

Testing Time: 4251.64s ******************** Unresolved Tests (1): lldb-api :: functionalities/gdb_remote_client/TestWasm.py

Hide Details

Hide Details

Slowest Tests: -------------------------------------------------------------------------- 83.91s: lldb-api :: lang/objc/objc-super/TestObjCSuper.py 90.80s: lldb-api :: lang/objcxx/hide-runtime-values/TestObjCXXHideRuntimeValues.py 94.29s: lldb-api :: types/TestLongTypes.py 103.34s: lldb-api :: lang/objc/foundation/TestObjCMethodsNSError.py 108.14s: lldb-api :: types/TestIntegerTypeExpr.py 113.16s: lldb-api :: lang/objc/objc-new-syntax/TestObjCNewSyntaxDictionary.py 113.96s: lldb-api :: lang/objc/objc-new-syntax/TestObjCNewSyntaxArray.py 114.71s: lldb-api :: lang/objc/foundation/TestObjCMethodsString.py 120.69s: lldb-api :: tools/lldb-server/TestGdbRemote_qThreadStopInfo.py 129.93s: lldb-api :: types/TestLongTypesExpr.py 136.53s: lldb-api :: lang/objc/exceptions/TestObjCExceptions.py 139.07s: lldb-api :: lang/objc/real-definition/TestRealDefinition.py 148.84s: lldb-api :: lang/objc/objc-new-syntax/TestObjCNewSyntaxLiteral.py 163.25s: lldb-api :: lang/cpp/namespace/TestNamespaceLookup.py 214.28s: lldb-api :: lang/objc/foundation/TestObjCMethods.py 241.12s: lldb-api :: lang/objc/hidden-ivars/TestHiddenIvars.py 246.72s: lldb-api :: tools/lldb-server/TestGdbRemoteThreadsInStopReply.py 251.62s: lldb-api :: api/multithreaded/TestMultithreaded.py 273.40s: lldb-api :: lang/cpp/enum_types/TestCPP11EnumTypes.py 354.35s: lldb-api :: tools/lldb-server/TestLldbGdbServer.py

Hide Details

Tests Times: -------------------------------------------------------------------------- [ Range ] :: [ Percentage ] :: [ Count ] -------------------------------------------------------------------------- [ 0s, 20s) :: [********************************** ] :: [1691/1935] [ 20s, 40s) :: [** ] :: [ 123/1935] [ 40s, 60s) :: [* ] :: [ 73/1935] [ 60s, 80s) :: [ ] :: [ 24/1935] [ 80s,100s) :: [ ] :: [ 7/1935] [100s,120s) :: [ ] :: [ 5/1935] [120s,140s) :: [ ] :: [ 3/1935] [140s,160s) :: [ ] :: [ 2/1935] [160s,180s) :: [ ] :: [ 1/1935] [180s,200s) :: [ ] :: [ 0/1935] [200s,220s) :: [ ] :: [ 1/1935] [220s,240s) :: [ ] :: [ 0/1935] [240s,260s) :: [ ] :: [ 3/1935] [260s,280s) :: [ ] :: [ 1/1935] [280s,300s) :: [ ] :: [ 0/1935] [300s,320s) :: [ ] :: [ 0/1935] [320s,340s) :: [ ] :: [ 0/1935] [340s,360s) :: [ ] :: [ 1/1935] Expected Passes : 1764 Expected Failures : 6 Unsupported Tests : 164 Unresolved Tests : 1 FAILED: tools/lldb/test/CMakeFiles/check-lldb-lit cd /Users/buildslave/jenkins/workspace/lldb-cmake-sanitized/lldb-build/tools/lldb/test && /usr/local/bin/python /Users/buildslave/jenkins/workspace/lldb-cmake-sanitized/lldb-build/./bin/llvm-lit -v --time-tests --shuffle --xunit-xml-output=/Users/buildslave/jenkins/workspace/lldb-cmake-sanitized/test/results.xml -v -j 4 --timeout 1200 /Users/buildslave/jenkins/workspace/lldb-cmake-sanitized/lldb-build/tools/lldb/test ninja: build stopped: subcommand failed. Command failed: Command '['/usr/bin/env', 'TERM=vt100', '/usr/local/bin/ninja', '-v', 'check-lldb']' returned non-zero exit status 1. Command: ['/usr/bin/env', 'TERM=vt100', '/usr/local/bin/ninja', '-v', 'check-lldb'] [Pipeline] } [Pipeline] // timeout [Pipeline] } [Pipeline] // stage [Pipeline] stage [Pipeline] { (Declarative: Post Actions) [Pipeline] scanForIssues No credentials specified [Clang (LLVM based)] Sleeping for 5 seconds due to JENKINS-32191... [Clang (LLVM based)] Parsing console log (workspace: '/Users/buildslave/jenkins/workspace/lldb-cmake-sanitized') > git rev-parse HEAD^{commit} # timeout=10 [Clang (LLVM based)] [-ERROR-] Git blame errors: [Clang (LLVM based)] [-ERROR-] - no blame results for request <llvm-project/lldb/source/Plugins/Language/ObjC/NSDictionary.cpp - [726]>.

Hide Details

[Clang (LLVM based)] [-ERROR-] Git blame errors: [Clang (LLVM based)] [-ERROR-] - no blame results for request <llvm-project/lldb/source/Plugins/Language/ObjC/NSSet.cpp - [516]>.

Hide Details

[Clang (LLVM based)] [-ERROR-] Git blame errors: [Clang (LLVM based)] [-ERROR-] - no blame results for request <llvm-project/lldb/source/Plugins/Language/ObjC/NSArray.cpp - [530, 597]>.

Hide Details

[Clang (LLVM based)] Post processing issues on 'green-dragon-23' with source code encoding 'UTF-8' [Clang (LLVM based)] Resolving absolute file names for all issues in workspace '/Users/buildslave/jenkins/workspace/lldb-cmake-sanitized' [Clang (LLVM based)] -> 0 resolved, 0 unresolved, 3 already resolved [Clang (LLVM based)] Copying affected files to Jenkins' build folder '/Users/Shared/Jenkins/Home/jobs/lldb-cmake-sanitized/builds/965/files-with-issues' [Clang (LLVM based)] -> 3 copied, 0 not in workspace, 0 not-found, 0 with I/O error [Clang (LLVM based)] Resolving module names from module definitions (build.xml, pom.xml, or Manifest.mf files) [Clang (LLVM based)] -> resolved module names for 4 issues [Clang (LLVM based)] Resolving package names (or namespaces) by parsing the affected files [Clang (LLVM based)] -> resolved package names of 3 affected files [Clang (LLVM based)] No filter has been set, publishing all 4 issues [Clang (LLVM based)] Creating fingerprints for all affected code blocks to track issues over different builds [Clang (LLVM based)] -> created fingerprints for 4 issues [Clang (LLVM based)] Invoking Git blamer to create author and commit information for all affected files [Clang (LLVM based)] GIT_COMMIT env = 'HEAD' [Clang (LLVM based)] Git working tree = '/Users/buildslave/jenkins/workspace/lldb-cmake-sanitized' [Clang (LLVM based)] Git commit ID = '3a4296e9c1cdb53e0bf939b244790d257a6d5f26' [Clang (LLVM based)] Job workspace = '/Users/buildslave/jenkins/workspace/lldb-cmake-sanitized' [Clang (LLVM based)] Created blame requests for 3 files - invoking Git blame on agent for each of the requests [Clang (LLVM based)] -> blamed authors of issues in 3 files
[Pipeline] junit Recording test results [Pipeline] } [Pipeline] // stage [Pipeline] } [Pipeline] // withEnv [Pipeline] } [Pipeline] // node [Pipeline] End of Pipeline ERROR: script returned exit code 1 Finished: FAILURE