FailedConsole Output

Skipping 5,465 KB.. Full Log
/StreamTest.Indent (543 of 1935)
PASS: lldb-shell :: ExecControl/StopHook/stop-hook.test (544 of 1935)
PASS: lldb-unit :: UnwindAssembly/x86/./UnwindAssemblyx86Tests/Testx86AssemblyInspectionEngine.TestMovRSPtoRBP (545 of 1935)
PASS: lldb-unit :: Host/./HostTests/Host.WaitStatusFormat (546 of 1935)
PASS: lldb-api :: commands/command/nested_alias/TestNestedAlias.py (547 of 1935)
PASS: lldb-api :: commands/source/info/TestSourceInfo.py (548 of 1935)
PASS: lldb-unit :: Language/Highlighting/./HighlighterTests/HighlighterTest.ClangIdentifiers (549 of 1935)
PASS: lldb-api :: python_api/watchpoint/watchlocation/TestTargetWatchAddress.py (550 of 1935)
PASS: lldb-api :: lang/objc/objc-new-syntax/TestObjCNewSyntaxLiteral.py (551 of 1935)
PASS: lldb-unit :: Utility/./UtilityTests/StringExtractorTest.GetNameColonValueNoColon (552 of 1935)
PASS: lldb-api :: lang/cpp/class-template-parameter-pack/TestClassTemplateParameterPack.py (553 of 1935)
PASS: lldb-unit :: Interpreter/./InterpreterTests/OptionArgParserTest.toScriptLanguage (554 of 1935)
PASS: lldb-unit :: debugserver/./debugserverTests/RNBSocket.LoopBackConnectIPv6 (555 of 1935)
PASS: lldb-api :: functionalities/inline-stepping/TestInlineStepping.py (556 of 1935)
PASS: lldb-shell :: Watchpoint/SetErrorCases.test (557 of 1935)
UNSUPPORTED: lldb-shell :: Minidump/Windows/arm-fp-unwind.test (558 of 1935)
PASS: lldb-api :: lang/objc/foundation/TestObjCMethodsString.py (559 of 1935)
PASS: lldb-api :: commands/frame/diagnose/dereference-argument/TestDiagnoseDereferenceArgument.py (560 of 1935)
PASS: lldb-unit :: Host/./HostTests/Host.GetEnvironment (561 of 1935)
PASS: lldb-api :: functionalities/memory/cache/TestMemoryCache.py (562 of 1935)
PASS: lldb-unit :: Core/./LLDBCoreTests/UniqueCStringMap.NoDefaultConstructor (563 of 1935)
PASS: lldb-unit :: Utility/./UtilityTests/SerializationRountripTest.SerializeDeserializePod (564 of 1935)
PASS: lldb-unit :: Language/Highlighting/./HighlighterTests/HighlighterTest.HighlighterSelectionPath (565 of 1935)
PASS: lldb-api :: macosx/version_zero/TestGetVersionZeroVersion.py (566 of 1935)
PASS: lldb-unit :: Utility/./UtilityTests/EventTest.DumpEventDataBytes (567 of 1935)
PASS: lldb-api :: lang/c/set_values/TestSetValues.py (568 of 1935)
PASS: lldb-unit :: Host/./HostTests/MainLoopTest.TerminatesImmediately (569 of 1935)
PASS: lldb-unit :: UnwindAssembly/x86/./UnwindAssemblyx86Tests/Testx86AssemblyInspectionEngine.TestPopR13 (570 of 1935)
PASS: lldb-unit :: Utility/./UtilityTests/UriParserTest.Empty (571 of 1935)
PASS: lldb-shell :: Breakpoint/case-sensitive.test (572 of 1935)
PASS: lldb-unit :: debugserver/./debugserverTests/JSON.Parse (573 of 1935)
PASS: lldb-unit :: Utility/./UtilityTests/FileSpecTest.EqualDotsPosixRoot (574 of 1935)
PASS: lldb-api :: lang/objc/modules/TestObjCModules.py (575 of 1935)
PASS: lldb-api :: lang/cpp/function_refs/TestFunctionRefs.py (576 of 1935)
PASS: lldb-api :: functionalities/data-formatter/typedef_array/TestTypedefArray.py (577 of 1935)
PASS: lldb-unit :: Target/./TargetTests/PathMappingListTest.RemapRoot (578 of 1935)
PASS: lldb-unit :: Utility/./UtilityTests/StatusTest.Formatv (579 of 1935)
UNSUPPORTED: lldb-api :: functionalities/darwin_log/filter/exact_match/subsystem/TestDarwinLogFilterMatchSubsystem.py (580 of 1935)
PASS: lldb-api :: functionalities/thread/concurrent_events/TestConcurrentTwoBreakpointThreads.py (581 of 1935)
PASS: lldb-api :: lang/cpp/std-function-step-into-callable/TestStdFunctionStepIntoCallable.py (582 of 1935)
PASS: lldb-unit :: Utility/./UtilityTests/ArgsTest.TestAppendArg (583 of 1935)
PASS: lldb-api :: functionalities/inferior-crashing/recursive-inferior/TestRecursiveInferiorStep.py (584 of 1935)
PASS: lldb-api :: functionalities/thread/create_after_attach/TestCreateAfterAttach.py (585 of 1935)
PASS: lldb-shell :: SymbolFile/symbol-binding.test (586 of 1935)
PASS: lldb-api :: lang/cpp/const_this/TestConstThis.py (587 of 1935)
PASS: lldb-api :: functionalities/postmortem/elf-core/TestLinuxCore.py (588 of 1935)
PASS: lldb-api :: functionalities/thread/concurrent_events/TestConcurrentSignalWatch.py (589 of 1935)
PASS: lldb-unit :: Utility/./UtilityTests/RecordReplayTest.InstrumentedBar (590 of 1935)
PASS: lldb-api :: commands/process/attach/attach_denied/TestAttachDenied.py (591 of 1935)
PASS: lldb-unit :: Utility/./UtilityTests/StringListTest.Join (592 of 1935)
PASS: lldb-unit :: ObjectFile/Breakpad/./ObjectFileBreakpadTests/PublicRecord.parse (593 of 1935)
PASS: lldb-shell :: ObjectFile/ELF/netbsd-core-amd64.test (594 of 1935)
UNSUPPORTED: lldb-api :: benchmarks/turnaround/TestCompileRunToBreakpointTurnaround.py (595 of 1935)
PASS: lldb-unit :: Utility/./UtilityTests/DataExtractorTest.GetMaxU64 (596 of 1935)
PASS: lldb-unit :: Utility/./UtilityTests/RegularExpression.Invalid (597 of 1935)
PASS: lldb-unit :: Process/gdb-remote/./ProcessGdbRemoteTests/GDBRemoteCommunicationClientTest.SendGetMetaDataPacket (598 of 1935)
PASS: lldb-unit :: UnwindAssembly/x86/./UnwindAssemblyx86Tests/Testx86AssemblyInspectionEngine.TestPushExtended (599 of 1935)
PASS: lldb-unit :: SymbolFile/NativePDB/./SymbolFileNativePDBTests/PDBFPOProgramToDWARFExpressionTests.UnresolvedCyclicRegisterAssignmentReference (600 of 1935)
PASS: lldb-unit :: Utility/./UtilityTests/StreamTest.PutChar (601 of 1935)
PASS: lldb-api :: functionalities/non-overlapping-index-variable-i/TestIndexVariable.py (602 of 1935)
PASS: lldb-api :: python_api/value_var_update/TestValueVarUpdate.py (603 of 1935)
PASS: lldb-api :: functionalities/thread/concurrent_events/TestConcurrentSignalNWatchNBreak.py (604 of 1935)
PASS: lldb-api :: commands/expression/persistent_types/TestPersistentTypes.py (605 of 1935)
PASS: lldb-unit :: Utility/./UtilityTests/ProcessInstanceInfo.DumpTable_invalidUID (606 of 1935)
UNSUPPORTED: lldb-api :: functionalities/darwin_log/filter/regex/activity-chain/TestDarwinLogFilterRegexActivityChain.py (607 of 1935)
PASS: lldb-api :: lang/cpp/limit-debug-info/TestWithLimitDebugInfo.py (608 of 1935)
PASS: lldb-api :: commands/log/invalid-args/TestInvalidArgsLog.py (609 of 1935)
PASS: lldb-unit :: Process/minidump/./LLDBMinidumpTests/MinidumpParserTest.GetMiscInfo_no_stream (610 of 1935)
PASS: lldb-api :: functionalities/thread/step_until/TestStepUntil.py (611 of 1935)
PASS: lldb-unit :: Utility/./UtilityTests/Flags.Clear (612 of 1935)
UNSUPPORTED: lldb-api :: functionalities/data-formatter/data-formatter-stl/libstdcpp/map/TestDataFormatterStdMap.py (613 of 1935)
PASS: lldb-unit :: Symbol/./SymbolTests/TestTypeSystemClang.TestConvertAccessTypeToAccessSpecifier (614 of 1935)
PASS: lldb-unit :: ObjectFile/Breakpad/./ObjectFileBreakpadTests/FileRecord.parse (615 of 1935)
PASS: lldb-unit :: Utility/./UtilityTests/VMRange.ContainsAddr (616 of 1935)
PASS: lldb-api :: lang/cpp/multiple-inheritance/TestCppMultipleInheritance.py (617 of 1935)
PASS: lldb-api :: types/TestShortTypeExpr.py (618 of 1935)
UNSUPPORTED: lldb-api :: functionalities/darwin_log/source/debug/TestDarwinLogSourceDebug.py (619 of 1935)
PASS: lldb-unit :: Utility/./UtilityTests/FileSpecTest.EqualDotsWindows (620 of 1935)
UNSUPPORTED: lldb-api :: functionalities/darwin_log/filter/exact_match/activity-chain/TestDarwinLogFilterMatchActivityChain.py (621 of 1935)
PASS: lldb-unit :: UnwindAssembly/x86/./UnwindAssemblyx86Tests/Testx86AssemblyInspectionEngine.TestCALLNextInsn (622 of 1935)
XFAIL: lldb-shell :: Register/x86-mm-xmm-write.test (623 of 1935)
PASS: lldb-unit :: UnwindAssembly/x86/./UnwindAssemblyx86Tests/Testx86AssemblyInspectionEngine.TestSimplex86_64Augmented (624 of 1935)
PASS: lldb-unit :: Process/gdb-remote/./ProcessGdbRemoteTests/GDBRemoteCommunicationServerTest.SendErrorResponse_UnimplementedError (625 of 1935)
PASS: lldb-api :: lang/cpp/breakpoint-commands/TestCPPBreakpointCommands.py (626 of 1935)
UNSUPPORTED: lldb-shell :: SymbolFile/NativePDB/local-variables.cpp (627 of 1935)
PASS: lldb-unit :: Utility/./UtilityTests/RegularExpression.CopyAssignment (628 of 1935)
PASS: lldb-api :: functionalities/data-formatter/summary-string-onfail/Test-rdar-9974002.py (629 of 1935)
PASS: lldb-unit :: Language/Highlighting/./HighlighterTests/HighlighterTest.ClangTrailingBackslashBeforeNewline (630 of 1935)
PASS: lldb-unit :: Host/./HostTests/ConnectionFileDescriptorTest.TCPGetURIv6 (631 of 1935)
PASS: lldb-api :: functionalities/breakpoint/global_constructor/TestBreakpointInGlobalConstructor.py (632 of 1935)
PASS: lldb-api :: lang/objc/foundation/TestObjCMethods.py (633 of 1935)
PASS: lldb-api :: lang/objc/objc-foundation-dictionary-empty/TestNSDictionary0.py (634 of 1935)
PASS: lldb-shell :: Expr/TestMultilineExpr.test (635 of 1935)
PASS: lldb-api :: functionalities/step-avoids-no-debug/TestStepNoDebug.py (636 of 1935)
PASS: lldb-unit :: Utility/./UtilityTests/OptionsWithRawTest.SingleWordSuffix (637 of 1935)
UNSUPPORTED: lldb-api :: lang/objc/rdar-12408181/TestRdar12408181.py (638 of 1935)
PASS: lldb-shell :: SymbolFile/DWARF/find-basic-function.cpp (639 of 1935)
PASS: lldb-api :: commands/help/TestHelp.py (640 of 1935)
PASS: lldb-shell :: SymbolFile/Breakpad/unwind-via-raSearch.test (641 of 1935)
PASS: lldb-unit :: Utility/./UtilityTests/StringListTest.InsertStringAtIndexEnd (642 of 1935)
PASS: lldb-api :: lang/objc/modules-hash-mismatch/TestClangModulesHashMismatch.py (643 of 1935)
PASS: lldb-shell :: ObjectFile/Breakpad/sections-trailing-func.test (644 of 1935)
PASS: lldb-shell :: ObjectFile/ELF/PT_LOAD.yaml (645 of 1935)
PASS: lldb-unit :: Host/./HostTests/TaskPoolTest.RunTasks (646 of 1935)
PASS: lldb-shell :: Register/x86-64-read.test (647 of 1935)
PASS: lldb-unit :: Utility/./UtilityTests/OptionsWithRawTest.EmptySuffix (648 of 1935)
PASS: lldb-unit :: Symbol/./SymbolTests/TestTypeSystemClang.TestGetTypeClassDeclType (649 of 1935)
UNSUPPORTED: lldb-shell :: SymbolFile/PDB/compilands.test (650 of 1935)
PASS: lldb-api :: functionalities/show_location/TestShowLocationDwarf5.py (651 of 1935)
UNSUPPORTED: lldb-shell :: ScriptInterpreter/Lua/command_script_import.test (652 of 1935)
PASS: lldb-unit :: ScriptInterpreter/Python/./ScriptInterpreterPythonTests/PythonDataObjectsTest.TestPythonString (653 of 1935)
PASS: lldb-shell :: SymbolFile/DWARF/dwarf5-partial-index.cpp (654 of 1935)
PASS: lldb-api :: commands/expression/argument_passing_restrictions/TestArgumentPassingRestrictions.py (655 of 1935)
PASS: lldb-unit :: Utility/./UtilityTests/StringListTest.DefaultConstructor (656 of 1935)
UNSUPPORTED: lldb-shell :: SymbolFile/PDB/variables.test (657 of 1935)
PASS: lldb-unit :: Host/./HostTests/SocketTest.TCPListen0ConnectAccept (658 of 1935)
PASS: lldb-unit :: Symbol/./SymbolTests/TestTypeSystemClang.TestFunctionTemplateInRecordConstruction (659 of 1935)
UNSUPPORTED: lldb-shell :: SymbolFile/PDB/typedefs.test (660 of 1935)
PASS: lldb-api :: commands/register/register/register_command/TestRegisters.py (661 of 1935)
PASS: lldb-api :: python_api/value/empty_class/TestValueAPIEmptyClass.py (662 of 1935)
PASS: lldb-unit :: Utility/./UtilityTests/BinaryStreamTest.PutSLEB128SevenBytes (663 of 1935)
PASS: lldb-api :: commands/expression/import-std-module/basic/TestImportStdModule.py (664 of 1935)
PASS: lldb-shell :: SymbolFile/NativePDB/source-list.cpp (665 of 1935)
PASS: lldb-api :: commands/expression/import-std-module/weak_ptr-dbg-info-content/TestDbgInfoContentWeakPtrFromStdModule.py (666 of 1935)
PASS: lldb-api :: lang/cpp/unicode-literals/TestUnicodeLiterals.py (667 of 1935)
PASS: lldb-unit :: Utility/./UtilityTests/ScalarTest.ComparisonFloat (668 of 1935)
PASS: lldb-shell :: Settings/TestStopCommandSourceOnError.test (669 of 1935)
PASS: lldb-unit :: Utility/./UtilityTests/TimerTest.CategoryTimes2 (670 of 1935)
PASS: lldb-unit :: Language/Highlighting/./HighlighterTests/HighlighterTest.ClangCursorPosInOtherToken (671 of 1935)
PASS: lldb-unit :: Utility/./UtilityTests/SerializationRountripTest.SerializeDeserializeObjectPointer (672 of 1935)
PASS: lldb-api :: python_api/function_symbol/TestDisasmAPI.py (673 of 1935)
PASS: lldb-unit :: Symbol/./SymbolTests/TestTypeSystemClang.TestGetEnumIntegerTypeBasicTypes (674 of 1935)
PASS: lldb-api :: python_api/sbvalue_persist/TestSBValuePersist.py (675 of 1935)
PASS: lldb-shell :: SymbolFile/DWARF/find-inline-method.s (676 of 1935)
PASS: lldb-api :: driver/batch_mode/TestBatchMode.py (677 of 1935)
PASS: lldb-api :: lang/cpp/accelerator-table/TestCPPAccelerator.py (678 of 1935)
PASS: lldb-shell :: ObjectFile/ELF/PT_LOAD-overlap.yaml (679 of 1935)
PASS: lldb-api :: functionalities/data-formatter/data-formatter-stl/libcxx/map/TestDataFormatterLibccMap.py (680 of 1935)
PASS: lldb-api :: commands/frame/diagnose/virtual-method-call/TestDiagnoseDereferenceVirtualMethodCall.py (681 of 1935)
PASS: lldb-shell :: SymbolFile/DWARF/split-dwarf-inlining.cpp (682 of 1935)
PASS: lldb-unit :: Utility/./UtilityTests/ArgsTest.EscapeLLDBCommandArgument (683 of 1935)
PASS: lldb-unit :: Expression/./ExpressionTests/CppModuleConfigurationTest.LinuxLocalLibCpp (684 of 1935)
UNSUPPORTED: lldb-api :: functionalities/darwin_log/source/info/TestDarwinLogSourceInfo.py (685 of 1935)
PASS: lldb-api :: lang/cpp/this/TestCPPThis.py (686 of 1935)
UNSUPPORTED: lldb-api :: functionalities/tsan/thread_leak/TestTsanThreadLeak.py (687 of 1935)
PASS: lldb-shell :: SymbolFile/DWARF/childless-compile-unit.s (688 of 1935)
PASS: lldb-api :: python_api/signals/TestSignalsAPI.py (689 of 1935)
PASS: lldb-unit :: Utility/./UtilityTests/FileSpecTest.Equal (690 of 1935)
UNSUPPORTED: lldb-api :: iohandler/unicode/TestUnicode.py (691 of 1935)
PASS: lldb-api :: functionalities/load_using_paths/TestLoadUsingPaths.py (692 of 1935)
PASS: lldb-unit :: Utility/./UtilityTests/FileSpecTest.FormatFileSpec (693 of 1935)
PASS: lldb-unit :: UnwindAssembly/x86/./UnwindAssemblyx86Tests/Testx86AssemblyInspectionEngine.TestSimplei386ugmented (694 of 1935)
PASS: lldb-unit :: Utility/./UtilityTests/OptionsWithRawTest.LeadingSpaceArgs (695 of 1935)
PASS: lldb-shell :: ObjectFile/ELF/many-sections.s (696 of 1935)
PASS: lldb-unit :: Utility/./UtilityTests/ArgsTest.TestSingleQuotedArgWithSpace (697 of 1935)
PASS: lldb-unit :: Process/gdb-remote/./ProcessGdbRemoteTests/GDBRemoteClientBaseTest.SendContinueAndAsyncSignal (698 of 1935)
PASS: lldb-shell :: SymbolFile/DWARF/clang-ast-from-dwarf-objc-property.m (699 of 1935)
PASS: lldb-api :: commands/expression/options/TestExprOptions.py (700 of 1935)
PASS: lldb-api :: functionalities/data-formatter/vector-types/TestVectorTypesFormatting.py (701 of 1935)
PASS: lldb-unit :: Utility/./UtilityTests/StringListTest.JoinEmpty (702 of 1935)
PASS: lldb-api :: lang/cpp/llvm-style/TestLLVMStyle.py (703 of 1935)
UNSUPPORTED: lldb-api :: functionalities/thread/create_during_step/TestCreateDuringStep.py (704 of 1935)
PASS: lldb-unit :: Utility/./UtilityTests/LogTest.Register (705 of 1935)
PASS: lldb-shell :: SymbolFile/DWARF/find-method.cpp (706 of 1935)
PASS: lldb-api :: commands/expression/anonymous-struct/TestCallUserAnonTypedef.py (707 of 1935)
PASS: lldb-unit :: Utility/./UtilityTests/VASprintfTest.EncodingError (708 of 1935)
PASS: lldb-unit :: Utility/./UtilityTests/StreamTeeTest.AppendStream (709 of 1935)
PASS: lldb-unit :: Utility/./UtilityTests/VMRange.SetEndAddress (710 of 1935)
PASS: lldb-unit :: Process/gdb-remote/./ProcessGdbRemoteTests/GDBRemoteClientBaseTest.SendContinueAndWait (711 of 1935)
PASS: lldb-shell :: Reproducer/TestReuseDirectory.test (712 of 1935)
PASS: lldb-api :: commands/expression/no-deadlock/TestExprDoesntBlock.py (713 of 1935)
PASS: lldb-unit :: Process/minidump/./LLDBMinidumpTests/MinidumpParserTest.GetMemoryRegionInfoFromMemory64List (714 of 1935)
PASS: lldb-shell :: Commands/command-regex-delete.test (715 of 1935)
PASS: lldb-unit :: Utility/./UtilityTests/ScalarTest.Scalar_512 (716 of 1935)
PASS: lldb-api :: commands/expression/radar_8638051/Test8638051.py (717 of 1935)
PASS: lldb-unit :: Interpreter/./InterpreterTests/OptionArgParserTest.toChar (718 of 1935)
PASS: lldb-unit :: Editline/./EditlineTests/EditlineTestFixture.EditlineReceivesSingleLineText (719 of 1935)
PASS: lldb-unit :: Utility/./UtilityTests/OptionsWithRawTest.ArgsButNoLeadingDash (720 of 1935)
PASS: lldb-api :: functionalities/data-formatter/data-formatter-objc/TestDataFormatterObjCNSBundle.py (721 of 1935)
PASS: lldb-shell :: SymbolFile/DWARF/debug_rnglists-dwo.s (722 of 1935)
PASS: lldb-unit :: Utility/./UtilityTests/StringListTest.AppendListCStringArray (723 of 1935)
PASS: lldb-unit :: Symbol/./SymbolTests/TestTypeSystemClang.TestRemoveFastQualifiers (724 of 1935)
PASS: lldb-api :: commands/expression/expr-in-syscall/TestExpressionInSyscall.py (725 of 1935)
PASS: lldb-api :: python_api/thread/TestThreadAPI.py (726 of 1935)
PASS: lldb-api :: lang/cpp/nsimport/TestCppNsImport.py (727 of 1935)
PASS: lldb-unit :: Host/./HostTests/File.GetWaitableHandleFileno (728 of 1935)
PASS: lldb-api :: lang/cpp/overloaded-functions/TestOverloadedFunctions.py (729 of 1935)
PASS: lldb-api :: commands/expression/import-std-module/empty-module/TestEmptyStdModule.py (730 of 1935)
PASS: lldb-shell :: ObjectFile/ELF/basic-info.yaml (731 of 1935)
PASS: lldb-unit :: Process/minidump/./LLDBMinidumpTests/MinidumpParserTest.MinidumpModuleOrder (732 of 1935)
PASS: lldb-unit :: Utility/./UtilityTests/StringListTest.CopyList (733 of 1935)
PASS: lldb-unit :: Utility/./UtilityTests/StringExtractorTest.GetHexU8_InvalidHex (734 of 1935)
UNSUPPORTED: lldb-api :: functionalities/thread/concurrent_events/TestConcurrentManySignals.py (735 of 1935)
PASS: lldb-unit :: Utility/./UtilityTests/ConstStringTest.format_provider (736 of 1935)
PASS: lldb-unit :: Host/./HostTests/SocketTest.TCPListen0GetPort (737 of 1935)
PASS: lldb-api :: tools/lldb-vscode/step/TestVSCode_step.py (738 of 1935)
PASS: lldb-unit :: Utility/./UtilityTests/StringExtractorTest.GetHexBytesAvail_OddPair2 (739 of 1935)
PASS: lldb-api :: python_api/findvalue_duplist/TestSBFrameFindValue.py (740 of 1935)
PASS: lldb-unit :: Utility/./UtilityTests/StringLexerTest.AdvanceIf (741 of 1935)
PASS: lldb-api :: functionalities/tail_call_frames/ambiguous_tail_call_seq1/TestAmbiguousTailCallSeq1.py (742 of 1935)
PASS: lldb-api :: tools/lldb-server/TestGdbRemoteHostInfo.py (743 of 1935)
PASS: lldb-unit :: UnwindAssembly/x86/./UnwindAssemblyx86Tests/Testx86AssemblyInspectionEngine.TestSpArithx86_64Augmented (744 of 1935)
PASS: lldb-api :: functionalities/data-formatter/data-formatter-categories/TestDataFormatterCategories.py (745 of 1935)
PASS: lldb-unit :: Utility/./UtilityTests/StringExtractorTest.GetHexBytes_Underflow (746 of 1935)
PASS: lldb-unit :: ObjectFile/Breakpad/./ObjectFileBreakpadTests/Record.classify (747 of 1935)
PASS: lldb-shell :: Quit/TestQuitExitCodeTooManyArgs.test (748 of 1935)
PASS: lldb-shell :: ObjectFile/PECOFF/basic-info-arm64.yaml (749 of 1935)
PASS: lldb-api :: python_api/class_members/TestSBTypeClassMembers.py (750 of 1935)
PASS: lldb-api :: functionalities/breakpoint/breakpoint_locations/TestBreakpointLocations.py (751 of 1935)
PASS: lldb-api :: commands/expression/deleting-implicit-copy-constructor/TestDeletingImplicitCopyConstructor.py (752 of 1935)
PASS: lldb-unit :: Utility/./UtilityTests/UUIDTest.StringConverion (753 of 1935)
PASS: lldb-unit :: Utility/./UtilityTests/StringListTest.AppendList (754 of 1935)
PASS: lldb-unit :: Utility/./UtilityTests/ArchSpecTest.TripleComponentsWereSpecified (755 of 1935)
PASS: lldb-unit :: Target/./TargetTests/PathMappingListTest.AbsoluteTests (756 of 1935)
PASS: lldb-unit :: Symbol/./SymbolTests/TestTypeSystemClang.TestGetEnumIntegerTypeUnexpectedType (757 of 1935)
PASS: lldb-api :: python_api/value/linked_list/TestValueAPILinkedList.py (758 of 1935)
PASS: lldb-api :: commands/settings/quoting/TestQuoting.py (759 of 1935)
PASS: lldb-api :: commands/frame/select/TestFrameSelect.py (760 of 1935)
PASS: lldb-unit :: Utility/./UtilityTests/Flags.AnySet (761 of 1935)
PASS: lldb-api :: functionalities/thread/exit_during_break/TestExitDuringBreak.py (762 of 1935)
PASS: lldb-unit :: Utility/./UtilityTests/ArchSpecTest.MergeFromMachOUnknown (763 of 1935)
PASS: lldb-unit :: SymbolFile/NativePDB/./SymbolFileNativePDBTests/PDBFPOProgramToDWARFExpressionTests.SingleAssignmentRegisterRef (764 of 1935)
PASS: lldb-api :: commands/expression/completion-in-lambda-and-unnamed-class/TestCompletionInLambdaAndUnnamedClass.py (765 of 1935)
PASS: lldb-unit :: Utility/./UtilityTests/StringListTest.InsertStringAtIndexStdString (766 of 1935)
PASS: lldb-api :: commands/watchpoints/watchpoint_disable/TestWatchpointDisable.py (767 of 1935)
PASS: lldb-unit :: Utility/./UtilityTests/VMRange.IsValid (768 of 1935)
PASS: lldb-api :: commands/command/delete/TestCommandDelete.py (769 of 1935)
PASS: lldb-api :: functionalities/tail_call_frames/ambiguous_tail_call_seq2/TestAmbiguousTailCallSeq2.py (770 of 1935)
UNSUPPORTED: lldb-api :: benchmarks/libcxxmap/TestBenchmarkLibcxxMap.py (771 of 1935)
PASS: lldb-api :: tools/lldb-server/TestGdbRemoteKill.py (772 of 1935)
PASS: lldb-api :: lang/cpp/dynamic-value/TestCppValueCast.py (773 of 1935)
PASS: lldb-api :: functionalities/multiword-commands/TestMultiWordCommands.py (774 of 1935)
PASS: lldb-shell :: ObjectFile/PECOFF/sections.yaml (775 of 1935)
PASS: lldb-api :: functionalities/data-formatter/data-formatter-script/TestDataFormatterScript.py (776 of 1935)
PASS: lldb-api :: functionalities/gdb_remote_client/TestNoGPacketSupported.py (777 of 1935)
PASS: lldb-unit :: Host/./HostTests/NativeProcessProtocolTest.ReadCStringFromMemory_CrossPageBoundary (778 of 1935)
PASS: lldb-api :: lang/c/modules/TestCModules.py (779 of 1935)
PASS: lldb-unit :: Utility/./UtilityTests/StringExtractorTest.DecodeHexU8_InvalidHex2 (780 of 1935)
PASS: lldb-unit :: Utility/./UtilityTests/StreamTest.AddressPrefixAndSuffix (781 of 1935)
PASS: lldb-api :: functionalities/thread/num_threads/TestNumThreads.py (782 of 1935)
PASS: lldb-unit :: Utility/./UtilityTests/RangeTest.SizeTypes (783 of 1935)
PASS: lldb-unit :: ScriptInterpreter/Python/./ScriptInterpreterPythonTests/PythonDataObjectsTest.TestPythonTupleSize (784 of 1935)
UNSUPPORTED: lldb-shell :: SymbolFile/PDB/class-layout.test (785 of 1935)
UNSUPPORTED: lldb-api :: commands/watchpoints/multi_watchpoint_slots/TestWatchpointMultipleSlots.py (786 of 1935)
PASS: lldb-unit :: Process/minidump/./LLDBMinidumpTests/MinidumpParserTest.GetThreadContext_x86_32_wow64 (787 of 1935)
PASS: lldb-api :: lang/objc/objc-ivar-offsets/TestObjCIvarOffsets.py (788 of 1935)
PASS: lldb-api :: python_api/breakpoint/TestBreakpointAPI.py (789 of 1935)
PASS: lldb-api :: functionalities/breakpoint/serialize/TestBreakpointSerialization.py (790 of 1935)
PASS: lldb-unit :: Utility/./UtilityTests/RangeDataVector.FindEntryThatContains_Overlap (791 of 1935)
PASS: lldb-shell :: ScriptInterpreter/None/none.test (792 of 1935)
PASS: lldb-unit :: Interpreter/./InterpreterTests/CompletionTest.DirCompletionAbsolute (793 of 1935)
PASS: lldb-api :: python_api/disassemble-raw-data/TestDisassembleRawData.py (794 of 1935)
PASS: lldb-api :: functionalities/target_var/TestTargetVar.py (795 of 1935)
PASS: lldb-unit :: Utility/./UtilityTests/ArgsTest.TestInsertArg (796 of 1935)
PASS: lldb-unit :: Utility/./UtilityTests/StringExtractorTest.GetU32BigEndian (797 of 1935)
PASS: lldb-api :: python_api/value/change_values/TestChangeValueAPI.py (798 of 1935)
PASS: lldb-unit :: Signals/./SignalsTests/UnixSignalsTest.GetInfo (799 of 1935)
PASS: lldb-unit :: Utility/./UtilityTests/RangeTest.ContainsRangeStartingFromZero (800 of 1935)
PASS: lldb-api :: terminal/TestSTTYBeforeAndAfter.py (801 of 1935)
PASS: lldb-unit :: Expression/./ExpressionTests/DWARFExpression.DW_OP_convert (802 of 1935)
PASS: lldb-unit :: Host/./HostTests/FileSystemTest.Exists (803 of 1935)
PASS: lldb-shell :: SymbolFile/DWARF/inline-function-address.ll (804 of 1935)
PASS: lldb-unit :: Utility/./UtilityTests/ConstStringTest.NullAndEmptyStates (805 of 1935)
PASS: lldb-unit :: Utility/./UtilityTests/ArgsTest.GetQuotedCommandString (806 of 1935)
PASS: lldb-unit :: Utility/./UtilityTests/AnsiTerminal.Incomplete (807 of 1935)
UNSUPPORTED: lldb-shell :: Unwind/unwind-plan-dwarf-dump.test (808 of 1935)
PASS: lldb-shell :: Settings/TestDisassemblyFormat.test (809 of 1935)
PASS: lldb-unit :: Utility/./UtilityTests/StatusTest.ErrorConstructor (810 of 1935)
PASS: lldb-api :: types/TestFloatTypesExpr.py (811 of 1935)
UNSUPPORTED: lldb-shell :: Register/x86-zmm-write.test (812 of 1935)
UNSUPPORTED: lldb-shell :: Expr/TestIRMemoryMapWindows.test (813 of 1935)
PASS: lldb-unit :: Utility/./UtilityTests/StringExtractorTest.GetHexBytesAvail_OddPair (814 of 1935)
PASS: lldb-api :: types/TestLongTypesExpr.py (815 of 1935)
PASS: lldb-api :: python_api/objc_type/TestObjCType.py (816 of 1935)
PASS: lldb-unit :: Language/Highlighting/./HighlighterTests/HighlighterTest.ClangSquareBrackets (817 of 1935)
PASS: lldb-api :: macosx/universal/TestUniversal.py (818 of 1935)
PASS: lldb-unit :: Utility/./UtilityTests/BinaryStreamTest.PutULEB128FourBytes (819 of 1935)
PASS: lldb-unit :: Host/./HostTests/SocketTest.DecodeHostAndPort (820 of 1935)
PASS: lldb-unit :: Utility/./UtilityTests/StringListTest.AppendStringCString (821 of 1935)
PASS: lldb-api :: functionalities/postmortem/netbsd-core/TestNetBSDCore.py (822 of 1935)
PASS: lldb-unit :: Process/minidump/./LLDBMinidumpTests/MinidumpParserTest.GetPid (823 of 1935)
PASS: lldb-api :: functionalities/recursion/TestValueObjectRecursion.py (824 of 1935)
UNSUPPORTED: lldb-api :: functionalities/data-formatter/data-formatter-stl/libstdcpp/string/TestDataFormatterStdString.py (825 of 1935)
PASS: lldb-unit :: Symbol/./SymbolTests/PostfixExpression.ParseOneExpression (826 of 1935)
PASS: lldb-shell :: SymbolFile/DWARF/DW_AT_loclists_base.s (827 of 1935)
PASS: lldb-api :: lang/objc/objc-struct-argument/TestObjCStructArgument.py (828 of 1935)
PASS: lldb-shell :: ObjectFile/ELF/section-overlap.yaml (829 of 1935)
PASS: lldb-unit :: Utility/./UtilityTests/AnsiTerminal.Empty (830 of 1935)
PASS: lldb-unit :: Utility/./UtilityTests/StringExtractorTest.GetHexBytes_OddPair (831 of 1935)
PASS: lldb-unit :: Host/./HostTests/HostInfoTest.GetHostname (832 of 1935)
PASS: lldb-shell :: SymbolFile/Breakpad/line-table-discontinuous-file-ids.test (833 of 1935)
XFAIL: lldb-shell :: Register/x86-64-write.test (834 of 1935)
PASS: lldb-unit :: Utility/./UtilityTests/Flags.IsClear (835 of 1935)
PASS: lldb-unit :: UnwindAssembly/x86/./UnwindAssemblyx86Tests/Testx86AssemblyInspectionEngine.TestPopEBX (836 of 1935)
PASS: lldb-api :: types/TestFloatTypes.py (837 of 1935)
PASS: lldb-api :: functionalities/tail_call_frames/sbapi_support/TestTailCallFrameSBAPI.py (838 of 1935)
PASS: lldb-api :: functionalities/data-formatter/data-formatter-stl/libcxx/list/TestDataFormatterLibcxxList.py (839 of 1935)
PASS: lldb-unit :: Utility/./UtilityTests/BroadcasterTest.EventTypeHasListeners (840 of 1935)
PASS: lldb-api :: commands/target/dump-symtab-demangle/TestDumpSymtabDemangle.py (841 of 1935)
PASS: lldb-unit :: Utility/./UtilityTests/ScalarTest.Equality (842 of 1935)
PASS: lldb-api :: functionalities/thread/concurrent_events/TestConcurrentTwoWatchpointsOneDelayBreakpoint.py (843 of 1935)
PASS: lldb-unit :: Utility/./UtilityTests/ArgsTest.ReplaceArgumentAtIndexLonger (844 of 1935)
PASS: lldb-api :: functionalities/data-formatter/data-formatter-objc/TestDataFormatterObjCNSError.py (845 of 1935)
UNSUPPORTED: lldb-shell :: SymbolFile/PDB/enums-layout.test (846 of 1935)
PASS: lldb-api :: tools/lldb-server/commandline/TestStubSetSID.py (847 of 1935)
PASS: lldb-shell :: ObjectFile/MachO/subsections.yaml (848 of 1935)
PASS: lldb-unit :: Utility/./UtilityTests/ConstStringTest.CompareStringRef (849 of 1935)
PASS: lldb-shell :: Reproducer/Functionalities/TestImageList.test (850 of 1935)
PASS: lldb-shell :: Unwind/trap_frame_sym_ctx.test (851 of 1935)
PASS: lldb-api :: functionalities/type_completion/TestTypeCompletion.py (852 of 1935)
PASS: lldb-unit :: Host/./HostTests/NativeProcessProtocolTest.ReadCStringFromMemory (853 of 1935)
PASS: lldb-unit :: UnwindAssembly/x86/./UnwindAssemblyx86Tests/Testx86AssemblyInspectionEngine.TestSimple32bitFrameFunction (854 of 1935)
PASS: lldb-unit :: Utility/./UtilityTests/RangeTest.NotEqualInvalid (855 of 1935)
PASS: lldb-unit :: Utility/./UtilityTests/AnsiTerminal.KnownPrefix (856 of 1935)
PASS: lldb-unit :: ScriptInterpreter/Python/./ScriptInterpreterPythonTests/PythonDataObjectsTest.TestPythonBytes (857 of 1935)
PASS: lldb-unit :: Utility/./UtilityTests/OptionsWithRawTest.SingleWhitespaceInput (858 of 1935)
PASS: lldb-unit :: Utility/./UtilityTests/StringExtractorTest.GetHexU8_Underflow_NoEof (859 of 1935)
PASS: lldb-shell :: Heap/heap-cstr.test (860 of 1935)
PASS: lldb-api :: functionalities/data-formatter/ptr_ref_typedef/TestPtrRef2Typedef.py (861 of 1935)
PASS: lldb-api :: commands/expression/cast_int_to_anonymous_enum/TestCastIntToAnonymousEnum.py (862 of 1935)
PASS: lldb-unit :: Utility/./UtilityTests/ScalarTest.RightShiftOperator (863 of 1935)
PASS: lldb-unit :: Utility/./UtilityTests/StringListTest.GetMaxStringLengthIncreasingSize (864 of 1935)
PASS: lldb-shell :: SymbolFile/DWARF/clang-ast-from-dwarf-unamed-and-anon-structs.cpp (865 of 1935)
PASS: lldb-api :: functionalities/thread/concurrent_events/TestConcurrentTwoBreakpointsOneWatchpoint.py (866 of 1935)
PASS: lldb-shell :: Quit/TestQuitExitCode0.test (867 of 1935)
PASS: lldb-unit :: Utility/./UtilityTests/RegularExpression.Match (868 of 1935)
PASS: lldb-shell :: Commands/CommandScriptImmediateOutput/CommandScriptImmediateOutputFile.test (869 of 1935)
PASS: lldb-api :: commands/expression/radar_9673664/TestExprHelpExamples.py (870 of 1935)
PASS: lldb-unit :: Host/./HostTests/SocketTest.UDPConnect (871 of 1935)
PASS: lldb-unit :: ScriptInterpreter/Python/./ScriptInterpreterPythonTests/PythonDataObjectsTest.TestModuleNameResolutionNoDot (872 of 1935)
PASS: lldb-api :: commands/expression/import-std-module/deque-basic/TestDequeFromStdModule.py (873 of 1935)
UNSUPPORTED: lldb-api :: linux/add-symbols/TestTargetSymbolsAddCommand.py (874 of 1935)
PASS: lldb-unit :: Utility/./UtilityTests/BinaryStreamTest.PutULEB128Zero (875 of 1935)
PASS: lldb-unit :: ScriptInterpreter/Python/./ScriptInterpreterPythonTests/PythonDataObjectsTest.TestDictionaryResolutionWithDot (876 of 1935)
UNSUPPORTED: lldb-api :: functionalities/longjmp/TestLongjmp.py (877 of 1935)
PASS: lldb-api :: functionalities/gdb_remote_client/TestRecognizeBreakpoint.py (878 of 1935)
UNSUPPORTED: lldb-api :: commands/gui/basic/TestGuiBasic.py (879 of 1935)
PASS: lldb-unit :: Utility/./UtilityTests/ArchSpecTest.TestParseMachCPUDashSubtypeTripleSimple (880 of 1935)
PASS: lldb-unit :: Utility/./UtilityTests/StringExtractorTest.GetHexBytes_Partial (881 of 1935)
PASS: lldb-unit :: Process/gdb-remote/./ProcessGdbRemoteTests/GDBRemoteCommunicationServerTest.SendErrorResponse_Status (882 of 1935)
PASS: lldb-api :: functionalities/data-formatter/data-formatter-stl/libcxx/variant/TestDataFormatterLibcxxVariant.py (883 of 1935)
PASS: lldb-unit :: SymbolFile/NativePDB/./SymbolFileNativePDBTests/PDBFPOProgramToDWARFExpressionTests.InvalidOpUnary (884 of 1935)
PASS: lldb-shell :: Expr/TestTypeOfDeclTypeExpr.test (885 of 1935)
PASS: lldb-unit :: UnwindAssembly/x86/./UnwindAssemblyx86Tests/Testx86AssemblyInspectionEngine.Test64bitFramelessBigStackFrame (886 of 1935)
PASS: lldb-api :: functionalities/thread/thread_exit/TestThreadExit.py (887 of 1935)
PASS: lldb-api :: functionalities/thread/concurrent_events/TestConcurrentManyWatchpoints.py (888 of 1935)
UNSUPPORTED: lldb-api :: api/multiple-debuggers/TestMultipleDebuggers.py (889 of 1935)
UNSUPPORTED: lldb-api :: commands/target/auto-install-main-executable/TestAutoInstallMainExecutable.py (890 of 1935)
PASS: lldb-shell :: ObjectFile/PECOFF/sections-names.yaml (891 of 1935)
PASS: lldb-unit :: ObjectFile/Breakpad/./ObjectFileBreakpadTests/StackWinRecord.parse (892 of 1935)
PASS: lldb-unit :: SymbolFile/NativePDB/./SymbolFileNativePDBTests/PDBFPOProgramToDWARFExpressionTests.DependencyChain (893 of 1935)
PASS: lldb-api :: functionalities/data-formatter/data-formatter-stl/libcxx/function/TestLibCxxFunction.py (894 of 1935)
PASS: lldb-unit :: UnwindAssembly/x86/./UnwindAssemblyx86Tests/Testx86AssemblyInspectionEngine.TestDisassemblyJunkBytes (895 of 1935)
PASS: lldb-unit :: Expression/./ExpressionTests/DiagnosticManagerTest.GetStringMultiline (896 of 1935)
PASS: lldb-unit :: Core/./LLDBCoreTests/MangledTest.EmptyForInvalidName (897 of 1935)
UNSUPPORTED: lldb-shell :: Register/arm-fp-read.test (898 of 1935)
PASS: lldb-unit :: Interpreter/./InterpreterTests/CompletionTest.FileCompletionAbsolute (899 of 1935)
PASS: lldb-unit :: ScriptInterpreter/Python/./ScriptInterpreterPythonTests/PythonDataObjectsTest.TestRun (900 of 1935)
PASS: lldb-api :: python_api/section/TestSectionAPI.py (901 of 1935)
PASS: lldb-shell :: SymbolFile/Breakpad/line-table-missing-file.test (902 of 1935)
PASS: lldb-api :: commands/breakpoint/command/list/TestBreakpointCommandList.py (903 of 1935)
PASS: lldb-unit :: Process/gdb-remote/./ProcessGdbRemoteTests/GDBRemoteClientBaseTest.InterruptNoResponse (904 of 1935)
PASS: lldb-unit :: Symbol/./SymbolTests/TestTypeSystemClang.TestDisplayNameEmpty (905 of 1935)
PASS: lldb-unit :: ObjectFile/PECOFF/./ObjectFilePECOFFTests/PECallFrameInfoTest.Basic_eh (906 of 1935)
PASS: lldb-unit :: Utility/./UtilityTests/RangeTest.ClearWithStarAddress (907 of 1935)
PASS: lldb-unit :: Utility/./UtilityTests/SerializationRountripTest.SerializeDeserializeObjectReference (908 of 1935)
PASS: lldb-api :: lang/objc/objc-new-syntax/TestObjCNewSyntaxDictionary.py (909 of 1935)
PASS: lldb-api :: types/TestDoubleTypesExpr.py (910 of 1935)
PASS: lldb-api :: commands/command/history/TestCommandHistory.py (911 of 1935)
PASS: lldb-unit :: ScriptInterpreter/Python/./ScriptInterpreterPythonTests/PythonDataObjectsTest.TestPythonCallableCheck (912 of 1935)
UNSUPPORTED: lldb-api :: functionalities/thread/thread_specific_break_plus_condition/TestThreadSpecificBpPlusCondition.py (913 of 1935)
PASS: lldb-api :: macosx/duplicate-archive-members/TestDuplicateMembers.py (914 of 1935)
PASS: lldb-shell :: SymbolFile/Breakpad/stack-cfi-parsing.test (915 of 1935)
PASS: lldb-unit :: Utility/./UtilityTests/RangeDataVector.FindEntryThatContains (916 of 1935)
PASS: lldb-api :: functionalities/data-formatter/synthcapping/TestSyntheticCapping.py (917 of 1935)
PASS: lldb-shell :: Register/x86-64-ymm-read.test (918 of 1935)
PASS: lldb-api :: lang/c/inlines/TestRedefinitionsInInlines.py (919 of 1935)
PASS: lldb-unit :: Host/./HostTests/SocketAddressTest.Set (920 of 1935)
PASS: lldb-api :: lang/cpp/stl/TestSTL.py (921 of 1935)
PASS: lldb-api :: functionalities/data-formatter/data-formatter-stl/libcxx/vbool/TestDataFormatterLibcxxVBool.py (922 of 1935)
PASS: lldb-api :: commands/disassemble/basic/TestDisassembleBreakpoint.py (923 of 1935)
PASS: lldb-unit :: Utility/./UtilityTests/StringListTest.InsertStringAtIndexStart (924 of 1935)
PASS: lldb-api :: commands/expression/call-function/TestCallStdStringFunction.py (925 of 1935)
PASS: lldb-shell :: SymbolFile/Breakpad/line-table-mixed-path-styles.test (926 of 1935)
PASS: lldb-shell :: SymbolFile/DWARF/apple-index-is-used.cpp (927 of 1935)
PASS: lldb-api :: commands/expression/codegen-crash-typedefdecl-not-in_declcontext/TestCodegenCrashTypedefDeclNotInDeclContext.py (928 of 1935)
PASS: lldb-api :: lang/cpp/enum_types/TestCPP11EnumTypes.py (929 of 1935)
UNSUPPORTED: lldb-api :: lang/c/typedef/Testtypedef.py (930 of 1935)
PASS: lldb-api :: commands/expression/import-std-module/vector-of-vectors/TestVectorOfVectorsFromStdModule.py (931 of 1935)
PASS: lldb-unit :: Expression/./ExpressionTests/DiagnosticManagerTest.AddDiagnostic (932 of 1935)
PASS: lldb-api :: commands/expression/import-std-module/conflicts/TestStdModuleWithConflicts.py (933 of 1935)
PASS: lldb-api :: functionalities/inferior-crashing/TestInferiorCrashingStep.py (934 of 1935)
UNSUPPORTED: lldb-api :: functionalities/darwin_log/filter/regex/category/TestDarwinLogFilterRegexCategory.py (935 of 1935)
PASS: lldb-unit :: Utility/./UtilityTests/LogChannelTest.Disable (936 of 1935)
PASS: lldb-api :: commands/expression/po_verbosity/TestPoVerbosity.py (937 of 1935)
PASS: lldb-api :: functionalities/breakpoint/breakpoint_ignore_count/TestBreakpointIgnoreCount.py (938 of 1935)
PASS: lldb-api :: tools/lldb-vscode/breakpoint/TestVSCode_setBreakpoints.py (939 of 1935)
UNSUPPORTED: lldb-shell :: Register/x86-zmm-read.test (940 of 1935)
PASS: lldb-unit :: Utility/./UtilityTests/FileSpecTest.GuessPathStyle (941 of 1935)
PASS: lldb-unit :: Host/./HostTests/SocketTest.DomainListenConnectAccept (942 of 1935)
PASS: lldb-unit :: Utility/./UtilityTests/StringListTest.PopBack (943 of 1935)
UNSUPPORTED: lldb-api :: functionalities/asan/TestReportData.py (944 of 1935)
PASS: lldb-shell :: Reproducer/Functionalities/TestStepping.test (945 of 1935)
PASS: lldb-api :: lang/cpp/nested-class-other-compilation-unit/TestNestedClassWithParentInAnotherCU.py (946 of 1935)
PASS: lldb-api :: functionalities/breakpoint/inlined_breakpoints/TestInlinedBreakpoints.py (947 of 1935)
PASS: lldb-unit :: Process/gdb-remote/./ProcessGdbRemoteTests/GDBRemoteCommunicationClientTest.SendGetDataPacket (948 of 1935)
PASS: lldb-api :: commands/expression/save_jit_objects/TestSaveJITObjects.py (949 of 1935)
PASS: lldb-api :: commands/process/attach-resume/TestAttachResume.py (950 of 1935)
PASS: lldb-unit :: Utility/./UtilityTests/Flags.AnyClear (951 of 1935)
PASS: lldb-shell :: SymbolFile/DWARF/debug-line-basic.s (952 of 1935)
UNSUPPORTED: lldb-shell :: ScriptInterpreter/Lua/breakpoint_callback.test (953 of 1935)
PASS: lldb-unit :: Expression/./ExpressionTests/DiagnosticManagerTest.HasFixits (954 of 1935)
PASS: lldb-unit :: Utility/./UtilityTests/ArchSpecTest.TestSetTriple (955 of 1935)
PASS: lldb-api :: python_api/debugger/TestDebuggerAPI.py (956 of 1935)
PASS: lldb-api :: functionalities/conditional_break/TestConditionalBreak.py (957 of 1935)
PASS: lldb-unit :: Process/minidump/./LLDBMinidumpTests/MinidumpParserTest.GetThreadContext_x86_32 (958 of 1935)
PASS: lldb-api :: functionalities/gdb_remote_client/TestStopPCs.py (959 of 1935)
UNSUPPORTED: lldb-api :: functionalities/thread/multi_break/TestMultipleBreakpoints.py (960 of 1935)
PASS: lldb-unit :: UnwindAssembly/x86/./UnwindAssemblyx86Tests/Testx86AssemblyInspectionEngine.TestSpillRegToStackViaMOVi386 (961 of 1935)
PASS: lldb-shell :: SymbolFile/DWARF/dir-separator-no-comp-dir.s (962 of 1935)
PASS: lldb-api :: tools/lldb-vscode/attach/TestVSCode_attach.py (963 of 1935)
PASS: lldb-shell :: Driver/LocalLLDBInit.test (964 of 1935)
PASS: lldb-api :: lang/c/bitfields/TestBitfields.py (965 of 1935)
UNSUPPORTED: lldb-api :: commands/expression/macros/TestMacros.py (966 of 1935)
PASS: lldb-api :: lang/cpp/exceptions/TestCPPExceptionBreakpoints.py (967 of 1935)
PASS: lldb-api :: lang/objc/modules-update/TestClangModulesUpdate.py (968 of 1935)
PASS: lldb-unit :: Expression/./ExpressionTests/DiagnosticManagerTest.GetStringNoDiags (969 of 1935)
PASS: lldb-shell :: ObjectFile/Breakpad/discontiguous-sections.test (970 of 1935)
PASS: lldb-unit :: Utility/./UtilityTests/StringExtractorTest.GetU64LittleEndian (971 of 1935)
PASS: lldb-unit :: Utility/./UtilityTests/StringListTest.SplitIntoLines (972 of 1935)
PASS: lldb-shell :: ObjectFile/PECOFF/basic-info.yaml (973 of 1935)
PASS: lldb-unit :: ScriptInterpreter/Python/./ScriptInterpreterPythonTests/PythonDataObjectsTest.TestPythonDictionaryManipulation (974 of 1935)
PASS: lldb-api :: tools/lldb-server/TestGdbRemote_qThreadStopInfo.py (975 of 1935)
PASS: lldb-api :: tools/lldb-vscode/variables/TestVSCode_variables.py (976 of 1935)
PASS: lldb-shell :: SymbolFile/NativePDB/global-classes.cpp (977 of 1935)
PASS: lldb-api :: functionalities/data-formatter/data-formatter-python-synth/TestDataFormatterPythonSynth.py (978 of 1935)
UNSUPPORTED: lldb-api :: commands/expression/completion-crash-invalid-iterator/TestInvalidIteratorCompletionCrash.py (979 of 1935)
UNSUPPORTED: lldb-shell :: Register/x86-64-ymm16-read.test (980 of 1935)
UNSUPPORTED: lldb-shell :: Breakpoint/case-insensitive.test (981 of 1935)
PASS: lldb-unit :: Language/Highlighting/./HighlighterTests/HighlighterTest.ClangStringLiterals (982 of 1935)
PASS: lldb-api :: lang/objc/foundation/TestObjCMethodsNSArray.py (983 of 1935)
PASS: lldb-unit :: Process/gdb-remote/./ProcessGdbRemoteTests/GDBRemoteCommunicationClientTest.WriteRegisterNoSuffix (984 of 1935)
PASS: lldb-api :: functionalities/breakpoint/comp_dir_symlink/TestCompDirSymLink.py (985 of 1935)
PASS: lldb-api :: functionalities/tail_call_frames/inlining_and_tail_calls/TestInliningAndTailCalls.py (986 of 1935)
PASS: lldb-unit :: Utility/./UtilityTests/ScalarTest.Promotion (987 of 1935)
PASS: lldb-shell :: Reproducer/TestMultipleTargets.test (988 of 1935)
PASS: lldb-api :: commands/expression/completion/TestExprCompletion.py (989 of 1935)
PASS: lldb-api :: lang/cpp/static_methods/TestCPPStaticMethods.py (990 of 1935)
PASS: lldb-unit :: ScriptInterpreter/Python/./ScriptInterpreterPythonTests/PythonDataObjectsTest.TestPythonIntegerToStr (991 of 1935)
PASS: lldb-api :: commands/watchpoints/watchpoint_events/TestWatchpointEvents.py (992 of 1935)
PASS: lldb-unit :: Utility/./UtilityTests/BinaryStreamTest.PutULEB128One (993 of 1935)
PASS: lldb-unit :: Host/./HostTests/ProcessLaunchInfoTest.Constructor (994 of 1935)
PASS: lldb-unit :: Breakpoint/./LLDBBreakpointTests/BreakpointIDTest.StringIsBreakpointName (995 of 1935)
PASS: lldb-api :: commands/expression/top-level/TestTopLevelExprs.py (996 of 1935)
PASS: lldb-unit :: ScriptInterpreter/Python/./ScriptInterpreterPythonTests/PythonDataObjectsTest.TestGlobalNameResolutionWithDot (997 of 1935)
PASS: lldb-api :: commands/expression/test/TestExprs2.py (998 of 1935)
PASS: lldb-shell :: Commands/command-backtrace.test (999 of 1935)
PASS: lldb-unit :: Language/Highlighting/./HighlighterTests/HighlighterTest.ClangPreserveNewLine (1000 of 1935)
PASS: lldb-shell :: Breakpoint/debug_rnglistx_rlex.test (1001 of 1935)
PASS: lldb-api :: types/TestCharType.py (1002 of 1935)
PASS: lldb-unit :: Process/gdb-remote/./ProcessGdbRemoteTests/GDBRemoteCommunicationClientTest.TestPacketSpeedJSON (1003 of 1935)
PASS: lldb-api :: python_api/get-value-32bit-int/TestGetValue32BitInt.py (1004 of 1935)
PASS: lldb-unit :: Utility/./UtilityTests/StreamTest.AddressNoSuffix (1005 of 1935)
UNSUPPORTED: lldb-shell :: Register/x86-gp-write.test (1006 of 1935)
PASS: lldb-unit :: Utility/./UtilityTests/StreamTeeTest.SetStreamAtIndexOutOfBounds (1007 of 1935)
PASS: lldb-unit :: Utility/./UtilityTests/StreamTest.ChangingByteOrder (1008 of 1935)
PASS: lldb-unit :: Utility/./UtilityTests/RecordReplayTest.InstrumentedBarPtr (1009 of 1935)
PASS: lldb-shell :: SymbolFile/DWARF/win-i386-line-table.s (1010 of 1935)
PASS: lldb-unit :: Utility/./UtilityTests/StringListTest.GetMaxStringLengthMixed (1011 of 1935)
PASS: lldb-shell :: Breakpoint/split-dwarf-5-addrbase.test (1012 of 1935)
PASS: lldb-unit :: Utility/./UtilityTests/ArgsTest.ReplaceArgumentAtIndexOutOfRange (1013 of 1935)
PASS: lldb-api :: functionalities/thread/concurrent_events/TestConcurrentWatchpointWithDelayWatchpointThreads.py (1014 of 1935)
PASS: lldb-api :: functionalities/thread/concurrent_events/TestConcurrentCrashWithWatchpoint.py (1015 of 1935)
PASS: lldb-unit :: Utility/./UtilityTests/StreamTeeTest.CopyConstructor (1016 of 1935)
PASS: lldb-unit :: Utility/./UtilityTests/SerializationRountripTest.SerializeDeserializeCString (1017 of 1935)
PASS: lldb-api :: python_api/frame/TestFrames.py (1018 of 1935)
PASS: lldb-api :: lang/objc/objc-checker/TestObjCCheckers.py (1019 of 1935)
PASS: lldb-unit :: Utility/./UtilityTests/StreamTeeTest.GetStreamAtIndexOutOfBoundsEmpty (1020 of 1935)
PASS: lldb-api :: lang/objc/global_ptrs/TestGlobalObjects.py (1021 of 1935)
PASS: lldb-api :: lang/c/strings/TestCStrings.py (1022 of 1935)
PASS: lldb-api :: functionalities/data-formatter/nsdictionarysynth/TestNSDictionarySynthetic.py (1023 of 1935)
PASS: lldb-unit :: Utility/./UtilityTests/RangeTest.ContainsEndInclusiveInvalid (1024 of 1935)
PASS: lldb-shell :: Driver/TestSingleQuote.test (1025 of 1935)
PASS: lldb-api :: lang/objc/foundation/TestRuntimeTypes.py (1026 of 1935)
PASS: lldb-api :: commands/expression/persistent_types/TestNestedPersistentTypes.py (1027 of 1935)
PASS: lldb-unit :: Utility/./UtilityTests/ArgsTest.TestQuotedTrailingBackslash (1028 of 1935)
PASS: lldb-unit :: Core/./LLDBCoreTests/StreamCallbackTest.Callback (1029 of 1935)
PASS: lldb-unit :: Utility/./UtilityTests/UriParserTest.PortOverflow (1030 of 1935)
PASS: lldb-api :: commands/expression/regression-access-function-template-in-record/TestRegressionAccessFunctionTemplateInRecord.py (1031 of 1935)
PASS: lldb-api :: functionalities/signal/raise/TestRaise.py (1032 of 1935)
PASS: lldb-unit :: Process/gdb-remote/./ProcessGdbRemoteTests/GDBRemoteCommunicationClientTest.ReadRegister (1033 of 1935)
PASS: lldb-shell :: Driver/TestConvenienceVariables.test (1034 of 1935)
PASS: lldb-api :: functionalities/value_md5_crash/TestValueMD5Crash.py (1035 of 1935)
PASS: lldb-unit :: Target/./TargetTests/ExecutionContextTest.GetByteOrderTarget (1036 of 1935)
PASS: lldb-unit :: Utility/./UtilityTests/LogChannelTest.List (1037 of 1935)
PASS: lldb-unit :: UnwindAssembly/x86/./UnwindAssemblyx86Tests/Testx86AssemblyInspectionEngine.TestPopRBPWithREX (1038 of 1935)
PASS: lldb-api :: functionalities/data-formatter/data-formatter-named-summaries/TestDataFormatterNamedSummaries.py (1039 of 1935)
PASS: lldb-api :: functionalities/gdb_remote_client/TestGDBRemoteLoad.py (1040 of 1935)
PASS: lldb-shell :: BuildScript/modes.test (1041 of 1935)
PASS: lldb-unit :: Utility/./UtilityTests/CompletionRequest.TryCompleteCurrentArgGood (1042 of 1935)
PASS: lldb-unit :: Process/gdb-remote/./ProcessGdbRemoteTests/GDBRemoteCommunicationClientTest.SendSignalsToIgnore (1043 of 1935)
PASS: lldb-api :: lang/c/local_variables/TestLocalVariables.py (1044 of 1935)
PASS: lldb-shell :: Reproducer/TestSynchronous.test (1045 of 1935)
PASS: lldb-unit :: Expression/./ExpressionTests/DiagnosticManagerTest.FixedExpression (1046 of 1935)
PASS: lldb-api :: functionalities/breakpoint/source_regexp/TestSourceRegexBreakpoints.py (1047 of 1935)
PASS: lldb-unit :: Expression/./ExpressionTests/DiagnosticManagerTest.GetStringSeverityLabels (1048 of 1935)
PASS: lldb-unit :: Utility/./UtilityTests/Flags.GetBitSize (1049 of 1935)
PASS: lldb-shell :: Driver/TestNoUseColor.test (1050 of 1935)
PASS: lldb-unit :: Utility/./UtilityTests/StringListTest.ShiftStdString (1051 of 1935)
PASS: lldb-api :: commands/expression/context-object-objc/TestContextObjectObjc.py (1052 of 1935)
PASS: lldb-unit :: Utility/./UtilityTests/DataExtractorTest.GetCStrAtEnd (1053 of 1935)
PASS: lldb-unit :: Language/Highlighting/./HighlighterTests/HighlighterTest.FallbackHighlighter (1054 of 1935)
PASS: lldb-api :: lang/cpp/offsetof/TestOffsetofCpp.py (1055 of 1935)
PASS: lldb-unit :: UnwindAssembly/x86/./UnwindAssemblyx86Tests/Testx86AssemblyInspectionEngine.TestPushEBX (1056 of 1935)
PASS: lldb-unit :: Target/./TargetTests/StackFrameRecognizerTest.NullModuleRegex (1057 of 1935)
PASS: lldb-unit :: Host/./HostTests/FileSystemTest.GetPermissions (1058 of 1935)
PASS: lldb-unit :: Utility/./UtilityTests/BinaryStreamTest.PutSLEB128NineBytes (1059 of 1935)
PASS: lldb-unit :: Language/Highlighting/./HighlighterTests/HighlighterTest.ClangCursorPosAfterOtherToken (1060 of 1935)
PASS: lldb-api :: functionalities/postmortem/minidump-new/TestMiniDumpNew.py (1061 of 1935)
PASS: lldb-unit :: SymbolFile/NativePDB/./SymbolFileNativePDBTests/PDBFPOProgramToDWARFExpressionTests.MultipleDependentAssignments (1062 of 1935)
PASS: lldb-api :: sample_test/TestSampleTest.py (1063 of 1935)
PASS: lldb-unit :: Utility/./UtilityTests/DataExtractorTest.GetCStr (1064 of 1935)
PASS: lldb-shell :: SymbolFile/NativePDB/ast-methods.cpp (1065 of 1935)
PASS: lldb-api :: lang/objc/objc-super/TestObjCSuper.py (1066 of 1935)
PASS: lldb-shell :: Reproducer/TestRelativePath.test (1067 of 1935)
PASS: lldb-api :: functionalities/memory/find/TestMemoryFind.py (1068 of 1935)
UNSUPPORTED: lldb-api :: tools/lldb-server/platform-process-connect/TestPlatformProcessConnect.py (1069 of 1935)
PASS: lldb-api :: api/multiple-targets/TestMultipleTargets.py (1070 of 1935)
PASS: lldb-shell :: SymbolFile/DWARF/forward-declarations.s (1071 of 1935)
PASS: lldb-unit :: Utility/./UtilityTests/StreamTeeTest.GetStreamAtIndexOutOfBounds (1072 of 1935)
PASS: lldb-api :: functionalities/backticks/TestBackticksWithoutATarget.py (1073 of 1935)
PASS: lldb-shell :: Quit/TestQuitExitCode-30.test (1074 of 1935)
PASS: lldb-api :: functionalities/breakpoint/breakpoint_ids/TestBreakpointIDs.py (1075 of 1935)
PASS: lldb-unit :: Language/Highlighting/./HighlighterTests/HighlighterTest.ClangEmptyInput (1076 of 1935)
PASS: lldb-unit :: Process/gdb-remote/./ProcessGdbRemoteTests/GDBRemoteClientBaseTest.SendContinueAndInterrupt (1077 of 1935)
PASS: lldb-unit :: Utility/./UtilityTests/Predicate.WaitForValueEqualTo (1078 of 1935)
PASS: lldb-unit :: Process/gdb-remote/./ProcessGdbRemoteTests/GDBRemoteCommunicationTest.ReadPacket_checksum (1079 of 1935)
PASS: lldb-unit :: Utility/./UtilityTests/BinaryStreamTest.PutULEB128ThreeBytes (1080 of 1935)
PASS: lldb-unit :: Utility/./UtilityTests/StringExtractorTest.GetU64BigEndian (1081 of 1935)
PASS: lldb-api :: lang/c/stepping/TestStepAndBreakpoints.py (1082 of 1935)
PASS: lldb-unit :: UnwindAssembly/x86/./UnwindAssemblyx86Tests/Testx86AssemblyInspectionEngine.TestPushRBPWithREX (1083 of 1935)
PASS: lldb-api :: commands/process/attach/TestProcessAttach.py (1084 of 1935)
PASS: lldb-unit :: Utility/./UtilityTests/StringListTest.GetMaxStringLengthEmpty (1085 of 1935)
PASS: lldb-api :: lang/objc/print-obj/TestPrintObj.py (1086 of 1935)
PASS: lldb-api :: functionalities/gdb_remote_client/TestArmRegisterDefinition.py (1087 of 1935)
PASS: lldb-api :: functionalities/data-formatter/hexcaps/TestDataFormatterHexCaps.py (1088 of 1935)
PASS: lldb-shell :: Minidump/no-process-id.yaml (1089 of 1935)
PASS: lldb-unit :: Utility/./UtilityTests/RangeTest.Constructor (1090 of 1935)
PASS: lldb-unit :: ObjectFile/ELF/./ObjectFileELFTests/ObjectFileELFTest.GetSymtab_NoSymEntryPointArmThumbAddressClass (1091 of 1935)
PASS: lldb-unit :: Process/gdb-remote/./ProcessGdbRemoteTests/GDBRemoteCommunicationServerTest.SendErrorResponse_StringError (1092 of 1935)
PASS: lldb-unit :: Language/CPlusPlus/./LanguageCPlusPlusTests/CPlusPlusLanguage.FindAlternateFunctionManglings (1093 of 1935)
PASS: lldb-api :: functionalities/thread/crash_during_step/TestCrashDuringStep.py (1094 of 1935)
PASS: lldb-unit :: Utility/./UtilityTests/FileSpecTest.GetPath (1095 of 1935)
PASS: lldb-shell :: ObjectFile/ELF/PT_LOAD-overlap-PT_TLS.yaml (1096 of 1935)
PASS: lldb-unit :: Utility/./UtilityTests/CompletionRequest.TryCompleteCurrentArgMode (1097 of 1935)
PASS: lldb-api :: lang/objc/objc_direct-methods/TestObjCDirectMethods.py (1098 of 1935)
PASS: lldb-api :: functionalities/data-formatter/data-formatter-stl/libcxx/vector/TestDataFormatterLibcxxVector.py (1099 of 1935)
PASS: lldb-api :: commands/expression/call-function/TestCallUserDefinedFunction.py (1100 of 1935)
PASS: lldb-shell :: SymbolFile/DWARF/compilercontext.ll (1101 of 1935)
PASS: lldb-api :: functionalities/breakpoint/breakpoint_names/TestBreakpointNames.py (1102 of 1935)
PASS: lldb-api :: lang/cpp/inlines/TestInlines.py (1103 of 1935)
UNSUPPORTED: lldb-api :: commands/register/register/intel_xtended_registers/mpx_bound_violation/TestBoundViolation.py (1104 of 1935)
PASS: lldb-api :: commands/expression/persistent_ptr_update/TestPersistentPtrUpdate.py (1105 of 1935)
PASS: lldb-api :: python_api/default-constructor/TestDefaultConstructorForAPIObjects.py (1106 of 1935)
PASS: lldb-unit :: Utility/./UtilityTests/StringListTest.ShiftCString (1107 of 1935)
PASS: lldb-api :: commands/expression/issue_11588/Test11588.py (1108 of 1935)
PASS: lldb-api :: functionalities/data-formatter/data-formatter-objc/TestDataFormatterObjCNSContainer.py (1109 of 1935)
PASS: lldb-unit :: Utility/./UtilityTests/RegularExpression.Valid (1110 of 1935)
PASS: lldb-unit :: UnwindAssembly/x86/./UnwindAssemblyx86Tests/Testx86AssemblyInspectionEngine.TestPushRBP (1111 of 1935)
PASS: lldb-api :: functionalities/data-formatter/user-format-vs-summary/TestUserFormatVsSummary.py (1112 of 1935)
PASS: lldb-shell :: Driver/TestCommands.test (1113 of 1935)
PASS: lldb-shell :: SymbolFile/Breakpad/unwind-via-stack-win.test (1114 of 1935)
PASS: lldb-api :: functionalities/data-formatter/data-formatter-smart-array/TestDataFormatterSmartArray.py (1115 of 1935)
PASS: lldb-api :: functionalities/data-formatter/data-formatter-objc/TestDataFormatterObjCNSURL.py (1116 of 1935)
PASS: lldb-unit :: Symbol/./SymbolTests/TestTypeSystemClang.TestGetBasicTypeFromEnum (1117 of 1935)
PASS: lldb-unit :: Utility/./UtilityTests/SharedCluster.ClusterManager (1118 of 1935)
PASS: lldb-unit :: Host/./HostTests/FileSystemTest.MakeAbsolute (1119 of 1935)
UNSUPPORTED: lldb-api :: arm/breakpoint-thumb-codesection/TestBreakpointThumbCodesection.py (1120 of 1935)
PASS: lldb-shell :: ObjectFile/PECOFF/uuid.yaml (1121 of 1935)
PASS: lldb-api :: commands/expression/import-std-module/forward_list/TestForwardListFromStdModule.py (1122 of 1935)
PASS: lldb-unit :: Utility/./UtilityTests/OptionsWithRawTest.EmptyArgsOnlySuffix (1123 of 1935)
PASS: lldb-unit :: Process/minidump/./LLDBMinidumpTests/RegisterContextMinidump.CheckRegisterContextMinidump_ARM (1124 of 1935)
PASS: lldb-api :: lang/c/conflicting-symbol/TestConflictingSymbol.py (1125 of 1935)
PASS: lldb-api :: functionalities/history/TestHistoryRecall.py (1126 of 1935)
PASS: lldb-unit :: UnwindAssembly/x86/./UnwindAssemblyx86Tests/Testx86AssemblyInspectionEngine.TestDisassemblyMidFunctionEpilogues (1127 of 1935)
PASS: lldb-unit :: debugserver/./debugserverTests/RNBSocket.LoopBackConnectIPv4 (1128 of 1935)
PASS: lldb-unit :: Language/Highlighting/./HighlighterTests/HighlighterTest.ClangCursorPosEndOfLine (1129 of 1935)
PASS: lldb-api :: lang/c/stepping/TestThreadStepping.py (1130 of 1935)
PASS: lldb-unit :: Utility/./UtilityTests/SerializationRountripTest.SerializeDeserializeCStringNull (1131 of 1935)
PASS: lldb-unit :: Utility/./UtilityTests/ArgsTest.TestSingleArgWithQuotedSpace (1132 of 1935)
PASS: lldb-api :: functionalities/data-formatter/array_typedef/TestArrayTypedef.py (1133 of 1935)
PASS: lldb-api :: lang/objc/modules-app-update/TestClangModulesAppUpdate.py (1134 of 1935)
PASS: lldb-unit :: Expression/./ExpressionTests/CppModuleConfigurationTest.AmbiguousCLib (1135 of 1935)
PASS: lldb-api :: functionalities/float-display/TestFloatDisplay.py (1136 of 1935)
PASS: lldb-unit :: Expression/./ExpressionTests/CppModuleConfigurationTest.UnrelatedLibrary (1137 of 1935)
PASS: lldb-api :: functionalities/data-formatter/data-formatter-stl/libcxx/queue/TestDataFormatterLibcxxQueue.py (1138 of 1935)
PASS: lldb-shell :: Commands/command-script-import.test (1139 of 1935)
PASS: lldb-unit :: Host/./HostTests/FileSystemTest.EnumerateDirectory (1140 of 1935)
PASS: lldb-api :: functionalities/return-value/TestReturnValue.py (1141 of 1935)
PASS: lldb-api :: functionalities/fat_archives/TestFatArchives.py (1142 of 1935)
PASS: lldb-unit :: Utility/./UtilityTests/FileSpecTest.EqualDotsPosix (1143 of 1935)
PASS: lldb-unit :: ObjectFile/Breakpad/./ObjectFileBreakpadTests/InfoRecord.parse (1144 of 1935)
PASS: lldb-unit :: Host/./HostTests/ConnectionFileDescriptorTest.TCPGetURIv4 (1145 of 1935)
PASS: lldb-api :: commands/expression/import-std-module/shared_ptr/TestSharedPtrFromStdModule.py (1146 of 1935)
PASS: lldb-unit :: Utility/./UtilityTests/FileSpecTest.EqualSeparator (1147 of 1935)
PASS: lldb-api :: lang/cpp/namespace/TestNamespace.py (1148 of 1935)
PASS: lldb-shell :: SymbolFile/DWARF/debug-types-missing-signature.test (1149 of 1935)
PASS: lldb-unit :: Utility/./UtilityTests/TimeoutTest.Format (1150 of 1935)
PASS: lldb-shell :: SymbolFile/Breakpad/line-table-edgecases.test (1151 of 1935)
PASS: lldb-unit :: Utility/./UtilityTests/RangeDataVector.CustomSort (1152 of 1935)
PASS: lldb-api :: functionalities/thread/concurrent_events/TestConcurrentDelayedCrashWithBreakpointSignal.py (1153 of 1935)
UNSUPPORTED: lldb-api :: functionalities/signal/handle-segv/TestHandleSegv.py (1154 of 1935)
PASS: lldb-unit :: Utility/./UtilityTests/StringListTest.JoinMultiCharSeparator (1155 of 1935)
PASS: lldb-unit :: Utility/./UtilityTests/SerializationRountripTest.SerializeDeserializePodPointers (1156 of 1935)
PASS: lldb-unit :: Process/minidump/./LLDBMinidumpTests/RegisterContextMinidump.ConvertMinidumpContext_x86_64 (1157 of 1935)
PASS: lldb-unit :: Editline/./EditlineTests/EditlineTestFixture.EditlineReceivesMultiLineText (1158 of 1935)
PASS: lldb-api :: commands/expression/class_template_specialization_empty_pack/TestClassTemplateSpecializationParametersHandling.py (1159 of 1935)
PASS: lldb-unit :: Utility/./UtilityTests/LogChannelTest.Enable (1160 of 1935)
PASS: lldb-unit :: Utility/./UtilityTests/ArgsTest.TestSingleArg (1161 of 1935)
PASS: lldb-unit :: Language/Highlighting/./HighlighterTests/HighlighterTest.ClangCursorOutOfBounds (1162 of 1935)
PASS: lldb-api :: lang/c/unions/TestUnionMembers.py (1163 of 1935)
UNSUPPORTED: lldb-api :: lang/objc/objc-dynamic-value/TestObjCDynamicValue.py (1164 of 1935)
PASS: lldb-unit :: Symbol/./SymbolTests/Type.GetTypeScopeAndBasename (1165 of 1935)
PASS: lldb-api :: tools/lldb-server/inferior-crash/TestGdbRemoteAbort.py (1166 of 1935)
UNSUPPORTED: lldb-shell :: SymbolFile/target-symbols-add-unwind.test (1167 of 1935)
PASS: lldb-api :: commands/frame/var-scope/TestFrameVariableScope.py (1168 of 1935)
PASS: lldb-api :: lang/objc/rdar-10967107/TestRdar10967107.py (1169 of 1935)
PASS: lldb-unit :: Utility/./UtilityTests/StreamTeeTest.Write (1170 of 1935)
PASS: lldb-api :: functionalities/data-formatter/data-formatter-objc/TestDataFormatterObjCKVO.py (1171 of 1935)
PASS: lldb-api :: functionalities/signal/TestSendSignal.py (1172 of 1935)
PASS: lldb-unit :: Expression/./ExpressionTests/DiagnosticManagerTest.AppendMessageAttachToLastDiag (1173 of 1935)
PASS: lldb-unit :: Utility/./UtilityTests/BinaryStreamTest.PutSLEB128OneByte (1174 of 1935)
PASS: lldb-unit :: Process/gdb-remote/./ProcessGdbRemoteTests/GDBRemoteCommunicationClientTest.SyncThreadState (1175 of 1935)
PASS: lldb-unit :: Utility/./UtilityTests/UUIDTest.SetFromStringRef (1176 of 1935)
PASS: lldb-unit :: SymbolFile/NativePDB/./SymbolFileNativePDBTests/PDBFPOProgramToDWARFExpressionTests.UnresolvedRegisterAssignmentReference (1177 of 1935)
PASS: lldb-unit :: Utility/./UtilityTests/DataExtractorTest.GetCStrUnterminated (1178 of 1935)
PASS: lldb-unit :: Utility/./UtilityTests/StreamTest.PutULEB128 (1179 of 1935)
PASS: lldb-unit :: ScriptInterpreter/Python/./ScriptInterpreterPythonTests/PythonDataObjectsTest.TestPythonTupleToStructuredList (1180 of 1935)
UNSUPPORTED: lldb-api :: lang/cpp/printf/TestPrintf.py (1181 of 1935)
PASS: lldb-unit :: Process/gdb-remote/./ProcessGdbRemoteTests/GDBRemoteCommunicationClientTest.GetModulesInfoInvalidResponse (1182 of 1935)
PASS: lldb-api :: functionalities/thread/thread_specific_break/TestThreadSpecificBreakpoint.py (1183 of 1935)
PASS: lldb-api :: python_api/type/TestTypeList.py (1184 of 1935)
PASS: lldb-unit :: ScriptInterpreter/Python/./ScriptInterpreterPythonTests/PythonDataObjectsTest.TestPythonByteArray (1185 of 1935)
PASS: lldb-api :: commands/watchpoints/watchpoint_commands/condition/TestWatchpointConditionCmd.py (1186 of 1935)
PASS: lldb-unit :: Utility/./UtilityTests/StringLexerTest.Peek (1187 of 1935)
PASS: lldb-shell :: ObjectFile/ELF/PT_LOAD-overlap-section.yaml (1188 of 1935)
PASS: lldb-shell :: SymbolFile/NativePDB/break-by-line.cpp (1189 of 1935)
PASS: lldb-unit :: Process/gdb-remote/./ProcessGdbRemoteTests/GDBRemoteCommunicationClientTest.SendStopTracePacket (1190 of 1935)
PASS: lldb-unit :: Utility/./UtilityTests/BinaryStreamTest.PutULEB128EightBytes (1191 of 1935)
PASS: lldb-unit :: Symbol/./SymbolTests/TestTypeSystemClang.TestGetTypeClassTypeOf (1192 of 1935)
PASS: lldb-unit :: Utility/./UtilityTests/NameMatchesTest.Equals (1193 of 1935)
PASS: lldb-api :: functionalities/data-formatter/type_summary_list_arg/TestTypeSummaryListArg.py (1194 of 1935)
PASS: lldb-shell :: SymbolFile/Breakpad/symtab-macho.test (1195 of 1935)
PASS: lldb-api :: lang/objc/foundation/TestConstStrings.py (1196 of 1935)
UNSUPPORTED: lldb-shell :: ScriptInterpreter/Lua/independent_state.test (1197 of 1935)
PASS: lldb-api :: commands/expression/test/TestExprs.py (1198 of 1935)
PASS: lldb-api :: lang/objcxx/objcxx-ivar-vector/TestIvarVector.py (1199 of 1935)
PASS: lldb-unit :: Utility/./UtilityTests/ScalarTest.Comparison (1200 of 1935)
PASS: lldb-shell :: Settings/TestModuleCacheSanity.test (1201 of 1935)
PASS: lldb-api :: tools/lldb-vscode/breakpoint/TestVSCode_setExceptionBreakpoints.py (1202 of 1935)
PASS: lldb-shell :: SymbolFile/DWARF/debug_loc-aslr.s (1203 of 1935)
PASS: lldb-api :: functionalities/breakpoint/breakpoint_command/TestBreakpointCommandsFromPython.py (1204 of 1935)
UNSUPPORTED: lldb-shell :: SymbolFile/PDB/variables-locations.test (1205 of 1935)
PASS: lldb-api :: python_api/watchpoint/TestWatchpointIter.py (1206 of 1935)
PASS: lldb-api :: lang/c/struct_types/TestStructTypes.py (1207 of 1935)
UNSUPPORTED: lldb-api :: tools/lldb-server/TestGdbRemoteModuleInfo.py (1208 of 1935)
PASS: lldb-shell :: SymbolFile/DWARF/debug_aranges-empty-section.s (1209 of 1935)
UNSUPPORTED: lldb-api :: functionalities/darwin_log/format/TestDarwinLogMessageFormat.py (1210 of 1935)
PASS: lldb-api :: functionalities/optimized_code/TestNoASanExceptionAfterEvalOP_piece.py (1211 of 1935)
PASS: lldb-unit :: UnwindAssembly/x86/./UnwindAssemblyx86Tests/Testx86AssemblyInspectionEngine.TestPushR15 (1212 of 1935)
PASS: lldb-unit :: Target/./TargetTests/MemoryRegionInfoTest.Formatv (1213 of 1935)
PASS: lldb-api :: python_api/file_handle/TestFileHandle.py (1214 of 1935)
PASS: lldb-unit :: Utility/./UtilityTests/BinaryStreamTest.PutULEB128FiveBytes (1215 of 1935)
PASS: lldb-unit :: Utility/./UtilityTests/StringExtractorTest.GetHexBytesAvail_FullString (1216 of 1935)
PASS: lldb-api :: lang/cpp/char8_t/TestCxxChar8_t.py (1217 of 1935)
PASS: lldb-unit :: Process/gdb-remote/./ProcessGdbRemoteTests/GDBRemoteCommunicationClientTest.SendStartTracePacket (1218 of 1935)
PASS: lldb-api :: functionalities/var_path/TestVarPath.py (1219 of 1935)
UNSUPPORTED: lldb-shell :: Register/x86-64-zmm-write.test (1220 of 1935)
PASS: lldb-shell :: ObjectFile/PECOFF/basic-info-arm.yaml (1221 of 1935)
PASS: lldb-unit :: Process/minidump/./LLDBMinidumpTests/MinidumpParserTest.MinidumpDuplicateModuleMinAddress (1222 of 1935)
PASS: lldb-unit :: SymbolFile/NativePDB/./SymbolFileNativePDBTests/PDBFPOProgramToDWARFExpressionTests.MissingTargetRegister (1223 of 1935)
PASS: lldb-api :: functionalities/data-formatter/data-formatter-disabling/TestDataFormatterDisabling.py (1224 of 1935)
PASS: lldb-api :: functionalities/thread/exit_during_step/TestExitDuringStep.py (1225 of 1935)
UNSUPPORTED: lldb-api :: commands/watchpoints/variable_out_of_scope/TestWatchedVarHitWhenInScope.py (1226 of 1935)
PASS: lldb-api :: commands/expression/vector_of_enums/TestVectorOfEnums.py (1227 of 1935)
PASS: lldb-unit :: Utility/./UtilityTests/UriParserTest.BracketedHostnameWithColon (1228 of 1935)
PASS: lldb-shell :: BuildScript/compiler-full-path.test (1229 of 1935)
PASS: lldb-unit :: SymbolFile/NativePDB/./SymbolFileNativePDBTests/PDBFPOProgramToDWARFExpressionTests.UnknownOp (1230 of 1935)
PASS: lldb-unit :: Utility/./UtilityTests/IndexToObjectTest.ObjectForIndex (1231 of 1935)
PASS: lldb-unit :: Utility/./UtilityTests/StringExtractorTest.GetNameColonValueSuccess (1232 of 1935)
UNSUPPORTED: lldb-api :: functionalities/asan/TestMemoryHistory.py (1233 of 1935)
PASS: lldb-api :: lang/cpp/namespace_conflicts/TestNamespaceConflicts.py (1234 of 1935)
PASS: lldb-unit :: Utility/./UtilityTests/StreamTest.PutCStringWithStringRef (1235 of 1935)
PASS: lldb-api :: commands/target/create-no-such-arch/TestNoSuchArch.py (1236 of 1935)
PASS: lldb-unit :: Symbol/./SymbolTests/TestClangASTImporter.CompleteFwdDeclWithOtherOrigin (1237 of 1935)
PASS: lldb-api :: lang/cpp/modules-import/TestCXXModulesImport.py (1238 of 1935)
PASS: lldb-api :: tools/lldb-vscode/breakpoint-events/TestVSCode_breakpointEvents.py (1239 of 1935)
PASS: lldb-api :: lang/c/anonymous/TestAnonymous.py (1240 of 1935)
PASS: lldb-shell :: Minidump/breakpad-symbols.test (1241 of 1935)
PASS: lldb-api :: lang/cpp/unique-types/TestUniqueTypes.py (1242 of 1935)
PASS: lldb-api :: lang/objc/variadic_methods/TestVariadicMethods.py (1243 of 1935)
PASS: lldb-api :: functionalities/thread/concurrent_events/TestConcurrentTwoWatchpointsOneSignal.py (1244 of 1935)
PASS: lldb-api :: functionalities/thread/concurrent_events/TestConcurrentTwoWatchpointThreads.py (1245 of 1935)
UNSUPPORTED: lldb-shell :: SymbolFile/PDB/type-quals.test (1246 of 1935)
PASS: lldb-shell :: Breakpoint/debug_rnglist_offset_pair.test (1247 of 1935)
PASS: lldb-api :: api/log/TestAPILog.py (1248 of 1935)
PASS: lldb-unit :: Symbol/./SymbolTests/TestClangASTImporter.DeportTypeTagDecl (1249 of 1935)
PASS: lldb-api :: python_api/process/io/TestProcessIO.py (1250 of 1935)
PASS: lldb-api :: commands/watchpoints/watchpoint_set_command/TestWatchLocationWithWatchSet.py (1251 of 1935)
PASS: lldb-unit :: Utility/./UtilityTests/RecordReplayTest.InstrumentedBarRef (1252 of 1935)
PASS: lldb-api :: lang/cpp/trivial_abi/TestTrivialABI.py (1253 of 1935)
PASS: lldb-unit :: SymbolFile/NativePDB/./SymbolFileNativePDBTests/PDBFPOProgramToDWARFExpressionTests.UnresolvedDependentCyclicRegisterAssignmentReference (1254 of 1935)
PASS: lldb-shell :: SymbolFile/NativePDB/function-types-calling-conv.cpp (1255 of 1935)
UNRESOLVED: lldb-api :: functionalities/gdb_remote_client/TestWasm.py (1256 of 1935)
******************** TEST 'lldb-api :: functionalities/gdb_remote_client/TestWasm.py' FAILED ********************
Script:
--
/usr/local/bin/python /Users/buildslave/jenkins/workspace/lldb-cmake-sanitized/llvm-project/lldb/test/API/dotest.py --arch x86_64 -s /Users/buildslave/jenkins/workspace/lldb-cmake-sanitized/lldb-build/lldb-test-traces -S nm -u CXXFLAGS -u CFLAGS --codesign-identity lldb_codesign --server /Users/buildslave/jenkins/workspace/lldb-cmake-sanitized/lldb-build/./bin/debugserver --arch x86_64 --build-dir /Users/buildslave/jenkins/workspace/lldb-cmake-sanitized/lldb-build/lldb-test-build.noindex -s=/Users/buildslave/jenkins/workspace/lldb-cmake-sanitized/test/logs -t --env TERM=vt100 --env LLVM_LIBS_DIR=/Users/buildslave/jenkins/workspace/lldb-cmake-sanitized/lldb-build/./lib --inferior-env ASAN_OPTIONS=detect_stack_use_after_return=1 --inferior-env DYLD_INSERT_LIBRARIES=/Users/buildslave/jenkins/workspace/lldb-cmake-sanitized/host-compiler/lib/clang/11.0.0/lib/darwin/libclang_rt.asan_osx_dynamic.dylib --build-dir /Users/buildslave/jenkins/workspace/lldb-cmake-sanitized/lldb-build/lldb-test-build.noindex --lldb-module-cache-dir /Users/buildslave/jenkins/workspace/lldb-cmake-sanitized/lldb-build/lldb-test-build.noindex/module-cache-lldb/lldb-api --clang-module-cache-dir /Users/buildslave/jenkins/workspace/lldb-cmake-sanitized/lldb-build/lldb-test-build.noindex/module-cache-clang/lldb-api --executable /Users/buildslave/jenkins/workspace/lldb-cmake-sanitized/lldb-build/./bin/lldb --compiler /Users/buildslave/jenkins/workspace/lldb-cmake-sanitized/lldb-build/./bin/clang --dsymutil /Users/buildslave/jenkins/workspace/lldb-cmake-sanitized/lldb-build/./bin/dsymutil --filecheck /Users/buildslave/jenkins/workspace/lldb-cmake-sanitized/lldb-build/./bin/FileCheck --lldb-libs-dir /Users/buildslave/jenkins/workspace/lldb-cmake-sanitized/lldb-build/./lib /Users/buildslave/jenkins/workspace/lldb-cmake-sanitized/llvm-project/lldb/test/API/functionalities/gdb_remote_client -p TestWasm.py
--
Exit Code: -6

Hide Details

Command Output (stdout): -- lldb version 11.0.99 clang revision 6085593c128e91fd7db998c5441ebe120c7e4f04 llvm revision 6085593c128e91fd7db998c5441ebe120c7e4f04

Hide Details

-- Command Output (stderr): -- ================================================================= ==5440==ERROR: AddressSanitizer: container-overflow on address 0x615000016184 at pc 0x000101f5c8e3 bp 0x7ffeedce9130 sp 0x7ffeedce88f8 READ of size 512 at 0x615000016184 thread T0 #0 0x101f5c8e2 in __asan_memcpy+0x1b2 (libclang_rt.asan_osx_dynamic.dylib:x86_64+0x418e2) #1 0x10be814e5 in lldb_private::MemoryCache::Read(unsigned long long, void*, unsigned long, lldb_private::Status&) Memory.cpp:189 #2 0x10b9d5ef9 in lldb_private::Module::GetMemoryObjectFile(std::__1::shared_ptr<lldb_private::Process> const&, unsigned long long, lldb_private::Status&, unsigned long) Module.cpp:298 #3 0x10bed7cff in lldb_private::Process::ReadModuleFromMemory(lldb_private::FileSpec const&, unsigned long long, unsigned long) Process.cpp:2402 #4 0x10b96c18b in lldb_private::DynamicLoader::LoadModuleAtAddress(lldb_private::FileSpec const&, unsigned long long, unsigned long long, bool) DynamicLoader.cpp:212 #5 0x10c707c3a in lldb_private::process_gdb_remote::ProcessGDBRemote::LoadModuleAtAddress(lldb_private::FileSpec const&, unsigned long long, unsigned long long, bool) ProcessGDBRemote.cpp:4767 #6 0x10c708218 in lldb_private::process_gdb_remote::ProcessGDBRemote::LoadModules() ProcessGDBRemote.cpp:4801 #7 0x10c1fe7ca in lldb_private::wasm::DynamicLoaderWasmDYLD::DidAttach() DynamicLoaderWasmDYLD.cpp:63 #8 0x10bedc8a7 in lldb_private::Process::CompleteAttach() Process.cpp:2930 #9 0x10bedf9ef in lldb_private::Process::ConnectRemote(lldb_private::Stream*, llvm::StringRef) Process.cpp:3015 #10 0x10b27029e in lldb::SBTarget::ConnectRemote(lldb::SBListener&, char const*, char const*, lldb::SBError&) SBTarget.cpp:559 #11 0x10b75d141 in _wrap_SBTarget_ConnectRemote(_object*, _object*) LLDBWrapPython.cpp:52799 #12 0x102cb7226 in _PyMethodDef_RawFastCallKeywords+0xeb (Python:x86_64+0x1a226) #13 0x102cb68c6 in _PyCFunction_FastCallKeywords+0x2b (Python:x86_64+0x198c6) #14 0x102d4c905 in call_function+0x1de (Python:x86_64+0xaf905) #15 0x102d455ee in _PyEval_EvalFrameDefault+0x1b51 (Python:x86_64+0xa85ee) #16 0x102cb6ca1 in function_code_fastcall+0x6f (Python:x86_64+0x19ca1) #17 0x102d4c97d in call_function+0x256 (Python:x86_64+0xaf97d) #18 0x102d455d5 in _PyEval_EvalFrameDefault+0x1b38 (Python:x86_64+0xa85d5) #19 0x102cb6ca1 in function_code_fastcall+0x6f (Python:x86_64+0x19ca1) #20 0x102d4c97d in call_function+0x256 (Python:x86_64+0xaf97d) #21 0x102d455d5 in _PyEval_EvalFrameDefault+0x1b38 (Python:x86_64+0xa85d5) #22 0x102cb6ca1 in function_code_fastcall+0x6f (Python:x86_64+0x19ca1) #23 0x102d4c97d in call_function+0x256 (Python:x86_64+0xaf97d) #24 0x102d4568c in _PyEval_EvalFrameDefault+0x1bef (Python:x86_64+0xa868c) #25 0x102cb6ca1 in function_code_fastcall+0x6f (Python:x86_64+0x19ca1) #26 0x102d4c97d in call_function+0x256 (Python:x86_64+0xaf97d) #27 0x102d455d5 in _PyEval_EvalFrameDefault+0x1b38 (Python:x86_64+0xa85d5) #28 0x102d4d2da in _PyEval_EvalCodeWithName+0x72a (Python:x86_64+0xb02da) #29 0x102cb64f4 in _PyFunction_FastCallDict+0x1b8 (Python:x86_64+0x194f4) #30 0x102cb7624 in _PyObject_Call_Prepend+0x95 (Python:x86_64+0x1a624) #31 0x102cb69d4 in PyObject_Call+0x87 (Python:x86_64+0x199d4) #32 0x102d45905 in _PyEval_EvalFrameDefault+0x1e68 (Python:x86_64+0xa8905) #33 0x102d4d2da in _PyEval_EvalCodeWithName+0x72a (Python:x86_64+0xb02da) #34 0x102cb64f4 in _PyFunction_FastCallDict+0x1b8 (Python:x86_64+0x194f4) #35 0x102cb7624 in _PyObject_Call_Prepend+0x95 (Python:x86_64+0x1a624) #36 0x102cf44af in slot_tp_call+0x46 (Python:x86_64+0x574af) #37 0x102cb672c in _PyObject_FastCallKeywords+0x166 (Python:x86_64+0x1972c) #38 0x102d4c976 in call_function+0x24f (Python:x86_64+0xaf976) #39 0x102d4568c in _PyEval_EvalFrameDefault+0x1bef (Python:x86_64+0xa868c) #40 0x102d4d2da in _PyEval_EvalCodeWithName+0x72a (Python:x86_64+0xb02da) #41 0x102cb688b in _PyFunction_FastCallKeywords+0xe0 (Python:x86_64+0x1988b) #42 0x102d4c97d in call_function+0x256 (Python:x86_64+0xaf97d) #43 0x102d455d5 in _PyEval_EvalFrameDefault+0x1b38 (Python:x86_64+0xa85d5) #44 0x102d4d2da in _PyEval_EvalCodeWithName+0x72a (Python:x86_64+0xb02da) #45 0x102cb688b in _PyFunction_FastCallKeywords+0xe0 (Python:x86_64+0x1988b) #46 0x102d4c97d in call_function+0x256 (Python:x86_64+0xaf97d) #47 0x102d455d5 in _PyEval_EvalFrameDefault+0x1b38 (Python:x86_64+0xa85d5) #48 0x102cb6ca1 in function_code_fastcall+0x6f (Python:x86_64+0x19ca1) #49 0x102cb7624 in _PyObject_Call_Prepend+0x95 (Python:x86_64+0x1a624) #50 0x102cb69d4 in PyObject_Call+0x87 (Python:x86_64+0x199d4) #51 0x102d45905 in _PyEval_EvalFrameDefault+0x1e68 (Python:x86_64+0xa8905) #52 0x102d4d2da in _PyEval_EvalCodeWithName+0x72a (Python:x86_64+0xb02da) #53 0x102cb64f4 in _PyFunction_FastCallDict+0x1b8 (Python:x86_64+0x194f4) #54 0x102cb7624 in _PyObject_Call_Prepend+0x95 (Python:x86_64+0x1a624) #55 0x102cf44af in slot_tp_call+0x46 (Python:x86_64+0x574af) #56 0x102cb672c in _PyObject_FastCallKeywords+0x166 (Python:x86_64+0x1972c) #57 0x102d4c976 in call_function+0x24f (Python:x86_64+0xaf976) #58 0x102d4568c in _PyEval_EvalFrameDefault+0x1bef (Python:x86_64+0xa868c) #59 0x102cb6ca1 in function_code_fastcall+0x6f (Python:x86_64+0x19ca1) #60 0x102d4c97d in call_function+0x256 (Python:x86_64+0xaf97d) #61 0x102d455d5 in _PyEval_EvalFrameDefault+0x1b38 (Python:x86_64+0xa85d5) #62 0x102cb6ca1 in function_code_fastcall+0x6f (Python:x86_64+0x19ca1) #63 0x102d4c97d in call_function+0x256 (Python:x86_64+0xaf97d) #64 0x102d455ee in _PyEval_EvalFrameDefault+0x1b51 (Python:x86_64+0xa85ee) #65 0x102d4d2da in _PyEval_EvalCodeWithName+0x72a (Python:x86_64+0xb02da) #66 0x102d43a14 in PyEval_EvalCode+0x29 (Python:x86_64+0xa6a14) #67 0x102d722aa in run_mod+0x35 (Python:x86_64+0xd52aa) #68 0x102d712c5 in PyRun_FileExFlags+0xa3 (Python:x86_64+0xd42c5) #69 0x102d709a4 in PyRun_SimpleFileExFlags+0x114 (Python:x86_64+0xd39a4) #70 0x102d88010 in pymain_main+0x13de (Python:x86_64+0xeb010) #71 0x102d887b7 in _Py_UnixMain+0x67 (Python:x86_64+0xeb7b7) #72 0x7fff63d3b084 in start+0x0 (libdyld.dylib:x86_64+0x17084)

Hide Details

0x615000016300 is located 0 bytes to the right of 512-byte region [0x615000016100,0x615000016300) allocated by thread T0 here: #0 0x101f6b60d in wrap__Znwm+0x7d (libclang_rt.asan_osx_dynamic.dylib:x86_64+0x5060d) #1 0x10c0b1950 in std::__1::vector<unsigned char, std::__1::allocator<unsigned char> >::__vallocate(unsigned long) new:253 #2 0x10c0ad4ff in std::__1::vector<unsigned char, std::__1::allocator<unsigned char> >::assign(unsigned long, unsigned char const&) vector:1481 #3 0x10c0ad34a in lldb_private::DataBufferHeap::DataBufferHeap(unsigned long long, unsigned char) DataBufferHeap.cpp:20 #4 0x10be8188d in lldb_private::MemoryCache::Read(unsigned long long, void*, unsigned long, lldb_private::Status&) Memory.cpp:228 #5 0x10b9d5ef9 in lldb_private::Module::GetMemoryObjectFile(std::__1::shared_ptr<lldb_private::Process> const&, unsigned long long, lldb_private::Status&, unsigned long) Module.cpp:298 #6 0x10bed7cff in lldb_private::Process::ReadModuleFromMemory(lldb_private::FileSpec const&, unsigned long long, unsigned long) Process.cpp:2402 #7 0x10b96c18b in lldb_private::DynamicLoader::LoadModuleAtAddress(lldb_private::FileSpec const&, unsigned long long, unsigned long long, bool) DynamicLoader.cpp:212 #8 0x10c707c3a in lldb_private::process_gdb_remote::ProcessGDBRemote::LoadModuleAtAddress(lldb_private::FileSpec const&, unsigned long long, unsigned long long, bool) ProcessGDBRemote.cpp:4767 #9 0x10c708218 in lldb_private::process_gdb_remote::ProcessGDBRemote::LoadModules() ProcessGDBRemote.cpp:4801 #10 0x10c1fe7ca in lldb_private::wasm::DynamicLoaderWasmDYLD::DidAttach() DynamicLoaderWasmDYLD.cpp:63 #11 0x10bedc8a7 in lldb_private::Process::CompleteAttach() Process.cpp:2930 #12 0x10bedf9ef in lldb_private::Process::ConnectRemote(lldb_private::Stream*, llvm::StringRef) Process.cpp:3015 #13 0x10b27029e in lldb::SBTarget::ConnectRemote(lldb::SBListener&, char const*, char const*, lldb::SBError&) SBTarget.cpp:559 #14 0x10b75d141 in _wrap_SBTarget_ConnectRemote(_object*, _object*) LLDBWrapPython.cpp:52799 #15 0x102cb7226 in _PyMethodDef_RawFastCallKeywords+0xeb (Python:x86_64+0x1a226) #16 0x102cb68c6 in _PyCFunction_FastCallKeywords+0x2b (Python:x86_64+0x198c6) #17 0x102d4c905 in call_function+0x1de (Python:x86_64+0xaf905) #18 0x102d455ee in _PyEval_EvalFrameDefault+0x1b51 (Python:x86_64+0xa85ee) #19 0x102cb6ca1 in function_code_fastcall+0x6f (Python:x86_64+0x19ca1) #20 0x102d4c97d in call_function+0x256 (Python:x86_64+0xaf97d) #21 0x102d455d5 in _PyEval_EvalFrameDefault+0x1b38 (Python:x86_64+0xa85d5) #22 0x102cb6ca1 in function_code_fastcall+0x6f (Python:x86_64+0x19ca1) #23 0x102d4c97d in call_function+0x256 (Python:x86_64+0xaf97d) #24 0x102d455d5 in _PyEval_EvalFrameDefault+0x1b38 (Python:x86_64+0xa85d5) #25 0x102cb6ca1 in function_code_fastcall+0x6f (Python:x86_64+0x19ca1) #26 0x102d4c97d in call_function+0x256 (Python:x86_64+0xaf97d) #27 0x102d4568c in _PyEval_EvalFrameDefault+0x1bef (Python:x86_64+0xa868c) #28 0x102cb6ca1 in function_code_fastcall+0x6f (Python:x86_64+0x19ca1) #29 0x102d4c97d in call_function+0x256 (Python:x86_64+0xaf97d)

Hide Details

HINT: if you don't care about these errors you may set ASAN_OPTIONS=detect_container_overflow=0. If you suspect a false positive see also: https://github.com/google/sanitizers/wiki/AddressSanitizerContainerOverflow. SUMMARY: AddressSanitizer: container-overflow (libclang_rt.asan_osx_dynamic.dylib:x86_64+0x418e2) in __asan_memcpy+0x1b2 Shadow bytes around the buggy address: 0x1c2a00002be0: 00 00 00 00 00 00 00 00 00 00 00 00 00 00 00 00 0x1c2a00002bf0: 00 00 00 00 00 00 00 00 00 00 00 00 00 00 00 00 0x1c2a00002c00: 00 00 00 00 00 00 00 00 00 00 00 00 00 00 00 00 0x1c2a00002c10: fa fa fa fa fa fa fa fa fa fa fa fa fa fa fa fa 0x1c2a00002c20: 00 00 00 00 00 00 00 00 00 00 00 00 00 00 00 00 =>0x1c2a00002c30:[04]fc fc fc fc fc fc fc fc fc fc fc fc fc fc fc 0x1c2a00002c40: fc fc fc fc fc fc fc fc fc fc fc fc fc fc fc fc 0x1c2a00002c50: fc fc fc fc fc fc fc fc fc fc fc fc fc fc fc fc 0x1c2a00002c60: fa fa fa fa fa fa fa fa fa fa fa fa fa fa fa fa 0x1c2a00002c70: fd fd fd fd fd fd fd fd fd fd fd fd fd fd fd fd 0x1c2a00002c80: fd fd fd fd fd fd fd fd fd fd fd fd fd fd fd fd Shadow byte legend (one shadow byte represents 8 application bytes): Addressable: 00 Partially addressable: 01 02 03 04 05 06 07 Heap left redzone: fa Freed heap region: fd Stack left redzone: f1 Stack mid redzone: f2 Stack right redzone: f3 Stack after return: f5 Stack use after scope: f8 Global redzone: f9 Global init order: f6 Poisoned by user: f7 Container overflow: fc Array cookie: ac Intra object redzone: bb ASan internal: fe Left alloca redzone: ca Right alloca redzone: cb Shadow gap: cc ==5440==ABORTING

Hide Details

--

Hide Details

******************** PASS: lldb-api :: functionalities/data-formatter/data-formatter-ptr-to-array/TestPtrToArrayFormatting.py (1257 of 1935) PASS: lldb-unit :: Expression/./ExpressionTests/CppModuleConfigurationTest.UnknownLibCppFile (1258 of 1935) PASS: lldb-unit :: Utility/./UtilityTests/BinaryStreamTest.PutULEB128NineBytes (1259 of 1935) PASS: lldb-api :: commands/expression/static-initializers/TestStaticInitializers.py (1260 of 1935) PASS: lldb-unit :: SymbolFile/NativePDB/./SymbolFileNativePDBTests/PDBFPOProgramToDWARFExpressionTests.InvalidOpBinary (1261 of 1935) PASS: lldb-unit :: Symbol/./SymbolTests/DWARFCallFrameInfoTest.Basic_dwarf4 (1262 of 1935) PASS: lldb-api :: lang/objcxx/hide-runtime-values/TestObjCXXHideRuntimeValues.py (1263 of 1935) PASS: lldb-unit :: Language/CPlusPlus/./LanguageCPlusPlusTests/CPlusPlusLanguage.ExtractContextAndIdentifier (1264 of 1935) PASS: lldb-unit :: Process/gdb-remote/./ProcessGdbRemoteTests/GDBRemoteCommunicationServerTest.SendErrorResponse_ErrorList (1265 of 1935) PASS: lldb-unit :: Target/./TargetTests/ExecutionContextTest.GetByteOrderProcess (1266 of 1935) PASS: lldb-api :: python_api/frame/inlines/TestInlinedFrame.py (1267 of 1935) PASS: lldb-shell :: ObjectFile/ELF/section-addresses.yaml (1268 of 1935) PASS: lldb-unit :: Utility/./UtilityTests/Flags.AllClear (1269 of 1935) PASS: lldb-unit :: ScriptInterpreter/Python/./ScriptInterpreterPythonTests/PythonDataObjectsTest.TestPythonListManipulation (1270 of 1935) PASS: lldb-unit :: Utility/./UtilityTests/StringListTest.ShiftMove (1271 of 1935) PASS: lldb-unit :: Host/./HostTests/NativeProcessProtocolTest.SetBreakpoint (1272 of 1935) PASS: lldb-unit :: Utility/./UtilityTests/StringExtractorTest.GetHexBytes (1273 of 1935) PASS: lldb-api :: python_api/exprpath_synthetic/TestExprPathSynthetic.py (1274 of 1935) PASS: lldb-unit :: Utility/./UtilityTests/ArgsTest.ReplaceArgumentAtIndexFarOutOfRange (1275 of 1935) PASS: lldb-unit :: Utility/./UtilityTests/StringListTest.GetMaxStringLengthDecreasingSize (1276 of 1935) PASS: lldb-unit :: Utility/./UtilityTests/StreamTest.PutMaxHex64ByteOrderLittle (1277 of 1935) PASS: lldb-api :: functionalities/data-formatter/synthupdate/TestSyntheticFilterRecompute.py (1278 of 1935) PASS: lldb-unit :: Host/./HostTests/HostInfoTest.GetAugmentedArchSpec (1279 of 1935) PASS: lldb-api :: commands/frame/diagnose/complicated-expression/TestComplicatedExpression.py (1280 of 1935) PASS: lldb-api :: functionalities/thread/concurrent_events/TestConcurrentTwoBreakpointsOneDelaySignal.py (1281 of 1935) UNSUPPORTED: lldb-shell :: ObjectFile/ELF/minidebuginfo-set-and-hit-breakpoint.test (1282 of 1935) PASS: lldb-unit :: Utility/./UtilityTests/SubsystemRAIITest.SubsystemWithErrorFailure (1283 of 1935) PASS: lldb-api :: tools/lldb-server/TestAppleSimulatorOSType.py (1284 of 1935) PASS: lldb-unit :: Utility/./UtilityTests/LogTest.LLDB_LOG_nullptr (1285 of 1935) PASS: lldb-api :: lang/cpp/gmodules/TestWithModuleDebugging.py (1286 of 1935) UNSUPPORTED: lldb-shell :: Register/x86-64-ymm16-write.test (1287 of 1935) PASS: lldb-unit :: Utility/./UtilityTests/StreamTest.AddressPrefix (1288 of 1935) PASS: lldb-api :: lang/c/tls_globals/TestTlsGlobals.py (1289 of 1935) PASS: lldb-api :: commands/expression/call-function/TestCallBuiltinFunction.py (1290 of 1935) PASS: lldb-api :: lang/c/local_types/TestUseClosestType.py (1291 of 1935) PASS: lldb-shell :: SymbolFile/DWARF/find-qualified-variable.cpp (1292 of 1935) PASS: lldb-api :: functionalities/breakpoint/step_over_breakpoint/TestStepOverBreakpoint.py (1293 of 1935) PASS: lldb-unit :: Utility/./UtilityTests/UserIDResolver.GetUserName (1294 of 1935) PASS: lldb-unit :: Platform/./LLDBPlatformTests/PlatformDarwinTest.TestParseVersionBuildDir (1295 of 1935) PASS: lldb-api :: functionalities/object-file/TestImageListMultiArchitecture.py (1296 of 1935) PASS: lldb-unit :: UnwindAssembly/x86/./UnwindAssemblyx86Tests/Testx86AssemblyInspectionEngine.TestPopRBP (1297 of 1935) PASS: lldb-unit :: Utility/./UtilityTests/BinaryStreamTest.PutSLEB128SixBytes (1298 of 1935) PASS: lldb-api :: lang/c/vla/TestVLA.py (1299 of 1935) PASS: lldb-shell :: Reproducer/TestVersionCheck.test (1300 of 1935) PASS: lldb-unit :: Utility/./UtilityTests/BinaryStreamTest.PutSLEB128TwoBytes (1301 of 1935) PASS: lldb-unit :: Utility/./UtilityTests/RangeTest.DoesIntersect (1302 of 1935) PASS: lldb-unit :: Symbol/./SymbolTests/TestTypeSystemClang.TestFunctionTemplateConstruction (1303 of 1935) PASS: lldb-api :: commands/frame/diagnose/local-variable/TestLocalVariable.py (1304 of 1935) PASS: lldb-shell :: SymbolFile/DWARF/debug_ranges_and_rnglists.test (1305 of 1935) PASS: lldb-unit :: Utility/./UtilityTests/AnsiTerminal.WhiteSpace (1306 of 1935) PASS: lldb-unit :: Utility/./UtilityTests/ScalarTest.SetValueFromCString (1307 of 1935) PASS: lldb-unit :: Expression/./ExpressionTests/DiagnosticManagerTest.GetStringMultipleDiags (1308 of 1935) PASS: lldb-unit :: UnwindAssembly/x86/./UnwindAssemblyx86Tests/Testx86AssemblyInspectionEngine.Test64bitFramelessSmallStackFrame (1309 of 1935) PASS: lldb-unit :: Utility/./UtilityTests/AnsiTerminal.Basic (1310 of 1935) PASS: lldb-api :: functionalities/data-formatter/format-propagation/TestFormatPropagation.py (1311 of 1935) PASS: lldb-api :: lang/objc/objc-stepping/TestObjCStepping.py (1312 of 1935) PASS: lldb-unit :: Utility/./UtilityTests/StreamTest.PutNHex8 (1313 of 1935) PASS: lldb-unit :: Utility/./UtilityTests/SubsystemRAIITest.SubsystemWithErrorSuccess (1314 of 1935) PASS: lldb-api :: lang/cpp/global_variables/TestCPPGlobalVariables.py (1315 of 1935) PASS: lldb-api :: functionalities/breakpoint/breakpoint_hit_count/TestBreakpointHitCount.py (1316 of 1935) UNSUPPORTED: lldb-shell :: ScriptInterpreter/Lua/nested_sessions.test (1317 of 1935) PASS: lldb-unit :: Utility/./UtilityTests/StreamTest.SetIndentLevel (1318 of 1935) UNSUPPORTED: lldb-shell :: Register/x86-64-gp-write.test (1319 of 1935) PASS: lldb-unit :: ScriptInterpreter/Python/./ScriptInterpreterPythonTests/PythonDataObjectsTest.TestPythonTupleValues (1320 of 1935) PASS: lldb-unit :: Utility/./UtilityTests/StreamTest.AddressRangeEmptyRange (1321 of 1935) PASS: lldb-api :: commands/expression/char/TestExprsChar.py (1322 of 1935) PASS: lldb-shell :: Minidump/fb-dump.test (1323 of 1935) PASS: lldb-unit :: Utility/./UtilityTests/RangeTest.SlideZero (1324 of 1935) PASS: lldb-api :: functionalities/rerun/TestRerun.py (1325 of 1935) PASS: lldb-unit :: Process/gdb-remote/./ProcessGdbRemoteTests/GDBRemoteCommunicationClientTest.GetModulesInfo (1326 of 1935) PASS: lldb-unit :: Utility/./UtilityTests/SubsystemRAIITest.NormalSubsystem (1327 of 1935) PASS: lldb-unit :: UnwindAssembly/x86/./UnwindAssemblyx86Tests/Testx86AssemblyInspectionEngine.TestStackRealign8BitDisp_i386 (1328 of 1935) PASS: lldb-unit :: UnwindAssembly/x86/./UnwindAssemblyx86Tests/Testx86AssemblyInspectionEngine.TestSimple64bitFrameFunction (1329 of 1935) PASS: lldb-unit :: UnwindAssembly/x86/./UnwindAssemblyx86Tests/Testx86AssemblyInspectionEngine.TestPush0 (1330 of 1935) PASS: lldb-api :: functionalities/tail_call_frames/unambiguous_sequence/TestUnambiguousTailCalls.py (1331 of 1935) PASS: lldb-unit :: Host/./HostTests/FileActionTest.Open (1332 of 1935) PASS: lldb-api :: lang/c/register_variables/TestRegisterVariables.py (1333 of 1935) PASS: lldb-unit :: Utility/./UtilityTests/StringExtractorTest.GetU32LittleEndian (1334 of 1935) PASS: lldb-unit :: Utility/./UtilityTests/StringExtractorTest.GetHexU8_Exact_NoEof (1335 of 1935) PASS: lldb-unit :: Symbol/./SymbolTests/PostfixExpression.ToDWARF (1336 of 1935) PASS: lldb-api :: functionalities/postmortem/minidump-new/TestMiniDumpUUID.py (1337 of 1935) PASS: lldb-api :: functionalities/process_group/TestChangeProcessGroup.py (1338 of 1935) PASS: lldb-shell :: SymbolFile/DWARF/debug_rnglists.s (1339 of 1935) PASS: lldb-unit :: Utility/./UtilityTests/StringExtractorTest.GetHexBytes_OddPair2 (1340 of 1935) PASS: lldb-api :: lang/objc/radar-9691614/TestObjCMethodReturningBOOL.py (1341 of 1935) PASS: lldb-unit :: Utility/./UtilityTests/ArchSpecTest.Compatibility (1342 of 1935) PASS: lldb-api :: types/TestShortType.py (1343 of 1935) PASS: lldb-unit :: Core/./LLDBCoreTests/MangledTest.NameIndexes_FindFunctionSymbols (1344 of 1935) PASS: lldb-unit :: Utility/./UtilityTests/DataExtractorTest.PeekData (1345 of 1935) PASS: lldb-shell :: SymbolFile/DWARF/dir-separator-windows.s (1346 of 1935) PASS: lldb-shell :: Minidump/dump-all.test (1347 of 1935) PASS: lldb-api :: python_api/lldbutil/iter/TestRegistersIterator.py (1348 of 1935) PASS: lldb-unit :: ScriptInterpreter/Python/./ScriptInterpreterPythonTests/PythonDataObjectsTest.TestPythonStringToStructuredString (1349 of 1935) PASS: lldb-unit :: Process/gdb-remote/./ProcessGdbRemoteTests/GDBRemoteClientBaseTest.SendContinueAndAsyncPacket (1350 of 1935) PASS: lldb-unit :: Utility/./UtilityTests/StringListTest.ForRange (1351 of 1935) PASS: lldb-api :: functionalities/data-formatter/pyobjsynthprovider/TestPyObjSynthProvider.py (1352 of 1935) UNSUPPORTED: lldb-api :: functionalities/darwin_log/filter/regex/activity/TestDarwinLogFilterRegexActivity.py (1353 of 1935) PASS: lldb-unit :: Expression/./ExpressionTests/DiagnosticManagerTest.PutString (1354 of 1935) PASS: lldb-shell :: SymbolFile/NativePDB/nested-types.cpp (1355 of 1935) PASS: lldb-api :: functionalities/data-formatter/data-formatter-objc/nsindexpath/TestDataFormatterNSIndexPath.py (1356 of 1935) PASS: lldb-unit :: Host/./HostTests/MainLoopTest.UnmonitoredSignal (1357 of 1935) UNSUPPORTED: lldb-api :: functionalities/data-formatter/data-formatter-stl/libstdcpp/smart_ptr/TestDataFormatterStdSmartPtr.py (1358 of 1935) UNSUPPORTED: lldb-api :: benchmarks/expression/TestExpressionCmd.py (1359 of 1935) PASS: lldb-shell :: ObjectFile/ELF/short-build-id.yaml (1360 of 1935) PASS: lldb-api :: python_api/lldbutil/iter/TestLLDBIterator.py (1361 of 1935) PASS: lldb-shell :: ObjectFile/ELF/duplicate-section.yaml (1362 of 1935) PASS: lldb-api :: functionalities/thread/concurrent_events/TestConcurrentNWatchNBreak.py (1363 of 1935) PASS: lldb-api :: functionalities/data-formatter/poarray/TestPrintObjectArray.py (1364 of 1935) PASS: lldb-api :: commands/statistics/basic/TestStats.py (1365 of 1935) UNSUPPORTED: lldb-shell :: BuildScript/toolchain-msvc.test (1366 of 1935) PASS: lldb-unit :: UnwindAssembly/x86/./UnwindAssemblyx86Tests/Testx86AssemblyInspectionEngine.TestPushR12 (1367 of 1935) PASS: lldb-unit :: Symbol/./SymbolTests/TestTypeSystemClang.TestRecordHasFields (1368 of 1935) PASS: lldb-unit :: Process/minidump/./LLDBMinidumpTests/RegisterContextMinidump.ConvertMinidumpContext_x86_32 (1369 of 1935) UNSUPPORTED: lldb-api :: lang/objc/foundation/TestFoundationDisassembly.py (1370 of 1935) PASS: lldb-shell :: Settings/TestFrameFormatNoColor.test (1371 of 1935) PASS: lldb-api :: functionalities/paths/TestPaths.py (1372 of 1935) PASS: lldb-api :: lang/cpp/call-function/TestCallCPPFunction.py (1373 of 1935) PASS: lldb-shell :: Recognizer/assert.test (1374 of 1935) PASS: lldb-api :: commands/expression/import-std-module/vector-dbg-info-content/TestDbgInfoContentVectorFromStdModule.py (1375 of 1935) PASS: lldb-unit :: ObjectFile/Breakpad/./ObjectFileBreakpadTests/ModuleRecord.parse (1376 of 1935) PASS: lldb-unit :: Utility/./UtilityTests/StreamTest.PutMaxHex64ByteOrderBig (1377 of 1935) PASS: lldb-api :: commands/expression/namespace_local_var_same_name_obj_c/TestNamespaceLocalVarSameNameObjC.py (1378 of 1935) PASS: lldb-unit :: Utility/./UtilityTests/RangeTest.DoesAdjoinOrIntersect (1379 of 1935) PASS: lldb-shell :: SymbolFile/DWARF/dwarf5_locations.s (1380 of 1935) PASS: lldb-shell :: ScriptInterpreter/Python/scripted_breakpoint.test (1381 of 1935) PASS: lldb-unit :: ScriptInterpreter/Python/./ScriptInterpreterPythonTests/PythonDataObjectsTest.TestCallable (1382 of 1935) PASS: lldb-api :: functionalities/thread/step_out/TestThreadStepOut.py (1383 of 1935) PASS: lldb-api :: functionalities/inferior-crashing/recursive-inferior/TestRecursiveInferior.py (1384 of 1935) PASS: lldb-unit :: Utility/./UtilityTests/AnsiTerminal.Twice (1385 of 1935) PASS: lldb-unit :: Utility/./UtilityTests/StreamTeeTest.Constructor2Streams (1386 of 1935) PASS: lldb-unit :: Utility/./UtilityTests/FileSpecTest.Match (1387 of 1935) PASS: lldb-unit :: Utility/./UtilityTests/RangeTest.NotEqual (1388 of 1935) PASS: lldb-unit :: Utility/./UtilityTests/OptionsWithRawTest.MultiWordSuffix (1389 of 1935) PASS: lldb-api :: functionalities/breakpoint/scripted_bkpt/TestScriptedResolver.py (1390 of 1935) PASS: lldb-unit :: Language/Highlighting/./HighlighterTests/HighlighterTest.ClangCursorPosBeforeOtherToken (1391 of 1935) PASS: lldb-unit :: SymbolFile/NativePDB/./SymbolFileNativePDBTests/PDBFPOProgramToDWARFExpressionTests.MultipleIndependentAssignments (1392 of 1935) UNSUPPORTED: lldb-api :: benchmarks/expression/TestRepeatedExprs.py (1393 of 1935) PASS: lldb-api :: tools/lldb-server/commandline/TestStubReverseConnect.py (1394 of 1935) PASS: lldb-shell :: SymbolFile/DWARF/find-variable-file.cpp (1395 of 1935) PASS: lldb-api :: commands/process/launch/TestProcessLaunch.py (1396 of 1935) PASS: lldb-api :: lang/objc/objc-static-method-stripped/TestObjCStaticMethodStripped.py (1397 of 1935) PASS: lldb-api :: python_api/formatters/TestFormattersSBAPI.py (1398 of 1935) UNSUPPORTED: lldb-shell :: Watchpoint/netbsd-nouserdbregs.test (1399 of 1935) PASS: lldb-shell :: Minidump/memory-region-from-module.yaml (1400 of 1935) UNSUPPORTED: lldb-api :: python_api/event/TestEvents.py (1401 of 1935) PASS: lldb-api :: functionalities/data-formatter/data-formatter-synthtype/TestDataFormatterSynthType.py (1402 of 1935) PASS: lldb-shell :: Reproducer/TestGDBRemoteRepro.test (1403 of 1935) PASS: lldb-api :: commands/gui/invalid-args/TestInvalidArgsGui.py (1404 of 1935) UNSUPPORTED: lldb-shell :: Register/x86-64-xmm16-write.test (1405 of 1935) UNSUPPORTED: lldb-api :: functionalities/param_entry_vals/basic_entry_values_x86_64/TestBasicEntryValuesX86_64.py (1406 of 1935) PASS: lldb-api :: functionalities/thread/concurrent_events/TestConcurrentCrashWithWatchpointBreakpointSignal.py (1407 of 1935) PASS: lldb-api :: lang/objc/blocks/TestObjCIvarsInBlocks.py (1408 of 1935) PASS: lldb-unit :: ObjectFile/ELF/./ObjectFileELFTests/ObjectFileELFTest.GetSymtab_NoSymEntryPointArmAddressClass (1409 of 1935) PASS: lldb-unit :: ObjectFile/Breakpad/./ObjectFileBreakpadTests/StackCFIRecord.parse (1410 of 1935) PASS: lldb-unit :: Expression/./ExpressionTests/CppModuleConfigurationTest.AmbiguousLibCpp (1411 of 1935) PASS: lldb-shell :: SymbolFile/DWARF/find-basic-namespace.cpp (1412 of 1935) PASS: lldb-unit :: Utility/./UtilityTests/ProcessInfoTest.Constructor (1413 of 1935) PASS: lldb-api :: lang/cpp/template-function/TestTemplateFunctions.py (1414 of 1935) PASS: lldb-unit :: Utility/./UtilityTests/VMRange.ContainsRange (1415 of 1935) PASS: lldb-unit :: UnwindAssembly/x86/./UnwindAssemblyx86Tests/Testx86AssemblyInspectionEngine.TestSubESP (1416 of 1935) PASS: lldb-unit :: Symbol/./SymbolTests/TestTypeSystemClang.TestGetTypeClassNested (1417 of 1935) UNSUPPORTED: lldb-api :: commands/expression/multiline-navigation/TestMultilineNavigation.py (1418 of 1935) PASS: lldb-api :: tools/lldb-server/TestGdbRemoteProcessInfo.py (1419 of 1935) PASS: lldb-api :: lang/cpp/bitfields/TestCppBitfields.py (1420 of 1935) PASS: lldb-unit :: ScriptInterpreter/Python/./ScriptInterpreterPythonTests/PythonDataObjectsTest.TestResetting (1421 of 1935) PASS: lldb-api :: lang/c/unicode/TestUnicodeSymbols.py (1422 of 1935) PASS: lldb-unit :: Utility/./UtilityTests/LogChannelEnabledTest.log_options (1423 of 1935) PASS: lldb-unit :: Language/Highlighting/./HighlighterTests/HighlighterTest.Colons (1424 of 1935) PASS: lldb-api :: functionalities/data-formatter/compactvectors/TestCompactVectors.py (1425 of 1935) PASS: lldb-shell :: SymbolFile/DWARF/inline-function-address-shared.test (1426 of 1935) PASS: lldb-api :: lang/cpp/dynamic-value-same-basename/TestDynamicValueSameBase.py (1427 of 1935) PASS: lldb-api :: functionalities/dead-strip/TestDeadStrip.py (1428 of 1935) UNSUPPORTED: lldb-api :: functionalities/data-formatter/data-formatter-stl/libstdcpp/unique_ptr/TestDataFormatterStdUniquePtr.py (1429 of 1935) PASS: lldb-unit :: Utility/./UtilityTests/ArgsTest.TestArgv (1430 of 1935) PASS: lldb-unit :: Utility/./UtilityTests/ScalarTest.GetValue (1431 of 1935) UNSUPPORTED: lldb-shell :: SymbolFile/NativePDB/stack_unwinding01.cpp (1432 of 1935) PASS: lldb-unit :: Language/Highlighting/./HighlighterTests/HighlighterTest.ClangCommas (1433 of 1935) PASS: lldb-api :: functionalities/breakpoint/address_breakpoints/TestBadAddressBreakpoints.py (1434 of 1935) PASS: lldb-api :: functionalities/mtc/simple/TestMTCSimple.py (1435 of 1935) PASS: lldb-api :: commands/expression/rdar42038760/TestScalarURem.py (1436 of 1935) PASS: lldb-api :: lang/cpp/char1632_t/TestChar1632T.py (1437 of 1935) PASS: lldb-api :: functionalities/postmortem/minidump/TestMiniDump.py (1438 of 1935) PASS: lldb-api :: functionalities/data-formatter/data-formatter-objc/nsstring/TestDataFormatterNSString.py (1439 of 1935) PASS: lldb-unit :: Utility/./UtilityTests/RangeTest.LessThan (1440 of 1935) PASS: lldb-unit :: Expression/./ExpressionTests/ClangHostTest.MacOSX (1441 of 1935) UNSUPPORTED: lldb-api :: arm/breakpoint-it/TestBreakpointIt.py (1442 of 1935) PASS: lldb-api :: commands/expression/weak_symbols/TestWeakSymbols.py (1443 of 1935) PASS: lldb-api :: tools/lldb-server/TestGdbRemoteRegisterState.py (1444 of 1935) UNSUPPORTED: lldb-api :: functionalities/ubsan/user-expression/TestUbsanUserExpression.py (1445 of 1935) PASS: lldb-api :: lang/objc/objc++/TestObjCXX.py (1446 of 1935) PASS: lldb-api :: functionalities/data-formatter/data-formatter-stl/libcxx/iterator/TestDataFormatterLibccIterator.py (1447 of 1935) PASS: lldb-unit :: Expression/./ExpressionTests/DiagnosticManagerTest.PutStringSeverities (1448 of 1935) PASS: lldb-unit :: Host/./HostTests/SocketTest.DomainGetConnectURI (1449 of 1935) PASS: lldb-unit :: UnwindAssembly/x86/./UnwindAssemblyx86Tests/Testx86AssemblyInspectionEngine.TestAddESP (1450 of 1935) PASS: lldb-unit :: Symbol/./SymbolTests/TestTypeSystemClang.TestDeletingImplicitCopyCstrDueToMoveCStr (1451 of 1935) UNSUPPORTED: lldb-api :: functionalities/tsan/cpp_global_location/TestTsanCPPGlobalLocation.py (1452 of 1935) PASS: lldb-shell :: Quit/TestQuitExitCodeNonInt.test (1453 of 1935) PASS: lldb-unit :: Utility/./UtilityTests/BinaryStreamTest.PutSLEB128MaxValue (1454 of 1935) UNSUPPORTED: lldb-shell :: Register/x86-64-zmm-read.test (1455 of 1935) PASS: lldb-shell :: ObjectFile/ELF/section-types-edgecases.yaml (1456 of 1935) UNSUPPORTED: lldb-shell :: SymbolFile/PDB/calling-conventions.test (1457 of 1935) PASS: lldb-api :: commands/expression/import-std-module/vector/TestVectorFromStdModule.py (1458 of 1935) PASS: lldb-api :: commands/settings/TestSettings.py (1459 of 1935) PASS: lldb-api :: lang/objc/objc-ivar-stripped/TestObjCIvarStripped.py (1460 of 1935) PASS: lldb-api :: commands/expression/import-std-module/unique_ptr-dbg-info-content/TestUniquePtrDbgInfoContent.py (1461 of 1935) PASS: lldb-api :: commands/expression/import-std-module/queue/TestQueueFromStdModule.py (1462 of 1935) PASS: lldb-api :: commands/platform/process/TestProcessList.py (1463 of 1935) PASS: lldb-api :: lang/objc/direct-dispatch-step/TestObjCDirectDispatchStepping.py (1464 of 1935) PASS: lldb-api :: commands/expression/dont_allow_jit/TestAllowJIT.py (1465 of 1935) PASS: lldb-unit :: Language/CPlusPlus/./LanguageCPlusPlusTests/CPlusPlusLanguage.MethodNameParsing (1466 of 1935) PASS: lldb-unit :: Host/./HostTests/NativeProcessProtocolTest.SetBreakpointFailRead (1467 of 1935) PASS: lldb-unit :: Utility/./UtilityTests/OptionsWithRawTest.ArgsButNoDelimiter (1468 of 1935) PASS: lldb-api :: functionalities/breakpoint/cpp/TestCPPBreakpointLocations.py (1469 of 1935) PASS: lldb-unit :: Utility/./UtilityTests/DataExtractorTest.GetMaxS64 (1470 of 1935) PASS: lldb-api :: commands/command/source/TestCommandSource.py (1471 of 1935) UNSUPPORTED: lldb-shell :: ScriptInterpreter/Lua/convenience_variables.test (1472 of 1935) PASS: lldb-shell :: SymbolFile/DWARF/DW_OP_piece-struct.s (1473 of 1935) UNSUPPORTED: lldb-api :: lang/cpp/static_members/TestCPPStaticMembers.py (1474 of 1935) PASS: lldb-unit :: Process/minidump/./LLDBMinidumpTests/MinidumpParserTest.GetArchitecture (1475 of 1935) PASS: lldb-api :: commands/expression/import-std-module/deque-dbg-info-content/TestDbgInfoContentDequeFromStdModule.py (1476 of 1935) PASS: lldb-shell :: SymbolFile/DWARF/dir-separator-posix.s (1477 of 1935) UNSUPPORTED: lldb-shell :: SymbolFile/NativePDB/ast-functions-msvc.cpp (1478 of 1935) PASS: lldb-unit :: Expression/./ExpressionTests/CppModuleConfigurationTest.Xcode (1479 of 1935) PASS: lldb-unit :: Utility/./UtilityTests/TildeExpressionResolver.ResolveFullPath (1480 of 1935) PASS: lldb-shell :: SymbolFile/DWARF/debug_loclists-dwo.s (1481 of 1935) PASS: lldb-shell :: SymbolFile/DWARF/dwarf5-atomic.s (1482 of 1935) PASS: lldb-unit :: Utility/./UtilityTests/StreamTest.PutStringAsRawHex8 (1483 of 1935) PASS: lldb-api :: functionalities/gdb_remote_client/TestWriteMemory.py (1484 of 1935) PASS: lldb-api :: functionalities/abbreviation/TestCommonShortSpellings.py (1485 of 1935) PASS: lldb-api :: functionalities/breakpoint/debugbreak/TestDebugBreak.py (1486 of 1935) PASS: lldb-api :: python_api/lldbutil/TestSwigVersion.py (1487 of 1935) PASS: lldb-api :: functionalities/breakpoint/objc/TestObjCBreakpoints.py (1488 of 1935) PASS: lldb-api :: commands/expression/ir-interpreter/TestIRInterpreter.py (1489 of 1935) PASS: lldb-api :: lang/objc/modules-auto-import/TestModulesAutoImport.py (1490 of 1935) PASS: lldb-unit :: Signals/./SignalsTests/UnixSignalsTest.Iteration (1491 of 1935) PASS: lldb-shell :: SymbolFile/DWARF/find-function-regex.cpp (1492 of 1935) PASS: lldb-unit :: Utility/./UtilityTests/SerializationRountripTest.SerializeDeserializeCStringArrayNullptr (1493 of 1935) PASS: lldb-api :: python_api/sbtype_typeclass/TestSBTypeTypeClass.py (1494 of 1935) PASS: lldb-unit :: Utility/./UtilityTests/StringExtractorTest.InitMisc (1495 of 1935) PASS: lldb-api :: commands/watchpoints/multiple_hits/TestMultipleHits.py (1496 of 1935) PASS: lldb-unit :: Utility/./UtilityTests/BinaryStreamTest.PutULEB128SevenBytes (1497 of 1935) PASS: lldb-api :: functionalities/thread/jump/TestThreadJump.py (1498 of 1935) PASS: lldb-unit :: Utility/./UtilityTests/UriParserTest.SchemeHostSeparator3 (1499 of 1935) PASS: lldb-api :: functionalities/gdb_remote_client/TestThreadSelectionBug.py (1500 of 1935) PASS: lldb-unit :: Utility/./UtilityTests/RangeTest.ContainsAddrInvalid (1501 of 1935) PASS: lldb-unit :: Language/Highlighting/./HighlighterTests/HighlighterTest.DefaultHighlighter (1502 of 1935) PASS: lldb-api :: python_api/process/TestProcessAPI.py (1503 of 1935) PASS: lldb-api :: functionalities/unwind/noreturn/module-end/TestNoReturnModuleEnd.py (1504 of 1935) PASS: lldb-unit :: Utility/./UtilityTests/DataExtractorTest.GetCStrEmpty (1505 of 1935) PASS: lldb-api :: commands/expression/import-std-module/sysroot/TestStdModuleSysroot.py (1506 of 1935) PASS: lldb-unit :: tools/lldb-server/tests/./LLDBServerTests/StandardStartupTest.TestStopReplyContainsThreadPcs (1507 of 1935) PASS: lldb-api :: functionalities/wrong_commands/TestWrongCommands.py (1508 of 1935) PASS: lldb-api :: lang/cpp/bool/TestCPPBool.py (1509 of 1935) PASS: lldb-shell :: Commands/command-regex-unalias.test (1510 of 1935) PASS: lldb-unit :: Utility/./UtilityTests/StreamTest.PutBytesAsRawHex8ToLittleEndian (1511 of 1935) PASS: lldb-unit :: Utility/./UtilityTests/FileSpecTest.FileAndDirectoryComponents (1512 of 1935) PASS: lldb-shell :: ObjectFile/ELF/aarch64-relocations.yaml (1513 of 1935) PASS: lldb-unit :: Utility/./UtilityTests/ReproducerTest.SetReplay (1514 of 1935) PASS: lldb-unit :: Core/./LLDBCoreTests/MangledTest.ResultForBlockInvocation (1515 of 1935) PASS: lldb-shell :: Settings/TestSettingsSet.test (1516 of 1935) PASS: lldb-shell :: SymbolFile/DWARF/debug-types-dwo-cross-reference.cpp (1517 of 1935) PASS: lldb-api :: commands/apropos/with-process/TestAproposWithProcess.py (1518 of 1935) PASS: lldb-shell :: Quit/TestQuitExitCodeHex0.test (1519 of 1935) PASS: lldb-api :: commands/log/basic/TestLogging.py (1520 of 1935) PASS: lldb-shell :: ObjectFile/PECOFF/invalid-export-table.yaml (1521 of 1935) PASS: lldb-api :: lang/c/array_types/TestArrayTypes.py (1522 of 1935) PASS: lldb-shell :: ObjectFile/ELF/PT_LOAD-empty.yaml (1523 of 1935) PASS: lldb-unit :: Symbol/./SymbolTests/TestClangASTImporter.MetadataPropagationAfterCopying (1524 of 1935) PASS: lldb-shell :: SymbolFile/DWARF/debug-types-signature-loop.s (1525 of 1935) PASS: lldb-unit :: Utility/./UtilityTests/CompletionRequest.DuplicateFilteringWithComments (1526 of 1935) UNSUPPORTED: lldb-api :: functionalities/darwin_log/filter/regex/message/TestDarwinLogFilterRegexMessage.py (1527 of 1935) PASS: lldb-api :: lang/cpp/unsigned_types/TestUnsignedTypes.py (1528 of 1935) PASS: lldb-api :: macosx/find-dsym/deep-bundle/TestDeepBundle.py (1529 of 1935) PASS: lldb-shell :: Breakpoint/implicit_const_form_support.test (1530 of 1935) PASS: lldb-api :: functionalities/data-formatter/data-formatter-objc/TestDataFormatterObjCExpr.py (1531 of 1935) PASS: lldb-api :: lang/objc/orderedset/TestOrderedSet.py (1532 of 1935) PASS: lldb-api :: functionalities/data-formatter/data-formatter-globals/TestDataFormatterGlobals.py (1533 of 1935) PASS: lldb-api :: source-manager/TestSourceManager.py (1534 of 1935) PASS: lldb-unit :: Expression/./ExpressionTests/CppModuleConfigurationTest.MissingUsrInclude (1535 of 1935) PASS: lldb-unit :: UnwindAssembly/x86/./UnwindAssemblyx86Tests/Testx86AssemblyInspectionEngine.TestSubRSP (1536 of 1935) PASS: lldb-unit :: Expression/./ExpressionTests/CppModuleConfigurationTest.Linux (1537 of 1935) PASS: lldb-api :: functionalities/thread/concurrent_events/TestConcurrentTwoBreakpointsOneSignal.py (1538 of 1935) PASS: lldb-unit :: Host/./HostTests/SocketAddressTest.GetAddressInfo (1539 of 1935) PASS: lldb-unit :: Utility/./UtilityTests/VMRange.Ordering (1540 of 1935) UNSUPPORTED: lldb-api :: functionalities/breakpoint/breakpoint_in_delayslot/TestAvoidBreakpointInDelaySlot.py (1541 of 1935) PASS: lldb-unit :: Utility/./UtilityTests/StringListTest.GetSize (1542 of 1935) PASS: lldb-shell :: SymbolFile/DWARF/debug_loc.s (1543 of 1935) PASS: lldb-unit :: Host/./HostTests/MainLoopTest.ReadObject (1544 of 1935) PASS: lldb-shell :: Reproducer/Functionalities/TestDataFormatter.test (1545 of 1935) PASS: lldb-unit :: Utility/./UtilityTests/Flags.Test (1546 of 1935) PASS: lldb-api :: macosx/find-dsym/bundle-with-dot-in-filename/TestBundleWithDotInFilename.py (1547 of 1935) PASS: lldb-api :: functionalities/data-formatter/data-formatter-stl/libcxx/bitset/TestDataFormatterLibcxxBitset.py (1548 of 1935) PASS: lldb-unit :: Utility/./UtilityTests/FileSpecTest.IsRelative (1549 of 1935) PASS: lldb-api :: commands/expression/import-std-module/forward_list-dbg-info-content/TestDbgInfoContentForwardListFromStdModule.py (1550 of 1935) PASS: lldb-shell :: ObjectFile/MachO/lc_build_version.yaml (1551 of 1935) PASS: lldb-unit :: Utility/./UtilityTests/FileSpecTest.PrependPathComponent (1552 of 1935) PASS: lldb-shell :: Settings/TestFrameFormatMangling.test (1553 of 1935) PASS: lldb-api :: commands/frame/diagnose/dereference-function-return/TestDiagnoseDereferenceFunctionReturn.py (1554 of 1935) PASS: lldb-shell :: ObjectFile/ELF/section-permissions.yaml (1555 of 1935) PASS: lldb-unit :: Utility/./UtilityTests/EnvironmentTest.EnvpConversion (1556 of 1935) PASS: lldb-unit :: Utility/./UtilityTests/RangeTest.Union (1557 of 1935) PASS: lldb-api :: functionalities/data-formatter/data-formatter-caching/TestDataFormatterCaching.py (1558 of 1935) UNSUPPORTED: lldb-api :: linux/thread/create_during_instruction_step/TestCreateDuringInstructionStep.py (1559 of 1935) PASS: lldb-shell :: Breakpoint/single-file-split-dwarf.test (1560 of 1935) PASS: lldb-api :: functionalities/data-formatter/data-formatter-stl/libcxx/optional/TestDataFormatterLibcxxOptional.py (1561 of 1935) PASS: lldb-unit :: Utility/./UtilityTests/StringExtractorTest.DecodeHexU8_Underflow (1562 of 1935) PASS: lldb-unit :: ScriptInterpreter/Python/./ScriptInterpreterPythonTests/PythonDataObjectsTest.TestObjectAttributes (1563 of 1935) UNSUPPORTED: lldb-shell :: Register/aarch64-gp-read.test (1564 of 1935) PASS: lldb-unit :: Utility/./UtilityTests/ArgsTest.TestUnknownEscape (1565 of 1935) PASS: lldb-api :: functionalities/data-formatter/data-formatter-stl/libcxx/tuple/TestDataFormatterLibcxxTuple.py (1566 of 1935) PASS: lldb-unit :: Utility/./UtilityTests/LogChannelEnabledTest.LogVerboseThread (1567 of 1935) PASS: lldb-unit :: Utility/./UtilityTests/StreamTest.PutHex16ByteOrderLittle (1568 of 1935) PASS: lldb-api :: lang/cpp/wchar_t/TestCxxWCharT.py (1569 of 1935) PASS: lldb-unit :: ScriptInterpreter/Python/./ScriptInterpreterPythonTests/PythonDataObjectsTest.TestPythonListToStructuredList (1570 of 1935) UNSUPPORTED: lldb-api :: functionalities/darwin_log/basic/TestDarwinLogBasic.py (1571 of 1935) PASS: lldb-shell :: Quit/TestQuitExitCodeImplicit0.test (1572 of 1935) PASS: lldb-api :: macosx/safe-to-func-call/TestSafeFuncCalls.py (1573 of 1935) UNSUPPORTED: lldb-shell :: Register/arm-gp-read.test (1574 of 1935) PASS: lldb-unit :: Utility/./UtilityTests/RangeTest.ContainsEndInclusive (1575 of 1935) PASS: lldb-api :: functionalities/data-formatter/frameformat_smallstruct/TestFrameFormatSmallStruct.py (1576 of 1935) PASS: lldb-unit :: Utility/./UtilityTests/BinaryStreamTest.PutSLEB128One (1577 of 1935) PASS: lldb-unit :: Language/Highlighting/./HighlighterTests/HighlighterTest.ClangTrailingBackslashMissingNewLine (1578 of 1935) PASS: lldb-unit :: UnwindAssembly/x86/./UnwindAssemblyx86Tests/Testx86AssemblyInspectionEngine.TestAddRSP (1579 of 1935) UNSUPPORTED: lldb-api :: functionalities/data-formatter/data-formatter-stl/libstdcpp/vector/TestDataFormatterStdVector.py (1580 of 1935) PASS: lldb-api :: functionalities/source-map/TestTargetSourceMap.py (1581 of 1935) PASS: lldb-unit :: SymbolFile/NativePDB/./SymbolFileNativePDBTests/PDBFPOProgramToDWARFExpressionTests.UnresolvedRegisterReference (1582 of 1935) PASS: lldb-api :: functionalities/thread/concurrent_events/TestConcurrentDelayWatchBreak.py (1583 of 1935) PASS: lldb-api :: functionalities/thread/concurrent_events/TestConcurrentWatchpointDelayWatchpointOneBreakpoint.py (1584 of 1935) UNSUPPORTED: lldb-api :: functionalities/thread/state/TestThreadStates.py (1585 of 1935) PASS: lldb-unit :: Host/./HostTests/TaskPoolTest.TaskMap (1586 of 1935) PASS: lldb-api :: functionalities/thread/concurrent_events/TestConcurrentBreakpointDelayBreakpointOneSignal.py (1587 of 1935) PASS: lldb-unit :: Expression/./ExpressionTests/DWARFExpression.DW_OP_pick (1588 of 1935) PASS: lldb-api :: lang/c/step_over_no_deadlock/TestStepOverDoesntBlock.py (1589 of 1935) PASS: lldb-api :: functionalities/load_unload/TestLoadUnload.py (1590 of 1935) PASS: lldb-unit :: Utility/./UtilityTests/UriParserTest.Minimal (1591 of 1935) PASS: lldb-unit :: Utility/./UtilityTests/StreamTeeTest.Flush (1592 of 1935) PASS: lldb-unit :: Utility/./UtilityTests/RecordReplayTest.InstrumentedFoo (1593 of 1935) PASS: lldb-unit :: tools/lldb-server/tests/./LLDBServerTests/TestBase.LaunchModePreservesEnvironment (1594 of 1935) PASS: lldb-shell :: ObjectFile/MachO/lc_version_min.yaml (1595 of 1935) PASS: lldb-shell :: ObjectFile/Breakpad/breakpad-identification.test (1596 of 1935) PASS: lldb-unit :: DataFormatter/./LLDBFormatterTests/FormatManagerTests.CompatibleLangs (1597 of 1935) PASS: lldb-api :: python_api/frame/get-variables/TestGetVariables.py (1598 of 1935) PASS: lldb-unit :: Utility/./UtilityTests/NameMatchesTest.EndsWith (1599 of 1935) PASS: lldb-unit :: ScriptInterpreter/Python/./ScriptInterpreterPythonTests/PythonDataObjectsTest.TestPythonBoolean (1600 of 1935) PASS: lldb-unit :: Utility/./UtilityTests/OptionsWithRawTest.WhitespaceSuffix (1601 of 1935) PASS: lldb-unit :: Process/minidump/./LLDBMinidumpTests/MinidumpParserTest.FindMemoryRange (1602 of 1935) PASS: lldb-shell :: ObjectFile/ELF/minidebuginfo-corrupt-xz.yaml (1603 of 1935) PASS: lldb-api :: lang/objc/foundation/TestObjectDescriptionAPI.py (1604 of 1935) PASS: lldb-api :: types/TestRecursiveTypes.py (1605 of 1935) PASS: lldb-unit :: Utility/./UtilityTests/StreamTest.PutCharNull (1606 of 1935) PASS: lldb-unit :: ObjectFile/PECOFF/./ObjectFilePECOFFTests/PECallFrameInfoTest.Chained_eh (1607 of 1935) PASS: lldb-api :: functionalities/tail_call_frames/disambiguate_paths_to_common_sink/TestDisambiguatePathsToCommonSink.py (1608 of 1935) UNSUPPORTED: lldb-shell :: SymbolFile/PDB/func-symbols.test (1609 of 1935) PASS: lldb-unit :: Symbol/./SymbolTests/LineEntryTest.GetSameLineContiguousAddressRangeOneInline (1610 of 1935) PASS: lldb-api :: macosx/thread_suspend/TestInternalThreadSuspension.py (1611 of 1935) PASS: lldb-unit :: Utility/./UtilityTests/RangeTest.Equal (1612 of 1935) UNSUPPORTED: lldb-api :: benchmarks/frame_variable/TestFrameVariableResponse.py (1613 of 1935) PASS: lldb-unit :: ObjectFile/Breakpad/./ObjectFileBreakpadTests/FuncRecord.parse (1614 of 1935) PASS: lldb-shell :: SymbolFile/NativePDB/tag-types.cpp (1615 of 1935) PASS: lldb-unit :: Utility/./UtilityTests/StringListTest.RemoveBlankLines (1616 of 1935) PASS: lldb-unit :: Host/./HostTests/FileSystemTest.Readable (1617 of 1935) PASS: lldb-api :: lang/c/enum_types/TestEnumTypes.py (1618 of 1935) PASS: lldb-unit :: Host/./HostTests/SocketTest.TCPGetConnectURI (1619 of 1935) PASS: lldb-unit :: Utility/./UtilityTests/UriParserTest.SchemeHostSeparator (1620 of 1935) PASS: lldb-shell :: Reproducer/TestFileRepro.test (1621 of 1935) PASS: lldb-unit :: Utility/./UtilityTests/Flags.Reset (1622 of 1935) PASS: lldb-shell :: ObjectFile/PECOFF/symbol.yaml (1623 of 1935) PASS: lldb-unit :: ScriptInterpreter/Python/./ScriptInterpreterPythonTests/PythonDataObjectsTest.TestTypeNameResolutionNoDot (1624 of 1935) PASS: lldb-api :: lang/c/const_variables/TestConstVariables.py (1625 of 1935) PASS: lldb-unit :: Utility/./UtilityTests/StringListTest.CopyListSingle (1626 of 1935) PASS: lldb-unit :: Process/minidump/./LLDBMinidumpTests/MinidumpParserTest.GetFilteredModuleList (1627 of 1935) PASS: lldb-unit :: Utility/./UtilityTests/StringListTest.LongestCommonPrefixEmpty (1628 of 1935) PASS: lldb-shell :: Driver/TestProcessAttach.test (1629 of 1935) PASS: lldb-api :: python_api/process/read-mem-cstring/TestReadMemCString.py (1630 of 1935) PASS: lldb-unit :: Utility/./UtilityTests/CompletionRequest.Constructor (1631 of 1935) PASS: lldb-unit :: Language/Highlighting/./HighlighterTests/HighlighterTest.Keywords (1632 of 1935) PASS: lldb-api :: functionalities/step_scripted/TestStepScripted.py (1633 of 1935) PASS: lldb-unit :: UnwindAssembly/x86/./UnwindAssemblyx86Tests/Testx86AssemblyInspectionEngine.TestPushECX (1634 of 1935) PASS: lldb-unit :: Utility/./UtilityTests/StateTest.Formatv (1635 of 1935) PASS: lldb-unit :: Language/Highlighting/./HighlighterTests/HighlighterTest.DefaultHighlighterWithCursorOutOfBounds (1636 of 1935) PASS: lldb-api :: commands/watchpoints/watchpoint_commands/command/TestWatchpointCommandPython.py (1637 of 1935) PASS: lldb-unit :: Process/gdb-remote/./ProcessGdbRemoteTests/GDBRemoteCommunicationServerTest.SendErrorResponse_ErrorNumber (1638 of 1935) PASS: lldb-shell :: SymbolFile/DWARF/dwarf5-debug_line.s (1639 of 1935) PASS: lldb-api :: lang/cpp/signed_types/TestSignedTypes.py (1640 of 1935) UNSUPPORTED: lldb-api :: functionalities/tsan/global_location/TestTsanGlobalLocation.py (1641 of 1935) PASS: lldb-unit :: Utility/./UtilityTests/StreamTest.AddressRangeSize (1642 of 1935) PASS: lldb-unit :: ScriptInterpreter/Python/./ScriptInterpreterPythonTests/PythonDataObjectsTest.TestExtractingUInt64ThroughStructuredData (1643 of 1935) PASS: lldb-api :: macosx/thread-names/TestInterruptThreadNames.py (1644 of 1935) PASS: lldb-shell :: Quit/TestQuitExitCode30.test (1645 of 1935) PASS: lldb-api :: functionalities/thread/concurrent_events/TestConcurrentSignalDelayWatch.py (1646 of 1935) PASS: lldb-unit :: Host/./HostTests/SocketTest.TCPGetAddress (1647 of 1935) UNSUPPORTED: lldb-api :: functionalities/tsan/basic/TestTsanBasic.py (1648 of 1935) PASS: lldb-unit :: debugserver/./debugserverTests/RNBSocket.LoopBackListenIPv6 (1649 of 1935) PASS: lldb-unit :: Utility/./UtilityTests/StreamTest.AddressEmptyPrefix (1650 of 1935) PASS: lldb-api :: commands/add-dsym/uuid/TestAddDsymCommand.py (1651 of 1935) PASS: lldb-api :: lang/cpp/class_types/TestClassTypes.py (1652 of 1935) PASS: lldb-api :: lang/objc/objc-dyn-sbtype/TestObjCDynamicSBType.py (1653 of 1935) PASS: lldb-api :: functionalities/signal/handle-abrt/TestHandleAbort.py (1654 of 1935) PASS: lldb-unit :: Utility/./UtilityTests/OptionsWithRawTest.QuotedSuffix (1655 of 1935) PASS: lldb-api :: commands/expression/pr35310/TestExprsBug35310.py (1656 of 1935) PASS: lldb-unit :: Target/./TargetTests/PathMappingListTest.RelativeTests (1657 of 1935) PASS: lldb-unit :: Utility/./UtilityTests/ArgsTest.StringListConstructor (1658 of 1935) PASS: lldb-unit :: Language/CPlusPlus/./LanguageCPlusPlusTests/CPlusPlusLanguage.CPlusPlusNameParser (1659 of 1935) PASS: lldb-shell :: ObjectFile/ELF/gnu-debuglink.yaml (1660 of 1935) PASS: lldb-unit :: Utility/./UtilityTests/StructuredDataTest.ParseJSONFromFile (1661 of 1935) PASS: lldb-unit :: Utility/./UtilityTests/CompletionRequest.ShiftArguments (1662 of 1935) PASS: lldb-unit :: Host/./HostTests/TaskPoolTest.AddTask (1663 of 1935) UNSUPPORTED: lldb-api :: functionalities/thread/break_after_join/TestBreakAfterJoin.py (1664 of 1935) PASS: lldb-api :: commands/expression/invalid-args/TestInvalidArgsExpression.py (1665 of 1935) PASS: lldb-unit :: Process/minidump/./LLDBMinidumpTests/MinidumpParserTest.GetLinuxProcStatus_no_stream (1666 of 1935) PASS: lldb-api :: python_api/sbvalue_const_addrof/TestSBValueConstAddrOf.py (1667 of 1935) PASS: lldb-unit :: Symbol/./SymbolTests/TestClangASTImporter.CanImportInvalidType (1668 of 1935) PASS: lldb-unit :: Utility/./UtilityTests/UriParserTest.LongPath (1669 of 1935) PASS: lldb-unit :: Process/gdb-remote/./ProcessGdbRemoteTests/GDBRemoteCommunicationClientTest.GetModulesInfo_UUID20 (1670 of 1935) PASS: lldb-shell :: Commands/CommandScriptImmediateOutput/CommandScriptImmediateOutputConsole.test (1671 of 1935) PASS: lldb-api :: tools/lldb-server/TestGdbRemoteAttach.py (1672 of 1935) PASS: lldb-api :: functionalities/abbreviation/TestAbbreviations.py (1673 of 1935) PASS: lldb-unit :: UnwindAssembly/x86/./UnwindAssemblyx86Tests/Testx86AssemblyInspectionEngine.TestStackRealign32BitDisp_x86_64 (1674 of 1935) PASS: lldb-api :: macosx/DBGSourcePathRemapping/TestDSYMSourcePathRemapping.py (1675 of 1935) PASS: lldb-api :: api/multithreaded/TestMultithreaded.py (1676 of 1935) PASS: lldb-api :: tools/lldb-server/TestLldbGdbServer.py (1677 of 1935) PASS: lldb-api :: lang/cpp/symbols/TestSymbols.py (1678 of 1935) PASS: lldb-api :: commands/expression/import-std-module/vector-bool/TestVectorBoolFromStdModule.py (1679 of 1935) PASS: lldb-unit :: Process/minidump/./LLDBMinidumpTests/MinidumpParserTest.GetThreadContext_x86_64 (1680 of 1935) PASS: lldb-unit :: Utility/./UtilityTests/VMRange.Clear (1681 of 1935) PASS: lldb-unit :: Utility/./UtilityTests/AnsiTerminal.AtStart (1682 of 1935) PASS: lldb-unit :: Utility/./UtilityTests/VASprintfTest.NoBufferResize (1683 of 1935) PASS: lldb-unit :: ObjectFile/PECOFF/./ObjectFilePECOFFTests/PECallFrameInfoTest.Frame_reg_eh (1684 of 1935) PASS: lldb-unit :: Utility/./UtilityTests/UriParserTest.BracketedHostnamePort (1685 of 1935) PASS: lldb-api :: commands/command/script/TestCommandScript.py (1686 of 1935) PASS: lldb-unit :: Utility/./UtilityTests/ArgsTest.DoubleQuotedItem (1687 of 1935) PASS: lldb-unit :: Utility/./UtilityTests/UriParserTest.MinimalPath (1688 of 1935) PASS: lldb-shell :: Reproducer/Modules/TestModuleCXX.test (1689 of 1935) PASS: lldb-api :: functionalities/thread/backtrace_all/TestBacktraceAll.py (1690 of 1935) PASS: lldb-api :: commands/expression/persistent_variables/TestPersistentVariables.py (1691 of 1935) PASS: lldb-api :: python_api/module_section/TestModuleAndSection.py (1692 of 1935) PASS: lldb-unit :: SymbolFile/DWARF/./SymbolFileDWARFTests/SymbolFileDWARFTests.TestAbbrevNullAttrValidForm (1693 of 1935) PASS: lldb-api :: lang/objcxx/class-name-clash/TestNameClash.py (1694 of 1935) PASS: lldb-unit :: UnwindAssembly/x86/./UnwindAssemblyx86Tests/Testx86AssemblyInspectionEngine.Test32BitOnlyInstruction (1695 of 1935) UNSUPPORTED: lldb-api :: macosx/macabi/TestMacABImacOSFramework.py (1696 of 1935) UNSUPPORTED: lldb-api :: terminal/TestEditline.py (1697 of 1935) PASS: lldb-unit :: ScriptInterpreter/Python/./ScriptInterpreterPythonTests/PythonDataObjectsTest.TestGlobalNameResolutionNoDot (1698 of 1935) PASS: lldb-api :: lang/c/shared_lib_stripped_symbols/TestSharedLibStrippedSymbols.py (1699 of 1935) PASS: lldb-shell :: Process/TestEnvironment.test (1700 of 1935) PASS: lldb-unit :: Utility/./UtilityTests/CompletionRequest.FakeLastArg (1701 of 1935) PASS: lldb-api :: types/TestCharTypeExpr.py (1702 of 1935) PASS: lldb-api :: functionalities/dynamic_value_child_count/TestDynamicValueChildCount.py (1703 of 1935) PASS: lldb-shell :: SymbolFile/DWARF/debug-types-basic.test (1704 of 1935) PASS: lldb-shell :: ObjectFile/PECOFF/export-dllfunc.yaml (1705 of 1935) PASS: lldb-api :: types/TestIntegerTypeExpr.py (1706 of 1935) PASS: lldb-api :: tools/lldb-server/TestGdbRemoteExitCode.py (1707 of 1935) PASS: lldb-api :: functionalities/data-formatter/type_summary_list_script/TestTypeSummaryListScript.py (1708 of 1935) PASS: lldb-api :: functionalities/data-formatter/var-in-aggregate-misuse/TestVarInAggregateMisuse.py (1709 of 1935) PASS: lldb-unit :: Utility/./UtilityTests/UriParserTest.MinimalPortPath (1710 of 1935) UNSUPPORTED: lldb-shell :: BuildScript/toolchain-clang-cl.test (1711 of 1935) PASS: lldb-api :: commands/expression/radar_9531204/TestPrintfAfterUp.py (1712 of 1935) UNSUPPORTED: lldb-api :: python_api/disassemble-raw-data/TestDisassemble_VST1_64.py (1713 of 1935) PASS: lldb-shell :: SymbolFile/DWARF/dir-separator-no-comp-dir-relative-name.s (1714 of 1935) UNSUPPORTED: lldb-api :: android/platform/TestDefaultCacheLineSize.py (1715 of 1935) PASS: lldb-shell :: Quit/TestQuitExitCodeHexA.test (1716 of 1935) PASS: lldb-unit :: Interpreter/./InterpreterTests/CompletionTest.DirCompletionUsername (1717 of 1935) UNSUPPORTED: lldb-shell :: SymbolFile/PDB/vbases.test (1718 of 1935) PASS: lldb-api :: functionalities/data-formatter/data-formatter-cpp/TestDataFormatterCpp.py (1719 of 1935) PASS: lldb-unit :: Interpreter/./InterpreterTests/OptionArgParserTest.toBoolean (1720 of 1935) PASS: lldb-unit :: Utility/./UtilityTests/BinaryStreamTest.PutSLEB128EightBytes (1721 of 1935) PASS: lldb-unit :: Utility/./UtilityTests/Flags.AllSet (1722 of 1935) PASS: lldb-unit :: Utility/./UtilityTests/UriParserTest.BadPort (1723 of 1935) PASS: lldb-unit :: Symbol/./SymbolTests/SymbolsTest.LocateExecutableSymbolFileForUnknownExecutableAndMissingSymbolFile (1724 of 1935) PASS: lldb-unit :: ScriptInterpreter/Python/./ScriptInterpreterPythonTests/PythonDataObjectsTest.TestPythonInteger (1725 of 1935) PASS: lldb-unit :: Utility/./UtilityTests/StreamTest.ShiftOperatorPtr (1726 of 1935) UNSUPPORTED: lldb-api :: functionalities/breakpoint/breakpoint_callback_command_source/TestBreakpointCallbackCommandSource.py (1727 of 1935) PASS: lldb-api :: tools/lldb-server/TestGdbRemoteSingleStep.py (1728 of 1935) PASS: lldb-api :: functionalities/data-formatter/data-formatter-stl/libcxx/initializerlist/TestInitializerList.py (1729 of 1935) PASS: lldb-shell :: BuildScript/script-args.test (1730 of 1935) PASS: lldb-unit :: Utility/./UtilityTests/DataExtractorTest.GetBitfield (1731 of 1935) PASS: lldb-api :: lang/objc/foundation/TestSymbolTable.py (1732 of 1935) PASS: lldb-api :: lang/cpp/rvalue-references/TestRvalueReferences.py (1733 of 1935) UNSUPPORTED: lldb-api :: functionalities/unwind/standard/TestStandardUnwind.py (1734 of 1935) PASS: lldb-unit :: UnwindAssembly/x86/./UnwindAssemblyx86Tests/Testx86AssemblyInspectionEngine.TestReturnDetect (1735 of 1935) PASS: lldb-unit :: Utility/./UtilityTests/StreamTest.ShiftOperatorStrings (1736 of 1935) PASS: lldb-unit :: Host/./HostTests/MainLoopTest.DetectsEOF (1737 of 1935) PASS: lldb-api :: sample_test/TestSampleInlineTest.py (1738 of 1935) PASS: lldb-api :: functionalities/breakpoint/dummy_target_breakpoints/TestBreakpointsWithNoTargets.py (1739 of 1935) PASS: lldb-shell :: Reproducer/TestCrash.test (1740 of 1935) PASS: lldb-unit :: Utility/./UtilityTests/LogChannelEnabledTest.LogThread (1741 of 1935) PASS: lldb-unit :: UnwindAssembly/x86/./UnwindAssemblyx86Tests/Testx86AssemblyInspectionEngine.TestPushEDX (1742 of 1935) PASS: lldb-api :: commands/watchpoints/step_over_watchpoint/TestStepOverWatchpoint.py (1743 of 1935) PASS: lldb-unit :: Utility/./UtilityTests/ArchSpecTest.MergeFrom (1744 of 1935) PASS: lldb-unit :: Host/./HostTests/FileSystemTest.Resolve (1745 of 1935) PASS: lldb-api :: functionalities/memory/read/TestMemoryRead.py (1746 of 1935) PASS: lldb-unit :: Utility/./UtilityTests/ArgsTest.GetArgumentArrayRef (1747 of 1935) UNSUPPORTED: lldb-shell :: Unwind/eh-frame-small-fde.test (1748 of 1935) PASS: lldb-unit :: Utility/./UtilityTests/RangeTest.EqualInvalid (1749 of 1935) PASS: lldb-unit :: Expression/./ExpressionTests/ClangHostTest.ComputeClangResourceDirectory (1750 of 1935) PASS: lldb-unit :: Utility/./UtilityTests/ArchSpecTest.OperatorBool (1751 of 1935) PASS: lldb-unit :: Target/./TargetTests/ModuleCacheTest.GetAndPutUuidExists (1752 of 1935) PASS: lldb-api :: lang/cpp/chained-calls/TestCppChainedCalls.py (1753 of 1935) UNSUPPORTED: lldb-shell :: SymbolFile/dissassemble-entry-point.s (1754 of 1935) PASS: lldb-api :: functionalities/unwind/noreturn/TestNoreturnUnwind.py (1755 of 1935) PASS: lldb-api :: functionalities/plugins/python_os_plugin/TestPythonOSPlugin.py (1756 of 1935) PASS: lldb-unit :: Utility/./UtilityTests/ArgsTest.TestQuotedUnknownEscape (1757 of 1935) PASS: lldb-unit :: Utility/./UtilityTests/StreamTest.PutRawBytesToLittleEndian (1758 of 1935) PASS: lldb-unit :: Target/./TargetTests/ModuleCacheTest.GetAndPutStrangeHostname (1759 of 1935) PASS: lldb-unit :: UnwindAssembly/x86/./UnwindAssemblyx86Tests/Testx86AssemblyInspectionEngine.TestPopEDI (1760 of 1935) PASS: lldb-api :: commands/expression/import-std-module/list/TestListFromStdModule.py (1761 of 1935) UNSUPPORTED: lldb-api :: functionalities/darwin_log/filter/exact_match/category/TestDarwinLogFilterMatchCategory.py (1762 of 1935) PASS: lldb-unit :: Host/./HostTests/SocketTest.UDPGetConnectURI (1763 of 1935) PASS: lldb-unit :: UnwindAssembly/x86/./UnwindAssemblyx86Tests/Testx86AssemblyInspectionEngine.TestPopR14 (1764 of 1935) PASS: lldb-unit :: Utility/./UtilityTests/UUIDTest.Validity (1765 of 1935) PASS: lldb-unit :: Utility/./UtilityTests/LogChannelEnabledTest.LLDB_LOG_ERROR (1766 of 1935) PASS: lldb-unit :: Utility/./UtilityTests/StreamTest.PutHex64ByteOrderLittle (1767 of 1935) PASS: lldb-shell :: SymbolFile/DWARF/debug-types-line-tables.s (1768 of 1935) PASS: lldb-api :: lang/cpp/class_types/TestClassTypesDisassembly.py (1769 of 1935) XFAIL: lldb-shell :: Unwind/prefer-debug-over-eh-frame.test (1770 of 1935) PASS: lldb-shell :: SymbolFile/NativePDB/break-by-function.cpp (1771 of 1935) PASS: lldb-shell :: Minidump/Windows/broken-unwind.test (1772 of 1935) PASS: lldb-unit :: Symbol/./SymbolTests/DWARFCallFrameInfoTest.Basic_dwarf3 (1773 of 1935) PASS: lldb-unit :: Symbol/./SymbolTests/TestClangASTImporter.ImportInvalidType (1774 of 1935) PASS: lldb-unit :: Utility/./UtilityTests/StreamTeeTest.DefaultConstructor (1775 of 1935) PASS: lldb-unit :: Host/./HostTests/NativeProcessProtocolTest.SetBreakpointFailVerify (1776 of 1935) PASS: lldb-api :: functionalities/thread/concurrent_events/TestConcurrentWatchBreakDelay.py (1777 of 1935) PASS: lldb-unit :: Utility/./UtilityTests/OptionsWithRawTest.EmptyInput (1778 of 1935) PASS: lldb-api :: commands/watchpoints/watchpoint_commands/command/TestWatchpointCommandLLDB.py (1779 of 1935) PASS: lldb-unit :: Utility/./UtilityTests/TimerTest.CategoryTimesNested (1780 of 1935) PASS: lldb-unit :: Core/./LLDBCoreTests/RichManglingContextTest.FromCxxMethodName (1781 of 1935) PASS: lldb-api :: lang/cpp/scope/TestCppScope.py (1782 of 1935) PASS: lldb-unit :: Process/gdb-remote/./ProcessGdbRemoteTests/GDBRemoteClientBaseTest.SendContinueDelegateInterface (1783 of 1935) PASS: lldb-unit :: Target/./TargetTests/MCBasedABI.MapRegisterName (1784 of 1935) PASS: lldb-unit :: Host/./HostTests/FileSystemTest.FileAndDirectoryComponents (1785 of 1935) PASS: lldb-api :: python_api/lldbutil/process/TestPrintStackTraces.py (1786 of 1935) PASS: lldb-api :: lang/objc/objc-ivar-protocols/TestIvarProtocols.py (1787 of 1935) PASS: lldb-unit :: ObjectFile/ELF/./ObjectFileELFTests/ObjectFileELFTest.GetModuleSpecifications_EarlySectionHeaders (1788 of 1935) PASS: lldb-unit :: Symbol/./SymbolTests/TestTypeSystemClang.TestUnifyAccessSpecifiers (1789 of 1935) PASS: lldb-unit :: Utility/./UtilityTests/StringExtractorTest.GetHexU8_Underflow (1790 of 1935) PASS: lldb-unit :: Utility/./UtilityTests/ArchSpecTest.TestParseMachCPUDashSubtypeTripleExtra (1791 of 1935) PASS: lldb-api :: lang/mixed/TestMixedLanguages.py (1792 of 1935) PASS: lldb-shell :: ObjectFile/MachO/symtab.yaml (1793 of 1935) PASS: lldb-unit :: Utility/./UtilityTests/BroadcasterTest.BroadcastEvent (1794 of 1935) PASS: lldb-unit :: Utility/./UtilityTests/FileSpecTest.CopyByAppendingPathComponent (1795 of 1935) UNSUPPORTED: lldb-api :: functionalities/data-formatter/data-formatter-stl/libstdcpp/vbool/TestDataFormatterStdVBool.py (1796 of 1935) PASS: lldb-api :: commands/expression/diagnostics/TestExprDiagnostics.py (1797 of 1935) PASS: lldb-shell :: Host/TestCustomShell.test (1798 of 1935) PASS: lldb-api :: functionalities/data-formatter/data-formatter-synthval/TestDataFormatterSynthVal.py (1799 of 1935) PASS: lldb-api :: functionalities/thread/backtrace_limit/TestBacktraceLimit.py (1800 of 1935) PASS: lldb-api :: functionalities/data-formatter/boolreference/TestFormattersBoolRefPtr.py (1801 of 1935) PASS: lldb-unit :: Expression/./ExpressionTests/CppModuleConfigurationTest.Sysroot (1802 of 1935) PASS: lldb-unit :: Utility/./UtilityTests/RangeTest.SetRangeBase (1803 of 1935) PASS: lldb-shell :: SymbolFile/DWARF/debug-names-compressed.cpp (1804 of 1935) PASS: lldb-api :: functionalities/postmortem/mach-core/TestMachCore.py (1805 of 1935) PASS: lldb-shell :: SymbolFile/NativePDB/s_constant.cpp (1806 of 1935) PASS: lldb-unit :: Utility/./UtilityTests/StreamTeeTest.SetStreamAtIndexOverwrite (1807 of 1935) PASS: lldb-api :: functionalities/data-formatter/data-formatter-objc/cmtime/TestDataFormatterCMTime.py (1808 of 1935) PASS: lldb-api :: lang/objc/ptr_refs/TestPtrRefsObjC.py (1809 of 1935) PASS: lldb-unit :: Utility/./UtilityTests/StringLexerTest.NextIf (1810 of 1935) PASS: lldb-unit :: Utility/./UtilityTests/StreamTest.PutCString (1811 of 1935) PASS: lldb-shell :: Reproducer/Functionalities/TestExpressionEvaluation.test (1812 of 1935) PASS: lldb-unit :: Language/Highlighting/./HighlighterTests/HighlighterTest.ClangTrailingBackslashWithWhitespace (1813 of 1935) UNSUPPORTED: lldb-api :: lang/objc/bitfield_ivars/TestBitfieldIvars.py (1814 of 1935) PASS: lldb-shell :: SymbolFile/DWARF/DW_OP_piece-smaller-than-struct.s (1815 of 1935) PASS: lldb-api :: commands/expression/completion-crash-incomplete-record/TestCompletionCrashIncompleteRecord.py (1816 of 1935) PASS: lldb-api :: types/TestIntegerType.py (1817 of 1935) PASS: lldb-unit :: Utility/./UtilityTests/StringExtractorTest.GetHexBytes_FullString (1818 of 1935) PASS: lldb-api :: lang/c/blocks/TestBlocks.py (1819 of 1935) PASS: lldb-unit :: Expression/./ExpressionTests/DWARFExpression.DW_OP_piece (1820 of 1935) PASS: lldb-shell :: Breakpoint/dummy-target.test (1821 of 1935) PASS: lldb-api :: functionalities/gdb_remote_client/TestGDBRemoteClient.py (1822 of 1935) PASS: lldb-shell :: Unwind/thread-step-out-ret-addr-check.test (1823 of 1935) PASS: lldb-shell :: SymbolFile/NativePDB/globals-fundamental.cpp (1824 of 1935) PASS: lldb-api :: commands/frame/diagnose/dereference-this/TestDiagnoseDereferenceThis.py (1825 of 1935) PASS: lldb-unit :: Symbol/./SymbolTests/TestTypeSystemClang.TestGetTypeClassTypeOfExpr (1826 of 1935) PASS: lldb-api :: functionalities/data-formatter/data-formatter-stl/libcxx/atomic/TestLibCxxAtomic.py (1827 of 1935) PASS: lldb-unit :: Utility/./UtilityTests/StringListTest.InsertStringAtIndexOutOfBounds (1828 of 1935) PASS: lldb-shell :: SymbolFile/Breakpad/unwind-via-stack-cfi.test (1829 of 1935) PASS: lldb-api :: commands/process/launch-with-shellexpand/TestLaunchWithShellExpand.py (1830 of 1935) PASS: lldb-unit :: Utility/./UtilityTests/NameMatchesTest.Contains (1831 of 1935) PASS: lldb-unit :: Utility/./UtilityTests/GeneratorTest.Get (1832 of 1935) PASS: lldb-api :: commands/expression/namespace_local_var_same_name_cpp_and_c/TestNamespaceLocalVarSameNameCppAndC.py (1833 of 1935) PASS: lldb-unit :: Utility/./UtilityTests/ArgsTest.AppendArguments (1834 of 1935) PASS: lldb-unit :: UnwindAssembly/x86/./UnwindAssemblyx86Tests/Testx86AssemblyInspectionEngine.TestSpillRegToStackViaMOVx86_64 (1835 of 1935) PASS: lldb-unit :: Utility/./UtilityTests/ProcessInstanceInfo.DumpTable (1836 of 1935) PASS: lldb-api :: commands/expression/function_template_specialization_temp_args/TestFunctionTemplateSpecializationTempArgs.py (1837 of 1935) PASS: lldb-unit :: Utility/./UtilityTests/StreamTest.PutHex64ByteOrderBig (1838 of 1935) PASS: lldb-shell :: Driver/TestTarget.test (1839 of 1935) PASS: lldb-shell :: Reproducer/TestWorkingDir.test (1840 of 1935) PASS: lldb-api :: functionalities/data-formatter/data-formatter-synth/TestDataFormatterSynth.py (1841 of 1935) PASS: lldb-api :: lang/objc/objc-runtime-ivars/TestRuntimeIvars.py (1842 of 1935) PASS: lldb-unit :: Utility/./UtilityTests/OptionsWithRawTest.UnterminatedQuote (1843 of 1935) PASS: lldb-unit :: Process/minidump/./LLDBMinidumpTests/MinidumpParserTest.GetMemoryRegionInfoLinuxMaps (1844 of 1935) UNSUPPORTED: lldb-api :: functionalities/data-formatter/data-formatter-stl/libstdcpp/list/TestDataFormatterStdList.py (1845 of 1935) PASS: lldb-api :: functionalities/data-formatter/data-formatter-stl/libcxx/set/TestDataFormatterLibcxxSet.py (1846 of 1935) PASS: lldb-api :: functionalities/breakpoint/consecutive_breakpoints/TestConsecutiveBreakpoints.py (1847 of 1935) UNSUPPORTED: lldb-shell :: SymbolFile/PDB/expressions.test (1848 of 1935) PASS: lldb-api :: commands/reproducer/invalid-args/TestInvalidArgsReproducer.py (1849 of 1935) PASS: lldb-api :: commands/expression/import-std-module/stack/TestStackFromStdModule.py (1850 of 1935) PASS: lldb-unit :: Utility/./UtilityTests/BinaryStreamTest.PutSLEB128ThreeBytes (1851 of 1935) PASS: lldb-unit :: Utility/./UtilityTests/StringLexerTest.GetUnlexed (1852 of 1935) PASS: lldb-api :: macosx/load-kext/TestLoadKext.py (1853 of 1935) PASS: lldb-unit :: Utility/./UtilityTests/StringListTest.JoinThree (1854 of 1935) PASS: lldb-unit :: Utility/./UtilityTests/NameMatchesTest.StartsWith (1855 of 1935) PASS: lldb-unit :: Symbol/./SymbolTests/PostfixExpression.ParseFPOProgram (1856 of 1935) PASS: lldb-shell :: Commands/command-source.test (1857 of 1935) PASS: lldb-api :: macosx/queues/TestQueues.py (1858 of 1935) PASS: lldb-api :: functionalities/pre_run_dylibs/TestPreRunDylibs.py (1859 of 1935) UNSUPPORTED: lldb-shell :: ObjectFile/PECOFF/disassemble-thumb.yaml (1860 of 1935) PASS: lldb-shell :: SymbolFile/DWARF/debug_ranges.s (1861 of 1935) PASS: lldb-unit :: Process/minidump/./LLDBMinidumpTests/MinidumpParserTest.InvalidMinidump (1862 of 1935) PASS: lldb-api :: commands/expression/scoped_enums/TestScopedEnumType.py (1863 of 1935) PASS: lldb-unit :: Utility/./UtilityTests/StringListTest.LongestCommonPrefixSingleElement (1864 of 1935) PASS: lldb-shell :: Minidump/disassemble-no-module.yaml (1865 of 1935) PASS: lldb-unit :: Utility/./UtilityTests/StringLexerTest.NextIfList (1866 of 1935) PASS: lldb-api :: functionalities/target-new-solib-notifications/TestModuleLoadedNotifys.py (1867 of 1935) UNSUPPORTED: lldb-shell :: ScriptInterpreter/Lua/watchpoint_callback.test (1868 of 1935) PASS: lldb-shell :: Unwind/eh-frame-dwarf-unwind.test (1869 of 1935) PASS: lldb-api :: functionalities/tail_call_frames/disambiguate_call_site/TestDisambiguateCallSite.py (1870 of 1935) PASS: lldb-api :: commands/expression/ignore-artificial-constructors/TestIgnoreArtificialConstructors.py (1871 of 1935) PASS: lldb-shell :: Minidump/Windows/find-module.test (1872 of 1935) PASS: lldb-api :: functionalities/ptr_refs/TestPtrRefs.py (1873 of 1935) PASS: lldb-unit :: Utility/./UtilityTests/TimerTest.CategoryTimes (1874 of 1935) PASS: lldb-shell :: SymbolFile/NativePDB/function-types-classes.cpp (1875 of 1935) PASS: lldb-api :: commands/watchpoints/multiple_threads/TestWatchpointMultipleThreads.py (1876 of 1935) PASS: lldb-unit :: Utility/./UtilityTests/UserIDResolver.GetGroupName (1877 of 1935) PASS: lldb-unit :: Utility/./UtilityTests/SerializationRountripTest.SerializeDeserializeCStringArray (1878 of 1935) PASS: lldb-shell :: Minidump/Windows/Sigsegv/sigsegv.test (1879 of 1935) UNSUPPORTED: lldb-api :: functionalities/data-formatter/data-formatter-stl/libstdcpp/tuple/TestDataFormatterStdTuple.py (1880 of 1935) PASS: lldb-unit :: Utility/./UtilityTests/StreamTest.PutHex32ByteOrderLittle (1881 of 1935) PASS: lldb-unit :: Utility/./UtilityTests/StringExtractorTest.GetNameColonValueContainsColon (1882 of 1935) PASS: lldb-api :: functionalities/archives/TestBSDArchives.py (1883 of 1935) PASS: lldb-unit :: Utility/./UtilityTests/StringListTest.JoinNonSpace (1884 of 1935) PASS: lldb-unit :: Language/Highlighting/./HighlighterTests/HighlighterTest.ClangPPDirectives (1885 of 1935) PASS: lldb-api :: commands/frame/diagnose/bad-reference/TestBadReference.py (1886 of 1935) PASS: lldb-shell :: SymbolFile/DWARF/find-basic-variable.cpp (1887 of 1935) UNSUPPORTED: lldb-shell :: SymbolFile/NativePDB/typedefs.cpp (1888 of 1935) PASS: lldb-unit :: Utility/./UtilityTests/StringListTest.LongestCommonPrefixDuplicateElement (1889 of 1935) PASS: lldb-api :: functionalities/breakpoint/breakpoint_by_line_and_column/TestBreakpointByLineAndColumn.py (1890 of 1935) PASS: lldb-api :: commands/version/TestVersion.py (1891 of 1935) PASS: lldb-unit :: Process/minidump/./LLDBMinidumpTests/MinidumpParserTest.GetExceptionStream (1892 of 1935) UNSUPPORTED: lldb-api :: commands/expression/call-restarts/TestCallThatRestarts.py (1893 of 1935) PASS: lldb-api :: lang/cpp/operators/TestCppOperators.py (1894 of 1935) PASS: lldb-unit :: Utility/./UtilityTests/StreamTest.PutRawBytesToBigEndian (1895 of 1935) PASS: lldb-api :: functionalities/tail_call_frames/disambiguate_tail_call_seq/TestDisambiguateTailCallSeq.py (1896 of 1935) PASS: lldb-shell :: ObjectFile/ELF/base-address.yaml (1897 of 1935) PASS: lldb-unit :: Utility/./UtilityTests/StreamTest.PutRawBytesToMixedEndian (1898 of 1935) PASS: lldb-unit :: Language/Highlighting/./HighlighterTests/HighlighterTest.HighlighterSelectionType (1899 of 1935) PASS: lldb-api :: functionalities/thread/concurrent_events/TestConcurrentDelaySignalBreak.py (1900 of 1935) PASS: lldb-api :: commands/command/script/import/rdar-12586188/TestRdar12586188.py (1901 of 1935) PASS: lldb-api :: commands/disassemble/basic/TestFrameDisassemble.py (1902 of 1935) PASS: lldb-api :: commands/expression/context-object/TestContextObject.py (1903 of 1935) PASS: lldb-api :: commands/watchpoints/watchpoint_commands/TestWatchpointCommands.py (1904 of 1935) PASS: lldb-api :: commands/expression/calculator_mode/TestCalculatorMode.py (1905 of 1935) PASS: lldb-unit :: Expression/./ExpressionTests/CppModuleConfigurationTest.IgnoreLibStdCpp (1906 of 1935) PASS: lldb-api :: lang/objc/hidden-ivars/TestHiddenIvars.py (1907 of 1935) PASS: lldb-api :: lang/objc/ivar-IMP/TestObjCiVarIMP.py (1908 of 1935) PASS: lldb-unit :: Core/./LLDBCoreTests/MangledTest.ResultForValidName (1909 of 1935) PASS: lldb-api :: lang/cpp/virtual-functions/TestCppVirtualFunctions.py (1910 of 1935) PASS: lldb-api :: functionalities/thread/concurrent_events/TestConcurrentCrashWithBreak.py (1911 of 1935) PASS: lldb-unit :: Utility/./UtilityTests/ListenerTest.GetEventWait (1912 of 1935) PASS: lldb-api :: lang/c/forward/TestForwardDeclaration.py (1913 of 1935) PASS: lldb-unit :: Utility/./UtilityTests/StringListTest.LongestCommonPrefixNoPrefix (1914 of 1935) PASS: lldb-api :: python_api/sbstructureddata/TestStructuredDataAPI.py (1915 of 1935) PASS: lldb-unit :: Symbol/./SymbolTests/TestTypeSystemClang.TestGetEnumIntegerTypeInvalid (1916 of 1935) PASS: lldb-unit :: Utility/./UtilityTests/BinaryStreamTest.PutSLEB128FourBytes (1917 of 1935) PASS: lldb-unit :: UnwindAssembly/x86/./UnwindAssemblyx86Tests/Testx86AssemblyInspectionEngine.Testi386IgnoredRegisters (1918 of 1935) PASS: lldb-api :: commands/apropos/basic/TestApropos.py (1919 of 1935) PASS: lldb-unit :: Utility/./UtilityTests/UUIDTest.RelationalOperators (1920 of 1935) PASS: lldb-api :: commands/expression/rdar44436068/Test128BitsInteger.py (1921 of 1935) PASS: lldb-unit :: Utility/./UtilityTests/StringListTest.Assignment (1922 of 1935) PASS: lldb-shell :: Minidump/memory-region.yaml (1923 of 1935) PASS: lldb-unit :: Utility/./UtilityTests/StringExtractorTest.GetHexBytesAvail_Partial (1924 of 1935) PASS: lldb-api :: functionalities/thread/concurrent_events/TestConcurrentCrashWithSignal.py (1925 of 1935) PASS: lldb-unit :: Expression/./ExpressionTests/DiagnosticManagerTest.PutStringMultiple (1926 of 1935) PASS: lldb-unit :: Utility/./UtilityTests/StringListTest.AppendListCStringArrayEmpty (1927 of 1935) PASS: lldb-api :: lang/cpp/template/TestTemplateArgs.py (1928 of 1935) PASS: lldb-shell :: ObjectFile/ELF/compressed-sections.yaml (1929 of 1935) PASS: lldb-shell :: ObjectFile/ELF/minidebuginfo-find-symbols.yaml (1930 of 1935) UNSUPPORTED: lldb-api :: functionalities/darwin_log/filter/regex/subsystem/TestDarwinLogFilterRegexSubsystem.py (1931 of 1935) PASS: lldb-shell :: SymbolFile/DWARF/debug_line-relative_path.s (1932 of 1935) PASS: lldb-api :: functionalities/memory-region/TestMemoryRegion.py (1933 of 1935) PASS: lldb-api :: functionalities/data-formatter/data-formatter-objc/TestDataFormatterObjCCF.py (1934 of 1935) PASS: lldb-api :: lang/objc/forward-decl/TestForwardDecl.py (1935 of 1935)

Hide Details

Testing Time: 4231.82s ******************** Unresolved Tests (1): lldb-api :: functionalities/gdb_remote_client/TestWasm.py

Hide Details

Hide Details

Slowest Tests: -------------------------------------------------------------------------- 89.77s: lldb-api :: lang/objc/rdar-11355592/TestRdar11355592.py 90.16s: lldb-api :: lang/objc/conflicting-definition/TestConflictingDefinition.py 105.65s: lldb-api :: lang/objc/foundation/TestObjCMethodsNSError.py 106.98s: lldb-api :: python_api/lldbutil/iter/TestLLDBIterator.py 112.66s: lldb-api :: lang/objc/objc-new-syntax/TestObjCNewSyntaxArray.py 113.57s: lldb-api :: lang/objc/foundation/TestObjCMethodsString.py 114.90s: lldb-api :: lang/objc/objc-new-syntax/TestObjCNewSyntaxDictionary.py 118.13s: lldb-api :: types/TestLongTypes.py 120.87s: lldb-api :: tools/lldb-server/TestGdbRemote_qThreadStopInfo.py 127.74s: lldb-api :: types/TestLongTypesExpr.py 128.02s: lldb-api :: lang/objc/exceptions/TestObjCExceptions.py 138.61s: lldb-api :: lang/objc/real-definition/TestRealDefinition.py 149.50s: lldb-api :: lang/objc/objc-new-syntax/TestObjCNewSyntaxLiteral.py 159.58s: lldb-api :: lang/cpp/namespace/TestNamespaceLookup.py 214.32s: lldb-api :: lang/objc/foundation/TestObjCMethods.py 219.96s: lldb-api :: lang/objc/hidden-ivars/TestHiddenIvars.py 248.09s: lldb-api :: tools/lldb-server/TestGdbRemoteThreadsInStopReply.py 252.36s: lldb-api :: api/multithreaded/TestMultithreaded.py 272.79s: lldb-api :: lang/cpp/enum_types/TestCPP11EnumTypes.py 365.36s: lldb-api :: tools/lldb-server/TestLldbGdbServer.py

Hide Details

Tests Times: -------------------------------------------------------------------------- [ Range ] :: [ Percentage ] :: [ Count ] -------------------------------------------------------------------------- [ 0s, 20s) :: [********************************** ] :: [1690/1935] [ 20s, 40s) :: [** ] :: [ 119/1935] [ 40s, 60s) :: [* ] :: [ 76/1935] [ 60s, 80s) :: [ ] :: [ 24/1935] [ 80s,100s) :: [ ] :: [ 8/1935] [100s,120s) :: [ ] :: [ 5/1935] [120s,140s) :: [ ] :: [ 4/1935] [140s,160s) :: [ ] :: [ 2/1935] [160s,180s) :: [ ] :: [ 1/1935] [180s,200s) :: [ ] :: [ 0/1935] [200s,220s) :: [ ] :: [ 0/1935] [220s,240s) :: [ ] :: [ 2/1935] [240s,260s) :: [ ] :: [ 1/1935] [260s,280s) :: [ ] :: [ 1/1935] [280s,300s) :: [ ] :: [ 1/1935] [300s,320s) :: [ ] :: [ 0/1935] [320s,340s) :: [ ] :: [ 0/1935] [340s,360s) :: [ ] :: [ 0/1935] [360s,380s) :: [ ] :: [ 1/1935] Expected Passes : 1764 Expected Failures : 6 Unsupported Tests : 164 Unresolved Tests : 1 FAILED: tools/lldb/test/CMakeFiles/check-lldb-lit cd /Users/buildslave/jenkins/workspace/lldb-cmake-sanitized/lldb-build/tools/lldb/test && /usr/local/bin/python /Users/buildslave/jenkins/workspace/lldb-cmake-sanitized/lldb-build/./bin/llvm-lit -v --time-tests --shuffle --xunit-xml-output=/Users/buildslave/jenkins/workspace/lldb-cmake-sanitized/test/results.xml -v -j 4 --timeout 1200 /Users/buildslave/jenkins/workspace/lldb-cmake-sanitized/lldb-build/tools/lldb/test ninja: build stopped: subcommand failed. Command failed: Command '['/usr/bin/env', 'TERM=vt100', '/usr/local/bin/ninja', '-v', 'check-lldb']' returned non-zero exit status 1. Command: ['/usr/bin/env', 'TERM=vt100', '/usr/local/bin/ninja', '-v', 'check-lldb'] [Pipeline] } [Pipeline] // timeout [Pipeline] } [Pipeline] // stage [Pipeline] stage [Pipeline] { (Declarative: Post Actions) [Pipeline] scanForIssues No credentials specified [Clang (LLVM based)] Sleeping for 5 seconds due to JENKINS-32191... [Clang (LLVM based)] Parsing console log (workspace: '/Users/buildslave/jenkins/workspace/lldb-cmake-sanitized') [Clang (LLVM based)] [-ERROR-] Git blame errors: [Clang (LLVM based)] [-ERROR-] - no blame results for request <llvm-project/lldb/source/Plugins/Language/ObjC/NSDictionary.cpp - [726]>.

Hide Details

[Clang (LLVM based)] [-ERROR-] Git blame errors: [Clang (LLVM based)] [-ERROR-] - no blame results for request <llvm-project/lldb/source/Plugins/Language/ObjC/NSSet.cpp - [516]>.

Hide Details

[Clang (LLVM based)] [-ERROR-] Git blame errors: [Clang (LLVM based)] [-ERROR-] - no blame results for request <llvm-project/lldb/source/Plugins/Language/ObjC/NSArray.cpp - [530, 597]>.

Hide Details

[Clang (LLVM based)] Post processing issues on 'green-dragon-23' with source code encoding 'UTF-8' [Clang (LLVM based)] Resolving absolute file names for all issues in workspace '/Users/buildslave/jenkins/workspace/lldb-cmake-sanitized' [Clang (LLVM based)] -> 0 resolved, 0 unresolved, 3 already resolved [Clang (LLVM based)] Copying affected files to Jenkins' build folder '/Users/Shared/Jenkins/Home/jobs/lldb-cmake-sanitized/builds/966/files-with-issues' [Clang (LLVM based)] -> 3 copied, 0 not in workspace, 0 not-found, 0 with I/O error [Clang (LLVM based)] Resolving module names from module definitions (build.xml, pom.xml, or Manifest.mf files) [Clang (LLVM based)] -> resolved module names for 4 issues [Clang (LLVM based)] Resolving package names (or namespaces) by parsing the affected files [Clang (LLVM based)] -> resolved package names of 3 affected files [Clang (LLVM based)] No filter has been set, publishing all 4 issues [Clang (LLVM based)] Creating fingerprints for all affected code blocks to track issues over different builds [Clang (LLVM based)] -> created fingerprints for 4 issues [Clang (LLVM based)] Invoking Git blamer to create author and commit information for all affected files [Clang (LLVM based)] GIT_COMMIT env = 'HEAD' [Clang (LLVM based)] Git working tree = '/Users/buildslave/jenkins/workspace/lldb-cmake-sanitized' [Clang (LLVM based)] Git commit ID = '3a4296e9c1cdb53e0bf939b244790d257a6d5f26' [Clang (LLVM based)] Job workspace = '/Users/buildslave/jenkins/workspace/lldb-cmake-sanitized' [Clang (LLVM based)] Created blame requests for 3 files - invoking Git blame on agent for each of the requests [Clang (LLVM based)] -> blamed authors of issues in 3 files
[Pipeline] junit Recording test results [Pipeline] } [Pipeline] // stage [Pipeline] } [Pipeline] // withEnv [Pipeline] } [Pipeline] // node [Pipeline] End of Pipeline ERROR: script returned exit code 1 Finished: FAILURE