FailedConsole Output

Skipping 571 KB.. Full Log
elTest.Disable (526 of 1935)
PASS: lldb-unit :: Utility/./UtilityTests/StringExtractorTest.GetHexBytes_Underflow (527 of 1935)
UNSUPPORTED: lldb-shell :: ScriptInterpreter/Lua/breakpoint_callback.test (528 of 1935)
PASS: lldb-unit :: UnwindAssembly/x86/./UnwindAssemblyx86Tests/Testx86AssemblyInspectionEngine.TestPushRBX (529 of 1935)
PASS: lldb-unit :: Utility/./UtilityTests/ReproducerTest.SetReplay (530 of 1935)
PASS: lldb-api :: functionalities/data-formatter/data-formatter-objc/TestDataFormatterObjCExpr.py (531 of 1935)
UNSUPPORTED: lldb-api :: functionalities/breakpoint/breakpoint_callback_command_source/TestBreakpointCallbackCommandSource.py (532 of 1935)
PASS: lldb-api :: functionalities/data-formatter/data-formatter-disabling/TestDataFormatterDisabling.py (533 of 1935)
PASS: lldb-unit :: Process/gdb-remote/./ProcessGdbRemoteTests/GDBRemoteCommunicationClientTest.WriteRegisterNoSuffix (534 of 1935)
PASS: lldb-api :: commands/command/script/TestCommandScript.py (535 of 1935)
PASS: lldb-api :: lang/objcxx/hide-runtime-values/TestObjCXXHideRuntimeValues.py (536 of 1935)
PASS: lldb-shell :: SymbolFile/DWARF/debug-types-signature-loop.s (537 of 1935)
PASS: lldb-shell :: SymbolFile/DWARF/dir-separator-posix.s (538 of 1935)
PASS: lldb-api :: lang/objc/objc-runtime-ivars/TestRuntimeIvars.py (539 of 1935)
PASS: lldb-unit :: Utility/./UtilityTests/StreamTeeTest.Constructor1Stream (540 of 1935)
PASS: lldb-unit :: Interpreter/./InterpreterTests/OptionArgParserTest.toBoolean (541 of 1935)
UNSUPPORTED: lldb-shell :: ObjectFile/PECOFF/disassemble-thumb.yaml (542 of 1935)
UNSUPPORTED: lldb-api :: functionalities/data-formatter/data-formatter-stl/libstdcpp/map/TestDataFormatterStdMap.py (543 of 1935)
PASS: lldb-api :: lang/cpp/char8_t/TestCxxChar8_t.py (544 of 1935)
PASS: lldb-api :: lang/c/offsetof/TestOffsetof.py (545 of 1935)
PASS: lldb-unit :: Utility/./UtilityTests/StringExtractorTest.GetHexBytesAvail_FullString (546 of 1935)
PASS: lldb-api :: lang/cpp/multiple-inheritance/TestCppMultipleInheritance.py (547 of 1935)
PASS: lldb-api :: lang/cpp/namespace/TestNamespaceLookup.py (548 of 1935)
PASS: lldb-unit :: Symbol/./SymbolTests/TestClangASTImporter.RecordLayout (549 of 1935)
UNSUPPORTED: lldb-api :: functionalities/ubsan/basic/TestUbsanBasic.py (550 of 1935)
PASS: lldb-shell :: Driver/TestTarget.test (551 of 1935)
PASS: lldb-api :: python_api/value/change_values/TestChangeValueAPI.py (552 of 1935)
PASS: lldb-api :: python_api/value/linked_list/TestValueAPILinkedList.py (553 of 1935)
PASS: lldb-unit :: Interpreter/./InterpreterTests/CompletionTest.DirCompletionUsername (554 of 1935)
PASS: lldb-unit :: Utility/./UtilityTests/StreamTest.PutCharWhitespace (555 of 1935)
UNSUPPORTED: lldb-shell :: SymbolFile/DWARF/debug-types-expressions.test (556 of 1935)
PASS: lldb-unit :: Utility/./UtilityTests/OptionsWithRawTest.EmptySuffix (557 of 1935)
PASS: lldb-unit :: Symbol/./SymbolTests/Type.GetTypeScopeAndBasename (558 of 1935)
PASS: lldb-unit :: SymbolFile/DWARF/./SymbolFileDWARFTests/SymbolFileDWARFTests.TestAbbrevValidAttrNullForm (559 of 1935)
PASS: lldb-api :: functionalities/stats_api/TestStatisticsAPI.py (560 of 1935)
UNSUPPORTED: lldb-api :: functionalities/darwin_log/filter/exact_match/category/TestDarwinLogFilterMatchCategory.py (561 of 1935)
PASS: lldb-unit :: Utility/./UtilityTests/ArgsTest.ReplaceArgumentAtIndexFarOutOfRange (562 of 1935)
PASS: lldb-api :: functionalities/postmortem/minidump/TestMiniDump.py (563 of 1935)
PASS: lldb-unit :: Utility/./UtilityTests/LogChannelTest.Enable (564 of 1935)
PASS: lldb-unit :: Utility/./UtilityTests/StreamTest.PutCString (565 of 1935)
PASS: lldb-api :: commands/target/create-no-such-arch/TestNoSuchArch.py (566 of 1935)
PASS: lldb-unit :: SymbolFile/NativePDB/./SymbolFileNativePDBTests/PDBFPOProgramToDWARFExpressionTests.InvalidAssignmentSingle (567 of 1935)
PASS: lldb-api :: commands/watchpoints/watchpoint_set_command/TestWatchLocationWithWatchSet.py (568 of 1935)
PASS: lldb-api :: functionalities/thread/create_after_attach/TestCreateAfterAttach.py (569 of 1935)
PASS: lldb-unit :: Core/./LLDBCoreTests/RichManglingContextTest.IPDRealloc (570 of 1935)
PASS: lldb-unit :: Symbol/./SymbolTests/TestTypeSystemClang.TestFunctionTemplateInRecordConstruction (571 of 1935)
PASS: lldb-shell :: Breakpoint/single-file-split-dwarf.test (572 of 1935)
PASS: lldb-unit :: Utility/./UtilityTests/ScalarTest.SetValueFromCString (573 of 1935)
PASS: lldb-shell :: SymbolFile/NativePDB/function-types-builtins.cpp (574 of 1935)
PASS: lldb-unit :: Symbol/./SymbolTests/PostfixExpression.ParseFPOProgram (575 of 1935)
PASS: lldb-unit :: SymbolFile/DWARF/./SymbolFileDWARFTests/DWARFASTParserClangTests.EnsureAllDIEsInDeclContextHaveBeenParsedParsesOnlyMatchingEntries (576 of 1935)
PASS: lldb-unit :: Utility/./UtilityTests/CompletionRequest.TryCompleteCurrentArgBad (577 of 1935)
PASS: lldb-api :: lang/cpp/static_methods/TestCPPStaticMethods.py (578 of 1935)
PASS: lldb-api :: macosx/find-app-in-bundle/TestFindAppInBundle.py (579 of 1935)
PASS: lldb-unit :: Utility/./UtilityTests/StreamTeeTest.SetStreamAtIndexOverwrite (580 of 1935)
PASS: lldb-unit :: Utility/./UtilityTests/StringListTest.GetSize (581 of 1935)
PASS: lldb-api :: lang/c/unicode/TestUnicodeSymbols.py (582 of 1935)
UNSUPPORTED: lldb-api :: benchmarks/libcxxmap/TestBenchmarkLibcxxMap.py (583 of 1935)
PASS: lldb-shell :: Breakpoint/split-dwarf5-debug-stroffsets.test (584 of 1935)
PASS: lldb-shell :: Driver/TestConvenienceVariables.test (585 of 1935)
PASS: lldb-unit :: Language/Highlighting/./HighlighterTests/HighlighterTest.ClangStringLiterals (586 of 1935)
PASS: lldb-api :: lang/objcxx/class-name-clash/TestNameClash.py (587 of 1935)
PASS: lldb-unit :: ScriptInterpreter/Python/./ScriptInterpreterPythonTests/PythonDataObjectsTest.TestModuleNameResolutionNoDot (588 of 1935)
PASS: lldb-unit :: Utility/./UtilityTests/VASprintfTest.NoBufferResize (589 of 1935)
PASS: lldb-unit :: Symbol/./SymbolTests/DWARFCallFrameInfoTest.Basic_dwarf4 (590 of 1935)
PASS: lldb-unit :: Utility/./UtilityTests/RangeTest.Constructor (591 of 1935)
PASS: lldb-unit :: UnwindAssembly/x86/./UnwindAssemblyx86Tests/Testx86AssemblyInspectionEngine.TestLEAVE (592 of 1935)
PASS: lldb-unit :: Utility/./UtilityTests/BinaryStreamTest.PutSLEB128NineBytes (593 of 1935)
PASS: lldb-shell :: SymbolFile/DWARF/debug-types-missing-signature.test (594 of 1935)
PASS: lldb-api :: types/TestLongTypesExpr.py (595 of 1935)
PASS: lldb-api :: python_api/watchpoint/TestWatchpointIter.py (596 of 1935)
PASS: lldb-unit :: Utility/./UtilityTests/VMRange.Ordering (597 of 1935)
PASS: lldb-unit :: UnwindAssembly/x86/./UnwindAssemblyx86Tests/Testx86AssemblyInspectionEngine.TestPopR13 (598 of 1935)
PASS: lldb-api :: functionalities/load_using_paths/TestLoadUsingPaths.py (599 of 1935)
PASS: lldb-api :: lang/cpp/dynamic-value/TestCppValueCast.py (600 of 1935)
PASS: lldb-shell :: ObjectFile/ELF/PT_LOAD-overlap.yaml (601 of 1935)
PASS: lldb-shell :: SymbolFile/DWARF/gnu-style-compression.cpp (602 of 1935)
PASS: lldb-api :: lang/objc/objc-new-syntax/TestObjCNewSyntaxDictionary.py (603 of 1935)
PASS: lldb-unit :: Utility/./UtilityTests/StreamTest.PutMaxHex64ByteOrderLittle (604 of 1935)
UNSUPPORTED: lldb-shell :: SymbolFile/PDB/compilands.test (605 of 1935)
PASS: lldb-unit :: Language/Highlighting/./HighlighterTests/HighlighterTest.ClangCursorPos (606 of 1935)
PASS: lldb-unit :: Symbol/./SymbolTests/TestClangASTImporter.CompleteFwdDeclWithOtherOrigin (607 of 1935)
PASS: lldb-shell :: Breakpoint/case-sensitive.test (608 of 1935)
PASS: lldb-unit :: UnwindAssembly/x86/./UnwindAssemblyx86Tests/Testx86AssemblyInspectionEngine.TestAddESP (609 of 1935)
PASS: lldb-api :: functionalities/thread/concurrent_events/TestConcurrentCrashWithSignal.py (610 of 1935)
PASS: lldb-shell :: SymbolFile/DWARF/dir-separator-no-comp-dir-relative-name.s (611 of 1935)
PASS: lldb-api :: commands/watchpoints/watchpoint_commands/TestWatchpointCommands.py (612 of 1935)
PASS: lldb-unit :: Utility/./UtilityTests/RangeTest.ContainsRangeStartingFromZero (613 of 1935)
PASS: lldb-api :: lang/objc/objc-checker/TestObjCCheckers.py (614 of 1935)
PASS: lldb-api :: python_api/watchpoint/TestWatchpointIgnoreCount.py (615 of 1935)
PASS: lldb-api :: lang/cpp/llvm-style/TestLLVMStyle.py (616 of 1935)
PASS: lldb-unit :: Utility/./UtilityTests/StringListTest.CopyListEmpty (617 of 1935)
PASS: lldb-api :: macosx/add-dsym/TestAddDsymMidExecutionCommand.py (618 of 1935)
PASS: lldb-shell :: Quit/TestQuitExitCodeImplicit0.test (619 of 1935)
PASS: lldb-api :: commands/breakpoint/command/list/TestBreakpointCommandList.py (620 of 1935)
PASS: lldb-unit :: Utility/./UtilityTests/StringListTest.LongestCommonPrefix (621 of 1935)
PASS: lldb-api :: python_api/section/TestSectionAPI.py (622 of 1935)
PASS: lldb-unit :: Expression/./ExpressionTests/ClangHostTest.MacOSX (623 of 1935)
UNSUPPORTED: lldb-api :: api/multiple-debuggers/TestMultipleDebuggers.py (624 of 1935)
PASS: lldb-unit :: Utility/./UtilityTests/StringExtractorTest.GetHexU8_Exact_NoEof (625 of 1935)
PASS: lldb-shell :: ObjectFile/PECOFF/basic-info-arm64.yaml (626 of 1935)
PASS: lldb-api :: lang/cpp/gmodules-templates/TestGModules.py (627 of 1935)
PASS: lldb-api :: functionalities/dynamic_value_child_count/TestDynamicValueChildCount.py (628 of 1935)
PASS: lldb-api :: functionalities/data-formatter/data-formatter-stl/libcxx/function/TestLibCxxFunction.py (629 of 1935)
PASS: lldb-unit :: Host/./HostTests/FileSystemTest.MakeAbsolute (630 of 1935)
PASS: lldb-api :: functionalities/postmortem/elf-core/gcore/TestGCore.py (631 of 1935)
PASS: lldb-unit :: Utility/./UtilityTests/FileSpecTest.Match (632 of 1935)
PASS: lldb-unit :: Utility/./UtilityTests/LogChannelEnabledTest.LogVerboseThread (633 of 1935)
PASS: lldb-shell :: SymbolFile/DWARF/win-i386-line-table.s (634 of 1935)
PASS: lldb-api :: functionalities/gdb_remote_client/TestWriteMemory.py (635 of 1935)
PASS: lldb-shell :: Minidump/Windows/Sigsegv/sigsegv.test (636 of 1935)
PASS: lldb-shell :: ObjectFile/ELF/gnu-debuglink.yaml (637 of 1935)
PASS: lldb-unit :: UnwindAssembly/x86/./UnwindAssemblyx86Tests/Testx86AssemblyInspectionEngine.TestStackRealign32BitDisp_x86_64 (638 of 1935)
PASS: lldb-api :: functionalities/type_completion/TestTypeCompletion.py (639 of 1935)
PASS: lldb-api :: commands/watchpoints/watchpoint_disable/TestWatchpointDisable.py (640 of 1935)
PASS: lldb-api :: lang/objcxx/cxx-bridged-po/TestObjCXXBridgedPO.py (641 of 1935)
PASS: lldb-unit :: Language/Highlighting/./HighlighterTests/HighlighterTest.ClangCursorPosAfterOtherToken (642 of 1935)
PASS: lldb-api :: functionalities/data-formatter/data-formatter-stl/libcxx/map/TestDataFormatterLibccMap.py (643 of 1935)
PASS: lldb-unit :: Process/gdb-remote/./ProcessGdbRemoteTests/GDBRemoteCommunicationClientTest.WriteRegister (644 of 1935)
PASS: lldb-unit :: Expression/./ExpressionTests/DWARFExpression.DW_OP_convert (645 of 1935)
PASS: lldb-api :: lang/c/set_values/TestSetValues.py (646 of 1935)
PASS: lldb-api :: functionalities/breakpoint/breakpoint_set_restart/TestBreakpointSetRestart.py (647 of 1935)
PASS: lldb-api :: lang/objc/objc-class-method/TestObjCClassMethod.py (648 of 1935)
PASS: lldb-unit :: Process/gdb-remote/./ProcessGdbRemoteTests/GDBRemoteCommunicationClientTest.SyncThreadState (649 of 1935)
PASS: lldb-unit :: Utility/./UtilityTests/VMRange.IsValid (650 of 1935)
PASS: lldb-unit :: Utility/./UtilityTests/StringExtractorTest.GetNameColonValueNoColon (651 of 1935)
PASS: lldb-unit :: Utility/./UtilityTests/FileSpecTest.IsRelative (652 of 1935)
PASS: lldb-api :: lang/c/const_variables/TestConstVariables.py (653 of 1935)
PASS: lldb-unit :: Utility/./UtilityTests/StreamTest.AddressPrefix (654 of 1935)
PASS: lldb-api :: types/TestLongTypes.py (655 of 1935)
UNSUPPORTED: lldb-shell :: Register/x86-64-xmm16-write.test (656 of 1935)
PASS: lldb-api :: commands/expression/dont_allow_jit/TestAllowJIT.py (657 of 1935)
PASS: lldb-unit :: ScriptInterpreter/Python/./ScriptInterpreterPythonTests/PythonDataObjectsTest.TestPythonTupleToStructuredList (658 of 1935)
PASS: lldb-unit :: Utility/./UtilityTests/BinaryStreamTest.PutULEB128MaxValue (659 of 1935)
PASS: lldb-unit :: ScriptInterpreter/Python/./ScriptInterpreterPythonTests/PythonDataObjectsTest.TestOwnedReferences (660 of 1935)
PASS: lldb-api :: functionalities/gdb_remote_client/TestNoGPacketSupported.py (661 of 1935)
PASS: lldb-api :: python_api/process/io/TestProcessIO.py (662 of 1935)
PASS: lldb-api :: commands/watchpoints/watchpoint_commands/condition/TestWatchpointConditionCmd.py (663 of 1935)
PASS: lldb-unit :: Utility/./UtilityTests/StringLexerTest.GetUnlexed (664 of 1935)
PASS: lldb-unit :: Symbol/./SymbolTests/SymbolsTest.TerminateLocateExecutableSymbolFileForUnknownExecutableAndUnknownSymbolFile (665 of 1935)
PASS: lldb-api :: functionalities/thread/backtrace_limit/TestBacktraceLimit.py (666 of 1935)
PASS: lldb-api :: macosx/load-kext/TestLoadKext.py (667 of 1935)
PASS: lldb-unit :: Language/Highlighting/./HighlighterTests/HighlighterTest.ClangCursorPosInOtherToken (668 of 1935)
PASS: lldb-api :: functionalities/tail_call_frames/thread_step_out_message/TestArtificialFrameStepOutMessage.py (669 of 1935)
PASS: lldb-unit :: Signals/./SignalsTests/UnixSignalsTest.GetInfo (670 of 1935)
PASS: lldb-api :: functionalities/thread/concurrent_events/TestConcurrentSignalBreak.py (671 of 1935)
PASS: lldb-unit :: ScriptInterpreter/Python/./ScriptInterpreterPythonTests/PythonDataObjectsTest.TestRun (672 of 1935)
UNSUPPORTED: lldb-api :: lang/objc/foundation/TestFoundationDisassembly.py (673 of 1935)
PASS: lldb-api :: commands/expression/argument_passing_restrictions/TestArgumentPassingRestrictions.py (674 of 1935)
PASS: lldb-shell :: SymbolFile/Breakpad/unwind-via-stack-win.test (675 of 1935)
PASS: lldb-unit :: Utility/./UtilityTests/TimeoutTest.Format (676 of 1935)
PASS: lldb-api :: lang/c/forward/TestForwardDeclaration.py (677 of 1935)
PASS: lldb-api :: functionalities/data-formatter/parray/TestPrintArray.py (678 of 1935)
PASS: lldb-unit :: SymbolFile/NativePDB/./SymbolFileNativePDBTests/PDBFPOProgramToDWARFExpressionTests.MultipleIndependentAssignments (679 of 1935)
PASS: lldb-unit :: Process/minidump/./LLDBMinidumpTests/MinidumpParserTest.GetPidWow64 (680 of 1935)
PASS: lldb-unit :: Utility/./UtilityTests/NameMatchesTest.StartsWith (681 of 1935)
PASS: lldb-api :: functionalities/show_location/TestShowLocationDwarf5.py (682 of 1935)
PASS: lldb-unit :: Utility/./UtilityTests/EnvironmentTest.EnvpConversion (683 of 1935)
PASS: lldb-unit :: Utility/./UtilityTests/OptionsWithRawTest.ArgsButNoDelimiter (684 of 1935)
XFAIL: lldb-shell :: Register/x86-64-write.test (685 of 1935)
PASS: lldb-shell :: Unwind/thread-step-out-ret-addr-check.test (686 of 1935)
PASS: lldb-unit :: UnwindAssembly/x86/./UnwindAssemblyx86Tests/Testx86AssemblyInspectionEngine.TestPushR12 (687 of 1935)
PASS: lldb-api :: lang/objc/foundation/TestObjectDescriptionAPI.py (688 of 1935)
UNSUPPORTED: lldb-api :: iohandler/completion/TestIOHandlerCompletion.py (689 of 1935)
PASS: lldb-unit :: Utility/./UtilityTests/StringListTest.LongestCommonPrefixDuplicateElement (690 of 1935)
PASS: lldb-api :: functionalities/gdb_remote_client/TestThreadSelectionBug.py (691 of 1935)
PASS: lldb-api :: commands/expression/import-std-module/weak_ptr-dbg-info-content/TestDbgInfoContentWeakPtrFromStdModule.py (692 of 1935)
PASS: lldb-unit :: Utility/./UtilityTests/StringListTest.InsertStringAtIndexEnd (693 of 1935)
PASS: lldb-unit :: Utility/./UtilityTests/StreamTest.AddressRangeInvalidRange (694 of 1935)
PASS: lldb-api :: python_api/hello_world/TestHelloWorld.py (695 of 1935)
UNSUPPORTED: lldb-api :: linux/add-symbols/TestTargetSymbolsAddCommand.py (696 of 1935)
PASS: lldb-api :: functionalities/data-formatter/format-propagation/TestFormatPropagation.py (697 of 1935)
PASS: lldb-unit :: Utility/./UtilityTests/StringListTest.ShiftMove (698 of 1935)
PASS: lldb-unit :: Utility/./UtilityTests/StringLexerTest.PutBack (699 of 1935)
PASS: lldb-unit :: Utility/./UtilityTests/ArgsTest.TestOverwriteArgs (700 of 1935)
PASS: lldb-unit :: UnwindAssembly/x86/./UnwindAssemblyx86Tests/Testx86AssemblyInspectionEngine.TestPushEDI (701 of 1935)
PASS: lldb-api :: tools/lldb-server/TestGdbRemoteKill.py (702 of 1935)
PASS: lldb-shell :: ObjectFile/ELF/avr-basic-info.yaml (703 of 1935)
PASS: lldb-unit :: Utility/./UtilityTests/RangeTest.Copy (704 of 1935)
PASS: lldb-unit :: Utility/./UtilityTests/BinaryStreamTest.PutSLEB128MaxValue (705 of 1935)
PASS: lldb-api :: lang/cpp/limit-debug-info/TestWithLimitDebugInfo.py (706 of 1935)
PASS: lldb-unit :: Process/gdb-remote/./ProcessGdbRemoteTests/GDBRemoteClientBaseTest.SendContinueDelegateInterface (707 of 1935)
UNSUPPORTED: lldb-shell :: SymbolFile/PDB/func-symbols.test (708 of 1935)
PASS: lldb-api :: macosx/nslog/TestDarwinNSLogOutput.py (709 of 1935)
UNSUPPORTED: lldb-api :: functionalities/tsan/cpp_global_location/TestTsanCPPGlobalLocation.py (710 of 1935)
PASS: lldb-shell :: ObjectFile/ELF/PT_LOAD.yaml (711 of 1935)
PASS: lldb-api :: commands/frame/language/TestGuessLanguage.py (712 of 1935)
PASS: lldb-unit :: Language/Highlighting/./HighlighterTests/HighlighterTest.ClangTrailingBackslashBeforeNewline (713 of 1935)
PASS: lldb-unit :: Interpreter/./InterpreterTests/CompletionTest.FileCompletionAbsolute (714 of 1935)
PASS: lldb-api :: commands/process/attach-resume/TestAttachResume.py (715 of 1935)
PASS: lldb-unit :: Utility/./UtilityTests/UriParserTest.Minimal (716 of 1935)
PASS: lldb-api :: commands/expression/completion-in-lambda-and-unnamed-class/TestCompletionInLambdaAndUnnamedClass.py (717 of 1935)
PASS: lldb-unit :: Expression/./ExpressionTests/DiagnosticManagerTest.GetStringBasic (718 of 1935)
PASS: lldb-api :: commands/expression/save_jit_objects/TestSaveJITObjects.py (719 of 1935)
PASS: lldb-api :: python_api/lldbutil/process/TestPrintStackTraces.py (720 of 1935)
PASS: lldb-api :: commands/disassemble/basic/TestDisassembleBreakpoint.py (721 of 1935)
PASS: lldb-shell :: SymbolFile/Breakpad/symtab-macho.test (722 of 1935)
PASS: lldb-api :: lang/c/conflicting-symbol/TestConflictingSymbol.py (723 of 1935)
PASS: lldb-unit :: Utility/./UtilityTests/StreamTest.AddressRangeEmptyRange (724 of 1935)
PASS: lldb-api :: commands/apropos/with-process/TestAproposWithProcess.py (725 of 1935)
PASS: lldb-unit :: Utility/./UtilityTests/BinaryStreamTest.PutULEB128EightBytes (726 of 1935)
PASS: lldb-unit :: Utility/./UtilityTests/RecordReplayTest.InstrumentedBarRef (727 of 1935)
PASS: lldb-shell :: SymbolFile/DWARF/debug-names-compressed.cpp (728 of 1935)
PASS: lldb-unit :: Language/Highlighting/./HighlighterTests/HighlighterTest.ClangComments (729 of 1935)
UNSUPPORTED: lldb-api :: functionalities/tsan/thread_numbers/TestTsanThreadNumbers.py (730 of 1935)
PASS: lldb-api :: lang/objc/variadic_methods/TestVariadicMethods.py (731 of 1935)
PASS: lldb-unit :: Utility/./UtilityTests/BinaryStreamTest.PutULEB128SixBytes (732 of 1935)
PASS: lldb-unit :: Process/gdb-remote/./ProcessGdbRemoteTests/GDBRemoteCommunicationClientTest.ReadRegister (733 of 1935)
PASS: lldb-shell :: Register/x86-64-ymm-read.test (734 of 1935)
PASS: lldb-api :: functionalities/target_var/TestTargetVar.py (735 of 1935)
PASS: lldb-api :: python_api/sbdata/TestSBData.py (736 of 1935)
PASS: lldb-unit :: Symbol/./SymbolTests/LineEntryTest.GetSameLineContiguousAddressRangeNoInlines (737 of 1935)
PASS: lldb-unit :: UnwindAssembly/x86/./UnwindAssemblyx86Tests/Testx86AssemblyInspectionEngine.Test64bitFramelessBigStackFrame (738 of 1935)
PASS: lldb-api :: functionalities/breakpoint/step_over_breakpoint/TestStepOverBreakpoint.py (739 of 1935)
PASS: lldb-api :: commands/expression/formatters/TestFormatters.py (740 of 1935)
PASS: lldb-unit :: Utility/./UtilityTests/StringLexerTest.NextIf (741 of 1935)
PASS: lldb-unit :: SymbolFile/NativePDB/./SymbolFileNativePDBTests/PDBFPOProgramToDWARFExpressionTests.MissingTargetRegister (742 of 1935)
PASS: lldb-api :: functionalities/data-formatter/data-formatter-objc/TestDataFormatterObjCPlain.py (743 of 1935)
PASS: lldb-api :: lang/objc/objc-ivar-stripped/TestObjCIvarStripped.py (744 of 1935)
PASS: lldb-unit :: Symbol/./SymbolTests/TestTypeSystemClang.TestNotDeletingUserCopyCstrDueToMoveCStr (745 of 1935)
PASS: lldb-unit :: ScriptInterpreter/Python/./ScriptInterpreterPythonTests/PythonDataObjectsTest.TestPythonIntegerToStr (746 of 1935)
PASS: lldb-api :: commands/command/script_alias/TestCommandScriptAlias.py (747 of 1935)
PASS: lldb-api :: functionalities/data-formatter/data-formatter-objc/nsindexpath/TestDataFormatterNSIndexPath.py (748 of 1935)
PASS: lldb-shell :: ObjectFile/PECOFF/uuid.yaml (749 of 1935)
PASS: lldb-api :: tools/lldb-server/TestGdbRemoteAttach.py (750 of 1935)
PASS: lldb-api :: functionalities/thread/concurrent_events/TestConcurrentDelaySignalBreak.py (751 of 1935)
PASS: lldb-shell :: Breakpoint/implicit_const_form_support.test (752 of 1935)
PASS: lldb-unit :: Utility/./UtilityTests/StateTest.Formatv (753 of 1935)
PASS: lldb-unit :: Utility/./UtilityTests/StreamTest.PutBytesAsRawHex8ToLittleEndian (754 of 1935)
UNSUPPORTED: lldb-shell :: Register/x86-64-zmm-write.test (755 of 1935)
PASS: lldb-unit :: Symbol/./SymbolTests/TestClangASTImporter.MetadataPropagation (756 of 1935)
PASS: lldb-api :: commands/frame/diagnose/dereference-this/TestDiagnoseDereferenceThis.py (757 of 1935)
UNSUPPORTED: lldb-api :: functionalities/darwin_log/filter/exact_match/activity-chain/TestDarwinLogFilterMatchActivityChain.py (758 of 1935)
PASS: lldb-api :: lang/cpp/global_operators/TestCppGlobalOperators.py (759 of 1935)
PASS: lldb-api :: functionalities/paths/TestPaths.py (760 of 1935)
PASS: lldb-unit :: UnwindAssembly/x86/./UnwindAssemblyx86Tests/Testx86AssemblyInspectionEngine.TestPushEDX (761 of 1935)
PASS: lldb-unit :: Utility/./UtilityTests/StringListTest.GetMaxStringLengthEqualSize (762 of 1935)
PASS: lldb-api :: functionalities/memory/read/TestMemoryRead.py (763 of 1935)
PASS: lldb-api :: functionalities/thread/concurrent_events/TestConcurrentDelayWatchBreak.py (764 of 1935)
PASS: lldb-unit :: Language/Highlighting/./HighlighterTests/HighlighterTest.Keywords (765 of 1935)
PASS: lldb-unit :: Expression/./ExpressionTests/CppModuleConfigurationTest.LibCppV2 (766 of 1935)
PASS: lldb-unit :: Host/./HostTests/NativeProcessProtocolTest.SetBreakpointFailRead (767 of 1935)
PASS: lldb-api :: python_api/function_symbol/TestSymbolAPI.py (768 of 1935)
UNSUPPORTED: lldb-api :: tools/lldb-server/TestGdbRemoteModuleInfo.py (769 of 1935)
PASS: lldb-unit :: Utility/./UtilityTests/RangeDataVector.CustomSort (770 of 1935)
PASS: lldb-unit :: Process/gdb-remote/./ProcessGdbRemoteTests/GDBRemoteCommunicationClientTest.SendStartTracePacket (771 of 1935)
PASS: lldb-unit :: Utility/./UtilityTests/StringListTest.ForRangeEmpty (772 of 1935)
PASS: lldb-shell :: SymbolFile/DWARF/find-method.cpp (773 of 1935)
PASS: lldb-shell :: SymbolFile/DWARF/find-method-local-struct.cpp (774 of 1935)
PASS: lldb-unit :: Language/Highlighting/./HighlighterTests/HighlighterTest.DefaultHighlighterWithCursorOutOfBounds (775 of 1935)
PASS: lldb-unit :: Utility/./UtilityTests/SerializationRountripTest.SerializeDeserializeCStringArrayNullptr (776 of 1935)
PASS: lldb-api :: commands/expression/class_template_specialization_empty_pack/TestClassTemplateSpecializationParametersHandling.py (777 of 1935)
PASS: lldb-api :: functionalities/data-formatter/data-formatter-synthtype/TestDataFormatterSynthType.py (778 of 1935)
PASS: lldb-api :: functionalities/breakpoint/comp_dir_symlink/TestCompDirSymLink.py (779 of 1935)
PASS: lldb-api :: sample_test/TestSampleInlineTest.py (780 of 1935)
PASS: lldb-shell :: SymbolFile/DWARF/array-sizes.s (781 of 1935)
PASS: lldb-unit :: Utility/./UtilityTests/FileSpecTest.EqualDotsWindows (782 of 1935)
PASS: lldb-unit :: Interpreter/./InterpreterTests/OptionArgParserTest.toScriptLanguage (783 of 1935)
PASS: lldb-unit :: Target/./TargetTests/ModuleCacheTest.GetAndPutStrangeHostname (784 of 1935)
PASS: lldb-api :: commands/expression/persistent_variables/TestPersistentVariables.py (785 of 1935)
PASS: lldb-unit :: Utility/./UtilityTests/OptionsWithRawTest.EmptyInput (786 of 1935)
PASS: lldb-unit :: Process/gdb-remote/./ProcessGdbRemoteTests/GDBRemoteClientBaseTest.SendPacketAndReceiveResponseWithOutputSupport (787 of 1935)
PASS: lldb-unit :: Host/./HostTests/SocketTest.DecodeHostAndPort (788 of 1935)
PASS: lldb-api :: lang/cpp/class_static/TestStaticVariables.py (789 of 1935)
PASS: lldb-api :: functionalities/data-formatter/type_summary_list_script/TestTypeSummaryListScript.py (790 of 1935)
PASS: lldb-api :: functionalities/breakpoint/cpp/TestCPPBreakpointLocations.py (791 of 1935)
PASS: lldb-unit :: Expression/./ExpressionTests/DiagnosticManagerTest.GetStringMultipleDiags (792 of 1935)
PASS: lldb-unit :: Utility/./UtilityTests/BinaryStreamTest.PutULEB128TwoBytes (793 of 1935)
PASS: lldb-api :: commands/expression/calculator_mode/TestCalculatorMode.py (794 of 1935)
PASS: lldb-shell :: SymbolFile/NativePDB/function-types-classes.cpp (795 of 1935)
PASS: lldb-unit :: UnwindAssembly/x86/./UnwindAssemblyx86Tests/Testx86AssemblyInspectionEngine.TestSimplex86_64Augmented (796 of 1935)
PASS: lldb-api :: driver/batch_mode/TestBatchMode.py (797 of 1935)
UNSUPPORTED: lldb-shell :: Register/arm-fp-read.test (798 of 1935)
PASS: lldb-shell :: Commands/command-regex-unalias.test (799 of 1935)
PASS: lldb-shell :: Reproducer/TestReuseDirectory.test (800 of 1935)
UNSUPPORTED: lldb-shell :: ScriptInterpreter/Lua/watchpoint_callback.test (801 of 1935)
UNSUPPORTED: lldb-shell :: SymbolFile/PDB/function-level-linking.test (802 of 1935)
UNSUPPORTED: lldb-api :: functionalities/darwin_log/filter/regex/activity-chain/TestDarwinLogFilterRegexActivityChain.py (803 of 1935)
PASS: lldb-unit :: Editline/./EditlineTests/EditlineTestFixture.EditlineReceivesMultiLineText (804 of 1935)
PASS: lldb-unit :: Expression/./ExpressionTests/DiagnosticManagerTest.AppendMessageSubsequentDiags (805 of 1935)
PASS: lldb-unit :: Utility/./UtilityTests/GeneratorTest.GetOrCreate (806 of 1935)
PASS: lldb-unit :: UnwindAssembly/x86/./UnwindAssemblyx86Tests/Testx86AssemblyInspectionEngine.TestPushEAX (807 of 1935)
PASS: lldb-unit :: Utility/./UtilityTests/StreamTest.AddressEmptyPrefix (808 of 1935)
PASS: lldb-shell :: Recognizer/assert.test (809 of 1935)
PASS: lldb-api :: functionalities/thread/concurrent_events/TestConcurrentDelaySignalWatch.py (810 of 1935)
PASS: lldb-unit :: Utility/./UtilityTests/AnsiTerminal.Empty (811 of 1935)
PASS: lldb-api :: functionalities/signal/handle-abrt/TestHandleAbort.py (812 of 1935)
PASS: lldb-shell :: ObjectFile/wasm/stripped-debug-sections.yaml (813 of 1935)
PASS: lldb-api :: terminal/TestSTTYBeforeAndAfter.py (814 of 1935)
PASS: lldb-unit :: Utility/./UtilityTests/NameMatchesTest.Ignore (815 of 1935)
UNSUPPORTED: lldb-api :: commands/expression/macros/TestMacros.py (816 of 1935)
PASS: lldb-api :: functionalities/avoids-fd-leak/TestFdLeak.py (817 of 1935)
PASS: lldb-api :: api/listeners/TestListener.py (818 of 1935)
PASS: lldb-api :: functionalities/postmortem/minidump-new/TestMiniDumpUUID.py (819 of 1935)
PASS: lldb-unit :: Host/./HostTests/Host.GetEnvironment (820 of 1935)
PASS: lldb-api :: lang/cpp/symbols/TestSymbols.py (821 of 1935)
PASS: lldb-shell :: SymbolFile/DWARF/debug_line-relative_path.s (822 of 1935)
PASS: lldb-api :: commands/expression/import-std-module/shared_ptr-dbg-info-content/TestSharedPtrDbgInfoContentFromStdModule.py (823 of 1935)
PASS: lldb-api :: functionalities/data-formatter/dump_dynamic/TestDumpDynamic.py (824 of 1935)
PASS: lldb-unit :: Utility/./UtilityTests/BinaryStreamTest.PutSLEB128FiveBytes (825 of 1935)
PASS: lldb-unit :: Utility/./UtilityTests/StreamTest.AddressRangeSize (826 of 1935)
PASS: lldb-unit :: Expression/./ExpressionTests/DiagnosticManagerTest.GetStringMultiline (827 of 1935)
PASS: lldb-api :: lang/cpp/const_this/TestConstThis.py (828 of 1935)
PASS: lldb-unit :: Symbol/./SymbolTests/Type.CompilerContextPattern (829 of 1935)
PASS: lldb-unit :: ScriptInterpreter/Python/./ScriptInterpreterPythonTests/PythonDataObjectsTest.TestObjectAttributes (830 of 1935)
PASS: lldb-unit :: Utility/./UtilityTests/StringExtractorTest.GetHexU8_InvalidHex (831 of 1935)
UNSUPPORTED: lldb-shell :: Expr/TestIRMemoryMapWindows.test (832 of 1935)
PASS: lldb-shell :: SymbolFile/DWARF/debug_ranges_and_rnglists.test (833 of 1935)
PASS: lldb-api :: lang/objc/objc-static-method/TestObjCStaticMethod.py (834 of 1935)
PASS: lldb-unit :: Editline/./EditlineTests/EditlineTestFixture.EditlineReceivesSingleLineText (835 of 1935)
PASS: lldb-unit :: Utility/./UtilityTests/StringExtractorTest.DecodeHexU8_Extra (836 of 1935)
PASS: lldb-unit :: Utility/./UtilityTests/Flags.AllSet (837 of 1935)
UNSUPPORTED: lldb-api :: functionalities/asan/TestMemoryHistory.py (838 of 1935)
PASS: lldb-shell :: SymbolFile/DWARF/split-dwarf-inlining.cpp (839 of 1935)
PASS: lldb-api :: functionalities/thread/concurrent_events/TestConcurrentTwoWatchpointThreads.py (840 of 1935)
PASS: lldb-shell :: Quit/TestQuitExitCodeTooManyArgs.test (841 of 1935)
PASS: lldb-api :: commands/frame/var/TestFrameVar.py (842 of 1935)
PASS: lldb-unit :: Utility/./UtilityTests/BinaryStreamTest.PutULEB128FiveBytes (843 of 1935)
PASS: lldb-unit :: Utility/./UtilityTests/StringExtractorTest.GetHexU8_Underflow2 (844 of 1935)
PASS: lldb-shell :: Driver/LocalLLDBInit.test (845 of 1935)
PASS: lldb-unit :: Utility/./UtilityTests/StringListTest.AppendListCStringArray (846 of 1935)
PASS: lldb-api :: lang/cpp/scope/TestCppScope.py (847 of 1935)
PASS: lldb-api :: lang/cpp/accelerator-table/TestCPPAccelerator.py (848 of 1935)
PASS: lldb-shell :: ObjectFile/Breakpad/sections.test (849 of 1935)
PASS: lldb-api :: functionalities/object-file/TestImageListMultiArchitecture.py (850 of 1935)
PASS: lldb-api :: tools/lldb-server/TestLldbGdbServer.py (851 of 1935)
PASS: lldb-api :: tools/lldb-server/commandline/TestStubReverseConnect.py (852 of 1935)
PASS: lldb-api :: lang/cpp/namespace_conflicts/TestNamespaceConflicts.py (853 of 1935)
PASS: lldb-shell :: SymbolFile/DWARF/debug-line-basic.s (854 of 1935)
PASS: lldb-shell :: Quit/TestQuitExitCodeNonInt.test (855 of 1935)
PASS: lldb-unit :: Symbol/./SymbolTests/TestTypeSystemClang.TestGetEnumIntegerTypeBasicTypes (856 of 1935)
PASS: lldb-api :: commands/log/invalid-args/TestInvalidArgsLog.py (857 of 1935)
PASS: lldb-api :: macosx/version_zero/TestGetVersionZeroVersion.py (858 of 1935)
PASS: lldb-api :: functionalities/data-formatter/boolreference/TestFormattersBoolRefPtr.py (859 of 1935)
UNSUPPORTED: lldb-api :: commands/watchpoints/variable_out_of_scope/TestWatchedVarHitWhenInScope.py (860 of 1935)
PASS: lldb-unit :: UnwindAssembly/x86/./UnwindAssemblyx86Tests/Testx86AssemblyInspectionEngine.TestSimple32bitFrameFunction (861 of 1935)
PASS: lldb-unit :: Language/Highlighting/./HighlighterTests/HighlighterTest.ClangUnterminatedString (862 of 1935)
PASS: lldb-unit :: debugserver/./debugserverTests/RNBSocket.LoopBackListenIPv4 (863 of 1935)
PASS: lldb-unit :: Expression/./ExpressionTests/ClangExpressionDeclMapTest.TestPersistentDeclLookup (864 of 1935)
PASS: lldb-api :: functionalities/thread/concurrent_events/TestConcurrentWatchBreakDelay.py (865 of 1935)
PASS: lldb-api :: functionalities/data-formatter/synthcapping/TestSyntheticCapping.py (866 of 1935)
UNSUPPORTED: lldb-shell :: Register/aarch64-fp-read.test (867 of 1935)
PASS: lldb-unit :: UnwindAssembly/x86/./UnwindAssemblyx86Tests/Testx86AssemblyInspectionEngine.Test32bitFramelessSmallStackFrame (868 of 1935)
PASS: lldb-unit :: ObjectFile/Breakpad/./ObjectFileBreakpadTests/StackWinRecord.parse (869 of 1935)
PASS: lldb-unit :: Utility/./UtilityTests/VMRange.Reset (870 of 1935)
PASS: lldb-api :: python_api/sbstructureddata/TestStructuredDataAPI.py (871 of 1935)
PASS: lldb-unit :: Process/minidump/./LLDBMinidumpTests/MinidumpParserTest.GetThreadContext_x86_32 (872 of 1935)
PASS: lldb-api :: lang/objc/modules-app-update/TestClangModulesAppUpdate.py (873 of 1935)
PASS: lldb-unit :: Utility/./UtilityTests/FileSpecTest.CopyByAppendingPathComponent (874 of 1935)
PASS: lldb-shell :: SymbolFile/DWARF/DW_AT_low_pc-addrx.s (875 of 1935)
PASS: lldb-api :: lang/objc/objc-builtin-types/TestObjCBuiltinTypes.py (876 of 1935)
PASS: lldb-api :: python_api/frame/get-variables/TestGetVariables.py (877 of 1935)
PASS: lldb-unit :: Utility/./UtilityTests/StreamTest.AddressRange (878 of 1935)
PASS: lldb-unit :: Utility/./UtilityTests/BinaryStreamTest.PutULEB128SevenBytes (879 of 1935)
PASS: lldb-unit :: Utility/./UtilityTests/ArgsTest.TestTrailingBackslash (880 of 1935)
PASS: lldb-unit :: tools/lldb-server/tests/./LLDBServerTests/TestBase.DebugserverEnv (881 of 1935)
PASS: lldb-unit :: ScriptInterpreter/Python/./ScriptInterpreterPythonTests/PythonDataObjectsTest.TestPythonString (882 of 1935)
PASS: lldb-unit :: Expression/./ExpressionTests/CppModuleConfigurationTest.MissingLibCpp (883 of 1935)
PASS: lldb-unit :: Utility/./UtilityTests/ArchSpecTest.TripleComponentsWereSpecified (884 of 1935)
PASS: lldb-api :: lang/objc/modules/TestObjCModules.py (885 of 1935)
PASS: lldb-unit :: Utility/./UtilityTests/StringExtractorTest.GetU32LittleEndian (886 of 1935)
PASS: lldb-unit :: Utility/./UtilityTests/OptionsWithRawTest.WhitespaceSuffix (887 of 1935)
PASS: lldb-unit :: ScriptInterpreter/Python/./ScriptInterpreterPythonTests/PythonDataObjectsTest.TestPythonDictionaryManipulation (888 of 1935)
PASS: lldb-unit :: ObjectFile/Breakpad/./ObjectFileBreakpadTests/ModuleRecord.parse (889 of 1935)
PASS: lldb-api :: python_api/symbol-context/TestSymbolContext.py (890 of 1935)
PASS: lldb-api :: functionalities/tail_call_frames/disambiguate_call_site/TestDisambiguateCallSite.py (891 of 1935)
PASS: lldb-unit :: Process/minidump/./LLDBMinidumpTests/MinidumpParserTest.GetThreadContext_x86_64 (892 of 1935)
PASS: lldb-shell :: Expr/TestIRMemoryMap.test (893 of 1935)
PASS: lldb-unit :: Core/./LLDBCoreTests/MangledTest.ResultForBlockInvocation (894 of 1935)
PASS: lldb-api :: lang/objc/objc-dyn-sbtype/TestObjCDynamicSBType.py (895 of 1935)
PASS: lldb-unit :: Utility/./UtilityTests/StreamTest.PutMaxHex64ByteOrderBig (896 of 1935)
PASS: lldb-unit :: Utility/./UtilityTests/RangeTest.DoesIntersect (897 of 1935)
UNSUPPORTED: lldb-shell :: BuildScript/toolchain-msvc.test (898 of 1935)
UNSUPPORTED: lldb-api :: commands/gui/basic/TestGuiBasic.py (899 of 1935)
PASS: lldb-api :: lang/cpp/template-function/TestTemplateFunctions.py (900 of 1935)
PASS: lldb-shell :: SymbolFile/DWARF/dwarf5_locations.s (901 of 1935)
PASS: lldb-unit :: Utility/./UtilityTests/BinaryStreamTest.PutSLEB128EightBytes (902 of 1935)
PASS: lldb-api :: commands/expression/persistent_types/TestPersistentTypes.py (903 of 1935)
PASS: lldb-unit :: Utility/./UtilityTests/StringExtractorTest.GetNameColonValueContainsColon (904 of 1935)
PASS: lldb-unit :: Utility/./UtilityTests/StreamTest.PutHex32ByteOrderBig (905 of 1935)
PASS: lldb-unit :: ScriptInterpreter/Python/./ScriptInterpreterPythonTests/PythonDataObjectsTest.TestPythonIntegerToStructuredInteger (906 of 1935)
PASS: lldb-api :: commands/frame/diagnose/inheritance/TestDiagnoseInheritance.py (907 of 1935)
PASS: lldb-api :: macosx/function-starts/TestFunctionStarts.py (908 of 1935)
UNSUPPORTED: lldb-shell :: SymbolFile/NativePDB/ast-functions-msvc.cpp (909 of 1935)
PASS: lldb-unit :: Utility/./UtilityTests/StringLexerTest.AdvanceIf (910 of 1935)
PASS: lldb-shell :: Driver/TestSingleQuote.test (911 of 1935)
PASS: lldb-api :: functionalities/data-formatter/data-formatter-stl/libstdcpp/unique_ptr/invalid/TestDataFormatterInvalidStdUniquePtr.py (912 of 1935)
PASS: lldb-api :: functionalities/data-formatter/pyobjsynthprovider/TestPyObjSynthProvider.py (913 of 1935)
PASS: lldb-unit :: Utility/./UtilityTests/RangeTest.ContainsAddr (914 of 1935)
PASS: lldb-unit :: ScriptInterpreter/Python/./ScriptInterpreterPythonTests/PythonDataObjectsTest.TestGlobalNameResolutionWithDot (915 of 1935)
PASS: lldb-unit :: Utility/./UtilityTests/StreamTest.SetIndentLevel (916 of 1935)
PASS: lldb-api :: functionalities/breakpoint/debugbreak/TestDebugBreak.py (917 of 1935)
PASS: lldb-api :: commands/expression/regression-access-function-template-in-record/TestRegressionAccessFunctionTemplateInRecord.py (918 of 1935)
PASS: lldb-unit :: Process/gdb-remote/./ProcessGdbRemoteTests/GDBRemoteCommunicationServerTest.SendErrorResponse_UnimplementedError (919 of 1935)
PASS: lldb-unit :: Utility/./UtilityTests/StreamTest.PutBytesAsRawHex8ToMixedEndian (920 of 1935)
PASS: lldb-api :: lang/cpp/call-function/TestCallCPPFunction.py (921 of 1935)
PASS: lldb-api :: functionalities/thread/concurrent_events/TestConcurrentDelayedCrashWithBreakpointWatchpoint.py (922 of 1935)
PASS: lldb-shell :: SymbolFile/NativePDB/nested-types.cpp (923 of 1935)
PASS: lldb-api :: functionalities/data-formatter/data-formatter-caching/TestDataFormatterCaching.py (924 of 1935)
UNSUPPORTED: lldb-api :: benchmarks/libcxxlist/TestBenchmarkLibcxxList.py (925 of 1935)
PASS: lldb-unit :: Language/CPlusPlus/./LanguageCPlusPlusTests/CPlusPlusLanguage.CPlusPlusNameParser (926 of 1935)
PASS: lldb-unit :: Utility/./UtilityTests/ConstStringTest.UpdateMangledCounterpart (927 of 1935)
PASS: lldb-api :: functionalities/data-formatter/data-formatter-stl/libcxx/unordered/TestDataFormatterUnordered.py (928 of 1935)
PASS: lldb-unit :: Utility/./UtilityTests/SerializationRountripTest.SerializeDeserializeCStringArray (929 of 1935)
PASS: lldb-api :: functionalities/thread/concurrent_events/TestConcurrentSignalDelayWatch.py (930 of 1935)
PASS: lldb-shell :: ObjectFile/PECOFF/dep-modules.yaml (931 of 1935)
PASS: lldb-shell :: Settings/TestEchoCommands.test (932 of 1935)
PASS: lldb-unit :: UnwindAssembly/x86/./UnwindAssemblyx86Tests/Testx86AssemblyInspectionEngine.TestPushR14 (933 of 1935)
PASS: lldb-api :: commands/frame/diagnose/dereference-function-return/TestDiagnoseDereferenceFunctionReturn.py (934 of 1935)
PASS: lldb-api :: functionalities/inferior-assert/TestInferiorAssert.py (935 of 1935)
PASS: lldb-unit :: Expression/./ExpressionTests/DiagnosticManagerTest.PutStringMultiple (936 of 1935)
PASS: lldb-unit :: Utility/./UtilityTests/StringExtractorTest.DecodeHexU8_Underflow2 (937 of 1935)
PASS: lldb-unit :: Process/gdb-remote/./ProcessGdbRemoteTests/GDBRemoteClientBaseTest.SendContinueDelegateStructuredDataReceipt (938 of 1935)
PASS: lldb-api :: functionalities/data-formatter/data-formatter-ptr-to-array/TestPtrToArrayFormatting.py (939 of 1935)
PASS: lldb-unit :: Utility/./UtilityTests/StringListTest.ShiftStdString (940 of 1935)
UNSUPPORTED: lldb-api :: functionalities/thread/concurrent_events/TestConcurrentManySignals.py (941 of 1935)
PASS: lldb-api :: functionalities/data-formatter/setvaluefromcstring/TestSetValueFromCString.py (942 of 1935)
PASS: lldb-unit :: ObjectFile/Breakpad/./ObjectFileBreakpadTests/StackCFIRecord.parse (943 of 1935)
PASS: lldb-api :: commands/expression/call-function/TestCallBuiltinFunction.py (944 of 1935)
PASS: lldb-api :: api/multiple-targets/TestMultipleTargets.py (945 of 1935)
PASS: lldb-api :: functionalities/thread/step_out/TestThreadStepOut.py (946 of 1935)
PASS: lldb-shell :: Quit/TestQuitExitCode30.test (947 of 1935)
PASS: lldb-api :: functionalities/var_path/TestVarPath.py (948 of 1935)
PASS: lldb-api :: functionalities/data-formatter/data-formatter-objc/TestDataFormatterObjCNSContainer.py (949 of 1935)
PASS: lldb-api :: functionalities/thread/num_threads/TestNumThreads.py (950 of 1935)
PASS: lldb-unit :: Language/CPlusPlus/./LanguageCPlusPlusTests/CPlusPlusLanguage.MethodNameParsing (951 of 1935)
PASS: lldb-unit :: Process/gdb-remote/./ProcessGdbRemoteTests/GDBRemoteCommunicationClientTest.GetModulesInfo_UUID20 (952 of 1935)
PASS: lldb-api :: lang/c/vla/TestVLA.py (953 of 1935)
PASS: lldb-unit :: Utility/./UtilityTests/GeneratorTest.Get (954 of 1935)
PASS: lldb-unit :: Host/./HostTests/SocketTest.DomainGetConnectURI (955 of 1935)
PASS: lldb-unit :: Utility/./UtilityTests/OptionsWithRawTest.MultiWordSuffix (956 of 1935)
PASS: lldb-api :: functionalities/thread/exit_during_break/TestExitDuringBreak.py (957 of 1935)
PASS: lldb-shell :: SymbolFile/DWARF/dwarf5-debug_line.s (958 of 1935)
UNSUPPORTED: lldb-api :: commands/register/register/intel_xtended_registers/mpx_offset_intersection/TestMPXOffsetIntersection.py (959 of 1935)
PASS: lldb-api :: commands/platform/basic/TestPlatformPython.py (960 of 1935)
PASS: lldb-unit :: Utility/./UtilityTests/LogChannelEnabledTest.LLDB_LOG_ERROR (961 of 1935)
PASS: lldb-api :: lang/cpp/lambdas/TestLambdas.py (962 of 1935)
PASS: lldb-unit :: Utility/./UtilityTests/FileSpecTest.RemoveLastPathComponent (963 of 1935)
UNSUPPORTED: lldb-api :: functionalities/darwin_log/filter/regex/subsystem/TestDarwinLogFilterRegexSubsystem.py (964 of 1935)
UNSUPPORTED: lldb-api :: tools/lldb-server/thread-name/TestGdbRemoteThreadName.py (965 of 1935)
PASS: lldb-api :: commands/expression/import-std-module/queue/TestQueueFromStdModule.py (966 of 1935)
PASS: lldb-api :: commands/expression/no-deadlock/TestExprDoesntBlock.py (967 of 1935)
PASS: lldb-api :: functionalities/gdb_remote_client/TestGDBRemoteClient.py (968 of 1935)
PASS: lldb-api :: functionalities/data-formatter/data-formatter-proper-plurals/TestFormattersOneIsSingular.py (969 of 1935)
PASS: lldb-api :: lang/objc/single-entry-dictionary/TestObjCSingleEntryDictionary.py (970 of 1935)
PASS: lldb-shell :: ObjectFile/ELF/netbsd-core-amd64.test (971 of 1935)
UNSUPPORTED: lldb-api :: functionalities/longjmp/TestLongjmp.py (972 of 1935)
PASS: lldb-unit :: Process/minidump/./LLDBMinidumpTests/MinidumpParserTest.FindMemoryRange (973 of 1935)
PASS: lldb-unit :: Host/./HostTests/SocketTest.UDPGetConnectURI (974 of 1935)
PASS: lldb-unit :: Host/./HostTests/FileSystemTest.OpenErrno (975 of 1935)
PASS: lldb-api :: commands/platform/process/TestProcessList.py (976 of 1935)
PASS: lldb-api :: lang/objc/unicode-string/TestUnicodeString.py (977 of 1935)
PASS: lldb-api :: macosx/duplicate-archive-members/TestDuplicateMembers.py (978 of 1935)
PASS: lldb-api :: functionalities/breakpoint/breakpoint_command/TestBreakpointCommand.py (979 of 1935)
PASS: lldb-api :: commands/expression/import-std-module/basic/TestImportStdModule.py (980 of 1935)
PASS: lldb-api :: commands/process/attach/TestProcessAttach.py (981 of 1935)
PASS: lldb-api :: functionalities/gdb_remote_client/TestTargetXMLArch.py (982 of 1935)
PASS: lldb-api :: lang/c/enum_types/TestEnumTypes.py (983 of 1935)
PASS: lldb-api :: functionalities/history/TestHistoryRecall.py (984 of 1935)
PASS: lldb-api :: lang/objc/modules-hash-mismatch/TestClangModulesHashMismatch.py (985 of 1935)
PASS: lldb-unit :: Host/./HostTests/SocketTest.TCPListen0ConnectAccept (986 of 1935)
PASS: lldb-unit :: Utility/./UtilityTests/StringListTest.LongestCommonPrefixNoPrefix (987 of 1935)
PASS: lldb-shell :: SymbolFile/Breakpad/line-table.test (988 of 1935)
PASS: lldb-unit :: SymbolFile/NativePDB/./SymbolFileNativePDBTests/PDBFPOProgramToDWARFExpressionTests.UnsupportedRASearch (989 of 1935)
PASS: lldb-unit :: Utility/./UtilityTests/ConstStringTest.NullAndEmptyStates (990 of 1935)
PASS: lldb-unit :: Process/gdb-remote/./ProcessGdbRemoteTests/GDBRemoteCommunicationClientTest.GetModulesInfo (991 of 1935)
PASS: lldb-unit :: Core/./LLDBCoreTests/UniqueCStringMap.NoDefaultConstructor (992 of 1935)
PASS: lldb-unit :: ScriptInterpreter/Python/./ScriptInterpreterPythonTests/PythonDataObjectsTest.TestPythonTupleValues (993 of 1935)
PASS: lldb-unit :: Utility/./UtilityTests/RecordReplayTest.InstrumentedBarPtr (994 of 1935)
UNSUPPORTED: lldb-api :: functionalities/thread/state/TestThreadStates.py (995 of 1935)
PASS: lldb-api :: lang/objc/forward-decl/TestForwardDecl.py (996 of 1935)
UNSUPPORTED: lldb-api :: functionalities/thread/multi_break/TestMultipleBreakpoints.py (997 of 1935)
PASS: lldb-unit :: Utility/./UtilityTests/FileSpecTest.EqualDotsPosix (998 of 1935)
PASS: lldb-unit :: Utility/./UtilityTests/FileSpecTest.FormatFileSpec (999 of 1935)
UNSUPPORTED: lldb-shell :: ScriptInterpreter/Lua/persistent_state.test (1000 of 1935)
PASS: lldb-unit :: UnwindAssembly/x86/./UnwindAssemblyx86Tests/Testx86AssemblyInspectionEngine.TestPopR15 (1001 of 1935)
PASS: lldb-unit :: UnwindAssembly/x86/./UnwindAssemblyx86Tests/Testx86AssemblyInspectionEngine.TestPushEBX (1002 of 1935)
PASS: lldb-api :: functionalities/data-formatter/data-formatter-stl/libcxx/set/TestDataFormatterLibcxxSet.py (1003 of 1935)
PASS: lldb-shell :: ObjectFile/PECOFF/basic-info-arm.yaml (1004 of 1935)
PASS: lldb-api :: functionalities/data-formatter/varscript_formatting/TestDataFormatterVarScriptFormatting.py (1005 of 1935)
PASS: lldb-unit :: Utility/./UtilityTests/ProcessInstanceInfoMatch.Name (1006 of 1935)
PASS: lldb-unit :: Host/./HostTests/File.GetWaitableHandleFileno (1007 of 1935)
PASS: lldb-api :: commands/expression/radar_9673664/TestExprHelpExamples.py (1008 of 1935)
PASS: lldb-api :: functionalities/gdb_remote_client/TestPlatformClient.py (1009 of 1935)
PASS: lldb-api :: python_api/default-constructor/TestDefaultConstructorForAPIObjects.py (1010 of 1935)
UNSUPPORTED: lldb-api :: commands/watchpoints/multi_watchpoint_slots/TestWatchpointMultipleSlots.py (1011 of 1935)
PASS: lldb-api :: functionalities/backticks/TestBackticksWithoutATarget.py (1012 of 1935)
PASS: lldb-api :: commands/command/delete/TestCommandDelete.py (1013 of 1935)
PASS: lldb-shell :: Settings/TestStopCommandSourceOnError.test (1014 of 1935)
PASS: lldb-unit :: Utility/./UtilityTests/ArgsTest.AppendArguments (1015 of 1935)
UNSUPPORTED: lldb-shell :: SymbolFile/PDB/expressions.test (1016 of 1935)
PASS: lldb-api :: functionalities/signal/TestSendSignal.py (1017 of 1935)
PASS: lldb-api :: lang/c/modules/TestCModules.py (1018 of 1935)
PASS: lldb-api :: lang/objc/modules-cache/TestClangModulesCache.py (1019 of 1935)
PASS: lldb-unit :: ScriptInterpreter/Python/./ScriptInterpreterPythonTests/PythonDataObjectsTest.TestPythonTupleSize (1020 of 1935)
PASS: lldb-unit :: Symbol/./SymbolTests/TestTypeSystemClang.TestRemoveFastQualifiers (1021 of 1935)
PASS: lldb-unit :: ScriptInterpreter/Python/./ScriptInterpreterPythonTests/PythonDataObjectsTest.TestResetting (1022 of 1935)
PASS: lldb-unit :: Utility/./UtilityTests/AnsiTerminal.Basic (1023 of 1935)
UNSUPPORTED: lldb-shell :: SymbolFile/PDB/class-layout.test (1024 of 1935)
PASS: lldb-unit :: UnwindAssembly/x86/./UnwindAssemblyx86Tests/Testx86AssemblyInspectionEngine.Test32bitFramelessBigStackFrame (1025 of 1935)
PASS: lldb-api :: lang/objc/foundation/TestConstStrings.py (1026 of 1935)
PASS: lldb-unit :: Host/./HostTests/HostInfoTest.GetAugmentedArchSpec (1027 of 1935)
PASS: lldb-unit :: Host/./HostTests/MainLoopTest.TerminatesImmediately (1028 of 1935)
PASS: lldb-api :: functionalities/gdb_remote_client/TestRestartBug.py (1029 of 1935)
UNSUPPORTED: lldb-shell :: Register/x86-64-xmm16-read.test (1030 of 1935)
PASS: lldb-unit :: ScriptInterpreter/Python/./ScriptInterpreterPythonTests/PythonDataObjectsTest.TestPythonBytes (1031 of 1935)
PASS: lldb-api :: functionalities/data-formatter/data-formatter-objc/TestDataFormatterObjCNSBundle.py (1032 of 1935)
PASS: lldb-api :: tools/lldb-server/TestGdbRemoteThreadsInStopReply.py (1033 of 1935)
PASS: lldb-unit :: Utility/./UtilityTests/StringExtractorTest.DecodeHexU8_InvalidHex (1034 of 1935)
PASS: lldb-api :: commands/expression/import-std-module/list/TestListFromStdModule.py (1035 of 1935)
PASS: lldb-unit :: Utility/./UtilityTests/ConstStringTest.MangledCounterpart (1036 of 1935)
PASS: lldb-api :: lang/objc/global_ptrs/TestGlobalObjects.py (1037 of 1935)
PASS: lldb-unit :: Utility/./UtilityTests/FileSpecTest.EqualDotsPosixRoot (1038 of 1935)
PASS: lldb-shell :: ObjectFile/MachO/lc_version_min.yaml (1039 of 1935)
PASS: lldb-unit :: Expression/./ExpressionTests/DiagnosticManagerTest.GetStringNoDiags (1040 of 1935)
PASS: lldb-api :: functionalities/data-formatter/data-formatter-stl/libcxx/queue/TestDataFormatterLibcxxQueue.py (1041 of 1935)
PASS: lldb-unit :: Utility/./UtilityTests/StringExtractorTest.GetHexU8_Underflow (1042 of 1935)
PASS: lldb-unit :: Utility/./UtilityTests/StringExtractorTest.GetHexBytes_FullString (1043 of 1935)
PASS: lldb-unit :: Utility/./UtilityTests/BinaryStreamTest.PutULEB128NineBytes (1044 of 1935)
PASS: lldb-unit :: Symbol/./SymbolTests/TestTypeSystemClang.TestConvertAccessTypeToAccessSpecifier (1045 of 1935)
PASS: lldb-unit :: Utility/./UtilityTests/StringListTest.CopyListSingle (1046 of 1935)
PASS: lldb-unit :: Utility/./UtilityTests/ArgsTest.TestMultipleArgs (1047 of 1935)
PASS: lldb-api :: functionalities/thread/concurrent_events/TestConcurrentTwoBreakpointThreads.py (1048 of 1935)
PASS: lldb-unit :: Utility/./UtilityTests/RegisterValueTest.GetSet8 (1049 of 1935)
PASS: lldb-api :: commands/command/script/import/rdar-12586188/TestRdar12586188.py (1050 of 1935)
PASS: lldb-api :: lang/objc/objc-baseclass-sbtype/TestObjCBaseClassSBType.py (1051 of 1935)
PASS: lldb-unit :: Utility/./UtilityTests/CompletionRequest.TryCompleteCurrentArgGood (1052 of 1935)
PASS: lldb-unit :: Process/minidump/./LLDBMinidumpTests/MinidumpParserTest.MinidumpModuleOrder (1053 of 1935)
PASS: lldb-unit :: Utility/./UtilityTests/StringListTest.JoinMultiCharSeparator (1054 of 1935)
UNSUPPORTED: lldb-shell :: BuildScript/toolchain-clang-cl.test (1055 of 1935)
PASS: lldb-api :: functionalities/dead-strip/TestDeadStrip.py (1056 of 1935)
PASS: lldb-unit :: Utility/./UtilityTests/RegularExpression.Invalid (1057 of 1935)
PASS: lldb-unit :: Utility/./UtilityTests/StringExtractorTest.GetU64BigEndian (1058 of 1935)
PASS: lldb-api :: functionalities/data-formatter/data-formatter-stl/libcxx/list/TestDataFormatterLibcxxList.py (1059 of 1935)
PASS: lldb-unit :: Utility/./UtilityTests/StreamTest.AddressSize (1060 of 1935)
UNSUPPORTED: lldb-shell :: Minidump/Windows/arm-fp-unwind.test (1061 of 1935)
PASS: lldb-unit :: Utility/./UtilityTests/StreamTeeTest.GetStreamAtIndexOutOfBounds (1062 of 1935)
PASS: lldb-unit :: Utility/./UtilityTests/IndexToObjectTest.ObjectForIndex (1063 of 1935)
PASS: lldb-api :: functionalities/data-formatter/data-formatter-stl/libcxx/tuple/TestDataFormatterLibcxxTuple.py (1064 of 1935)
PASS: lldb-unit :: Language/Highlighting/./HighlighterTests/HighlighterTest.ClangCommas (1065 of 1935)
PASS: lldb-api :: lang/objc/modules-update/TestClangModulesUpdate.py (1066 of 1935)
PASS: lldb-api :: functionalities/breakpoint/source_regexp/TestSourceRegexBreakpoints.py (1067 of 1935)
PASS: lldb-unit :: Process/gdb-remote/./ProcessGdbRemoteTests/GDBRemoteCommunicationClientTest.SaveRestoreRegistersNoSuffix (1068 of 1935)
PASS: lldb-unit :: ScriptInterpreter/Python/./ScriptInterpreterPythonTests/PythonDataObjectsTest.TestInstanceNameResolutionNoDot (1069 of 1935)
PASS: lldb-shell :: Reproducer/TestMultipleTargets.test (1070 of 1935)
PASS: lldb-unit :: Symbol/./SymbolTests/TestTypeSystemClang.TestUnifyAccessSpecifiers (1071 of 1935)
PASS: lldb-unit :: UnwindAssembly/x86/./UnwindAssemblyx86Tests/Testx86AssemblyInspectionEngine.Testi386IgnoredRegisters (1072 of 1935)
PASS: lldb-api :: commands/expression/import-std-module/shared_ptr/TestSharedPtrFromStdModule.py (1073 of 1935)
PASS: lldb-api :: commands/expression/issue_11588/Test11588.py (1074 of 1935)
PASS: lldb-api :: functionalities/multiword-commands/TestMultiWordCommands.py (1075 of 1935)
PASS: lldb-shell :: SymbolFile/DWARF/debug_loclists-dwo.s (1076 of 1935)
PASS: lldb-unit :: Symbol/./SymbolTests/LineEntryTest.GetSameLineContiguousAddressRangeNestedInline (1077 of 1935)
PASS: lldb-api :: commands/expression/persistent_ptr_update/TestPersistentPtrUpdate.py (1078 of 1935)
PASS: lldb-api :: lang/objc/objc-new-syntax/TestObjCNewSyntaxArray.py (1079 of 1935)
PASS: lldb-api :: functionalities/breakpoint/global_constructor/TestBreakpointInGlobalConstructor.py (1080 of 1935)
PASS: lldb-api :: functionalities/unwind/sigtramp/TestSigtrampUnwind.py (1081 of 1935)
PASS: lldb-api :: lang/objc/rdar-10967107/TestRdar10967107.py (1082 of 1935)
PASS: lldb-unit :: Utility/./UtilityTests/StreamTeeTest.Write (1083 of 1935)
PASS: lldb-api :: lang/cpp/nsimport/TestCppNsImport.py (1084 of 1935)
PASS: lldb-api :: tools/lldb-server/register-reading/TestGdbRemoteGPacket.py (1085 of 1935)
PASS: lldb-shell :: SymbolFile/DWARF/find-qualified-variable.cpp (1086 of 1935)
PASS: lldb-api :: commands/expression/function_template_specialization_temp_args/TestFunctionTemplateSpecializationTempArgs.py (1087 of 1935)
PASS: lldb-unit :: Expression/./ExpressionTests/CppModuleConfigurationTest.UnrelatedLibrary (1088 of 1935)
PASS: lldb-api :: functionalities/step_scripted/TestStepScripted.py (1089 of 1935)
PASS: lldb-unit :: UnwindAssembly/x86/./UnwindAssemblyx86Tests/Testx86AssemblyInspectionEngine.TestPopR14 (1090 of 1935)
PASS: lldb-unit :: Utility/./UtilityTests/SerializationRountripTest.SerializeDeserializeObjectReference (1091 of 1935)
PASS: lldb-unit :: Utility/./UtilityTests/StatusTest.ErrorConversion (1092 of 1935)
UNSUPPORTED: lldb-shell :: SymbolFile/NativePDB/stack_unwinding01.cpp (1093 of 1935)
PASS: lldb-api :: commands/expression/timeout/TestCallWithTimeout.py (1094 of 1935)
PASS: lldb-api :: functionalities/data-formatter/array_typedef/TestArrayTypedef.py (1095 of 1935)
PASS: lldb-api :: lang/cpp/bool/TestCPPBool.py (1096 of 1935)
PASS: lldb-unit :: Utility/./UtilityTests/ArgsTest.TestSingleArg (1097 of 1935)
PASS: lldb-unit :: Host/./HostTests/SocketTest.DomainListenConnectAccept (1098 of 1935)
PASS: lldb-unit :: UnwindAssembly/x86/./UnwindAssemblyx86Tests/Testx86AssemblyInspectionEngine.TestPushRBPWithREX (1099 of 1935)
PASS: lldb-api :: commands/expression/completion-crash-incomplete-record/TestCompletionCrashIncompleteRecord.py (1100 of 1935)
PASS: lldb-unit :: Utility/./UtilityTests/RangeTest.ContainsEndInclusive (1101 of 1935)
PASS: lldb-unit :: Utility/./UtilityTests/StringListTest.InsertStringAtIndexStdString (1102 of 1935)
PASS: lldb-api :: functionalities/breakpoint/breakpoint_conditions/TestBreakpointConditions.py (1103 of 1935)
PASS: lldb-unit :: Utility/./UtilityTests/LogTest.Unregister (1104 of 1935)
PASS: lldb-unit :: Utility/./UtilityTests/StringExtractorTest.GetHexBytesAvail_Underflow (1105 of 1935)
PASS: lldb-shell :: ObjectFile/ELF/PT_TLS-overlap-PT_LOAD.yaml (1106 of 1935)
PASS: lldb-unit :: Symbol/./SymbolTests/TestClangASTImporter.DeportTypeTagDecl (1107 of 1935)
XFAIL: lldb-shell :: Register/x86-mm-xmm-write.test (1108 of 1935)
PASS: lldb-unit :: Process/gdb-remote/./ProcessGdbRemoteTests/GDBRemoteCommunicationClientTest.GetModulesInfoInvalidResponse (1109 of 1935)
PASS: lldb-shell :: Minidump/breakpad-symbols.test (1110 of 1935)
UNSUPPORTED: lldb-api :: functionalities/exec/TestExec.py (1111 of 1935)
PASS: lldb-unit :: ScriptInterpreter/Python/./ScriptInterpreterPythonTests/PythonDataObjectsTest.TestPythonInteger (1112 of 1935)
PASS: lldb-shell :: SymbolFile/DWARF/find-function-regex.cpp (1113 of 1935)
PASS: lldb-unit :: Utility/./UtilityTests/StreamTest.PutRawBytesToLittleEndian (1114 of 1935)
PASS: lldb-api :: lang/objc/modules-auto-import/TestModulesAutoImport.py (1115 of 1935)
PASS: lldb-api :: python_api/breakpoint/TestBreakpointAPI.py (1116 of 1935)
PASS: lldb-unit :: Utility/./UtilityTests/RangeTest.SizeTypes (1117 of 1935)
PASS: lldb-unit :: Utility/./UtilityTests/UriParserTest.TypicalPortPath (1118 of 1935)
PASS: lldb-shell :: SymbolFile/DWARF/dwarf5-index-is-used.cpp (1119 of 1935)
PASS: lldb-unit :: UnwindAssembly/x86/./UnwindAssemblyx86Tests/Testx86AssemblyInspectionEngine.TestSimple64bitFrameFunction (1120 of 1935)
PASS: lldb-unit :: Expression/./ExpressionTests/DWARFExpression.DW_OP_pick (1121 of 1935)
PASS: lldb-api :: tools/lldb-server/TestGdbRemoteSingleStep.py (1122 of 1935)
PASS: lldb-unit :: Host/./HostTests/FileSystemTest.Resolve (1123 of 1935)
PASS: lldb-unit :: Process/minidump/./LLDBMinidumpTests/RegisterContextMinidump.ConvertMinidumpContext_x86_64 (1124 of 1935)
PASS: lldb-api :: functionalities/signal/raise/TestRaise.py (1125 of 1935)
PASS: lldb-shell :: ObjectFile/ELF/minidebuginfo-find-symbols.yaml (1126 of 1935)
PASS: lldb-unit :: Utility/./UtilityTests/OptionsWithRawTest.UnterminatedQuote (1127 of 1935)
PASS: lldb-unit :: Utility/./UtilityTests/StringExtractorTest.GetHexU8_Exact (1128 of 1935)
UNSUPPORTED: lldb-api :: lang/objc/bitfield_ivars/TestBitfieldIvars.py (1129 of 1935)
PASS: lldb-api :: functionalities/data-formatter/compactvectors/TestCompactVectors.py (1130 of 1935)
PASS: lldb-api :: functionalities/tail_call_frames/unambiguous_sequence/TestUnambiguousTailCalls.py (1131 of 1935)
PASS: lldb-unit :: Symbol/./SymbolTests/TestClangASTImporter.ImportInvalidType (1132 of 1935)
PASS: lldb-api :: functionalities/return-value/TestReturnValue.py (1133 of 1935)
PASS: lldb-unit :: Utility/./UtilityTests/Flags.AllClear (1134 of 1935)
PASS: lldb-api :: lang/objc/objc_direct-methods/TestObjCDirectMethods.py (1135 of 1935)
PASS: lldb-api :: python_api/interpreter/TestCommandInterpreterAPI.py (1136 of 1935)
PASS: lldb-shell :: SymbolFile/DWARF/find-basic-type.cpp (1137 of 1935)
PASS: lldb-unit :: UnwindAssembly/x86/./UnwindAssemblyx86Tests/Testx86AssemblyInspectionEngine.TestSpillRegToStackViaMOVi386 (1138 of 1935)
PASS: lldb-api :: lang/objc/objc-optimized/TestObjcOptimized.py (1139 of 1935)
UNSUPPORTED: lldb-api :: functionalities/param_entry_vals/basic_entry_values_x86_64/TestBasicEntryValuesX86_64.py (1140 of 1935)
PASS: lldb-api :: commands/expression/scoped_enums/TestScopedEnumType.py (1141 of 1935)
PASS: lldb-unit :: ScriptInterpreter/Python/./ScriptInterpreterPythonTests/PythonDataObjectsTest.TestPythonStringToStructuredString (1142 of 1935)
PASS: lldb-unit :: Utility/./UtilityTests/ArchSpecTest.MergeFrom (1143 of 1935)
PASS: lldb-api :: lang/cpp/rvalue-references/TestRvalueReferences.py (1144 of 1935)
PASS: lldb-api :: tools/lldb-server/TestGdbRemoteProcessInfo.py (1145 of 1935)
PASS: lldb-shell :: ObjectFile/ELF/PT_LOAD-overlap-PT_TLS.yaml (1146 of 1935)
UNSUPPORTED: lldb-shell :: Register/x86-64-gp-write.test (1147 of 1935)
PASS: lldb-unit :: Expression/./ExpressionTests/DiagnosticManagerTest.FixedExpression (1148 of 1935)
PASS: lldb-unit :: Utility/./UtilityTests/StreamTest.PutHex64ByteOrderBig (1149 of 1935)
PASS: lldb-unit :: ScriptInterpreter/Python/./ScriptInterpreterPythonTests/PythonDataObjectsTest.TestPythonBoolean (1150 of 1935)
PASS: lldb-unit :: Process/gdb-remote/./ProcessGdbRemoteTests/GDBRemoteCommunicationClientTest.GetMemoryRegionInfoInvalidResponse (1151 of 1935)
PASS: lldb-unit :: Utility/./UtilityTests/BinaryStreamTest.PutSLEB128Zero (1152 of 1935)
PASS: lldb-api :: functionalities/memory/find/TestMemoryFind.py (1153 of 1935)
PASS: lldb-api :: commands/watchpoints/hello_watchpoint/TestMyFirstWatchpoint.py (1154 of 1935)
PASS: lldb-api :: commands/expression/import-std-module/forward_list-dbg-info-content/TestDbgInfoContentForwardListFromStdModule.py (1155 of 1935)
PASS: lldb-api :: functionalities/breakpoint/breakpoint_language/TestBreakpointLanguage.py (1156 of 1935)
PASS: lldb-unit :: Utility/./UtilityTests/DataExtractorTest.GetCStrUnterminated (1157 of 1935)
UNSUPPORTED: lldb-api :: iohandler/unicode/TestUnicode.py (1158 of 1935)
PASS: lldb-unit :: Utility/./UtilityTests/UriParserTest.Empty (1159 of 1935)
PASS: lldb-api :: functionalities/thread/concurrent_events/TestConcurrentWatchpointWithDelayWatchpointThreads.py (1160 of 1935)
PASS: lldb-unit :: Utility/./UtilityTests/SharedCluster.ClusterManager (1161 of 1935)
PASS: lldb-unit :: Utility/./UtilityTests/StringListTest.PopBack (1162 of 1935)
PASS: lldb-unit :: Utility/./UtilityTests/StringLexerTest.Next (1163 of 1935)
PASS: lldb-api :: lang/c/struct_types/TestStructTypes.py (1164 of 1935)
PASS: lldb-shell :: Unwind/trap_frame_sym_ctx.test (1165 of 1935)
PASS: lldb-unit :: Process/minidump/./LLDBMinidumpTests/MinidumpParserTest.GetLinuxProcStatus (1166 of 1935)
PASS: lldb-api :: functionalities/inferior-changed/TestInferiorChanged.py (1167 of 1935)
PASS: lldb-unit :: Utility/./UtilityTests/VMRange.CollectionContains (1168 of 1935)
PASS: lldb-unit :: Utility/./UtilityTests/LogChannelEnabledTest.log_options (1169 of 1935)
UNSUPPORTED: lldb-shell :: Register/x86-zmm-write.test (1170 of 1935)
PASS: lldb-unit :: Utility/./UtilityTests/AnsiTerminal.KnownPrefix (1171 of 1935)
PASS: lldb-unit :: Expression/./ExpressionTests/CppModuleConfigurationTest.IgnoreLibStdCpp (1172 of 1935)
PASS: lldb-shell :: SymbolFile/DWARF/deterministic-build.cpp (1173 of 1935)
UNSUPPORTED: lldb-api :: python_api/disassemble-raw-data/TestDisassemble_VST1_64.py (1174 of 1935)
PASS: lldb-api :: commands/command/history/TestCommandHistory.py (1175 of 1935)
PASS: lldb-api :: functionalities/breakpoint/require_hw_breakpoints/TestRequireHWBreakpoints.py (1176 of 1935)
PASS: lldb-unit :: Utility/./UtilityTests/UriParserTest.MinimalPort (1177 of 1935)
UNSUPPORTED: lldb-api :: benchmarks/turnaround/TestCompileRunToBreakpointTurnaround.py (1178 of 1935)
PASS: lldb-api :: arm/emulation/TestEmulations.py (1179 of 1935)
PASS: lldb-api :: lang/cpp/type_lookup/TestCppTypeLookup.py (1180 of 1935)
PASS: lldb-unit :: Utility/./UtilityTests/TildeExpressionResolver.ResolveFullPath (1181 of 1935)
PASS: lldb-shell :: Reproducer/Modules/TestModuleCXX.test (1182 of 1935)
PASS: lldb-unit :: Utility/./UtilityTests/BroadcasterTest.EventTypeHasListeners (1183 of 1935)
PASS: lldb-api :: commands/command/nested_alias/TestNestedAlias.py (1184 of 1935)
UNSUPPORTED: lldb-api :: tools/lldb-server/TestGdbRemote_vContThreads.py (1185 of 1935)
PASS: lldb-api :: python_api/module_section/TestModuleAndSection.py (1186 of 1935)
PASS: lldb-unit :: Utility/./UtilityTests/LogChannelEnabledTest.LogGetLogThread (1187 of 1935)
PASS: lldb-api :: lang/objc/objc-stepping/TestObjCStepping.py (1188 of 1935)
PASS: lldb-api :: lang/cpp/virtual-functions/TestCppVirtualFunctions.py (1189 of 1935)
PASS: lldb-shell :: Breakpoint/split-dwarf-5-addrbase.test (1190 of 1935)
PASS: lldb-api :: lang/objc/self/TestObjCSelf.py (1191 of 1935)
PASS: lldb-api :: commands/expression/import-std-module/deque-dbg-info-content/TestDbgInfoContentDequeFromStdModule.py (1192 of 1935)
PASS: lldb-api :: functionalities/data-formatter/language_category_updates/TestDataFormatterLanguageCategoryUpdates.py (1193 of 1935)
PASS: lldb-unit :: Utility/./UtilityTests/StreamTeeTest.GetStreamAtIndexOutOfBoundsEmpty (1194 of 1935)
PASS: lldb-api :: commands/expression/two-files/TestObjCTypeQueryFromOtherCompileUnit.py (1195 of 1935)
PASS: lldb-unit :: UnwindAssembly/x86/./UnwindAssemblyx86Tests/Testx86AssemblyInspectionEngine.TestPushImm (1196 of 1935)
PASS: lldb-unit :: Utility/./UtilityTests/FileSpecTest.PrependPathComponent (1197 of 1935)
PASS: lldb-api :: python_api/lldbutil/iter/TestLLDBIterator.py (1198 of 1935)
PASS: lldb-unit :: Utility/./UtilityTests/VMRange.ContainsRange (1199 of 1935)
PASS: lldb-unit :: Process/gdb-remote/./ProcessGdbRemoteTests/GDBRemoteClientBaseTest.SendContinueAndInterrupt (1200 of 1935)
PASS: lldb-unit :: ScriptInterpreter/Python/./ScriptInterpreterPythonTests/PythonDataObjectsTest.TestPythonDictionaryValueEquality (1201 of 1935)
PASS: lldb-api :: functionalities/postmortem/elf-core/thread_crash/TestLinuxCoreThreads.py (1202 of 1935)
PASS: lldb-unit :: Utility/./UtilityTests/AnsiTerminal.Unknown (1203 of 1935)
PASS: lldb-api :: lang/c/strings/TestCStrings.py (1204 of 1935)
PASS: lldb-api :: functionalities/tail_call_frames/disambiguate_paths_to_common_sink/TestDisambiguatePathsToCommonSink.py (1205 of 1935)
PASS: lldb-api :: functionalities/thread/concurrent_events/TestConcurrentBreakpointsDelayedBreakpointOneWatchpoint.py (1206 of 1935)
PASS: lldb-shell :: Quit/TestQuitExitCodeHex0.test (1207 of 1935)
UNSUPPORTED: lldb-shell :: Register/aarch64-gp-read.test (1208 of 1935)
PASS: lldb-unit :: Utility/./UtilityTests/DeserializerTest.HasData (1209 of 1935)
PASS: lldb-api :: commands/expression/unwind_expression/TestUnwindExpression.py (1210 of 1935)
PASS: lldb-shell :: Process/TestEnvironment.test (1211 of 1935)
PASS: lldb-unit :: Host/./HostTests/FileActionTest.Open (1212 of 1935)
PASS: lldb-unit :: UnwindAssembly/x86/./UnwindAssemblyx86Tests/Testx86AssemblyInspectionEngine.TestPopEDI (1213 of 1935)
PASS: lldb-unit :: Process/minidump/./LLDBMinidumpTests/MinidumpParserTest.GetMemoryRegionInfo (1214 of 1935)
PASS: lldb-api :: functionalities/thread/concurrent_events/TestConcurrentWatchpointDelayWatchpointOneBreakpoint.py (1215 of 1935)
PASS: lldb-api :: functionalities/data-formatter/data-formatter-python-synth/TestDataFormatterPythonSynth.py (1216 of 1935)
PASS: lldb-api :: lang/objc/ptr_refs/TestPtrRefsObjC.py (1217 of 1935)
PASS: lldb-unit :: Process/gdb-remote/./ProcessGdbRemoteTests/GDBRemoteCommunicationTest.ReadPacket_checksum (1218 of 1935)
PASS: lldb-unit :: Utility/./UtilityTests/StreamTeeTest.Flush (1219 of 1935)
PASS: lldb-unit :: ScriptInterpreter/Python/./ScriptInterpreterPythonTests/PythonDataObjectsTest.TestPythonTupleInitializerList (1220 of 1935)
PASS: lldb-unit :: Host/./HostTests/NativeProcessProtocolTest.ReadCStringFromMemory_MaxSize (1221 of 1935)
PASS: lldb-api :: lang/c/local_types/TestUseClosestType.py (1222 of 1935)
PASS: lldb-api :: functionalities/deleted-executable/TestDeletedExecutable.py (1223 of 1935)
PASS: lldb-api :: functionalities/thread/concurrent_events/TestConcurrentCrashWithWatchpoint.py (1224 of 1935)
PASS: lldb-api :: functionalities/process_group/TestChangeProcessGroup.py (1225 of 1935)
PASS: lldb-unit :: Utility/./UtilityTests/ConstStringTest.format_provider (1226 of 1935)
UNSUPPORTED: lldb-api :: functionalities/tsan/multiple/TestTsanMultiple.py (1227 of 1935)
PASS: lldb-shell :: Reproducer/TestDriverOptions.test (1228 of 1935)
PASS: lldb-api :: functionalities/data-formatter/nssetsynth/TestNSSetSynthetic.py (1229 of 1935)
PASS: lldb-shell :: SymbolFile/NativePDB/ast-methods.cpp (1230 of 1935)
PASS: lldb-api :: functionalities/data-formatter/data-formatter-advanced/TestDataFormatterAdv.py (1231 of 1935)
PASS: lldb-unit :: Utility/./UtilityTests/RangeTest.SlideZero (1232 of 1935)
UNSUPPORTED: lldb-api :: lang/objc/objc-dynamic-value/TestObjCDynamicValue.py (1233 of 1935)
PASS: lldb-api :: functionalities/data-formatter/data-formatter-objc/nsstring/TestDataFormatterNSString.py (1234 of 1935)
PASS: lldb-unit :: Utility/./UtilityTests/ScalarTest.ExtractBitfield (1235 of 1935)
UNSUPPORTED: lldb-api :: functionalities/data-formatter/data-formatter-stl/libstdcpp/list/TestDataFormatterStdList.py (1236 of 1935)
PASS: lldb-api :: python_api/file_handle/TestFileHandle.py (1237 of 1935)
PASS: lldb-unit :: debugserver/./debugserverTests/RNBSocket.AnyListen (1238 of 1935)
PASS: lldb-shell :: Quit/TestQuitExitCode-30.test (1239 of 1935)
PASS: lldb-unit :: Expression/./ExpressionTests/DWARFExpression.DW_OP_piece (1240 of 1935)
PASS: lldb-api :: lang/cpp/exceptions/TestCPPExceptionBreakpoints.py (1241 of 1935)
PASS: lldb-api :: functionalities/data-formatter/nsdictionarysynth/TestNSDictionarySynthetic.py (1242 of 1935)
PASS: lldb-api :: functionalities/thread/concurrent_events/TestConcurrentTwoBreakpointsOneSignal.py (1243 of 1935)
PASS: lldb-unit :: Utility/./UtilityTests/StringExtractorTest.DecodeHexU8_Exact (1244 of 1935)
PASS: lldb-api :: functionalities/thread/thread_exit/TestThreadExit.py (1245 of 1935)
PASS: lldb-api :: lang/cpp/nested-class-other-compilation-unit/TestNestedClassWithParentInAnotherCU.py (1246 of 1935)
PASS: lldb-shell :: Breakpoint/dummy-target.test (1247 of 1935)
PASS: lldb-unit :: Utility/./UtilityTests/ArgsTest.TestQuotedTrailingBackslash (1248 of 1935)
PASS: lldb-unit :: Utility/./UtilityTests/StringExtractorTest.GetHexU8_Underflow_NoEof (1249 of 1935)
PASS: lldb-unit :: Expression/./ExpressionTests/CppModuleConfigurationTest.UnknownLibCppFile (1250 of 1935)
PASS: lldb-api :: commands/expression/codegen-crash-typedefdecl-not-in_declcontext/TestCodegenCrashTypedefDeclNotInDeclContext.py (1251 of 1935)
UNSUPPORTED: lldb-api :: functionalities/thread/thread_specific_break_plus_condition/TestThreadSpecificBpPlusCondition.py (1252 of 1935)
PASS: lldb-shell :: ObjectFile/Breakpad/sections-trailing-func.test (1253 of 1935)
PASS: lldb-api :: macosx/lc-note/kern-ver-str/TestKernVerStrLCNOTE.py (1254 of 1935)
UNSUPPORTED: lldb-api :: tools/lldb-server/platform-process-connect/TestPlatformProcessConnect.py (1255 of 1935)
PASS: lldb-unit :: Host/./HostTests/Host.WaitStatusFormat (1256 of 1935)
PASS: lldb-unit :: Host/./HostTests/NativeProcessProtocolTest.ReadCStringFromMemory_CrossPageBoundary (1257 of 1935)
PASS: lldb-api :: linux/builtin_trap/TestBuiltinTrap.py (1258 of 1935)
PASS: lldb-unit :: Utility/./UtilityTests/StringLexerTest.HasAtLeast (1259 of 1935)
PASS: lldb-api :: python_api/target/TestTargetAPI.py (1260 of 1935)
PASS: lldb-shell :: Reproducer/TestVersionCheck.test (1261 of 1935)
PASS: lldb-unit :: Target/./TargetTests/PathMappingListTest.RelativeTests (1262 of 1935)
PASS: lldb-unit :: Expression/./ExpressionTests/ClangExpressionDeclMapTest.TestUnknownIdentifierLookup (1263 of 1935)
PASS: lldb-api :: types/TestIntegerType.py (1264 of 1935)
PASS: lldb-shell :: Commands/CommandScriptImmediateOutput/CommandScriptImmediateOutputConsole.test (1265 of 1935)
PASS: lldb-unit :: Utility/./UtilityTests/CompletionRequest.FakeLastArg (1266 of 1935)
PASS: lldb-unit :: Host/./HostTests/SocketTest.TCPGetConnectURI (1267 of 1935)
PASS: lldb-unit :: Utility/./UtilityTests/ScalarTest.APIntConstructor (1268 of 1935)
PASS: lldb-api :: functionalities/fat_archives/TestFatArchives.py (1269 of 1935)
PASS: lldb-api :: functionalities/data-formatter/data-formatter-stl/libcxx/string/TestDataFormatterLibcxxString.py (1270 of 1935)
PASS: lldb-unit :: Utility/./UtilityTests/StringListTest.GetMaxStringLengthIncreasingSize (1271 of 1935)
PASS: lldb-unit :: UnwindAssembly/x86/./UnwindAssemblyx86Tests/Testx86AssemblyInspectionEngine.TestPopRBP (1272 of 1935)
PASS: lldb-api :: lang/cpp/enum_types/TestCPP11EnumTypes.py (1273 of 1935)
PASS: lldb-shell :: SymbolFile/NativePDB/globals-fundamental.cpp (1274 of 1935)
PASS: lldb-unit :: Utility/./UtilityTests/ScalarTest.ComparisonFloat (1275 of 1935)
PASS: lldb-unit :: Utility/./UtilityTests/StringListTest.CopyList (1276 of 1935)
PASS: lldb-api :: functionalities/tail_call_frames/cross_object/TestCrossObjectTailCalls.py (1277 of 1935)
PASS: lldb-unit :: Host/./HostTests/File.GetStreamFromDescriptor (1278 of 1935)
PASS: lldb-unit :: ScriptInterpreter/Python/./ScriptInterpreterPythonTests/PythonDataObjectsTest.TestGlobalNameResolutionNoDot (1279 of 1935)
PASS: lldb-unit :: Process/gdb-remote/./ProcessGdbRemoteTests/GDBRemoteCommunicationClientTest.SendSignalsToIgnore (1280 of 1935)
PASS: lldb-unit :: Language/Highlighting/./HighlighterTests/HighlighterTest.ClangOperators (1281 of 1935)
PASS: lldb-unit :: Utility/./UtilityTests/Flags.GetBitSize (1282 of 1935)
PASS: lldb-unit :: Utility/./UtilityTests/UriParserTest.BracketedHostnamePort (1283 of 1935)
PASS: lldb-api :: functionalities/multidebugger_commands/TestMultipleDebuggersCommands.py (1284 of 1935)
PASS: lldb-shell :: Commands/command-source.test (1285 of 1935)
PASS: lldb-api :: lang/cpp/auto/TestCPPAuto.py (1286 of 1935)
PASS: lldb-unit :: Utility/./UtilityTests/StringExtractorTest.InitEmpty (1287 of 1935)
XFAIL: lldb-shell :: Register/x86-mm-xmm-read.test (1288 of 1935)
PASS: lldb-api :: python_api/lldbutil/TestSwigVersion.py (1289 of 1935)
PASS: lldb-shell :: SymbolFile/DWARF/DW_OP_piece-smaller-than-struct.s (1290 of 1935)
PASS: lldb-shell :: Driver/TestNoUseColor.test (1291 of 1935)
PASS: lldb-shell :: Breakpoint/debug_rnglist_basic.test (1292 of 1935)
PASS: lldb-api :: lang/c/tls_globals/TestTlsGlobals.py (1293 of 1935)
PASS: lldb-api :: commands/watchpoints/watchpoint_events/TestWatchpointEvents.py (1294 of 1935)
PASS: lldb-api :: python_api/sbtype_typeclass/TestSBTypeTypeClass.py (1295 of 1935)
PASS: lldb-shell :: SymbolFile/DWARF/debug_aranges-empty-section.s (1296 of 1935)
PASS: lldb-unit :: Target/./TargetTests/ModuleCacheTest.GetAndPutUuidExists (1297 of 1935)
PASS: lldb-api :: functionalities/data-formatter/data-formatter-objc/TestDataFormatterObjCNSDate.py (1298 of 1935)
PASS: lldb-unit :: ObjectFile/PECOFF/./ObjectFilePECOFFTests/PECallFrameInfoTest.Basic_eh (1299 of 1935)
PASS: lldb-api :: commands/watchpoints/multiple_threads/TestWatchpointMultipleThreads.py (1300 of 1935)
PASS: lldb-unit :: Process/gdb-remote/./ProcessGdbRemoteTests/GDBRemoteClientBaseTest.InterruptNoResponse (1301 of 1935)
PASS: lldb-unit :: Utility/./UtilityTests/StringListTest.Join (1302 of 1935)
PASS: lldb-api :: commands/expression/persistent_types/TestNestedPersistentTypes.py (1303 of 1935)
PASS: lldb-unit :: Symbol/./SymbolTests/TestTypeSystemClang.TestGetEnumIntegerTypeInvalid (1304 of 1935)
PASS: lldb-api :: commands/expression/fixits/TestFixIts.py (1305 of 1935)
PASS: lldb-unit :: Host/./HostTests/HostInfoTest.GetHostname (1306 of 1935)
PASS: lldb-api :: commands/watchpoints/multiple_hits/TestMultipleHits.py (1307 of 1935)
PASS: lldb-api :: functionalities/data-formatter/data-formatter-objc/TestDataFormatterObjCNSURL.py (1308 of 1935)
PASS: lldb-unit :: Utility/./UtilityTests/FileSpecTest.FileAndDirectoryComponents (1309 of 1935)
PASS: lldb-unit :: Utility/./UtilityTests/BinaryStreamTest.PutSLEB128TwoBytes (1310 of 1935)
PASS: lldb-shell :: SymbolFile/DWARF/debug-types-address-ranges.s (1311 of 1935)
PASS: lldb-unit :: Utility/./UtilityTests/RegularExpression.Valid (1312 of 1935)
PASS: lldb-unit :: Utility/./UtilityTests/StreamTest.AddressPrefixAndSuffix (1313 of 1935)
PASS: lldb-api :: commands/disassemble/basic/TestFrameDisassemble.py (1314 of 1935)
PASS: lldb-unit :: Utility/./UtilityTests/ArgsTest.TestSingleQuotedArgWithSpace (1315 of 1935)
PASS: lldb-unit :: Process/minidump/./LLDBMinidumpTests/MinidumpParserTest.GetMemoryRegionInfoLinuxMaps (1316 of 1935)
PASS: lldb-unit :: Utility/./UtilityTests/UserIDResolver.GetGroupName (1317 of 1935)
UNSUPPORTED: lldb-shell :: SymbolFile/PDB/variables-locations.test (1318 of 1935)
PASS: lldb-shell :: Expr/TestMultilineExpr.test (1319 of 1935)
UNSUPPORTED: lldb-api :: arm/breakpoint-it/TestBreakpointIt.py (1320 of 1935)
PASS: lldb-api :: functionalities/data-formatter/data-formatter-stl/libcxx/initializerlist/TestInitializerList.py (1321 of 1935)
PASS: lldb-api :: python_api/class_members/TestSBTypeClassMembers.py (1322 of 1935)
PASS: lldb-api :: python_api/name_lookup/TestNameLookup.py (1323 of 1935)
PASS: lldb-unit :: Utility/./UtilityTests/FileSpecTest.Equal (1324 of 1935)
PASS: lldb-api :: lang/cpp/bitfields/TestCppBitfields.py (1325 of 1935)
PASS: lldb-api :: lang/cpp/trivial_abi/TestTrivialABI.py (1326 of 1935)
PASS: lldb-shell :: Register/x86-64-gp-read.test (1327 of 1935)
PASS: lldb-unit :: UnwindAssembly/x86/./UnwindAssemblyx86Tests/Testx86AssemblyInspectionEngine.TestDisassemblyJunkBytes (1328 of 1935)
PASS: lldb-shell :: ObjectFile/PECOFF/symbol.yaml (1329 of 1935)
PASS: lldb-api :: functionalities/data-formatter/var-in-aggregate-misuse/TestVarInAggregateMisuse.py (1330 of 1935)
PASS: lldb-shell :: SymbolFile/DWARF/compilercontext.ll (1331 of 1935)
PASS: lldb-api :: python_api/interpreter/TestRunCommandInterpreterAPI.py (1332 of 1935)
PASS: lldb-api :: api/check_public_api_headers/TestPublicAPIHeaders.py (1333 of 1935)
PASS: lldb-api :: commands/expression/import_builtin_fileid/TestImportBuiltinFileID.py (1334 of 1935)
PASS: lldb-unit :: Utility/./UtilityTests/ScalarTest.GetValue (1335 of 1935)
PASS: lldb-unit :: Symbol/./SymbolTests/TestClangASTImporter.DeportDeclTagDecl (1336 of 1935)
PASS: lldb-api :: sanity/TestModuleCacheSanity.py (1337 of 1935)
PASS: lldb-api :: python_api/value_var_update/TestValueVarUpdate.py (1338 of 1935)
PASS: lldb-api :: python_api/function_symbol/TestDisasmAPI.py (1339 of 1935)
PASS: lldb-unit :: SymbolFile/NativePDB/./SymbolFileNativePDBTests/PDBFPOProgramToDWARFExpressionTests.MultipleDependentAssignments (1340 of 1935)
PASS: lldb-unit :: Expression/./ExpressionTests/CppModuleConfigurationTest.MissingUsrInclude (1341 of 1935)
PASS: lldb-api :: lang/cpp/thread_local/TestThreadLocal.py (1342 of 1935)
PASS: lldb-api :: commands/log/basic/TestLogging.py (1343 of 1935)
PASS: lldb-shell :: ObjectFile/ELF/section-types.yaml (1344 of 1935)
UNSUPPORTED: lldb-shell :: Process/Windows/exception_access_violation.cpp (1345 of 1935)
PASS: lldb-api :: commands/expression/import-std-module/weak_ptr/TestWeakPtrFromStdModule.py (1346 of 1935)
PASS: lldb-unit :: Utility/./UtilityTests/StringExtractorTest.GetHexBytes_OddPair2 (1347 of 1935)
PASS: lldb-unit :: Core/./LLDBCoreTests/RichManglingContextTest.SwitchProvider (1348 of 1935)
PASS: lldb-unit :: ScriptInterpreter/Python/./ScriptInterpreterPythonTests/PythonDataObjectsTest.TestPythonByteArray (1349 of 1935)
UNSUPPORTED: lldb-api :: benchmarks/expression/TestExpressionCmd.py (1350 of 1935)
PASS: lldb-shell :: Quit/TestQuitExitCodeHexA.test (1351 of 1935)
PASS: lldb-api :: lang/cpp/breakpoint-commands/TestCPPBreakpointCommands.py (1352 of 1935)
PASS: lldb-unit :: Language/Highlighting/./HighlighterTests/HighlighterTest.HighlighterSelectionType (1353 of 1935)
PASS: lldb-unit :: Utility/./UtilityTests/Flags.Reset (1354 of 1935)
UNSUPPORTED: lldb-shell :: SymbolFile/PDB/typedefs.test (1355 of 1935)
PASS: lldb-unit :: Utility/./UtilityTests/FileSpecTest.GetPath (1356 of 1935)
PASS: lldb-api :: functionalities/thread/concurrent_events/TestConcurrentTwoBreakpointsOneDelaySignal.py (1357 of 1935)
PASS: lldb-api :: tools/lldb-vscode/attach/TestVSCode_attach.py (1358 of 1935)
UNSUPPORTED: lldb-shell :: Register/arm-gp-read.test (1359 of 1935)
PASS: lldb-api :: functionalities/tail_call_frames/disambiguate_tail_call_seq/TestDisambiguateTailCallSeq.py (1360 of 1935)
PASS: lldb-unit :: Host/./HostTests/TaskPoolTest.AddTask (1361 of 1935)
PASS: lldb-unit :: Process/minidump/./LLDBMinidumpTests/MinidumpParserTest.GetLinuxProcStatus_no_stream (1362 of 1935)
PASS: lldb-api :: commands/gui/invalid-args/TestInvalidArgsGui.py (1363 of 1935)
PASS: lldb-unit :: Utility/./UtilityTests/ScalarTest.GetBytes (1364 of 1935)
PASS: lldb-unit :: Utility/./UtilityTests/ArgsTest.TestAppendArg (1365 of 1935)
PASS: lldb-shell :: ObjectFile/ELF/section-types-edgecases.yaml (1366 of 1935)
PASS: lldb-api :: lang/c/blocks/TestBlocks.py (1367 of 1935)
PASS: lldb-unit :: Expression/./ExpressionTests/DiagnosticManagerTest.AppendMessageNoDiag (1368 of 1935)
PASS: lldb-api :: commands/expression/import-std-module/unique_ptr/TestUniquePtrFromStdModule.py (1369 of 1935)
PASS: lldb-shell :: Commands/command-regex-delete.test (1370 of 1935)
PASS: lldb-unit :: Language/Highlighting/./HighlighterTests/HighlighterTest.ClangCursorOutOfBounds (1371 of 1935)
PASS: lldb-unit :: Symbol/./SymbolTests/TestTypeSystemClang.TestGetBasicTypeFromName (1372 of 1935)
PASS: lldb-api :: lang/objc/objc-ivar-offsets/TestObjCIvarOffsets.py (1373 of 1935)
PASS: lldb-unit :: Language/Highlighting/./HighlighterTests/HighlighterTest.DefaultHighlighterWithCursor (1374 of 1935)
PASS: lldb-shell :: SymbolFile/DWARF/find-variable-file.cpp (1375 of 1935)
UNSUPPORTED: lldb-api :: functionalities/darwin_log/filter/regex/message/TestDarwinLogFilterRegexMessage.py (1376 of 1935)
PASS: lldb-unit :: Utility/./UtilityTests/CompletionRequest.DuplicateFiltering (1377 of 1935)
PASS: lldb-unit :: Symbol/./SymbolTests/TestClangASTImporter.CopyDeclTagDecl (1378 of 1935)
PASS: lldb-api :: lang/objc/blocks/TestObjCIvarsInBlocks.py (1379 of 1935)
PASS: lldb-api :: lang/c/anonymous/TestAnonymous.py (1380 of 1935)
PASS: lldb-unit :: Utility/./UtilityTests/ScalarTest.Equality (1381 of 1935)
PASS: lldb-unit :: Language/Highlighting/./HighlighterTests/HighlighterTest.ClangTrailingBackslashWithWhitespace (1382 of 1935)
PASS: lldb-unit :: Core/./LLDBCoreTests/RichManglingContextTest.FromCxxMethodName (1383 of 1935)
UNSUPPORTED: lldb-shell :: Register/x86-gp-write.test (1384 of 1935)
PASS: lldb-unit :: Process/minidump/./LLDBMinidumpTests/MinidumpParserTest.MinidumpDuplicateModuleMinAddress (1385 of 1935)
PASS: lldb-unit :: Utility/./UtilityTests/StringExtractorTest.GetHexU8_Extra (1386 of 1935)
PASS: lldb-unit :: Utility/./UtilityTests/RegularExpression.CopyAssignment (1387 of 1935)
PASS: lldb-unit :: ObjectFile/ELF/./ObjectFileELFTests/ObjectFileELFTest.SectionsResolveConsistently (1388 of 1935)
PASS: lldb-unit :: Host/./HostTests/MainLoopTest.Signal (1389 of 1935)
PASS: lldb-unit :: Utility/./UtilityTests/UriParserTest.MinimalPortPath (1390 of 1935)
PASS: lldb-unit :: Host/./HostTests/SocketTest.UDPConnect (1391 of 1935)
PASS: lldb-shell :: ObjectFile/ELF/netbsd-exec-8.99.30-amd64.yaml (1392 of 1935)
PASS: lldb-shell :: Unwind/eh-frame-dwarf-unwind.test (1393 of 1935)
PASS: lldb-unit :: Utility/./UtilityTests/OptionsWithRawTest.WhitespaceInput (1394 of 1935)
PASS: lldb-unit :: Utility/./UtilityTests/TimerTest.CategoryTimes2 (1395 of 1935)
PASS: lldb-unit :: Language/Highlighting/./HighlighterTests/HighlighterTest.ClangPreserveNewLine (1396 of 1935)
PASS: lldb-api :: functionalities/data-formatter/data-formatter-objc/TestDataFormatterObjCCF.py (1397 of 1935)
PASS: lldb-unit :: Utility/./UtilityTests/ScalarTest.Promotion (1398 of 1935)
PASS: lldb-unit :: Host/./HostTests/FileSystemTest.GetPermissions (1399 of 1935)
PASS: lldb-api :: api/command-return-object/TestSBCommandReturnObject.py (1400 of 1935)
PASS: lldb-shell :: Commands/command-breakpoint-col.test (1401 of 1935)
PASS: lldb-unit :: Utility/./UtilityTests/StringExtractorTest.GetHexBytes (1402 of 1935)
PASS: lldb-unit :: ObjectFile/ELF/./ObjectFileELFTests/ObjectFileELFTest.GetSymtab_NoSymEntryPointArmAddressClass (1403 of 1935)
PASS: lldb-api :: commands/expression/import-std-module/unique_ptr-dbg-info-content/TestUniquePtrDbgInfoContent.py (1404 of 1935)
PASS: lldb-api :: commands/expression/char/TestExprsChar.py (1405 of 1935)
PASS: lldb-api :: lang/objc/ivar-IMP/TestObjCiVarIMP.py (1406 of 1935)
PASS: lldb-api :: functionalities/abbreviation/TestAbbreviations.py (1407 of 1935)
PASS: lldb-unit :: Core/./LLDBCoreTests/RichManglingContextTest.Basic (1408 of 1935)
UNSUPPORTED: lldb-api :: commands/watchpoints/hello_watchlocation/TestWatchLocation.py (1409 of 1935)
PASS: lldb-api :: python_api/disassemble-raw-data/TestDisassembleRawData.py (1410 of 1935)
PASS: lldb-api :: lang/cpp/incomplete-types/TestCppIncompleteTypes.py (1411 of 1935)
PASS: lldb-unit :: Utility/./UtilityTests/ArchSpecTest.MergeFromMachOUnknown (1412 of 1935)
PASS: lldb-shell :: SymbolFile/DWARF/debug_ranges.s (1413 of 1935)
PASS: lldb-api :: commands/expression/anonymous-struct/TestCallUserAnonTypedef.py (1414 of 1935)
PASS: lldb-unit :: Utility/./UtilityTests/StringListTest.RemoveBlankLines (1415 of 1935)
UNSUPPORTED: lldb-api :: functionalities/darwin_log/source/debug/TestDarwinLogSourceDebug.py (1416 of 1935)
PASS: lldb-api :: lang/objc/conflicting-definition/TestConflictingDefinition.py (1417 of 1935)
PASS: lldb-api :: commands/expression/inline-namespace/TestInlineNamespace.py (1418 of 1935)
PASS: lldb-api :: commands/target/dump-symtab-demangle/TestDumpSymtabDemangle.py (1419 of 1935)
PASS: lldb-unit :: Utility/./UtilityTests/StringListTest.ForRange (1420 of 1935)
PASS: lldb-api :: functionalities/abbreviation/TestCommonShortSpellings.py (1421 of 1935)
UNSUPPORTED: lldb-shell :: ObjectFile/ELF/minidebuginfo-no-lzma.yaml (1422 of 1935)
PASS: lldb-api :: lang/cpp/chained-calls/TestCppChainedCalls.py (1423 of 1935)
PASS: lldb-unit :: Utility/./UtilityTests/SerializationRountripTest.SerializeDeserializeObjectPointer (1424 of 1935)
PASS: lldb-unit :: tools/lldb-server/tests/./LLDBServerTests/TestBase.LaunchModePreservesEnvironment (1425 of 1935)
PASS: lldb-api :: lang/cpp/function_refs/TestFunctionRefs.py (1426 of 1935)
PASS: lldb-unit :: UnwindAssembly/x86/./UnwindAssemblyx86Tests/Testx86AssemblyInspectionEngine.TestSpillRegToStackViaMOVx86_64 (1427 of 1935)
PASS: lldb-unit :: Utility/./UtilityTests/StreamTest.PutStringAsRawHex8 (1428 of 1935)
PASS: lldb-unit :: Utility/./UtilityTests/ArgsTest.GetQuotedCommandString (1429 of 1935)
PASS: lldb-unit :: Host/./HostTests/MainLoopTest.ReadObject (1430 of 1935)
PASS: lldb-api :: lang/cpp/wchar_t/TestCxxWCharT.py (1431 of 1935)
PASS: lldb-shell :: Reproducer/Functionalities/TestDataFormatter.test (1432 of 1935)
PASS: lldb-shell :: SymbolFile/DWARF/debug_ranges-missing-section.s (1433 of 1935)
PASS: lldb-shell :: Settings/TestDisassemblyFormat.test (1434 of 1935)
PASS: lldb-unit :: Utility/./UtilityTests/StringListTest.AppendList (1435 of 1935)
PASS: lldb-api :: functionalities/thread/concurrent_events/TestConcurrentManyBreakpoints.py (1436 of 1935)
PASS: lldb-shell :: BuildScript/toolchain-clang.test (1437 of 1935)
PASS: lldb-shell :: SymbolFile/NativePDB/s_constant.cpp (1438 of 1935)
PASS: lldb-unit :: Process/gdb-remote/./ProcessGdbRemoteTests/GDBRemoteClientBaseTest.SendContinueAndLateInterrupt (1439 of 1935)
PASS: lldb-unit :: Utility/./UtilityTests/ArgsTest.StringListConstructor (1440 of 1935)
PASS: lldb-shell :: Reproducer/TestDiscard.test (1441 of 1935)
PASS: lldb-unit :: Language/Highlighting/./HighlighterTests/HighlighterTest.HighlighterSelectionPath (1442 of 1935)
PASS: lldb-api :: commands/expression/import-std-module/sysroot/TestStdModuleSysroot.py (1443 of 1935)
PASS: lldb-unit :: Utility/./UtilityTests/OptionsWithRawTest.EmptyArgsOnlySuffix (1444 of 1935)
PASS: lldb-api :: functionalities/thread/step_until/TestStepUntil.py (1445 of 1935)
PASS: lldb-unit :: UnwindAssembly/x86/./UnwindAssemblyx86Tests/Testx86AssemblyInspectionEngine.TestSubESP (1446 of 1935)
PASS: lldb-shell :: SymbolFile/NativePDB/tag-types.cpp (1447 of 1935)
PASS: lldb-unit :: Signals/./SignalsTests/UnixSignalsTest.VersionChange (1448 of 1935)
PASS: lldb-api :: types/TestFloatTypes.py (1449 of 1935)
PASS: lldb-api :: lang/cpp/diamond/TestDiamond.py (1450 of 1935)
PASS: lldb-shell :: Quit/TestQuitExitCode0.test (1451 of 1935)
PASS: lldb-unit :: Process/minidump/./LLDBMinidumpTests/MinidumpParserTest.GetMiscInfoWindows (1452 of 1935)
PASS: lldb-api :: functionalities/breakpoint/breakpoint_by_line_and_column/TestBreakpointByLineAndColumn.py (1453 of 1935)
PASS: lldb-api :: functionalities/gdb_remote_client/TestNestedRegDefinitions.py (1454 of 1935)
PASS: lldb-unit :: Process/gdb-remote/./ProcessGdbRemoteTests/GDBRemoteCommunicationClientTest.SendStopTracePacket (1455 of 1935)
PASS: lldb-api :: tools/lldb-server/TestGdbRemoteExpeditedRegisters.py (1456 of 1935)
PASS: lldb-shell :: SymbolFile/DWARF/debug-types-line-tables.s (1457 of 1935)
PASS: lldb-api :: lang/objc/rdar-11355592/TestRdar11355592.py (1458 of 1935)
PASS: lldb-api :: functionalities/step-avoids-no-debug/TestStepNoDebug.py (1459 of 1935)
PASS: lldb-api :: functionalities/data-formatter/data-formatter-stl/libcxx/multiset/TestDataFormatterLibcxxMultiSet.py (1460 of 1935)
UNSUPPORTED: lldb-shell :: Register/x86-64-ymm16-write.test (1461 of 1935)
PASS: lldb-unit :: Utility/./UtilityTests/RecordReplayTest.InstrumentedFoo (1462 of 1935)
UNSUPPORTED: lldb-shell :: SymbolFile/NativePDB/typedefs.cpp (1463 of 1935)
UNSUPPORTED: lldb-api :: functionalities/signal/handle-segv/TestHandleSegv.py (1464 of 1935)
PASS: lldb-unit :: Utility/./UtilityTests/StringListTest.LongestCommonPrefixEmpty (1465 of 1935)
PASS: lldb-api :: functionalities/plugins/python_os_plugin/TestPythonOSPlugin.py (1466 of 1935)
PASS: lldb-unit :: ScriptInterpreter/Python/./ScriptInterpreterPythonTests/PythonDataObjectsTest.TestPythonListValueEquality (1467 of 1935)
PASS: lldb-unit :: Utility/./UtilityTests/BinaryStreamTest.PutULEB128FourBytes (1468 of 1935)
PASS: lldb-unit :: Utility/./UtilityTests/StringListTest.GetMaxStringLengthDecreasingSize (1469 of 1935)
PASS: lldb-unit :: Utility/./UtilityTests/CompletionRequest.ShiftArguments (1470 of 1935)
PASS: lldb-api :: lang/cpp/gmodules/TestWithModuleDebugging.py (1471 of 1935)
PASS: lldb-shell :: ObjectFile/ELF/PT_LOAD-overlap-section.yaml (1472 of 1935)
PASS: lldb-shell :: ObjectFile/MachO/subsections.yaml (1473 of 1935)
PASS: lldb-api :: functionalities/thread/concurrent_events/TestConcurrentBreakpointDelayBreakpointOneSignal.py (1474 of 1935)
PASS: lldb-api :: tools/lldb-server/TestGdbRemote_vCont.py (1475 of 1935)
PASS: lldb-unit :: ScriptInterpreter/Python/./ScriptInterpreterPythonTests/PythonDataObjectsTest.TestTypeNameResolutionNoDot (1476 of 1935)
PASS: lldb-unit :: Utility/./UtilityTests/StreamTest.PutRawBytesToBigEndian (1477 of 1935)
PASS: lldb-api :: commands/expression/namespace_local_var_same_name_obj_c/TestNamespaceLocalVarSameNameObjC.py (1478 of 1935)
PASS: lldb-api :: functionalities/breakpoint/auto_continue/TestBreakpointAutoContinue.py (1479 of 1935)
PASS: lldb-api :: commands/watchpoints/watchpoint_commands/command/TestWatchpointCommandLLDB.py (1480 of 1935)
PASS: lldb-shell :: ObjectFile/ELF/section-overlap.yaml (1481 of 1935)
UNSUPPORTED: lldb-api :: functionalities/process_save_core/TestProcessSaveCore.py (1482 of 1935)
UNSUPPORTED: lldb-api :: benchmarks/startup/TestStartupDelays.py (1483 of 1935)
PASS: lldb-api :: sample_test/TestSampleTest.py (1484 of 1935)
PASS: lldb-api :: functionalities/data-formatter/data-formatter-enum-format/TestDataFormatterEnumFormat.py (1485 of 1935)
PASS: lldb-api :: lang/cpp/class_types/TestClassTypesDisassembly.py (1486 of 1935)
PASS: lldb-shell :: SymbolFile/DWARF/debug-types-basic.test (1487 of 1935)
PASS: lldb-shell :: SymbolFile/DWARF/debug_rnglists-dwo.s (1488 of 1935)
PASS: lldb-api :: commands/expression/expr-in-syscall/TestExpressionInSyscall.py (1489 of 1935)
PASS: lldb-unit :: Symbol/./SymbolTests/TestClangASTImporter.MetadataPropagationIndirectImport (1490 of 1935)
PASS: lldb-api :: python_api/value/empty_class/TestValueAPIEmptyClass.py (1491 of 1935)
PASS: lldb-api :: functionalities/thread/concurrent_events/TestConcurrentDelayedCrashWithBreakpointSignal.py (1492 of 1935)
PASS: lldb-unit :: Language/Highlighting/./HighlighterTests/HighlighterTest.ClangBraces (1493 of 1935)
UNSUPPORTED: lldb-api :: functionalities/tty/TestTerminal.py (1494 of 1935)
PASS: lldb-api :: lang/cpp/global_variables/TestCPPGlobalVariables.py (1495 of 1935)
PASS: lldb-unit :: SymbolFile/DWARF/./SymbolFileDWARFTests/SymbolFileDWARFTests.TestAbbrevNullAttrValidForm (1496 of 1935)
PASS: lldb-api :: commands/expression/import-std-module/list-dbg-info-content/TestDbgInfoContentListFromStdModule.py (1497 of 1935)
UNSUPPORTED: lldb-shell :: Unwind/eh-frame-small-fde.test (1498 of 1935)
PASS: lldb-api :: commands/expression/persist_objc_pointeetype/TestPersistObjCPointeeType.py (1499 of 1935)
PASS: lldb-api :: commands/process/launch-with-shellexpand/TestLaunchWithShellExpand.py (1500 of 1935)
PASS: lldb-api :: functionalities/testid/TestTestId.py (1501 of 1935)
PASS: lldb-api :: functionalities/breakpoint/breakpoint_locations/TestBreakpointLocations.py (1502 of 1935)
PASS: lldb-api :: functionalities/tail_call_frames/thread_step_out_or_return/TestSteppingOutWithArtificialFrames.py (1503 of 1935)
PASS: lldb-unit :: Utility/./UtilityTests/StringListTest.Clear (1504 of 1935)
PASS: lldb-unit :: Utility/./UtilityTests/ArgsTest.TestArgv (1505 of 1935)
PASS: lldb-shell :: Settings/TestDisableColor.test (1506 of 1935)
PASS: lldb-unit :: Signals/./SignalsTests/UnixSignalsTest.Iteration (1507 of 1935)
PASS: lldb-api :: commands/expression/import-std-module/vector-dbg-info-content/TestDbgInfoContentVectorFromStdModule.py (1508 of 1935)
PASS: lldb-api :: functionalities/data-formatter/data-formatter-stl/libcxx/optional/TestDataFormatterLibcxxOptional.py (1509 of 1935)
UNSUPPORTED: lldb-shell :: Register/x86-zmm-read.test (1510 of 1935)
XFAIL: lldb-shell :: Register/x86-64-ymm-write.test (1511 of 1935)
PASS: lldb-api :: tools/lldb-server/inferior-crash/TestGdbRemoteSegFault.py (1512 of 1935)
PASS: lldb-api :: functionalities/breakpoint/dummy_target_breakpoints/TestBreakpointsWithNoTargets.py (1513 of 1935)
PASS: lldb-api :: python_api/watchpoint/TestSetWatchpoint.py (1514 of 1935)
PASS: lldb-unit :: Utility/./UtilityTests/AnsiTerminal.AtStart (1515 of 1935)
PASS: lldb-unit :: Utility/./UtilityTests/FileSpecTest.AppendPathComponent (1516 of 1935)
PASS: lldb-unit :: Utility/./UtilityTests/RangeDataVector.FindEntryThatContains_Overlap (1517 of 1935)
PASS: lldb-shell :: SymbolFile/DWARF/find-inline-method.s (1518 of 1935)
PASS: lldb-api :: tools/lldb-server/TestAppleSimulatorOSType.py (1519 of 1935)
PASS: lldb-unit :: Utility/./UtilityTests/OptionsWithRawTest.QuotedSuffix (1520 of 1935)
PASS: lldb-shell :: ObjectFile/MachO/lc_build_version.yaml (1521 of 1935)
PASS: lldb-api :: functionalities/memory-region/TestMemoryRegion.py (1522 of 1935)
PASS: lldb-unit :: ScriptInterpreter/Python/./ScriptInterpreterPythonTests/PythonDataObjectsTest.TestCallable (1523 of 1935)
PASS: lldb-unit :: ObjectFile/Breakpad/./ObjectFileBreakpadTests/FileRecord.parse (1524 of 1935)
PASS: lldb-shell :: Watchpoint/SetErrorCases.test (1525 of 1935)
PASS: lldb-unit :: Language/CPlusPlus/./LanguageCPlusPlusTests/CPlusPlusLanguage.FindAlternateFunctionManglings (1526 of 1935)
PASS: lldb-unit :: Utility/./UtilityTests/ArchSpecTest.TestParseMachCPUDashSubtypeTripleExtra (1527 of 1935)
PASS: lldb-unit :: Target/./TargetTests/MemoryRegionInfoTest.Formatv (1528 of 1935)
PASS: lldb-api :: functionalities/breakpoint/breakpoint_command/TestBreakpointCommandsFromPython.py (1529 of 1935)
PASS: lldb-unit :: Process/minidump/./LLDBMinidumpTests/MinidumpParserTest.GetThreadsAndGetThreadContext (1530 of 1935)
PASS: lldb-api :: types/TestDoubleTypesExpr.py (1531 of 1935)
PASS: lldb-unit :: Utility/./UtilityTests/BinaryStreamTest.PutULEB128OneByte (1532 of 1935)
PASS: lldb-unit :: ScriptInterpreter/Python/./ScriptInterpreterPythonTests/PythonDataObjectsTest.TestScript (1533 of 1935)
PASS: lldb-shell :: Driver/TestProcessAttach.test (1534 of 1935)
PASS: lldb-unit :: Utility/./UtilityTests/LogTest.Register (1535 of 1935)
UNSUPPORTED: lldb-api :: commands/expression/completion-crash-invalid-iterator/TestInvalidIteratorCompletionCrash.py (1536 of 1935)
PASS: lldb-api :: functionalities/data-formatter/typedef_array/TestTypedefArray.py (1537 of 1935)
PASS: lldb-unit :: debugserver/./debugserverTests/RNBSocket.LoopBackListenIPv6 (1538 of 1935)
PASS: lldb-shell :: Minidump/Windows/broken-unwind.test (1539 of 1935)
UNSUPPORTED: lldb-api :: macosx/macabi/TestMacABImacOSFramework.py (1540 of 1935)
PASS: lldb-api :: commands/expression/top-level/TestTopLevelExprs.py (1541 of 1935)
PASS: lldb-unit :: Utility/./UtilityTests/GeneratorTest.Create (1542 of 1935)
PASS: lldb-shell :: Reproducer/TestGDBRemoteRepro.test (1543 of 1935)
PASS: lldb-api :: tools/lldb-vscode/variables/TestVSCode_variables.py (1544 of 1935)
PASS: lldb-api :: functionalities/set-data/TestSetData.py (1545 of 1935)
PASS: lldb-api :: lang/c/global_variables/TestGlobalVariables.py (1546 of 1935)
PASS: lldb-unit :: Utility/./UtilityTests/SerializationRountripTest.SerializeDeserializeCStringNull (1547 of 1935)
PASS: lldb-api :: commands/quit/TestQuit.py (1548 of 1935)
PASS: lldb-unit :: ObjectFile/PECOFF/./ObjectFilePECOFFTests/PECallFrameInfoTest.Chained_eh (1549 of 1935)
PASS: lldb-unit :: Language/Highlighting/./HighlighterTests/HighlighterTest.ClangSquareBrackets (1550 of 1935)
PASS: lldb-unit :: Utility/./UtilityTests/OptionsWithRawTest.EmptySuffixSingleWhitespace (1551 of 1935)
PASS: lldb-api :: lang/c/find_struct_type/TestFindStructTypes.py (1552 of 1935)
PASS: lldb-unit :: Target/./TargetTests/ModuleCacheTest.GetAndPut (1553 of 1935)
PASS: lldb-unit :: debugserver/./debugserverTests/RNBSocket.LoopBackConnectIPv6 (1554 of 1935)
PASS: lldb-unit :: Utility/./UtilityTests/UUIDTest.SetFromStringRef (1555 of 1935)
PASS: lldb-unit :: Utility/./UtilityTests/RangeTest.SetRangeBase (1556 of 1935)
PASS: lldb-api :: types/TestFloatTypesExpr.py (1557 of 1935)
PASS: lldb-unit :: Utility/./UtilityTests/NameMatchesTest.RegularExpression (1558 of 1935)
PASS: lldb-api :: commands/expression/call-function/TestCallStdStringFunction.py (1559 of 1935)
PASS: lldb-unit :: Utility/./UtilityTests/StringExtractorTest.GetHexBytes_OddPair (1560 of 1935)
PASS: lldb-unit :: ScriptInterpreter/Python/./ScriptInterpreterPythonTests/PythonDataObjectsTest.TestDictionaryResolutionWithDot (1561 of 1935)
PASS: lldb-unit :: Utility/./UtilityTests/ScalarTest.Division (1562 of 1935)
PASS: lldb-unit :: Utility/./UtilityTests/CompletionRequest.TestCompletionOwnership (1563 of 1935)
PASS: lldb-shell :: SymbolFile/DWARF/clang-ast-from-dwarf-unamed-and-anon-structs.cpp (1564 of 1935)
PASS: lldb-unit :: Utility/./UtilityTests/ArgsTest.DoubleQuotedItem (1565 of 1935)
PASS: lldb-api :: tools/lldb-server/TestGdbRemote_qThreadStopInfo.py (1566 of 1935)
PASS: lldb-api :: commands/expression/test/TestExprs2.py (1567 of 1935)
PASS: lldb-unit :: Host/./HostTests/MainLoopTest.UnmonitoredSignal (1568 of 1935)
PASS: lldb-api :: commands/register/register/register_command/TestRegisters.py (1569 of 1935)
PASS: lldb-api :: functionalities/data-formatter/data-formatter-objc/cmtime/TestDataFormatterCMTime.py (1570 of 1935)
PASS: lldb-unit :: Target/./TargetTests/ExecutionContextTest.GetByteOrderProcess (1571 of 1935)
PASS: lldb-unit :: Utility/./UtilityTests/StreamTest.PutBytesAsRawHex8ToBigEndian (1572 of 1935)
PASS: lldb-api :: lang/c/unions/TestUnionMembers.py (1573 of 1935)
PASS: lldb-api :: python_api/get-value-32bit-int/TestGetValue32BitInt.py (1574 of 1935)
PASS: lldb-api :: functionalities/data-formatter/data-formatter-objc/TestDataFormatterObjCNSData.py (1575 of 1935)
PASS: lldb-unit :: SymbolFile/NativePDB/./SymbolFileNativePDBTests/PDBFPOProgramToDWARFExpressionTests.SingleAssignmentRegisterRef (1576 of 1935)
PASS: lldb-shell :: ObjectFile/PECOFF/sections.yaml (1577 of 1935)
PASS: lldb-api :: functionalities/data-formatter/hexcaps/TestDataFormatterHexCaps.py (1578 of 1935)
PASS: lldb-shell :: SymbolFile/DWARF/debug_loc.s (1579 of 1935)
PASS: lldb-unit :: Utility/./UtilityTests/SerializationRountripTest.SerializeDeserializeCString (1580 of 1935)
PASS: lldb-api :: lang/c/array_types/TestArrayTypes.py (1581 of 1935)
PASS: lldb-api :: python_api/symbol-context/two-files/TestSymbolContextTwoFiles.py (1582 of 1935)
PASS: lldb-unit :: Process/minidump/./LLDBMinidumpTests/MinidumpParserTest.GetMemoryRegionInfoFromMemory64List (1583 of 1935)
PASS: lldb-api :: functionalities/data-formatter/data-formatter-synth/TestDataFormatterSynth.py (1584 of 1935)
PASS: lldb-unit :: Utility/./UtilityTests/DataExtractorTest.GetCStr (1585 of 1935)
PASS: lldb-unit :: Utility/./UtilityTests/RecordReplayTest.InstrumentedFooSameThis (1586 of 1935)
PASS: lldb-unit :: Language/Highlighting/./HighlighterTests/HighlighterTest.Colons (1587 of 1935)
PASS: lldb-api :: commands/command/script/import/TestImport.py (1588 of 1935)
PASS: lldb-api :: macosx/order/TestOrderFile.py (1589 of 1935)
PASS: lldb-shell :: Reproducer/TestWorkingDir.test (1590 of 1935)
PASS: lldb-api :: commands/frame/diagnose/complicated-expression/TestComplicatedExpression.py (1591 of 1935)
PASS: lldb-api :: lang/c/bitfields/TestBitfields.py (1592 of 1935)
PASS: lldb-unit :: Utility/./UtilityTests/StreamTest.PutRawBytesToMixedEndian (1593 of 1935)
PASS: lldb-api :: functionalities/data-formatter/summary-string-onfail/Test-rdar-9974002.py (1594 of 1935)
PASS: lldb-shell :: ObjectFile/PECOFF/basic-info.yaml (1595 of 1935)
UNSUPPORTED: lldb-api :: functionalities/darwin_log/filter/exact_match/activity/TestDarwinLogFilterMatchActivity.py (1596 of 1935)
PASS: lldb-unit :: Core/./LLDBCoreTests/MangledTest.NameIndexes_FindFunctionSymbols (1597 of 1935)
PASS: lldb-shell :: ObjectFile/ELF/PT_LOAD-empty.yaml (1598 of 1935)
PASS: lldb-unit :: Utility/./UtilityTests/StringExtractorTest.GetHexU8_Extra_NoEof (1599 of 1935)
PASS: lldb-shell :: Commands/command-backtrace.test (1600 of 1935)
PASS: lldb-unit :: Process/minidump/./LLDBMinidumpTests/MinidumpParserTest.GetThreadContext_x86_32_wow64 (1601 of 1935)
PASS: lldb-api :: functionalities/thread/concurrent_events/TestConcurrentTwoWatchpointsOneDelayBreakpoint.py (1602 of 1935)
PASS: lldb-unit :: Language/Highlighting/./HighlighterTests/HighlighterTest.ClangIdentifiers (1603 of 1935)
PASS: lldb-unit :: Host/./HostTests/NativeProcessProtocolTest.SetBreakpointFailVerify (1604 of 1935)
PASS: lldb-unit :: Utility/./UtilityTests/ConstStringTest.CompareStringRef (1605 of 1935)
PASS: lldb-unit :: Expression/./ExpressionTests/DiagnosticManagerTest.PutStringSeverities (1606 of 1935)
PASS: lldb-api :: types/TestCharType.py (1607 of 1935)
PASS: lldb-unit :: Utility/./UtilityTests/StreamTest.PutHex32ByteOrderLittle (1608 of 1935)
PASS: lldb-shell :: Reproducer/TestSynchronous.test (1609 of 1935)
PASS: lldb-unit :: Utility/./UtilityTests/StreamTest.PutPtr (1610 of 1935)
PASS: lldb-unit :: Utility/./UtilityTests/StreamTest.PutNHex8 (1611 of 1935)
PASS: lldb-unit :: Utility/./UtilityTests/ArgsTest.ReplaceArgumentAtIndexLonger (1612 of 1935)
PASS: lldb-unit :: Utility/./UtilityTests/StreamTest.AddressNoSuffix (1613 of 1935)
PASS: lldb-unit :: Expression/./ExpressionTests/DiagnosticManagerTest.HasFixits (1614 of 1935)
PASS: lldb-unit :: Host/./HostTests/NativeProcessProtocolTest.SetBreakpointFailWrite (1615 of 1935)
PASS: lldb-shell :: ObjectFile/Breakpad/breakpad-identification.test (1616 of 1935)
PASS: lldb-api :: functionalities/thread/crash_during_step/TestCrashDuringStep.py (1617 of 1935)
PASS: lldb-api :: commands/expression/import-std-module/vector-of-vectors/TestVectorOfVectorsFromStdModule.py (1618 of 1935)
PASS: lldb-unit :: Expression/./ExpressionTests/DiagnosticManagerTest.GetStringPreserveOrder (1619 of 1935)
PASS: lldb-unit :: UnwindAssembly/x86/./UnwindAssemblyx86Tests/Testx86AssemblyInspectionEngine.TestPushR15 (1620 of 1935)
PASS: lldb-shell :: BuildScript/modes.test (1621 of 1935)
PASS: lldb-api :: tools/lldb-server/TestGdbRemoteRegisterState.py (1622 of 1935)
PASS: lldb-shell :: SymbolFile/DWARF/anon_class_w_and_wo_export_symbols.ll (1623 of 1935)
PASS: lldb-api :: functionalities/non-overlapping-index-variable-i/TestIndexVariable.py (1624 of 1935)
PASS: lldb-unit :: Utility/./UtilityTests/RangeTest.Slide (1625 of 1935)
PASS: lldb-unit :: Utility/./UtilityTests/UUIDTest.StringConverion (1626 of 1935)
PASS: lldb-unit :: Utility/./UtilityTests/BinaryStreamTest.PutSLEB128FourBytes (1627 of 1935)
PASS: lldb-unit :: Utility/./UtilityTests/SerializationRountripTest.SerializeDeserializePodReferences (1628 of 1935)
PASS: lldb-unit :: Utility/./UtilityTests/ConstStringTest.CompareConstString (1629 of 1935)
PASS: lldb-unit :: Utility/./UtilityTests/BinaryStreamTest.PutSLEB128One (1630 of 1935)
PASS: lldb-unit :: Utility/./UtilityTests/StringExtractorTest.GetHexU8_Underflow2_NoEof (1631 of 1935)
PASS: lldb-unit :: ScriptInterpreter/Python/./ScriptInterpreterPythonTests/PythonDataObjectsTest.TestBorrowedReferences (1632 of 1935)
PASS: lldb-unit :: Expression/./ExpressionTests/CppModuleConfigurationTest.Linux (1633 of 1935)
PASS: lldb-shell :: SymbolFile/DWARF/inline-function-address.ll (1634 of 1935)
PASS: lldb-shell :: Driver/TestRepl.test (1635 of 1935)
PASS: lldb-unit :: Utility/./UtilityTests/ArchSpecTest.TestParseMachCPUDashSubtypeTripleSimple (1636 of 1935)
PASS: lldb-api :: lang/cpp/operator-overload/TestOperatorOverload.py (1637 of 1935)
PASS: lldb-api :: types/TestShortTypeExpr.py (1638 of 1935)
PASS: lldb-shell :: SymbolFile/DWARF/find-variable-dwo.cpp (1639 of 1935)
PASS: lldb-api :: functionalities/data-formatter/data-formatter-stl/libcxx/variant/TestDataFormatterLibcxxVariant.py (1640 of 1935)
PASS: lldb-api :: functionalities/inferior-crashing/TestInferiorCrashing.py (1641 of 1935)
PASS: lldb-shell :: SymbolFile/Breakpad/line-table-discontinuous-file-ids.test (1642 of 1935)
PASS: lldb-unit :: Utility/./UtilityTests/DataExtractorTest.GetMaxS64 (1643 of 1935)
PASS: lldb-unit :: Utility/./UtilityTests/StringExtractorTest.GetNameColonValueSuccess (1644 of 1935)
PASS: lldb-unit :: Utility/./UtilityTests/ScalarTest.Comparison (1645 of 1935)
PASS: lldb-api :: lang/objc/foundation/TestObjCMethods.py (1646 of 1935)
PASS: lldb-api :: lang/objc/objc-new-syntax/TestObjCNewSyntaxLiteral.py (1647 of 1935)
PASS: lldb-unit :: UnwindAssembly/x86/./UnwindAssemblyx86Tests/Testx86AssemblyInspectionEngine.TestPushExtended (1648 of 1935)
PASS: lldb-unit :: Symbol/./SymbolTests/TestTypeSystemClang.TestGetEnumIntegerTypeUnexpectedType (1649 of 1935)
PASS: lldb-api :: commands/expression/call-function/TestCallStopAndContinue.py (1650 of 1935)
PASS: lldb-api :: functionalities/data-formatter/refpointer-recursion/TestDataFormatterRefPtrRecursion.py (1651 of 1935)
PASS: lldb-unit :: Utility/./UtilityTests/StreamTest.PutCStringWithStringRef (1652 of 1935)
UNSUPPORTED: lldb-api :: functionalities/data-formatter/data-formatter-stl/libstdcpp/string/TestDataFormatterStdString.py (1653 of 1935)
PASS: lldb-unit :: Expression/./ExpressionTests/DiagnosticManagerTest.PutString (1654 of 1935)
PASS: lldb-unit :: Expression/./ExpressionTests/DiagnosticManagerTest.AppendMessageAttachToLastDiag (1655 of 1935)
PASS: lldb-unit :: UnwindAssembly/x86/./UnwindAssemblyx86Tests/Testx86AssemblyInspectionEngine.TestStackRealign8BitDisp_i386 (1656 of 1935)
PASS: lldb-shell :: ScriptInterpreter/None/import_module.test (1657 of 1935)
PASS: lldb-unit :: Host/./HostTests/TaskPoolTest.TaskMap (1658 of 1935)
PASS: lldb-unit :: Utility/./UtilityTests/CompletionRequest.DuplicateFilteringWithComments (1659 of 1935)
PASS: lldb-shell :: ObjectFile/ELF/aarch64-relocations.yaml (1660 of 1935)
PASS: lldb-shell :: ObjectFile/ELF/basic-info.yaml (1661 of 1935)
PASS: lldb-unit :: ScriptInterpreter/Python/./ScriptInterpreterPythonTests/PythonDataObjectsTest.TestPythonCallableCheck (1662 of 1935)
PASS: lldb-api :: commands/command/invalid-args/TestInvalidArgsCommand.py (1663 of 1935)
PASS: lldb-api :: functionalities/thread/concurrent_events/TestConcurrentCrashWithWatchpointBreakpointSignal.py (1664 of 1935)
PASS: lldb-unit :: Process/gdb-remote/./ProcessGdbRemoteTests/GDBRemoteCommunicationServerTest.SendErrorResponse_ErrorList (1665 of 1935)
PASS: lldb-api :: commands/expression/completion/TestExprCompletion.py (1666 of 1935)
UNSUPPORTED: lldb-shell :: SymbolFile/NativePDB/local-variables.cpp (1667 of 1935)
PASS: lldb-api :: commands/command/source/TestCommandSource.py (1668 of 1935)
UNRESOLVED: lldb-api :: functionalities/gdb_remote_client/TestWasm.py (1669 of 1935)
******************** TEST 'lldb-api :: functionalities/gdb_remote_client/TestWasm.py' FAILED ********************
Script:
--
/usr/local/bin/python /Users/buildslave/jenkins/workspace/lldb-cmake-sanitized/llvm-project/lldb/test/API/dotest.py --arch x86_64 -s /Users/buildslave/jenkins/workspace/lldb-cmake-sanitized/lldb-build/lldb-test-traces -S nm -u CXXFLAGS -u CFLAGS --codesign-identity lldb_codesign --server /Users/buildslave/jenkins/workspace/lldb-cmake-sanitized/lldb-build/./bin/debugserver --arch x86_64 --build-dir /Users/buildslave/jenkins/workspace/lldb-cmake-sanitized/lldb-build/lldb-test-build.noindex -s=/Users/buildslave/jenkins/workspace/lldb-cmake-sanitized/test/logs -t --env TERM=vt100 --env LLVM_LIBS_DIR=/Users/buildslave/jenkins/workspace/lldb-cmake-sanitized/lldb-build/./lib --inferior-env ASAN_OPTIONS=detect_stack_use_after_return=1 --inferior-env DYLD_INSERT_LIBRARIES=/Users/buildslave/jenkins/workspace/lldb-cmake-sanitized/host-compiler/lib/clang/11.0.0/lib/darwin/libclang_rt.asan_osx_dynamic.dylib --build-dir /Users/buildslave/jenkins/workspace/lldb-cmake-sanitized/lldb-build/lldb-test-build.noindex --lldb-module-cache-dir /Users/buildslave/jenkins/workspace/lldb-cmake-sanitized/lldb-build/lldb-test-build.noindex/module-cache-lldb/lldb-api --clang-module-cache-dir /Users/buildslave/jenkins/workspace/lldb-cmake-sanitized/lldb-build/lldb-test-build.noindex/module-cache-clang/lldb-api --executable /Users/buildslave/jenkins/workspace/lldb-cmake-sanitized/lldb-build/./bin/lldb --compiler /Users/buildslave/jenkins/workspace/lldb-cmake-sanitized/lldb-build/./bin/clang --dsymutil /Users/buildslave/jenkins/workspace/lldb-cmake-sanitized/lldb-build/./bin/dsymutil --filecheck /Users/buildslave/jenkins/workspace/lldb-cmake-sanitized/lldb-build/./bin/FileCheck --lldb-libs-dir /Users/buildslave/jenkins/workspace/lldb-cmake-sanitized/lldb-build/./lib /Users/buildslave/jenkins/workspace/lldb-cmake-sanitized/llvm-project/lldb/test/API/functionalities/gdb_remote_client -p TestWasm.py
--
Exit Code: -6

Hide Details

Command Output (stdout): -- lldb version 11.0.99 clang revision 32e4e7196630dfe23072990ef4071df4aaa41bb6 llvm revision 32e4e7196630dfe23072990ef4071df4aaa41bb6

Hide Details

-- Command Output (stderr): -- ================================================================= ==30590==ERROR: AddressSanitizer: container-overflow on address 0x615000016184 at pc 0x000109a398e3 bp 0x7ffee6209130 sp 0x7ffee62088f8 READ of size 512 at 0x615000016184 thread T0 #0 0x109a398e2 in __asan_memcpy+0x1b2 (libclang_rt.asan_osx_dynamic.dylib:x86_64+0x418e2) #1 0x116c4edb5 in lldb_private::MemoryCache::Read(unsigned long long, void*, unsigned long, lldb_private::Status&) Memory.cpp:189 #2 0x1167a37c9 in lldb_private::Module::GetMemoryObjectFile(std::__1::shared_ptr<lldb_private::Process> const&, unsigned long long, lldb_private::Status&, unsigned long) Module.cpp:298 #3 0x116ca55cf in lldb_private::Process::ReadModuleFromMemory(lldb_private::FileSpec const&, unsigned long long, unsigned long) Process.cpp:2402 #4 0x116739a5b in lldb_private::DynamicLoader::LoadModuleAtAddress(lldb_private::FileSpec const&, unsigned long long, unsigned long long, bool) DynamicLoader.cpp:212 #5 0x1174d553a in lldb_private::process_gdb_remote::ProcessGDBRemote::LoadModuleAtAddress(lldb_private::FileSpec const&, unsigned long long, unsigned long long, bool) ProcessGDBRemote.cpp:4767 #6 0x1174d5b18 in lldb_private::process_gdb_remote::ProcessGDBRemote::LoadModules() ProcessGDBRemote.cpp:4801 #7 0x116fcc09a in lldb_private::wasm::DynamicLoaderWasmDYLD::DidAttach() DynamicLoaderWasmDYLD.cpp:63 #8 0x116caa177 in lldb_private::Process::CompleteAttach() Process.cpp:2930 #9 0x116cad2bf in lldb_private::Process::ConnectRemote(lldb_private::Stream*, llvm::StringRef) Process.cpp:3015 #10 0x11603db4e in lldb::SBTarget::ConnectRemote(lldb::SBListener&, char const*, char const*, lldb::SBError&) SBTarget.cpp:559 #11 0x11652aa11 in _wrap_SBTarget_ConnectRemote(_object*, _object*) LLDBWrapPython.cpp:52799 #12 0x10a795226 in _PyMethodDef_RawFastCallKeywords+0xeb (Python:x86_64+0x1a226) #13 0x10a7948c6 in _PyCFunction_FastCallKeywords+0x2b (Python:x86_64+0x198c6) #14 0x10a82a905 in call_function+0x1de (Python:x86_64+0xaf905) #15 0x10a8235ee in _PyEval_EvalFrameDefault+0x1b51 (Python:x86_64+0xa85ee) #16 0x10a794ca1 in function_code_fastcall+0x6f (Python:x86_64+0x19ca1) #17 0x10a82a97d in call_function+0x256 (Python:x86_64+0xaf97d) #18 0x10a8235d5 in _PyEval_EvalFrameDefault+0x1b38 (Python:x86_64+0xa85d5) #19 0x10a794ca1 in function_code_fastcall+0x6f (Python:x86_64+0x19ca1) #20 0x10a82a97d in call_function+0x256 (Python:x86_64+0xaf97d) #21 0x10a8235d5 in _PyEval_EvalFrameDefault+0x1b38 (Python:x86_64+0xa85d5) #22 0x10a794ca1 in function_code_fastcall+0x6f (Python:x86_64+0x19ca1) #23 0x10a82a97d in call_function+0x256 (Python:x86_64+0xaf97d) #24 0x10a82368c in _PyEval_EvalFrameDefault+0x1bef (Python:x86_64+0xa868c) #25 0x10a794ca1 in function_code_fastcall+0x6f (Python:x86_64+0x19ca1) #26 0x10a82a97d in call_function+0x256 (Python:x86_64+0xaf97d) #27 0x10a8235d5 in _PyEval_EvalFrameDefault+0x1b38 (Python:x86_64+0xa85d5) #28 0x10a82b2da in _PyEval_EvalCodeWithName+0x72a (Python:x86_64+0xb02da) #29 0x10a7944f4 in _PyFunction_FastCallDict+0x1b8 (Python:x86_64+0x194f4) #30 0x10a795624 in _PyObject_Call_Prepend+0x95 (Python:x86_64+0x1a624) #31 0x10a7949d4 in PyObject_Call+0x87 (Python:x86_64+0x199d4) #32 0x10a823905 in _PyEval_EvalFrameDefault+0x1e68 (Python:x86_64+0xa8905) #33 0x10a82b2da in _PyEval_EvalCodeWithName+0x72a (Python:x86_64+0xb02da) #34 0x10a7944f4 in _PyFunction_FastCallDict+0x1b8 (Python:x86_64+0x194f4) #35 0x10a795624 in _PyObject_Call_Prepend+0x95 (Python:x86_64+0x1a624) #36 0x10a7d24af in slot_tp_call+0x46 (Python:x86_64+0x574af) #37 0x10a79472c in _PyObject_FastCallKeywords+0x166 (Python:x86_64+0x1972c) #38 0x10a82a976 in call_function+0x24f (Python:x86_64+0xaf976) #39 0x10a82368c in _PyEval_EvalFrameDefault+0x1bef (Python:x86_64+0xa868c) #40 0x10a82b2da in _PyEval_EvalCodeWithName+0x72a (Python:x86_64+0xb02da) #41 0x10a79488b in _PyFunction_FastCallKeywords+0xe0 (Python:x86_64+0x1988b) #42 0x10a82a97d in call_function+0x256 (Python:x86_64+0xaf97d) #43 0x10a8235d5 in _PyEval_EvalFrameDefault+0x1b38 (Python:x86_64+0xa85d5) #44 0x10a82b2da in _PyEval_EvalCodeWithName+0x72a (Python:x86_64+0xb02da) #45 0x10a79488b in _PyFunction_FastCallKeywords+0xe0 (Python:x86_64+0x1988b) #46 0x10a82a97d in call_function+0x256 (Python:x86_64+0xaf97d) #47 0x10a8235d5 in _PyEval_EvalFrameDefault+0x1b38 (Python:x86_64+0xa85d5) #48 0x10a794ca1 in function_code_fastcall+0x6f (Python:x86_64+0x19ca1) #49 0x10a795624 in _PyObject_Call_Prepend+0x95 (Python:x86_64+0x1a624) #50 0x10a7949d4 in PyObject_Call+0x87 (Python:x86_64+0x199d4) #51 0x10a823905 in _PyEval_EvalFrameDefault+0x1e68 (Python:x86_64+0xa8905) #52 0x10a82b2da in _PyEval_EvalCodeWithName+0x72a (Python:x86_64+0xb02da) #53 0x10a7944f4 in _PyFunction_FastCallDict+0x1b8 (Python:x86_64+0x194f4) #54 0x10a795624 in _PyObject_Call_Prepend+0x95 (Python:x86_64+0x1a624) #55 0x10a7d24af in slot_tp_call+0x46 (Python:x86_64+0x574af) #56 0x10a79472c in _PyObject_FastCallKeywords+0x166 (Python:x86_64+0x1972c) #57 0x10a82a976 in call_function+0x24f (Python:x86_64+0xaf976) #58 0x10a82368c in _PyEval_EvalFrameDefault+0x1bef (Python:x86_64+0xa868c) #59 0x10a794ca1 in function_code_fastcall+0x6f (Python:x86_64+0x19ca1) #60 0x10a82a97d in call_function+0x256 (Python:x86_64+0xaf97d) #61 0x10a8235d5 in _PyEval_EvalFrameDefault+0x1b38 (Python:x86_64+0xa85d5) #62 0x10a794ca1 in function_code_fastcall+0x6f (Python:x86_64+0x19ca1) #63 0x10a82a97d in call_function+0x256 (Python:x86_64+0xaf97d) #64 0x10a8235ee in _PyEval_EvalFrameDefault+0x1b51 (Python:x86_64+0xa85ee) #65 0x10a82b2da in _PyEval_EvalCodeWithName+0x72a (Python:x86_64+0xb02da) #66 0x10a821a14 in PyEval_EvalCode+0x29 (Python:x86_64+0xa6a14) #67 0x10a8502aa in run_mod+0x35 (Python:x86_64+0xd52aa) #68 0x10a84f2c5 in PyRun_FileExFlags+0xa3 (Python:x86_64+0xd42c5) #69 0x10a84e9a4 in PyRun_SimpleFileExFlags+0x114 (Python:x86_64+0xd39a4) #70 0x10a866010 in pymain_main+0x13de (Python:x86_64+0xeb010) #71 0x10a8667b7 in _Py_UnixMain+0x67 (Python:x86_64+0xeb7b7) #72 0x7fff7a046084 in start+0x0 (libdyld.dylib:x86_64+0x17084)

Hide Details

0x615000016300 is located 0 bytes to the right of 512-byte region [0x615000016100,0x615000016300) allocated by thread T0 here: #0 0x109a4860d in wrap__Znwm+0x7d (libclang_rt.asan_osx_dynamic.dylib:x86_64+0x5060d) #1 0x116e7f220 in std::__1::vector<unsigned char, std::__1::allocator<unsigned char> >::__vallocate(unsigned long) new:253 #2 0x116e7adcf in std::__1::vector<unsigned char, std::__1::allocator<unsigned char> >::assign(unsigned long, unsigned char const&) vector:1481 #3 0x116e7ac1a in lldb_private::DataBufferHeap::DataBufferHeap(unsigned long long, unsigned char) DataBufferHeap.cpp:20 #4 0x116c4f15d in lldb_private::MemoryCache::Read(unsigned long long, void*, unsigned long, lldb_private::Status&) Memory.cpp:228 #5 0x1167a37c9 in lldb_private::Module::GetMemoryObjectFile(std::__1::shared_ptr<lldb_private::Process> const&, unsigned long long, lldb_private::Status&, unsigned long) Module.cpp:298 #6 0x116ca55cf in lldb_private::Process::ReadModuleFromMemory(lldb_private::FileSpec const&, unsigned long long, unsigned long) Process.cpp:2402 #7 0x116739a5b in lldb_private::DynamicLoader::LoadModuleAtAddress(lldb_private::FileSpec const&, unsigned long long, unsigned long long, bool) DynamicLoader.cpp:212 #8 0x1174d553a in lldb_private::process_gdb_remote::ProcessGDBRemote::LoadModuleAtAddress(lldb_private::FileSpec const&, unsigned long long, unsigned long long, bool) ProcessGDBRemote.cpp:4767 #9 0x1174d5b18 in lldb_private::process_gdb_remote::ProcessGDBRemote::LoadModules() ProcessGDBRemote.cpp:4801 #10 0x116fcc09a in lldb_private::wasm::DynamicLoaderWasmDYLD::DidAttach() DynamicLoaderWasmDYLD.cpp:63 #11 0x116caa177 in lldb_private::Process::CompleteAttach() Process.cpp:2930 #12 0x116cad2bf in lldb_private::Process::ConnectRemote(lldb_private::Stream*, llvm::StringRef) Process.cpp:3015 #13 0x11603db4e in lldb::SBTarget::ConnectRemote(lldb::SBListener&, char const*, char const*, lldb::SBError&) SBTarget.cpp:559 #14 0x11652aa11 in _wrap_SBTarget_ConnectRemote(_object*, _object*) LLDBWrapPython.cpp:52799 #15 0x10a795226 in _PyMethodDef_RawFastCallKeywords+0xeb (Python:x86_64+0x1a226) #16 0x10a7948c6 in _PyCFunction_FastCallKeywords+0x2b (Python:x86_64+0x198c6) #17 0x10a82a905 in call_function+0x1de (Python:x86_64+0xaf905) #18 0x10a8235ee in _PyEval_EvalFrameDefault+0x1b51 (Python:x86_64+0xa85ee) #19 0x10a794ca1 in function_code_fastcall+0x6f (Python:x86_64+0x19ca1) #20 0x10a82a97d in call_function+0x256 (Python:x86_64+0xaf97d) #21 0x10a8235d5 in _PyEval_EvalFrameDefault+0x1b38 (Python:x86_64+0xa85d5) #22 0x10a794ca1 in function_code_fastcall+0x6f (Python:x86_64+0x19ca1) #23 0x10a82a97d in call_function+0x256 (Python:x86_64+0xaf97d) #24 0x10a8235d5 in _PyEval_EvalFrameDefault+0x1b38 (Python:x86_64+0xa85d5) #25 0x10a794ca1 in function_code_fastcall+0x6f (Python:x86_64+0x19ca1) #26 0x10a82a97d in call_function+0x256 (Python:x86_64+0xaf97d) #27 0x10a82368c in _PyEval_EvalFrameDefault+0x1bef (Python:x86_64+0xa868c) #28 0x10a794ca1 in function_code_fastcall+0x6f (Python:x86_64+0x19ca1) #29 0x10a82a97d in call_function+0x256 (Python:x86_64+0xaf97d)

Hide Details

HINT: if you don't care about these errors you may set ASAN_OPTIONS=detect_container_overflow=0. If you suspect a false positive see also: https://github.com/google/sanitizers/wiki/AddressSanitizerContainerOverflow. SUMMARY: AddressSanitizer: container-overflow (libclang_rt.asan_osx_dynamic.dylib:x86_64+0x418e2) in __asan_memcpy+0x1b2 Shadow bytes around the buggy address: 0x1c2a00002be0: 00 00 00 00 00 00 00 00 00 00 00 00 00 00 00 00 0x1c2a00002bf0: 00 00 00 00 00 00 00 00 00 00 00 00 00 00 00 00 0x1c2a00002c00: 00 00 00 00 00 00 00 00 00 00 00 00 00 00 00 00 0x1c2a00002c10: fa fa fa fa fa fa fa fa fa fa fa fa fa fa fa fa 0x1c2a00002c20: 00 00 00 00 00 00 00 00 00 00 00 00 00 00 00 00 =>0x1c2a00002c30:[04]fc fc fc fc fc fc fc fc fc fc fc fc fc fc fc 0x1c2a00002c40: fc fc fc fc fc fc fc fc fc fc fc fc fc fc fc fc 0x1c2a00002c50: fc fc fc fc fc fc fc fc fc fc fc fc fc fc fc fc 0x1c2a00002c60: fa fa fa fa fa fa fa fa fa fa fa fa fa fa fa fa 0x1c2a00002c70: fd fd fd fd fd fd fd fd fd fd fd fd fd fd fd fd 0x1c2a00002c80: fd fd fd fd fd fd fd fd fd fd fd fd fd fd fd fd Shadow byte legend (one shadow byte represents 8 application bytes): Addressable: 00 Partially addressable: 01 02 03 04 05 06 07 Heap left redzone: fa Freed heap region: fd Stack left redzone: f1 Stack mid redzone: f2 Stack right redzone: f3 Stack after return: f5 Stack use after scope: f8 Global redzone: f9 Global init order: f6 Poisoned by user: f7 Container overflow: fc Array cookie: ac Intra object redzone: bb ASan internal: fe Left alloca redzone: ca Right alloca redzone: cb Shadow gap: cc ==30590==ABORTING

Hide Details

--

Hide Details

******************** PASS: lldb-unit :: Symbol/./SymbolTests/PostfixExpression.ParseOneExpression (1670 of 1935) PASS: lldb-shell :: ScriptInterpreter/Python/crashlog.test (1671 of 1935) PASS: lldb-api :: api/log/TestAPILog.py (1672 of 1935) PASS: lldb-api :: functionalities/tail_call_frames/ambiguous_tail_call_seq2/TestAmbiguousTailCallSeq2.py (1673 of 1935) PASS: lldb-unit :: UnwindAssembly/x86/./UnwindAssemblyx86Tests/Testx86AssemblyInspectionEngine.Test64bitFramelessSmallStackFrame (1674 of 1935) PASS: lldb-unit :: Utility/./UtilityTests/RegularExpression.Empty (1675 of 1935) PASS: lldb-unit :: Utility/./UtilityTests/StringExtractorTest.DecodeHexU8_InvalidHex2 (1676 of 1935) PASS: lldb-shell :: Minidump/no-process-id.yaml (1677 of 1935) PASS: lldb-api :: lang/c/step-target/TestStepTarget.py (1678 of 1935) PASS: lldb-unit :: Utility/./UtilityTests/TimerTest.CategoryTimesStats (1679 of 1935) PASS: lldb-unit :: Target/./TargetTests/ExecutionContextTest.GetByteOrder (1680 of 1935) PASS: lldb-api :: functionalities/breakpoint/cpp_exception/TestCPPExceptionBreakpoint.py (1681 of 1935) PASS: lldb-unit :: Utility/./UtilityTests/StreamTest.PutCharNull (1682 of 1935) PASS: lldb-api :: lang/cpp/template/TestTemplateArgs.py (1683 of 1935) PASS: lldb-shell :: BuildScript/compiler-full-path.test (1684 of 1935) PASS: lldb-unit :: Utility/./UtilityTests/StreamTeeTest.AppendStream (1685 of 1935) PASS: lldb-unit :: Utility/./UtilityTests/ArgsTest.ReplaceArgumentAtIndexShort (1686 of 1935) PASS: lldb-unit :: Utility/./UtilityTests/ScalarTest.CastOperations (1687 of 1935) PASS: lldb-api :: functionalities/value_md5_crash/TestValueMD5Crash.py (1688 of 1935) PASS: lldb-api :: api/multithreaded/TestMultithreaded.py (1689 of 1935) PASS: lldb-api :: functionalities/completion/TestCompletion.py (1690 of 1935) PASS: lldb-unit :: Process/gdb-remote/./ProcessGdbRemoteTests/GDBRemoteCommunicationClientTest.SendGetTraceConfigPacket (1691 of 1935) PASS: lldb-unit :: Process/minidump/./LLDBMinidumpTests/MinidumpParserTest.GetMemoryRegionInfoFromMemoryList (1692 of 1935) PASS: lldb-api :: lang/cpp/dynamic-value-same-basename/TestDynamicValueSameBase.py (1693 of 1935) PASS: lldb-shell :: ObjectFile/PECOFF/sections-names.yaml (1694 of 1935) PASS: lldb-unit :: Process/minidump/./LLDBMinidumpTests/MinidumpParserTest.GetMemory (1695 of 1935) PASS: lldb-api :: commands/settings/TestSettings.py (1696 of 1935) PASS: lldb-api :: commands/expression/context-object-objc/TestContextObjectObjc.py (1697 of 1935) PASS: lldb-api :: functionalities/plugins/command_plugin/TestPluginCommands.py (1698 of 1935) PASS: lldb-api :: commands/platform/basic/TestPlatformCommand.py (1699 of 1935) PASS: lldb-unit :: Utility/./UtilityTests/RangeTest.Clear (1700 of 1935) PASS: lldb-unit :: Utility/./UtilityTests/LogChannelTest.List (1701 of 1935) PASS: lldb-api :: lang/cpp/inlines/TestInlines.py (1702 of 1935) PASS: lldb-shell :: SymbolFile/DWARF/dir-separator-windows.s (1703 of 1935) PASS: lldb-api :: commands/expression/diagnostics/TestExprDiagnostics.py (1704 of 1935) PASS: lldb-shell :: ObjectFile/ELF/short-build-id.yaml (1705 of 1935) PASS: lldb-unit :: ScriptInterpreter/Python/./ScriptInterpreterPythonTests/PythonDataObjectsTest.TestPythonStringToStr (1706 of 1935) PASS: lldb-api :: functionalities/breakpoint/breakpoint_ids/TestBreakpointIDs.py (1707 of 1935) PASS: lldb-unit :: Utility/./UtilityTests/StringListTest.AppendStringCString (1708 of 1935) PASS: lldb-unit :: UnwindAssembly/x86/./UnwindAssemblyx86Tests/Testx86AssemblyInspectionEngine.TestPushR13 (1709 of 1935) PASS: lldb-unit :: Utility/./UtilityTests/StreamTest.QuotedCString (1710 of 1935) PASS: lldb-unit :: Symbol/./SymbolTests/TestTypeSystemClang.TestDeletingImplicitCopyCstrDueToMoveCStr (1711 of 1935) PASS: lldb-unit :: Utility/./UtilityTests/SubsystemRAIITest.SubsystemWithErrorSuccess (1712 of 1935) PASS: lldb-api :: commands/process/launch/TestProcessLaunch.py (1713 of 1935) PASS: lldb-unit :: debugserver/./debugserverTests/JSON.Parse (1714 of 1935) PASS: lldb-unit :: Utility/./UtilityTests/UriParserTest.BracketedHostnameWithColon (1715 of 1935) PASS: lldb-api :: commands/expression/test/TestExprs.py (1716 of 1935) PASS: lldb-api :: python_api/thread/TestThreadAPI.py (1717 of 1935) PASS: lldb-shell :: Settings/TestSettingsWrite.test (1718 of 1935) PASS: lldb-unit :: Utility/./UtilityTests/BinaryStreamTest.PutULEB128Zero (1719 of 1935) PASS: lldb-api :: lang/cpp/unsigned_types/TestUnsignedTypes.py (1720 of 1935) PASS: lldb-unit :: Process/minidump/./LLDBMinidumpTests/MinidumpParserTest.GetArchitecture (1721 of 1935) PASS: lldb-unit :: UnwindAssembly/x86/./UnwindAssemblyx86Tests/Testx86AssemblyInspectionEngine.TestStackRealignMSVC_i386 (1722 of 1935) PASS: lldb-unit :: Utility/./UtilityTests/UriParserTest.PortOverflow (1723 of 1935) PASS: lldb-api :: functionalities/target-new-solib-notifications/TestModuleLoadedNotifys.py (1724 of 1935) UNSUPPORTED: lldb-shell :: SymbolFile/PDB/ast-restore.test (1725 of 1935) PASS: lldb-api :: lang/objc/objc-ivar-protocols/TestIvarProtocols.py (1726 of 1935) UNSUPPORTED: lldb-shell :: ExecControl/StopHook/stop-hook-threads.test (1727 of 1935) PASS: lldb-unit :: SymbolFile/NativePDB/./SymbolFileNativePDBTests/PDBFPOProgramToDWARFExpressionTests.UnresolvedRegisterAssignmentReference (1728 of 1935) PASS: lldb-api :: lang/objc/foundation/TestSymbolTable.py (1729 of 1935) PASS: lldb-api :: tools/lldb-server/commandline/TestStubSetSID.py (1730 of 1935) PASS: lldb-api :: macosx/thread_suspend/TestInternalThreadSuspension.py (1731 of 1935) PASS: lldb-unit :: SymbolFile/NativePDB/./SymbolFileNativePDBTests/PDBFPOProgramToDWARFExpressionTests.DependencyChain (1732 of 1935) PASS: lldb-unit :: Utility/./UtilityTests/BinaryStreamTest.PutSLEB128OneByte (1733 of 1935) PASS: lldb-api :: lang/objc/objc-property/TestObjCProperty.py (1734 of 1935) PASS: lldb-api :: commands/expression/pr35310/TestExprsBug35310.py (1735 of 1935) PASS: lldb-unit :: Utility/./UtilityTests/ArchSpecTest.Compatibility (1736 of 1935) PASS: lldb-shell :: SymbolFile/DWARF/debug-types-dwarf5.s (1737 of 1935) UNSUPPORTED: lldb-api :: tools/lldb-server/libraries-svr4/TestGdbRemoteLibrariesSvr4Support.py (1738 of 1935) PASS: lldb-api :: lang/objc/orderedset/TestOrderedSet.py (1739 of 1935) PASS: lldb-unit :: Symbol/./SymbolTests/TestClangASTImporter.CopyTypeTagDecl (1740 of 1935) PASS: lldb-shell :: SymbolFile/DWARF/apple-index-is-used.cpp (1741 of 1935) PASS: lldb-unit :: Process/gdb-remote/./ProcessGdbRemoteTests/GDBRemoteClientBaseTest.SendContinueAndAsyncPacket (1742 of 1935) PASS: lldb-api :: functionalities/data-formatter/frameformat_smallstruct/TestFrameFormatSmallStruct.py (1743 of 1935) PASS: lldb-api :: commands/expression/ir-interpreter-phi-nodes/TestIRInterpreterPHINodes.py (1744 of 1935) PASS: lldb-api :: lang/cpp/signed_types/TestSignedTypes.py (1745 of 1935) PASS: lldb-api :: functionalities/source-map/TestTargetSourceMap.py (1746 of 1935) PASS: lldb-unit :: Utility/./UtilityTests/ProcessInstanceInfo.DumpTable (1747 of 1935) PASS: lldb-unit :: Utility/./UtilityTests/VMRange.ContainsAddr (1748 of 1935) PASS: lldb-unit :: Utility/./UtilityTests/SerializationRountripTest.SerializeDeserializePodPointers (1749 of 1935) PASS: lldb-unit :: Utility/./UtilityTests/SubsystemRAIITest.SubsystemWithErrorFailure (1750 of 1935) PASS: lldb-unit :: Language/Highlighting/./HighlighterTests/HighlighterTest.ClangPPDirectives (1751 of 1935) PASS: lldb-api :: functionalities/gdb_remote_client/TestRecognizeBreakpoint.py (1752 of 1935) PASS: lldb-unit :: Host/./HostTests/FileSystemTest.GetByteSize (1753 of 1935) PASS: lldb-unit :: Utility/./UtilityTests/StringListTest.LongestCommonPrefixSingleElement (1754 of 1935) PASS: lldb-unit :: UnwindAssembly/x86/./UnwindAssemblyx86Tests/Testx86AssemblyInspectionEngine.TestCALLNextInsn (1755 of 1935) PASS: lldb-unit :: Utility/./UtilityTests/StreamTeeTest.SetStreamAtIndexOutOfBounds (1756 of 1935) PASS: lldb-api :: functionalities/thread/concurrent_events/TestConcurrentSignalNWatchNBreak.py (1757 of 1935) PASS: lldb-unit :: Utility/./UtilityTests/DataExtractorTest.GetMaxU64 (1758 of 1935) PASS: lldb-shell :: SymbolFile/NativePDB/global-classes.cpp (1759 of 1935) UNSUPPORTED: lldb-api :: benchmarks/frame_variable/TestFrameVariableResponse.py (1760 of 1935) PASS: lldb-api :: tools/lldb-vscode/breakpoint/TestVSCode_setExceptionBreakpoints.py (1761 of 1935) PASS: lldb-api :: functionalities/data-formatter/type_summary_list_arg/TestTypeSummaryListArg.py (1762 of 1935) PASS: lldb-unit :: Language/Highlighting/./HighlighterTests/HighlighterTest.FallbackHighlighter (1763 of 1935) PASS: lldb-unit :: UnwindAssembly/x86/./UnwindAssemblyx86Tests/Testx86AssemblyInspectionEngine.TestSubRSP (1764 of 1935) PASS: lldb-api :: functionalities/data-formatter/data-formatter-synthval/TestDataFormatterSynthVal.py (1765 of 1935) PASS: lldb-api :: functionalities/thread/concurrent_events/TestConcurrentBreakpointOneDelayBreakpointThreads.py (1766 of 1935) PASS: lldb-api :: python_api/formatters/TestFormattersSBAPI.py (1767 of 1935) PASS: lldb-shell :: ObjectFile/ELF/base-address.yaml (1768 of 1935) PASS: lldb-unit :: Utility/./UtilityTests/Flags.IsClear (1769 of 1935) PASS: lldb-unit :: Process/minidump/./LLDBMinidumpTests/MinidumpParserTest.GetPidWindows (1770 of 1935) UNSUPPORTED: lldb-shell :: ScriptInterpreter/Lua/nested_sessions.test (1771 of 1935) PASS: lldb-unit :: Utility/./UtilityTests/StreamTeeTest.Assignment (1772 of 1935) PASS: lldb-unit :: Process/gdb-remote/./ProcessGdbRemoteTests/GDBRemoteClientBaseTest.SendContinueAndAsyncSignal (1773 of 1935) UNSUPPORTED: lldb-shell :: ScriptInterpreter/Lua/bindings.test (1774 of 1935) PASS: lldb-unit :: Utility/./UtilityTests/LogTest.LLDB_LOG_nullptr (1775 of 1935) PASS: lldb-unit :: Process/minidump/./LLDBMinidumpTests/MinidumpParserTest.GetPid (1776 of 1935) PASS: lldb-api :: lang/cpp/constructors/TestCppConstructors.py (1777 of 1935) PASS: lldb-shell :: SymbolFile/NativePDB/break-by-function.cpp (1778 of 1935) PASS: lldb-api :: lang/c/shared_lib_stripped_symbols/TestSharedLibStrippedSymbols.py (1779 of 1935) PASS: lldb-api :: python_api/watchpoint/watchlocation/TestTargetWatchAddress.py (1780 of 1935) PASS: lldb-unit :: Utility/./UtilityTests/DataExtractorTest.GetMaxU64_unchecked (1781 of 1935) PASS: lldb-unit :: SymbolFile/DWARF/./SymbolFileDWARFTests/SymbolFileDWARFTests.TestAbbrevOrder1Start1 (1782 of 1935) PASS: lldb-api :: lang/cpp/char1632_t/TestChar1632T.py (1783 of 1935) PASS: lldb-api :: lang/c/shared_lib/TestSharedLib.py (1784 of 1935) PASS: lldb-unit :: Utility/./UtilityTests/VASprintfTest.EncodingError (1785 of 1935) PASS: lldb-unit :: Process/minidump/./LLDBMinidumpTests/MinidumpParserTest.GetExceptionStream (1786 of 1935) PASS: lldb-shell :: SymbolFile/DWARF/debug_rnglists.s (1787 of 1935) PASS: lldb-api :: commands/version/TestVersion.py (1788 of 1935) PASS: lldb-unit :: UnwindAssembly/x86/./UnwindAssemblyx86Tests/Testx86AssemblyInspectionEngine.TestPopEBX (1789 of 1935) PASS: lldb-api :: functionalities/data-formatter/data-formatter-objc/TestDataFormatterObjCNSError.py (1790 of 1935) PASS: lldb-api :: functionalities/inferior-crashing/recursive-inferior/TestRecursiveInferiorStep.py (1791 of 1935) PASS: lldb-unit :: Expression/./ExpressionTests/CppModuleConfigurationTest.AmbiguousLibCpp (1792 of 1935) PASS: lldb-shell :: ScriptInterpreter/Python/scripted_breakpoint.test (1793 of 1935) PASS: lldb-shell :: Commands/CommandScriptImmediateOutput/CommandScriptImmediateOutputFile.test (1794 of 1935) PASS: lldb-shell :: Reproducer/Functionalities/TestExpressionEvaluation.test (1795 of 1935) PASS: lldb-unit :: SymbolFile/NativePDB/./SymbolFileNativePDBTests/PDBFPOProgramToDWARFExpressionTests.InvalidOpBinary (1796 of 1935) UNSUPPORTED: lldb-api :: commands/target/auto-install-main-executable/TestAutoInstallMainExecutable.py (1797 of 1935) PASS: lldb-shell :: SymbolFile/DWARF/split-dwarf-multiple-cu.ll (1798 of 1935) PASS: lldb-unit :: Utility/./UtilityTests/TimeoutTest.Construction (1799 of 1935) PASS: lldb-api :: tools/lldb-server/inferior-crash/TestGdbRemoteAbort.py (1800 of 1935) PASS: lldb-api :: lang/cpp/operators/TestCppOperators.py (1801 of 1935) PASS: lldb-api :: functionalities/data-formatter/data-formatter-stl/libcxx/atomic/TestLibCxxAtomic.py (1802 of 1935) PASS: lldb-api :: commands/expression/import-std-module/vector/TestVectorFromStdModule.py (1803 of 1935) PASS: lldb-api :: python_api/lldbutil/iter/TestRegistersIterator.py (1804 of 1935) PASS: lldb-unit :: Utility/./UtilityTests/StreamTest.PutHex16ByteOrderLittle (1805 of 1935) PASS: lldb-api :: functionalities/data-formatter/poarray/TestPrintObjectArray.py (1806 of 1935) UNSUPPORTED: lldb-api :: android/platform/TestDefaultCacheLineSize.py (1807 of 1935) PASS: lldb-api :: types/TestDoubleTypes.py (1808 of 1935) PASS: lldb-unit :: Process/minidump/./LLDBMinidumpTests/MinidumpParserTest.GetMiscInfo_no_stream (1809 of 1935) PASS: lldb-shell :: Reproducer/Functionalities/TestStepping.test (1810 of 1935) PASS: lldb-unit :: Utility/./UtilityTests/ArchSpecTest.OperatorBool (1811 of 1935) PASS: lldb-unit :: UnwindAssembly/x86/./UnwindAssemblyx86Tests/Testx86AssemblyInspectionEngine.TestPushRBP (1812 of 1935) PASS: lldb-unit :: Utility/./UtilityTests/RangeTest.Union (1813 of 1935) PASS: lldb-api :: functionalities/data-formatter/data-formatter-stl/libcxx/list/loop/TestDataFormatterLibcxxListLoop.py (1814 of 1935) PASS: lldb-shell :: ScriptInterpreter/None/none.test (1815 of 1935) PASS: lldb-api :: lang/c/inlines/TestRedefinitionsInInlines.py (1816 of 1935) PASS: lldb-unit :: Process/gdb-remote/./ProcessGdbRemoteTests/GDBRemoteCommunicationClientTest.GetMemoryRegionInfo (1817 of 1935) PASS: lldb-api :: functionalities/thread/concurrent_events/TestConcurrentSignalWatch.py (1818 of 1935) UNSUPPORTED: lldb-shell :: SymbolFile/PDB/vbases.test (1819 of 1935) PASS: lldb-api :: tools/lldb-vscode/breakpoint/TestVSCode_setBreakpoints.py (1820 of 1935) PASS: lldb-unit :: Utility/./UtilityTests/OptionsWithRawTest.ArgsButNoLeadingDash (1821 of 1935) PASS: lldb-unit :: Utility/./UtilityTests/UriParserTest.BracketedHostname (1822 of 1935) PASS: lldb-shell :: ObjectFile/wasm/basic.yaml (1823 of 1935) PASS: lldb-shell :: SymbolFile/NativePDB/globals-bss.cpp (1824 of 1935) PASS: lldb-unit :: Expression/./ExpressionTests/CppModuleConfigurationTest.AmbiguousCLib (1825 of 1935) UNSUPPORTED: lldb-api :: functionalities/data-formatter/data-formatter-stl/libstdcpp/vector/TestDataFormatterStdVector.py (1826 of 1935) PASS: lldb-unit :: Utility/./UtilityTests/ScalarTest.RightShiftOperator (1827 of 1935) PASS: lldb-api :: lang/objc/foundation/TestObjCMethodsString.py (1828 of 1935) PASS: lldb-shell :: SymbolFile/DWARF/dir-separator-no-comp-dir.s (1829 of 1935) PASS: lldb-api :: commands/expression/vector_of_enums/TestVectorOfEnums.py (1830 of 1935) PASS: lldb-unit :: Utility/./UtilityTests/StreamTeeTest.DefaultConstructor (1831 of 1935) PASS: lldb-api :: functionalities/gdb_remote_client/TestRegDefinitionInParts.py (1832 of 1935) PASS: lldb-api :: commands/expression/radar_9531204/TestPrintfAfterUp.py (1833 of 1935) PASS: lldb-api :: functionalities/breakpoint/breakpoint_hit_count/TestBreakpointHitCount.py (1834 of 1935) PASS: lldb-unit :: Language/Highlighting/./HighlighterTests/HighlighterTest.ClangEmptyInput (1835 of 1935) PASS: lldb-unit :: Utility/./UtilityTests/StreamTest.Indent (1836 of 1935) PASS: lldb-unit :: UnwindAssembly/x86/./UnwindAssemblyx86Tests/Testx86AssemblyInspectionEngine.TestDisassemblyMidFunctionEpilogues (1837 of 1935) PASS: lldb-api :: commands/expression/entry-bp/TestExprEntryBP.py (1838 of 1935) PASS: lldb-unit :: ScriptInterpreter/Python/./ScriptInterpreterPythonTests/PythonDataObjectsTest.TestPythonTupleInitializerList2 (1839 of 1935) PASS: lldb-shell :: Host/TestCustomShell.test (1840 of 1935) UNSUPPORTED: lldb-shell :: SymbolFile/PDB/enums-layout.test (1841 of 1935) UNSUPPORTED: lldb-api :: functionalities/unwind/standard/TestStandardUnwind.py (1842 of 1935) PASS: lldb-unit :: Utility/./UtilityTests/Flags.Test (1843 of 1935) PASS: lldb-unit :: Utility/./UtilityTests/UriParserTest.SchemeHostSeparator (1844 of 1935) PASS: lldb-unit :: Symbol/./SymbolTests/TestClangASTImporter.MetadataPropagationAfterCopying (1845 of 1935) PASS: lldb-api :: tools/lldb-server/TestGdbRemoteHostInfo.py (1846 of 1935) PASS: lldb-unit :: Signals/./SignalsTests/UnixSignalsTest.GetFilteredSignals (1847 of 1935) PASS: lldb-unit :: Utility/./UtilityTests/RangeTest.DefaultConstructor (1848 of 1935) PASS: lldb-api :: lang/cpp/unique-types/TestUniqueTypes.py (1849 of 1935) PASS: lldb-api :: tools/lldb-server/TestGdbRemoteExitCode.py (1850 of 1935) PASS: lldb-unit :: Utility/./UtilityTests/OptionsWithRawTest.TerminatedQuote (1851 of 1935) PASS: lldb-unit :: Host/./HostTests/SocketAddressTest.Set (1852 of 1935) PASS: lldb-api :: lang/objc/foundation/TestObjCMethodsNSError.py (1853 of 1935) PASS: lldb-unit :: Utility/./UtilityTests/StreamTest.PutHex8 (1854 of 1935) PASS: lldb-unit :: Platform/./LLDBPlatformTests/PlatformDarwinTest.TestParseVersionBuildDir (1855 of 1935) PASS: lldb-unit :: Utility/./UtilityTests/StringExtractorTest.GetU64LittleEndian (1856 of 1935) PASS: lldb-unit :: Host/./HostTests/FileSystemTest.FileAndDirectoryComponents (1857 of 1935) PASS: lldb-api :: functionalities/tail_call_frames/inlining_and_tail_calls/TestInliningAndTailCalls.py (1858 of 1935) PASS: lldb-unit :: Utility/./UtilityTests/StringExtractorTest.GetNameColonValueNoSemicolon (1859 of 1935) UNSUPPORTED: lldb-api :: commands/expression/multiline-completion/TestMultilineCompletion.py (1860 of 1935) PASS: lldb-unit :: Utility/./UtilityTests/BinaryStreamTest.PutSLEB128SixBytes (1861 of 1935) PASS: lldb-unit :: Utility/./UtilityTests/AnsiTerminal.AtEnd (1862 of 1935) PASS: lldb-api :: commands/watchpoints/watchpoint_on_vectors/TestValueOfVectorVariable.py (1863 of 1935) PASS: lldb-api :: commands/expression/import-std-module/stack/TestStackFromStdModule.py (1864 of 1935) PASS: lldb-shell :: Settings/TestFrameFormatColor.test (1865 of 1935) PASS: lldb-unit :: Utility/./UtilityTests/StructuredDataTest.ParseJSONFromFile (1866 of 1935) PASS: lldb-shell :: Driver/TestFile.test (1867 of 1935) PASS: lldb-unit :: SymbolFile/NativePDB/./SymbolFileNativePDBTests/PDBFPOProgramToDWARFExpressionTests.InvalidAssignmentMultiple (1868 of 1935) PASS: lldb-unit :: Utility/./UtilityTests/StringListTest.ShiftCString (1869 of 1935) PASS: lldb-api :: functionalities/thread/thread_specific_break/TestThreadSpecificBreakpoint.py (1870 of 1935) PASS: lldb-unit :: Utility/./UtilityTests/RangeTest.NotEqualInvalid (1871 of 1935) PASS: lldb-shell :: Breakpoint/debug_rnglist_offset_pair.test (1872 of 1935) UNSUPPORTED: lldb-api :: functionalities/thread/break_after_join/TestBreakAfterJoin.py (1873 of 1935) PASS: lldb-unit :: ObjectFile/Breakpad/./ObjectFileBreakpadTests/Record.classify (1874 of 1935) PASS: lldb-api :: commands/frame/recognizer/TestFrameRecognizer.py (1875 of 1935) UNSUPPORTED: lldb-api :: functionalities/asan/TestReportData.py (1876 of 1935) PASS: lldb-shell :: SymbolFile/Breakpad/line-table-mixed-path-styles.test (1877 of 1935) PASS: lldb-unit :: Expression/./ExpressionTests/DiagnosticManagerTest.AddDiagnostic (1878 of 1935) PASS: lldb-shell :: ObjectFile/ELF/minidebuginfo-corrupt-xz.yaml (1879 of 1935) PASS: lldb-unit :: UnwindAssembly/x86/./UnwindAssemblyx86Tests/Testx86AssemblyInspectionEngine.TestPushESI (1880 of 1935) PASS: lldb-api :: functionalities/gdb_remote_client/TestNoWatchpointSupportInfo.py (1881 of 1935) PASS: lldb-unit :: Process/gdb-remote/./ProcessGdbRemoteTests/GDBRemoteClientBaseTest.SendContinueAndInterrupt2PacketBug (1882 of 1935) PASS: lldb-shell :: SymbolFile/NativePDB/break-by-line.cpp (1883 of 1935) PASS: lldb-shell :: SymbolFile/Breakpad/symtab.test (1884 of 1935) PASS: lldb-unit :: Utility/./UtilityTests/AnsiTerminal.WhiteSpace (1885 of 1935) PASS: lldb-unit :: Expression/./ExpressionTests/CppModuleConfigurationTest.Sysroot (1886 of 1935) PASS: lldb-api :: lang/objc/radar-9691614/TestObjCMethodReturningBOOL.py (1887 of 1935) PASS: lldb-api :: commands/watchpoints/step_over_watchpoint/TestStepOverWatchpoint.py (1888 of 1935) PASS: lldb-api :: functionalities/unwind/noreturn/module-end/TestNoReturnModuleEnd.py (1889 of 1935) UNSUPPORTED: lldb-api :: commands/expression/call-restarts/TestCallThatRestarts.py (1890 of 1935) UNSUPPORTED: lldb-api :: functionalities/tsan/thread_leak/TestTsanThreadLeak.py (1891 of 1935) PASS: lldb-unit :: Utility/./UtilityTests/RangeTest.ContainsEndInclusiveInvalid (1892 of 1935) PASS: lldb-unit :: Utility/./UtilityTests/ArgsTest.ReplaceArgumentAtIndexEqual (1893 of 1935) PASS: lldb-unit :: Utility/./UtilityTests/SerializationRountripTest.SerializeDeserializeCStringArrayNullptrElem (1894 of 1935) PASS: lldb-unit :: Utility/./UtilityTests/StatusTest.Formatv (1895 of 1935) PASS: lldb-shell :: SymbolFile/DWARF/parallel-indexing-stress.s (1896 of 1935) PASS: lldb-api :: commands/expression/import-std-module/deque-basic/TestDequeFromStdModule.py (1897 of 1935) PASS: lldb-api :: functionalities/pre_run_dylibs/TestPreRunDylibs.py (1898 of 1935) PASS: lldb-api :: commands/target/basic/TestTargetCommand.py (1899 of 1935) PASS: lldb-api :: functionalities/gdb_remote_client/TestStopPCs.py (1900 of 1935) PASS: lldb-api :: commands/expression/import-std-module/vector-bool/TestVectorBoolFromStdModule.py (1901 of 1935) UNSUPPORTED: lldb-api :: functionalities/darwin_log/filter/regex/category/TestDarwinLogFilterRegexCategory.py (1902 of 1935) PASS: lldb-unit :: Host/./HostTests/NativeProcessProtocolTest.ReadMemoryWithoutTrap (1903 of 1935) PASS: lldb-unit :: Utility/./UtilityTests/Flags.AnyClear (1904 of 1935) PASS: lldb-unit :: UnwindAssembly/x86/./UnwindAssemblyx86Tests/Testx86AssemblyInspectionEngine.TestSpArithx86_64Augmented (1905 of 1935) UNSUPPORTED: lldb-shell :: Register/x86-gp-read.test (1906 of 1935) PASS: lldb-api :: commands/expression/invalid-args/TestInvalidArgsExpression.py (1907 of 1935) PASS: lldb-shell :: SymbolFile/DWARF/dwarf5-partial-index.cpp (1908 of 1935) PASS: lldb-api :: functionalities/postmortem/netbsd-core/TestNetBSDCore.py (1909 of 1935) PASS: lldb-api :: commands/statistics/basic/TestStats.py (1910 of 1935) PASS: lldb-unit :: Utility/./UtilityTests/TimerTest.CategoryTimes (1911 of 1935) PASS: lldb-unit :: Utility/./UtilityTests/UriParserTest.SchemeHostSeparator3 (1912 of 1935) PASS: lldb-api :: functionalities/breakpoint/hardware_breakpoints/hardware_breakpoint_on_multiple_threads/TestHWBreakMultiThread.py (1913 of 1935) UNSUPPORTED: lldb-shell :: Register/x86-64-ymm16-read.test (1914 of 1935) PASS: lldb-shell :: SymbolFile/NativePDB/ast-functions.cpp (1915 of 1935) PASS: lldb-unit :: Symbol/./SymbolTests/TestTypeSystemClang.TemplateArguments (1916 of 1935) PASS: lldb-api :: lang/cpp/offsetof/TestOffsetofCpp.py (1917 of 1935) PASS: lldb-unit :: Utility/./UtilityTests/StringListTest.InsertStringAtIndexStart (1918 of 1935) PASS: lldb-unit :: Process/gdb-remote/./ProcessGdbRemoteTests/GDBRemoteCommunicationServerTest.SendErrorResponse_ErrorNumber (1919 of 1935) PASS: lldb-unit :: Core/./LLDBCoreTests/MangledTest.ResultForValidName (1920 of 1935) PASS: lldb-unit :: Utility/./UtilityTests/StringExtractorTest.GetHexU8_InvalidHex_NoEof (1921 of 1935) PASS: lldb-api :: types/TestIntegerTypeExpr.py (1922 of 1935) UNSUPPORTED: lldb-api :: lang/cpp/static_members/TestCPPStaticMembers.py (1923 of 1935) PASS: lldb-api :: macosx/thread-names/TestInterruptThreadNames.py (1924 of 1935) PASS: lldb-api :: functionalities/breakpoint/consecutive_breakpoints/TestConsecutiveBreakpoints.py (1925 of 1935) PASS: lldb-unit :: Utility/./UtilityTests/StringListTest.JoinThree (1926 of 1935) PASS: lldb-api :: python_api/findvalue_duplist/TestSBFrameFindValue.py (1927 of 1935) PASS: lldb-unit :: Utility/./UtilityTests/RangeTest.ContainsRange (1928 of 1935) UNSUPPORTED: lldb-api :: functionalities/ubsan/user-expression/TestUbsanUserExpression.py (1929 of 1935) PASS: lldb-unit :: DataFormatter/./LLDBFormatterTests/FormatManagerTests.CompatibleLangs (1930 of 1935) PASS: lldb-api :: commands/expression/import-std-module/empty-module/TestEmptyStdModule.py (1931 of 1935) PASS: lldb-api :: functionalities/thread/concurrent_events/TestConcurrentTwoBreakpointsOneWatchpoint.py (1932 of 1935) PASS: lldb-api :: lang/objc/objc-struct-argument/TestObjCStructArgument.py (1933 of 1935) PASS: lldb-api :: functionalities/recursion/TestValueObjectRecursion.py (1934 of 1935) PASS: lldb-api :: functionalities/inline-stepping/TestInlineStepping.py (1935 of 1935)

Hide Details

Testing Time: 4228.43s ******************** Unresolved Tests (1): lldb-api :: functionalities/gdb_remote_client/TestWasm.py

Hide Details

Hide Details

Slowest Tests: -------------------------------------------------------------------------- 83.08s: lldb-api :: types/TestIntegerTypeExpr.py 93.63s: lldb-api :: types/TestLongTypes.py 96.66s: lldb-api :: types/TestCharTypeExpr.py 103.12s: lldb-api :: python_api/lldbutil/iter/TestLLDBIterator.py 112.08s: lldb-api :: lang/objc/foundation/TestObjCMethodsNSError.py 112.62s: lldb-api :: lang/objc/objc-new-syntax/TestObjCNewSyntaxArray.py 113.43s: lldb-api :: lang/objc/objc-new-syntax/TestObjCNewSyntaxDictionary.py 114.77s: lldb-api :: lang/objc/foundation/TestObjCMethodsString.py 120.55s: lldb-api :: tools/lldb-server/TestGdbRemote_qThreadStopInfo.py 129.75s: lldb-api :: types/TestLongTypesExpr.py 140.42s: lldb-api :: lang/objc/real-definition/TestRealDefinition.py 150.32s: lldb-api :: lang/objc/objc-new-syntax/TestObjCNewSyntaxLiteral.py 163.20s: lldb-api :: lang/cpp/namespace/TestNamespaceLookup.py 185.44s: lldb-api :: lang/objc/exceptions/TestObjCExceptions.py 213.80s: lldb-api :: lang/objc/foundation/TestObjCMethods.py 240.60s: lldb-api :: lang/objc/hidden-ivars/TestHiddenIvars.py 248.64s: lldb-api :: tools/lldb-server/TestGdbRemoteThreadsInStopReply.py 250.00s: lldb-api :: api/multithreaded/TestMultithreaded.py 274.70s: lldb-api :: lang/cpp/enum_types/TestCPP11EnumTypes.py 366.26s: lldb-api :: tools/lldb-server/TestLldbGdbServer.py

Hide Details

Tests Times: -------------------------------------------------------------------------- [ Range ] :: [ Percentage ] :: [ Count ] -------------------------------------------------------------------------- [ 0s, 20s) :: [********************************** ] :: [1688/1935] [ 20s, 40s) :: [** ] :: [ 121/1935] [ 40s, 60s) :: [* ] :: [ 79/1935] [ 60s, 80s) :: [ ] :: [ 23/1935] [ 80s,100s) :: [ ] :: [ 6/1935] [100s,120s) :: [ ] :: [ 6/1935] [120s,140s) :: [ ] :: [ 2/1935] [140s,160s) :: [ ] :: [ 2/1935] [160s,180s) :: [ ] :: [ 1/1935] [180s,200s) :: [ ] :: [ 1/1935] [200s,220s) :: [ ] :: [ 0/1935] [220s,240s) :: [ ] :: [ 1/1935] [240s,260s) :: [ ] :: [ 3/1935] [260s,280s) :: [ ] :: [ 0/1935] [280s,300s) :: [ ] :: [ 1/1935] [300s,320s) :: [ ] :: [ 0/1935] [320s,340s) :: [ ] :: [ 0/1935] [340s,360s) :: [ ] :: [ 0/1935] [360s,380s) :: [ ] :: [ 1/1935] Expected Passes : 1764 Expected Failures : 6 Unsupported Tests : 164 Unresolved Tests : 1 FAILED: tools/lldb/test/CMakeFiles/check-lldb-lit cd /Users/buildslave/jenkins/workspace/lldb-cmake-sanitized/lldb-build/tools/lldb/test && /usr/local/bin/python /Users/buildslave/jenkins/workspace/lldb-cmake-sanitized/lldb-build/./bin/llvm-lit -v --time-tests --shuffle --xunit-xml-output=/Users/buildslave/jenkins/workspace/lldb-cmake-sanitized/test/results.xml -v -j 4 --timeout 1200 /Users/buildslave/jenkins/workspace/lldb-cmake-sanitized/lldb-build/tools/lldb/test ninja: build stopped: subcommand failed. Command failed: Command '['/usr/bin/env', 'TERM=vt100', '/usr/local/bin/ninja', '-v', 'check-lldb']' returned non-zero exit status 1. Command: ['/usr/bin/env', 'TERM=vt100', '/usr/local/bin/ninja', '-v', 'check-lldb'] [Pipeline] } [Pipeline] // timeout [Pipeline] } [Pipeline] // stage [Pipeline] stage [Pipeline] { (Declarative: Post Actions) [Pipeline] scanForIssues No credentials specified [Clang (LLVM based)] Sleeping for 5 seconds due to JENKINS-32191... [Clang (LLVM based)] Parsing console log (workspace: '/Users/buildslave/jenkins/workspace/lldb-cmake-sanitized') [Pipeline] junit Recording test results [Pipeline] } [Pipeline] // stage [Pipeline] } [Pipeline] // withEnv [Pipeline] } [Pipeline] // node [Pipeline] End of Pipeline ERROR: script returned exit code 1 Finished: FAILURE