FailedConsole Output

Skipping 8,962 KB.. Full Log
ages/Python/lldbsuite/test/make -f /Users/buildslave/jenkins/workspace/lldb-cmake-matrix/llvm-project/lldb/test/API/types/Makefile MAKE_DSYM=YES  ARCH=x86_64 CC="/Users/buildslave/jenkins/workspace/lldb-cmake-matrix/lldb-build/bin/clang" DSYMUTIL="/Users/buildslave/jenkins/workspace/lldb-cmake-matrix/lldb-build/./bin/dsymutil"  CLANG_MODULE_CACHE_DIR=/Users/buildslave/jenkins/workspace/lldb-cmake-matrix/lldb-build/lldb-test-build.noindex/module-cache-clang/lldb-api all CXX_SOURCES='unsigned_long_long.cpp' EXE='test_unsigned_long_long_type_from_block_dsym' CFLAGS_EXTRAS='-DTEST_BLOCK_CAPTURED_VARS'

Hide Details

Build Command Output: /Users/buildslave/jenkins/workspace/lldb-cmake-matrix/lldb-build/bin/clang -std=c++11 -gdwarf-2 -isysroot "/Applications/Xcode.app/Contents/Developer/Platforms/MacOSX.platform/Developer/SDKs/MacOSX10.15.sdk" -arch x86_64 -I/Users/buildslave/jenkins/workspace/lldb-cmake-matrix/llvm-project/lldb/packages/Python/lldbsuite/test/make/../../../../../include -I/Users/buildslave/jenkins/workspace/lldb-cmake-matrix/llvm-project/lldb/test/API/types -I/Users/buildslave/jenkins/workspace/lldb-cmake-matrix/llvm-project/lldb/packages/Python/lldbsuite/test/make -include /Users/buildslave/jenkins/workspace/lldb-cmake-matrix/llvm-project/lldb/packages/Python/lldbsuite/test/make/test_common.h -fno-limit-debug-info -DTEST_BLOCK_CAPTURED_VARS --driver-mode=g++ -c -o unsigned_long_long.o /Users/buildslave/jenkins/workspace/lldb-cmake-matrix/llvm-project/lldb/test/API/types/unsigned_long_long.cpp make: *** [unsigned_long_long.o] Killed: 9

Hide Details

Test Directory: /Users/buildslave/jenkins/workspace/lldb-cmake-matrix/llvm-project/lldb/test/API/types ====================================================================== ERROR: test_unsigned_long_long_type_from_block_dwarf (TestLongTypesExpr.LongTypesExprTestCase) Test that 'unsigned_long_long'-type variables are displayed correctly from a block. ---------------------------------------------------------------------- Error when building test subject.

Hide Details

Build Command: make VPATH=/Users/buildslave/jenkins/workspace/lldb-cmake-matrix/llvm-project/lldb/test/API/types -C /Users/buildslave/jenkins/workspace/lldb-cmake-matrix/lldb-build/lldb-test-build.noindex/types/TestLongTypesExpr.test_unsigned_long_long_type_from_block_dwarf -I /Users/buildslave/jenkins/workspace/lldb-cmake-matrix/llvm-project/lldb/test/API/types -I /Users/buildslave/jenkins/workspace/lldb-cmake-matrix/llvm-project/lldb/packages/Python/lldbsuite/test/make -f /Users/buildslave/jenkins/workspace/lldb-cmake-matrix/llvm-project/lldb/test/API/types/Makefile MAKE_DSYM=NO ARCH=x86_64 CC="/Users/buildslave/jenkins/workspace/lldb-cmake-matrix/lldb-build/bin/clang" DSYMUTIL="/Users/buildslave/jenkins/workspace/lldb-cmake-matrix/lldb-build/./bin/dsymutil" CLANG_MODULE_CACHE_DIR=/Users/buildslave/jenkins/workspace/lldb-cmake-matrix/lldb-build/lldb-test-build.noindex/module-cache-clang/lldb-api CXX_SOURCES='unsigned_long_long.cpp' EXE='test_unsigned_long_long_type_from_block_dwarf' CFLAGS_EXTRAS='-DTEST_BLOCK_CAPTURED_VARS'

Hide Details

Build Command Output: /Users/buildslave/jenkins/workspace/lldb-cmake-matrix/lldb-build/bin/clang -std=c++11 -gdwarf-2 -isysroot "/Applications/Xcode.app/Contents/Developer/Platforms/MacOSX.platform/Developer/SDKs/MacOSX10.15.sdk" -arch x86_64 -I/Users/buildslave/jenkins/workspace/lldb-cmake-matrix/llvm-project/lldb/packages/Python/lldbsuite/test/make/../../../../../include -I/Users/buildslave/jenkins/workspace/lldb-cmake-matrix/llvm-project/lldb/test/API/types -I/Users/buildslave/jenkins/workspace/lldb-cmake-matrix/llvm-project/lldb/packages/Python/lldbsuite/test/make -include /Users/buildslave/jenkins/workspace/lldb-cmake-matrix/llvm-project/lldb/packages/Python/lldbsuite/test/make/test_common.h -fno-limit-debug-info -DTEST_BLOCK_CAPTURED_VARS --driver-mode=g++ -c -o unsigned_long_long.o /Users/buildslave/jenkins/workspace/lldb-cmake-matrix/llvm-project/lldb/test/API/types/unsigned_long_long.cpp make: *** [unsigned_long_long.o] Killed: 9

Hide Details

Test Directory: /Users/buildslave/jenkins/workspace/lldb-cmake-matrix/llvm-project/lldb/test/API/types ====================================================================== ERROR: test_unsigned_long_type_dsym (TestLongTypesExpr.LongTypesExprTestCase) Test that 'unsigned long'-type variable expressions are evaluated correctly. ---------------------------------------------------------------------- Error when building test subject.

Hide Details

Build Command: make VPATH=/Users/buildslave/jenkins/workspace/lldb-cmake-matrix/llvm-project/lldb/test/API/types -C /Users/buildslave/jenkins/workspace/lldb-cmake-matrix/lldb-build/lldb-test-build.noindex/types/TestLongTypesExpr.test_unsigned_long_type_dsym -I /Users/buildslave/jenkins/workspace/lldb-cmake-matrix/llvm-project/lldb/test/API/types -I /Users/buildslave/jenkins/workspace/lldb-cmake-matrix/llvm-project/lldb/packages/Python/lldbsuite/test/make -f /Users/buildslave/jenkins/workspace/lldb-cmake-matrix/llvm-project/lldb/test/API/types/Makefile MAKE_DSYM=YES ARCH=x86_64 CC="/Users/buildslave/jenkins/workspace/lldb-cmake-matrix/lldb-build/bin/clang" DSYMUTIL="/Users/buildslave/jenkins/workspace/lldb-cmake-matrix/lldb-build/./bin/dsymutil" CLANG_MODULE_CACHE_DIR=/Users/buildslave/jenkins/workspace/lldb-cmake-matrix/lldb-build/lldb-test-build.noindex/module-cache-clang/lldb-api all CXX_SOURCES='unsigned_long.cpp' EXE='test_unsigned_long_type_dsym'

Hide Details

Build Command Output: /Users/buildslave/jenkins/workspace/lldb-cmake-matrix/lldb-build/bin/clang -std=c++11 -gdwarf-2 -isysroot "/Applications/Xcode.app/Contents/Developer/Platforms/MacOSX.platform/Developer/SDKs/MacOSX10.15.sdk" -arch x86_64 -I/Users/buildslave/jenkins/workspace/lldb-cmake-matrix/llvm-project/lldb/packages/Python/lldbsuite/test/make/../../../../../include -I/Users/buildslave/jenkins/workspace/lldb-cmake-matrix/llvm-project/lldb/test/API/types -I/Users/buildslave/jenkins/workspace/lldb-cmake-matrix/llvm-project/lldb/packages/Python/lldbsuite/test/make -include /Users/buildslave/jenkins/workspace/lldb-cmake-matrix/llvm-project/lldb/packages/Python/lldbsuite/test/make/test_common.h -fno-limit-debug-info --driver-mode=g++ -c -o unsigned_long.o /Users/buildslave/jenkins/workspace/lldb-cmake-matrix/llvm-project/lldb/test/API/types/unsigned_long.cpp make: *** [unsigned_long.o] Killed: 9

Hide Details

Test Directory: /Users/buildslave/jenkins/workspace/lldb-cmake-matrix/llvm-project/lldb/test/API/types ====================================================================== ERROR: test_unsigned_long_type_dwarf (TestLongTypesExpr.LongTypesExprTestCase) Test that 'unsigned long'-type variable expressions are evaluated correctly. ---------------------------------------------------------------------- Error when building test subject.

Hide Details

Build Command: make VPATH=/Users/buildslave/jenkins/workspace/lldb-cmake-matrix/llvm-project/lldb/test/API/types -C /Users/buildslave/jenkins/workspace/lldb-cmake-matrix/lldb-build/lldb-test-build.noindex/types/TestLongTypesExpr.test_unsigned_long_type_dwarf -I /Users/buildslave/jenkins/workspace/lldb-cmake-matrix/llvm-project/lldb/test/API/types -I /Users/buildslave/jenkins/workspace/lldb-cmake-matrix/llvm-project/lldb/packages/Python/lldbsuite/test/make -f /Users/buildslave/jenkins/workspace/lldb-cmake-matrix/llvm-project/lldb/test/API/types/Makefile MAKE_DSYM=NO ARCH=x86_64 CC="/Users/buildslave/jenkins/workspace/lldb-cmake-matrix/lldb-build/bin/clang" DSYMUTIL="/Users/buildslave/jenkins/workspace/lldb-cmake-matrix/lldb-build/./bin/dsymutil" CLANG_MODULE_CACHE_DIR=/Users/buildslave/jenkins/workspace/lldb-cmake-matrix/lldb-build/lldb-test-build.noindex/module-cache-clang/lldb-api CXX_SOURCES='unsigned_long.cpp' EXE='test_unsigned_long_type_dwarf'

Hide Details

Build Command Output: /Users/buildslave/jenkins/workspace/lldb-cmake-matrix/lldb-build/bin/clang -std=c++11 -gdwarf-2 -isysroot "/Applications/Xcode.app/Contents/Developer/Platforms/MacOSX.platform/Developer/SDKs/MacOSX10.15.sdk" -arch x86_64 -I/Users/buildslave/jenkins/workspace/lldb-cmake-matrix/llvm-project/lldb/packages/Python/lldbsuite/test/make/../../../../../include -I/Users/buildslave/jenkins/workspace/lldb-cmake-matrix/llvm-project/lldb/test/API/types -I/Users/buildslave/jenkins/workspace/lldb-cmake-matrix/llvm-project/lldb/packages/Python/lldbsuite/test/make -include /Users/buildslave/jenkins/workspace/lldb-cmake-matrix/llvm-project/lldb/packages/Python/lldbsuite/test/make/test_common.h -fno-limit-debug-info --driver-mode=g++ -c -o unsigned_long.o /Users/buildslave/jenkins/workspace/lldb-cmake-matrix/llvm-project/lldb/test/API/types/unsigned_long.cpp make: *** [unsigned_long.o] Killed: 9

Hide Details

Test Directory: /Users/buildslave/jenkins/workspace/lldb-cmake-matrix/llvm-project/lldb/test/API/types ====================================================================== ERROR: test_unsigned_long_type_from_block_dsym (TestLongTypesExpr.LongTypesExprTestCase) Test that 'unsigned_long'-type variables are displayed correctly from a block. ---------------------------------------------------------------------- Error when building test subject.

Hide Details

Build Command: make VPATH=/Users/buildslave/jenkins/workspace/lldb-cmake-matrix/llvm-project/lldb/test/API/types -C /Users/buildslave/jenkins/workspace/lldb-cmake-matrix/lldb-build/lldb-test-build.noindex/types/TestLongTypesExpr.test_unsigned_long_type_from_block_dsym -I /Users/buildslave/jenkins/workspace/lldb-cmake-matrix/llvm-project/lldb/test/API/types -I /Users/buildslave/jenkins/workspace/lldb-cmake-matrix/llvm-project/lldb/packages/Python/lldbsuite/test/make -f /Users/buildslave/jenkins/workspace/lldb-cmake-matrix/llvm-project/lldb/test/API/types/Makefile MAKE_DSYM=YES ARCH=x86_64 CC="/Users/buildslave/jenkins/workspace/lldb-cmake-matrix/lldb-build/bin/clang" DSYMUTIL="/Users/buildslave/jenkins/workspace/lldb-cmake-matrix/lldb-build/./bin/dsymutil" CLANG_MODULE_CACHE_DIR=/Users/buildslave/jenkins/workspace/lldb-cmake-matrix/lldb-build/lldb-test-build.noindex/module-cache-clang/lldb-api all CXX_SOURCES='unsigned_long.cpp' EXE='test_unsigned_long_type_from_block_dsym' CFLAGS_EXTRAS='-DTEST_BLOCK_CAPTURED_VARS'

Hide Details

Build Command Output: /Users/buildslave/jenkins/workspace/lldb-cmake-matrix/lldb-build/bin/clang -std=c++11 -gdwarf-2 -isysroot "/Applications/Xcode.app/Contents/Developer/Platforms/MacOSX.platform/Developer/SDKs/MacOSX10.15.sdk" -arch x86_64 -I/Users/buildslave/jenkins/workspace/lldb-cmake-matrix/llvm-project/lldb/packages/Python/lldbsuite/test/make/../../../../../include -I/Users/buildslave/jenkins/workspace/lldb-cmake-matrix/llvm-project/lldb/test/API/types -I/Users/buildslave/jenkins/workspace/lldb-cmake-matrix/llvm-project/lldb/packages/Python/lldbsuite/test/make -include /Users/buildslave/jenkins/workspace/lldb-cmake-matrix/llvm-project/lldb/packages/Python/lldbsuite/test/make/test_common.h -fno-limit-debug-info -DTEST_BLOCK_CAPTURED_VARS --driver-mode=g++ -c -o unsigned_long.o /Users/buildslave/jenkins/workspace/lldb-cmake-matrix/llvm-project/lldb/test/API/types/unsigned_long.cpp make: *** [unsigned_long.o] Killed: 9

Hide Details

Test Directory: /Users/buildslave/jenkins/workspace/lldb-cmake-matrix/llvm-project/lldb/test/API/types ====================================================================== ERROR: test_unsigned_long_type_from_block_dwarf (TestLongTypesExpr.LongTypesExprTestCase) Test that 'unsigned_long'-type variables are displayed correctly from a block. ---------------------------------------------------------------------- Error when building test subject.

Hide Details

Build Command: make VPATH=/Users/buildslave/jenkins/workspace/lldb-cmake-matrix/llvm-project/lldb/test/API/types -C /Users/buildslave/jenkins/workspace/lldb-cmake-matrix/lldb-build/lldb-test-build.noindex/types/TestLongTypesExpr.test_unsigned_long_type_from_block_dwarf -I /Users/buildslave/jenkins/workspace/lldb-cmake-matrix/llvm-project/lldb/test/API/types -I /Users/buildslave/jenkins/workspace/lldb-cmake-matrix/llvm-project/lldb/packages/Python/lldbsuite/test/make -f /Users/buildslave/jenkins/workspace/lldb-cmake-matrix/llvm-project/lldb/test/API/types/Makefile MAKE_DSYM=NO ARCH=x86_64 CC="/Users/buildslave/jenkins/workspace/lldb-cmake-matrix/lldb-build/bin/clang" DSYMUTIL="/Users/buildslave/jenkins/workspace/lldb-cmake-matrix/lldb-build/./bin/dsymutil" CLANG_MODULE_CACHE_DIR=/Users/buildslave/jenkins/workspace/lldb-cmake-matrix/lldb-build/lldb-test-build.noindex/module-cache-clang/lldb-api CXX_SOURCES='unsigned_long.cpp' EXE='test_unsigned_long_type_from_block_dwarf' CFLAGS_EXTRAS='-DTEST_BLOCK_CAPTURED_VARS'

Hide Details

Build Command Output: /Users/buildslave/jenkins/workspace/lldb-cmake-matrix/lldb-build/bin/clang -std=c++11 -gdwarf-2 -isysroot "/Applications/Xcode.app/Contents/Developer/Platforms/MacOSX.platform/Developer/SDKs/MacOSX10.15.sdk" -arch x86_64 -I/Users/buildslave/jenkins/workspace/lldb-cmake-matrix/llvm-project/lldb/packages/Python/lldbsuite/test/make/../../../../../include -I/Users/buildslave/jenkins/workspace/lldb-cmake-matrix/llvm-project/lldb/test/API/types -I/Users/buildslave/jenkins/workspace/lldb-cmake-matrix/llvm-project/lldb/packages/Python/lldbsuite/test/make -include /Users/buildslave/jenkins/workspace/lldb-cmake-matrix/llvm-project/lldb/packages/Python/lldbsuite/test/make/test_common.h -fno-limit-debug-info -DTEST_BLOCK_CAPTURED_VARS --driver-mode=g++ -c -o unsigned_long.o /Users/buildslave/jenkins/workspace/lldb-cmake-matrix/llvm-project/lldb/test/API/types/unsigned_long.cpp make: *** [unsigned_long.o] Killed: 9

Hide Details

Test Directory: /Users/buildslave/jenkins/workspace/lldb-cmake-matrix/llvm-project/lldb/test/API/types ====================================================================== FAIL: test_unsigned_long_long_type_dsym (TestLongTypesExpr.LongTypesExprTestCase) Test that 'unsigned long long'-type variable expressions are evaluated correctly. ---------------------------------------------------------------------- Traceback (most recent call last): File "/Users/buildslave/jenkins/workspace/lldb-cmake-matrix/llvm-project/lldb/packages/Python/lldbsuite/test/lldbtest.py", line 1832, in test_method return attrvalue(self) File "/Users/buildslave/jenkins/workspace/lldb-cmake-matrix/llvm-project/lldb/test/API/types/TestLongTypesExpr.py", line 45, in test_unsigned_long_long_type ['unsigned', 'long long']) File "/Users/buildslave/jenkins/workspace/lldb-cmake-matrix/llvm-project/lldb/test/API/types/AbstractBase.py", line 72, in build_and_run_expr source, atoms, expr=True, bc=bc, qd=qd) File "/Users/buildslave/jenkins/workspace/lldb-cmake-matrix/llvm-project/lldb/test/API/types/AbstractBase.py", line 86, in build_and_run_with_source_atoms_expr self.exe_name, atoms, blockCaptured=bc, quotedDisplay=qd) File "/Users/buildslave/jenkins/workspace/lldb-cmake-matrix/llvm-project/lldb/test/API/types/AbstractBase.py", line 260, in generic_type_expr_tester self.runCmd("run", RUN_SUCCEEDED) File "/Users/buildslave/jenkins/workspace/lldb-cmake-matrix/llvm-project/lldb/packages/Python/lldbsuite/test/lldbtest.py", line 2163, in runCmd msg if (msg) else CMD_MSG(cmd)) AssertionError: False is not True : Process is launched successfully Error output: error: shell expansion failed (reason: lldb-argdumper exited with error -1). consider launching with 'process launch'.

Hide Details

Config=x86_64-/Users/buildslave/jenkins/workspace/lldb-cmake-matrix/lldb-build/bin/clang ---------------------------------------------------------------------- Ran 32 tests in 20.020s

Hide Details

RESULT: FAILED (8 passes, 1 failures, 7 errors, 16 skipped, 0 expected failures, 0 unexpected successes)

Hide Details

--

Hide Details

******************** Slowest Tests: -------------------------------------------------------------------------- 47.06s: lldb-api :: functionalities/completion/TestCompletion.py 34.24s: lldb-api :: tools/lldb-server/TestGdbRemoteThreadsInStopReply.py 28.13s: lldb-api :: api/multithreaded/TestMultithreaded.py 27.80s: lldb-api :: lang/objc/foundation/TestObjCMethodsString.py 21.16s: lldb-api :: functionalities/load_unload/TestLoadUnload.py 20.65s: lldb-api :: commands/register/register/register_command/TestRegisters.py 20.51s: lldb-api :: types/TestLongTypesExpr.py 17.67s: lldb-api :: commands/expression/import-std-module/list-dbg-info-content/TestDbgInfoContentListFromStdModule.py 16.33s: lldb-api :: lang/objc/conflicting-definition/TestConflictingDefinition.py 14.63s: lldb-api :: functionalities/data-formatter/compactvectors/TestCompactVectors.py 13.57s: lldb-api :: lang/objc/foundation/TestObjectDescriptionAPI.py 13.35s: lldb-api :: functionalities/data-formatter/data-formatter-stl/libcxx/set/TestDataFormatterLibcxxSet.py 13.33s: lldb-api :: functionalities/thread/backtrace_all/TestBacktraceAll.py 13.15s: lldb-api :: commands/expression/import-std-module/list/TestListFromStdModule.py 12.92s: lldb-shell :: Reproducer/TestGDBRemoteRepro.test 12.68s: lldb-api :: lang/objc/objc-ivar-offsets/TestObjCIvarOffsets.py 12.02s: lldb-shell :: Reproducer/TestVersionCheck.test 11.79s: lldb-api :: lang/objcxx/hide-runtime-values/TestObjCXXHideRuntimeValues.py 11.50s: lldb-api :: commands/expression/import-std-module/array/TestArrayFromStdModule.py 11.04s: lldb-api :: commands/expression/po_verbosity/TestPoVerbosity.py

Hide Details

Tests Times: -------------------------------------------------------------------------- [ Range ] :: [ Percentage ] :: [ Count ] -------------------------------------------------------------------------- [46.0s,48.0s) :: [ ] :: [ 1/2240] [44.0s,46.0s) :: [ ] :: [ 0/2240] [42.0s,44.0s) :: [ ] :: [ 0/2240] [40.0s,42.0s) :: [ ] :: [ 0/2240] [38.0s,40.0s) :: [ ] :: [ 0/2240] [36.0s,38.0s) :: [ ] :: [ 0/2240] [34.0s,36.0s) :: [ ] :: [ 1/2240] [32.0s,34.0s) :: [ ] :: [ 0/2240] [30.0s,32.0s) :: [ ] :: [ 0/2240] [28.0s,30.0s) :: [ ] :: [ 2/2240] [26.0s,28.0s) :: [ ] :: [ 0/2240] [24.0s,26.0s) :: [ ] :: [ 0/2240] [22.0s,24.0s) :: [ ] :: [ 0/2240] [20.0s,22.0s) :: [ ] :: [ 3/2240] [18.0s,20.0s) :: [ ] :: [ 1/2240] [16.0s,18.0s) :: [ ] :: [ 1/2240] [14.0s,16.0s) :: [ ] :: [ 1/2240] [12.0s,14.0s) :: [ ] :: [ 8/2240] [10.0s,12.0s) :: [ ] :: [ 11/2240] [ 8.0s,10.0s) :: [ ] :: [ 19/2240] [ 6.0s, 8.0s) :: [ ] :: [ 16/2240] [ 4.0s, 6.0s) :: [ ] :: [ 26/2240] [ 2.0s, 4.0s) :: [* ] :: [ 66/2240] [ 0.0s, 2.0s) :: [************************************* ] :: [2084/2240] -------------------------------------------------------------------------- ******************** Failed Tests (1578): lldb-api :: api/multithreaded/TestMultithreaded.py lldb-api :: functionalities/load_unload/TestLoadUnload.py lldb-api :: types/TestLongTypesExpr.py lldb-api :: lang/objc/foundation/TestSymbolTable.py lldb-api :: functionalities/mtc/simple/TestMTCSimple.py lldb-api :: types/TestRecursiveTypes.py lldb-api :: commands/process/attach/TestProcessAttach.py lldb-api :: lang/objc/ivar-IMP/TestObjCiVarIMP.py lldb-api :: functionalities/data-formatter/data-formatter-stl/libcxx/bitset/TestDataFormatterLibcxxBitset.py lldb-api :: lang/objc/objc_direct-methods/TestObjCDirectMethods.py lldb-api :: lang/c/stepping/TestThreadStepping.py lldb-api :: commands/expression/import-std-module/shared_ptr/TestSharedPtrFromStdModule.py lldb-api :: functionalities/data-formatter/varscript_formatting/TestDataFormatterVarScriptFormatting.py lldb-api :: python_api/type/TestTypeList.py lldb-api :: functionalities/process_group/TestChangeProcessGroup.py lldb-unit :: Utility/./UtilityTests/NameMatchesTest.Contains lldb-api :: functionalities/tail_call_frames/thread_step_out_message/TestArtificialFrameStepOutMessage.py lldb-unit :: Host/./HostTests/NativeProcessProtocolTest.ReadCStringFromMemory_MaxSize lldb-api :: linux/sepdebugsymlink/TestTargetSymbolsSepDebugSymlink.py lldb-shell :: SymbolFile/DWARF/DW_TAG_basic_type_DW_ATE_UTF_nonC.ll lldb-unit :: Utility/./UtilityTests/RangeDataVector.FindEntryIndexesThatContain_Overlap lldb-unit :: Utility/./UtilityTests/StructuredDataTest.StringDump lldb-shell :: SymbolFile/DWARF/deterministic-build.cpp lldb-unit :: Symbol/./SymbolTests/TestTypeSystemClang.AddMethodToObjCObjectType lldb-unit :: Utility/./UtilityTests/ScalarTest.LongLongAssigmentOperator lldb-api :: functionalities/data-formatter/pyobjsynthprovider/TestPyObjSynthProvider.py lldb-shell :: Process/UnsupportedLanguage.test lldb-unit :: Platform/./LLDBPlatformTests/PlatformAppleSimulatorTest.TestSimHasSimEnvionament lldb-unit :: Utility/./UtilityTests/UriParserTest.SchemeHostSeparator4 lldb-unit :: Target/./TargetTests/ExecutionContextTest.GetByteOrder lldb-unit :: Platform/./LLDBPlatformTests/PlatformAppleSimulatorTest.TestHostPlatformToSim lldb-api :: api/command-return-object/TestSBCommandReturnObject.py lldb-unit :: Utility/./UtilityTests/RangeTest.Slide lldb-api :: commands/target/stop-hook/delete/TestTargetStopHookDelete.py lldb-api :: commands/process/attach-resume/TestAttachResume.py lldb-api :: types/TestDoubleTypes.py lldb-shell :: SymbolFile/DWARF/DW_OP_piece-smaller-than-struct.s lldb-api :: lang/c/register_variables/TestRegisterVariables.py lldb-unit :: Process/./ProcessEventDataTests/ProcessEventDataTest.ShouldStop lldb-api :: lang/objc/foundation/TestObjCMethods.py lldb-shell :: Minidump/breakpad-symbols.test lldb-unit :: UnwindAssembly/x86/./UnwindAssemblyx86Tests/Testx86AssemblyInspectionEngine.TestSubRSP lldb-api :: functionalities/data-formatter/format-propagation/TestFormatPropagation.py lldb-api :: functionalities/inferior-assert/TestInferiorAssert.py lldb-shell :: Reproducer/TestSynchronous.test lldb-unit :: Utility/./UtilityTests/BinaryStreamTest.PutULEB128SixBytes lldb-shell :: Heap/heap-cstr.test lldb-api :: commands/expression/radar_8638051/Test8638051.py lldb-unit :: Language/CPlusPlus/./LanguageCPlusPlusTests/CPlusPlusLanguage.FindAlternateFunctionManglings lldb-unit :: Process/gdb-remote/./ProcessGdbRemoteTests/GDBRemoteClientBaseTest.SendContinueAndLateInterrupt lldb-unit :: Utility/./UtilityTests/StreamTest.ShiftOperatorChars lldb-unit :: Host/./HostTests/FileSystemTest.GetByteSize lldb-api :: functionalities/data-formatter/data-formatter-stl/libcxx/multiset/TestDataFormatterLibcxxMultiSet.py lldb-api :: functionalities/object-file/TestImageListMultiArchitecture.py lldb-api :: functionalities/breakpoint/comp_dir_symlink/TestCompDirSymLink.py lldb-shell :: Minidump/memory-region-from-module.yaml lldb-api :: functionalities/thread/concurrent_events/TestConcurrentDelayWatchBreak.py lldb-api :: functionalities/data-formatter/data-formatter-objc/TestDataFormatterObjCExpr.py lldb-api :: functionalities/memory/cache/TestMemoryCache.py lldb-api :: commands/expression/argument_passing_restrictions/TestArgumentPassingRestrictions.py lldb-api :: commands/trace/TestTraceLoad.py lldb-api :: functionalities/thread/concurrent_events/TestConcurrentTwoWatchpointThreads.py lldb-api :: tools/lldb-server/TestGdbRemoteRegisterState.py lldb-api :: lang/objc/objc-stepping/TestObjCStepping.py lldb-api :: tools/lldb-vscode/runInTerminal/TestVSCode_runInTerminal.py lldb-unit :: Process/Utility/./ProcessUtilityTests/ProcSMapTests/LinuxProcSMapsTestFixture.ParseSMapRegions/6 lldb-shell :: ObjectFile/MachO/lc_version_min.yaml lldb-api :: tools/lldb-vscode/launch/TestVSCode_launch.py lldb-unit :: Utility/./UtilityTests/Flags.AnySet lldb-api :: commands/target/modules/search-paths/insert/TestTargetModulesSearchpathsInsert.py lldb-unit :: Utility/./UtilityTests/BinaryStreamTest.PutULEB128FourBytes lldb-unit :: Utility/./UtilityTests/StreamTest.SetIndentLevel lldb-shell :: Commands/command-thread-select.test lldb-unit :: Language/Highlighting/./HighlighterTests/HighlighterTest.ClangCursorPosEndOfLine lldb-unit :: SymbolFile/NativePDB/./SymbolFileNativePDBTests/PDBFPOProgramToDWARFExpressionTests.InvalidAssignmentSingle lldb-unit :: Host/./HostTests/SocketTests/SocketTest.UDPGetConnectURI/ipv6 lldb-unit :: ScriptInterpreter/Python/./ScriptInterpreterPythonTests/PythonDataObjectsTest.TestBorrowedReferences lldb-api :: functionalities/thread/concurrent_events/TestConcurrentTwoWatchpointsOneDelayBreakpoint.py lldb-api :: functionalities/load_using_paths/TestLoadUsingPaths.py lldb-api :: functionalities/data-formatter/data-formatter-stl/libcxx/list/loop/TestDataFormatterLibcxxListLoop.py lldb-unit :: Platform/Android/./AdbClientTests/AdbClientTest.CreateByDeviceId lldb-api :: lang/cpp/elaborated-types/TestElaboratedTypes.py lldb-api :: functionalities/data-formatter/data-formatter-proper-plurals/TestFormattersOneIsSingular.py lldb-api :: functionalities/gdb_remote_client/TestRegDefinitionInParts.py lldb-api :: functionalities/recursion/TestValueObjectRecursion.py lldb-api :: commands/expression/regression-access-function-template-in-record/TestRegressionAccessFunctionTemplateInRecord.py lldb-shell :: SymbolFile/DWARF/anon_class_w_and_wo_export_symbols.ll lldb-api :: python_api/watchpoint/TestSetWatchpoint.py lldb-api :: commands/register/register/intel_xtended_registers/TestMPXRegisters.py lldb-api :: functionalities/data-formatter/refpointer-recursion/TestDataFormatterRefPtrRecursion.py lldb-api :: commands/watchpoints/multi_watchpoint_slots/TestWatchpointMultipleSlots.py lldb-unit :: Utility/./UtilityTests/StringExtractorTest.GetHexBytesAvail lldb-unit :: Utility/./UtilityTests/StreamTest.AddressPrefix lldb-api :: python_api/lldbutil/process/TestPrintStackTraces.py lldb-unit :: Process/minidump/./LLDBMinidumpTests/MinidumpParserTest.GetMemoryRegionInfoLinuxMapsError lldb-api :: functionalities/breakpoint/inlined_breakpoints/TestInlinedBreakpoints.py lldb-unit :: Utility/./UtilityTests/ConstStringTest.YAML lldb-api :: lang/cpp/class_types/TestClassTypes.py lldb-shell :: SymbolFile/DWARF/DW_AT_location-DW_AT_const_value.s lldb-unit :: Target/./TargetTests/ExecutionContextTest.GetByteOrderProcess lldb-unit :: UnwindAssembly/x86/./UnwindAssemblyx86Tests/Testx86AssemblyInspectionEngine.TestLEAVE lldb-unit :: Utility/./UtilityTests/OptionsWithRawTest.WhitespaceInput lldb-unit :: Utility/./UtilityTests/ScalarTest.ComparisonFloat lldb-api :: functionalities/source-map/TestTargetSourceMap.py lldb-api :: macosx/duplicate-archive-members/TestDuplicateMembers.py lldb-api :: iohandler/resize/TestIOHandlerResize.py lldb-api :: functionalities/tail_call_frames/ambiguous_tail_call_seq1/TestAmbiguousTailCallSeq1.py lldb-api :: commands/expression/persist_objc_pointeetype/TestPersistObjCPointeeType.py lldb-api :: functionalities/plugins/python_os_plugin/TestPythonOSPlugin.py lldb-unit :: Utility/./UtilityTests/StreamTest.PutRawBytesToMixedEndian lldb-api :: lang/cpp/signed_types/TestSignedTypes.py lldb-unit :: Interpreter/./InterpreterTests/CompletionTest.DirCompletionAbsolute lldb-unit :: Language/Highlighting/./HighlighterTests/HighlighterTest.ClangCursorPosAfterOtherToken lldb-api :: lang/cpp/thread_local/TestThreadLocal.py lldb-api :: commands/process/launch-with-shellexpand/TestLaunchWithShellExpand.py lldb-api :: functionalities/breakpoint/breakpoint_language/TestBreakpointLanguage.py lldb-api :: commands/gui/basicdebug/TestGuiBasicDebug.py lldb-api :: functionalities/gdb_remote_client/TestNoWatchpointSupportInfo.py lldb-shell :: Breakpoint/debug_addrx.test lldb-unit :: Host/./HostTests/ProcessLaunchInfoTest.Constructor lldb-api :: lang/objcxx/class-name-clash/TestNameClash.py lldb-shell :: ObjectFile/ELF/many-sections.s lldb-api :: python_api/sbdata/TestSBData.py lldb-unit :: Target/./TargetTests/RemoteAwarePlatformTest.TestResolveExecutabelOnClientByPlatform lldb-api :: functionalities/breakpoint/move_nearest/TestMoveNearest.py lldb-unit :: Expression/./ExpressionTests/DiagnosticManagerTest.GetStringSeverityLabels lldb-unit :: Host/./HostTests/SocketTests/SocketTest.UDPConnect/ipv6 lldb-unit :: Utility/./UtilityTests/FileSpecTest.CopyByAppendingPathComponent lldb-unit :: Process/minidump/./LLDBMinidumpTests/RegisterContextMinidump.ConvertMinidumpContext_x86_32 lldb-unit :: Utility/./UtilityTests/VMRange.CollectionContains lldb-unit :: Utility/./UtilityTests/StringExtractorTest.GetHexBytesAvail_Underflow lldb-unit :: Utility/./UtilityTests/RangeTest.ClearWithStarAddress lldb-unit :: Utility/./UtilityTests/OptionsWithRawTest.ArgsButNoDelimiter lldb-api :: functionalities/data-formatter/data-formatter-stl/libcxx/iterator/TestDataFormatterLibccIterator.py lldb-unit :: Expression/./ExpressionTests/DiagnosticManagerTest.PutStringSeverities lldb-api :: lang/cpp/covariant-return-types/TestCovariantReturnTypes.py lldb-api :: commands/expression/invalid-args/TestInvalidArgsExpression.py lldb-unit :: Symbol/./SymbolTests/TestTypeSystemClang.TestOwningModule lldb-unit :: Utility/./UtilityTests/RangeTest.DefaultConstructor lldb-api :: python_api/exprpath_synthetic/TestExprPathSynthetic.py lldb-api :: functionalities/breakpoint/hardware_breakpoints/write_memory_with_hw_breakpoint/TestWriteMemoryWithHWBreakpoint.py lldb-shell :: SymbolFile/DWARF/gnu-style-compression.cpp lldb-unit :: tools/lldb-server/tests/./LLDBServerTests/StandardStartupTest.TestStopReplyContainsThreadPcs lldb-unit :: Utility/./UtilityTests/ArgsTest.ReplaceArgumentAtIndexFarOutOfRange lldb-api :: commands/expression/ignore-artificial-constructors/TestIgnoreArtificialConstructors.py lldb-unit :: Symbol/./SymbolTests/DWARFCallFrameInfoTest.Basic_eh lldb-api :: functionalities/data-formatter/data-formatter-python-synth/TestDataFormatterPythonSynth.py lldb-api :: api/log/TestAPILog.py lldb-api :: functionalities/data-formatter/data-formatter-objc/TestDataFormatterObjCNSBundle.py lldb-api :: arm/emulation/TestEmulations.py lldb-api :: commands/expression/radar_9531204/TestPrintfAfterUp.py lldb-unit :: SymbolFile/DWARF/./SymbolFileDWARFTests/SymbolFileDWARFTests.TestAbbrevInvalidNULLTag lldb-api :: functionalities/breakpoint/breakpoint_locations/TestBreakpointLocations.py lldb-api :: lang/cpp/class_static/TestStaticVariables.py lldb-api :: python_api/objc_type/TestObjCType.py lldb-shell :: SymbolFile/Breakpad/line-table-edgecases.test lldb-api :: commands/expression/import-std-module/deque-basic/TestDequeFromStdModule.py lldb-unit :: Host/./HostTests/SocketTests/SocketTest.TCPGetAddress/ipv6 lldb-unit :: Utility/./UtilityTests/BinaryStreamTest.PutULEB128SevenBytes lldb-api :: functionalities/darwin_log/filter/regex/activity/TestDarwinLogFilterRegexActivity.py lldb-shell :: Quit/TestQuitExitCodeNonInt.test lldb-unit :: Utility/./UtilityTests/StringListTest.Join lldb-unit :: ScriptInterpreter/Python/./ScriptInterpreterPythonTests/PythonDataObjectsTest.TestPythonListManipulation lldb-unit :: Symbol/./SymbolTests/TestTypeSystemClang.TemplateArguments lldb-api :: tools/lldb-server/inferior-crash/TestGdbRemoteAbort.py lldb-api :: functionalities/data-formatter/builtin-formats/TestBuiltinFormats.py lldb-unit :: UnwindAssembly/x86/./UnwindAssemblyx86Tests/Testx86AssemblyInspectionEngine.TestPushRBP lldb-shell :: SymbolFile/DWARF/split-dwarf-inlining.cpp lldb-unit :: Expression/./ExpressionTests/ClangHostTest.ComputeClangResourceDirectory lldb-unit :: Utility/./UtilityTests/StringExtractorTest.GetHexU8_Underflow_NoEof lldb-unit :: Utility/./UtilityTests/StringExtractorTest.GetHexU8_InvalidHex lldb-api :: functionalities/abbreviation/TestAbbreviations.py lldb-shell :: Register/x86-64-read.test lldb-api :: python_api/formatters/TestFormattersSBAPI.py lldb-unit :: Process/gdb-remote/./ProcessGdbRemoteTests/GDBRemoteCommunicationClientTest.SendStopTracePacket lldb-api :: commands/expression/char/TestExprsChar.py lldb-unit :: Process/Utility/./ProcessUtilityTests/ProcSMapTests/LinuxProcSMapsTestFixture.ParseSMapRegions/3 lldb-api :: lang/c/complex/TestComplexC99.py lldb-unit :: Process/gdb-remote/./ProcessGdbRemoteTests/GDBRemoteClientBaseTest.SendContinueDelegateInterface lldb-shell :: ObjectFile/PECOFF/invalid-export-table.yaml lldb-api :: benchmarks/libcxxmap/TestBenchmarkLibcxxMap.py lldb-unit :: Utility/./UtilityTests/StringListTest.CopyListEmpty lldb-api :: functionalities/show_location/TestShowLocationDwarf5.py lldb-unit :: Expression/./ExpressionTests/DWARFExpression.DW_OP_piece lldb-shell :: Minidump/fb-dump.test lldb-unit :: ScriptInterpreter/Python/./ScriptInterpreterPythonTests/PythonDataObjectsTest.TestPythonCallableCheck lldb-api :: functionalities/step_scripted/TestStepScripted.py lldb-api :: lang/cpp/modules-import/TestCXXModulesImport.py lldb-unit :: Utility/./UtilityTests/AnsiTerminal.AtEnd lldb-api :: functionalities/breakpoint/breakpoint_callback_command_source/TestBreakpointCallbackCommandSource.py lldb-unit :: Expression/./ExpressionTests/DiagnosticManagerTest.HasFixits lldb-unit :: ScriptInterpreter/Python/./ScriptInterpreterPythonTests/PythonDataObjectsTest.TestPythonTupleToStructuredList lldb-api :: functionalities/fat_archives/TestFatArchives.py lldb-api :: lang/c/function_types/TestFunctionTypes.py lldb-shell :: ScriptInterpreter/Python/fail_breakpoint_oneline.test lldb-api :: commands/watchpoints/watchpoint_set_command/TestWatchLocationWithWatchSet.py lldb-api :: lang/cpp/alignas_base_class/TestAlignAsBaseClass.py lldb-unit :: Utility/./UtilityTests/StringListTest.SplitIntoLinesSingleTrailingCR lldb-api :: functionalities/data-formatter/data-formatter-skip-summary/TestDataFormatterSkipSummary.py lldb-shell :: SymbolFile/DWARF/DW_OP_piece-struct.s lldb-api :: functionalities/data-formatter/data-formatter-synthtype/TestDataFormatterSynthType.py lldb-api :: python_api/sbstructureddata/TestStructuredDataAPI.py lldb-api :: commands/command/delete/TestCommandDelete.py lldb-unit :: ScriptInterpreter/Python/./ScriptInterpreterPythonTests/PythonDataObjectsTest.TestDictionaryResolutionWithDot lldb-unit :: Utility/./UtilityTests/StringExtractorTest.GetU64BigEndian lldb-unit :: Utility/./UtilityTests/StringListTest.Assignment lldb-unit :: Language/Highlighting/./HighlighterTests/HighlighterTest.Colons lldb-unit :: Utility/./UtilityTests/LogChannelTest.List lldb-api :: macosx/add-dsym/TestAddDsymMidExecutionCommand.py lldb-api :: functionalities/thread/concurrent_events/TestConcurrentWatchBreak.py lldb-shell :: SymbolFile/DWARF/childless-compile-unit.s lldb-shell :: ObjectFile/Breakpad/sections-trailing-func.test lldb-unit :: Process/minidump/./LLDBMinidumpTests/MinidumpParserTest.GetArchitectureWindows lldb-api :: linux/aarch64/mte_memory_region/TestAArch64LinuxMTEMemoryRegion.py lldb-api :: commands/expression/vector_of_enums/TestVectorOfEnums.py lldb-shell :: Reproducer/Functionalities/TestExpressionEvaluation.test lldb-unit :: Utility/./UtilityTests/ArgsTest.StringListConstructor lldb-api :: functionalities/data-formatter/data-formatter-cpp/TestDataFormatterCpp.py lldb-api :: functionalities/thread/num_threads/TestNumThreads.py lldb-unit :: UnwindAssembly/x86/./UnwindAssemblyx86Tests/Testx86AssemblyInspectionEngine.TestPopRBPWithREX lldb-unit :: Process/gdb-remote/./ProcessGdbRemoteTests/GDBRemoteCommunicationTest.ReadPacket_checksum lldb-shell :: ObjectFile/ELF/compressed-sections.yaml lldb-api :: functionalities/thread/multi_break/TestMultipleBreakpoints.py lldb-api :: functionalities/data-formatter/var-in-aggregate-misuse/TestVarInAggregateMisuse.py lldb-unit :: Process/Utility/./ProcessUtilityTests/RegisterContext_x86Test.FullToAbridgedTagWord lldb-unit :: Process/gdb-remote/./ProcessGdbRemoteTests/GDBRemoteCommunicationClientTest.SendSignalsToIgnore lldb-api :: functionalities/data-formatter/poarray/TestPrintObjectArray.py lldb-unit :: Utility/./UtilityTests/LogTest.Register lldb-unit :: ScriptInterpreter/Python/./ScriptInterpreterPythonTests/PythonDataObjectsTest.TestPythonTupleValues lldb-unit :: Symbol/./SymbolTests/TestTypeSystemClang.TestDisplayNameEmpty lldb-shell :: ObjectFile/ELF/PT_LOAD-overlap-section.yaml lldb-api :: commands/command/script/import/TestImport.py lldb-api :: api/listeners/TestListener.py lldb-unit :: UnwindAssembly/x86/./UnwindAssemblyx86Tests/Testx86AssemblyInspectionEngine.TestStackRealign32BitDisp_x86_64 lldb-api :: types/TestLongTypes.py lldb-unit :: Expression/./ExpressionTests/ClangHostTest.MacOSX lldb-api :: functionalities/data-formatter/data-formatter-stl/libcxx/string/TestDataFormatterLibcxxString.py lldb-api :: functionalities/type_completion/TestTypeCompletion.py lldb-shell :: ObjectFile/ELF/PT_LOAD-overlap.yaml lldb-unit :: Utility/./UtilityTests/UriParserTest.BadPort2 lldb-unit :: Host/./HostTests/FileSystemTest.FileAndDirectoryComponents lldb-unit :: Utility/./UtilityTests/StreamTest.PutSLEB128 lldb-unit :: Utility/./UtilityTests/StringExtractorTest.InitMisc lldb-api :: commands/expression/import-std-module/non-module-type-separation/TestNonModuleTypeSeparation.py lldb-unit :: Process/gdb-remote/./ProcessGdbRemoteTests/GDBRemoteCommunicationClientTest.GetModulesInfoInvalidResponse lldb-unit :: Utility/./UtilityTests/NameMatchesTest.EndsWith lldb-api :: lang/cpp/enum_types/TestCPP11EnumTypes.py lldb-shell :: Commands/command-backtrace.test lldb-shell :: Unwind/thread-step-out-ret-addr-check.test lldb-api :: lang/objc/variadic_methods/TestVariadicMethods.py lldb-unit :: Expression/./ExpressionTests/CppModuleConfigurationTest.AmbiguousLibCpp lldb-unit :: Symbol/./SymbolTests/TestTypeSystemClang.TestRecordHasFields lldb-unit :: Expression/./ExpressionTests/CppModuleConfigurationTest.MissingLibCpp lldb-unit :: Utility/./UtilityTests/StringExtractorTest.GetU64LittleEndian lldb-api :: commands/expression/no-deadlock/TestExprDoesntBlock.py lldb-unit :: Host/./HostTests/NativeProcessProtocolTest.SetBreakpointFailRead lldb-unit :: Expression/./ExpressionTests/ClangExpressionDeclMapTest.TestPersistentDeclLookup lldb-unit :: Utility/./UtilityTests/UriParserTest.BracketedHostnameWithPortIPv6 lldb-unit :: Utility/./UtilityTests/OptionsWithRawTest.EmptySuffix lldb-api :: commands/watchpoints/multiple_threads/TestWatchpointMultipleThreads.py lldb-unit :: Utility/./UtilityTests/StreamTeeTest.Write lldb-api :: functionalities/thread/concurrent_events/TestConcurrentDelaySignalWatch.py lldb-shell :: Register/x86-multithread-read.test lldb-unit :: Utility/./UtilityTests/ArgsTest.GetArgumentArrayRef lldb-api :: lang/objc/modules-non-objc-target/TestObjCModulesNonObjCTarget.py lldb-api :: commands/frame/diagnose/virtual-method-call/TestDiagnoseDereferenceVirtualMethodCall.py lldb-unit :: Expression/./ExpressionTests/ClangExpressionDeclMapTest.TestUnknownIdentifierLookup lldb-api :: tools/lldb-vscode/stackTrace/TestVSCode_stackTrace.py lldb-api :: functionalities/signal/raise/TestRaise.py lldb-api :: functionalities/thread/concurrent_events/TestConcurrentSignalNWatchNBreak.py lldb-unit :: Expression/./ExpressionTests/DiagnosticManagerTest.AddDiagnostic lldb-unit :: Utility/./UtilityTests/StringListTest.PopBack lldb-api :: functionalities/breakpoint/cpp/TestCPPBreakpointLocations.py lldb-api :: commands/watchpoints/hello_watchlocation/TestWatchLocation.py lldb-unit :: Process/gdb-remote/./ProcessGdbRemoteTests/GDBRemoteCommunicationClientTest.SendStartTracePacket lldb-shell :: ObjectFile/PECOFF/basic-info-arm64.yaml lldb-unit :: Host/./HostTests/SocketTests/SocketTest.TCPListen0GetPort/ipv6 lldb-unit :: ObjectFile/ELF/./ObjectFileELFTests/ObjectFileELFTest.GetSymtab_NoSymEntryPointArmAddressClass lldb-api :: commands/expression/unicode-in-variable/TestUnicodeInVariable.py lldb-api :: functionalities/data-formatter/data-formatter-stl/libcxx/atomic/TestLibCxxAtomic.py lldb-unit :: Utility/./UtilityTests/ReproducerTest.SetCapture lldb-unit :: Utility/./UtilityTests/StringExtractorTest.GetU32BigEndian lldb-api :: lang/cpp/unicode-literals/TestUnicodeLiterals.py lldb-unit :: Utility/./UtilityTests/ScalarTest.TruncOrExtendTo lldb-unit :: Core/./LLDBCoreTests/RichManglingContextTest.SwitchProvider lldb-api :: functionalities/ptr_refs/TestPtrRefs.py lldb-api :: commands/platform/basic/TestPlatformPython.py lldb-api :: lang/c/unions/TestUnionMembers.py lldb-unit :: ScriptInterpreter/Python/./ScriptInterpreterPythonTests/PythonDataObjectsTest.TestResetting lldb-unit :: Core/./LLDBCoreTests/MangledTest.EmptyForInvalidName lldb-api :: commands/expression/persistent_ptr_update/TestPersistentPtrUpdate.py lldb-api :: functionalities/breakpoint/address_breakpoints/TestBadAddressBreakpoints.py lldb-api :: macosx/builtin-debugtrap/TestBuiltinDebugTrap.py lldb-api :: macosx/macCatalyst/TestMacCatalyst.py lldb-unit :: Host/./HostTests/Host.GetEnvironment lldb-unit :: Utility/./UtilityTests/ProcessInstanceInfo.Yaml lldb-api :: lang/cpp/unique-types/TestUniqueTypes.py lldb-unit :: Utility/./UtilityTests/CompletionRequest.FakeLastArg lldb-api :: functionalities/breakpoint/breakpoint_in_delayslot/TestAvoidBreakpointInDelaySlot.py lldb-unit :: ScriptInterpreter/Python/./ScriptInterpreterPythonTests/PythonDataObjectsTest.TestPythonTupleSize lldb-api :: functionalities/thread/concurrent_events/TestConcurrentSignalDelayBreak.py lldb-unit :: Process/minidump/./LLDBMinidumpTests/RegisterContextMinidump.CheckRegisterContextMinidump_ARM lldb-api :: lang/c/blocks/TestBlocks.py lldb-shell :: ObjectFile/ELF/PT_LOAD-empty.yaml lldb-api :: commands/log/invalid-args/TestInvalidArgsLog.py lldb-shell :: Commands/command-breakpoint-col.test lldb-unit :: Utility/./UtilityTests/DataExtractorTest.GetCStrAtEnd lldb-api :: tools/lldb-vscode/breakpoint/TestVSCode_setBreakpoints.py lldb-unit :: Host/./HostTests/File.GetStreamFromDescriptor lldb-unit :: Utility/./UtilityTests/BinaryStreamTest.PutSLEB128TwoBytes lldb-unit :: Utility/./UtilityTests/StringListTest.ShiftMove lldb-unit :: Utility/./UtilityTests/RecordReplayTest.InstrumentedBarPtr lldb-api :: commands/expression/import-std-module/retry-with-std-module/TestRetryWithStdModule.py lldb-unit :: Language/CLanguages/./LanguageCLanguagesTests/CLanguages.LookupCLanguagesByLanguageType lldb-unit :: Utility/./UtilityTests/StringLexerTest.PutBack lldb-api :: tools/lldb-server/TestGdbRemoteKill.py lldb-unit :: Utility/./UtilityTests/StreamTest.PutCString lldb-unit :: Utility/./UtilityTests/RangeTest.Clear lldb-shell :: ObjectFile/PECOFF/symbol.yaml lldb-unit :: Host/./HostTests/HostInfoTest.GetXcodeSDK lldb-unit :: UnwindAssembly/x86/./UnwindAssemblyx86Tests/Testx86AssemblyInspectionEngine.TestPushExtended lldb-unit :: Symbol/./SymbolTests/TestScratchTypeSystemClang.InferSubASTFromLangOpts lldb-api :: commands/expression/import-std-module/conflicts/TestStdModuleWithConflicts.py lldb-unit :: Expression/./ExpressionTests/DWARFExpression.DW_OP_pick lldb-unit :: Language/Highlighting/./HighlighterTests/HighlighterTest.ClangTrailingBackslashMissingNewLine lldb-api :: commands/expression/issue_11588/Test11588.py lldb-shell :: Settings/TestDisassemblyFormat.test lldb-shell :: ObjectFile/ELF/section-types.yaml lldb-unit :: Symbol/./SymbolTests/SymbolsTest.LocateExecutableSymbolFileForUnknownExecutableAndMissingSymbolFile lldb-api :: lang/cpp/non-type-template-param/TestCppNonTypeTemplateParam.py lldb-unit :: Utility/./UtilityTests/ArgsTest.ReplaceArgumentAtIndexOutOfRange lldb-api :: lang/cpp/wchar_t/TestCxxWCharT.py lldb-api :: functionalities/thread/exit_during_step/TestExitDuringStep.py lldb-api :: tools/lldb-vscode/completions/TestVSCode_completions.py lldb-api :: linux/thread/create_during_instruction_step/TestCreateDuringInstructionStep.py lldb-unit :: SymbolFile/NativePDB/./SymbolFileNativePDBTests/PDBFPOProgramToDWARFExpressionTests.DependencyChain lldb-unit :: SymbolFile/DWARF/./SymbolFileDWARFTests/SymbolFileDWARFTests.TestAbilitiesForDWARF lldb-unit :: Process/minidump/./LLDBMinidumpTests/RegisterContextMinidump.ConvertMinidumpContext_x86_64 lldb-api :: tools/lldb-server/TestAppleSimulatorOSType.py lldb-unit :: Utility/./UtilityTests/PassiveReplayTest.InstrumentedBarRef lldb-api :: functionalities/inferior-crashing/recursive-inferior/TestRecursiveInferior.py lldb-unit :: SymbolFile/DWARF/./SymbolFileDWARFTests/SymbolFileDWARFTests.TestAbbrevMissingTerminator lldb-api :: functionalities/gdb_remote_client/TestJLink6Armv7RegisterDefinition.py lldb-api :: commands/frame/select/TestFrameSelect.py lldb-unit :: Utility/./UtilityTests/StreamTeeTest.AppendStream lldb-shell :: SymbolFile/DWARF/clang-ast-from-dwarf-unamed-and-anon-structs.cpp lldb-shell :: Reproducer/TestDebugSymbols.test lldb-api :: functionalities/darwin_log/basic/TestDarwinLogBasic.py lldb-api :: functionalities/breakpoint/serialize/TestBreakpointSerialization.py lldb-unit :: Host/./HostTests/SocketTests/SocketTest.DecodeHostAndPort/ipv4 lldb-api :: functionalities/thread/create_during_step/TestCreateDuringStep.py lldb-api :: commands/settings/TestSettings.py lldb-api :: python_api/sblaunchinfo/TestSBLaunchInfo.py lldb-unit :: Utility/./UtilityTests/NameMatchesTest.Equals lldb-api :: functionalities/jitloader_gdb/TestJITLoaderGDB.py lldb-unit :: Utility/./UtilityTests/LogChannelTest.Enable lldb-api :: python_api/frame/inlines/TestInlinedFrame.py lldb-api :: macosx/function-starts/TestFunctionStarts.py lldb-api :: benchmarks/startup/TestStartupDelays.py lldb-unit :: Process/minidump/./LLDBMinidumpTests/MinidumpParserTest.GetThreadContext_x86_64 lldb-shell :: SymbolFile/DWARF/debug_loclists-dwo.s lldb-api :: macosx/profile_vrs_detach/TestDetachVrsProfile.py lldb-api :: lang/objcxx/cxx-bridged-po/TestObjCXXBridgedPO.py lldb-api :: functionalities/target_var/no_vars/TestTargetVarNoVars.py lldb-unit :: SymbolFile/NativePDB/./SymbolFileNativePDBTests/PDBFPOProgramToDWARFExpressionTests.MissingTargetRegister lldb-api :: python_api/watchpoint/watchlocation/TestSetWatchlocation.py lldb-api :: functionalities/breakpoint/breakpoint_ignore_count/TestBreakpointIgnoreCount.py lldb-shell :: ObjectFile/wasm/embedded-debug-sections.yaml lldb-unit :: UnwindAssembly/x86/./UnwindAssemblyx86Tests/Testx86AssemblyInspectionEngine.TestPopEBX lldb-shell :: SymbolFile/DWARF/debug_ranges.s lldb-unit :: Utility/./UtilityTests/StreamTest.PutBytesAsRawHex8ToMixedEndian lldb-unit :: Target/./TargetTests/MemoryRegionInfoTest.Formatv lldb-unit :: Utility/./UtilityTests/RegularExpression.Match lldb-shell :: Driver/TestSingleQuote.test lldb-api :: lang/cpp/lambdas/TestLambdas.py lldb-unit :: Process/minidump/./LLDBMinidumpTests/MinidumpParserTest.MinidumpDuplicateModuleMappedFirst lldb-unit :: Utility/./UtilityTests/StreamTest.AddressPrefixAndSuffix lldb-shell :: lldb-server/TestErrorMessages.test lldb-unit :: ScriptInterpreter/Python/./ScriptInterpreterPythonTests/PythonDataObjectsTest.TestPythonString lldb-api :: functionalities/data-formatter/data-formatter-stl/libcxx/variant/TestDataFormatterLibcxxVariant.py lldb-api :: lang/cpp/auto/TestCPPAuto.py lldb-api :: commands/expression/expr-in-syscall/TestExpressionInSyscall.py lldb-unit :: Host/./HostTests/SocketTests/SocketTest.UDPGetConnectURI/ipv4 lldb-unit :: Utility/./UtilityTests/BinaryStreamTest.PutULEB128FiveBytes lldb-unit :: Utility/./UtilityTests/DataExtractorTest.GetCStrAtNullOffset lldb-unit :: Utility/./UtilityTests/RangeTest.Constructor lldb-api :: macosx/safe-to-func-call/TestSafeFuncCalls.py lldb-api :: functionalities/float-display/TestFloatDisplay.py lldb-unit :: Utility/./UtilityTests/StateTest.Formatv lldb-api :: lang/c/step-target/TestStepTarget.py lldb-shell :: Breakpoint/single-file-split-dwarf.test lldb-unit :: Utility/./UtilityTests/StatusTest.ErrorCodeConstructor lldb-api :: python_api/disassemble-raw-data/TestDisassemble_VST1_64.py lldb-api :: commands/expression/formatters/TestFormatters.py lldb-api :: python_api/symbol-context/TestSymbolContext.py lldb-unit :: Utility/./UtilityTests/DataExtractorTest.GetDouble lldb-api :: commands/expression/import-std-module/basic/TestImportStdModule.py lldb-unit :: UnwindAssembly/x86/./UnwindAssemblyx86Tests/Testx86AssemblyInspectionEngine.TestAddESP lldb-unit :: Utility/./UtilityTests/ScalarTest.GetValue lldb-unit :: DataFormatter/./LLDBFormatterTests/TypeMatcherTests.CreatedBySameMatchStringExactNamePrefixes lldb-unit :: Host/./HostTests/NativeProcessProtocolTest.ReadCStringFromMemory_CrossPageBoundary lldb-unit :: Utility/./UtilityTests/StreamTest.PutHex64ByteOrderBig lldb-api :: commands/expression/class_template_specialization_empty_pack/TestClassTemplateSpecializationParametersHandling.py lldb-unit :: Process/minidump/./LLDBMinidumpTests/MinidumpParserTest.GetArchitecture lldb-unit :: Utility/./UtilityTests/DataExtractorTest.GetDoubleUnaligned lldb-unit :: Utility/./UtilityTests/EnvironmentTest.EnvpConstruction lldb-unit :: ObjectFile/PECOFF/./ObjectFilePECOFFTests/PECallFrameInfoTest.Frame_reg_eh lldb-unit :: Utility/./UtilityTests/LogChannelEnabledTest.LLDB_LOG_ERROR lldb-api :: functionalities/data-formatter/data-formatter-objc/cmtime/TestDataFormatterCMTime.py lldb-unit :: Utility/./UtilityTests/RegularExpression.Empty lldb-api :: lang/c/complex_int/TestComplexInt.py lldb-shell :: ObjectFile/wasm/unified-debug-sections.yaml lldb-unit :: Utility/./UtilityTests/SubsystemRAIITest.SubsystemWithErrorFailure lldb-api :: commands/expression/import-std-module/vector-dbg-info-content/TestDbgInfoContentVectorFromStdModule.py lldb-api :: commands/command/source/TestCommandSource.py lldb-unit :: Utility/./UtilityTests/Flags.Test lldb-unit :: Symbol/./SymbolTests/Type.GetTypeScopeAndBasename lldb-shell :: Reproducer/TestRelativePath.test lldb-unit :: Utility/./UtilityTests/StreamTest.PutHex64ByteOrderLittle lldb-unit :: Utility/./UtilityTests/AnsiTerminal.Twice lldb-api :: lang/cpp/inlines/TestInlines.py lldb-unit :: Host/./HostTests/SocketTests/SocketTest.TCPListen0GetPort/ipv4 lldb-unit :: Process/gdb-remote/./ProcessGdbRemoteTests/GDBRemoteClientBaseTest.SendContinueAndInterrupt lldb-api :: functionalities/darwin_log/filter/exact_match/message/TestDarwinLogFilterMatchMessage.py lldb-shell :: ObjectFile/ELF/minidebuginfo-corrupt-xz.yaml lldb-unit :: Editline/./EditlineTests/EditlineTestFixture.EditlineReceivesSingleLineText lldb-unit :: Utility/./UtilityTests/UriParserTest.TypicalPortPathIPv6 lldb-unit :: ScriptInterpreter/Python/./ScriptInterpreterPythonTests/PythonDataObjectsTest.TestTypeNameResolutionNoDot lldb-api :: commands/apropos/basic/TestApropos.py lldb-unit :: Core/./LLDBCoreTests/RichManglingContextTest.IPDRealloc lldb-unit :: Utility/./UtilityTests/Flags.Reset lldb-api :: functionalities/tail_call_frames/inlining_and_tail_calls/TestInliningAndTailCalls.py lldb-unit :: Utility/./UtilityTests/Flags.GetBitSize lldb-unit :: Utility/./UtilityTests/StreamTest.AddressNoSuffix lldb-api :: functionalities/inferior-changed/TestInferiorChanged.py lldb-unit :: Expression/./ExpressionTests/CppModuleConfigurationTest.UnknownLibCppFile lldb-api :: iohandler/autosuggestion/TestAutosuggestion.py lldb-api :: functionalities/data-formatter/data-formatter-caching/TestDataFormatterCaching.py lldb-api :: commands/gui/basic/TestGuiBasic.py lldb-api :: functionalities/data-formatter/data-formatter-enum-format/TestDataFormatterEnumFormat.py lldb-unit :: Language/Highlighting/./HighlighterTests/HighlighterTest.ClangTrailingBackslashBeforeNewline lldb-unit :: Utility/./UtilityTests/FileSpecTest.Yaml lldb-unit :: Symbol/./SymbolTests/TestClangASTImporter.MetadataPropagationAfterCopying lldb-api :: lang/objc/bitfield_ivars/TestBitfieldIvars.py lldb-api :: lang/cpp/dynamic-value/TestDynamicValue.py lldb-api :: functionalities/testid/TestTestId.py lldb-unit :: Host/./HostTests/FileSystemTest.EmptyTest lldb-unit :: Process/minidump/./LLDBMinidumpTests/MinidumpParserTest.MinidumpDuplicateModuleMappedSecond lldb-unit :: Core/./LLDBCoreTests/ModuleSpecTest.TestELFFile lldb-api :: functionalities/avoids-fd-leak/TestFdLeak.py lldb-api :: functionalities/gdb_remote_client/TestProcessConnect.py lldb-api :: functionalities/data-formatter/nsdictionarysynth/TestNSDictionarySynthetic.py lldb-shell :: Watchpoint/SetErrorCases.test lldb-unit :: Utility/./UtilityTests/StringExtractorTest.GetNameColonValueNoSemicolon lldb-api :: python_api/function_symbol/TestDisasmAPI.py lldb-shell :: Driver/TestProcessAttach.test lldb-unit :: Utility/./UtilityTests/NameMatchesTest.Ignore lldb-shell :: SymbolFile/DWARF/module-ownership.mm lldb-api :: commands/gui/viewlarge/TestGuiViewLarge.py lldb-unit :: Interpreter/./InterpreterTests/OptionArgParserTest.toScriptLanguage lldb-unit :: Process/gdb-remote/./ProcessGdbRemoteTests/GDBRemoteCommunicationClientTest.GetMemoryRegionInfoInvalidResponse lldb-unit :: Utility/./UtilityTests/OptionsWithRawTest.ArgsButNoLeadingDash lldb-unit :: Utility/./UtilityTests/ScalarTest.Getters lldb-unit :: Host/./HostTests/SocketTests/SocketTest.TCPListen0ConnectAccept/ipv6 lldb-api :: functionalities/data-formatter/data-formatter-stl/libcxx/vector/TestDataFormatterLibcxxVector.py lldb-api :: functionalities/multiword-commands/TestMultiWordCommands.py lldb-unit :: Utility/./UtilityTests/CompletionRequest.TryCompleteCurrentArgMode lldb-api :: functionalities/data-formatter/stringprinter/TestStringPrinter.py lldb-api :: tools/lldb-server/libraries-svr4/TestGdbRemoteLibrariesSvr4Support.py lldb-unit :: Utility/./UtilityTests/CompletionRequest.TestCompletionOwnership lldb-api :: lang/objc/forward-decl/TestForwardDecl.py lldb-unit :: Utility/./UtilityTests/UriParserTest.MinimalPath lldb-api :: lang/cpp/virtual-functions/TestCppVirtualFunctions.py lldb-api :: macosx/find-dsym/deep-bundle/TestDeepBundle.py lldb-unit :: Utility/./UtilityTests/BinaryStreamTest.PutULEB128ThreeBytes lldb-unit :: Process/gdb-remote/./ProcessGdbRemoteTests/GDBRemoteCommunicationClientTest.WriteRegisterNoSuffix lldb-api :: functionalities/darwin_log/filter/regex/activity-chain/TestDarwinLogFilterRegexActivityChain.py lldb-api :: functionalities/data-formatter/data-formatter-script/TestDataFormatterScript.py lldb-api :: functionalities/data-formatter/data-formatter-objc/TestDataFormatterObjCNSData.py lldb-unit :: Utility/./UtilityTests/RangeDataVector.CustomSort lldb-api :: python_api/watchpoint/TestWatchpointIter.py lldb-unit :: ScriptInterpreter/Python/./ScriptInterpreterPythonTests/PythonDataObjectsTest.TestPythonStringToStr lldb-api :: python_api/disassemble-raw-data/TestDisassembleRawData.py lldb-unit :: Target/./TargetTests/ExecutionContextTest.GetByteOrderTarget lldb-api :: functionalities/data-formatter/data-formatter-objc/TestDataFormatterObjNSException.py lldb-unit :: Expression/./ExpressionTests/DiagnosticManagerTest.GetStringMultipleDiags lldb-unit :: Interpreter/./InterpreterTests/OptionArgParserTest.toBoolean lldb-shell :: Host/TestCustomShell.test lldb-api :: macosx/version_zero/TestGetVersionZeroVersion.py lldb-shell :: ObjectFile/ELF/netbsd-core-amd64.test lldb-unit :: Utility/./UtilityTests/StreamTest.ShiftOperatorPtr lldb-api :: types/TestShortType.py lldb-unit :: UnwindAssembly/x86/./UnwindAssemblyx86Tests/Testx86AssemblyInspectionEngine.TestPushEAX lldb-api :: python_api/lldbutil/TestSwigVersion.py lldb-unit :: Utility/./UtilityTests/BinaryStreamTest.PutSLEB128ThreeBytes lldb-shell :: SymbolFile/DWARF/DW_AT_const_value.s lldb-unit :: Utility/./UtilityTests/UriParserTest.BadPort lldb-api :: python_api/lldbutil/iter/TestLLDBIterator.py lldb-api :: commands/expression/import-std-module/sysroot/TestStdModuleSysroot.py lldb-api :: tools/lldb-server/TestGdbRemoteAttach.py lldb-unit :: DataFormatter/./LLDBFormatterTests/TypeMatcherTests.GetMatchStringExactName lldb-api :: tools/lldb-vscode/breakpoint-events/TestVSCode_breakpointEvents.py lldb-shell :: Quit/TestQuitExitCodeHex0.test lldb-unit :: ObjectFile/MachO/./ObjectFileMachOTests/ObjectFileMachOTest.ModuleFromSharedCacheInfo lldb-shell :: ScriptInterpreter/Python/sb_address_exception.test lldb-shell :: SymbolFile/Breakpad/line-table.test lldb-api :: commands/expression/import-std-module/pair/TestPairFromStdModule.py lldb-api :: functionalities/var_path/TestVarPath.py lldb-unit :: Utility/./UtilityTests/DataExtractorTest.UncommonAddressSize lldb-api :: test_utils/TestPExpectTest.py lldb-unit :: Utility/./UtilityTests/CompletionRequest.TryCompleteCurrentArgBad lldb-unit :: Utility/./UtilityTests/StringExtractorTest.GetHexBytes_Partial lldb-unit :: Utility/./UtilityTests/BinaryStreamTest.PutSLEB128One lldb-unit :: Utility/./UtilityTests/StringLexerTest.NextIfList lldb-shell :: Minidump/Windows/Sigsegv/sigsegv.test lldb-api :: sanity/TestSettingSkipping.py lldb-api :: commands/expression/rdar42038760/TestScalarURem.py lldb-api :: lang/objc/modules-hash-mismatch/TestClangModulesHashMismatch.py lldb-unit :: Platform/Android/./AdbClientTests/AdbClientTest.CreateByDeviceId_ByEnvVar lldb-api :: functionalities/gdb_remote_client/TestPlatformClient.py lldb-shell :: Commands/command-regex-delete.test lldb-api :: functionalities/data-formatter/data-formatter-stl/libcxx/deque/TestDataFormatterLibcxxDeque.py lldb-api :: commands/expression/deleting-implicit-copy-constructor/TestDeletingImplicitCopyConstructor.py lldb-unit :: Symbol/./SymbolTests/TestTypeSystemClang.TestDisplayName lldb-api :: functionalities/memory-region/TestMemoryRegion.py lldb-unit :: DataFormatter/./LLDBFormatterTests/FormatManagerTests.CompatibleLangs lldb-shell :: SymbolFile/DWARF/find-qualified-variable.cpp lldb-api :: functionalities/data-formatter/data-formatter-objc/TestDataFormatterObjCNSURL.py lldb-unit :: Utility/./UtilityTests/StatusTest.Formatv lldb-unit :: Utility/./UtilityTests/ArgsTest.TestArgv lldb-shell :: Unwind/eh-frame-dwarf-unwind.test lldb-unit :: Expression/./ExpressionTests/DiagnosticManagerTest.PutStringMultiple lldb-unit :: Utility/./UtilityTests/CompletionRequest.TryCompleteCurrentArgGood lldb-shell :: ScriptInterpreter/Python/python.test lldb-shell :: SymbolFile/symbol-binding.test lldb-unit :: Utility/./UtilityTests/StringExtractorTest.GetHexU8_Extra_NoEof lldb-unit :: Target/./TargetTests/MCBasedABI.MapRegisterName lldb-unit :: Interpreter/./InterpreterTests/OptionValueFileColonLine.setFromString lldb-unit :: DataFormatter/./LLDBFormatterTests/TypeMatcherTests.RegexName lldb-unit :: Process/gdb-remote/./ProcessGdbRemoteTests/GDBRemoteClientBaseTest.SendContinueAndInterrupt2PacketBug lldb-shell :: Recognizer/assert.test lldb-unit :: UnwindAssembly/x86/./UnwindAssemblyx86Tests/Testx86AssemblyInspectionEngine.TestPopESI lldb-api :: tools/lldb-vscode/attach/TestVSCode_attach.py lldb-unit :: Expression/./ExpressionTests/CppModuleConfigurationTest.LibCppV2 lldb-api :: lang/objc/foundation/TestFoundationDisassembly.py lldb-unit :: Utility/./UtilityTests/UriParserTest.BracketedHostname lldb-unit :: Utility/./UtilityTests/ArchSpecTest.YAML lldb-api :: functionalities/thread/jump/TestThreadJump.py lldb-unit :: Language/Highlighting/./HighlighterTests/HighlighterTest.ClangBraces lldb-unit :: UnwindAssembly/x86/./UnwindAssemblyx86Tests/Testx86AssemblyInspectionEngine.TestPushR13 lldb-api :: functionalities/breakpoint/source_regexp/TestSourceRegexBreakpoints.py lldb-unit :: Platform/./LLDBPlatformTests/PlatformDarwinTest.TestParseVersionBuildDir lldb-shell :: ObjectFile/wasm/basic.yaml lldb-api :: sample_test/TestSampleInlineTest.py lldb-unit :: Target/./TargetTests/ModuleCacheTest.GetAndPutStrangeHostname lldb-unit :: Host/./HostTests/FileSystemTest.Readable lldb-api :: functionalities/inferior-crashing/TestInferiorCrashing.py lldb-shell :: lldb-server/TestGdbserverPort.test lldb-unit :: Utility/./UtilityTests/StringListTest.RemoveBlankLines lldb-unit :: Symbol/./SymbolTests/TestClangASTImporter.RecordLayout lldb-unit :: Symbol/./SymbolTests/TestTypeSystemClang.TestGetEnumIntegerTypeBasicTypes lldb-unit :: Process/gdb-remote/./ProcessGdbRemoteTests/GDBRemoteClientBaseTest.SendContinueDelegateStructuredDataReceipt lldb-api :: commands/expression/namespace_local_var_same_name_obj_c/TestNamespaceLocalVarSameNameObjC.py lldb-unit :: Utility/./UtilityTests/DataExtractorTest.GetCStrEmpty lldb-shell :: SymbolFile/Breakpad/unwind-via-stack-win.test lldb-unit :: Utility/./UtilityTests/StreamTest.PutBytesAsRawHex8ToBigEndian lldb-unit :: Symbol/./SymbolTests/LineEntryTest.GetSameLineContiguousAddressRangeNestedInline lldb-unit :: Process/Utility/./ProcessUtilityTests/ProcMapTests/LinuxProcMapsTestFixture.ParseMapRegions/5 lldb-unit :: Utility/./UtilityTests/FileSpecTest.Equal lldb-api :: tools/lldb-server/TestGdbRemote_vCont.py lldb-unit :: Utility/./UtilityTests/XcodeSDKTest.FindXcodeContentsDirectoryInPath lldb-unit :: Language/CPlusPlus/./LanguageCPlusPlusTests/CPlusPlusLanguage.ExtractContextAndIdentifier lldb-unit :: Utility/./UtilityTests/StringExtractorTest.GetHexU8_Extra lldb-unit :: Process/Utility/./ProcessUtilityTests/ProcSMapTests/LinuxProcSMapsTestFixture.ParseSMapRegions/0 lldb-unit :: Process/gdb-remote/./ProcessGdbRemoteTests/GDBRemoteCommunicationClientTest.SendGetDataPacket lldb-api :: functionalities/data-formatter/user-format-vs-summary/TestUserFormatVsSummary.py lldb-unit :: Utility/./UtilityTests/StringLexerTest.GetUnlexed lldb-api :: functionalities/signal/TestSendSignal.py lldb-api :: commands/expression/context-object-objc/TestContextObjectObjc.py lldb-unit :: Utility/./UtilityTests/StringExtractorTest.GetHexBytesAvail_OddPair lldb-api :: functionalities/data-formatter/data-formatter-stl/libstdcpp/iterator/TestDataFormatterStdIterator.py lldb-api :: lang/objc/foundation/TestObjCMethods2.py lldb-unit :: Utility/./UtilityTests/ArchSpecTest.MergeFromMachOUnknown lldb-shell :: SymbolFile/Breakpad/stack-cfi-parsing.test lldb-unit :: UnwindAssembly/x86/./UnwindAssemblyx86Tests/Testx86AssemblyInspectionEngine.TestSimple64bitFrameFunction lldb-api :: functionalities/pre_run_dylibs/TestPreRunDylibs.py lldb-api :: python_api/symbol-context/two-files/TestSymbolContextTwoFiles.py lldb-api :: python_api/watchpoint/watchlocation/TestTargetWatchAddress.py lldb-api :: terminal/TestSTTYBeforeAndAfter.py lldb-api :: functionalities/thread/concurrent_events/TestConcurrentCrashWithBreak.py lldb-api :: lang/cpp/limit-debug-info/TestWithLimitDebugInfo.py lldb-api :: lang/cpp/function-template-parameter-pack/TestFunctionTemplateParameterPack.py lldb-unit :: Host/./HostTests/NativeProcessProtocolTest.SetBreakpointFailWrite lldb-unit :: Utility/./UtilityTests/ProcessInstanceInfoMatch.Name lldb-api :: types/TestDoubleTypesExpr.py lldb-api :: tools/lldb-server/registers-target-xml-reading/TestGdbRemoteTargetXmlPacket.py lldb-api :: functionalities/breakpoint/breakpoint_options/TestBreakpointOptions.py lldb-api :: functionalities/breakpoint/cpp_exception/TestCPPExceptionBreakpoint.py lldb-api :: commands/platform/sdk/TestPlatformSDK.py lldb-unit :: ScriptInterpreter/Python/./ScriptInterpreterPythonTests/PythonDataObjectsTest.TestPythonDictionaryManipulation lldb-unit :: Host/./HostTests/MainLoopTest.Signal lldb-unit :: SymbolFile/NativePDB/./SymbolFileNativePDBTests/PDBFPOProgramToDWARFExpressionTests.MultipleDependentAssignments lldb-unit :: Expression/./ExpressionTests/DiagnosticManagerTest.FixedExpression lldb-unit :: Utility/./UtilityTests/StringListTest.InsertStringAtIndexStdString lldb-unit :: Process/minidump/./LLDBMinidumpTests/MinidumpParserTest.GetFilteredModuleList lldb-unit :: Utility/./UtilityTests/SubsystemRAIITest.SubsystemWithErrorSuccess lldb-api :: lang/cpp/dynamic-value/TestCppValueCast.py lldb-unit :: Symbol/./SymbolTests/TestTypeSystemClang.TestUnifyAccessSpecifiers lldb-unit :: Host/./HostTests/SocketTests/SocketTest.DomainListenConnectAccept/ipv6 lldb-api :: lang/c/stepping/TestThreadStepInAvoidRegexp.py lldb-unit :: Utility/./UtilityTests/StreamTest.PutBytesAsRawHex8ToLittleEndian lldb-unit :: Utility/./UtilityTests/SerializationRountripTest.SerializeDeserializeCStringNull lldb-api :: functionalities/darwin_log/filter/regex/category/TestDarwinLogFilterRegexCategory.py lldb-unit :: Process/minidump/./LLDBMinidumpTests/MinidumpParserTest.MinidumpModuleOrder lldb-unit :: Utility/./UtilityTests/RangeTest.Equal lldb-api :: python_api/function_symbol/TestSymbolAPI.py lldb-api :: commands/platform/process/list/TestProcessList.py lldb-unit :: Utility/./UtilityTests/ProcessInstanceInfoList.Yaml lldb-shell :: ObjectFile/Breakpad/breakpad-identification.test lldb-shell :: SymbolFile/DWARF/debug_line-tombstone.s lldb-shell :: Settings/TestEchoCommands.test lldb-unit :: ScriptInterpreter/Python/./ScriptInterpreterPythonTests/PythonDataObjectsTest.TestPythonCallableInvoke lldb-api :: functionalities/data-formatter/data-formatter-objc/nsindexpath/TestDataFormatterNSIndexPath.py lldb-api :: lang/objc/objc-new-syntax/TestObjCNewSyntaxDictionary.py lldb-api :: functionalities/data-formatter/data-formatter-stl/libstdcpp/smart_ptr/TestDataFormatterStdSmartPtr.py lldb-shell :: ExecControl/StopHook/stop-hook.test lldb-api :: functionalities/gdb_remote_client/TestTargetXMLArch.py lldb-api :: commands/command/script/import/rdar-12586188/TestRdar12586188.py lldb-shell :: Reproducer/TestDiscard.test lldb-unit :: Target/./TargetTests/StackFrameRecognizerTest.NullModuleRegex lldb-api :: tools/lldb-server/TestGdbRemoteSingleStep.py lldb-api :: lang/cpp/template-specialization-type/TestTemplateSpecializationType.py lldb-unit :: Utility/./UtilityTests/RangeTest.ContainsEndInclusive lldb-api :: commands/expression/import_builtin_fileid/TestImportBuiltinFileID.py lldb-unit :: Utility/./UtilityTests/StringExtractorTest.DecodeHexU8_InvalidHex2 lldb-unit :: Expression/./ExpressionTests/CppModuleConfigurationTest.Linux lldb-unit :: Language/Highlighting/./HighlighterTests/HighlighterTest.Keywords lldb-api :: lang/objc/rdar-11355592/TestRdar11355592.py lldb-unit :: Symbol/./SymbolTests/DWARFCallFrameInfoTest.Basic_dwarf3 lldb-unit :: Utility/./UtilityTests/RangeTest.ContainsRange lldb-api :: lang/objc/objc-ivar-protocols/TestIvarProtocols.py lldb-unit :: Utility/./UtilityTests/StreamTest.PutPtr lldb-api :: lang/cpp/static_members/TestCPPStaticMembers.py lldb-api :: functionalities/postmortem/minidump/TestMiniDump.py lldb-unit :: ObjectFile/Breakpad/./ObjectFileBreakpadTests/StackWinRecord.parse lldb-unit :: ScriptInterpreter/Python/./ScriptInterpreterPythonTests/PythonDataObjectsTest.TestPythonInteger lldb-unit :: UnwindAssembly/x86/./UnwindAssemblyx86Tests/Testx86AssemblyInspectionEngine.TestPushRBX lldb-unit :: Process/minidump/./LLDBMinidumpTests/MinidumpParserTest.GetThreadsAndGetThreadContext lldb-unit :: Language/Highlighting/./HighlighterTests/HighlighterTest.ClangEmptyInput lldb-api :: lang/objc/objc-property/TestObjCProperty.py lldb-shell :: SymbolFile/DWARF/DW_AT_loclists_base.s lldb-api :: functionalities/unwind/noreturn/TestNoreturnUnwind.py lldb-shell :: Quit/TestQuitExitCode30.test lldb-unit :: Utility/./UtilityTests/StreamTest.AddressRangeInvalidRange lldb-api :: lang/c/stepping/TestStepAndBreakpoints.py lldb-unit :: Utility/./UtilityTests/RangeTest.SetRangeBase lldb-api :: functionalities/wrong_commands/TestWrongCommands.py lldb-unit :: Process/Utility/./ProcessUtilityTests/ProcMapTests/LinuxProcMapsTestFixture.ParseMapRegions/0 lldb-unit :: Process/gdb-remote/./ProcessGdbRemoteTests/GDBRemoteCommunicationClientTest.GetModulesInfo lldb-unit :: Process/Utility/./ProcessUtilityTests/ProcMapTests/LinuxProcMapsTestFixture.ParseMapRegions/6 lldb-unit :: Utility/./UtilityTests/FileSpecTest.RemoveLastPathComponent lldb-api :: commands/expression/import-std-module/vector/TestVectorFromStdModule.py lldb-unit :: Language/Highlighting/./HighlighterTests/HighlighterTest.ClangTrailingBackslashWithWhitespace lldb-api :: terminal/TestEditline.py lldb-unit :: Core/./LLDBCoreTests/MangledTest.ResultForBlockInvocation lldb-api :: lang/objc/objc-new-syntax/TestObjCNewSyntaxLiteral.py lldb-unit :: Utility/./UtilityTests/StringListTest.SplitIntoLines lldb-unit :: Utility/./UtilityTests/StreamTest.PutRawBytesToBigEndian lldb-unit :: Utility/./UtilityTests/StringExtractorTest.GetNameColonValueSuccess lldb-api :: functionalities/archives/TestBSDArchives.py lldb-api :: commands/frame/diagnose/dereference-this/TestDiagnoseDereferenceThis.py lldb-shell :: ObjectFile/ELF/PT_LOAD-overlap-PT_TLS.yaml lldb-api :: functionalities/lazy-loading/TestLazyLoading.py lldb-api :: functionalities/breakpoint/breakpoint_set_restart/TestBreakpointSetRestart.py lldb-unit :: Utility/./UtilityTests/RangeTest.Union lldb-unit :: Process/gdb-remote/./ProcessGdbRemoteTests/GDBRemoteClientBaseTest.SendContinueAndAsyncPacket lldb-shell :: Commands/CommandScriptImmediateOutput/CommandScriptImmediateOutputFile.test lldb-api :: tools/lldb-server/TestGdbRemoteModuleInfo.py lldb-unit :: Utility/./UtilityTests/SerializationRountripTest.SerializeDeserializeObjectReference lldb-unit :: Core/./LLDBCoreTests/StreamCallbackTest.Callback lldb-api :: tools/lldb-vscode/disconnect/TestVSCode_disconnect.py lldb-unit :: Process/minidump/./LLDBMinidumpTests/MinidumpParserTest.GetPidWindows lldb-api :: lang/cpp/chained-calls/TestCppChainedCalls.py lldb-unit :: Utility/./UtilityTests/ScalarTest.Division lldb-unit :: UnwindAssembly/x86/./UnwindAssemblyx86Tests/Testx86AssemblyInspectionEngine.TestSpArithx86_64Augmented lldb-api :: iohandler/unicode/TestUnicode.py lldb-api :: commands/watchpoints/watchpoint_commands/command/TestWatchpointCommandPython.py lldb-api :: api/check_public_api_headers/TestPublicAPIHeaders.py lldb-unit :: Utility/./UtilityTests/FileSpecTest.Match lldb-unit :: Utility/./UtilityTests/AnsiTerminal.Unknown lldb-unit :: Utility/./UtilityTests/ArchSpecTest.TestParseMachCPUDashSubtypeTripleSimple lldb-shell :: ObjectFile/PECOFF/section-types.yaml lldb-api :: commands/breakpoint/set/func-regex/TestBreakpointRegexError.py lldb-unit :: Utility/./UtilityTests/StringListTest.ShiftStdString lldb-api :: functionalities/thread/thread_specific_break/TestThreadSpecificBreakpoint.py lldb-api :: tools/lldb-server/TestGdbRemote_qThreadStopInfo.py lldb-unit :: Utility/./UtilityTests/FileSpecTest.FileAndDirectoryComponents lldb-api :: commands/settings/use_source_cache/TestUseSourceCache.py lldb-unit :: Utility/./UtilityTests/StringListTest.InsertStringAtIndexMove lldb-unit :: Symbol/./SymbolTests/TestTypeSystemClang.TestGetBasicTypeFromEnum lldb-api :: types/TestIntegerType.py lldb-api :: functionalities/thread/concurrent_events/TestConcurrentManyBreakpoints.py lldb-unit :: Utility/./UtilityTests/EventTest.DumpEventDataBytes lldb-shell :: SymbolFile/DWARF/debug_line-relative_path.s lldb-api :: functionalities/inline-stepping/TestInlineStepping.py lldb-api :: functionalities/gdb_remote_client/TestWriteMemory.py lldb-unit :: Utility/./UtilityTests/XcodeSDKTest.GetCanonicalNameAndConstruct lldb-shell :: Driver/TestRepl.test lldb-unit :: Symbol/./SymbolTests/TestTypeSystemClang.TestGetTypeClassTypeOfExpr lldb-shell :: Reproducer/Functionalities/TestDataFormatter.test lldb-api :: lang/objc/exceptions/TestObjCExceptions.py lldb-unit :: ScriptInterpreter/Python/./ScriptInterpreterPythonTests/PythonDataObjectsTest.TestPythonListToStructuredList lldb-unit :: Thread/./ThreadTests/ThreadTest.SetStopInfo lldb-api :: functionalities/signal/handle-segv/TestHandleSegv.py lldb-api :: commands/help/TestHelp.py lldb-api :: commands/expression/call-function/TestCallStdStringFunction.py lldb-unit :: Process/Utility/./ProcessUtilityTests/ProcMapTests/LinuxProcMapsTestFixture.ParseMapRegions/8 lldb-unit :: ObjectFile/Breakpad/./ObjectFileBreakpadTests/PublicRecord.parse lldb-api :: functionalities/breakpoint/breakpoint_hit_count/TestBreakpointHitCount.py lldb-unit :: UnwindAssembly/x86/./UnwindAssemblyx86Tests/Testx86AssemblyInspectionEngine.TestPushRBPWithREX lldb-unit :: Utility/./UtilityTests/GeneratorTest.YamlMultiProvider lldb-api :: commands/expression/import-std-module/stack/TestStackFromStdModule.py lldb-unit :: Process/gdb-remote/./ProcessGdbRemoteTests/GDBRemoteCommunicationServerTest.SendErrorResponse_ErrorList lldb-unit :: SymbolFile/NativePDB/./SymbolFileNativePDBTests/PDBFPOProgramToDWARFExpressionTests.MultipleIndependentAssignments lldb-unit :: Symbol/./SymbolTests/TestClangASTImporter.DeportDeclTagDecl lldb-api :: commands/expression/anonymous-struct/TestCallUserAnonTypedef.py lldb-unit :: Utility/./UtilityTests/RegisterValueTest.GetSet8 lldb-api :: functionalities/data-formatter/data-formatter-stl/libcxx/optional/TestDataFormatterLibcxxOptional.py lldb-api :: linux/builtin_trap/TestBuiltinTrap.py lldb-unit :: Utility/./UtilityTests/PassiveReplayTest.InstrumentedFoo lldb-unit :: SymbolFile/DWARF/./SymbolFileDWARFTests/SymbolFileDWARFTests.TestAbbrevOrder1Start1 lldb-api :: functionalities/data-formatter/typedef_array/TestTypedefArray.py lldb-unit :: ScriptInterpreter/Python/./ScriptInterpreterPythonTests/PythonDataObjectsTest.TestPythonIntegerToStructuredInteger lldb-shell :: Minidump/disassemble-no-module.yaml lldb-unit :: UnwindAssembly/x86/./UnwindAssemblyx86Tests/Testx86AssemblyInspectionEngine.TestPopEDI lldb-api :: commands/gui/invalid-args/TestInvalidArgsGui.py lldb-api :: functionalities/stats_api/TestStatisticsAPI.py lldb-api :: functionalities/thread/exit_during_expression/TestExitDuringExpression.py lldb-unit :: Language/Highlighting/./HighlighterTests/HighlighterTest.HighlighterSelectionType lldb-api :: functionalities/data-formatter/data-formatter-advanced/TestDataFormatterAdv.py lldb-api :: benchmarks/libcxxlist/TestBenchmarkLibcxxList.py lldb-api :: iohandler/completion/TestIOHandlerCompletion.py lldb-unit :: Process/gdb-remote/./ProcessGdbRemoteTests/GDBRemoteCommunicationClientTest.SendGetTraceConfigPacket lldb-api :: commands/expression/radar_9673664/TestExprHelpExamples.py lldb-api :: commands/expression/two-files/TestObjCTypeQueryFromOtherCompileUnit.py lldb-shell :: SymbolFile/DWARF/dwp.s lldb-api :: commands/command/script_alias/TestCommandScriptAlias.py lldb-api :: commands/frame/diagnose/bad-reference/TestBadReference.py lldb-unit :: Utility/./UtilityTests/VASprintfTest.EncodingError lldb-api :: commands/expression/call-function/TestCallBuiltinFunction.py lldb-unit :: Symbol/./SymbolTests/TestClangASTImporter.CopyTypeTagDecl lldb-api :: source-manager/TestSourceManager.py lldb-api :: functionalities/thread/concurrent_events/TestConcurrentDelayedCrashWithBreakpointWatchpoint.py lldb-api :: lang/c/shared_lib_stripped_symbols/TestSharedLibStrippedSymbols.py lldb-api :: python_api/lldbutil/frame/TestFrameUtils.py lldb-unit :: API/./APITests/SBCommandInterpreterTest.MultiWordCommand lldb-api :: lang/cpp/breakpoint_in_member_func_w_non_primitive_params/TestBreakpointInMemberFuncWNonPrimitiveParams.py lldb-unit :: Utility/./UtilityTests/VASprintfTest.NoBufferResize lldb-api :: lang/objc/objc-dynamic-value/TestObjCDynamicValue.py lldb-api :: commands/target/basic/TestTargetCommand.py lldb-shell :: ObjectFile/ELF/avr-basic-info.yaml lldb-unit :: Utility/./UtilityTests/BinaryStreamTest.PutULEB128One lldb-shell :: ObjectFile/ELF/netbsd-exec-8.99.30-amd64.yaml lldb-api :: python_api/event/TestEvents.py lldb-unit :: Utility/./UtilityTests/BinaryStreamTest.PutULEB128OneByte lldb-api :: functionalities/longjmp/TestLongjmp.py lldb-unit :: Process/gdb-remote/./ProcessGdbRemoteTests/GDBRemoteCommunicationClientTest.SaveRestoreRegistersNoSuffix lldb-api :: lang/c/conflicting-symbol/TestConflictingSymbol.py lldb-api :: lang/cpp/this/TestCPPThis.py lldb-unit :: Utility/./UtilityTests/StreamTest.PutHex16ByteOrderLittle lldb-api :: lang/c/unicode/TestUnicodeSymbols.py lldb-api :: commands/command/invalid-args/TestInvalidArgsCommand.py lldb-api :: python_api/sbtype_typeclass/TestSBTypeTypeClass.py lldb-api :: functionalities/data-formatter/data-formatter-stl/libcxx/unique_ptr/TestDataFormatterLibcxxUniquePtr.py lldb-unit :: Utility/./UtilityTests/ArgsTest.Yaml lldb-shell :: Settings/TestFrameFormatMangling.test lldb-unit :: Utility/./UtilityTests/UriParserTest.SchemeHostSeparator2 lldb-api :: functionalities/tsan/thread_leak/TestTsanThreadLeak.py lldb-unit :: Process/Utility/./ProcessUtilityTests/ProcSMapTests/LinuxProcSMapsTestFixture.ParseSMapRegions/9 lldb-unit :: UnwindAssembly/x86/./UnwindAssemblyx86Tests/Testx86AssemblyInspectionEngine.TestSimple32bitFrameFunction lldb-api :: macosx/find-dsym/bundle-with-dot-in-filename/TestBundleWithDotInFilename.py lldb-unit :: Symbol/./SymbolTests/PostfixExpression.ParseFPOProgram lldb-api :: iohandler/resize/TestIOHandlerResizeNoEditline.py lldb-api :: functionalities/breakpoint/auto_continue/TestBreakpointAutoContinue.py lldb-unit :: Expression/./ExpressionTests/DWARFExpression.DW_OP_unknown lldb-api :: functionalities/data-formatter/summary-string-onfail/Test-rdar-9974002.py lldb-unit :: Utility/./UtilityTests/TimerTest.CategoryTimesNested lldb-api :: python_api/sbplatform/TestSBPlatform.py lldb-api :: lang/objc/foundation/TestObjCMethodsNSError.py lldb-unit :: Utility/./UtilityTests/Flags.AllClear lldb-unit :: Utility/./UtilityTests/StringListTest.DefaultConstructor lldb-api :: functionalities/data-formatter/data-formatter-globals/TestDataFormatterGlobals.py lldb-unit :: Symbol/./SymbolTests/TestTypeSystemClang.TestDeletingImplicitCopyCstrDueToMoveCStr lldb-unit :: Host/./HostTests/ConnectionFileDescriptorTest.TCPGetURIv4 lldb-unit :: SymbolFile/DWARF/./SymbolFileDWARFTests/DWARFASTParserClangTests.EnsureAllDIEsInDeclContextHaveBeenParsedParsesOnlyMatchingEntries lldb-api :: functionalities/data-formatter/data-formatter-stl/libstdcpp/string/TestDataFormatterStdString.py lldb-shell :: SymbolFile/DWARF/DW_AT_const_value-bitfields.s lldb-unit :: Utility/./UtilityTests/Flags.IsClear lldb-unit :: Utility/./UtilityTests/StringListTest.GetSize lldb-unit :: Utility/./UtilityTests/StringListTest.AppendListCStringArrayEmpty lldb-unit :: UnwindAssembly/x86/./UnwindAssemblyx86Tests/Testx86AssemblyInspectionEngine.TestAddRSP lldb-shell :: Breakpoint/split-dwarf-5-addrbase.test lldb-shell :: ObjectFile/Breakpad/discontiguous-sections.test lldb-api :: functionalities/data-formatter/nsarraysynth/TestNSArraySynthetic.py lldb-unit :: Utility/./UtilityTests/StringListTest.GetMaxStringLengthMixed lldb-api :: lang/objc/modules-cache/TestClangModulesCache.py lldb-unit :: Language/Highlighting/./HighlighterTests/HighlighterTest.ClangCommas lldb-api :: functionalities/backticks/TestBackticksWithoutATarget.py lldb-unit :: Host/./HostTests/NativeProcessProtocolTest.ReadCStringFromMemory lldb-api :: benchmarks/expression/TestRepeatedExprs.py lldb-api :: python_api/value/empty_class/TestValueAPIEmptyClass.py lldb-api :: commands/expression/multiline-navigation/TestMultilineNavigation.py lldb-api :: commands/watchpoints/multiple_hits/TestMultipleHits.py lldb-unit :: Utility/./UtilityTests/StreamTest.AddressSize lldb-unit :: UnwindAssembly/x86/./UnwindAssemblyx86Tests/Testx86AssemblyInspectionEngine.Test32BitOnlyInstruction lldb-api :: commands/expression/import-std-module/weak_ptr-dbg-info-content/TestDbgInfoContentWeakPtrFromStdModule.py lldb-api :: functionalities/data-formatter/data-formatter-stl/libcxx/list/TestDataFormatterLibcxxList.py lldb-api :: lang/cpp/typeof/TestTypeOfDeclTypeExpr.py lldb-shell :: SymbolFile/DWARF/dwarf5-debug_line.s lldb-api :: commands/expression/import-std-module/queue/TestQueueFromStdModule.py lldb-unit :: Utility/./UtilityTests/StringListTest.SetSize lldb-unit :: Utility/./UtilityTests/UriParserTest.BracketedHostnameWithColon lldb-api :: commands/target/dump-symtab-demangle/TestDumpSymtabDemangle.py lldb-shell :: Quit/TestQuitExitCodeImplicit0.test lldb-shell :: Driver/TestCommands.test lldb-unit :: Host/./HostTests/SocketTests/SocketTest.TCPGetConnectURI/ipv6 lldb-api :: commands/disassemble/basic/TestDisassembleBreakpoint.py lldb-api :: commands/expression/error-limit/TestExprErrorLimit.py lldb-unit :: Utility/./UtilityTests/ArgsTest.ReplaceArgumentAtIndexEqual lldb-shell :: Reproducer/TestPythonImport.test lldb-shell :: BuildScript/script-args.test lldb-unit :: ScriptInterpreter/Python/./ScriptInterpreterPythonTests/PythonDataObjectsTest.TestObjectAttributes lldb-unit :: Utility/./UtilityTests/UriParserTest.Minimal lldb-unit :: Process/gdb-remote/./ProcessGdbRemoteTests/GDBRemoteCommunicationServerTest.SendErrorResponse_StringError lldb-api :: lang/cpp/frame-var-anon-unions/TestFrameVariableAnonymousUnions.py lldb-unit :: Host/./HostTests/SocketTests/SocketTest.DomainListenConnectAccept/ipv4 lldb-shell :: Settings/TestLineMarkerColor.test lldb-unit :: Symbol/./SymbolTests/TestTypeSystemClang.TestRemoveFastQualifiers lldb-api :: tools/lldb-server/signal-filtering/TestGdbRemote_QPassSignals.py lldb-unit :: Utility/./UtilityTests/StreamTest.QuotedCString lldb-unit :: Utility/./UtilityTests/UUIDTest.SetFromStringRef lldb-api :: python_api/section/TestSectionAPI.py lldb-shell :: Minidump/Windows/broken-unwind.test lldb-api :: commands/expression/calculator_mode/TestCalculatorMode.py lldb-unit :: Utility/./UtilityTests/StringExtractorTest.GetNameColonValueContainsColon lldb-unit :: Utility/./UtilityTests/FileSpecTest.EqualDotsWindows lldb-api :: commands/expression/test/TestExprs.py lldb-unit :: Utility/./UtilityTests/StreamTeeTest.GetStreamAtIndexOutOfBoundsEmpty lldb-unit :: Utility/./UtilityTests/GeneratorTest.GetOrCreate lldb-api :: commands/expression/dont_allow_jit/TestAllowJIT.py lldb-unit :: Utility/./UtilityTests/ScalarTest.Equality lldb-api :: lang/cpp/function-qualifiers/TestCppFunctionQualifiers.py lldb-unit :: Utility/./UtilityTests/SerializationRountripTest.SerializeDeserializePod lldb-api :: functionalities/tail_call_frames/disambiguate_paths_to_common_sink/TestDisambiguatePathsToCommonSink.py lldb-api :: lang/objc/foundation/TestRuntimeTypes.py lldb-api :: lang/c/global_variables/TestGlobalVariables.py lldb-unit :: Utility/./UtilityTests/ConstStringTest.FromMidOfBufferStringRef lldb-unit :: Host/./HostTests/FileSystemTest.OpenErrno lldb-api :: lang/objc/objc-struct-argument/TestObjCStructArgument.py lldb-api :: lang/objc/modules/TestObjCModules.py lldb-unit :: Utility/./UtilityTests/AnsiTerminal.KnownPrefix lldb-unit :: Language/Highlighting/./HighlighterTests/HighlighterTest.ClangCursorOutOfBounds lldb-unit :: Utility/./UtilityTests/XcodeSDKTest.MergeTest lldb-api :: tools/lldb-server/register-reading/TestGdbRemoteGPacket.py lldb-api :: functionalities/data-formatter/ptr_ref_typedef/TestPtrRef2Typedef.py lldb-unit :: Expression/./ExpressionTests/DWARFExpression.DW_OP_stack_value lldb-shell :: ObjectFile/ELF/section-permissions.yaml lldb-api :: python_api/signals/TestSignalsAPI.py lldb-api :: lang/cpp/stl/TestStdCXXDisassembly.py lldb-unit :: UnwindAssembly/x86/./UnwindAssemblyx86Tests/Testx86AssemblyInspectionEngine.Test64bitFramelessBigStackFrame lldb-api :: lang/cpp/bool/TestCPPBool.py lldb-unit :: Language/CPlusPlus/./LanguageCPlusPlusTests/CPlusPlusLanguage.MethodNameParsing lldb-shell :: ObjectFile/PECOFF/basic-info-arm.yaml lldb-api :: lang/cpp/breakpoint-commands/TestCPPBreakpointCommands.py lldb-unit :: Utility/./UtilityTests/PassiveReplayTest.InstrumentedBar lldb-unit :: Symbol/./SymbolTests/TestTypeSystemClang.TestGetTypeClassTypeOf lldb-unit :: UnwindAssembly/x86/./UnwindAssemblyx86Tests/Testx86AssemblyInspectionEngine.TestCALLNextInsn lldb-unit :: Symbol/./SymbolTests/TestClangASTImporter.ImportInvalidType lldb-api :: lang/objc/print-obj/TestPrintObj.py lldb-api :: lang/objc/self/TestObjCSelf.py lldb-api :: functionalities/data-formatter/data-formatter-stl/libcxx/multimap/TestDataFormatterLibccMultiMap.py lldb-api :: commands/expression/import-std-module/no-std-module/TestMissingStdModule.py lldb-unit :: Utility/./UtilityTests/StreamTeeTest.Constructor1Stream lldb-unit :: Utility/./UtilityTests/ScalarTest.GetBytes lldb-api :: functionalities/unwind/noreturn/module-end/TestNoReturnModuleEnd.py lldb-unit :: Utility/./UtilityTests/RangeTest.ContainsEndInclusiveInvalid lldb-api :: functionalities/data-formatter/hexcaps/TestDataFormatterHexCaps.py lldb-api :: functionalities/thread/concurrent_events/TestConcurrentWatchpointDelayWatchpointOneBreakpoint.py lldb-api :: functionalities/thread/break_after_join/TestBreakAfterJoin.py lldb-api :: functionalities/breakpoint/breakpoint_by_line_and_column/TestBreakpointByLineAndColumn.py lldb-unit :: Utility/./UtilityTests/StreamTest.PutCStringWithStringRef lldb-api :: commands/target/stop-hook/enable/TestTargetStopHookEnable.py lldb-unit :: Process/Utility/./ProcessUtilityTests/ProcSMapTests/LinuxProcSMapsTestFixture.ParseSMapRegions/2 lldb-unit :: ObjectFile/ELF/./ObjectFileELFTests/ObjectFileELFTest.GetModuleSpecifications_EarlySectionHeaders lldb-unit :: Utility/./UtilityTests/SerializationRountripTest.SerializeDeserializeObjectPointer lldb-api :: lang/cpp/class-template-type-parameter-pack/TestClassTemplateTypeParameterPack.py lldb-unit :: UnwindAssembly/x86/./UnwindAssemblyx86Tests/Testx86AssemblyInspectionEngine.Test32bitFramelessBigStackFrame lldb-api :: commands/expression/import-std-module/unique_ptr/TestUniquePtrFromStdModule.py lldb-unit :: Process/gdb-remote/./ProcessGdbRemoteTests/GDBRemoteCommunicationServerTest.SendErrorResponse_ErrorNumber lldb-unit :: Language/Highlighting/./HighlighterTests/HighlighterTest.ClangScalarLiterals lldb-unit :: Utility/./UtilityTests/StringListTest.CopyListSingle lldb-unit :: Utility/./UtilityTests/VMRange.ContainsRange lldb-unit :: Utility/./UtilityTests/BinaryStreamTest.PutSLEB128SevenBytes lldb-api :: commands/quit/TestQuit.py lldb-api :: commands/target/stop-hooks/TestStopHooks.py lldb-api :: lang/c/local_variables/TestLocalVariables.py lldb-unit :: Utility/./UtilityTests/XcodeSDKTest.SDKSupportsSwift lldb-api :: commands/expression/codegen-crash-typedefdecl-not-in_declcontext/TestCodegenCrashTypedefDeclNotInDeclContext.py lldb-unit :: SymbolFile/NativePDB/./SymbolFileNativePDBTests/PDBFPOProgramToDWARFExpressionTests.InvalidAssignmentMultiple lldb-unit :: Utility/./UtilityTests/RangeDataVector.FindEntryThatContains_Overlap lldb-unit :: Language/Highlighting/./HighlighterTests/HighlighterTest.ClangCursorPosBeforeOtherToken lldb-unit :: Symbol/./SymbolTests/TestClangASTImporter.CanImportInvalidType lldb-unit :: Host/./HostTests/SocketAddressTest.Set lldb-api :: types/TestCharTypeExpr.py lldb-unit :: Utility/./UtilityTests/TimeoutTest.Construction lldb-api :: functionalities/data-formatter/synthcapping/TestSyntheticCapping.py lldb-unit :: UnwindAssembly/x86/./UnwindAssemblyx86Tests/Testx86AssemblyInspectionEngine.TestPushEBP lldb-unit :: Utility/./UtilityTests/StringExtractorTest.GetHexBytes_Underflow lldb-unit :: ObjectFile/Breakpad/./ObjectFileBreakpadTests/ModuleRecord.parse lldb-unit :: Utility/./UtilityTests/StringExtractorTest.GetHexBytes lldb-unit :: Utility/./UtilityTests/StringExtractorTest.GetHexBytesAvail_Partial lldb-unit :: Utility/./UtilityTests/AnsiTerminal.Basic lldb-unit :: Host/./HostTests/SocketTests/SocketTest.DecodeHostAndPort/ipv6 lldb-api :: functionalities/data-formatter/type_summary_list_script/TestTypeSummaryListScript.py lldb-unit :: Utility/./UtilityTests/DataExtractorTest.GetBitfield lldb-unit :: Symbol/./SymbolTests/TestTypeSystemClang.TestFunctionTemplateInRecordConstruction lldb-unit :: Expression/./ExpressionTests/CppModuleConfigurationTest.UnrelatedLibrary lldb-api :: commands/session/save/TestSessionSave.py lldb-api :: lang/cpp/nsimport/TestCppNsImport.py lldb-unit :: Utility/./UtilityTests/TimerTest.CategoryTimes lldb-api :: commands/disassemble/basic/TestFrameDisassemble.py lldb-unit :: SymbolFile/DWARF/./SymbolFileDWARFTests/SymbolFileDWARFTests.TestAbbrevNullAttrValidForm lldb-api :: commands/expression/persistent_types/TestNestedPersistentTypes.py lldb-unit :: UnwindAssembly/x86/./UnwindAssemblyx86Tests/Testx86AssemblyInspectionEngine.TestPopEBP lldb-api :: lang/c/step_over_no_deadlock/TestStepOverDoesntBlock.py lldb-unit :: ObjectFile/ELF/./ObjectFileELFTests/ObjectFileELFTest.GetSymtab_NoSymEntryPointArmThumbAddressClass lldb-unit :: Language/Highlighting/./HighlighterTests/HighlighterTest.ClangUnterminatedString lldb-api :: lang/c/set_values/TestSetValues.py lldb-shell :: SymbolFile/DWARF/debug-types-line-tables.s lldb-api :: functionalities/tsan/cpp_global_location/TestTsanCPPGlobalLocation.py lldb-shell :: ObjectFile/MachO/lc_build_version.yaml lldb-api :: lang/c/struct_types/TestStructTypes.py lldb-unit :: Utility/./UtilityTests/StreamTest.AddressRangeSize lldb-api :: commands/expression/import-std-module/forward_decl_from_module/TestForwardDeclFromStdModule.py lldb-api :: commands/expression/xvalue/TestXValuePrinting.py lldb-api :: functionalities/thread/concurrent_events/TestConcurrentCrashWithSignal.py lldb-api :: functionalities/ubsan/basic/TestUbsanBasic.py lldb-unit :: Utility/./UtilityTests/SerializationRountripTest.SerializeDeserializeCStringArrayNullptr lldb-unit :: Core/./LLDBCoreTests/ModuleSpecTest.TestCOFFFile lldb-shell :: Breakpoint/debug_rnglistx_rlex.test lldb-unit :: Expression/./ExpressionTests/CppModuleConfigurationTest.LinuxLocalLibCpp lldb-unit :: Utility/./UtilityTests/StreamTest.PutHex32ByteOrderLittle lldb-api :: lang/objc/unicode-string/TestUnicodeString.py lldb-unit :: Utility/./UtilityTests/StreamTeeTest.Assignment lldb-api :: commands/expression/completion-crash-incomplete-record/TestCompletionCrashIncompleteRecord.py lldb-api :: functionalities/signal/handle-abrt/TestHandleAbort.py lldb-shell :: ObjectFile/ELF/build-id-case.yaml lldb-unit :: Utility/./UtilityTests/ArgsTest.TestInsertArg lldb-unit :: Utility/./UtilityTests/FileSpecTest.AppendPathComponent lldb-api :: functionalities/tty/TestTerminal.py lldb-unit :: DataFormatter/./LLDBFormatterTests/TypeMatcherTests.ExactName lldb-shell :: Commands/command-disassemble-process.yaml lldb-api :: commands/platform/file/close/TestPlatformFileClose.py lldb-api :: commands/watchpoints/watchpoint_on_vectors/TestValueOfVectorVariable.py lldb-unit :: UnwindAssembly/x86/./UnwindAssemblyx86Tests/Testx86AssemblyInspectionEngine.TestStackRealign8BitDisp_i386 lldb-api :: commands/platform/file/read/TestPlatformFileRead.py lldb-shell :: Quit/TestQuitExitCode0.test lldb-shell :: SymbolFile/DWARF/clang-ast-from-dwarf-objc-property.m lldb-shell :: Reproducer/TestFinalize.test lldb-api :: python_api/frame/TestFrames.py lldb-api :: functionalities/gdb_remote_client/TestStopPCs.py lldb-shell :: SymbolFile/DWARF/DW_AT_declaration-with-children.s lldb-api :: commands/thread/select/TestThreadSelect.py lldb-unit :: Utility/./UtilityTests/ConstStringTest.NullAndEmptyStates lldb-api :: functionalities/data-formatter/frameformat_smallstruct/TestFrameFormatSmallStruct.py lldb-api :: functionalities/breakpoint/objc/TestObjCBreakpoints.py lldb-api :: commands/gui/breakpoints/TestGuiBreakpoints.py lldb-api :: types/TestFloatTypesExpr.py lldb-unit :: Utility/./UtilityTests/RangeTest.Copy lldb-unit :: Utility/./UtilityTests/StringListTest.JoinSingle lldb-shell :: ScriptInterpreter/Python/scripted_breakpoint_lua.test lldb-api :: functionalities/data-formatter/data-formatter-stl/libstdcpp/list/TestDataFormatterStdList.py lldb-api :: lang/c/strings/TestCStrings.py lldb-unit :: Utility/./UtilityTests/RegularExpression.Valid lldb-api :: commands/watchpoints/variable_out_of_scope/TestWatchedVarHitWhenInScope.py lldb-api :: macosx/lc-note/firmware-corefile/TestFirmwareCorefiles.py lldb-api :: functionalities/data-formatter/data-formatter-named-summaries/TestDataFormatterNamedSummaries.py lldb-api :: lang/cpp/nested-class-other-compilation-unit/TestNestedClassWithParentInAnotherCU.py lldb-shell :: Driver/TestHelp.test lldb-api :: functionalities/data-formatter/data-formatter-stl/libstdcpp/unique_ptr/TestDataFormatterStdUniquePtr.py lldb-api :: functionalities/tail_call_frames/disambiguate_tail_call_seq/TestDisambiguateTailCallSeq.py lldb-api :: commands/expression/call-restarts/TestCallThatRestarts.py lldb-api :: functionalities/data-formatter/data-formatter-objc/nsstring/TestDataFormatterNSString.py lldb-api :: lang/objc/modules-compile-error/TestModulesCompileError.py lldb-unit :: Utility/./UtilityTests/RangeTest.NotEqualInvalid lldb-unit :: Utility/./UtilityTests/ArchSpecTest.Compatibility lldb-unit :: Symbol/./SymbolTests/TestTypeSystemClang.TestBuiltinTypeForEncodingAndBitSize lldb-unit :: Utility/./UtilityTests/ArgsTest.BareSingleQuote lldb-shell :: Minidump/Windows/find-module.test lldb-api :: lang/cpp/multiple-inheritance/TestCppMultipleInheritance.py lldb-unit :: Process/minidump/./LLDBMinidumpTests/MinidumpParserTest.GetLinuxProcStatus_no_stream lldb-unit :: Symbol/./SymbolTests/Type.CompilerContextPattern lldb-unit :: Breakpoint/./LLDBBreakpointTests/BreakpointIDTest.StringIsBreakpointName lldb-api :: commands/expression/static-initializers/TestStaticInitializers.py lldb-shell :: ObjectFile/PDB/object.test lldb-api :: functionalities/darwin_log/filter/exact_match/activity/TestDarwinLogFilterMatchActivity.py lldb-api :: commands/frame/diagnose/inheritance/TestDiagnoseInheritance.py lldb-unit :: Utility/./UtilityTests/RangeTest.DoesIntersect lldb-unit :: Process/minidump/./LLDBMinidumpTests/MinidumpParserTest.FindMemoryRangeWithFullMemoryMinidump lldb-api :: functionalities/thread_plan/TestThreadPlanCommands.py lldb-unit :: Process/gdb-remote/./ProcessGdbRemoteTests/GDBRemoteCommunicationServerTest.SendErrorResponse_Status lldb-shell :: ObjectFile/PECOFF/sections-names.yaml lldb-unit :: Utility/./UtilityTests/RecordReplayTest.InstrumentedBar lldb-api :: functionalities/data-formatter/data-formatter-stl/libstdcpp/tuple/TestDataFormatterStdTuple.py lldb-unit :: Target/./TargetTests/PathMappingListTest.RelativeTests lldb-api :: lang/objc/foundation/TestConstStrings.py lldb-api :: lang/objc/objc-class-method/TestObjCClassMethod.py lldb-unit :: Core/./LLDBCoreTests/ModuleSpecTest.InvalidInMemoryBuffer lldb-unit :: Utility/./UtilityTests/ListenerTest.GetEventImmediate lldb-api :: functionalities/exec/TestExec.py lldb-api :: lang/objc/objc-runtime-ivars/TestRuntimeIvars.py lldb-shell :: BuildScript/modes.test lldb-api :: lang/c/forward/TestForwardDeclaration.py lldb-unit :: Symbol/./SymbolTests/TestTypeSystemClang.TestGetEnumIntegerTypeInvalid lldb-unit :: Utility/./UtilityTests/NameMatchesTest.RegularExpression lldb-api :: functionalities/abbreviation/TestCommonShortSpellings.py lldb-api :: lang/cpp/gmodules/TestWithModuleDebugging.py lldb-api :: python_api/target/TestTargetAPI.py lldb-api :: lang/objc/foundation/TestObjCMethodsNSArray.py lldb-unit :: Utility/./UtilityTests/ArgsTest.EscapeLLDBCommandArgument lldb-api :: functionalities/gdb_remote_client/TestNestedRegDefinitions.py lldb-api :: commands/expression/persistent_variables/TestPersistentVariables.py lldb-api :: lang/objc/objc-baseclass-sbtype/TestObjCBaseClassSBType.py lldb-api :: commands/expression/import-std-module/deque-dbg-info-content/TestDbgInfoContentDequeFromStdModule.py lldb-api :: functionalities/thread/concurrent_events/TestConcurrentTwoWatchpointsOneSignal.py lldb-unit :: ScriptInterpreter/Python/./ScriptInterpreterPythonTests/PythonDataObjectsTest.TestCallable lldb-api :: commands/expression/codegen-crash-import-def-arraytype-element/TestImportDefinitionArrayType.py lldb-api :: lang/cpp/std-function-step-into-callable/TestStdFunctionStepIntoCallable.py lldb-unit :: UnwindAssembly/x86/./UnwindAssemblyx86Tests/Testx86AssemblyInspectionEngine.TestPopRBP lldb-api :: python_api/debugger/TestDebuggerAPI.py lldb-unit :: Utility/./UtilityTests/OptionsWithRawTest.UnterminatedQuote lldb-api :: functionalities/data-formatter/data-formatter-stl/libcxx/queue/TestDataFormatterLibcxxQueue.py lldb-api :: lang/objcxx/cpp_keywords_enabled/TestObjCppKeywordsEnabled.py lldb-api :: lang/cpp/bitfields/TestCppBitfields.py lldb-unit :: Host/./HostTests/FileSystemTest.MakeAbsolute lldb-unit :: Utility/./UtilityTests/NameMatchesTest.StartsWith lldb-unit :: Utility/./UtilityTests/StreamTeeTest.Constructor2Streams lldb-unit :: Process/minidump/./LLDBMinidumpTests/MinidumpParserTest.GetThreadContext_x86_32_wow64 lldb-shell :: ObjectFile/MachO/subsections.yaml lldb-unit :: Utility/./UtilityTests/OptionsWithRawTest.EmptySuffixSingleWhitespace lldb-shell :: Reproducer/TestReuseDirectory.test lldb-unit :: Process/minidump/./LLDBMinidumpTests/MinidumpParserTest.GetMemoryRegionInfoLinuxMaps lldb-api :: commands/target/create-no-such-arch/TestNoSuchArch.py lldb-api :: commands/expression/context-object/TestContextObject.py lldb-unit :: Process/minidump/./LLDBMinidumpTests/MinidumpParserTest.GetMiscInfoWindows lldb-unit :: Utility/./UtilityTests/StringListTest.InsertStringAtIndexOutOfBounds lldb-unit :: ScriptInterpreter/Python/./ScriptInterpreterPythonTests/PythonDataObjectsTest.TestExtractingUInt64ThroughStructuredData lldb-shell :: Minidump/no-process-id.yaml lldb-api :: tools/lldb-server/TestLldbGdbServer.py lldb-unit :: Process/minidump/./LLDBMinidumpTests/MinidumpParserTest.InvalidMinidump lldb-unit :: Host/./HostTests/File.GetWaitableHandleFileno lldb-api :: linux/mix-dwo-and-regular-objects/TestMixedDwarfBinary.py lldb-api :: functionalities/gdb_remote_client/TestIOSSimulator.py lldb-api :: tools/lldb-server/TestGdbRemoteHostInfo.py lldb-shell :: ScriptInterpreter/Python/scripted_breakpoint.test lldb-api :: sanity/TestModuleCacheSanity.py lldb-api :: functionalities/data-formatter/data-formatter-objc/TestDataFormatterObjCKVO.py lldb-api :: commands/statistics/basic/TestStats.py lldb-api :: python_api/frame/get-variables/TestGetVariables.py lldb-unit :: Utility/./UtilityTests/StringExtractorTest.GetHexBytes_OddPair lldb-unit :: Process/Utility/./ProcessUtilityTests/RegisterContext_x86Test.AbridgedToFullTagWord lldb-api :: functionalities/thread/state/TestThreadStates.py lldb-api :: tools/lldb-vscode/breakpoint/TestVSCode_setFunctionBreakpoints.py lldb-unit :: Utility/./UtilityTests/ConstStringTest.CompareStringRef lldb-unit :: Utility/./UtilityTests/FileSpecTest.EqualDotsPosixRoot lldb-shell :: Expr/TestIRMemoryMap.test lldb-unit :: ScriptInterpreter/Python/./ScriptInterpreterPythonTests/PythonDataObjectsTest.TestRun lldb-unit :: Language/Highlighting/./HighlighterTests/HighlighterTest.ClangPreserveNewLine lldb-api :: functionalities/thread/concurrent_events/TestConcurrentBreakpointOneDelayBreakpointThreads.py lldb-api :: functionalities/breakpoint/breakpoint_by_file_colon_line/TestBreakpointByFileColonLine.py lldb-api :: lang/c/const_variables/TestConstVariables.py lldb-unit :: Utility/./UtilityTests/StringListTest.ShiftCString lldb-api :: functionalities/data-formatter/data-formatter-stl/libstdcpp/vector/TestDataFormatterStdVector.py lldb-shell :: SymbolFile/DWARF/DW_TAG_variable-DW_AT_const_value.s lldb-api :: functionalities/dead-strip/TestDeadStrip.py lldb-api :: lang/cpp/member-and-local-vars-with-same-name/TestMembersAndLocalsWithSameName.py lldb-api :: functionalities/reproducers/attach/TestReproducerAttach.py lldb-unit :: Utility/./UtilityTests/OptionsWithRawTest.SingleWordSuffix lldb-unit :: Host/./HostTests/HostInfoTest.GetAugmentedArchSpec lldb-api :: functionalities/memory/find/TestMemoryFind.py lldb-unit :: Utility/./UtilityTests/StringExtractorTest.GetHexU8_InvalidHex_NoEof lldb-unit :: Utility/./UtilityTests/RecordReplayTest.ValidSequence lldb-unit :: Utility/./UtilityTests/StringExtractorTest.DecodeHexU8_Extra lldb-unit :: Language/Highlighting/./HighlighterTests/HighlighterTest.DefaultHighlighter lldb-unit :: ScriptInterpreter/Python/./ScriptInterpreterPythonTests/PythonDataObjectsTest.TestOwnedReferences lldb-api :: lang/c/anonymous/TestAnonymous.py lldb-api :: macosx/lc-note/kern-ver-str/TestKernVerStrLCNOTE.py lldb-shell :: ObjectFile/wasm/stripped-debug-sections.yaml lldb-api :: commands/session/history/TestSessionHistory.py lldb-api :: commands/expression/completion/TestExprCompletion.py lldb-api :: commands/log/basic/TestLogging.py lldb-unit :: Utility/./UtilityTests/IndexToObjectTest.ObjectForIndex lldb-api :: commands/register/register/aarch64_sve_registers/rw_access_static_config/TestSVERegisters.py lldb-unit :: Utility/./UtilityTests/StringListTest.LongestCommonPrefixDuplicateElement lldb-unit :: Symbol/./SymbolTests/TestTypeSystemClang.OnlyPackName lldb-shell :: Reproducer/TestVerify.test lldb-unit :: Process/gdb-remote/./ProcessGdbRemoteTests/GDBRemoteClientBaseTest.SendContinueAndAsyncSignal lldb-unit :: Interpreter/./InterpreterTests/CompletionTest.DirCompletionUsername lldb-api :: functionalities/gdb_remote_client/TestqOffsets.py lldb-shell :: Reproducer/TestMultipleTargets.test lldb-unit :: Utility/./UtilityTests/GeneratorTest.Get lldb-api :: lang/c/inlines/TestRedefinitionsInInlines.py lldb-api :: functionalities/breakpoint/breakpoint_conditions/TestBreakpointConditions.py lldb-shell :: SymbolFile/DWARF/debug_aranges-empty-section.s lldb-unit :: Utility/./UtilityTests/UriParserTest.SchemeHostSeparator3 lldb-unit :: Utility/./UtilityTests/RecordReplayTest.InstrumentedBarRef lldb-unit :: Utility/./UtilityTests/ProcessInfoTest.Constructor lldb-api :: lang/cpp/operator-overload/TestOperatorOverload.py lldb-unit :: Expression/./ExpressionTests/DiagnosticManagerTest.GetStringPreserveOrder lldb-unit :: Utility/./UtilityTests/StringExtractorTest.GetHexU8_Exact_NoEof lldb-unit :: Utility/./UtilityTests/LogTest.Unregister lldb-unit :: Expression/./ExpressionTests/CppModuleConfigurationTest.IgnoreLibStdCpp lldb-shell :: Reproducer/Functionalities/TestStepping.test lldb-api :: lang/cpp/diamond/TestDiamond.py lldb-api :: functionalities/tsan/thread_numbers/TestTsanThreadNumbers.py lldb-api :: commands/expression/import-std-module/forward_list-dbg-info-content/TestDbgInfoContentForwardListFromStdModule.py lldb-shell :: SymbolFile/DWARF/debug-types-dwarf5.s lldb-api :: lang/cpp/function_refs/TestFunctionRefs.py lldb-unit :: Utility/./UtilityTests/StringListTest.InsertStringAtIndexStart lldb-unit :: Utility/./UtilityTests/StringExtractorTest.GetHexU8_Underflow2_NoEof lldb-api :: functionalities/data-formatter/data-formatter-objc/TestDataFormatterObjCNSDate.py lldb-api :: commands/frame/var/TestFrameVar.py lldb-unit :: UnwindAssembly/x86/./UnwindAssemblyx86Tests/Testx86AssemblyInspectionEngine.TestPushImm lldb-unit :: Utility/./UtilityTests/VMRange.Clear lldb-unit :: Utility/./UtilityTests/ArgsTest.DoubleQuotedItem lldb-api :: functionalities/data-formatter/array_typedef/TestArrayTypedef.py lldb-api :: lang/cpp/const_this/TestConstThis.py lldb-unit :: Process/minidump/./LLDBMinidumpTests/MinidumpParserTest.GetExceptionStream lldb-api :: functionalities/data-formatter/data-formatter-categories/TestDataFormatterCategories.py lldb-unit :: Platform/./LLDBPlatformTests/PlatformDarwinTest.FindComponentInPath lldb-api :: functionalities/thread/concurrent_events/TestConcurrentSignalBreak.py lldb-unit :: UnwindAssembly/x86/./UnwindAssemblyx86Tests/Testx86AssemblyInspectionEngine.TestDisassemblyMidFunctionEpilogues lldb-unit :: Utility/./UtilityTests/ReproducerTest.SetReplay lldb-api :: functionalities/type_lookup/TestTypeLookup.py lldb-api :: lang/c/enum_types/TestEnumTypes.py lldb-unit :: Utility/./UtilityTests/LogChannelEnabledTest.log_options lldb-shell :: SymbolFile/DWARF/debug_loc_and_loclists.s lldb-api :: python_api/get-value-32bit-int/TestGetValue32BitInt.py lldb-api :: lang/cpp/global_variables/TestCPPGlobalVariables.py lldb-unit :: UnwindAssembly/x86/./UnwindAssemblyx86Tests/Testx86AssemblyInspectionEngine.TestPushR15 lldb-api :: functionalities/gdb_remote_client/TestNoGPacketSupported.py lldb-shell :: Breakpoint/debug_rnglist_offset_pair.test lldb-api :: lang/objc/objc++/TestObjCXX.py lldb-unit :: ScriptInterpreter/Python/./ScriptInterpreterPythonTests/PythonDataObjectsTest.TestPythonBytes lldb-api :: commands/target/stop-hook/disable/TestTargetStopHookDisable.py lldb-api :: functionalities/thread/concurrent_events/TestConcurrentManyCrash.py lldb-api :: types/TestCharType.py lldb-api :: commands/frame/diagnose/dereference-function-return/TestDiagnoseDereferenceFunctionReturn.py lldb-unit :: Utility/./UtilityTests/BroadcasterTest.BroadcastEvent lldb-shell :: Commands/command-regex-unalias.test lldb-unit :: DataFormatter/./LLDBFormatterTests/StringPrinterTests.CxxASCII lldb-api :: functionalities/optimized_code/TestNoASanExceptionAfterEvalOP_piece.py lldb-api :: python_api/sbenvironment/TestSBEnvironment.py lldb-unit :: Utility/./UtilityTests/StreamTest.ShiftOperatorStrings lldb-unit :: Utility/./UtilityTests/OptionsWithRawTest.TerminatedQuote lldb-api :: commands/expression/diagnostics/TestExprDiagnostics.py lldb-api :: functionalities/data-formatter/data-formatter-objc/TestDataFormatterObjCPlain.py lldb-unit :: Utility/./UtilityTests/StreamTest.PutULEB128 lldb-api :: functionalities/thread/concurrent_events/TestConcurrentTwoBreakpointsOneWatchpoint.py lldb-api :: functionalities/inferior-crashing/TestInferiorCrashingStep.py lldb-api :: tools/lldb-vscode/coreFile/TestVSCode_coreFile.py lldb-api :: functionalities/tail_call_frames/cross_object/TestCrossObjectTailCalls.py lldb-unit :: UnwindAssembly/x86/./UnwindAssemblyx86Tests/Testx86AssemblyInspectionEngine.Testi386IgnoredRegisters lldb-api :: commands/expression/pr35310/TestExprsBug35310.py lldb-api :: lang/cpp/char1632_t/TestChar1632T.py lldb-unit :: Utility/./UtilityTests/CompletionRequest.Constructor lldb-api :: functionalities/breakpoint/breakpoint_names/TestBreakpointNames.py lldb-api :: functionalities/data-formatter/data-formatter-disabling/TestDataFormatterDisabling.py lldb-unit :: Language/Highlighting/./HighlighterTests/HighlighterTest.ClangOperators lldb-unit :: Language/Highlighting/./HighlighterTests/HighlighterTest.ClangStringLiterals lldb-unit :: SymbolFile/NativePDB/./SymbolFileNativePDBTests/PDBFPOProgramToDWARFExpressionTests.UnresolvedCyclicRegisterAssignmentReference lldb-api :: lang/c/tls_globals/TestTlsGlobals.py lldb-api :: commands/expression/import-std-module/vector-of-vectors/TestVectorOfVectorsFromStdModule.py lldb-api :: tools/lldb-server/thread-name/TestGdbRemoteThreadName.py lldb-unit :: Target/./TargetTests/PathMappingListTest.AbsoluteTests lldb-unit :: tools/lldb-server/tests/./LLDBServerTests/TestBase.LaunchModePreservesEnvironment lldb-unit :: Utility/./UtilityTests/FileSpecTest.GetPath lldb-api :: python_api/lldbutil/iter/TestRegistersIterator.py lldb-unit :: Utility/./UtilityTests/StreamTest.AddressEmptyPrefix lldb-unit :: UnwindAssembly/x86/./UnwindAssemblyx86Tests/Testx86AssemblyInspectionEngine.TestSpillRegToStackViaMOVx86_64 lldb-unit :: Utility/./UtilityTests/ArgsTest.TestOverwriteArgs lldb-shell :: Minidump/dump-all.test lldb-shell :: Reproducer/Functionalities/TestImageList.test lldb-unit :: Host/./HostTests/FileSystemTest.Exists lldb-shell :: SymbolFile/DWARF/dwo-type-in-main-file.s lldb-unit :: Utility/./UtilityTests/SerializationRountripTest.SerializeDeserializeCString lldb-api :: functionalities/thread/concurrent_events/TestConcurrentTwoBreakpointThreads.py lldb-unit :: Utility/./UtilityTests/ArgsTest.TestUnknownEscape lldb-unit :: Utility/./UtilityTests/StreamTest.PutNHex8 lldb-shell :: ObjectFile/ELF/base-address.yaml lldb-shell :: ObjectFile/ELF/duplicate-section.yaml lldb-unit :: UnwindAssembly/x86/./UnwindAssemblyx86Tests/Testx86AssemblyInspectionEngine.Test32bitFramelessSmallStackFrame lldb-api :: commands/version/TestVersion.py lldb-unit :: Utility/./UtilityTests/RecordReplayTest.InvalidSequence lldb-api :: tools/lldb-server/TestGdbRemoteProcessInfo.py lldb-unit :: Utility/./UtilityTests/ScalarTest.APIntConstructor lldb-api :: lang/cpp/class_types/TestClassTypesDisassembly.py lldb-shell :: SymbolFile/Breakpad/unwind-via-raSearch.test lldb-unit :: Utility/./UtilityTests/ArgsTest.GetShellSafeArgument lldb-api :: functionalities/thread/backtrace_limit/TestBacktraceLimit.py lldb-api :: lang/objc/objc-new-syntax/TestObjCNewSyntaxArray.py lldb-unit :: SymbolFile/DWARF/./SymbolFileDWARFTests/SymbolFileDWARFTests.TestAbbrevOutOfOrder lldb-shell :: ObjectFile/ELF/minidebuginfo-find-symbols.yaml lldb-api :: macosx/simulator/TestSimulatorPlatform.py lldb-api :: commands/expression/cast_int_to_anonymous_enum/TestCastIntToAnonymousEnum.py lldb-unit :: Host/./HostTests/NativeProcessProtocolTest.SetBreakpoint lldb-unit :: Utility/./UtilityTests/StringListTest.InsertStringAtIndexEnd lldb-api :: commands/add-dsym/uuid/TestAddDsymCommand.py lldb-api :: lang/cpp/template-function/TestTemplateFunctions.py lldb-unit :: Utility/./UtilityTests/DataExtractorTest.GetMaxU64 lldb-unit :: Process/minidump/./LLDBMinidumpTests/MinidumpParserTest.GetLinuxProcStatus lldb-shell :: SymbolFile/DWARF/DW_AT_decl_file-DW_AT_specification-crosscu.s lldb-api :: functionalities/breakpoint/breakpoint_command/TestBreakpointCommandsFromPython.py lldb-unit :: Symbol/./SymbolTests/TestClangASTImporter.MetadataPropagationIndirectImport lldb-unit :: Utility/./UtilityTests/StringListTest.GetMaxStringLengthEqualSize lldb-api :: lang/cpp/virtual-overload/TestVirtualOverload.py lldb-unit :: Process/minidump/./LLDBMinidumpTests/MinidumpParserTest.GetMemory lldb-api :: functionalities/thread/concurrent_events/TestConcurrentManySignals.py lldb-unit :: Utility/./UtilityTests/StringListTest.GetMaxStringLengthEmpty lldb-unit :: Symbol/./SymbolTests/TestTypeSystemClang.TestGetTypeClassNested lldb-unit :: Utility/./UtilityTests/ListenerTest.GetEventWait lldb-unit :: debugserver/./debugserverTests/RNBSocket.LoopBackConnectIPv4 lldb-api :: functionalities/postmortem/elf-core/TestLinuxCore.py lldb-unit :: Process/gdb-remote/./ProcessGdbRemoteTests/GDBRemoteCommunicationClientTest.SyncThreadState lldb-api :: commands/trace/TestTraceSchema.py lldb-api :: tools/lldb-server/inferior-crash/TestGdbRemoteSegFault.py lldb-unit :: Utility/./UtilityTests/RegularExpression.Invalid lldb-api :: functionalities/data-formatter/data-formatter-ptr-to-array/TestPtrToArrayFormatting.py lldb-api :: functionalities/thread/concurrent_events/TestConcurrentNWatchNBreak.py lldb-api :: lang/c/array_types/TestArrayTypes.py lldb-shell :: ObjectFile/ELF/section-types-edgecases.yaml lldb-unit :: Symbol/./SymbolTests/LineEntryTest.GetSameLineContiguousAddressRangeNoInlines lldb-api :: functionalities/breakpoint/hardware_breakpoints/hardware_breakpoint_on_multiple_threads/TestHWBreakMultiThread.py lldb-api :: functionalities/postmortem/netbsd-core/TestNetBSDCore.py lldb-unit :: Host/./HostTests/SocketTests/SocketTest.TCPGetAddress/ipv4 lldb-api :: functionalities/breakpoint/hardware_breakpoints/require_hw_breakpoints/TestRequireHWBreakpoints.py lldb-shell :: SymbolFile/DWARF/debug_ranges-missing-section.s lldb-api :: commands/expression/call-throws/TestCallThatThrows.py lldb-api :: functionalities/data-formatter/type_summary_list_arg/TestTypeSummaryListArg.py lldb-unit :: Utility/./UtilityTests/RegisterValueTest.GetScalarValue lldb-unit :: Utility/./UtilityTests/ArgsTest.AppendArguments lldb-api :: python_api/hello_world/TestHelloWorld.py lldb-unit :: Utility/./UtilityTests/RangeTest.SlideZero lldb-unit :: Utility/./UtilityTests/ArchSpecTest.MergeFrom lldb-api :: lang/cpp/stl/TestSTL.py lldb-shell :: ObjectFile/MachO/lc_build_version_notools.yaml lldb-api :: functionalities/darwin_log/source/debug/TestDarwinLogSourceDebug.py lldb-unit :: SymbolFile/NativePDB/./SymbolFileNativePDBTests/PDBFPOProgramToDWARFExpressionTests.UnresolvedDependentCyclicRegisterAssignmentReference lldb-unit :: Utility/./UtilityTests/ArchSpecTest.TestSetTriple lldb-api :: lang/objc/hidden-ivars/TestHiddenIvars.py lldb-unit :: Target/./TargetTests/ModuleCacheTest.GetAndPutUuidExists lldb-unit :: ScriptInterpreter/Python/./ScriptInterpreterPythonTests/PythonDataObjectsTest.TestPythonByteArray lldb-shell :: BuildScript/compiler-full-path.test lldb-api :: functionalities/thread/concurrent_events/TestConcurrentWatchBreakDelay.py lldb-unit :: Utility/./UtilityTests/Flags.AnyClear lldb-api :: functionalities/data-formatter/data-formatter-stl/libcxx/initializerlist/TestInitializerList.py lldb-shell :: ObjectFile/ELF/section-addresses.yaml lldb-unit :: Utility/./UtilityTests/StreamTest.PutHex32ByteOrderBig lldb-api :: benchmarks/stepping/TestSteppingSpeed.py lldb-api :: commands/watchpoints/watchpoint_disable/TestWatchpointDisable.py lldb-unit :: Utility/./UtilityTests/OptionsWithRawTest.LeadingSpaceArgs lldb-api :: functionalities/data-formatter/data-formatter-stl/libstdcpp/map/TestDataFormatterStdMap.py lldb-unit :: Utility/./UtilityTests/StructuredDataTest.ParseJSONFromFile lldb-api :: functionalities/thread/concurrent_events/TestConcurrentDelaySignalBreak.py lldb-shell :: Settings/TestFrameFormatNoColor.test lldb-unit :: Utility/./UtilityTests/GeneratorTest.Create lldb-api :: functionalities/thread/step_until/TestStepUntil.py lldb-api :: commands/frame/diagnose/array/TestArray.py lldb-unit :: Utility/./UtilityTests/StreamTest.AddressRange lldb-unit :: Process/Utility/./ProcessUtilityTests/ProcMapTests/LinuxProcMapsTestFixture.ParseMapRegions/3 lldb-unit :: Symbol/./SymbolTests/TestTypeSystemClang.TestGetEnumIntegerTypeUnexpectedType lldb-unit :: Utility/./UtilityTests/DataExtractorTest.GetMaxU64_unchecked lldb-api :: lang/objc/orderedset/TestOrderedSet.py lldb-unit :: Interpreter/./InterpreterTests/OptionArgParserTest.toChar lldb-api :: commands/settings/quoting/TestQuoting.py lldb-api :: python_api/watchpoint/condition/TestWatchpointConditionAPI.py lldb-unit :: ScriptInterpreter/Python/./ScriptInterpreterPythonTests/PythonDataObjectsTest.TestPythonStringToStructuredString lldb-api :: functionalities/data-formatter/data-formatter-synth/TestDataFormatterSynth.py lldb-shell :: Commands/command-disassemble.s lldb-unit :: debugserver/./debugserverTests/RNBSocket.LoopBackConnectIPv6 lldb-api :: functionalities/darwin_log/format/TestDarwinLogMessageFormat.py lldb-unit :: UnwindAssembly/x86/./UnwindAssemblyx86Tests/Testx86AssemblyInspectionEngine.TestSimplex86_64Augmented lldb-api :: functionalities/param_entry_vals/basic_entry_values/TestBasicEntryValues.py lldb-api :: functionalities/thread/concurrent_events/TestConcurrentSignalDelayWatch.py lldb-api :: functionalities/gdb_remote_client/TestAArch64XMLRegOffsets.py lldb-unit :: Utility/./UtilityTests/Predicate.WaitForValueEqualTo lldb-api :: functionalities/data-formatter/data-formatter-objc/TestDataFormatterObjCNSContainer.py lldb-api :: lang/cpp/namespace/TestNamespaceLookup.py lldb-api :: python_api/watchpoint/TestWatchpointIgnoreCount.py lldb-unit :: UnwindAssembly/x86/./UnwindAssemblyx86Tests/Testx86AssemblyInspectionEngine.TestSpillRegToStackViaMOVi386 lldb-unit :: Utility/./UtilityTests/StringListTest.JoinMultiCharSeparator lldb-api :: lang/objc/objc-static-method-stripped/TestObjCStaticMethodStripped.py lldb-api :: functionalities/gdb_remote_client/TestGDBRemoteLoad.py lldb-unit :: Utility/./UtilityTests/StringLexerTest.AdvanceIf lldb-shell :: SymbolFile/Breakpad/unwind-via-stack-cfi.test lldb-shell :: Breakpoint/dummy-target.test lldb-unit :: Utility/./UtilityTests/CompletionRequest.DuplicateFilteringWithComments lldb-shell :: Reproducer/Modules/TestModuleCXX.test lldb-api :: commands/expression/call-function/TestCallStopAndContinue.py lldb-api :: api/multiple-targets/TestMultipleTargets.py lldb-unit :: Utility/./UtilityTests/AnsiTerminal.Empty lldb-api :: commands/target/stop-hooks/TestStopHookScripted.py lldb-unit :: Utility/./UtilityTests/Flags.AllSet lldb-unit :: Utility/./UtilityTests/StreamTest.AddressRangeEmptyRange lldb-api :: functionalities/thread/concurrent_events/TestConcurrentDelayedCrashWithBreakpointSignal.py lldb-shell :: ObjectFile/PECOFF/basic-info.yaml lldb-shell :: SymbolFile/Breakpad/symtab-macho.test lldb-unit :: Utility/./UtilityTests/UserIDResolver.GetUserName lldb-shell :: SymbolFile/DWARF/compilercontext.ll lldb-unit :: Utility/./UtilityTests/LogChannelTest.EnableOptions lldb-unit :: ObjectFile/Breakpad/./ObjectFileBreakpadTests/FuncRecord.parse lldb-api :: lang/objcxx/objcxx-ivar-vector/TestIvarVector.py lldb-api :: lang/objc/modules-inline-functions/TestModulesInlineFunctions.py lldb-unit :: Utility/./UtilityTests/ScalarTest.Comparison lldb-api :: lang/cpp/rvalue-references/TestRvalueReferences.py lldb-api :: python_api/interpreter/TestCommandInterpreterAPI.py lldb-shell :: Reproducer/TestDSYM.test lldb-unit :: Process/gdb-remote/./ProcessGdbRemoteTests/GDBRemoteCommunicationClientTest.SendTraceSupportedTypePacket lldb-api :: functionalities/gdb_remote_client/TestQemuAArch64TargetXml.py lldb-shell :: SymbolFile/DWARF/DW_AT_low_pc-addrx.s lldb-api :: commands/expression/fixits/TestFixIts.py lldb-api :: functionalities/ubsan/user-expression/TestUbsanUserExpression.py lldb-shell :: ScriptInterpreter/Python/command_relative_import.test lldb-unit :: Utility/./UtilityTests/StreamTest.PutHex16ByteOrderBig lldb-api :: commands/platform/basic/TestPlatformCommand.py lldb-unit :: Process/./ProcessEventDataTests/ProcessEventDataTest.DoOnRemoval lldb-unit :: Utility/./UtilityTests/StreamTeeTest.SetStreamAtIndexOutOfBounds lldb-api :: functionalities/thread/concurrent_events/TestConcurrentTwoWatchpointsOneBreakpoint.py lldb-unit :: Utility/./UtilityTests/TimeoutTest.Format lldb-unit :: Process/Utility/./ProcessUtilityTests/ProcMapTests/LinuxProcMapsTestFixture.ParseMapRegions/7 lldb-api :: functionalities/thread/concurrent_events/TestConcurrentSignalWatchBreak.py lldb-unit :: Utility/./UtilityTests/StringExtractorTest.GetHexBytes_OddPair2 lldb-api :: types/TestIntegerTypeExpr.py lldb-api :: commands/process/attach/attach_denied/TestAttachDenied.py lldb-unit :: Utility/./UtilityTests/DataExtractorTest.GetCStr lldb-unit :: Utility/./UtilityTests/AnsiTerminal.WhiteSpace lldb-api :: python_api/value_var_update/TestValueVarUpdate.py lldb-unit :: ObjectFile/Breakpad/./ObjectFileBreakpadTests/LineRecord.parse lldb-api :: commands/expression/weak_symbols/TestWeakSymbols.py lldb-api :: functionalities/limit-debug-info/TestLimitDebugInfo.py lldb-api :: linux/add-symbols/TestTargetSymbolsAddCommand.py lldb-unit :: Process/Utility/./ProcessUtilityTests/ProcMapTests/LinuxProcMapsTestFixture.ParseMapRegions/1 lldb-api :: lang/objc/ptr_refs/TestPtrRefsObjC.py lldb-unit :: API/./APITests/SBCommandInterpreterTest.SingleWordCommand lldb-unit :: Utility/./UtilityTests/FileSpecTest.EqualDotsPosix lldb-unit :: Utility/./UtilityTests/StreamTeeTest.Flush lldb-unit :: Host/./HostTests/MainLoopTest.UnmonitoredSignal lldb-unit :: Process/gdb-remote/./ProcessGdbRemoteTests/PortMapTest.AllowPort lldb-unit :: ObjectFile/Breakpad/./ObjectFileBreakpadTests/FileRecord.parse lldb-api :: functionalities/darwin_log/filter/regex/subsystem/TestDarwinLogFilterRegexSubsystem.py lldb-shell :: ObjectFile/ELF/PT_LOAD-overlap-PT_INTERP.yaml lldb-api :: functionalities/tsan/multiple/TestTsanMultiple.py lldb-api :: functionalities/breakpoint/consecutive_breakpoints/TestConsecutiveBreakpoints.py lldb-api :: tools/lldb-server/platform-process-connect/TestPlatformProcessConnect.py lldb-api :: functionalities/rerun/TestRerun.py lldb-unit :: Utility/./UtilityTests/StringListTest.AppendListCStringArray lldb-unit :: Utility/./UtilityTests/ConstStringTest.UpdateMangledCounterpart lldb-unit :: UnwindAssembly/x86/./UnwindAssemblyx86Tests/Testx86AssemblyInspectionEngine.TestPopR13 lldb-api :: macosx/save_crashlog/TestSaveCrashlog.py lldb-api :: functionalities/inferior-crashing/recursive-inferior/TestRecursiveInferiorStep.py lldb-api :: functionalities/thread/create_after_attach/TestCreateAfterAttach.py lldb-api :: tools/lldb-server/TestGdbRemoteExpeditedRegisters.py lldb-api :: functionalities/breakpoint/breakpoint_command/TestRegexpBreakCommand.py lldb-api :: commands/watchpoints/watchpoint_commands/TestWatchpointCommands.py lldb-unit :: Utility/./UtilityTests/BroadcasterTest.EventTypeHasListeners lldb-api :: lang/cpp/dynamic-value-same-basename/TestDynamicValueSameBase.py lldb-api :: tools/lldb-server/memory-allocation/TestGdbRemoteMemoryAllocation.py lldb-api :: macosx/debugserver-exit-code/TestDebugServerExitCode.py lldb-unit :: Host/./HostTests/Host.WaitStatusFormat lldb-unit :: Utility/./UtilityTests/UriParserTest.TypicalPortPathIPv4 lldb-unit :: Utility/./UtilityTests/FileSpecTest.IsRelative lldb-api :: lang/c/bitfields/TestBitfields.py lldb-api :: lang/objc/modules-update/TestClangModulesUpdate.py lldb-api :: lang/cpp/constructors/TestCppConstructors.py lldb-api :: commands/watchpoints/watchpoint_events/TestWatchpointEvents.py lldb-shell :: SymbolFile/DWARF/dwarf5-split.s lldb-unit :: Utility/./UtilityTests/BinaryStreamTest.PutULEB128MaxValue lldb-api :: macosx/DBGSourcePathRemapping/TestDSYMSourcePathRemapping.py lldb-api :: functionalities/breakpoint/address_breakpoints/TestAddressBreakpoints.py lldb-shell :: ObjectFile/ELF/aarch64-relocations.yaml lldb-api :: functionalities/data-formatter/data-formatter-synthval/TestDataFormatterSynthVal.py lldb-unit :: Utility/./UtilityTests/TimerTest.CategoryTimes2 lldb-api :: functionalities/tail_call_frames/sbapi_support/TestTailCallFrameSBAPI.py lldb-unit :: Utility/./UtilityTests/StreamTeeTest.CopyConstructor lldb-api :: lang/objc/objc-ivar-stripped/TestObjCIvarStripped.py lldb-api :: functionalities/history/TestHistoryRecall.py lldb-unit :: Utility/./UtilityTests/SerializationRountripTest.SerializeDeserializeCStringArrayNullptrElem lldb-api :: functionalities/thread/step_out/TestThreadStepOut.py lldb-api :: macosx/thread_suspend/TestInternalThreadSuspension.py lldb-shell :: Reproducer/TestCaptureEnvOverride.test lldb-unit :: tools/lldb-server/tests/./LLDBServerTests/TestBase.DebugserverEnv lldb-unit :: Utility/./UtilityTests/BinaryStreamTest.PutSLEB128OneByte lldb-unit :: Utility/./UtilityTests/SharedCluster.ClusterManager lldb-unit :: Interpreter/./InterpreterTests/CompletionTest.FileCompletionAbsolute lldb-unit :: Utility/./UtilityTests/UriParserTest.PortOverflow lldb-unit :: Utility/./UtilityTests/ArchSpecTest.TestParseMachCPUDashSubtypeTripleExtra lldb-unit :: Utility/./UtilityTests/BinaryStreamTest.PutSLEB128EightBytes lldb-api :: functionalities/gdb_remote_client/TestWasm.py lldb-unit :: Process/gdb-remote/./ProcessGdbRemoteTests/PortMapTest.Constructors lldb-api :: functionalities/asan/TestReportData.py lldb-api :: commands/source/info/TestSourceInfo.py lldb-unit :: DataFormatter/./LLDBFormatterTests/TypeMatcherTests.CreatedBySameMatchString lldb-unit :: ObjectFile/Breakpad/./ObjectFileBreakpadTests/Record.classify lldb-shell :: VSCode/TestOptions.test lldb-api :: lang/cpp/typedef/TestCppTypedef.py lldb-api :: lang/c/modules/TestCModules.py lldb-api :: commands/expression/save_jit_objects/TestSaveJITObjects.py lldb-unit :: Utility/./UtilityTests/ArgsTest.TestMultipleArgs lldb-api :: python_api/value/TestValueAPI.py lldb-unit :: Core/./LLDBCoreTests/RichManglingContextTest.FromCxxMethodName lldb-api :: tools/lldb-server/TestGdbRemoteExitCode.py lldb-unit :: Utility/./UtilityTests/ConstStringTest.CompareConstString lldb-unit :: Process/minidump/./LLDBMinidumpTests/MinidumpParserTest.GetMemoryRegionInfoFromMemoryList lldb-unit :: Utility/./UtilityTests/BinaryStreamTest.PutULEB128EightBytes lldb-api :: tools/lldb-server/commandline/TestStubSetSID.py lldb-api :: lang/objc/modules-app-update/TestClangModulesAppUpdate.py lldb-api :: tools/intel-features/intel-pt/test/TestIntelPTSimpleBinary.py lldb-unit :: Utility/./UtilityTests/XcodeSDKTest.GetSDKTypeForTriple lldb-api :: lang/cpp/global_operators/TestCppGlobalOperators.py lldb-unit :: Host/./HostTests/NativeProcessProtocolTest.SetBreakpointFailVerify lldb-api :: lang/objc/objc-foundation-dictionary-empty/TestNSDictionary0.py lldb-shell :: ObjectFile/MachO/symtab.yaml lldb-unit :: ObjectFile/PECOFF/./ObjectFilePECOFFTests/PECallFrameInfoTest.Chained_eh lldb-api :: lang/cpp/unsigned_types/TestUnsignedTypes.py lldb-unit :: Utility/./UtilityTests/StringListTest.AppendStringStdString lldb-unit :: Utility/./UtilityTests/VMRange.Reset lldb-api :: commands/expression/call-function/TestCallUserDefinedFunction.py lldb-api :: lang/c/find_struct_type/TestFindStructTypes.py lldb-unit :: Utility/./UtilityTests/StringListTest.AppendList lldb-api :: tools/lldb-vscode/step/TestVSCode_step.py lldb-shell :: Settings/TestDisableColor.test lldb-unit :: Language/Highlighting/./HighlighterTests/HighlighterTest.ClangCursorPosInOtherToken lldb-unit :: Process/gdb-remote/./ProcessGdbRemoteTests/GDBRemoteCommunicationClientTest.WriteRegister lldb-api :: lang/cpp/namespace_conflicts/TestNamespaceConflicts.py lldb-unit :: Core/./LLDBCoreTests/SourceFileCache.FindSourceFileNotFound lldb-shell :: ObjectFile/ELF/PT_TLS-overlap-PT_LOAD.yaml lldb-api :: commands/register/register/intel_xtended_registers/mpx_bound_violation/TestBoundViolation.py lldb-shell :: Reproducer/TestProcessList.test lldb-api :: python_api/value/change_values/TestChangeValueAPI.py lldb-api :: commands/expression/completion-crash-invalid-iterator/TestInvalidIteratorCompletionCrash.py lldb-api :: functionalities/data-formatter/ostypeformatting/TestFormattersOsType.py lldb-unit :: Host/./HostTests/SocketTests/SocketTest.TCPGetConnectURI/ipv4 lldb-shell :: Commands/command-target-modules-dump-sections.yaml lldb-unit :: Utility/./UtilityTests/PassiveReplayTest.InstrumentedBarPtr lldb-api :: functionalities/gdb_remote_client/TestRecognizeBreakpoint.py lldb-api :: sample_test/TestSampleTest.py lldb-unit :: ScriptInterpreter/Python/./ScriptInterpreterPythonTests/PythonDataObjectsTest.TestPythonIntegerToStr lldb-shell :: ScriptInterpreter/Python/Crashlog/parser_json.test lldb-shell :: Quit/TestQuitExitCodeHexA.test lldb-unit :: Utility/./UtilityTests/StringListTest.Clear lldb-unit :: ScriptInterpreter/Python/./ScriptInterpreterPythonTests/PythonDataObjectsTest.TestPythonListValueEquality lldb-api :: commands/frame/var-scope/TestFrameVariableScope.py lldb-api :: lang/objc/single-entry-dictionary/TestObjCSingleEntryDictionary.py lldb-api :: commands/expression/multiline-completion/TestMultilineCompletion.py lldb-unit :: Process/Utility/./ProcessUtilityTests/ProcSMapTests/LinuxProcSMapsTestFixture.ParseSMapRegions/8 lldb-shell :: SymbolFile/Breakpad/line-table-missing-file.test lldb-unit :: Utility/./UtilityTests/UserIDResolver.GetGroupName lldb-api :: macosx/indirect_symbol/TestIndirectSymbols.py lldb-unit :: Utility/./UtilityTests/StreamTeeTest.DefaultConstructor lldb-api :: lang/cpp/class-template-parameter-pack/TestClassTemplateParameterPack.py lldb-unit :: ObjectFile/PECOFF/./ObjectFilePECOFFTests/PECallFrameInfoTest.Basic_eh lldb-api :: commands/target/auto-install-main-executable/TestAutoInstallMainExecutable.py lldb-unit :: Symbol/./SymbolTests/LineEntryTest.GetSameLineContiguousAddressRangeOneInline lldb-unit :: Utility/./UtilityTests/OptionsWithRawTest.MultiWordSuffix lldb-api :: lang/objc/modules-incomplete/TestIncompleteModules.py lldb-shell :: ObjectFile/ELF/gnu-debuglink.yaml lldb-api :: functionalities/breakpoint/breakpoint_ids/TestBreakpointIDs.py lldb-api :: tools/lldb-vscode/module/TestVSCode_module.py lldb-unit :: Language/Highlighting/./HighlighterTests/HighlighterTest.FallbackHighlighter lldb-unit :: Process/minidump/./LLDBMinidumpTests/MinidumpParserTest.FindMemoryRange lldb-unit :: Utility/./UtilityTests/StringListTest.AppendStringCString lldb-unit :: UnwindAssembly/x86/./UnwindAssemblyx86Tests/Testx86AssemblyInspectionEngine.TestMovRSPtoRBP lldb-unit :: Utility/./UtilityTests/StringListTest.LongestCommonPrefixSingleElement lldb-api :: commands/expression/result_numbering/TestResultNumbering.py lldb-unit :: DataFormatter/./LLDBFormatterTests/StringPrinterTests.SwiftUTF8 lldb-unit :: Utility/./UtilityTests/StringListTest.ForRangeEmpty lldb-unit :: Core/./LLDBCoreTests/RichManglingContextTest.Basic lldb-api :: benchmarks/continue/TestBenchmarkContinue.py lldb-api :: python_api/process/TestProcessAPI.py lldb-api :: python_api/value/linked_list/TestValueAPILinkedList.py lldb-api :: arm/breakpoint-it/TestBreakpointIt.py lldb-unit :: Utility/./UtilityTests/ProcessInstanceInfo.Dump lldb-unit :: Process/minidump/./LLDBMinidumpTests/MinidumpParserTest.MinidumpDuplicateModuleSeparateCode lldb-unit :: Utility/./UtilityTests/VMRange.SetEndAddress lldb-unit :: UnwindAssembly/x86/./UnwindAssemblyx86Tests/Testx86AssemblyInspectionEngine.TestPopR14 lldb-api :: lang/c/offsetof/TestOffsetof.py lldb-api :: functionalities/plugins/python_os_plugin/stepping_plugin_threads/TestOSPluginStepping.py lldb-api :: commands/frame/language/TestGuessLanguage.py lldb-unit :: Symbol/./SymbolTests/PostfixExpression.ParseOneExpression lldb-api :: functionalities/darwin_log/filter/regex/message/TestDarwinLogFilterRegexMessage.py lldb-unit :: Expression/./ExpressionTests/CppModuleConfigurationTest.Xcode lldb-shell :: SymbolFile/DWARF/debug_loc-aslr.s lldb-api :: functionalities/thread/concurrent_events/TestConcurrentBreakpointDelayBreakpointOneSignal.py lldb-unit :: SymbolFile/DWARF/./SymbolFileDWARFTests/SymbolFileDWARFTests.TestAbbrevOrder1Start5 lldb-unit :: UnwindAssembly/x86/./UnwindAssemblyx86Tests/Testx86AssemblyInspectionEngine.TestPushR12 lldb-api :: lang/objc/objc-dyn-sbtype/TestObjCDynamicSBType.py lldb-unit :: Utility/./UtilityTests/UriParserTest.SchemeHostSeparator lldb-unit :: Symbol/./SymbolTests/TestClangASTImporter.DeportTypeTagDecl lldb-shell :: Settings/TestDefaultModuleCachePath.test lldb-shell :: ObjectFile/Breakpad/uuid-matching-mac.test lldb-api :: types/TestShortTypeExpr.py lldb-unit :: Process/gdb-remote/./ProcessGdbRemoteTests/PortMapTest.FreePort lldb-unit :: SymbolFile/NativePDB/./SymbolFileNativePDBTests/PDBFPOProgramToDWARFExpressionTests.UnsupportedRASearch lldb-api :: commands/expression/dollar-in-variable/TestDollarInVariable.py lldb-unit :: Utility/./UtilityTests/StreamTeeTest.GetStreamAtIndexOutOfBounds lldb-unit :: Host/./HostTests/ConnectionFileDescriptorTest.TCPGetURIv6 lldb-shell :: Driver/TestTarget.test lldb-unit :: Utility/./UtilityTests/ArgsTest.TestQuotedUnknownEscape lldb-api :: functionalities/process_save_core/TestProcessSaveCore.py lldb-unit :: Utility/./UtilityTests/TimerTest.CategoryTimesStats lldb-api :: functionalities/unwind/ehframe/TestEhFrameUnwind.py lldb-unit :: Utility/./UtilityTests/UriParserTest.LongPath lldb-unit :: Utility/./UtilityTests/DataExtractorTest.GetMaxS64 lldb-api :: lang/objc/objc-super/TestObjCSuper.py lldb-unit :: Language/Highlighting/./HighlighterTests/HighlighterTest.ClangIdentifiers lldb-unit :: Utility/./UtilityTests/StringExtractorTest.GetHexU8_Underflow lldb-shell :: Unwind/trap_frame_sym_ctx.test lldb-api :: commands/expression/import-std-module/weak_ptr/TestWeakPtrFromStdModule.py lldb-api :: functionalities/data-formatter/data-formatter-stl/libcxx/function/TestLibCxxFunction.py lldb-shell :: Commands/command-stop-hook-output.test lldb-api :: functionalities/data-formatter/vector-types/TestVectorTypesFormatting.py lldb-api :: lang/cpp/symbols/TestSymbols.py lldb-unit :: UnwindAssembly/x86/./UnwindAssemblyx86Tests/Testx86AssemblyInspectionEngine.TestPushEBX lldb-unit :: Process/gdb-remote/./ProcessGdbRemoteTests/GDBRemoteClientBaseTest.InterruptNoResponse lldb-shell :: ScriptInterpreter/Python/Crashlog/text.test lldb-api :: commands/expression/scoped_enums/TestScopedEnumType.py lldb-api :: commands/expression/test/TestExprs2.py lldb-unit :: Symbol/./SymbolTests/SymbolsTest.TerminateLocateExecutableSymbolFileForUnknownExecutableAndUnknownSymbolFile lldb-unit :: Utility/./UtilityTests/RangeTest.SizeTypes lldb-unit :: Utility/./UtilityTests/XcodeSDKTest.SDKSupportsModules lldb-api :: python_api/file_handle/TestFileHandle.py lldb-unit :: Utility/./UtilityTests/StreamTest.AddressSuffix lldb-unit :: Utility/./UtilityTests/StreamTest.PutRawBytesToLittleEndian lldb-api :: commands/expression/function_template_specialization_temp_args/TestFunctionTemplateSpecializationTempArgs.py lldb-unit :: Utility/./UtilityTests/ArgsTest.TestSingleArg lldb-shell :: SymbolFile/DWARF/debug_loc.s lldb-api :: commands/process/signal/TestProcessSignal.py lldb-api :: lang/cpp/template/TestTemplateArgs.py lldb-unit :: Utility/./UtilityTests/BinaryStreamTest.PutULEB128Zero lldb-api :: functionalities/thread/thread_exit/TestThreadExit.py lldb-api :: lang/objc/real-definition/TestRealDefinition.py lldb-unit :: Utility/./UtilityTests/StringListTest.GetMaxStringLengthIncreasingSize lldb-unit :: Utility/./UtilityTests/StringExtractorTest.GetNameColonValueNoColon lldb-api :: functionalities/breakpoint/debugbreak/TestDebugBreak.py lldb-unit :: Core/./LLDBCoreTests/MangledTest.NameIndexes_FindFunctionSymbols lldb-api :: lang/c/record_decl_in_expr/TestRecordDeclInExpr.py lldb-unit :: Utility/./UtilityTests/DataExtractorTest.GetULEB128_bit63 lldb-unit :: Process/gdb-remote/./ProcessGdbRemoteTests/GDBRemoteCommunicationClientTest.GetMemoryRegionInfo lldb-api :: functionalities/type_get_module/TestTypeGetModule.py lldb-api :: lang/cpp/exceptions/TestCPPExceptionBreakpoints.py lldb-api :: commands/frame/recognizer/TestFrameRecognizer.py lldb-shell :: SymbolFile/Breakpad/unwind-via-stack-win-no-memory-info.yaml lldb-api :: functionalities/data-formatter/data-formatter-stl/libstdcpp/unique_ptr/invalid/TestDataFormatterInvalidStdUniquePtr.py lldb-api :: functionalities/gdb_remote_client/TestGDBRemoteClient.py lldb-api :: lang/cpp/namespace_definitions/TestNamespaceDefinitions.py lldb-api :: lang/cpp/scope/TestCppScope.py lldb-api :: python_api/thread/TestThreadAPI.py lldb-unit :: Utility/./UtilityTests/AnsiTerminal.AtStart lldb-unit :: Utility/./UtilityTests/StringListTest.JoinEmpty lldb-unit :: Process/minidump/./LLDBMinidumpTests/MinidumpParserTest.MinidumpDuplicateModuleMinAddress lldb-unit :: Utility/./UtilityTests/FileSpecTest.FormatFileSpec lldb-api :: lang/c/shared_lib/TestSharedLib.py lldb-shell :: BuildScript/toolchain-clang.test lldb-api :: functionalities/multidebugger_commands/TestMultipleDebuggersCommands.py lldb-unit :: UnwindAssembly/x86/./UnwindAssemblyx86Tests/Testx86AssemblyInspectionEngine.TestSimplei386ugmented lldb-unit :: Utility/./UtilityTests/StringListTest.ForRange lldb-api :: python_api/interpreter/TestRunCommandInterpreterAPI.py lldb-api :: functionalities/tail_call_frames/thread_step_out_or_return/TestSteppingOutWithArtificialFrames.py

Hide Details

Hide Details

Testing Time: 72.43s Unsupported : 176 Passed : 477 Expectedly Failed: 9 Failed : 1578 FAILED: tools/lldb/test/CMakeFiles/check-lldb-lit cd /Users/buildslave/jenkins/workspace/lldb-cmake-matrix/lldb-build/tools/lldb/test && /usr/local/Frameworks/Python.framework/Versions/3.7/bin/python3.7 /Users/buildslave/jenkins/workspace/lldb-cmake-matrix/lldb-build/./bin/llvm-lit -v --time-tests --shuffle --xunit-xml-output=/Users/buildslave/jenkins/workspace/lldb-cmake-matrix/test/results.xml -v /Users/buildslave/jenkins/workspace/lldb-cmake-matrix/lldb-build/tools/lldb/test ninja: build stopped: subcommand failed. Command failed: Command '['/usr/bin/env', 'TERM=vt100', '/usr/local/bin/ninja', '-v', 'check-lldb']' returned non-zero exit status 1. Command: ['/usr/bin/env', 'TERM=vt100', '/usr/local/bin/ninja', '-v', 'check-lldb'] + set -e [Pipeline] } [Pipeline] // timeout [Pipeline] junit Recording test results [Checks API] No suitable checks publisher found. [Pipeline] } [Pipeline] // stage [Pipeline] stage [Pipeline] { (Test DWARF4) [Pipeline] timeout Timeout set to expire in 1 hr 0 min [Pipeline] { [Pipeline] sh process apparently never started in /Users/buildslave/jenkins/workspace/lldb-cmake-matrix@tmp/durable-05bae9e6 (running Jenkins temporarily with -Dorg.jenkinsci.plugins.durabletask.BourneShellScript.LAUNCH_DIAGNOSTICS=true might make the problem clearer) [Pipeline] } [Pipeline] // timeout [Pipeline] } [Pipeline] // stage [Pipeline] stage [Pipeline] { (Test DWARF5) Stage "Test DWARF5" skipped due to earlier failure(s) [Pipeline] } [Pipeline] // stage [Pipeline] stage [Pipeline] { (Build Clang 5.0.2) Stage "Build Clang 5.0.2" skipped due to earlier failure(s) [Pipeline] } [Pipeline] // stage [Pipeline] stage [Pipeline] { (Test Clang 5.0.2) Stage "Test Clang 5.0.2" skipped due to earlier failure(s) [Pipeline] } [Pipeline] // stage [Pipeline] stage [Pipeline] { (Build Clang 7.0.1) Stage "Build Clang 7.0.1" skipped due to earlier failure(s) [Pipeline] } [Pipeline] // stage [Pipeline] stage [Pipeline] { (Test Clang 7.0.1) Stage "Test Clang 7.0.1" skipped due to earlier failure(s) [Pipeline] } [Pipeline] // stage [Pipeline] stage [Pipeline] { (Build Clang 9.0.0) Stage "Build Clang 9.0.0" skipped due to earlier failure(s) [Pipeline] } [Pipeline] // stage [Pipeline] stage [Pipeline] { (Test Clang 9.0.0) Stage "Test Clang 9.0.0" skipped due to earlier failure(s) [Pipeline] } [Pipeline] // stage [Pipeline] } [Pipeline] // withEnv [Pipeline] } [Pipeline] // node [Pipeline] End of Pipeline ERROR: script returned exit code -2 Finished: FAILURE