Console Output

Skipping 13,585 KB.. Full Log
PASS: LLVM-Unit :: Support/./SupportTests/BinaryStreamTest.StreamWriterIntegerArrays (68983 of 70496)
PASS: LLVM-Unit :: Support/./SupportTests/BinaryStreamTest.StringWriterStrings (68984 of 70496)
PASS: LLVM-Unit :: Support/./SupportTests/BlockFrequencyTest.OneToOne (68985 of 70496)
PASS: LLVM-Unit :: Support/./SupportTests/BinaryStreamTest.StreamWriterBounds (68986 of 70496)
PASS: LLVM-Unit :: Support/./SupportTests/BlockFrequencyTest.BigToBig (68987 of 70496)
PASS: LLVM-Unit :: Support/./SupportTests/BlockFrequencyTest.MaxToMax (68988 of 70496)
PASS: LLVM-Unit :: Support/./SupportTests/BlockFrequency.Divide (68989 of 70496)
PASS: LLVM-Unit :: Support/./SupportTests/BlockFrequencyTest.OneToZero (68990 of 70496)
PASS: LLVM-Unit :: Support/./SupportTests/BlockFrequencyTest.MaxToHalfMax (68991 of 70496)
PASS: LLVM-Unit :: Support/./SupportTests/BlockFrequencyTest.Saturate (68992 of 70496)
PASS: LLVM-Unit :: Support/./SupportTests/BlockFrequencyTest.SaturatingRightShift (68993 of 70496)
PASS: LLVM-Unit :: Support/./SupportTests/BranchProbabilityTest.Accessors (68994 of 70496)
PASS: LLVM-Unit :: Support/./SupportTests/BlockFrequencyTest.Subtract (68995 of 70496)
PASS: LLVM-Unit :: Support/./SupportTests/BranchProbabilityTest.getCompl (68996 of 70496)
PASS: LLVM-Unit :: Support/./SupportTests/BranchProbabilityTest.NormalizeProbabilities (68997 of 70496)
PASS: LLVM-Unit :: Support/./SupportTests/BranchProbabilityTest.scaleBruteForce (68998 of 70496)
PASS: LLVM-Unit :: Support/./SupportTests/BranchProbabilityTest.scale (68999 of 70496)
PASS: LLVM-Unit :: Support/./SupportTests/BranchProbabilityTest.ArithmeticOperators (69000 of 70496)
PASS: LLVM-Unit :: Support/./SupportTests/BranchProbabilityTest.Operators (69001 of 70496)
PASS: LLVM-Unit :: Support/./SupportTests/BlockFrequencyTest.ThreeToOne (69002 of 70496)
PASS: LLVM-Unit :: Support/./SupportTests/BranchProbabilityTest.MoreOperators (69003 of 70496)
PASS: LLVM-Unit :: Support/./SupportTests/BranchProbabilityTest.scaleByInverse (69004 of 70496)
PASS: LLVM-Unit :: Support/./SupportTests/ByteSwap.Swap_64 (69005 of 70496)
PASS: LLVM-Unit :: Support/./SupportTests/ByteSwap.Swap_32 (69006 of 70496)
PASS: LLVM-Unit :: Support/./SupportTests/CPUAlignBuildAttr.testBuildAttr (69007 of 70496)
PASS: LLVM-Unit :: Support/./SupportTests/CPUArchBuildAttr.testBuildAttr (69008 of 70496)
PASS: LLVM-Unit :: Support/./SupportTests/CRCTest.CRC32 (69009 of 70496)
PASS: LLVM-Unit :: Support/./SupportTests/CachePruningPolicyParser.Empty (69010 of 70496)
PASS: LLVM-Unit :: Support/./SupportTests/CPUArchProfileBuildAttr.testBuildAttr (69011 of 70496)
PASS: LLVM-Unit :: Support/./SupportTests/CachePruningPolicyParser.Errors (69012 of 70496)
PASS: LLVM-Unit :: Support/./SupportTests/CastingTest.cast (69013 of 70496)
PASS: LLVM-Unit :: Support/./SupportTests/CachePruningPolicyParser.Interval (69014 of 70496)
PASS: LLVM-Unit :: Support/./SupportTests/CachePruningPolicyParser.MaxSizePercentageOfAvailableSpace (69015 of 70496)
PASS: LLVM-Unit :: Support/./SupportTests/CastingTest.InferredUpcastTakesPrecedence (69016 of 70496)
PASS: LLVM-Unit :: Support/./SupportTests/CastingTest.cast_or_null (69017 of 70496)
PASS: LLVM-Unit :: Support/./SupportTests/CachePruningPolicyParser.Multiple (69018 of 70496)
PASS: LLVM-Unit :: Support/./SupportTests/CachePruningPolicyParser.MaxSizeBytes (69019 of 70496)
PASS: LLVM-Unit :: Support/./SupportTests/CastingTest.UpcastIsInferred (69020 of 70496)
PASS: LLVM-Unit :: Support/./SupportTests/CastingTest.dyn_cast (69021 of 70496)
PASS: LLVM-Unit :: Support/./SupportTests/CachePruningPolicyParser.Expiration (69022 of 70496)
PASS: LLVM-Unit :: Support/./SupportTests/CastingTest.isa (69023 of 70496)
PASS: LLVM-Unit :: Support/./SupportTests/CastingTest.smart_isa (69024 of 70496)
PASS: LLVM-Unit :: Support/./SupportTests/CastingTest.dyn_cast_or_null (69025 of 70496)
PASS: LLVM-Unit :: Support/./SupportTests/CastingTest.smart_cast (69026 of 70496)
PASS: LLVM-Unit :: Support/./SupportTests/CastingTest.isa_and_nonnull (69027 of 70496)
PASS: LLVM-Unit :: Support/./SupportTests/CastingTest.smart_dyn_cast (69028 of 70496)
PASS: LLVM-Unit :: Support/./SupportTests/CastingTest.smart_cast_or_null (69029 of 70496)
PASS: LLVM-Unit :: Support/./SupportTests/CastingTest.smart_dyn_cast_or_null (69030 of 70496)
PASS: LLVM-Unit :: Support/./SupportTests/CastingTest.unique_dyn_cast (69031 of 70496)
PASS: LLVM-Unit :: Support/./SupportTests/CheckedArithmetic.CheckedAdd (69032 of 70496)
PASS: LLVM-Unit :: Support/./SupportTests/CheckedArithmetic.CheckedAddSmall (69033 of 70496)
PASS: LLVM-Unit :: Support/./SupportTests/CheckedArithmetic.CheckedMul (69034 of 70496)
PASS: LLVM-Unit :: Support/./SupportTests/CheckedArithmetic.CheckedMulAddUnsigned (69035 of 70496)
PASS: LLVM-Unit :: Support/./SupportTests/CheckedArithmetic.CheckedAddUnsigned (69036 of 70496)
PASS: LLVM-Unit :: Support/./SupportTests/CheckedArithmetic.CheckedMulAddSmall (69037 of 70496)
PASS: LLVM-Unit :: Support/./SupportTests/CheckedArithmetic.CheckedMulAdd (69038 of 70496)
PASS: LLVM-Unit :: Support/./SupportTests/CheckedArithmetic.CheckedMulSmall (69039 of 70496)
PASS: LLVM-Unit :: Support/./SupportTests/Chrono.DurationFormat (69040 of 70496)
PASS: LLVM-Unit :: Support/./SupportTests/Chrono.ImplicitConversions (69041 of 70496)
PASS: LLVM-Unit :: Support/./SupportTests/CheckedArithmetic.CheckedMulUnsigned (69042 of 70496)
PASS: LLVM-Unit :: Support/./SupportTests/Chrono.TimeTConversion (69043 of 70496)
PASS: LLVM-Unit :: Support/./SupportTests/Chrono.TimePointFormat (69044 of 70496)
PASS: LLVM-Unit :: Support/./SupportTests/CommandLineTest.AliasesWithArguments (69045 of 70496)
PASS: LLVM-Unit :: Support/./SupportTests/CommandLineTest.AliasRequired (69046 of 70496)
PASS: LLVM-Unit :: Support/./SupportTests/CommandLineTest.AddToAllSubCommands (69047 of 70496)
PASS: LLVM-Unit :: Support/./SupportTests/CommandLineTest.ArgumentLimit (69048 of 70496)
PASS: LLVM-Unit :: Support/./SupportTests/CommandLineTest.Callback (69049 of 70496)
PASS: LLVM-Unit :: Support/./SupportTests/CommandLineTest.ConsumeAfterOnePositional (69050 of 70496)
PASS: LLVM-Unit :: Support/./SupportTests/CommandLineTest.ConsumeAfterTwoPositionals (69051 of 70496)
PASS: LLVM-Unit :: Support/./SupportTests/CommandLineTest.DefaultOptions (69052 of 70496)
PASS: LLVM-Unit :: Support/./SupportTests/CommandLineTest.GroupingAndPrefix (69053 of 70496)
PASS: LLVM-Unit :: Support/./SupportTests/CommandLineTest.GetRegisteredSubcommands (69054 of 70496)
PASS: LLVM-Unit :: Support/./SupportTests/CommandLineTest.GroupingWithValue (69055 of 70496)
PASS: LLVM-Unit :: Support/./SupportTests/CommandLineTest.ModifyExisitingOption (69056 of 70496)
PASS: LLVM-Unit :: Support/./SupportTests/CommandLineTest.HideUnrelatedOptions (69057 of 70496)
PASS: LLVM-Unit :: Support/./SupportTests/CommandLineTest.LongOptions (69058 of 70496)
PASS: LLVM-Unit :: Support/./SupportTests/CommandLineTest.LookupFailsInWrongSubCommand (69059 of 70496)
PASS: LLVM-Unit :: Support/./SupportTests/CommandLineTest.HideUnrelatedOptionsMulti (69060 of 70496)
PASS: LLVM-Unit :: Support/./SupportTests/CommandLineTest.OptionErrorMessageSuggest (69061 of 70496)
PASS: LLVM-Unit :: Support/./SupportTests/CommandLineTest.OptionErrorMessage (69062 of 70496)
PASS: LLVM-Unit :: Support/./SupportTests/CommandLineTest.PositionalEatArgsError (69063 of 70496)
PASS: LLVM-Unit :: Support/./SupportTests/CommandLineTest.OptionErrorMessageSuggestNoHidden (69064 of 70496)
PASS: LLVM-Unit :: Support/./SupportTests/CommandLineTest.PrefixOptions (69065 of 70496)
PASS: LLVM-Unit :: Support/./SupportTests/CommandLineTest.RecursiveResponseFiles (69066 of 70496)
PASS: LLVM-Unit :: Support/./SupportTests/CommandLineTest.ReadConfigFile (69067 of 70496)
PASS: LLVM-Unit :: Support/./SupportTests/CommandLineTest.RemoveFromAllSubCommands (69068 of 70496)
PASS: LLVM-Unit :: Support/./SupportTests/CommandLineTest.RemoveFromTopLevelSubCommand (69069 of 70496)
PASS: LLVM-Unit :: Support/./SupportTests/CommandLineTest.RemoveFromRegularSubCommand (69070 of 70496)
PASS: LLVM-Unit :: Support/./SupportTests/CommandLineTest.ReparseCommandLineOptions (69071 of 70496)
PASS: LLVM-Unit :: Support/./SupportTests/CommandLineTest.ResponseFileEOLs (69072 of 70496)
PASS: LLVM-Unit :: Support/./SupportTests/CommandLineTest.ResponseFileRelativePath (69073 of 70496)
PASS: LLVM-Unit :: Support/./SupportTests/CommandLineTest.ResponseFileWindows (69074 of 70496)
PASS: LLVM-Unit :: Support/./SupportTests/CommandLineTest.ResponseFiles (69075 of 70496)
PASS: LLVM-Unit :: Support/./SupportTests/CommandLineTest.SetDefautValue (69076 of 70496)
PASS: LLVM-Unit :: Support/./SupportTests/CommandLineTest.SetValueInSubcategories (69077 of 70496)
PASS: LLVM-Unit :: Support/./SupportTests/CommandLineTest.ResponseFilesAtArguments (69078 of 70496)
PASS: LLVM-Unit :: Support/./SupportTests/CommandLineTest.TokenizeConfigFile1 (69079 of 70496)
PASS: LLVM-Unit :: Support/./SupportTests/CommandLineTest.TokenizeAndMarkEOLs (69080 of 70496)
PASS: LLVM-Unit :: Support/./SupportTests/CommandLineTest.TokenizeConfigFile10 (69081 of 70496)
PASS: LLVM-Unit :: Support/./SupportTests/CommandLineTest.TokenizeConfigFile11 (69082 of 70496)
PASS: LLVM-Unit :: Support/./SupportTests/CommandLineTest.TokenizeConfigFile2 (69083 of 70496)
PASS: LLVM-Unit :: Support/./SupportTests/CommandLineTest.TokenizeConfigFile3 (69084 of 70496)
PASS: LLVM-Unit :: Support/./SupportTests/CommandLineTest.TokenizeConfigFile4 (69085 of 70496)
PASS: LLVM-Unit :: Support/./SupportTests/CommandLineTest.TokenizeConfigFile5 (69086 of 70496)
PASS: LLVM-Unit :: Support/./SupportTests/CommandLineTest.TokenizeConfigFile6 (69087 of 70496)
PASS: LLVM-Unit :: Support/./SupportTests/CommandLineTest.TokenizeConfigFile7 (69088 of 70496)
PASS: LLVM-Unit :: Support/./SupportTests/CommandLineTest.TokenizeWindowsCommandLine2 (69089 of 70496)
PASS: LLVM-Unit :: Support/./SupportTests/CommandLineTest.TokenizeConfigFile8 (69090 of 70496)
PASS: LLVM-Unit :: Support/./SupportTests/CommandLineTest.TokenizeGNUCommandLine (69091 of 70496)
PASS: LLVM-Unit :: Support/./SupportTests/CommandLineTest.TokenizeWindowsCommandLine1 (69092 of 70496)
PASS: LLVM-Unit :: Support/./SupportTests/CommandLineTest.UseMultipleCategories (69093 of 70496)
PASS: LLVM-Unit :: Support/./SupportTests/CommandLineTest.TokenizeConfigFile9 (69094 of 70496)
PASS: LLVM-Unit :: Support/./SupportTests/CommandLineTest.TokenizeWindowsCommandLineQuotedLastArgument (69095 of 70496)
PASS: LLVM-Unit :: Support/./SupportTests/CommandLineTest.UseOptionCategory (69096 of 70496)
PASS: LLVM-Unit :: Support/./SupportTests/CompressionTest.Zlib (69097 of 70496)
PASS: LLVM-Unit :: Support/./SupportTests/CompressionTest.ZlibCRC32 (69098 of 70496)
PASS: LLVM-Unit :: Support/./SupportTests/ConvertUTFTest.ConvertUTF16LittleEndianToUTF8String (69099 of 70496)
PASS: LLVM-Unit :: Support/./SupportTests/ConvertUTFTest.ConvertUTF16BigEndianToUTF8String (69100 of 70496)
PASS: LLVM-Unit :: Support/./SupportTests/ConvertUTFTest.ConvertUTF8ToUTF16String (69101 of 70496)
PASS: LLVM-Unit :: Support/./SupportTests/ConvertUTFTest.ConvertUTF8toWide (69102 of 70496)
PASS: LLVM-Unit :: Support/./SupportTests/ConvertUTFTest.Empty (69103 of 70496)
PASS: LLVM-Unit :: Support/./SupportTests/ConvertUTFTest.HasUTF16BOM (69104 of 70496)
PASS: LLVM-Unit :: Support/./SupportTests/CostTest.Operators (69105 of 70496)
PASS: LLVM-Unit :: Support/./SupportTests/ConvertUTFTest.UTF8ToUTF32PartialLenient (69106 of 70496)
PASS: LLVM-Unit :: Support/./SupportTests/CostTest.DefaultCtor (69107 of 70496)
PASS: LLVM-Unit :: Support/./SupportTests/ConvertUTFTest.OddLengthInput (69108 of 70496)
PASS: LLVM-Unit :: Support/./SupportTests/ConvertUTFTest.UTF16WrappersForConvertUTF16ToUTF8String (69109 of 70496)
PASS: LLVM-Unit :: Support/./SupportTests/ConvertUTFTest.UTF8ToUTF32Lenient (69110 of 70496)
PASS: LLVM-Unit :: Support/./SupportTests/ConvertUTFTest.convertWideToUTF8 (69111 of 70496)
PASS: LLVM-Unit :: Support/./SupportTests/CrashRecoveryTest.Cleanup (69112 of 70496)
PASS: LLVM-Unit :: Support/./SupportTests/CrashRecoveryTest.Basic (69113 of 70496)
PASS: LLVM-Unit :: Support/./SupportTests/CrashRecoveryTest.LimitedStackTrace (69114 of 70496)
PASS: LLVM-Unit :: Support/./SupportTests/CrashRecoveryTest.DumpStackCleanup (69115 of 70496)
PASS: LLVM-Unit :: Support/./SupportTests/DJBTest.caseFolding (69116 of 70496)
PASS: LLVM-Unit :: Support/./SupportTests/DJBTest.knownValuesLowerCase (69117 of 70496)
PASS: LLVM-Unit :: Support/./SupportTests/DJBTest.knownValuesUnicode (69118 of 70496)
PASS: LLVM-Unit :: Support/./SupportTests/DataExtractorTest.Cursor_chaining (69119 of 70496)
PASS: LLVM-Unit :: Support/./SupportTests/DataExtractorTest.Cursor_tell (69120 of 70496)
PASS: LLVM-Unit :: Support/./SupportTests/DataExtractorTest.Cursor_takeError (69121 of 70496)
PASS: LLVM-Unit :: Support/./SupportTests/CrashRecoveryTest.UnixCRCReturnCode (69122 of 70496)
PASS: LLVM-Unit :: Support/./SupportTests/DataExtractorTest.FixedLengthString (69123 of 70496)
PASS: LLVM-Unit :: Support/./SupportTests/DataExtractorTest.LEB128_error (69124 of 70496)
PASS: LLVM-Unit :: Support/./SupportTests/DataExtractorTest.GetBytes (69125 of 70496)
PASS: LLVM-Unit :: Support/./SupportTests/DataExtractorTest.OffsetOverflow (69126 of 70496)
PASS: LLVM-Unit :: Support/./SupportTests/DataExtractorTest.SignedNumbers (69127 of 70496)
PASS: LLVM-Unit :: Support/./SupportTests/DataExtractorTest.Strings (69128 of 70496)
PASS: LLVM-Unit :: Support/./SupportTests/DataExtractorTest.LEB128 (69129 of 70496)
PASS: LLVM-Unit :: Support/./SupportTests/DataExtractorTest.eof (69130 of 70496)
PASS: LLVM-Unit :: Support/./SupportTests/DataExtractorTest.getU24 (69131 of 70496)
PASS: LLVM-Unit :: Support/./SupportTests/DataExtractorTest.UnsignedNumbers (69132 of 70496)
PASS: LLVM-Unit :: Support/./SupportTests/DataExtractorTest.getU8_vector (69133 of 70496)
PASS: LLVM-Unit :: Support/./SupportTests/DataExtractorTest.size (69134 of 70496)
PASS: LLVM-Unit :: Support/./SupportTests/DataExtractorTest.skip (69135 of 70496)
PASS: LLVM-Unit :: Support/./SupportTests/Endian.PackedEndianSpecificIntegral (69136 of 70496)
PASS: LLVM-Unit :: Support/./SupportTests/DivBuildAttr.testBuildAttr (69137 of 70496)
PASS: LLVM-Unit :: Support/./SupportTests/Endian.Read (69138 of 70496)
PASS: LLVM-Unit :: Support/./SupportTests/Endian.Write (69139 of 70496)
PASS: LLVM-Unit :: Support/./SupportTests/Endian.PacketEndianSpecificIntegralAsEnum (69140 of 70496)
PASS: LLVM-Unit :: Support/./SupportTests/EndianStream.WriteArrayLE (69141 of 70496)
PASS: LLVM-Unit :: Support/./SupportTests/Endian.ReadBitAligned (69142 of 70496)
PASS: LLVM-Unit :: Support/./SupportTests/Endian.WriteBitAligned (69143 of 70496)
PASS: LLVM-Unit :: Support/./SupportTests/EndianStream.WriteDoubleLE (69144 of 70496)
PASS: LLVM-Unit :: Support/./SupportTests/EndianStream.WriteDoubleBE (69145 of 70496)
PASS: LLVM-Unit :: Support/./SupportTests/EndianStream.WriteFloatBE (69146 of 70496)
PASS: LLVM-Unit :: Support/./SupportTests/EndianStream.WriteFloatArrayLE (69147 of 70496)
PASS: LLVM-Unit :: Support/./SupportTests/EndianStream.WriteFloatLE (69148 of 70496)
PASS: LLVM-Unit :: Support/./SupportTests/EndianStream.WriteInt32BE (69149 of 70496)
PASS: LLVM-Unit :: Support/./SupportTests/EndianStream.WriteInt32LE (69150 of 70496)
PASS: LLVM-Unit :: Support/./SupportTests/EndianStream.WriteInt64BE (69151 of 70496)
PASS: LLVM-Unit :: Support/./SupportTests/EndianStream.WriteInt64LE (69152 of 70496)
PASS: LLVM-Unit :: Support/./SupportTests/EnumSizeBuildAttr.testBuildAttr (69153 of 70496)
PASS: LLVM-Unit :: Support/./SupportTests/Error.C_API (69154 of 70496)
PASS: LLVM-Unit :: Support/./SupportTests/EndianStream.WriteVectorLE (69155 of 70496)
PASS: LLVM-Unit :: Support/./SupportTests/Error.CantFailSuccess (69156 of 70496)
PASS: LLVM-Unit :: Support/./SupportTests/ErrnoTest.RetryAfterSignal (69157 of 70496)
PASS: LLVM-Unit :: Support/./SupportTests/Error.CheckJoinErrors (69158 of 70496)
PASS: LLVM-Unit :: Support/./SupportTests/Error.CheckedSuccess (69159 of 70496)
PASS: LLVM-Unit :: Support/./SupportTests/Error.CatchErrorFromHandler (69160 of 70496)
PASS: LLVM-Unit :: Support/./SupportTests/Error.CheckedExpectedInSuccessMode (69161 of 70496)
PASS: LLVM-Unit :: Support/./SupportTests/Error.ErrorMessage (69162 of 70496)
PASS: LLVM-Unit :: Support/./SupportTests/Error.ConsumeSuccess (69163 of 70496)
PASS: LLVM-Unit :: Support/./SupportTests/Error.ErrorAsOutParameterChecked (69164 of 70496)
PASS: LLVM-Unit :: Support/./SupportTests/Error.ConsumeError (69165 of 70496)
PASS: LLVM-Unit :: Support/./SupportTests/Error.ErrorCodeConversions (69166 of 70496)
PASS: LLVM-Unit :: Support/./SupportTests/Error.ExpectedCovariance (69167 of 70496)
PASS: LLVM-Unit :: Support/./SupportTests/Error.ExpectedInFailureMode (69168 of 70496)
PASS: LLVM-Unit :: Support/./SupportTests/Error.ExpectedWithReferenceType (69169 of 70496)
PASS: LLVM-Unit :: Support/./SupportTests/Error.FailedMatcher (69170 of 70496)
PASS: LLVM-Unit :: Support/./SupportTests/Error.FileErrorTest (69171 of 70496)
PASS: LLVM-Unit :: Support/./SupportTests/Error.FirstHandlerOnly (69172 of 70496)
PASS: LLVM-Unit :: Support/./SupportTests/Error.FailedWithMessageMatcher (69173 of 70496)
PASS: LLVM-Unit :: Support/./SupportTests/Error.HandleCustomError (69174 of 70496)
PASS: LLVM-Unit :: Support/./SupportTests/Error.HandleCustomErrorWithCustomBaseClass (69175 of 70496)
PASS: LLVM-Unit :: Support/./SupportTests/Error.HandleExpectedHandledError (69176 of 70496)
PASS: LLVM-Unit :: Support/./SupportTests/Error.ExitOnError (69177 of 70496)
PASS: LLVM-Unit :: Support/./SupportTests/Error.HandleExpectedSuccess (69178 of 70496)
PASS: LLVM-Unit :: Support/./SupportTests/Error.HandlerShadowing (69179 of 70496)
PASS: LLVM-Unit :: Support/./SupportTests/Error.HandlerTypeDeduction (69180 of 70496)
PASS: LLVM-Unit :: Support/./SupportTests/Error.HandleExpectedUnhandledError (69181 of 70496)
PASS: LLVM-Unit :: Support/./SupportTests/Error.HasValueMatcher (69182 of 70496)
PASS: LLVM-Unit :: Support/./SupportTests/Error.IsAHandling (69183 of 70496)
PASS: LLVM-Unit :: Support/./SupportTests/Error.Stream (69184 of 70496)
PASS: LLVM-Unit :: Support/./SupportTests/Error.SubtypeStringErrorTest (69185 of 70496)
PASS: LLVM-Unit :: Support/./SupportTests/Error.StringError (69186 of 70496)
PASS: LLVM-Unit :: Support/./SupportTests/Error.SucceededMatcher (69187 of 70496)
PASS: LLVM-Unit :: Support/./SupportTests/ErrorOr.Comparison (69188 of 70496)
PASS: LLVM-Unit :: Support/./SupportTests/ErrorOr.Covariant (69189 of 70496)
PASS: LLVM-Unit :: Support/./SupportTests/Error.createStringError (69190 of 70496)
PASS: LLVM-Unit :: Support/./SupportTests/ErrorOr.ImplicitConversion (69191 of 70496)
PASS: LLVM-Unit :: Support/./SupportTests/ErrorOr.ImplicitConversionCausesMove (69192 of 70496)
PASS: LLVM-Unit :: Support/./SupportTests/ErrorOr.SimpleValue (69193 of 70496)
PASS: LLVM-Unit :: Support/./SupportTests/ErrorOr.ImplicitConversionNoAmbiguity (69194 of 70496)
PASS: LLVM-Unit :: Support/./SupportTests/ErrorOr.Types (69195 of 70496)
PASS: LLVM-Unit :: Support/./SupportTests/ExtensibleRTTI.dyn_cast (69196 of 70496)
PASS: LLVM-Unit :: Support/./SupportTests/ExtensibleRTTI.cast (69197 of 70496)
PASS: LLVM-Unit :: Support/./SupportTests/ExtensibleRTTI.isa (69198 of 70496)
PASS: LLVM-Unit :: Support/./SupportTests/FP16BuildAttr.testBuildAttr (69199 of 70496)
PASS: LLVM-Unit :: Support/./SupportTests/FPArchBuildAttr.testBuildAttr (69200 of 70496)
PASS: LLVM-Unit :: Support/./SupportTests/FPExceptionsBuildAttr.testBuildAttr (69201 of 70496)
PASS: LLVM-Unit :: Support/./SupportTests/FPDenormalBuildAttr.testBuildAttr (69202 of 70496)
PASS: LLVM-Unit :: Support/./SupportTests/FPHPBuildAttr.testBuildAttr (69203 of 70496)
PASS: LLVM-Unit :: Support/./SupportTests/FPNumberModelBuildAttr.testBuildAttr (69204 of 70496)
PASS: LLVM-Unit :: Support/./SupportTests/FPUserExceptionsBuildAttr.testBuildAttr (69205 of 70496)
PASS: LLVM-Unit :: Support/./SupportTests/FPRoundingBuildAttr.testBuildAttr (69206 of 70496)
PASS: LLVM-Unit :: Support/./SupportTests/FSUniqueIDTest.equals (69207 of 70496)
PASS: LLVM-Unit :: Support/./SupportTests/FSUniqueIDTest.construct (69208 of 70496)
PASS: LLVM-Unit :: Support/./SupportTests/FSUniqueIDTest.less (69209 of 70496)
PASS: LLVM-Unit :: Support/./SupportTests/FileCollectorTest.addDirectory (69210 of 70496)
PASS: LLVM-Unit :: Support/./SupportTests/FileCollectorTest.addFile (69211 of 70496)
PASS: LLVM-Unit :: Support/./SupportTests/FileCollectorTest.Symlinks (69212 of 70496)
PASS: LLVM-Unit :: Support/./SupportTests/FileCollectorTest.recordAndConstructDirectory (69213 of 70496)
PASS: LLVM-Unit :: Support/./SupportTests/FileCollectorTest.recordVFSSymlinkAccesses (69214 of 70496)
PASS: LLVM-Unit :: Support/./SupportTests/FileSystemTest.CreateAlways (69215 of 70496)
PASS: LLVM-Unit :: Support/./SupportTests/FileSystemTest.CreateDir (69216 of 70496)
PASS: LLVM-Unit :: Support/./SupportTests/FileSystemTest.AppendSetsCorrectFileOffset (69217 of 70496)
PASS: LLVM-Unit :: Support/./SupportTests/FileSystemTest.DirectoryNotExecutable (69218 of 70496)
PASS: LLVM-Unit :: Support/./SupportTests/FileCollectorTest.recordVFSAccesses (69219 of 70496)
PASS: LLVM-Unit :: Support/./SupportTests/FileSystemTest.CreateNew (69220 of 70496)
PASS: LLVM-Unit :: Support/./SupportTests/FileCollectorTest.copyFiles (69221 of 70496)
PASS: LLVM-Unit :: Support/./SupportTests/FileSystemTest.BrokenSymlinkDirectoryIteration (69222 of 70496)
PASS: LLVM-Unit :: Support/./SupportTests/FileSystemTest.DirectoryIteration (69223 of 70496)
PASS: LLVM-Unit :: Support/./SupportTests/FileOutputBuffer.Test (69224 of 70496)
PASS: LLVM-Unit :: Support/./SupportTests/FileSystemTest.ExpandTilde (69225 of 70496)
PASS: LLVM-Unit :: Support/./SupportTests/FileSystemTest.MD5 (69226 of 70496)
PASS: LLVM-Unit :: Support/./SupportTests/FileSystemTest.FileMapping (69227 of 70496)
PASS: LLVM-Unit :: Support/./SupportTests/FileSystemTest.OpenAlways (69228 of 70496)
PASS: LLVM-Unit :: Support/./SupportTests/FileSystemTest.OpenExisting (69229 of 70496)
PASS: LLVM-Unit :: Support/./SupportTests/FileSystemTest.OpenFileForRead (69230 of 70496)
PASS: LLVM-Unit :: Support/./SupportTests/FileSystemTest.ReadOnlyFileCantWrite (69231 of 70496)
PASS: LLVM-Unit :: Support/./SupportTests/FileSystemTest.ReadWriteFileCanReadOrWrite (69232 of 70496)
PASS: LLVM-Unit :: Support/./SupportTests/FileSystemTest.Resize (69233 of 70496)
PASS: LLVM-Unit :: Support/./SupportTests/FileSystemTest.RealPath (69234 of 70496)
PASS: LLVM-Unit :: Support/./SupportTests/FileSystemTest.RespectUmask (69235 of 70496)
PASS: LLVM-Unit :: Support/./SupportTests/FileSystemTest.RealPathNoReadPerm (69236 of 70496)
PASS: LLVM-Unit :: Support/./SupportTests/FileSystemTest.Remove (69237 of 70496)
PASS: LLVM-Unit :: Support/./SupportTests/FileSystemTest.TempFileKeepDiscard (69238 of 70496)
PASS: LLVM-Unit :: Support/./SupportTests/FileSystemTest.getUmask (69239 of 70496)
PASS: LLVM-Unit :: Support/./SupportTests/FileSystemTest.TempFiles (69240 of 70496)
PASS: LLVM-Unit :: Support/./SupportTests/FileSystemTest.Unique (69241 of 70496)
PASS: LLVM-Unit :: Support/./SupportTests/FileSystemTest.WriteOnlyFileCantRead (69242 of 70496)
PASS: LLVM-Unit :: Support/./SupportTests/FileSystemTest.is_local (69243 of 70496)
PASS: LLVM-Unit :: Support/./SupportTests/FormatVariadicTest.BigTest (69244 of 70496)
PASS: LLVM-Unit :: Support/./SupportTests/FormatVariadicTest.CharFormatting (69245 of 70496)
PASS: LLVM-Unit :: Support/./SupportTests/FormatVariadicTest.BoolTest (69246 of 70496)
PASS: LLVM-Unit :: Support/./SupportTests/FileSystemTest.TempFileDiscardDiscard (69247 of 70496)
PASS: LLVM-Unit :: Support/./SupportTests/FormatVariadicTest.Adapter (69248 of 70496)
PASS: LLVM-Unit :: Support/./SupportTests/FormatVariadicTest.CopiesAndMoves (69249 of 70496)
PASS: LLVM-Unit :: Support/./SupportTests/FormatVariadicTest.DefaultReplacementValues (69250 of 70496)
PASS: LLVM-Unit :: Support/./SupportTests/FormatVariadicTest.CustomPaddingCharacter (69251 of 70496)
PASS: LLVM-Unit :: Support/./SupportTests/FormatVariadicTest.DoubleFormatting (69252 of 70496)
PASS: LLVM-Unit :: Support/./SupportTests/FileSystemTest.set_current_path (69253 of 70496)
PASS: LLVM-Unit :: Support/./SupportTests/FileSystemTest.readNativeFileSlice (69254 of 70496)
PASS: LLVM-Unit :: Support/./SupportTests/FormatVariadicTest.EscapedBrace (69255 of 70496)
PASS: LLVM-Unit :: Support/./SupportTests/FormatVariadicTest.EmptyFormatString (69256 of 70496)
PASS: LLVM-Unit :: Support/./SupportTests/FormatVariadicTest.FormatBasicTypesOneReplacement (69257 of 70496)
PASS: LLVM-Unit :: Support/./SupportTests/FormatVariadicTest.FormatAdapter (69258 of 70496)
PASS: LLVM-Unit :: Support/./SupportTests/FileSystemTest.permissions (69259 of 70496)
PASS: LLVM-Unit :: Support/./SupportTests/FileSystemTest.readNativeFile (69260 of 70496)
PASS: LLVM-Unit :: Support/./SupportTests/FormatVariadicTest.ImplicitConversions (69261 of 70496)
PASS: LLVM-Unit :: Support/./SupportTests/FormatVariadicTest.IntegralHexFormatting (69262 of 70496)
PASS: LLVM-Unit :: Support/./SupportTests/FormatVariadicTest.IntegralNumberFormatting (69263 of 70496)
PASS: LLVM-Unit :: Support/./SupportTests/FormatVariadicTest.FormatStreamable (69264 of 70496)
PASS: LLVM-Unit :: Support/./SupportTests/FormatVariadicTest.NoReplacements (69265 of 70496)
PASS: LLVM-Unit :: Support/./SupportTests/FormatVariadicTest.FormatNoReplacements (69266 of 70496)
PASS: LLVM-Unit :: Support/./SupportTests/FormatVariadicTest.PointerFormatting (69267 of 70496)
PASS: LLVM-Unit :: Support/./SupportTests/FormatVariadicTest.Range (69268 of 70496)
PASS: LLVM-Unit :: Support/./SupportTests/FormatVariadicTest.FormatError (69269 of 70496)
PASS: LLVM-Unit :: Support/./SupportTests/FormatVariadicTest.StringFormatting (69270 of 70496)
PASS: LLVM-Unit :: Support/./SupportTests/FormatVariadicTest.MultipleReplacements (69271 of 70496)
PASS: LLVM-Unit :: Support/./SupportTests/FormatVariadicTest.MoveConstructor (69272 of 70496)
PASS: LLVM-Unit :: Support/./SupportTests/FormatVariadicTest.FormatFormatvObject (69273 of 70496)
PASS: LLVM-Unit :: Support/./SupportTests/FormatVariadicTest.ValidReplacementSequence (69274 of 70496)
PASS: LLVM-Unit :: Support/./SupportTests/GetOptionWidthTest.GetOptionWidthArgNameLonger (69275 of 70496)
PASS: LLVM-Unit :: Support/./SupportTests/GetOptionWidthTest.GetOptionWidthEmptyOptionNameLonger (69276 of 70496)
PASS: LLVM-Unit :: Support/./SupportTests/GetOptionWidthTest.GetOptionWidthValueOptionalEmptyOptionWithNoDescription (69277 of 70496)
PASS: LLVM-Unit :: Support/./SupportTests/GetOptionWidthTest.GetOptionWidthValueRequiredEmptyOptionWithNoDescription (69278 of 70496)
PASS: LLVM-Unit :: Support/./SupportTests/GetOptionWidthTest.GetOptionWidthSecondOptionNameLonger (69279 of 70496)
PASS: LLVM-Unit :: Support/./SupportTests/GlobPatternTest.Empty (69280 of 70496)
PASS: LLVM-Unit :: Support/./SupportTests/GetOptionWidthTest.GetOptionWidthFirstOptionNameLonger (69281 of 70496)
PASS: LLVM-Unit :: Support/./SupportTests/GlobPatternTest.ExtSym (69282 of 70496)
PASS: LLVM-Unit :: Support/./SupportTests/GlobPatternTest.BracketFrontOfCharacterClass (69283 of 70496)
PASS: LLVM-Unit :: Support/./SupportTests/GlobPatternTest.NegatedCharacterClass (69284 of 70496)
PASS: LLVM-Unit :: Support/./SupportTests/GlobPatternTest.IsTrivialMatchAll (69285 of 70496)
PASS: LLVM-Unit :: Support/./SupportTests/GlobPatternTest.BasicCharacterClass (69286 of 70496)
PASS: LLVM-Unit :: Support/./SupportTests/GlobPatternTest.Escape (69287 of 70496)
PASS: LLVM-Unit :: Support/./SupportTests/GlobPatternTest.Glob (69288 of 70496)
PASS: LLVM-Unit :: Support/./SupportTests/GlobPatternTest.Invalid (69289 of 70496)
PASS: LLVM-Unit :: Support/./SupportTests/FileSystemTest.TempFileCollisions (69290 of 70496)
PASS: LLVM-Unit :: Support/./SupportTests/GlobPatternTest.Wildcard (69291 of 70496)
PASS: LLVM-Unit :: Support/./SupportTests/InMemoryFileSystemTest.AddDirectoryThenAddChild (69292 of 70496)
PASS: LLVM-Unit :: Support/./SupportTests/GlobPatternTest.SpecialCharsInCharacterClass (69293 of 70496)
PASS: LLVM-Unit :: Support/./SupportTests/HostTest.DummyRunAndGetCommandOutputUse (69294 of 70496)
PASS: LLVM-Unit :: Support/./SupportTests/HostTest.NumPhysicalCores (69295 of 70496)
PASS: LLVM-Unit :: Support/./SupportTests/InMemoryFileSystemTest.AddFileInPlaceOfAHardLinkWithDifferentContent (69296 of 70496)
PASS: LLVM-Unit :: Support/./SupportTests/InMemoryFileSystemTest.AddFileWithGroup (69297 of 70496)
PASS: LLVM-Unit :: Support/./SupportTests/HardFPBuildAttr.testBuildAttr (69298 of 70496)
PASS: LLVM-Unit :: Support/./SupportTests/InMemoryFileSystemTest.AddFileWithUser (69299 of 70496)
PASS: LLVM-Unit :: Support/./SupportTests/InMemoryFileSystemTest.AddHardLinkInChainPattern (69300 of 70496)
PASS: LLVM-Unit :: Support/./SupportTests/InMemoryFileSystemTest.AddFileWithFileType (69301 of 70496)
PASS: LLVM-Unit :: Support/./SupportTests/InMemoryFileSystemTest.AddFileWithPerms (69302 of 70496)
PASS: LLVM-Unit :: Support/./SupportTests/InMemoryFileSystemTest.AddHardLinkFromAFileThatWasAddedBefore (69303 of 70496)
PASS: LLVM-Unit :: Support/./SupportTests/InMemoryFileSystemTest.AddHardLinkToAFileThatWasNotAddedBefore (69304 of 70496)
PASS: LLVM-Unit :: Support/./SupportTests/InMemoryFileSystemTest.AddHardLinkFromADirectory (69305 of 70496)
PASS: LLVM-Unit :: Support/./SupportTests/InMemoryFileSystemTest.AddHardLinkToFile (69306 of 70496)
PASS: LLVM-Unit :: Support/./SupportTests/InMemoryFileSystemTest.AddHardLinkToADirectory (69307 of 70496)
PASS: LLVM-Unit :: Support/./SupportTests/InMemoryFileSystemTest.AddFileInPlaceOfAHardLinkWithSameContent (69308 of 70496)
PASS: LLVM-Unit :: Support/./SupportTests/HostTest.getMacOSHostVersion (69309 of 70496)
PASS: LLVM-Unit :: Support/./SupportTests/InMemoryFileSystemTest.DuplicatedFile (69310 of 70496)
PASS: LLVM-Unit :: Support/./SupportTests/InMemoryFileSystemTest.AddHardLinkUnderAFile (69311 of 70496)
PASS: LLVM-Unit :: Support/./SupportTests/InMemoryFileSystemTest.AddSameHardLinkMoreThanOnce (69312 of 70496)
PASS: LLVM-Unit :: Support/./SupportTests/InMemoryFileSystemTest.IsLocal (69313 of 70496)
PASS: LLVM-Unit :: Support/./SupportTests/InMemoryFileSystemTest.GetRealPath (69314 of 70496)
PASS: LLVM-Unit :: Support/./SupportTests/InMemoryFileSystemTest.IsEmpty (69315 of 70496)
PASS: LLVM-Unit :: Support/./SupportTests/InMemoryFileSystemTest.OpenFileForRead (69316 of 70496)
PASS: LLVM-Unit :: Support/./SupportTests/InMemoryFileSystemTest.DirectoryIteration (69317 of 70496)
PASS: LLVM-Unit :: Support/./SupportTests/InMemoryFileSystemTest.OverlayFile (69318 of 70496)
PASS: LLVM-Unit :: Support/./SupportTests/InMemoryFileSystemTest.RecursiveIterationWithHardLink (69319 of 70496)
PASS: LLVM-Unit :: Support/./SupportTests/InMemoryFileSystemTest.StatusName (69320 of 70496)
PASS: LLVM-Unit :: Support/./SupportTests/InMemoryFileSystemTest.OverlayFileNoOwn (69321 of 70496)
PASS: LLVM-Unit :: Support/./SupportTests/InMemoryFileSystemTest.WindowsPath (69322 of 70496)
PASS: LLVM-Unit :: Support/./SupportTests/Initialize.MultipleThreads (69323 of 70496)
PASS: LLVM-Unit :: Support/./SupportTests/InMemoryFileSystemTest.WorkingDirectory (69324 of 70496)
PASS: LLVM-Unit :: Support/./SupportTests/ItaniumManglingCanonicalizerTest.TestCanonicalize (69325 of 70496)
PASS: LLVM-Unit :: Support/./SupportTests/ItaniumManglingCanonicalizerTest.TestLookup (69326 of 70496)
PASS: LLVM-Unit :: Support/./SupportTests/JSONTest.CanonicalOutput (69327 of 70496)
PASS: LLVM-Unit :: Support/./SupportTests/JSONTest.Constructors (69328 of 70496)
PASS: LLVM-Unit :: Support/./SupportTests/JSONTest.Integers (69329 of 70496)
PASS: LLVM-Unit :: Support/./SupportTests/JSONTest.Parse (69330 of 70496)
PASS: LLVM-Unit :: Support/./SupportTests/JSONTest.Object (69331 of 70496)
PASS: LLVM-Unit :: Support/./SupportTests/JSONTest.Inspection (69332 of 70496)
PASS: LLVM-Unit :: Support/./SupportTests/JSONTest.Escaping (69333 of 70496)
PASS: LLVM-Unit :: Support/./SupportTests/JSONTest.ParseErrors (69334 of 70496)
PASS: LLVM-Unit :: Support/./SupportTests/ItaniumManglingCanonicalizerTest.TestBadEquivalenceOrder (69335 of 70496)
PASS: LLVM-Unit :: Support/./SupportTests/ItaniumManglingCanonicalizerTest.TestInvalidManglings (69336 of 70496)
PASS: LLVM-Unit :: Support/./SupportTests/ItaniumManglingCanonicalizerTest.TestForwardTemplateReference (69337 of 70496)
PASS: LLVM-Unit :: Support/./SupportTests/JSONTest.PrettyPrinting (69338 of 70496)
PASS: LLVM-Unit :: Support/./SupportTests/JSONTest.Path (69339 of 70496)
PASS: LLVM-Unit :: Support/./SupportTests/JSONTest.Stream (69340 of 70496)
PASS: LLVM-Unit :: Support/./SupportTests/JSONTest.StringOwnership (69341 of 70496)
PASS: LLVM-Unit :: Support/./SupportTests/JSONTest.Types (69342 of 70496)
PASS: LLVM-Unit :: Support/./SupportTests/JSONTest.UTF8 (69343 of 70496)
PASS: LLVM-Unit :: Support/./SupportTests/JSONTest.Array (69344 of 70496)
PASS: LLVM-Unit :: Support/./SupportTests/JSONTest.Deserialize (69345 of 70496)
PASS: LLVM-Unit :: Support/./SupportTests/JSONTest.ParseDeserialize (69346 of 70496)
PASS: LLVM-Unit :: Support/./SupportTests/KnownBitsTest.SExtOrTrunc (69347 of 70496)
PASS: LLVM-Unit :: Support/./SupportTests/KnownBitsTest.GetSignedMinMaxVal (69348 of 70496)
PASS: LLVM-Unit :: Support/./SupportTests/KnownBitsTest.SExtInReg (69349 of 70496)
PASS: LLVM-Unit :: Support/./SupportTests/LEB128Test.EncodeSLEB128 (69350 of 70496)
PASS: LLVM-Unit :: Support/./SupportTests/LEB128Test.DecodeInvalidSLEB128 (69351 of 70496)
PASS: LLVM-Unit :: Support/./SupportTests/LEB128Test.DecodeInvalidULEB128 (69352 of 70496)
PASS: LLVM-Unit :: Support/./SupportTests/KnownBitsTest.GetMinMaxVal (69353 of 70496)
PASS: LLVM-Unit :: Support/./SupportTests/KnownBitsTest.AddCarryExhaustive (69354 of 70496)
PASS: LLVM-Unit :: Support/./SupportTests/KnownBitsTest.AddSubExhaustive (69355 of 70496)
PASS: LLVM-Unit :: Support/./SupportTests/KnownBitsTest.UnaryExhaustive (69356 of 70496)
PASS: LLVM-Unit :: Support/./SupportTests/LEB128Test.DecodeULEB128 (69357 of 70496)
PASS: LLVM-Unit :: Support/./SupportTests/LEB128Test.DecodeSLEB128 (69358 of 70496)
PASS: LLVM-Unit :: Support/./SupportTests/KnownBitsTest.ICmpExhaustive (69359 of 70496)
PASS: LLVM-Unit :: Support/./SupportTests/LEB128Test.EncodeULEB128 (69360 of 70496)
PASS: LLVM-Unit :: Support/./SupportTests/LEB128Test.SLEB128Size (69361 of 70496)
PASS: LLVM-Unit :: Support/./SupportTests/LineIteratorTest.Basic (69362 of 70496)
PASS: LLVM-Unit :: Support/./SupportTests/LEB128Test.ULEB128Size (69363 of 70496)
PASS: LLVM-Unit :: Support/./SupportTests/LineIteratorTest.BlankSkipping (69364 of 70496)
PASS: LLVM-Unit :: Support/./SupportTests/LineIteratorTest.BlankKeeping (69365 of 70496)
PASS: LLVM-Unit :: Support/./SupportTests/LinearPolyBase.Poly3D_Add (69366 of 70496)
PASS: LLVM-Unit :: Support/./SupportTests/LineIteratorTest.EmptyBuffers (69367 of 70496)
PASS: LLVM-Unit :: Support/./SupportTests/LineIteratorTest.CommentAndBlankSkipping (69368 of 70496)
PASS: LLVM-Unit :: Support/./SupportTests/KnownBitsTest.BinaryExhaustive (69369 of 70496)
PASS: LLVM-Unit :: Support/./SupportTests/LinearPolyBase.Poly3D_Equality (69370 of 70496)
PASS: LLVM-Unit :: Support/./SupportTests/LineIteratorTest.Ref (69371 of 70496)
PASS: LLVM-Unit :: Support/./SupportTests/LineIteratorTest.CommentSkippingKeepBlanks (69372 of 70496)
PASS: LLVM-Unit :: Support/./SupportTests/LinearPolyBase.Poly3D_GetValue (69373 of 70496)
PASS: LLVM-Unit :: Support/./SupportTests/LinearPolyBase.Poly3D_Scale (69374 of 70496)
PASS: LLVM-Unit :: Support/./SupportTests/LinearPolyBase.Poly3D_isZero (69375 of 70496)
PASS: LLVM-Unit :: Support/./SupportTests/LinearPolyBase.Poly3D_Sub (69376 of 70496)
PASS: LLVM-Unit :: Support/./SupportTests/MD5HashTest.MD5 (69377 of 70496)
PASS: LLVM-Unit :: Support/./SupportTests/LockFileManagerTest.Basic (69378 of 70496)
PASS: LLVM-Unit :: Support/./SupportTests/LockFileManagerTest.LinkLockExists (69379 of 70496)
PASS: LLVM-Unit :: Support/./SupportTests/LockFileManagerTest.RelativePath (69380 of 70496)
PASS: LLVM-Unit :: Support/./SupportTests/LinearPolyBase.Poly3D_Invert (69381 of 70496)
PASS: LLVM-Unit :: Support/./SupportTests/MD5Test.MD5 (69382 of 70496)
PASS: LLVM-Unit :: Support/./SupportTests/MPBuildAttr.testBuildAttr (69383 of 70496)
PASS: LLVM-Unit :: Support/./SupportTests/ManagedStaticTest.CustomCreatorDeletor (69384 of 70496)
PASS: LLVM-Unit :: Support/./SupportTests/MathExtras.CTLog2 (69385 of 70496)
PASS: LLVM-Unit :: Support/./SupportTests/MVEBuildAttr.testBuildAttr (69386 of 70496)
PASS: LLVM-Unit :: Support/./SupportTests/MathExtras.DoubleBits (69387 of 70496)
PASS: LLVM-Unit :: Support/./SupportTests/MatchersTest.Optional (69388 of 70496)
PASS: LLVM-Unit :: Support/./SupportTests/ManagedStaticTest.NestedStatics (69389 of 70496)
PASS: LLVM-Unit :: Support/./SupportTests/MathExtras.IsShiftedUInt (69390 of 70496)
PASS: LLVM-Unit :: Support/./SupportTests/MathExtras.MinAlign (69391 of 70496)
PASS: LLVM-Unit :: Support/./SupportTests/MathExtras.IsShiftedInt (69392 of 70496)
PASS: LLVM-Unit :: Support/./SupportTests/MathExtras.NextPowerOf2 (69393 of 70496)
PASS: LLVM-Unit :: Support/./SupportTests/MathExtras.PowerOf2Floor (69394 of 70496)
PASS: LLVM-Unit :: Support/./SupportTests/MathExtras.PowerOf2Ceil (69395 of 70496)
PASS: LLVM-Unit :: Support/./SupportTests/MathExtras.FloatBits (69396 of 70496)
PASS: LLVM-Unit :: Support/./SupportTests/MathExtras.SaturatingAdd (69397 of 70496)
PASS: LLVM-Unit :: Support/./SupportTests/MathExtras.findFirstSet (69398 of 70496)
PASS: LLVM-Unit :: Support/./SupportTests/MathExtras.SaturatingMultiply (69399 of 70496)
PASS: LLVM-Unit :: Support/./SupportTests/MathExtras.alignTo (69400 of 70496)
PASS: LLVM-Unit :: Support/./SupportTests/MathExtras.countTrailingZeros (69401 of 70496)
PASS: LLVM-Unit :: Support/./SupportTests/MathExtras.countLeadingZeros (69402 of 70496)
PASS: LLVM-Unit :: Support/./SupportTests/MathExtras.countLeadingOnes (69403 of 70496)
PASS: LLVM-Unit :: Support/./SupportTests/MathExtras.SaturatingMultiplyAdd (69404 of 70496)
PASS: LLVM-Unit :: Support/./SupportTests/MathExtras.findLastSet (69405 of 70496)
PASS: LLVM-Unit :: Support/./SupportTests/MathExtras.isUIntN (69406 of 70496)
PASS: LLVM-Unit :: Support/./SupportTests/MathExtras.isPowerOf2_64 (69407 of 70496)
PASS: LLVM-Unit :: Support/./SupportTests/MathExtras.isPowerOf2_32 (69408 of 70496)
PASS: LLVM-Unit :: Support/./SupportTests/MathExtras.maxIntN (69409 of 70496)
PASS: LLVM-Unit :: Support/./SupportTests/MathExtras.maxUIntN (69410 of 70496)
PASS: LLVM-Unit :: Support/./SupportTests/MathExtras.isIntN (69411 of 70496)
PASS: LLVM-Unit :: Support/./SupportTests/MathExtras.minIntN (69412 of 70496)
PASS: LLVM-Unit :: Support/./SupportTests/MemoryBufferRefTest.compareEquals (69413 of 70496)
PASS: LLVM-Unit :: Support/./SupportTests/MemoryBufferTest.make_new (69414 of 70496)
PASS: LLVM-Unit :: Support/./SupportTests/MemoryBufferTest.mmapVolatileNoNull (69415 of 70496)
PASS: LLVM-Unit :: Support/./SupportTests/MathExtras.onesMask (69416 of 70496)
PASS: LLVM-Unit :: Support/./SupportTests/MemoryBufferTest.writableSlice (69417 of 70496)
PASS: LLVM-Unit :: Support/./SupportTests/MemoryBufferTest.writeThroughFile (69418 of 70496)
PASS: LLVM-Unit :: Support/./SupportTests/MathExtras.reverseBits (69419 of 70496)
PASS: LLVM-Unit :: Support/./SupportTests/MemoryBufferRefTest.construct (69420 of 70496)
PASS: LLVM-Unit :: Support/./SupportTests/MemoryBufferTest.NullTerminator4K (69421 of 70496)
PASS: LLVM-Unit :: Support/./SupportTests/MemoryBufferTest.copy (69422 of 70496)
PASS: LLVM-Unit :: Support/./SupportTests/MemoryBufferTest.getOpenFileReopened (69423 of 70496)
PASS: LLVM-Unit :: Support/./SupportTests/MemoryBufferTest.getOpenFile (69424 of 70496)
PASS: LLVM-Unit :: Support/./SupportTests/MemoryBufferTest.get (69425 of 70496)
PASS: LLVM-Unit :: Support/./SupportTests/NativeFormatTest.BoundaryTests (69426 of 70496)
PASS: LLVM-Unit :: Support/./SupportTests/NativeFormatTest.HexTests (69427 of 70496)
PASS: LLVM-Unit :: Support/./SupportTests/NativeFormatTest.IntegerTests (69428 of 70496)
PASS: LLVM-Unit :: Support/./SupportTests/NativeFormatTest.BasicIntegerTests (69429 of 70496)
PASS: LLVM-Unit :: Support/./SupportTests/OptimizedStructLayoutTest.Gaps (69430 of 70496)
PASS: LLVM-Unit :: Support/./SupportTests/MemoryBufferTest.slice (69431 of 70496)
PASS: LLVM-Unit :: Support/./SupportTests/OptimizedStructLayoutTest.Basic (69432 of 70496)
PASS: LLVM-Unit :: Support/./SupportTests/NativeFormatTest.CommaTests (69433 of 70496)
PASS: LLVM-Unit :: Support/./SupportTests/OptimizedStructLayoutTest.Greed (69434 of 70496)
PASS: LLVM-Unit :: Support/./SupportTests/NativeFormatTest.BasicFloatingPointTests (69435 of 70496)
PASS: LLVM-Unit :: Support/./SupportTests/OptimizedStructLayoutTest.GardenPath (69436 of 70496)
PASS: LLVM-Unit :: Support/./SupportTests/OptimizedStructLayoutTest.Jagged (69437 of 70496)
PASS: LLVM-Unit :: Support/./SupportTests/OptimizedStructLayoutTest.OddSize (69438 of 70496)
PASS: LLVM-Unit :: Support/./SupportTests/OverflowTest/0.AddNoOverflow (69439 of 70496)
PASS: LLVM-Unit :: Support/./SupportTests/OverflowTest/0.AddOverflowToNegative (69440 of 70496)
PASS: LLVM-Unit :: Support/./SupportTests/OverflowTest/0.AddOverflowToMin (69441 of 70496)
PASS: LLVM-Unit :: Support/./SupportTests/OverflowTest/0.MulNoOverflow (69442 of 70496)
PASS: LLVM-Unit :: Support/./SupportTests/OverflowTest/0.MulNoOverflowToMax (69443 of 70496)
PASS: LLVM-Unit :: Support/./SupportTests/OverflowTest/0.MulResultZero (69444 of 70496)
PASS: LLVM-Unit :: Support/./SupportTests/OverflowTest/0.MulOverflowMax (69445 of 70496)
PASS: LLVM-Unit :: Support/./SupportTests/OverflowTest/0.AddOverflowToZero (69446 of 70496)
PASS: LLVM-Unit :: Support/./SupportTests/OverflowTest/0.AddOverflowToMax (69447 of 70496)
PASS: LLVM-Unit :: Support/./SupportTests/OverflowTest/0.SubNoOverflow (69448 of 70496)
PASS: LLVM-Unit :: Support/./SupportTests/OverflowTest/0.MulOverflowToMin (69449 of 70496)
PASS: LLVM-Unit :: Support/./SupportTests/OverflowTest/0.SubOverflowToMax (69450 of 70496)
PASS: LLVM-Unit :: Support/./SupportTests/OverflowTest/0.SubOverflowToMin (69451 of 70496)
PASS: LLVM-Unit :: Support/./SupportTests/OverflowTest/0.SubOverflowToNegative (69452 of 70496)
PASS: LLVM-Unit :: Support/./SupportTests/OverflowTest/0.SubOverflowToPositive (69453 of 70496)
PASS: LLVM-Unit :: Support/./SupportTests/MemoryBufferTest.createFromPipe (69454 of 70496)
PASS: LLVM-Unit :: Support/./SupportTests/OverflowTest/1.AddOverflowToMax (69455 of 70496)
PASS: LLVM-Unit :: Support/./SupportTests/OverflowTest/1.AddNoOverflow (69456 of 70496)
PASS: LLVM-Unit :: Support/./SupportTests/OverflowTest/1.AddOverflowToMin (69457 of 70496)
PASS: LLVM-Unit :: Support/./SupportTests/OverflowTest/1.AddOverflowToNegative (69458 of 70496)
PASS: LLVM-Unit :: Support/./SupportTests/OverflowTest/1.MulNoOverflow (69459 of 70496)
PASS: LLVM-Unit :: Support/./SupportTests/OverflowTest/1.AddOverflowToZero (69460 of 70496)
PASS: LLVM-Unit :: Support/./SupportTests/OverflowTest/1.MulOverflowToMin (69461 of 70496)
PASS: LLVM-Unit :: Support/./SupportTests/OverflowTest/1.SubNoOverflow (69462 of 70496)
PASS: LLVM-Unit :: Support/./SupportTests/OverflowTest/1.MulResultZero (69463 of 70496)
PASS: LLVM-Unit :: Support/./SupportTests/OverflowTest/1.MulNoOverflowToMax (69464 of 70496)
PASS: LLVM-Unit :: Support/./SupportTests/OverflowTest/1.MulOverflowMax (69465 of 70496)
PASS: LLVM-Unit :: Support/./SupportTests/OverflowTest/1.SubOverflowToMax (69466 of 70496)
PASS: LLVM-Unit :: Support/./SupportTests/OverflowTest/1.SubOverflowToMin (69467 of 70496)
PASS: LLVM-Unit :: Support/./SupportTests/OverflowTest/1.SubOverflowToNegative (69468 of 70496)
PASS: LLVM-Unit :: Support/./SupportTests/OverflowTest/1.SubOverflowToPositive (69469 of 70496)
PASS: LLVM-Unit :: Support/./SupportTests/OverflowTest/2.AddOverflowToMax (69470 of 70496)
PASS: LLVM-Unit :: Support/./SupportTests/OverflowTest/2.AddNoOverflow (69471 of 70496)
PASS: LLVM-Unit :: Support/./SupportTests/OverflowTest/2.AddOverflowToMin (69472 of 70496)
PASS: LLVM-Unit :: Support/./SupportTests/OverflowTest/2.AddOverflowToNegative (69473 of 70496)
PASS: LLVM-Unit :: Support/./SupportTests/OverflowTest/2.AddOverflowToZero (69474 of 70496)
PASS: LLVM-Unit :: Support/./SupportTests/OverflowTest/2.MulNoOverflow (69475 of 70496)
PASS: LLVM-Unit :: Support/./SupportTests/OverflowTest/2.MulOverflowToMin (69476 of 70496)
PASS: LLVM-Unit :: Support/./SupportTests/OverflowTest/2.MulOverflowMax (69477 of 70496)
PASS: LLVM-Unit :: Support/./SupportTests/OverflowTest/2.MulNoOverflowToMax (69478 of 70496)
PASS: LLVM-Unit :: Support/./SupportTests/OverflowTest/2.MulResultZero (69479 of 70496)
PASS: LLVM-Unit :: Support/./SupportTests/OverflowTest/2.SubNoOverflow (69480 of 70496)
PASS: LLVM-Unit :: Support/./SupportTests/OverflowTest/2.SubOverflowToMax (69481 of 70496)
PASS: LLVM-Unit :: Support/./SupportTests/OverflowTest/2.SubOverflowToNegative (69482 of 70496)
PASS: LLVM-Unit :: Support/./SupportTests/OverflowTest/2.SubOverflowToMin (69483 of 70496)
PASS: LLVM-Unit :: Support/./SupportTests/OverflowTest/2.SubOverflowToPositive (69484 of 70496)
PASS: LLVM-Unit :: Support/./SupportTests/OverflowTest/3.AddNoOverflow (69485 of 70496)
PASS: LLVM-Unit :: Support/./SupportTests/OverflowTest/3.AddOverflowToMax (69486 of 70496)
PASS: LLVM-Unit :: Support/./SupportTests/OverflowTest/3.AddOverflowToMin (69487 of 70496)
PASS: LLVM-Unit :: Support/./SupportTests/OverflowTest/3.AddOverflowToNegative (69488 of 70496)
PASS: LLVM-Unit :: Support/./SupportTests/OverflowTest/3.AddOverflowToZero (69489 of 70496)
PASS: LLVM-Unit :: Support/./SupportTests/OverflowTest/3.MulNoOverflow (69490 of 70496)
PASS: LLVM-Unit :: Support/./SupportTests/OverflowTest/3.MulOverflowMax (69491 of 70496)
PASS: LLVM-Unit :: Support/./SupportTests/OverflowTest/3.MulNoOverflowToMax (69492 of 70496)
PASS: LLVM-Unit :: Support/./SupportTests/OverflowTest/3.MulOverflowToMin (69493 of 70496)
PASS: LLVM-Unit :: Support/./SupportTests/OverflowTest/3.SubNoOverflow (69494 of 70496)
PASS: LLVM-Unit :: Support/./SupportTests/OverflowTest/3.SubOverflowToMax (69495 of 70496)
PASS: LLVM-Unit :: Support/./SupportTests/OverflowTest/3.MulResultZero (69496 of 70496)
PASS: LLVM-Unit :: Support/./SupportTests/OverflowTest/3.SubOverflowToMin (69497 of 70496)
PASS: LLVM-Unit :: Support/./SupportTests/OverflowTest/3.SubOverflowToPositive (69498 of 70496)
PASS: LLVM-Unit :: Support/./SupportTests/OverflowTest/3.SubOverflowToNegative (69499 of 70496)
PASS: LLVM-Unit :: Support/./SupportTests/OverflowTest/4.AddNoOverflow (69500 of 70496)
PASS: LLVM-Unit :: Support/./SupportTests/OverflowTest/4.AddOverflowToMax (69501 of 70496)
PASS: LLVM-Unit :: Support/./SupportTests/OverflowTest/4.AddOverflowToMin (69502 of 70496)
PASS: LLVM-Unit :: Support/./SupportTests/OverflowTest/4.AddOverflowToNegative (69503 of 70496)
PASS: LLVM-Unit :: Support/./SupportTests/OverflowTest/4.AddOverflowToZero (69504 of 70496)
PASS: LLVM-Unit :: Support/./SupportTests/OverflowTest/4.MulNoOverflowToMax (69505 of 70496)
PASS: LLVM-Unit :: Support/./SupportTests/OverflowTest/4.MulNoOverflow (69506 of 70496)
PASS: LLVM-Unit :: Support/./SupportTests/OverflowTest/4.MulOverflowToMin (69507 of 70496)
PASS: LLVM-Unit :: Support/./SupportTests/OverflowTest/4.MulOverflowMax (69508 of 70496)
PASS: LLVM-Unit :: Support/./SupportTests/OverflowTest/4.SubNoOverflow (69509 of 70496)
PASS: LLVM-Unit :: Support/./SupportTests/OverflowTest/4.MulResultZero (69510 of 70496)
PASS: LLVM-Unit :: Support/./SupportTests/OverflowTest/4.SubOverflowToMax (69511 of 70496)
PASS: LLVM-Unit :: Support/./SupportTests/OverflowTest/4.SubOverflowToMin (69512 of 70496)
PASS: LLVM-Unit :: Support/./SupportTests/OverflowTest/4.SubOverflowToNegative (69513 of 70496)
PASS: LLVM-Unit :: Support/./SupportTests/OverflowTest/4.SubOverflowToPositive (69514 of 70496)
PASS: LLVM-Unit :: Support/./SupportTests/PCS_ConfigBuildAttr.testBuildAttr (69515 of 70496)
PASS: LLVM-Unit :: Support/./SupportTests/PCS_GOTBuildAttr.testBuildAttr (69516 of 70496)
PASS: LLVM-Unit :: Support/./SupportTests/PCS_R9BuildAttr.testBuildAttr (69517 of 70496)
PASS: LLVM-Unit :: Support/./SupportTests/PCS_ROBuildAttr.testBuildAttr (69518 of 70496)
PASS: LLVM-Unit :: Support/./SupportTests/PageSizeTest.PageSize (69519 of 70496)
PASS: LLVM-Unit :: Support/./SupportTests/PCS_WCharBuildAttr.testBuildAttr (69520 of 70496)
PASS: LLVM-Unit :: Support/./SupportTests/PCS_RWBuildAttr.testBuildAttr (69521 of 70496)
PASS: LLVM-Unit :: Support/./SupportTests/PrintOptionInfoTest.PrintOptionInfoMultilineValueDescription (69522 of 70496)
PASS: LLVM-Unit :: Support/./SupportTests/Parallel.ForEachError (69523 of 70496)
PASS: LLVM-Unit :: Support/./SupportTests/PrintOptionInfoTest.PrintOptionInfoValueOptionalWithSentinel (69524 of 70496)
PASS: LLVM-Unit :: Support/./SupportTests/PrintOptionInfoTest.PrintOptionInfoEmptyValueDescription (69525 of 70496)
PASS: LLVM-Unit :: Support/./SupportTests/PrintOptionInfoTest.PrintOptionInfoValueOptionalWithSentinelWithHelp (69526 of 70496)
PASS: LLVM-Unit :: Support/./SupportTests/PrintOptionInfoTest.PrintOptionInfoValueOptionalWithoutSentinel (69527 of 70496)
PASS: LLVM-Unit :: Support/./SupportTests/PrintOptionInfoTest.PrintOptionInfoValueRequiredWithEmptyValueName (69528 of 70496)
PASS: LLVM-Unit :: Support/./SupportTests/ProcessTest.GetProcessIdTest (69529 of 70496)
PASS: LLVM-Unit :: Support/./SupportTests/Parallel.parallel_for (69530 of 70496)
PASS: LLVM-Unit :: Support/./SupportTests/ProcessTest.GetRandomNumberTest (69531 of 70496)
PASS: LLVM-Unit :: Support/./SupportTests/RegexTest.Escape (69532 of 70496)
PASS: LLVM-Unit :: Support/./SupportTests/Parallel.TransformReduce (69533 of 70496)
PASS: LLVM-Unit :: Support/./SupportTests/ProgramTest.TestExecuteNegative (69534 of 70496)
PASS: LLVM-Unit :: Support/./SupportTests/RegexTest.Backreferences (69535 of 70496)
PASS: LLVM-Unit :: Support/./SupportTests/ProxyFileSystemTest.Basic (69536 of 70496)
PASS: LLVM-Unit :: Support/./SupportTests/ProgramTest.TestWriteWithSystemEncoding (69537 of 70496)
PASS: LLVM-Unit :: Support/./SupportTests/RegexTest.Basics (69538 of 70496)
PASS: LLVM-Unit :: Support/./SupportTests/Parallel.sort (69539 of 70496)
PASS: LLVM-Unit :: Support/./SupportTests/ProgramEnvTest.CreateProcessTrailingSlash (69540 of 70496)
PASS: LLVM-Unit :: Support/./SupportTests/ProgramEnvTest.TestExecuteAndWaitStatistics (69541 of 70496)
PASS: LLVM-Unit :: Support/./SupportTests/RegexTest.IsLiteralERE (69542 of 70496)
PASS: LLVM-Unit :: Support/./SupportTests/RegexTest.MatchInvalid (69543 of 70496)
PASS: LLVM-Unit :: Support/./SupportTests/RegexTest.IsValid (69544 of 70496)
PASS: LLVM-Unit :: Support/./SupportTests/RegexTest.MoveAssign (69545 of 70496)
PASS: LLVM-Unit :: Support/./SupportTests/RegexTest.OssFuzz3727Regression (69546 of 70496)
PASS: LLVM-Unit :: Support/./SupportTests/RegexTest.MoveConstruct (69547 of 70496)
PASS: LLVM-Unit :: Support/./SupportTests/RegexTest.NoArgConstructor (69548 of 70496)
PASS: LLVM-Unit :: Support/./SupportTests/RegexTest.Substitution (69549 of 70496)
PASS: LLVM-Unit :: Support/./SupportTests/ReverseIterationTest.DenseMapTest1 (69550 of 70496)
PASS: LLVM-Unit :: Support/./SupportTests/ReverseIterationTest.DenseMapTest2 (69551 of 70496)
PASS: LLVM-Unit :: Support/./SupportTests/SIMDBuildAttr.testBuildAttr (69552 of 70496)
PASS: LLVM-Unit :: Support/./SupportTests/ScaledNumberHelpersTest.arithmeticOperators (69553 of 70496)
PASS: LLVM-Unit :: Support/./SupportTests/ScaledNumberHelpersTest.compare (69554 of 70496)
PASS: LLVM-Unit :: Support/./SupportTests/ScaledNumberHelpersTest.getAdjusted (69555 of 70496)
PASS: LLVM-Unit :: Support/./SupportTests/ScaledNumberHelpersTest.getDifference (69556 of 70496)
PASS: LLVM-Unit :: Support/./SupportTests/ScaledNumberHelpersTest.getLgFloor (69557 of 70496)
PASS: LLVM-Unit :: Support/./SupportTests/ScaledNumberHelpersTest.getQuotient (69558 of 70496)
PASS: LLVM-Unit :: Support/./SupportTests/ScaledNumberHelpersTest.getLgCeiling (69559 of 70496)
PASS: LLVM-Unit :: Support/./SupportTests/ScaledNumberHelpersTest.getProduct (69560 of 70496)
PASS: LLVM-Unit :: Support/./SupportTests/ScaledNumberHelpersTest.getLg (69561 of 70496)
PASS: LLVM-Unit :: Support/./SupportTests/ScaledNumberHelpersTest.getRounded (69562 of 70496)
PASS: LLVM-Unit :: Support/./SupportTests/SHA256Test.SHA256 (69563 of 70496)
PASS: LLVM-Unit :: Support/./SupportTests/ScaledNumberHelpersTest.matchScales (69564 of 70496)
PASS: LLVM-Unit :: Support/./SupportTests/ScaledNumberHelpersTest.getSum (69565 of 70496)
PASS: LLVM-Unit :: Support/./SupportTests/SourceMgrTest.BasicError (69566 of 70496)
PASS: LLVM-Unit :: Support/./SupportTests/ScaledNumberHelpersTest.toIntBug (69567 of 70496)
PASS: LLVM-Unit :: Support/./SupportTests/SourceMgrTest.BasicFixit (69568 of 70496)
PASS: LLVM-Unit :: Support/./SupportTests/SourceMgrTest.BasicNote (69569 of 70496)
PASS: LLVM-Unit :: Support/./SupportTests/SourceMgrTest.BasicWarning (69570 of 70496)
PASS: LLVM-Unit :: Support/./SupportTests/SourceMgrTest.BasicRemark (69571 of 70496)
PASS: LLVM-Unit :: Support/./SupportTests/SourceMgrTest.BasicRange (69572 of 70496)
PASS: LLVM-Unit :: Support/./SupportTests/SourceMgrTest.FixitForTab (69573 of 70496)
PASS: LLVM-Unit :: Support/./SupportTests/SourceMgrTest.LocationAtEmptyBuffer (69574 of 70496)
PASS: LLVM-Unit :: Support/./SupportTests/SourceMgrTest.LocationAtEndOf255ByteBuffer (69575 of 70496)
PASS: LLVM-Unit :: Support/./SupportTests/SourceMgrTest.LocationAtEndOf255ByteBufferEndingInNewline (69576 of 70496)
PASS: LLVM-Unit :: Support/./SupportTests/SourceMgrTest.LocationAtEndOf256ByteBuffer (69577 of 70496)
PASS: LLVM-Unit :: Support/./SupportTests/SourceMgrTest.LocationAtEndOf256ByteBufferEndingInNewline (69578 of 70496)
PASS: LLVM-Unit :: Support/./SupportTests/SourceMgrTest.LocationAtEndOf257ByteBuffer (69579 of 70496)
PASS: LLVM-Unit :: Support/./SupportTests/SourceMgrTest.LocationAtEndOf257ByteBufferEndingInNewline (69580 of 70496)
PASS: LLVM-Unit :: Support/./SupportTests/SourceMgrTest.LocationAtEndOfLine (69581 of 70496)
PASS: LLVM-Unit :: Support/./SupportTests/SourceMgrTest.LocationAtNewline (69582 of 70496)
PASS: LLVM-Unit :: Support/./SupportTests/SourceMgrTest.LocationBeforeEndOf255ByteBuffer (69583 of 70496)
PASS: LLVM-Unit :: Support/./SupportTests/SourceMgrTest.LocationBeforeEndOf255ByteBufferEndingInNewline (69584 of 70496)
PASS: LLVM-Unit :: Support/./SupportTests/SourceMgrTest.LocationBeforeEndOf256ByteBuffer (69585 of 70496)
PASS: LLVM-Unit :: Support/./SupportTests/SourceMgrTest.LocationBeforeEndOf257ByteBuffer (69586 of 70496)
PASS: LLVM-Unit :: Support/./SupportTests/SourceMgrTest.LocationBeforeEndOf256ByteBufferEndingInNewline (69587 of 70496)
PASS: LLVM-Unit :: Support/./SupportTests/SourceMgrTest.LocationJustAfterNonNewline (69588 of 70496)
PASS: LLVM-Unit :: Support/./SupportTests/SourceMgrTest.LocationJustAfterSoleNewline (69589 of 70496)
PASS: LLVM-Unit :: Support/./SupportTests/SourceMgrTest.LocationBeforeEndOf257ByteBufferEndingInNewline (69590 of 70496)
PASS: LLVM-Unit :: Support/./SupportTests/SourceMgrTest.LocationJustOnSoleNewline (69591 of 70496)
PASS: LLVM-Unit :: Support/./SupportTests/ProgramEnvTest.TestLockFile (69592 of 70496)
PASS: LLVM-Unit :: Support/./SupportTests/SourceMgrTest.LocationOnEOLOfFirstLineOfMultiline (69593 of 70496)
PASS: LLVM-Unit :: Support/./SupportTests/SourceMgrTest.LocationOnEOLOfSecondSecondLineOfMultiline (69594 of 70496)
PASS: LLVM-Unit :: Support/./SupportTests/SourceMgrTest.LocationOnFirstLineOfMultiline (69595 of 70496)
PASS: LLVM-Unit :: Support/./SupportTests/SourceMgrTest.LocationOnSecondLineOfMultiline (69596 of 70496)
PASS: LLVM-Unit :: Support/./SupportTests/SourceMgrTest.LocationOnSecondLineOfMultilineNoSecondEOL (69597 of 70496)
PASS: LLVM-Unit :: Support/./SupportTests/SourceMgrTest.LocationPastEndOf255ByteBuffer (69598 of 70496)
PASS: LLVM-Unit :: Support/./SupportTests/SourceMgrTest.LocationPastEndOf255ByteBufferEndingInNewline (69599 of 70496)
PASS: LLVM-Unit :: Support/./SupportTests/SourceMgrTest.LocationPastEndOf256ByteBuffer (69600 of 70496)
PASS: LLVM-Unit :: Support/./SupportTests/SourceMgrTest.LocationPastEndOf257ByteBufferEndingInNewline (69601 of 70496)
PASS: LLVM-Unit :: Support/./SupportTests/SourceMgrTest.LocationPastEndOf256ByteBufferEndingInNewline (69602 of 70496)
PASS: LLVM-Unit :: Support/./SupportTests/SourceMgrTest.LocationPastEndOf257ByteBuffer (69603 of 70496)
PASS: LLVM-Unit :: Support/./SupportTests/SourceMgrTest.MultiLineRange (69604 of 70496)
PASS: LLVM-Unit :: Support/./SupportTests/SourceMgrTest.MultipleRanges (69605 of 70496)
PASS: LLVM-Unit :: Support/./SupportTests/SourceMgrTest.OverlappingRanges (69606 of 70496)
PASS: LLVM-Unit :: Support/./SupportTests/SourceMgrTest.RangeWithTab (69607 of 70496)
PASS: LLVM-Unit :: Support/./SupportTests/SpecialCaseListTest.Basic (69608 of 70496)
PASS: LLVM-Unit :: Support/./SupportTests/SpecialCaseListTest.CorrectErrorLineNumberWithBlankLine (69609 of 70496)
PASS: LLVM-Unit :: Support/./SupportTests/SpecialCaseListTest.GlobalInit (69610 of 70496)
PASS: LLVM-Unit :: Support/./SupportTests/SpecialCaseListTest.EmptySpecialCaseList (69611 of 70496)
PASS: LLVM-Unit :: Support/./SupportTests/SpecialCaseListTest.EscapedSymbols (69612 of 70496)
PASS: LLVM-Unit :: Support/./SupportTests/SpecialCaseListTest.InvalidSpecialCaseList (69613 of 70496)
PASS: LLVM-Unit :: Support/./SupportTests/SpecialCaseListTest.NoTrigramsInARule (69614 of 70496)
PASS: LLVM-Unit :: Support/./SupportTests/SpecialCaseListTest.RepetitiveRule (69615 of 70496)
PASS: LLVM-Unit :: Support/./SupportTests/SpecialCaseListTest.PopularTrigram (69616 of 70496)
PASS: LLVM-Unit :: Support/./SupportTests/SpecialCaseListTest.NoTrigramsInRules (69617 of 70496)
PASS: LLVM-Unit :: Support/./SupportTests/SpecialCaseListTest.MultipleExclusions (69618 of 70496)
PASS: LLVM-Unit :: Support/./SupportTests/SpecialCaseListTest.Section (69619 of 70496)
PASS: LLVM-Unit :: Support/./SupportTests/SpecialCaseListTest.SectionRegexErrorHandling (69620 of 70496)
PASS: LLVM-Unit :: Support/./SupportTests/SpecialCaseListTest.Substring (69621 of 70496)
PASS: LLVM-Unit :: Support/./SupportTests/SpecialCaseListTest.SpecialSymbolRule (69622 of 70496)
PASS: LLVM-Unit :: Support/./SupportTests/StackAlign.testAttribute (69623 of 70496)
PASS: LLVM-Unit :: Support/./SupportTests/SuffixTreeTest.TestSingleCharacterRepeat (69624 of 70496)
PASS: LLVM-Unit :: Support/./SupportTests/SuffixTreeTest.TestExclusion (69625 of 70496)
PASS: LLVM-Unit :: Support/./SupportTests/SuffixTreeTest.TestLongerRepetition (69626 of 70496)
PASS: LLVM-Unit :: Support/./SupportTests/SuffixTreeTest.TestTandemRepeat (69627 of 70496)
PASS: LLVM-Unit :: Support/./SupportTests/Support.AbsolutePathIteratorEnd (69628 of 70496)
PASS: LLVM-Unit :: Support/./SupportTests/SuffixTreeTest.TestSingleRepetition (69629 of 70496)
PASS: LLVM-Unit :: Support/./SupportTests/Support.NormalizePath (69630 of 70496)
PASS: LLVM-Unit :: Support/./SupportTests/Support.HomeDirectory (69631 of 70496)
PASS: LLVM-Unit :: Support/./SupportTests/Support.ConfigDirectory (69632 of 70496)
PASS: LLVM-Unit :: Support/./SupportTests/Support.FilenameParent (69633 of 70496)
PASS: LLVM-Unit :: Support/./SupportTests/Support.PathIterator (69634 of 70496)
PASS: LLVM-Unit :: Support/./SupportTests/Support.PathRoot (69635 of 70496)
PASS: LLVM-Unit :: Support/./SupportTests/Support.RemoveDots (69636 of 70496)
PASS: LLVM-Unit :: Support/./SupportTests/Support.Path (69637 of 70496)
PASS: LLVM-Unit :: Support/./SupportTests/Support.RemoveLeadingDotSlash (69638 of 70496)
PASS: LLVM-Unit :: Support/./SupportTests/Support.ReplacePathPrefix (69639 of 70496)
PASS: LLVM-Unit :: Support/./SupportTests/SymbolRemappingReaderTest.DemanglingErrors (69640 of 70496)
PASS: LLVM-Unit :: Support/./SupportTests/SymbolRemappingReaderTest.BadMappingOrder (69641 of 70496)
PASS: LLVM-Unit :: Support/./SupportTests/T2EEBuildAttr.testBuildAttr (69642 of 70496)
PASS: LLVM-Unit :: Support/./SupportTests/SymbolRemappingReaderTest.ParseErrors (69643 of 70496)
PASS: LLVM-Unit :: Support/./SupportTests/SymbolRemappingReaderTest.RemappingsAdded (69644 of 70496)
PASS: LLVM-Unit :: Support/./SupportTests/TarWriterTest.Basics (69645 of 70496)
PASS: LLVM-Unit :: Support/./SupportTests/TarWriterTest.Duplicate (69646 of 70496)
PASS: LLVM-Unit :: Support/./SupportTests/Support.TempDirectory (69647 of 70496)
PASS: LLVM-Unit :: Support/./SupportTests/TarWriterTest.NoDuplicate (69648 of 70496)
PASS: LLVM-Unit :: Support/./SupportTests/TarWriterTest.Pax (69649 of 70496)
PASS: LLVM-Unit :: Support/./SupportTests/TargetParserTest.AArch64ArchExtFeature (69650 of 70496)
PASS: LLVM-Unit :: Support/./SupportTests/TarWriterTest.SingleFile (69651 of 70496)
PASS: LLVM-Unit :: Support/./SupportTests/TarWriterTest.LongFilename (69652 of 70496)
PASS: LLVM-Unit :: Support/./SupportTests/TargetParserTest.AArch64ArchFeatures (69653 of 70496)
PASS: LLVM-Unit :: Support/./SupportTests/TargetParserTest.ARMArchExtFeature (69654 of 70496)
PASS: LLVM-Unit :: Support/./SupportTests/TargetParserTest.AArch64ExtensionFeatures (69655 of 70496)
PASS: LLVM-Unit :: Support/./SupportTests/TargetParserTest.ARMArchExtDependencies (69656 of 70496)
PASS: LLVM-Unit :: Support/./SupportTests/TargetParserTest.ARMExtensionFeatures (69657 of 70496)
PASS: LLVM-Unit :: Support/./SupportTests/TargetParserTest.ARMFPUFeatures (69658 of 70496)
PASS: LLVM-Unit :: Support/./SupportTests/TargetParserTest.ARMFPUNeonSupportLevel (69659 of 70496)
PASS: LLVM-Unit :: Support/./SupportTests/TargetParserTest.ARMFPURestriction (69660 of 70496)
PASS: LLVM-Unit :: Support/./SupportTests/TargetParserTest.ARMFPUVersion (69661 of 70496)
PASS: LLVM-Unit :: Support/./SupportTests/TargetParserTest.ARMparseArchEndianAndISA (69662 of 70496)
PASS: LLVM-Unit :: Support/./SupportTests/TargetParserTest.ARMparseArchVersion (69663 of 70496)
PASS: LLVM-Unit :: Support/./SupportTests/TargetParserTest.ARMparseArchProfile (69664 of 70496)
PASS: LLVM-Unit :: Support/./SupportTests/TargetParserTest.ARMparseHWDiv (69665 of 70496)
PASS: LLVM-Unit :: Support/./SupportTests/TargetParserTest.testAArch64Extension (69666 of 70496)
PASS: LLVM-Unit :: Support/./SupportTests/TargetParserTest.testAArch64CPUArchList (69667 of 70496)
PASS: LLVM-Unit :: Support/./SupportTests/TargetParserTest.testAArch64Arch (69668 of 70496)
PASS: LLVM-Unit :: Support/./SupportTests/TargetParserTest.testARMArch (69669 of 70496)
PASS: LLVM-Unit :: Support/./SupportTests/TargetParserTest.testARMCPUArchList (69670 of 70496)
PASS: LLVM-Unit :: Support/./SupportTests/TargetParserTest.testInvalidARMArch (69671 of 70496)
PASS: LLVM-Unit :: Support/./SupportTests/TargetParserTest.testARMExtension (69672 of 70496)
PASS: LLVM-Unit :: Support/./SupportTests/TaskQueueTest.FutureWithReturnValue (69673 of 70496)
PASS: LLVM-Unit :: Support/./SupportTests/TaskQueueTest.UnOrderedFutures (69674 of 70496)
PASS: LLVM-Unit :: Support/./SupportTests/TaskQueueTest.OrderedFutures (69675 of 70496)
PASS: LLVM-Unit :: Support/./SupportTests/ThreadPoolTest.AllThreads_OneThreadPerCore (69676 of 70496)
PASS: LLVM-Unit :: Support/./SupportTests/ThreadLocalTest.Basics (69677 of 70496)
PASS: LLVM-Unit :: Support/./SupportTests/ThreadPoolTest.AffinityMask (69678 of 70496)
PASS: LLVM-Unit :: Support/./SupportTests/ThreadPoolTest.AllThreads_UseAllRessources (69679 of 70496)
PASS: LLVM-Unit :: Support/./SupportTests/ThreadPoolTest.Async (69680 of 70496)
PASS: LLVM-Unit :: Support/./SupportTests/ThreadPoolTest.AsyncBarrier (69681 of 70496)
PASS: LLVM-Unit :: Support/./SupportTests/ThreadPoolTest.GetFuture (69682 of 70496)
PASS: LLVM-Unit :: Support/./SupportTests/Threading.PhysicalConcurrency (69683 of 70496)
PASS: LLVM-Unit :: Support/./SupportTests/Threading.RunOnThreadSync (69684 of 70496)
PASS: LLVM-Unit :: Support/./SupportTests/ThreadPoolTest.AsyncBarrierArgs (69685 of 70496)
PASS: LLVM-Unit :: Support/./SupportTests/ThreadPoolTest.PoolDestruction (69686 of 70496)
PASS: LLVM-Unit :: Support/./SupportTests/ThumbISABuildAttr.testBuildAttr (69687 of 70496)
PASS: LLVM-Unit :: Support/./SupportTests/Threading.RunOnThreadSyncAsync (69688 of 70496)
PASS: LLVM-Unit :: Support/./SupportTests/Timer.CheckIfTriggered (69689 of 70496)
PASS: LLVM-Unit :: Support/./SupportTests/ToolOutputFileTest.DashOpensOuts (69690 of 70496)
PASS: LLVM-Unit :: Support/./SupportTests/Timer.Additivity (69691 of 70496)
PASS: LLVM-Unit :: Support/./SupportTests/TrailingObjects.Realignment (69692 of 70496)
PASS: LLVM-Unit :: Support/./SupportTests/TrailingObjects.ThreeArg (69693 of 70496)
PASS: LLVM-Unit :: Support/./SupportTests/TrailingObjects.OneArg (69694 of 70496)
PASS: LLVM-Unit :: Support/./SupportTests/TrailingObjects.TwoArg (69695 of 70496)
PASS: LLVM-Unit :: Support/./SupportTests/TrigramIndexTest.Backreference2 (69696 of 70496)
PASS: LLVM-Unit :: Support/./SupportTests/TrigramIndexTest.Backreference1 (69697 of 70496)
PASS: LLVM-Unit :: Support/./SupportTests/TrigramIndexTest.Empty (69698 of 70496)
PASS: LLVM-Unit :: Support/./SupportTests/TrigramIndexTest.Basic (69699 of 70496)
PASS: LLVM-Unit :: Support/./SupportTests/TrigramIndexTest.EscapedSymbols (69700 of 70496)
PASS: LLVM-Unit :: Support/./SupportTests/TrigramIndexTest.NoTrigramsInARule (69701 of 70496)
PASS: LLVM-Unit :: Support/./SupportTests/TrigramIndexTest.NoTrigramsInRules (69702 of 70496)
PASS: LLVM-Unit :: Support/./SupportTests/TrigramIndexTest.PopularTrigram2 (69703 of 70496)
PASS: LLVM-Unit :: Support/./SupportTests/TrigramIndexTest.PopularTrigram (69704 of 70496)
PASS: LLVM-Unit :: Support/./SupportTests/TrigramIndexTest.Sequence (69705 of 70496)
PASS: LLVM-Unit :: Support/./SupportTests/Triviality.ADT (69706 of 70496)
PASS: LLVM-Unit :: Support/./SupportTests/TrigramIndexTest.TooComplicatedRegex (69707 of 70496)
PASS: LLVM-Unit :: Support/./SupportTests/TypeNameTest.Names (69708 of 70496)
PASS: LLVM-Unit :: Support/./SupportTests/TrigramIndexTest.RepetitiveRule (69709 of 70496)
PASS: LLVM-Unit :: Support/./SupportTests/TrigramIndexTest.TooComplicatedRegex2 (69710 of 70496)
PASS: LLVM-Unit :: Support/./SupportTests/Triviality.Tester (69711 of 70496)
PASS: LLVM-Unit :: Support/./SupportTests/UnalignedAccess.testAttribute (69712 of 70496)
PASS: LLVM-Unit :: Support/./SupportTests/Unicode.columnWidthUTF8 (69713 of 70496)
PASS: LLVM-Unit :: Support/./SupportTests/Unicode.isPrintable (69714 of 70496)
PASS: LLVM-Unit :: Support/./SupportTests/UnivariateLinearPolyBase.Univariate3D_Add (69715 of 70496)
PASS: LLVM-Unit :: Support/./SupportTests/UnivariateLinearPolyBase.Univariate3D_Equality (69716 of 70496)
PASS: LLVM-Unit :: Support/./SupportTests/UnivariateLinearPolyBase.Univariate3D_GetValue (69717 of 70496)
PASS: LLVM-Unit :: Support/./SupportTests/UnivariateLinearPolyBase.Univariate3D_Invert (69718 of 70496)
PASS: LLVM-Unit :: Support/./SupportTests/UnivariateLinearPolyBase.Univariate3D_Sub (69719 of 70496)
PASS: LLVM-Unit :: Support/./SupportTests/UnivariateLinearPolyBase.Univariate3D_Scale (69720 of 70496)
PASS: LLVM-Unit :: Support/./SupportTests/UnivariateLinearPolyBase.Univariate3D_isZero (69721 of 70496)
PASS: LLVM-Unit :: Support/./SupportTests/VFPArgsBuildAttr.testBuildAttr (69722 of 70496)
PASS: LLVM-Unit :: Support/./SupportTests/VFSFromRemappedFilesTest.UseExternalNames (69723 of 70496)
PASS: LLVM-Unit :: Support/./SupportTests/VFSFromRemappedFilesTest.LastMappingWins (69724 of 70496)
PASS: LLVM-Unit :: Support/./SupportTests/VFSFromRemappedFilesTest.Basic (69725 of 70496)
PASS: LLVM-Unit :: Support/./SupportTests/VFSFromYAMLTest.BasicVFSFromYAML (69726 of 70496)
PASS: LLVM-Unit :: Support/./SupportTests/VFSFromYAMLTest.CaseInsensitive (69727 of 70496)
PASS: LLVM-Unit :: Support/./SupportTests/VFSFromYAMLTest.CaseSensitive (69728 of 70496)
PASS: LLVM-Unit :: Support/./SupportTests/VFSFromYAMLTest.DirectoryIteration (69729 of 70496)
PASS: LLVM-Unit :: Support/./SupportTests/VFSFromYAMLTest.DirectoryIterationErrorInVFSLayer (69730 of 70496)
PASS: LLVM-Unit :: Support/./SupportTests/VFSFromYAMLTest.DirectoryIterationWithDuplicates (69731 of 70496)
PASS: LLVM-Unit :: Support/./SupportTests/VFSFromYAMLTest.DirectoryIterationSameDirMultipleEntries (69732 of 70496)
PASS: LLVM-Unit :: Support/./SupportTests/VFSFromYAMLTest.GetRealPath (69733 of 70496)
PASS: LLVM-Unit :: Support/./SupportTests/VFSFromYAMLTest.MappedFiles (69734 of 70496)
PASS: LLVM-Unit :: Support/./SupportTests/VFSFromYAMLTest.IllegalVFSFile (69735 of 70496)
PASS: LLVM-Unit :: Support/./SupportTests/VFSFromYAMLTest.MappedRoot (69736 of 70496)
PASS: LLVM-Unit :: Support/./SupportTests/VFSFromYAMLTest.MultiComponentPath (69737 of 70496)
PASS: LLVM-Unit :: Support/./SupportTests/VFSFromYAMLTest.NonFallthroughDirectoryIteration (69738 of 70496)
PASS: LLVM-Unit :: Support/./SupportTests/VFSFromYAMLTest.RecursiveDirectoryIterationLevel (69739 of 70496)
PASS: LLVM-Unit :: Support/./SupportTests/VFSFromYAMLTest.RelativePaths (69740 of 70496)
PASS: LLVM-Unit :: Support/./SupportTests/VFSFromYAMLTest.RemappedDirectoryOverlay (69741 of 70496)
PASS: LLVM-Unit :: Support/./SupportTests/VFSFromYAMLTest.RemappedDirectoryOverlayNoExternalNames (69742 of 70496)
PASS: LLVM-Unit :: Support/./SupportTests/VFSFromYAMLTest.RemappedDirectoryOverlayNoFallthrough (69743 of 70496)
PASS: LLVM-Unit :: Support/./SupportTests/VFSFromYAMLTest.VirtualWorkingDirectory (69744 of 70496)
PASS: LLVM-Unit :: Support/./SupportTests/VFSFromYAMLTest.TrailingSlashes (69745 of 70496)
PASS: LLVM-Unit :: Support/./SupportTests/VFSFromYAMLTest.WorkingDirectory (69746 of 70496)
PASS: LLVM-Unit :: Support/./SupportTests/VFSFromYAMLTest.WorkingDirectoryFallthrough (69747 of 70496)
PASS: LLVM-Unit :: Support/./SupportTests/VFSFromYAMLTest.UseExternalName (69748 of 70496)
PASS: LLVM-Unit :: Support/./SupportTests/VFSFromYAMLTest.WorkingDirectoryFallthroughInvalid (69749 of 70496)
PASS: LLVM-Unit :: Support/./SupportTests/VFSFromYAMLTest.YAMLVFSWriterTestHandleDirs (69750 of 70496)
PASS: LLVM-Unit :: Support/./SupportTests/VersionTuple.getAsString (69751 of 70496)
PASS: LLVM-Unit :: Support/./SupportTests/VersionTuple.tryParse (69752 of 70496)
PASS: LLVM-Unit :: Support/./SupportTests/VFSFromYAMLTest.YAMLVFSWriterTest2 (69753 of 70496)
PASS: LLVM-Unit :: Support/./SupportTests/VirtualFileSystemTest.BaseOnlyOverlay (69754 of 70496)
PASS: LLVM-Unit :: Support/./SupportTests/VFSFromYAMLTest.YAMLVFSWriterTest3 (69755 of 70496)
PASS: LLVM-Unit :: Support/./SupportTests/VFSFromYAMLTest.YAMLVFSWriterTest (69756 of 70496)
PASS: LLVM-Unit :: Support/./SupportTests/MemoryBufferTest.getOpenFileNoReopen (69757 of 70496)
PASS: LLVM-Unit :: Support/./SupportTests/VirtualFileSystemTest.GetRealPathInOverlay (69758 of 70496)
PASS: LLVM-Unit :: Support/./SupportTests/VirtualFileSystemTest.BrokenSymlinkRealFSIteration (69759 of 70496)
PASS: LLVM-Unit :: Support/./SupportTests/VirtualFileSystemTest.BasicRealFSIteration (69760 of 70496)
PASS: LLVM-Unit :: Support/./SupportTests/VirtualFileSystemTest.MergedDirPermissions (69761 of 70496)
PASS: LLVM-Unit :: Support/./SupportTests/VirtualFileSystemTest.BasicRealFSRecursiveIteration (69762 of 70496)
PASS: LLVM-Unit :: Support/./SupportTests/VirtualFileSystemTest.BasicRealFSRecursiveIterationNoPush (69763 of 70496)
PASS: LLVM-Unit :: Support/./SupportTests/VirtualFileSystemTest.HiddenInIteration (69764 of 70496)
PASS: LLVM-Unit :: Support/./SupportTests/VirtualFileSystemTest.OverlayDirsNonMerged (69765 of 70496)
PASS: LLVM-Unit :: Support/./SupportTests/VirtualFileSystemTest.BrokenSymlinkRealFSRecursiveIteration (69766 of 70496)
PASS: LLVM-Unit :: Support/./SupportTests/VirtualFileSystemTest.OverlayIteration (69767 of 70496)
PASS: LLVM-Unit :: Support/./SupportTests/VirtualFileSystemTest.OverlayIterator (69768 of 70496)
PASS: LLVM-Unit :: Support/./SupportTests/VirtualFileSystemTest.OverlayFiles (69769 of 70496)
PASS: LLVM-Unit :: Support/./SupportTests/VirtualFileSystemTest.OverlayRecursiveIteration (69770 of 70496)
PASS: LLVM-Unit :: Support/./SupportTests/VirtualFileSystemTest.MultipleWorkingDirs (69771 of 70496)
PASS: LLVM-Unit :: Support/./SupportTests/VirtualFileSystemTest.StatusQueries (69772 of 70496)
PASS: LLVM-Unit :: Support/./SupportTests/VirtualFileSystemTest.ThreeLevelIteration (69773 of 70496)
PASS: LLVM-Unit :: Support/./SupportTests/VirtualizationBuildAttr.testBuildAttr (69774 of 70496)
PASS: LLVM-Unit :: Support/./SupportTests/WMMXArgsBuildAttr.testBuildAttr (69775 of 70496)
PASS: LLVM-Unit :: Support/./SupportTests/WMMXBuildAttr.testBuildAttr (69776 of 70496)
PASS: LLVM-Unit :: Support/./SupportTests/WithColorTest.ColorMode (69777 of 70496)
PASS: LLVM-Unit :: Support/./SupportTests/YAMLIO.MultilineStrings (69778 of 70496)
PASS: LLVM-Unit :: Support/./SupportTests/YAMLIO.Numeric (69779 of 70496)
PASS: LLVM-Unit :: Support/./SupportTests/YAMLIO.NoQuotesForTab (69780 of 70496)
PASS: LLVM-Unit :: Support/./SupportTests/YAMLIO.SequenceElideTest (69781 of 70496)
PASS: LLVM-Unit :: Support/./SupportTests/YAMLIO.TestAnchorMapError (69782 of 70496)
PASS: LLVM-Unit :: Support/./SupportTests/YAMLIO.TestContainerSequenceMapRead (69783 of 70496)
PASS: LLVM-Unit :: Support/./SupportTests/YAMLIO.TestColorsReadError (69784 of 70496)
PASS: LLVM-Unit :: Support/./SupportTests/YAMLIO.TestCustomMapping (69785 of 70496)
PASS: LLVM-Unit :: Support/./SupportTests/YAMLIO.TestCustomMappingStruct (69786 of 70496)
PASS: LLVM-Unit :: Support/./SupportTests/YAMLIO.TestDirectiveMappingNoValue (69787 of 70496)
PASS: LLVM-Unit :: Support/./SupportTests/YAMLIO.TestDocRead (69788 of 70496)
PASS: LLVM-Unit :: Support/./SupportTests/YAMLIO.TestEmptyAlias (69789 of 70496)
PASS: LLVM-Unit :: Support/./SupportTests/YAMLIO.TestEmptyMapWrite (69790 of 70496)
PASS: LLVM-Unit :: Support/./SupportTests/YAMLIO.TestEmptyAnchor (69791 of 70496)
PASS: LLVM-Unit :: Support/./SupportTests/YAMLIO.TestEmptySequenceWrite (69792 of 70496)
PASS: LLVM-Unit :: Support/./SupportTests/YAMLIO.TestEmptyStringFailsForMapWithRequiredFields (69793 of 70496)
PASS: LLVM-Unit :: Support/./SupportTests/YAMLIO.TestEmptyStringSucceedsForMapWithOptionalFields (69794 of 70496)
PASS: LLVM-Unit :: Support/./SupportTests/YAMLIO.TestEmptyStringSucceedsForSequence (69795 of 70496)
PASS: LLVM-Unit :: Support/./SupportTests/YAMLIO.TestEnumRead (69796 of 70496)
PASS: LLVM-Unit :: Support/./SupportTests/YAMLIO.TestEscaped (69797 of 70496)
PASS: LLVM-Unit :: Support/./SupportTests/YAMLIO.TestFlagsRead (69798 of 70496)
PASS: LLVM-Unit :: Support/./SupportTests/YAMLIO.TestFlagsReadError (69799 of 70496)
PASS: LLVM-Unit :: Support/./SupportTests/YAMLIO.TestGivenFilename (69800 of 70496)
PASS: LLVM-Unit :: Support/./SupportTests/YAMLIO.TestFlowSequenceTokenErrors (69801 of 70496)
PASS: LLVM-Unit :: Support/./SupportTests/YAMLIO.TestMalformedMapFailsGracefully (69802 of 70496)
PASS: LLVM-Unit :: Support/./SupportTests/YAMLIO.TestMalformedMapRead (69803 of 70496)
PASS: LLVM-Unit :: Support/./SupportTests/YAMLIO.TestMapRead (69804 of 70496)
PASS: LLVM-Unit :: Support/./SupportTests/YAMLIO.TestMalformedContainerSequenceMapRead (69805 of 70496)
PASS: LLVM-Unit :: Support/./SupportTests/YAMLIO.TestReadBuiltInTypes (69806 of 70496)
PASS: LLVM-Unit :: Support/./SupportTests/YAMLIO.TestReadBuiltInTypesDoubleError (69807 of 70496)
PASS: LLVM-Unit :: Support/./SupportTests/YAMLIO.TestReadBuiltInTypesFloatError (69808 of 70496)
PASS: LLVM-Unit :: Support/./SupportTests/YAMLIO.TestMapWithContext (69809 of 70496)
PASS: LLVM-Unit :: Support/./SupportTests/YAMLIO.TestReadBuiltInTypesHex32Error (69810 of 70496)
PASS: LLVM-Unit :: Support/./SupportTests/YAMLIO.TestReadBuiltInTypesHex16Error (69811 of 70496)
PASS: LLVM-Unit :: Support/./SupportTests/YAMLIO.TestReadBuiltInTypesHex64Error (69812 of 70496)
PASS: LLVM-Unit :: Support/./SupportTests/YAMLIO.TestReadBuiltInTypesHex8Error (69813 of 70496)
PASS: LLVM-Unit :: Support/./SupportTests/YAMLIO.TestReadBuiltInTypesUint16Error (69814 of 70496)
PASS: LLVM-Unit :: Support/./SupportTests/YAMLIO.TestReadBuiltInTypesUint8Error (69815 of 70496)
PASS: LLVM-Unit :: Support/./SupportTests/YAMLIO.TestReadBuiltInTypesUint64Error (69816 of 70496)
PASS: LLVM-Unit :: Support/./SupportTests/YAMLIO.TestReadBuiltInTypesUint32Error (69817 of 70496)
PASS: LLVM-Unit :: Support/./SupportTests/YAMLIO.TestReadBuiltInTypesint16OverError (69818 of 70496)
PASS: LLVM-Unit :: Support/./SupportTests/YAMLIO.TestReadBuiltInTypesint16UnderError (69819 of 70496)
PASS: LLVM-Unit :: Support/./SupportTests/YAMLIO.TestReadBuiltInTypesint32UnderError (69820 of 70496)
PASS: LLVM-Unit :: Support/./SupportTests/YAMLIO.TestReadBuiltInTypesint32OverError (69821 of 70496)
PASS: LLVM-Unit :: Support/./SupportTests/YAMLIO.TestReadBuiltInTypesint64UnderError (69822 of 70496)
PASS: LLVM-Unit :: Support/./SupportTests/YAMLIO.TestReadBuiltInTypesint64OverError (69823 of 70496)
PASS: LLVM-Unit :: Support/./SupportTests/YAMLIO.TestReadBuiltInTypesint8OverError (69824 of 70496)
PASS: LLVM-Unit :: Support/./SupportTests/YAMLIO.TestReadBuiltInTypesint8UnderError (69825 of 70496)
PASS: LLVM-Unit :: Support/./SupportTests/YAMLIO.TestReadEndianEnums (69826 of 70496)
PASS: LLVM-Unit :: Support/./SupportTests/YAMLIO.TestReadEndianTypes (69827 of 70496)
PASS: LLVM-Unit :: Support/./SupportTests/YAMLIO.TestReadKindAndFlagsSequence (69828 of 70496)
PASS: LLVM-Unit :: Support/./SupportTests/YAMLIO.TestReadWriteBlockScalarValue (69829 of 70496)
PASS: LLVM-Unit :: Support/./SupportTests/YAMLIO.TestReadWriteBlockScalarDocuments (69830 of 70496)
PASS: LLVM-Unit :: Support/./SupportTests/YAMLIO.TestReadMySecondsSequence (69831 of 70496)
PASS: LLVM-Unit :: Support/./SupportTests/YAMLIO.TestReadWriteBuiltInTypes (69832 of 70496)
PASS: LLVM-Unit :: Support/./SupportTests/YAMLIO.TestReadWriteEndianTypes (69833 of 70496)
PASS: LLVM-Unit :: Support/./SupportTests/YAMLIO.TestReadWriteFlags (69834 of 70496)
PASS: LLVM-Unit :: Support/./SupportTests/YAMLIO.TestReadWriteMyCustomType (69835 of 70496)
PASS: LLVM-Unit :: Support/./SupportTests/YAMLIO.TestReadWriteEndianEnums (69836 of 70496)
PASS: LLVM-Unit :: Support/./SupportTests/YAMLIO.TestReadWriteKindAndFlagsSequence (69837 of 70496)
PASS: LLVM-Unit :: Support/./SupportTests/YAMLIO.TestReadWriteMyFlowMapping (69838 of 70496)
PASS: LLVM-Unit :: Support/./SupportTests/YAMLIO.TestReadWriteMultilineStringType (69839 of 70496)
PASS: LLVM-Unit :: Support/./SupportTests/YAMLIO.TestReadWriteMyFlowSequence (69840 of 70496)
PASS: LLVM-Unit :: Support/./SupportTests/YAMLIO.TestReadWriteMySecondsSequence (69841 of 70496)
PASS: LLVM-Unit :: Support/./SupportTests/YAMLIO.TestReadWritePolymorphicScalar (69842 of 70496)
PASS: LLVM-Unit :: Support/./SupportTests/YAMLIO.TestReadWriteSequenceOfMyFlowSequence (69843 of 70496)
PASS: LLVM-Unit :: Support/./SupportTests/YAMLIO.TestReadWritePolymorphicMap (69844 of 70496)
PASS: LLVM-Unit :: Support/./SupportTests/YAMLIO.TestScannerNoNullScalarUnbalancedDoubleQuote (69845 of 70496)
PASS: LLVM-Unit :: Support/./SupportTests/YAMLIO.TestScannerNoNullEmptyAlias (69846 of 70496)
PASS: LLVM-Unit :: Support/./SupportTests/YAMLIO.TestScannerNoNullEmpty (69847 of 70496)
PASS: LLVM-Unit :: Support/./SupportTests/YAMLIO.TestReadWriteStringTypes (69848 of 70496)
PASS: LLVM-Unit :: Support/./SupportTests/YAMLIO.TestReadWritePolymorphicSeq (69849 of 70496)
PASS: LLVM-Unit :: Support/./SupportTests/YAMLIO.TestScannerNoNullEmptySequence (69850 of 70496)
PASS: LLVM-Unit :: Support/./SupportTests/YAMLIO.TestScannerNoNullDecodeInvalidUTF8 (69851 of 70496)
PASS: LLVM-Unit :: Support/./SupportTests/YAMLIO.TestScannerNoNullEmptyAnchor (69852 of 70496)
PASS: LLVM-Unit :: Support/./SupportTests/YAMLIO.TestScannerNoNullEmptyMap (69853 of 70496)
PASS: LLVM-Unit :: Support/./SupportTests/YAMLIO.TestScannerNoNullScalarUnbalancedSingleQuote (69854 of 70496)
PASS: LLVM-Unit :: Support/./SupportTests/YAMLIO.TestScannerNoNullScanPlainScalarInFlow (69855 of 70496)
PASS: LLVM-Unit :: Support/./SupportTests/YAMLIO.TestScannerNoNullSequenceOfNull (69856 of 70496)
PASS: LLVM-Unit :: Support/./SupportTests/YAMLIO.TestScannerNoNullSimpleSequence (69857 of 70496)
PASS: LLVM-Unit :: Support/./SupportTests/YAMLIO.TestScannerNoNullUnbalancedMap (69858 of 70496)
PASS: LLVM-Unit :: Support/./SupportTests/YAMLIO.TestScannerUnexpectedCharacter (69859 of 70496)
PASS: LLVM-Unit :: Support/./SupportTests/YAMLIO.TestSequenceMapWriteAndRead (69860 of 70496)
PASS: LLVM-Unit :: Support/./SupportTests/YAMLIO.TestScannerNoNullUnbalancedSequence (69861 of 70496)
PASS: LLVM-Unit :: Support/./SupportTests/YAMLIO.TestSequenceMapRead (69862 of 70496)
PASS: LLVM-Unit :: Support/./SupportTests/YAMLIO.TestSequenceDocListWriteAndRead (69863 of 70496)
PASS: LLVM-Unit :: Support/./SupportTests/YAMLIO.TestTaggedDocumentsWriteAndRead (69864 of 70496)
PASS: LLVM-Unit :: Support/./SupportTests/YAMLIO.TestUnknownDirective (69865 of 70496)
PASS: LLVM-Unit :: Support/./SupportTests/YAMLIO.TestUnescapeInfiniteLoop (69866 of 70496)
PASS: LLVM-Unit :: Support/./SupportTests/YAMLIO.TestTaggedDocuments (69867 of 70496)
PASS: LLVM-Unit :: Support/./SupportTests/YAMLIO.TestValidatingInput (69868 of 70496)
PASS: LLVM-Unit :: Support/./SupportTests/YAMLIO.TestWrapFlow (69869 of 70496)
PASS: LLVM-Unit :: Support/./SupportTests/YAMLParser.DifferentNodesIteratorOperatorEquals (69870 of 70496)
PASS: LLVM-Unit :: Support/./SupportTests/YAMLParser.DefaultDiagnosticFilename (69871 of 70496)
PASS: LLVM-Unit :: Support/./SupportTests/YAMLParser.DiagnosticFilenameFromBufferID (69872 of 70496)
PASS: LLVM-Unit :: Support/./SupportTests/YAMLParser.FailsIfMissingColon (69873 of 70496)
PASS: LLVM-Unit :: Support/./SupportTests/YAMLParser.DifferentNodesIteratorOperatorNotEquals (69874 of 70496)
PASS: LLVM-Unit :: Support/./SupportTests/YAMLParser.FailsOnMissingComma (69875 of 70496)
PASS: LLVM-Unit :: Support/./SupportTests/YAMLParser.FailsIfNotClosingObject (69876 of 70496)
PASS: LLVM-Unit :: Support/./SupportTests/YAMLParser.FailsIfNotClosingArray (69877 of 70496)
PASS: LLVM-Unit :: Support/./SupportTests/YAMLParser.FailsOnMissingQuote (69878 of 70496)
PASS: LLVM-Unit :: Support/./SupportTests/YAMLParser.FlowSequenceTokensOutsideFlowSequence (69879 of 70496)
PASS: LLVM-Unit :: Support/./SupportTests/YAMLParser.HandlesEndOfFileGracefully (69880 of 70496)
PASS: LLVM-Unit :: Support/./SupportTests/YAMLParser.HandlesNullValuesInKeyValueNodesGracefully (69881 of 70496)
PASS: LLVM-Unit :: Support/./SupportTests/YAMLParser.NullTerminatedBlockScalars (69882 of 70496)
PASS: LLVM-Unit :: Support/./SupportTests/YAMLParser.ParsesArrayOfArrays (69883 of 70496)
PASS: LLVM-Unit :: Support/./SupportTests/YAMLParser.ParsesBools (69884 of 70496)
PASS: LLVM-Unit :: Support/./SupportTests/YAMLParser.ParsesBlockLiteralScalars (69885 of 70496)
PASS: LLVM-Unit :: Support/./SupportTests/YAMLParser.ParsesEmptyObject (69886 of 70496)
PASS: LLVM-Unit :: Support/./SupportTests/YAMLParser.ParsesEmptyArray (69887 of 70496)
PASS: LLVM-Unit :: Support/./SupportTests/YAMLParser.ParsesEmptyArrayWithWhitespace (69888 of 70496)
PASS: LLVM-Unit :: Support/./SupportTests/YAMLParser.ParsesEmptyString (69889 of 70496)
PASS: LLVM-Unit :: Support/./SupportTests/YAMLParser.ParsesMultipleKeyValuePairsInObject (69890 of 70496)
PASS: LLVM-Unit :: Support/./SupportTests/YAMLParser.ParsesMultipleObjects (69891 of 70496)
PASS: LLVM-Unit :: Support/./SupportTests/YAMLParser.ParsesEscapedQuotes (69892 of 70496)
PASS: LLVM-Unit :: Support/./SupportTests/YAMLParser.ParsesObject (69893 of 70496)
PASS: LLVM-Unit :: Support/./SupportTests/YAMLParser.ParsesStrings (69894 of 70496)
PASS: LLVM-Unit :: Support/./SupportTests/YAMLParser.SameNodeIteratorOperatorEquals (69895 of 70496)
PASS: LLVM-Unit :: Support/./SupportTests/YAMLParser.ParsesSpacesInBetweenTokens (69896 of 70496)
PASS: LLVM-Unit :: Support/./SupportTests/YAMLParser.SameNodeIteratorOperatorNotEquals (69897 of 70496)
PASS: LLVM-Unit :: Support/./SupportTests/YAMLParser.WorksWithIteratorAlgorithms (69898 of 70496)
PASS: LLVM-Unit :: Support/./SupportTests/formatted_raw_ostreamTest.Test_LineColumn (69899 of 70496)
PASS: LLVM-Unit :: Support/./SupportTests/formatted_raw_ostreamTest.Test_Flush (69900 of 70496)
PASS: LLVM-Unit :: Support/./SupportTests/formatted_raw_ostreamTest.Test_Tell (69901 of 70496)
PASS: LLVM-Unit :: Support/./SupportTests/formatted_raw_ostreamTest.Test_UTF8 (69902 of 70496)
PASS: LLVM-Unit :: Support/./SupportTests/getLinuxHostCPUName.ARM (69903 of 70496)
PASS: LLVM-Unit :: Support/./SupportTests/formatted_raw_ostreamTest.Test_UTF8TinyBuffer (69904 of 70496)
PASS: LLVM-Unit :: Support/./SupportTests/getLinuxHostCPUName.AArch64 (69905 of 70496)
PASS: LLVM-Unit :: Support/./SupportTests/formatted_raw_ostreamTest.Test_UTF8Buffered (69906 of 70496)
PASS: LLVM-Unit :: Support/./SupportTests/getSwappedBytes.SignedRoundTrip (69907 of 70496)
PASS: LLVM-Unit :: Support/./SupportTests/getSwappedBytes.UnsignedRoundTrip (69908 of 70496)
PASS: LLVM-Unit :: Support/./SupportTests/getSwappedBytes.double (69909 of 70496)
PASS: LLVM-Unit :: Support/./SupportTests/getSwappedBytes.float (69910 of 70496)
PASS: LLVM-Unit :: Support/./SupportTests/getSwappedBytes.int16_t (69911 of 70496)
PASS: LLVM-Unit :: Support/./SupportTests/getSwappedBytes.int32_t (69912 of 70496)
PASS: LLVM-Unit :: Support/./SupportTests/getSwappedBytes.int64_t (69913 of 70496)
PASS: LLVM-Unit :: Support/./SupportTests/getSwappedBytes.int8_t (69914 of 70496)
PASS: LLVM-Unit :: Support/./SupportTests/getSwappedBytes.uint16_t (69915 of 70496)
PASS: LLVM-Unit :: Support/./SupportTests/getSwappedBytes.uint64_t (69916 of 70496)
PASS: LLVM-Unit :: Support/./SupportTests/getSwappedBytes.uint32_t (69917 of 70496)
PASS: LLVM-Unit :: Support/./SupportTests/is_absolute_gnu.Works (69918 of 70496)
PASS: LLVM-Unit :: Support/./SupportTests/is_separator.Works (69919 of 70496)
PASS: LLVM-Unit :: Support/./SupportTests/getSwappedBytes.uint8_t (69920 of 70496)
PASS: LLVM-Unit :: Support/./SupportTests/raw_fd_ostreamTest.multiple_raw_fd_ostream_to_stdout (69921 of 70496)
PASS: LLVM-Unit :: Support/./SupportTests/raw_fd_streamTest.DynCast (69922 of 70496)
PASS: LLVM-Unit :: Support/./SupportTests/raw_ostreamTest.Colors (69923 of 70496)
PASS: LLVM-Unit :: Support/./SupportTests/raw_ostreamTest.BufferEdge (69924 of 70496)
PASS: LLVM-Unit :: Support/./SupportTests/raw_fd_streamTest.ReadAfterWrite (69925 of 70496)
PASS: LLVM-Unit :: Support/./SupportTests/raw_ostreamTest.FormatHex (69926 of 70496)
PASS: LLVM-Unit :: Support/./SupportTests/raw_ostreamTest.FormattedHexBytes (69927 of 70496)
PASS: LLVM-Unit :: Support/./SupportTests/raw_ostreamTest.FormatDecimal (69928 of 70496)
PASS: LLVM-Unit :: Support/./SupportTests/raw_ostreamTest.Justify (69929 of 70496)
PASS: LLVM-Unit :: Support/./SupportTests/raw_ostreamTest.TinyBuffer (69930 of 70496)
PASS: LLVM-Unit :: Support/./SupportTests/raw_ostreamTest.flush_tied_to_stream_on_write (69931 of 70496)
PASS: LLVM-Unit :: Support/./SupportTests/raw_ostreamTest.WriteEscaped (69932 of 70496)
PASS: LLVM-Unit :: Support/./SupportTests/raw_ostreamTest.Types_Unbuffered (69933 of 70496)
PASS: LLVM-Unit :: Support/./SupportTests/raw_ostreamTest.Types_Buffered (69934 of 70496)
PASS: LLVM-Unit :: Support/./SupportTests/raw_ostreamTest.writeToDevNull (69935 of 70496)
PASS: LLVM-Unit :: Support/./SupportTests/raw_ostreamTest.reserve_stream (69936 of 70496)
PASS: LLVM-Unit :: Support/./SupportTests/raw_ostreamTest.writeToNonexistingPath (69937 of 70496)
PASS: LLVM-Unit :: Support/./SupportTests/raw_ostreamTest.writeToStdOut (69938 of 70496)
PASS: LLVM-Unit :: Support/./SupportTests/raw_ostreamTest.writeToOutputFile (69939 of 70496)
PASS: LLVM-Unit :: Support/./SupportTests/raw_pwrite_ostreamTest.TestDevNull (69940 of 70496)
PASS: LLVM-Unit :: Support/./SupportTests/raw_pwrite_ostreamTest.TestSVector (69941 of 70496)
PASS: LLVM-Unit :: Support/./SupportTests/raw_pwrite_ostreamTest.TestFD (69942 of 70496)
PASS: LLVM-Unit :: Support/./SupportTests/raw_sha1_ostreamTest.Basic (69943 of 70496)
PASS: LLVM-Unit :: Support/./SupportTests/raw_sha1_ostreamTest.Intermediate (69944 of 70496)
PASS: LLVM-Unit :: Support/./SupportTests/raw_sha1_ostreamTest.Reset (69945 of 70496)
PASS: LLVM-Unit :: Support/./SupportTests/rename.ExistingTemp (69946 of 70496)
PASS: LLVM-Unit :: Support/./SupportTests/sha1_hash_test.Basic (69947 of 70496)
PASS: LLVM-Unit :: Support/./SupportTests/rename.FileOpenedForReadingCanBeReplaced (69948 of 70496)
PASS: LLVM-Unit :: Support/./SupportTests/sha1_hash_test.Update (69949 of 70496)
PASS: LLVM-Unit :: Support/./SupportTests/swapByteOrder.double (69950 of 70496)
PASS: LLVM-Unit :: Support/./SupportTests/swapByteOrder.float (69951 of 70496)
PASS: LLVM-Unit :: Support/./SupportTests/swapByteOrder.int16_t (69952 of 70496)
PASS: LLVM-Unit :: Support/./SupportTests/swapByteOrder.int32_t (69953 of 70496)
PASS: LLVM-Unit :: Support/./SupportTests/swapByteOrder.int64_t (69954 of 70496)
PASS: LLVM-Unit :: Support/./SupportTests/swapByteOrder.int8_t (69955 of 70496)
PASS: LLVM-Unit :: Support/./SupportTests/swapByteOrder.uint16_t (69956 of 70496)
PASS: LLVM-Unit :: TableGen/./TableGenTests/Automata.NfaAutomatonAccepts (69957 of 70496)
PASS: LLVM-Unit :: TableGen/./TableGenTests/Automata.SimpleAutomatonAcceptsFromInitialState (69958 of 70496)
PASS: LLVM-Unit :: TableGen/./TableGenTests/Automata.BinPackerAutomatonAccepts (69959 of 70496)
PASS: LLVM-Unit :: Support/./SupportTests/swapByteOrder.uint32_t (69960 of 70496)
PASS: LLVM-Unit :: TableGen/./TableGenTests/Automata.BinPackerAutomatonExplains (69961 of 70496)
PASS: LLVM-Unit :: Support/./SupportTests/swapByteOrder.uint64_t (69962 of 70496)
PASS: LLVM-Unit :: Support/./SupportTests/swapByteOrder.uint8_t (69963 of 70496)
PASS: LLVM-Unit :: Support/./SupportTests/xxhashTest.Basic (69964 of 70496)
PASS: LLVM-Unit :: TableGen/./TableGenTests/Automata.SimpleAutomatonAcceptsSequences (69965 of 70496)
PASS: LLVM-Unit :: TableGen/./TableGenTests/Automata.TupleAutomatonAccepts (69966 of 70496)
PASS: LLVM-Unit :: TableGen/./TableGenTests/CodeExpander.Escape (69967 of 70496)
PASS: LLVM-Unit :: Support/./SupportTests/writeFileAtomicallyTest.Test (69968 of 70496)
PASS: LLVM-Unit :: TableGen/./TableGenTests/CodeExpander.EscapedExpansion (69969 of 70496)
PASS: LLVM-Unit :: TableGen/./TableGenTests/CodeExpander.EscapedNotAnExpansion (69970 of 70496)
PASS: LLVM-Unit :: TableGen/./TableGenTests/CodeExpander.EscapedUnterminatedExpansion (69971 of 70496)
PASS: LLVM-Unit :: TableGen/./TableGenTests/CodeExpander.Indentation (69972 of 70496)
PASS: LLVM-Unit :: TableGen/./TableGenTests/CodeExpander.NoExpansions (69973 of 70496)
PASS: LLVM-Unit :: TableGen/./TableGenTests/CodeExpander.NotAnExpansion (69974 of 70496)
PASS: LLVM-Unit :: TableGen/./TableGenTests/CodeExpander.UndefinedExpansion (69975 of 70496)
PASS: LLVM-Unit :: TableGen/./TableGenTests/CodeExpander.UnterminatedExpansion (69976 of 70496)
PASS: LLVM-Unit :: Target/AArch64/./AArch64Tests/StackOffset.decomposeStackOffsetForFrameOffsets (69977 of 70496)
PASS: LLVM-Unit :: Target/ARM/./ARMTests/MachineInstr.HasSideEffects (69978 of 70496)
PASS: LLVM-Unit :: Target/ARM/./ARMTests/MachineInstructionDoubleWidthResult.IsCorrect (69979 of 70496)
PASS: LLVM-Unit :: Target/ARM/./ARMTests/MachineInstrValidTailPredication.IsCorrect (69980 of 70496)
PASS: LLVM-Unit :: Target/AArch64/./AArch64Tests/InstSizes.STACKMAP (69981 of 70496)
PASS: LLVM-Unit :: Target/AArch64/./AArch64Tests/InstSizes.PATCHPOINT (69982 of 70496)
PASS: LLVM-Unit :: Target/AArch64/./AArch64Tests/InstSizes.TLSDESC_CALLSEQ (69983 of 70496)
PASS: LLVM-Unit :: Target/ARM/./ARMTests/MachineInstructionHorizontalReduction.IsCorrect (69984 of 70496)
PASS: LLVM-Unit :: TextAPI/./TextAPITests/TBDv1.MalformedFile1 (69985 of 70496)
PASS: LLVM-Unit :: Target/ARM/./ARMTests/MachineInstructionRetainsPreviousHalfElement.IsCorrect (69986 of 70496)
PASS: LLVM-Unit :: TextAPI/./TextAPITests/TBDv1.MalformedFile2 (69987 of 70496)
PASS: LLVM-Unit :: TextAPI/./TextAPITests/TBDv1.Platform_bridgeOS (69988 of 70496)
PASS: LLVM-Unit :: TextAPI/./TextAPITests/TBDv1.Platform_iOS (69989 of 70496)
PASS: LLVM-Unit :: TextAPI/./TextAPITests/TBDv1.Platform_macOS (69990 of 70496)
PASS: LLVM-Unit :: Target/AArch64/./AArch64Tests/InstSizes.Authenticated (69991 of 70496)
PASS: LLVM-Unit :: TextAPI/./TextAPITests/TBDv1.Platform_tvOS (69992 of 70496)
PASS: LLVM-Unit :: TextAPI/./TextAPITests/TBDv1.ReadFile (69993 of 70496)
PASS: LLVM-Unit :: TextAPI/./TextAPITests/TBDv1.Platform_watchOS (69994 of 70496)
PASS: LLVM-Unit :: TextAPI/./TextAPITests/TBDv1.ReadFile2 (69995 of 70496)
PASS: LLVM-Unit :: TextAPI/./TextAPITests/TBDv1.Swift_1_0 (69996 of 70496)
PASS: LLVM-Unit :: TextAPI/./TextAPITests/TBDv1.Swift_1_1 (69997 of 70496)
PASS: LLVM-Unit :: Target/X86/./X86Tests/MachineSizeOptsTest.Test (69998 of 70496)
PASS: LLVM-Unit :: TextAPI/./TextAPITests/TBDv1.Swift_2_0 (69999 of 70496)
PASS: LLVM-Unit :: TextAPI/./TextAPITests/TBDv1.Swift_3_0 (70000 of 70496)
PASS: LLVM-Unit :: TextAPI/./TextAPITests/TBDv1.Swift_4_0 (70001 of 70496)
PASS: LLVM-Unit :: TextAPI/./TextAPITests/TBDv1.Swift_99 (70002 of 70496)
PASS: LLVM-Unit :: TextAPI/./TextAPITests/TBDv1.Swift_5 (70003 of 70496)
PASS: LLVM-Unit :: TextAPI/./TextAPITests/TBDv1.UnknownArchitecture (70004 of 70496)
PASS: LLVM-Unit :: TextAPI/./TextAPITests/TBDv1.UnknownPlatform (70005 of 70496)
PASS: LLVM-Unit :: TextAPI/./TextAPITests/TBDv1.WriteFile (70006 of 70496)
PASS: LLVM-Unit :: TextAPI/./TextAPITests/TBDv2.MalformedFile1 (70007 of 70496)
PASS: LLVM-Unit :: TextAPI/./TextAPITests/TBDv2.MalformedFile2 (70008 of 70496)
PASS: LLVM-Unit :: TextAPI/./TextAPITests/TBDv2.InvalidPlatform (70009 of 70496)
PASS: LLVM-Unit :: TextAPI/./TextAPITests/TBDv2.Platform_bridgeOS (70010 of 70496)
PASS: LLVM-Unit :: TextAPI/./TextAPITests/TBDv2.Platform_iOS (70011 of 70496)
PASS: LLVM-Unit :: TextAPI/./TextAPITests/TBDv2.Platform_tvOS (70012 of 70496)
PASS: LLVM-Unit :: TextAPI/./TextAPITests/TBDv2.Platform_macOS (70013 of 70496)
PASS: LLVM-Unit :: TextAPI/./TextAPITests/TBDv2.Platform_watchOS (70014 of 70496)
PASS: LLVM-Unit :: TextAPI/./TextAPITests/TBDv2.ReadFile (70015 of 70496)
PASS: LLVM-Unit :: TextAPI/./TextAPITests/TBDv2.ReadFile2 (70016 of 70496)
PASS: LLVM-Unit :: TextAPI/./TextAPITests/TBDv2.Swift_1_0 (70017 of 70496)
PASS: LLVM-Unit :: TextAPI/./TextAPITests/TBDv2.Swift_1_1 (70018 of 70496)
PASS: LLVM-Unit :: TextAPI/./TextAPITests/TBDv2.Swift_2_0 (70019 of 70496)
PASS: LLVM-Unit :: TextAPI/./TextAPITests/TBDv2.Swift_3_0 (70020 of 70496)
PASS: LLVM-Unit :: TextAPI/./TextAPITests/TBDv2.Swift_4_0 (70021 of 70496)
PASS: LLVM-Unit :: TextAPI/./TextAPITests/TBDv2.Swift_5 (70022 of 70496)
PASS: LLVM-Unit :: TextAPI/./TextAPITests/TBDv2.Swift_99 (70023 of 70496)
PASS: LLVM-Unit :: TextAPI/./TextAPITests/TBDv2.UnknownArchitecture (70024 of 70496)
PASS: LLVM-Unit :: TextAPI/./TextAPITests/TBDv2.WriteFile (70025 of 70496)
PASS: LLVM-Unit :: TextAPI/./TextAPITests/TBDv2.UnknownPlatform (70026 of 70496)
PASS: LLVM-Unit :: TextAPI/./TextAPITests/TBDv3.Arch_arm64e (70027 of 70496)
PASS: LLVM-Unit :: TextAPI/./TextAPITests/TBDv3.InterfaceInequality (70028 of 70496)
PASS: LLVM-Unit :: TextAPI/./TextAPITests/TBDv3.InterfaceEquality (70029 of 70496)
PASS: LLVM-Unit :: TextAPI/./TextAPITests/TBDv3.MalformedFile1 (70030 of 70496)
PASS: LLVM-Unit :: TextAPI/./TextAPITests/TBDv3.MalformedFile2 (70031 of 70496)
PASS: LLVM-Unit :: TextAPI/./TextAPITests/TBDv3.Platform_bridgeOS (70032 of 70496)
PASS: LLVM-Unit :: TextAPI/./TextAPITests/TBDv3.Platform_iOS (70033 of 70496)
PASS: LLVM-Unit :: TextAPI/./TextAPITests/TBDv3.Platform_iOSSim (70034 of 70496)
PASS: LLVM-Unit :: TextAPI/./TextAPITests/TBDv3.Platform_macOS (70035 of 70496)
PASS: LLVM-Unit :: TextAPI/./TextAPITests/TBDv3.Platform_macCatalyst (70036 of 70496)
PASS: LLVM-Unit :: TextAPI/./TextAPITests/TBDv3.Platform_tvOS (70037 of 70496)
PASS: LLVM-Unit :: TextAPI/./TextAPITests/TBDv3.Platform_tvOSSim (70038 of 70496)
PASS: LLVM-Unit :: TextAPI/./TextAPITests/TBDv3.Platform_watchOS (70039 of 70496)
PASS: LLVM-Unit :: TextAPI/./TextAPITests/TBDv3.Platform_watchOSSim (70040 of 70496)
PASS: LLVM-Unit :: TextAPI/./TextAPITests/TBDv3.Platform_zippered (70041 of 70496)
PASS: LLVM-Unit :: TextAPI/./TextAPITests/TBDv3.ReadMultipleDocuments (70042 of 70496)
PASS: LLVM-Unit :: TextAPI/./TextAPITests/TBDv3.ReadFile (70043 of 70496)
PASS: LLVM-Unit :: TextAPI/./TextAPITests/TBDv3.Swift_1_0 (70044 of 70496)
PASS: LLVM-Unit :: TextAPI/./TextAPITests/TBDv3.Swift_1_1 (70045 of 70496)
PASS: LLVM-Unit :: TextAPI/./TextAPITests/TBDv3.Swift_3_0 (70046 of 70496)
PASS: LLVM-Unit :: TextAPI/./TextAPITests/TBDv3.Swift_4_0 (70047 of 70496)
PASS: LLVM-Unit :: TextAPI/./TextAPITests/TBDv3.Swift_5 (70048 of 70496)
PASS: LLVM-Unit :: TextAPI/./TextAPITests/TBDv3.Swift_2_0 (70049 of 70496)
PASS: LLVM-Unit :: TextAPI/./TextAPITests/TBDv3.Swift_99 (70050 of 70496)
PASS: LLVM-Unit :: TextAPI/./TextAPITests/TBDv3.UnknownArchitecture (70051 of 70496)
PASS: LLVM-Unit :: TextAPI/./TextAPITests/TBDv3.UnknownPlatform (70052 of 70496)
PASS: LLVM-Unit :: TextAPI/./TextAPITests/TBDv3.WriteFile (70053 of 70496)
PASS: LLVM-Unit :: TextAPI/./TextAPITests/TBDv3.WriteMultipleDocuments (70054 of 70496)
PASS: LLVM-Unit :: TextAPI/./TextAPITests/TBDv4.InterfaceDiffVersionsEquality (70055 of 70496)
PASS: LLVM-Unit :: TextAPI/./TextAPITests/TBDv4.InterfaceEquality (70056 of 70496)
PASS: LLVM-Unit :: TextAPI/./TextAPITests/TBDv4.InterfaceInequality (70057 of 70496)
PASS: LLVM-Unit :: TextAPI/./TextAPITests/TBDv4.MalformedFile1 (70058 of 70496)
PASS: LLVM-Unit :: TextAPI/./TextAPITests/TBDv4.InvalidArchitecture (70059 of 70496)
PASS: LLVM-Unit :: TextAPI/./TextAPITests/TBDv4.MalformedFile2 (70060 of 70496)
PASS: LLVM-Unit :: TextAPI/./TextAPITests/TBDv4.InvalidPlatform (70061 of 70496)
PASS: LLVM-Unit :: TextAPI/./TextAPITests/TBDv4.MalformedFile3 (70062 of 70496)
PASS: LLVM-Unit :: TextAPI/./TextAPITests/TBDv4.MultipleTargetsSameArch (70063 of 70496)
PASS: LLVM-Unit :: TextAPI/./TextAPITests/TBDv4.MultipleTargetsSamePlatform (70064 of 70496)
PASS: LLVM-Unit :: TextAPI/./TextAPITests/TBDv4.MultipleTargets (70065 of 70496)
PASS: LLVM-Unit :: TextAPI/./TextAPITests/TBDv4.ReadFile (70066 of 70496)
PASS: LLVM-Unit :: TextAPI/./TextAPITests/TBDv4.Swift_2 (70067 of 70496)
PASS: LLVM-Unit :: TextAPI/./TextAPITests/TBDv4.Swift_5 (70068 of 70496)
PASS: LLVM-Unit :: TextAPI/./TextAPITests/TBDv4.ReadMultipleDocuments (70069 of 70496)
PASS: LLVM-Unit :: TextAPI/./TextAPITests/TBDv4.Swift_1 (70070 of 70496)
PASS: LLVM-Unit :: TextAPI/./TextAPITests/TBDv4.Target_arm_bridgeOS (70071 of 70496)
PASS: LLVM-Unit :: Support/DynamicLibrary/./DynamicLibraryTests/DynamicLibrary.Overload (70072 of 70496)
PASS: LLVM-Unit :: TextAPI/./TextAPITests/TBDv4.Target_arm_iOS (70073 of 70496)
PASS: LLVM-Unit :: TextAPI/./TextAPITests/TBDv4.Target_i386_driverkit (70074 of 70496)
PASS: LLVM-Unit :: TextAPI/./TextAPITests/TBDv4.Swift_99 (70075 of 70496)
PASS: LLVM-Unit :: TextAPI/./TextAPITests/TBDv4.Target_maccatalyst (70076 of 70496)
PASS: LLVM-Unit :: TextAPI/./TextAPITests/TBDv4.Target_i386_watchos_simulator (70077 of 70496)
PASS: LLVM-Unit :: TextAPI/./TextAPITests/TBDv4.Target_x86_ios (70078 of 70496)
PASS: LLVM-Unit :: TextAPI/./TextAPITests/TBDv4.Target_x86_ios_simulator (70079 of 70496)
PASS: LLVM-Unit :: TextAPI/./TextAPITests/TBDv4.Target_x86_tvos_simulator (70080 of 70496)
PASS: LLVM-Unit :: TextAPI/./TextAPITests/TBDv4.WriteFile (70081 of 70496)
PASS: LLVM-Unit :: TextAPI/./TextAPITests/TBDv4.Target_x86_macos (70082 of 70496)
PASS: LLVM-Unit :: TextAPI/./TextAPITests/TBDv4.WriteMultipleDocuments (70083 of 70496)
PASS: LLVM-Unit :: Transforms/IPO/./IPOTests/AttributorTestBase.TestCast (70084 of 70496)
PASS: LLVM-Unit :: Transforms/IPO/./IPOTests/AttributorTestBase.IRPPositionCallBaseContext (70085 of 70496)
PASS: LLVM-Unit :: Transforms/IPO/./IPOTests/LowerTypeTests.BitSetBuilder (70086 of 70496)
PASS: LLVM-Unit :: Transforms/IPO/./IPOTests/WholeProgramDevirt.findLowestOffset (70087 of 70496)
PASS: LLVM-Unit :: Transforms/IPO/./IPOTests/WholeProgramDevirt.setReturnValues (70088 of 70496)
PASS: LLVM-Unit :: Transforms/Scalar/./ScalarTests/LoopPassManagerTest.FunctionPassInvalidationOfLoopAnalyses (70089 of 70496)
PASS: LLVM-Unit :: Transforms/Scalar/./ScalarTests/LoopPassManagerTest.InvalidationOfBundledAnalyses (70090 of 70496)
PASS: LLVM-Unit :: Transforms/Scalar/./ScalarTests/LoopPassManagerTest.Basic (70091 of 70496)
PASS: LLVM-Unit :: Transforms/Scalar/./ScalarTests/LoopPassManagerTest.IndirectOuterPassInvalidation (70092 of 70496)
PASS: LLVM-Unit :: Transforms/Scalar/./ScalarTests/LoopPassManagerTest.LoopDeletion (70093 of 70496)
PASS: LLVM-Unit :: Transforms/Scalar/./ScalarTests/LoopPassManagerTest.IndirectInvalidation (70094 of 70496)
PASS: LLVM-Unit :: Transforms/Scalar/./ScalarTests/LoopPassManagerTest.ModulePassInvalidationOfLoopAnalyses (70095 of 70496)
PASS: LLVM-Unit :: Transforms/Scalar/./ScalarTests/LoopPassManagerTest.LoopPeerInsertion (70096 of 70496)
PASS: LLVM-Unit :: Transforms/Scalar/./ScalarTests/LoopPassManagerTest.LoopChildInsertion (70097 of 70496)
PASS: LLVM-Unit :: Transforms/Scalar/./ScalarTests/LoopPassManagerTest.HandleLoopNestPass (70098 of 70496)
PASS: LLVM-Unit :: Transforms/IPO/./IPOTests/LowerTypeTests.GlobalLayoutBuilder (70099 of 70496)
PASS: LLVM-Unit :: Transforms/IPO/./IPOTests/LowerTypeTests.ByteArrayBuilder (70100 of 70496)
PASS: LLVM-Unit :: Transforms/Scalar/./ScalarTests/LICMTest.TestSCEVInvalidationOnHoisting (70101 of 70496)
PASS: LLVM-Unit :: Transforms/Utils/./UtilsTests/ASanStackFrameLayout.Test (70102 of 70496)
PASS: LLVM-Unit :: Transforms/Utils/./UtilsTests/BasicBlockUtils.EliminateUnreachableBlocks (70103 of 70496)
PASS: LLVM-Unit :: Transforms/Utils/./UtilsTests/BasicBlockUtils.NoUnreachableBlocksToEliminate (70104 of 70496)
PASS: LLVM-Unit :: Transforms/Utils/./UtilsTests/BasicBlockUtils.SetEdgeProbability (70105 of 70496)
PASS: LLVM-Unit :: Transforms/Utils/./UtilsTests/BasicBlockUtils.SplitBlockPredecessors (70106 of 70496)
PASS: LLVM-Unit :: Transforms/Utils/./UtilsTests/BasicBlockUtils.SplitEdge_ex1 (70107 of 70496)
PASS: LLVM-Unit :: Transforms/Utils/./UtilsTests/BasicBlockUtils.SplitCriticalEdge (70108 of 70496)
PASS: LLVM-Unit :: Transforms/Utils/./UtilsTests/BasicBlockUtils.SplitEdge_ex3 (70109 of 70496)
PASS: LLVM-Unit :: Transforms/Utils/./UtilsTests/BasicBlockUtils.SplitEdge_ex2 (70110 of 70496)
PASS: LLVM-Unit :: Transforms/Utils/./UtilsTests/BasicBlockUtils.SplitIndirectBrCriticalEdge (70111 of 70496)
PASS: LLVM-Unit :: Transforms/Utils/./UtilsTests/CallPromotionUtilsTest.TryPromoteCall_Legality (70112 of 70496)
PASS: LLVM-Unit :: Transforms/Utils/./UtilsTests/CallPromotionUtilsTest.TryPromoteCall_MemberFunctionCalls (70113 of 70496)
PASS: LLVM-Unit :: Transforms/Utils/./UtilsTests/CallPromotionUtilsTest.TryPromoteCall_NoVTablePtrLoad (70114 of 70496)
PASS: LLVM-Unit :: Transforms/Utils/./UtilsTests/CallPromotionUtilsTest.TryPromoteCall_NoFPLoad (70115 of 70496)
PASS: LLVM-Unit :: Transforms/Utils/./UtilsTests/CallPromotionUtilsTest.TryPromoteCall_NoVTableInitFound (70116 of 70496)
PASS: LLVM-Unit :: Transforms/Utils/./UtilsTests/CallPromotionUtilsTest.TryPromoteCall_NullFP (70117 of 70496)
PASS: LLVM-Unit :: Transforms/Utils/./UtilsTests/CloneFunc.DebugIntrinsics (70118 of 70496)
PASS: LLVM-Unit :: Transforms/Utils/./UtilsTests/CloneFunc.NewFunctionCreated (70119 of 70496)
PASS: LLVM-Unit :: Transforms/Utils/./UtilsTests/CloneFunc.Subprogram (70120 of 70496)
PASS: LLVM-Unit :: Transforms/Utils/./UtilsTests/CloneFunc.InstructionOwnership (70121 of 70496)
PASS: LLVM-Unit :: Transforms/Utils/./UtilsTests/CallPromotionUtilsTest.TryPromoteCall_EmptyVTable (70122 of 70496)
PASS: LLVM-Unit :: Transforms/Utils/./UtilsTests/BasicBlockUtils.splitBasicBlockBefore_ex1 (70123 of 70496)
PASS: LLVM-Unit :: Transforms/Utils/./UtilsTests/CallPromotionUtilsTest.TryPromoteCall (70124 of 70496)
PASS: LLVM-Unit :: Transforms/Utils/./UtilsTests/CloneFunction.CloneEmptyFunction (70125 of 70496)
PASS: LLVM-Unit :: Transforms/Utils/./UtilsTests/CloneFunction.CloneFunctionToDifferentModule (70126 of 70496)
PASS: LLVM-Unit :: Transforms/Utils/./UtilsTests/CloneFunction.CloneFunctionWithInalloca (70127 of 70496)
PASS: LLVM-Unit :: Transforms/Utils/./UtilsTests/CloneInstruction.Attributes (70128 of 70496)
PASS: LLVM-Unit :: Transforms/Utils/./UtilsTests/CloneFunction.CloneFunctionWithSubprograms (70129 of 70496)
PASS: LLVM-Unit :: Transforms/Utils/./UtilsTests/CloneInstruction.CallingConvention (70130 of 70496)
PASS: LLVM-Unit :: Transforms/Utils/./UtilsTests/CloneInstruction.DuplicateInstructionsToSplit (70131 of 70496)
PASS: LLVM-Unit :: Transforms/Utils/./UtilsTests/CloneInstruction.DuplicateInstructionsToSplitBlocksEq1 (70132 of 70496)
PASS: LLVM-Unit :: Transforms/Utils/./UtilsTests/CloneInstruction.DuplicateInstructionsToSplitBlocksEq2 (70133 of 70496)
PASS: LLVM-Unit :: Transforms/Utils/./UtilsTests/CloneInstruction.Exact (70134 of 70496)
PASS: LLVM-Unit :: Transforms/Utils/./UtilsTests/CloneInstruction.Inbounds (70135 of 70496)
PASS: LLVM-Unit :: Transforms/Utils/./UtilsTests/CloneInstruction.OverflowBits (70136 of 70496)
PASS: LLVM-Unit :: Transforms/Utils/./UtilsTests/CloneLoop.CloneLoopNest (70137 of 70496)
PASS: LLVM-Unit :: Transforms/Utils/./UtilsTests/CloneModule.Comdat (70138 of 70496)
PASS: LLVM-Unit :: Transforms/Utils/./UtilsTests/CloneModule.CompileUnit (70139 of 70496)
PASS: LLVM-Unit :: Transforms/Utils/./UtilsTests/CloneModule.GlobalDebugInfo (70140 of 70496)
PASS: LLVM-Unit :: Transforms/Utils/./UtilsTests/CloneModule.GlobalMetadata (70141 of 70496)
PASS: LLVM-Unit :: Transforms/Utils/./UtilsTests/CloneModule.OldModuleUnchanged (70142 of 70496)
PASS: LLVM-Unit :: Transforms/Utils/./UtilsTests/CloneModule.Verify (70143 of 70496)
PASS: LLVM-Unit :: Transforms/Utils/./UtilsTests/CloneModule.Subprogram (70144 of 70496)
PASS: LLVM-Unit :: Transforms/Utils/./UtilsTests/CodeExtractor.ExitPHIOnePredFromRegion (70145 of 70496)
PASS: LLVM-Unit :: Transforms/Utils/./UtilsTests/CodeExtractor.ExitStub (70146 of 70496)
PASS: LLVM-Unit :: Transforms/Utils/./UtilsTests/CodeExtractor.ExtractAndInvalidateAssumptionCache (70147 of 70496)
PASS: LLVM-Unit :: Transforms/Utils/./UtilsTests/CodeExtractor.RemoveBitcastUsesFromOuterLifetimeMarkers (70148 of 70496)
PASS: LLVM-Unit :: Transforms/Utils/./UtilsTests/CodeExtractor.StoreOutputInvokeResultAfterEHPad (70149 of 70496)
PASS: LLVM-Unit :: Transforms/Utils/./UtilsTests/CodeExtractor.StoreOutputInvokeResultInExitStub (70150 of 70496)
PASS: LLVM-Unit :: Transforms/Utils/./UtilsTests/CodeMoverUtils.IsControlFlowEquivalentCondNestTest (70151 of 70496)
PASS: LLVM-Unit :: Transforms/Utils/./UtilsTests/CodeMoverUtils.IsControlFlowEquivalentImbalanceTest (70152 of 70496)
PASS: LLVM-Unit :: Transforms/Utils/./UtilsTests/CodeMoverUtils.IsControlFlowEquivalentNotPostdomTest (70153 of 70496)
PASS: LLVM-Unit :: Transforms/Utils/./UtilsTests/CodeMoverUtils.IsControlFlowEquivalentOppositeCondTest (70154 of 70496)
PASS: LLVM-Unit :: Transforms/Utils/./UtilsTests/CodeMoverUtils.IsControlFlowEquivalentPointerTest (70155 of 70496)
PASS: LLVM-Unit :: Transforms/Utils/./UtilsTests/CodeMoverUtils.IsControlFlowEquivalentSimpleTest (70156 of 70496)
PASS: LLVM-Unit :: Transforms/Utils/./UtilsTests/CodeMoverUtils.IsSafeToMoveTest2 (70157 of 70496)
PASS: LLVM-Unit :: Transforms/Utils/./UtilsTests/CodeMoverUtils.IsSafeToMoveTest4 (70158 of 70496)
PASS: LLVM-Unit :: Transforms/Utils/./UtilsTests/CodeMoverUtils.IsSafeToMoveTest1 (70159 of 70496)
PASS: LLVM-Unit :: Transforms/Utils/./UtilsTests/CodeMoverUtils.IsSafeToMoveTest3 (70160 of 70496)
PASS: LLVM-Unit :: Transforms/Utils/./UtilsTests/CodeMoverUtils.IsSafeToMoveTest6 (70161 of 70496)
PASS: LLVM-Unit :: Transforms/Utils/./UtilsTests/CodeMoverUtils.IsSafeToMoveTest5 (70162 of 70496)
PASS: LLVM-Unit :: Transforms/Utils/./UtilsTests/DebugInfoDrop.DropOriginalDebugInfo (70163 of 70496)
PASS: LLVM-Unit :: Support/DynamicLibrary/./DynamicLibraryTests/DynamicLibrary.Shutdown (70164 of 70496)
PASS: LLVM-Unit :: Transforms/Utils/./UtilsTests/FunctionComparatorTest.TestAPI (70165 of 70496)
PASS: LLVM-Unit :: Transforms/Utils/./UtilsTests/IntegerDivision.SDiv (70166 of 70496)
PASS: LLVM-Unit :: Transforms/Utils/./UtilsTests/IntegerDivision.SDiv64 (70167 of 70496)
PASS: LLVM-Unit :: Transforms/Utils/./UtilsTests/DebugInfoDummyAnalysis.PreserveOriginalDebugInfo (70168 of 70496)
PASS: LLVM-Unit :: Transforms/Utils/./UtilsTests/IntegerDivision.SRem (70169 of 70496)
PASS: LLVM-Unit :: Transforms/Utils/./UtilsTests/IntegerDivision.SRem64 (70170 of 70496)
PASS: LLVM-Unit :: Transforms/Utils/./UtilsTests/IntegerDivision.UDiv (70171 of 70496)
PASS: LLVM-Unit :: Transforms/Utils/./UtilsTests/IntegerDivision.UDiv64 (70172 of 70496)
PASS: LLVM-Unit :: Transforms/Utils/./UtilsTests/IntegerDivision.URem (70173 of 70496)
PASS: LLVM-Unit :: Transforms/Utils/./UtilsTests/IntegerDivision.URem64 (70174 of 70496)
PASS: LLVM-Unit :: Transforms/Utils/./UtilsTests/Local.CanReplaceOperandWithVariable (70175 of 70496)
PASS: LLVM-Unit :: Transforms/Utils/./UtilsTests/Local.ChangeToUnreachable (70176 of 70496)
PASS: LLVM-Unit :: Transforms/Utils/./UtilsTests/Local.ConstantFoldTerminator (70177 of 70496)
PASS: LLVM-Unit :: Transforms/Utils/./UtilsTests/Local.RecursivelyDeleteDeadPHINodes (70178 of 70496)
PASS: LLVM-Unit :: Transforms/Utils/./UtilsTests/Local.MergeBasicBlockIntoOnlyPred (70179 of 70496)
PASS: LLVM-Unit :: Transforms/Utils/./UtilsTests/Local.RemoveDuplicatePHINodes (70180 of 70496)
PASS: LLVM-Unit :: Transforms/Utils/./UtilsTests/Local.ReplaceDbgDeclare (70181 of 70496)
PASS: LLVM-Unit :: Transforms/Utils/./UtilsTests/Local.ReplaceAllDbgUsesWith (70182 of 70496)
PASS: LLVM-Unit :: Transforms/Utils/./UtilsTests/Local.SimplifyCFGWithNullAC (70183 of 70496)
PASS: LLVM-Unit :: Transforms/Utils/./UtilsTests/Local.RemoveUnreachableBlocks (70184 of 70496)
PASS: LLVM-Unit :: Transforms/Utils/./UtilsTests/LoopRotate.MultiDeoptExit (70185 of 70496)
PASS: LLVM-Unit :: Transforms/Utils/./UtilsTests/LoopRotate.MultiDeoptExit_Nondup (70186 of 70496)
PASS: LLVM-Unit :: Transforms/Utils/./UtilsTests/LoopUnrollRuntime.Latch (70187 of 70496)
PASS: LLVM-Unit :: Transforms/Utils/./UtilsTests/LoopUtils.DeleteDeadLoopNest (70188 of 70496)
PASS: LLVM-Unit :: Transforms/Utils/./UtilsTests/SSAUpdaterBulk.SimpleMerge (70189 of 70496)
PASS: LLVM-Unit :: Transforms/Utils/./UtilsTests/SSAUpdaterBulk.Irreducible (70190 of 70496)
PASS: LLVM-Unit :: Transforms/Utils/./UtilsTests/SalvageDebugInfoTest.RecursiveBlockSimplification (70191 of 70496)
PASS: LLVM-Unit :: Transforms/Utils/./UtilsTests/SalvageDebugInfoTest.RecursiveInstDeletion (70192 of 70496)
PASS: LLVM-Unit :: Transforms/Utils/./UtilsTests/ScalarEvolutionExpanderTest.ExpandNonIntegralPtrWithNullBase (70193 of 70496)
PASS: LLVM-Unit :: Transforms/Utils/./UtilsTests/ScalarEvolutionExpanderTest.ExpandPtrTypeSCEV (70194 of 70496)
PASS: LLVM-Unit :: Transforms/Utils/./UtilsTests/ScalarEvolutionExpanderTest.SCEVCacheNUW (70195 of 70496)
PASS: LLVM-Unit :: Transforms/Utils/./UtilsTests/ScalarEvolutionExpanderTest.SCEVCacheNSW (70196 of 70496)
PASS: LLVM-Unit :: Transforms/Utils/./UtilsTests/ScalarEvolutionExpanderTest.SCEVExpandInsertCanonicalIV (70197 of 70496)
PASS: LLVM-Unit :: Transforms/Utils/./UtilsTests/ScalarEvolutionExpanderTest.SCEVExpanderIsSafeToExpandAt (70198 of 70496)
PASS: LLVM-Unit :: Transforms/Utils/./UtilsTests/ScalarEvolutionExpanderTest.SCEVExpanderNSW (70199 of 70496)
PASS: LLVM-Unit :: Transforms/Utils/./UtilsTests/ScalarEvolutionExpanderTest.SCEVExpanderNUW (70200 of 70496)
PASS: LLVM-Unit :: Transforms/Utils/./UtilsTests/ScalarEvolutionExpanderTest.SCEVExpanderShlNSW (70201 of 70496)
PASS: LLVM-Unit :: Transforms/Utils/./UtilsTests/ScalarEvolutionExpanderTest.SCEVZeroExtendExprNonIntegral (70202 of 70496)
PASS: LLVM-Unit :: Transforms/Utils/./UtilsTests/SizeOptsTest.Test (70203 of 70496)
PASS: LLVM-Unit :: Transforms/Utils/./UtilsTests/ScalarEvolutionExpanderTest.SCEVExpandNonAffineAddRec (70204 of 70496)
PASS: LLVM-Unit :: Transforms/Utils/./UtilsTests/VFABIAttrTest.Write (70205 of 70496)
PASS: LLVM-Unit :: Transforms/Utils/./UtilsTests/ValueMapperTest.mapMDNode (70206 of 70496)
PASS: LLVM-Unit :: Transforms/Utils/./UtilsTests/ValueMapperTest.mapMDNodeCycle (70207 of 70496)
PASS: LLVM-Unit :: Transforms/Utils/./UtilsTests/ValueMapperTest.mapMDNodeDistinct (70208 of 70496)
PASS: LLVM-Unit :: Transforms/Utils/./UtilsTests/ValueMapperTest.mapMDNodeDistinctOperands (70209 of 70496)
PASS: LLVM-Unit :: Transforms/Utils/./UtilsTests/ValueMapperTest.mapMDNodeDuplicatedCycle (70210 of 70496)
PASS: LLVM-Unit :: Transforms/Utils/./UtilsTests/ValueMapperTest.mapMDNodeSeeded (70211 of 70496)
PASS: LLVM-Unit :: Transforms/Utils/./UtilsTests/ValueMapperTest.mapMDNodeSeededWithNull (70212 of 70496)
PASS: LLVM-Unit :: Transforms/Utils/./UtilsTests/ValueMapperTest.mapMDNodeUnresolved (70213 of 70496)
PASS: LLVM-Unit :: Transforms/Utils/./UtilsTests/ValueMapperTest.mapMetadataConstantAsMetadata (70214 of 70496)
PASS: LLVM-Unit :: Transforms/Utils/./UtilsTests/ValueMapperTest.mapMetadataMDString (70215 of 70496)
PASS: LLVM-Unit :: Transforms/Utils/./UtilsTests/ValueMapperTest.mapMetadataGetMappedMD (70216 of 70496)
PASS: LLVM-Unit :: Transforms/Utils/./UtilsTests/ValueMapperTest.mapMetadataNoModuleLevelChanges (70217 of 70496)
PASS: LLVM-Unit :: Transforms/Utils/./UtilsTests/ValueMapperTest.mapMetadataNullMapGlobalWithIgnoreMissingLocals (70218 of 70496)
PASS: LLVM-Unit :: Transforms/Utils/./UtilsTests/ValueMapperTest.mapValueLocalAsMetadataToConstant (70219 of 70496)
PASS: LLVM-Unit :: Transforms/Utils/./UtilsTests/ValueMapperTest.mapValueLocalAsMetadata (70220 of 70496)
PASS: LLVM-Unit :: Transforms/Vectorize/./VectorizeTests/VPBasicBlockTest.getPlan (70221 of 70496)
PASS: LLVM-Unit :: Transforms/Vectorize/./VectorizeTests/VPDoubleValueDefTest.traverseUseLists (70222 of 70496)
PASS: LLVM-Unit :: Transforms/Vectorize/./VectorizeTests/VPInstructionTest.eraseFromParent (70223 of 70496)
PASS: LLVM-Unit :: Transforms/Vectorize/./VectorizeTests/VPInstructionTest.insertBefore (70224 of 70496)
PASS: LLVM-Unit :: Transforms/Vectorize/./VectorizeTests/VPInstructionTest.moveAfter (70225 of 70496)
PASS: LLVM-Unit :: Transforms/Vectorize/./VectorizeTests/VPInstructionTest.moveBefore (70226 of 70496)
PASS: LLVM-Unit :: Transforms/Vectorize/./VectorizeTests/VPInstructionTest.replaceAllUsesWith (70227 of 70496)
PASS: LLVM-Unit :: Transforms/Vectorize/./VectorizeTests/VPInstructionTest.releaseOperandsAtDeletion (70228 of 70496)
PASS: LLVM-Unit :: Transforms/Vectorize/./VectorizeTests/VPInstructionTest.setOperand (70229 of 70496)
PASS: LLVM-Unit :: Transforms/Vectorize/./VectorizeTests/VPRecipeTest.CastVPBlendRecipeToVPUser (70230 of 70496)
PASS: LLVM-Unit :: Transforms/Vectorize/./VectorizeTests/VPRecipeTest.CastVPBranchOnMaskRecipeToVPUser (70231 of 70496)
PASS: LLVM-Unit :: Transforms/Vectorize/./VectorizeTests/VPRecipeTest.CastVPInstructionToVPUser (70232 of 70496)
PASS: LLVM-Unit :: Transforms/Vectorize/./VectorizeTests/VPRecipeTest.CastVPInterleaveRecipeToVPUser (70233 of 70496)
PASS: LLVM-Unit :: Transforms/Vectorize/./VectorizeTests/VPRecipeTest.CastVPReductionRecipeToVPUser (70234 of 70496)
PASS: LLVM-Unit :: Transforms/Vectorize/./VectorizeTests/VPRecipeTest.CastVPReplicateRecipeToVPUser (70235 of 70496)
PASS: LLVM-Unit :: Transforms/Vectorize/./VectorizeTests/VPRecipeTest.CastVPWidenCallRecipeToVPUserAndVPDef (70236 of 70496)
PASS: LLVM-Unit :: Transforms/Vectorize/./VectorizeTests/VPRecipeTest.CastVPWidenGEPRecipeToVPUserAndVPDef (70237 of 70496)
PASS: LLVM-Unit :: Transforms/Vectorize/./VectorizeTests/VPRecipeTest.CastVPWidenMemoryInstructionRecipeToVPUserAndVPDef (70238 of 70496)
PASS: LLVM-Unit :: Transforms/Vectorize/./VectorizeTests/VPRecipeTest.CastVPWidenRecipeToVPUser (70239 of 70496)
PASS: LLVM-Unit :: Transforms/Vectorize/./VectorizeTests/VPRecipeTest.CastVPWidenSelectRecipeToVPUserAndVPDef (70240 of 70496)
PASS: LLVM-Unit :: Transforms/Vectorize/./VectorizeTests/VPlanDominatorTreeTest.BasicVPBBDomination (70241 of 70496)
PASS: LLVM-Unit :: Transforms/Vectorize/./VectorizeTests/VPlanHCFGTest.testBuildHCFGInnerLoop (70242 of 70496)
PASS: LLVM-Unit :: Transforms/Vectorize/./VectorizeTests/VPlanLoopInfo.BasicLoopInfoTest (70243 of 70496)
PASS: LLVM-Unit :: Transforms/Vectorize/./VectorizeTests/VPlanHCFGTest.testVPInstructionToVPRecipesInner (70244 of 70496)
PASS: LLVM-Unit :: Transforms/Vectorize/./VectorizeTests/VPlanPredicatorTest.PredicatorNegOrTest (70245 of 70496)
PASS: LLVM-Unit :: Transforms/Vectorize/./VectorizeTests/VPlanPredicatorTest.BasicPredicatorTest (70246 of 70496)
PASS: LLVM-Unit :: Transforms/Vectorize/./VectorizeTests/VPlanSlpTest.testInstrsInDifferentBBs (70247 of 70496)
PASS: LLVM-Unit :: Transforms/Vectorize/./VectorizeTests/VPlanSlpTest.testSlpAtomicLoad (70248 of 70496)
PASS: LLVM-Unit :: Transforms/Vectorize/./VectorizeTests/VPlanSlpTest.testInstrsInDifferentBBs2 (70249 of 70496)
PASS: LLVM-Unit :: Transforms/Vectorize/./VectorizeTests/VPlanSlpTest.testSlpAtomicStore (70250 of 70496)
PASS: LLVM-Unit :: Transforms/Vectorize/./VectorizeTests/VPlanSlpTest.testSlpReorder_1 (70251 of 70496)
PASS: LLVM-Unit :: Transforms/Vectorize/./VectorizeTests/VPlanSlpTest.testSlpReorder_2 (70252 of 70496)
PASS: LLVM-Unit :: Transforms/Vectorize/./VectorizeTests/VPlanSlpTest.testSlpReorder_3 (70253 of 70496)
PASS: LLVM-Unit :: Transforms/Vectorize/./VectorizeTests/VPlanSlpTest.testSlpReuse_1 (70254 of 70496)
PASS: LLVM-Unit :: Transforms/Vectorize/./VectorizeTests/VPlanSlpTest.testSlpReorder_4 (70255 of 70496)
PASS: LLVM-Unit :: Transforms/Vectorize/./VectorizeTests/VPlanSlpTest.testSlpSimple_3 (70256 of 70496)
PASS: LLVM-Unit :: XRay/./XRayTests/FDRBlockVerifierTest.IgnoreRecordsAfterEOB (70257 of 70496)
PASS: LLVM-Unit :: Transforms/Vectorize/./VectorizeTests/VPlanSlpTest.testSlpReuse_2 (70258 of 70496)
PASS: LLVM-Unit :: XRay/./XRayTests/FDRBlockIndexerTest.IndexBlocksV3 (70259 of 70496)
PASS: LLVM-Unit :: Transforms/Vectorize/./VectorizeTests/VPlanSlpTest.testSlpSimple_2 (70260 of 70496)
PASS: LLVM-Unit :: XRay/./XRayTests/FDRBlockVerifierTest.MalformedV2 (70261 of 70496)
PASS: LLVM-Unit :: XRay/./XRayTests/FDRBlockVerifierTest.MissingBufferExtents (70262 of 70496)
PASS: LLVM-Unit :: XRay/./XRayTests/FDRBlockVerifierTest.ValidBlocksV3 (70263 of 70496)
PASS: LLVM-Unit :: XRay/./XRayTests/FDRBlockVerifierTest.MissingPIDRecord (70264 of 70496)
PASS: LLVM-Unit :: XRay/./XRayTests/FDRRecordPrinterTest.WriteFunctionRecordEnter (70265 of 70496)
PASS: LLVM-Unit :: XRay/./XRayTests/FDRRecordPrinterTest.WriteFunctionRecordEnterArg (70266 of 70496)
PASS: LLVM-Unit :: XRay/./XRayTests/FDRRecordPrinterTest.WriteFunctionRecordExit (70267 of 70496)
PASS: LLVM-Unit :: XRay/./XRayTests/FDRRecordPrinterTest.WriteFunctionRecordTailExit (70268 of 70496)
PASS: LLVM-Unit :: XRay/./XRayTests/FDRTraceWriterTest.WriteToStringBufferVersion1 (70269 of 70496)
PASS: LLVM-Unit :: XRay/./XRayTests/GraphTest.TestConstruction (70270 of 70496)
PASS: LLVM-Unit :: XRay/./XRayTests/FDRTraceWriterTest.WriteToStringBufferVersion2 (70271 of 70496)
PASS: LLVM-Unit :: XRay/./XRayTests/GraphTest.TestEdgeAccessOperator (70272 of 70496)
PASS: LLVM-Unit :: XRay/./XRayTests/FDRTraceWriterTest.WriteToStringBufferVersion3 (70273 of 70496)
PASS: LLVM-Unit :: XRay/./XRayTests/GraphTest.TestiVertexAccessOperator (70274 of 70496)
PASS: LLVM-Unit :: XRay/./XRayTests/GraphTest/0.TestCopyAssign (70275 of 70496)
PASS: LLVM-Unit :: XRay/./XRayTests/GraphTest/0.TestCopyConstructor (70276 of 70496)
PASS: LLVM-Unit :: XRay/./XRayTests/GraphTest/0.TestGraphEdge (70277 of 70496)
PASS: LLVM-Unit :: XRay/./XRayTests/GraphTest/0.TestGraphVertex (70278 of 70496)
PASS: LLVM-Unit :: XRay/./XRayTests/GraphTest/0.TestMoveConstructor (70279 of 70496)
PASS: LLVM-Unit :: Support/./SupportTests/ProgramEnvTest.TestExecuteAndWaitTimeout (70280 of 70496)
PASS: LLVM-Unit :: XRay/./XRayTests/GraphTest/1.TestCopyAssign (70281 of 70496)
PASS: LLVM-Unit :: XRay/./XRayTests/GraphTest/1.TestCopyConstructor (70282 of 70496)
PASS: LLVM-Unit :: XRay/./XRayTests/GraphTest/1.TestGraphEdge (70283 of 70496)
PASS: LLVM-Unit :: XRay/./XRayTests/GraphTest/1.TestGraphVertex (70284 of 70496)
PASS: LLVM-Unit :: XRay/./XRayTests/ProfileTest.AddBlocks (70285 of 70496)
PASS: LLVM-Unit :: XRay/./XRayTests/GraphTest/1.TestMoveConstructor (70286 of 70496)
PASS: LLVM-Unit :: XRay/./XRayTests/ProfileTest.CopyProfile (70287 of 70496)
PASS: LLVM-Unit :: XRay/./XRayTests/ProfileTest.CreateProfile (70288 of 70496)
PASS: LLVM-Unit :: XRay/./XRayTests/ProfileTest.ExpandPath (70289 of 70496)
PASS: LLVM-Unit :: XRay/./XRayTests/ProfileTest.InternPath (70290 of 70496)
PASS: LLVM-Unit :: XRay/./XRayTests/ProfileTest.MergeProfilesByStack (70291 of 70496)
PASS: LLVM-Unit :: XRay/./XRayTests/ProfileTest.MergeProfilesByStackAccumulate (70292 of 70496)
PASS: LLVM-Unit :: XRay/./XRayTests/ProfileTest.MergeProfilesByThreadAccumulate (70293 of 70496)
PASS: LLVM-Unit :: XRay/./XRayTests/ProfileTest.MergeProfilesByThread (70294 of 70496)
PASS: LLVM-Unit :: XRay/./XRayTests/ProfileTest.MoveProfile (70295 of 70496)
PASS: LLVM-Unit :: XRay/./XRayTests/Records/PrinterTest/0.PrintsRecord (70296 of 70496)
PASS: LLVM-Unit :: XRay/./XRayTests/Records/PrinterTest/1.PrintsRecord (70297 of 70496)
PASS: LLVM-Unit :: XRay/./XRayTests/Records/PrinterTest/2.PrintsRecord (70298 of 70496)
PASS: LLVM-Unit :: XRay/./XRayTests/Records/PrinterTest/3.PrintsRecord (70299 of 70496)
PASS: LLVM-Unit :: XRay/./XRayTests/Records/PrinterTest/5.PrintsRecord (70300 of 70496)
PASS: LLVM-Unit :: XRay/./XRayTests/Records/PrinterTest/4.PrintsRecord (70301 of 70496)
PASS: LLVM-Unit :: XRay/./XRayTests/Records/PrinterTest/6.PrintsRecord (70302 of 70496)
PASS: LLVM-Unit :: XRay/./XRayTests/Records/PrinterTest/7.PrintsRecord (70303 of 70496)
PASS: LLVM-Unit :: XRay/./XRayTests/Records/PrinterTest/8.PrintsRecord (70304 of 70496)
PASS: LLVM-Unit :: XRay/./XRayTests/Records/PrinterTest/9.PrintsRecord (70305 of 70496)
PASS: LLVM-Unit :: XRay/./XRayTests/Records/RoundTripTest/0.RoundTripsSingleValue (70306 of 70496)
PASS: LLVM-Unit :: XRay/./XRayTests/Records/RoundTripTest/2.RoundTripsSingleValue (70307 of 70496)
PASS: LLVM-Unit :: XRay/./XRayTests/Records/RoundTripTest/1.RoundTripsSingleValue (70308 of 70496)
PASS: LLVM-Unit :: XRay/./XRayTests/Records/RoundTripTest/4.RoundTripsSingleValue (70309 of 70496)
PASS: LLVM-Unit :: XRay/./XRayTests/Records/RoundTripTest/3.RoundTripsSingleValue (70310 of 70496)
PASS: LLVM-Unit :: XRay/./XRayTests/Records/RoundTripTest/5.RoundTripsSingleValue (70311 of 70496)
PASS: LLVM-Unit :: XRay/./XRayTests/Records/RoundTripTest/6.RoundTripsSingleValue (70312 of 70496)
PASS: LLVM-Unit :: XRay/./XRayTests/Records/RoundTripTest/7.RoundTripsSingleValue (70313 of 70496)
PASS: LLVM-Unit :: XRay/./XRayTests/Records/RoundTripTestV5/0.RoundTripsSingleValue (70314 of 70496)
PASS: LLVM-Unit :: XRay/./XRayTests/Records/RoundTripTestV5/2.RoundTripsSingleValue (70315 of 70496)
PASS: LLVM-Unit :: XRay/./XRayTests/Records/RoundTripTestV5/1.RoundTripsSingleValue (70316 of 70496)
PASS: LLVM-Unit :: XRay/./XRayTests/Records/RoundTripTestV5/6.RoundTripsSingleValue (70317 of 70496)
PASS: LLVM-Unit :: XRay/./XRayTests/Records/RoundTripTestV5/3.RoundTripsSingleValue (70318 of 70496)
PASS: LLVM-Unit :: XRay/./XRayTests/Records/RoundTripTestV5/4.RoundTripsSingleValue (70319 of 70496)
PASS: LLVM-Unit :: XRay/./XRayTests/Records/RoundTripTestV5/5.RoundTripsSingleValue (70320 of 70496)
PASS: LLVM-Unit :: XRay/./XRayTests/Records/RoundTripTestV5/7.RoundTripsSingleValue (70321 of 70496)
PASS: LLVM-Unit :: XRay/./XRayTests/Records/RoundTripTestV5/8.RoundTripsSingleValue (70322 of 70496)
PASS: LLVM-Unit :: XRay/./XRayTests/XRayFDRTest.BuilderAndBlockVerifier (70323 of 70496)
PASS: LLVM-Unit :: XRay/./XRayTests/XRayFDRTest.BuilderAndBlockIndexer (70324 of 70496)
PASS: LLVM-Unit :: XRay/./XRayTests/XRayFDRTest.IndexAndVerifyBlocks (70325 of 70496)
PASS: LLVM-Unit :: tools/llvm-cfi-verify/./CFIVerifyTests/BasicAArch64FileAnalysisTest.AArch64BasicUnprotected (70326 of 70496)
PASS: LLVM-Unit :: tools/llvm-cfi-verify/./CFIVerifyTests/BasicAArch64FileAnalysisTest.AArch64BasicProtected (70327 of 70496)
PASS: LLVM-Unit :: tools/llvm-cfi-verify/./CFIVerifyTests/BasicAArch64FileAnalysisTest.AArch64ClobberBasic (70328 of 70496)
PASS: LLVM-Unit :: tools/llvm-cfi-verify/./CFIVerifyTests/BasicAArch64FileAnalysisTest.AArch64ClobberLoadAddBad (70329 of 70496)
PASS: LLVM-Unit :: tools/llvm-cfi-verify/./CFIVerifyTests/BasicAArch64FileAnalysisTest.AArch64ClobberLoadAddBad2 (70330 of 70496)
PASS: LLVM-Unit :: tools/llvm-cfi-verify/./CFIVerifyTests/BasicAArch64FileAnalysisTest.AArch64ClobberLoadAddGood (70331 of 70496)
PASS: LLVM-Unit :: tools/llvm-cfi-verify/./CFIVerifyTests/BasicAArch64FileAnalysisTest.AArch64ClobberOneLoad (70332 of 70496)
PASS: LLVM-Unit :: tools/llvm-cfi-verify/./CFIVerifyTests/BasicAArch64FileAnalysisTest.AArch64ClobberTwoLoads (70333 of 70496)
PASS: LLVM-Unit :: tools/llvm-cfi-verify/./CFIVerifyTests/BasicAArch64FileAnalysisTest.AArch64ClobberUnrelatedSecondLoad (70334 of 70496)
PASS: LLVM-Unit :: tools/llvm-cfi-verify/./CFIVerifyTests/BasicAArch64FileAnalysisTest.AArch64ClobberUnrelatedLoads (70335 of 70496)
PASS: LLVM-Unit :: tools/llvm-cfi-verify/./CFIVerifyTests/BasicAArch64FileAnalysisTest.AArch64GoodAndBadPaths (70336 of 70496)
PASS: LLVM-Unit :: tools/llvm-cfi-verify/./CFIVerifyTests/BasicAArch64FileAnalysisTest.AArch64TwoPaths (70337 of 70496)
PASS: LLVM-Unit :: tools/llvm-cfi-verify/./CFIVerifyTests/BasicAArch64FileAnalysisTest.AArch64TwoPathsBadLoad1 (70338 of 70496)
PASS: LLVM-Unit :: tools/llvm-cfi-verify/./CFIVerifyTests/BasicAArch64FileAnalysisTest.AArch64TwoPathsBadLoad2 (70339 of 70496)
PASS: LLVM-Unit :: tools/llvm-cfi-verify/./CFIVerifyTests/BasicGraphBuilderTest.BuildFlowGraphFailures (70340 of 70496)
PASS: LLVM-Unit :: tools/llvm-cfi-verify/./CFIVerifyTests/BasicGraphBuilderTest.BuildFlowGraphConditionalInfiniteLoop (70341 of 70496)
PASS: LLVM-Unit :: tools/llvm-cfi-verify/./CFIVerifyTests/BasicGraphBuilderTest.BuildFlowGraphComplexExample (70342 of 70496)
PASS: LLVM-Unit :: tools/llvm-cfi-verify/./CFIVerifyTests/BasicGraphBuilderTest.BuildFlowGraphLengthExceededDownwards (70343 of 70496)
PASS: LLVM-Unit :: tools/llvm-cfi-verify/./CFIVerifyTests/BasicGraphBuilderTest.BuildFlowGraphLengthExceededUpwards (70344 of 70496)
PASS: LLVM-Unit :: tools/llvm-cfi-verify/./CFIVerifyTests/BasicGraphBuilderTest.BuildFlowGraphTestDualPathDualUd2 (70345 of 70496)
PASS: LLVM-Unit :: tools/llvm-cfi-verify/./CFIVerifyTests/BasicGraphBuilderTest.BuildFlowGraphNoXrefs (70346 of 70496)
PASS: LLVM-Unit :: tools/llvm-cfi-verify/./CFIVerifyTests/BasicGraphBuilderTest.BuildFlowGraphNoFlowsToIndirection (70347 of 70496)
PASS: LLVM-Unit :: tools/llvm-cfi-verify/./CFIVerifyTests/BasicGraphBuilderTest.BuildFlowGraphTestDualPathSingleUd2 (70348 of 70496)
PASS: LLVM-Unit :: tools/llvm-cfi-verify/./CFIVerifyTests/BasicGraphBuilderTest.BuildFlowGraphUnconditionalInfiniteLoop (70349 of 70496)
PASS: LLVM-Unit :: tools/llvm-cfi-verify/./CFIVerifyTests/BasicGraphBuilderTest.BuildFlowGraphTestSinglePathFallthroughUd2 (70350 of 70496)
PASS: LLVM-Unit :: tools/llvm-cfi-verify/./CFIVerifyTests/BasicGraphBuilderTest.BuildFlowGraphTestSinglePathJumpUd2 (70351 of 70496)
PASS: LLVM-Unit :: tools/llvm-cfi-verify/./CFIVerifyTests/BasicX86FileAnalysisTest.BasicDisassemblyTraversalTest (70352 of 70496)
PASS: LLVM-Unit :: tools/llvm-cfi-verify/./CFIVerifyTests/BasicGraphBuilderTest.BuildFlowGraphWithRepeatedWork (70353 of 70496)
PASS: LLVM-Unit :: tools/llvm-cfi-verify/./CFIVerifyTests/BasicX86FileAnalysisTest.CFIProtectionBasicFallthroughToUd2 (70354 of 70496)
PASS: LLVM-Unit :: tools/llvm-cfi-verify/./CFIVerifyTests/BasicX86FileAnalysisTest.CFIProtectionClobberDualPathImplicit (70355 of 70496)
PASS: LLVM-Unit :: tools/llvm-cfi-verify/./CFIVerifyTests/BasicX86FileAnalysisTest.CFIProtectionClobberSinglePathExplicit (70356 of 70496)
PASS: LLVM-Unit :: tools/llvm-cfi-verify/./CFIVerifyTests/BasicX86FileAnalysisTest.CFIProtectionBasicJumpToUd2 (70357 of 70496)
PASS: LLVM-Unit :: tools/llvm-cfi-verify/./CFIVerifyTests/BasicX86FileAnalysisTest.CFIProtectionComplexExample (70358 of 70496)
PASS: LLVM-Unit :: tools/llvm-cfi-verify/./CFIVerifyTests/BasicX86FileAnalysisTest.CFIProtectionClobberSinglePathImplicit (70359 of 70496)
PASS: LLVM-Unit :: tools/llvm-cfi-verify/./CFIVerifyTests/BasicX86FileAnalysisTest.CFIProtectionDualFailLimitUpwards (70360 of 70496)
PASS: LLVM-Unit :: tools/llvm-cfi-verify/./CFIVerifyTests/BasicX86FileAnalysisTest.CFIProtectionClobberSinglePathExplicit2 (70361 of 70496)
PASS: LLVM-Unit :: tools/llvm-cfi-verify/./CFIVerifyTests/BasicX86FileAnalysisTest.CFIProtectionDualFailLimitDownwards (70362 of 70496)
PASS: LLVM-Unit :: tools/llvm-cfi-verify/./CFIVerifyTests/BasicX86FileAnalysisTest.CFIProtectionDualPathSingleUd2 (70363 of 70496)
PASS: LLVM-Unit :: tools/llvm-cfi-verify/./CFIVerifyTests/BasicX86FileAnalysisTest.CFIProtectionDualPathUd2 (70364 of 70496)
PASS: LLVM-Unit :: tools/llvm-cfi-verify/./CFIVerifyTests/BasicX86FileAnalysisTest.CFIProtectionWithUnconditionalJumpInFallthrough (70365 of 70496)
PASS: LLVM-Unit :: tools/llvm-cfi-verify/./CFIVerifyTests/BasicX86FileAnalysisTest.CFIProtectionInvalidTargets (70366 of 70496)
PASS: LLVM-Unit :: tools/llvm-cfi-verify/./CFIVerifyTests/BasicX86FileAnalysisTest.CFIProtectionGoodAndBadPaths (70367 of 70496)
PASS: LLVM-Unit :: tools/llvm-cfi-verify/./CFIVerifyTests/BasicX86FileAnalysisTest.CFITrapTest (70368 of 70496)
PASS: LLVM-Unit :: tools/llvm-cfi-verify/./CFIVerifyTests/BasicX86FileAnalysisTest.ControlFlowXRefsTest (70369 of 70496)
PASS: LLVM-Unit :: tools/llvm-exegesis/./LLVMExegesisTests/ClusteringTest.Ordering1 (70370 of 70496)
PASS: LLVM-Unit :: tools/llvm-exegesis/./LLVMExegesisTests/ClusteringTest.Clusters3D (70371 of 70496)
PASS: LLVM-Unit :: tools/llvm-cfi-verify/./CFIVerifyTests/BasicX86FileAnalysisTest.DefiniteNextInstructionTest (70372 of 70496)
PASS: LLVM-Unit :: tools/llvm-exegesis/./LLVMExegesisTests/ClusteringTest.Clusters3D_InvalidOrder (70373 of 70496)
PASS: LLVM-Unit :: tools/llvm-cfi-verify/./CFIVerifyTests/BasicX86FileAnalysisTest.PrevAndNextFromBadInst (70374 of 70496)
PASS: LLVM-Unit :: tools/llvm-exegesis/./LLVMExegesisTests/ClusteringTest.Clusters3D_InvalidSize (70375 of 70496)
PASS: LLVM-Unit :: tools/llvm-exegesis/./LLVMExegesisTests/ClusteringTest.Ordering (70376 of 70496)
PASS: LLVM-Unit :: tools/llvm-cfi-verify/./CFIVerifyTests/BasicX86FileAnalysisTest.UndefSearchLengthOneTest (70377 of 70496)
PASS: LLVM-Unit :: tools/llvm-cfi-verify/./CFIVerifyTests/BasicX86FileAnalysisTest.FallThroughTest (70378 of 70496)
PASS: LLVM-Unit :: tools/llvm-exegesis/./LLVMExegesisTests/ClusteringTest.Ordering2 (70379 of 70496)
PASS: LLVM-Unit :: tools/llvm-cfi-verify/./CFIVerifyTests/BasicX86FileAnalysisTest.UndefSearchLengthOneTestFarAway (70380 of 70496)
PASS: LLVM-Unit :: tools/llvm-exegesis/./LLVMExegesisTests/CombinationGenerator.LeftColumn (70381 of 70496)
PASS: LLVM-Unit :: tools/llvm-exegesis/./LLVMExegesisTests/CombinationGenerator.Column (70382 of 70496)
PASS: LLVM-Unit :: tools/llvm-exegesis/./LLVMExegesisTests/CombinationGenerator.MiddleColumn (70383 of 70496)
PASS: LLVM-Unit :: tools/llvm-exegesis/./LLVMExegesisTests/CombinationGenerator.Row (70384 of 70496)
PASS: LLVM-Unit :: tools/llvm-exegesis/./LLVMExegesisTests/RegisterValueTest.Single (70385 of 70496)
PASS: LLVM-Unit :: tools/llvm-exegesis/./LLVMExegesisTests/CombinationGenerator.RightColumn (70386 of 70496)
PASS: LLVM-Unit :: tools/llvm-exegesis/./LLVMExegesisTests/CombinationGenerator.Square (70387 of 70496)
PASS: LLVM-Unit :: tools/llvm-exegesis/./LLVMExegesisTests/CombinationGenerator.SideColumns (70388 of 70496)
PASS: LLVM-Unit :: tools/llvm-exegesis/./LLVMExegesisTests/CombinationGenerator.Singleton (70389 of 70496)
PASS: LLVM-Unit :: tools/llvm-exegesis/./LLVMExegesisTests/PerfHelperTest.FunctionalTest (70390 of 70496)
PASS: LLVM-Unit :: tools/llvm-exegesis/./LLVMExegesisTests/RegisterValueTest.Half (70391 of 70496)
PASS: LLVM-Unit :: tools/llvm-exegesis/./LLVMExegesisTests/ScratchSpaceTest.Works (70392 of 70496)
PASS: LLVM-Unit :: tools/llvm-exegesis/./LLVMExegesisTests/RegisterValueTest.Double (70393 of 70496)
PASS: LLVM-Unit :: tools/llvm-exegesis/AArch64/./LLVMExegesisAArch64Tests/AArch64TargetTest.SetRegToConstant (70394 of 70496)
PASS: LLVM-Unit :: tools/llvm-exegesis/AArch64/./LLVMExegesisAArch64Tests/AArch64TargetTest.DefaultPfmCounters (70395 of 70496)
PASS: LLVM-Unit :: tools/llvm-exegesis/X86/./LLVMExegesisX86Tests/BenchmarkResultTest.PerInstructionStats (70396 of 70496)
PASS: LLVM-Unit :: tools/llvm-exegesis/X86/./LLVMExegesisX86Tests/Core2Avx512TargetTest.SetRegToVR128Value_Use_VMOVDQU32Z128rm (70397 of 70496)
PASS: LLVM-Unit :: tools/llvm-exegesis/X86/./LLVMExegesisX86Tests/Core2Avx512TargetTest.FillMemoryOperands_VGATHERDPSZ128rm (70398 of 70496)
PASS: LLVM-Unit :: tools/llvm-exegesis/X86/./LLVMExegesisX86Tests/Core2Avx512TargetTest.FillMemoryOperands_ADD64rm (70399 of 70496)
PASS: LLVM-Unit :: tools/llvm-exegesis/X86/./LLVMExegesisX86Tests/Core2Avx512TargetTest.SetRegToVR256Value_Use_VMOVDQU32Z256rm (70400 of 70496)
PASS: LLVM-Unit :: tools/llvm-exegesis/X86/./LLVMExegesisX86Tests/Core2AvxTargetTest.SetRegToVR128Value_Use_VMOVDQUrm (70401 of 70496)
PASS: LLVM-Unit :: tools/llvm-exegesis/X86/./LLVMExegesisX86Tests/Core2AvxTargetTest.SetRegToVR256Value_Use_VMOVDQUYrm (70402 of 70496)
PASS: LLVM-Unit :: tools/llvm-exegesis/X86/./LLVMExegesisX86Tests/Core2Avx512TargetTest.SetRegToVR512Value (70403 of 70496)
PASS: LLVM-Unit :: tools/llvm-exegesis/X86/./LLVMExegesisX86Tests/Core2TargetTest.NoHighByteRegs (70404 of 70496)
PASS: LLVM-Unit :: tools/llvm-exegesis/X86/./LLVMExegesisX86Tests/Core2TargetTest.SetFlags (70405 of 70496)
PASS: LLVM-Unit :: tools/llvm-exegesis/X86/./LLVMExegesisX86Tests/Core2TargetTest.AllowAsBackToBack (70406 of 70496)
PASS: LLVM-Unit :: tools/llvm-exegesis/X86/./LLVMExegesisX86Tests/Core2TargetTest.SetRegToFP1_4Bits (70407 of 70496)
PASS: LLVM-Unit :: tools/llvm-exegesis/X86/./LLVMExegesisX86Tests/Core2TargetTest.SetRegToFP0_80Bits (70408 of 70496)
PASS: LLVM-Unit :: tools/llvm-exegesis/X86/./LLVMExegesisX86Tests/Core2TargetTest.SetRegToGR64Value (70409 of 70496)
PASS: LLVM-Unit :: tools/llvm-exegesis/X86/./LLVMExegesisX86Tests/Core2TargetTest.SetRegToGR32Value (70410 of 70496)
PASS: LLVM-Unit :: tools/llvm-exegesis/X86/./LLVMExegesisX86Tests/Core2TargetTest.SetRegToGR16Value (70411 of 70496)
PASS: LLVM-Unit :: tools/llvm-exegesis/X86/./LLVMExegesisX86Tests/Core2TargetTest.SetRegToFP1_32Bits (70412 of 70496)
PASS: LLVM-Unit :: tools/llvm-exegesis/X86/./LLVMExegesisX86Tests/Core2TargetTest.SetRegToST0_32Bits (70413 of 70496)
PASS: LLVM-Unit :: tools/llvm-exegesis/X86/./LLVMExegesisX86Tests/Core2TargetTest.SetRegToGR8Value (70414 of 70496)
PASS: LLVM-Unit :: tools/llvm-exegesis/X86/./LLVMExegesisX86Tests/Core2TargetTest.SetRegToST0_64Bits (70415 of 70496)
PASS: LLVM-Unit :: tools/llvm-exegesis/X86/./LLVMExegesisX86Tests/Core2TargetTest.SetRegToST1_32Bits (70416 of 70496)
PASS: LLVM-Unit :: tools/llvm-exegesis/X86/./LLVMExegesisX86Tests/FakeSnippetGeneratorTest.ComputeRegisterInitialValuesAdd64rr (70417 of 70496)
PASS: LLVM-Unit :: tools/llvm-exegesis/X86/./LLVMExegesisX86Tests/Core2TargetTest.SetRegToST0_80Bits (70418 of 70496)
PASS: LLVM-Unit :: tools/llvm-exegesis/X86/./LLVMExegesisX86Tests/Core2TargetTest.SetRegToVR64Value (70419 of 70496)
PASS: LLVM-Unit :: tools/llvm-exegesis/X86/./LLVMExegesisX86Tests/Core2TargetTest.SetRegToVR128Value_Use_MOVDQUrm (70420 of 70496)
PASS: LLVM-Unit :: tools/llvm-exegesis/X86/./LLVMExegesisX86Tests/FakeSnippetGeneratorTest.ComputeRegisterInitialValuesAdd16ri (70421 of 70496)
PASS: LLVM-Unit :: tools/llvm-exegesis/X86/./LLVMExegesisX86Tests/FakeSnippetGeneratorTest.MemoryUse_Movsb (70422 of 70496)
PASS: LLVM-Unit :: tools/llvm-exegesis/X86/./LLVMExegesisX86Tests/BenchmarkResultTest.WriteToAndReadFromDisk (70423 of 70496)
PASS: LLVM-Unit :: tools/llvm-exegesis/X86/./LLVMExegesisX86Tests/ParallelSnippetGeneratorTest.MOV16ms (70424 of 70496)
PASS: LLVM-Unit :: tools/llvm-exegesis/X86/./LLVMExegesisX86Tests/ParallelSnippetGeneratorTest.MemoryUse (70425 of 70496)
PASS: LLVM-Unit :: tools/llvm-exegesis/X86/./LLVMExegesisX86Tests/ParallelSnippetGeneratorTest.ParallelInstruction (70426 of 70496)
PASS: LLVM-Unit :: tools/llvm-exegesis/X86/./LLVMExegesisX86Tests/ParallelSnippetGeneratorTest.NoTiedVariables (70427 of 70496)
PASS: LLVM-Unit :: tools/llvm-exegesis/X86/./LLVMExegesisX86Tests/RegisterAliasingTest.TrackRegisterClass (70428 of 70496)
PASS: LLVM-Unit :: tools/llvm-exegesis/X86/./LLVMExegesisX86Tests/RegisterAliasingTest.TrackSimpleRegister (70429 of 70496)
PASS: LLVM-Unit :: tools/llvm-exegesis/X86/./LLVMExegesisX86Tests/ParallelSnippetGeneratorTest.SerialInstruction (70430 of 70496)
PASS: LLVM-Unit :: tools/llvm-exegesis/X86/./LLVMExegesisX86Tests/RegisterAliasingTest.TrackRegisterClassCache (70431 of 70496)
PASS: LLVM-Unit :: tools/llvm-exegesis/X86/./LLVMExegesisX86Tests/SchedClassResolutionTest.ComputeIdealizedProcResPressure_1P1_1P05_2P0156 (70432 of 70496)
PASS: LLVM-Unit :: tools/llvm-exegesis/X86/./LLVMExegesisX86Tests/ParallelSnippetGeneratorTest.StaticRenaming (70433 of 70496)
PASS: LLVM-Unit :: tools/llvm-exegesis/X86/./LLVMExegesisX86Tests/SchedClassResolutionTest.ComputeIdealizedProcResPressure_2P0 (70434 of 70496)
PASS: LLVM-Unit :: tools/llvm-exegesis/X86/./LLVMExegesisX86Tests/SchedClassResolutionTest.ComputeIdealizedProcResPressure_2P05 (70435 of 70496)
PASS: LLVM-Unit :: tools/llvm-exegesis/X86/./LLVMExegesisX86Tests/SchedClassResolutionTest.ComputeIdealizedProcResPressure_2P05_2P0156 (70436 of 70496)
PASS: LLVM-Unit :: tools/llvm-exegesis/X86/./LLVMExegesisX86Tests/SerialSnippetGeneratorTest.ImplicitSelfDependencyThroughImplicitReg (70437 of 70496)
PASS: LLVM-Unit :: tools/llvm-exegesis/X86/./LLVMExegesisX86Tests/SerialSnippetGeneratorTest.ImplicitSelfDependencyThroughTiedRegs (70438 of 70496)
PASS: LLVM-Unit :: tools/llvm-exegesis/X86/./LLVMExegesisX86Tests/SerialSnippetGeneratorTest.ImplicitSelfDependencyThroughExplicitRegs (70439 of 70496)
PASS: LLVM-Unit :: tools/llvm-exegesis/X86/./LLVMExegesisX86Tests/X86SnippetFileTest.BadDefregParam (70440 of 70496)
PASS: LLVM-Unit :: tools/llvm-exegesis/X86/./LLVMExegesisX86Tests/SerialSnippetGeneratorTest.VCVTUSI642SDZrrb_Int (70441 of 70496)
PASS: LLVM-Unit :: tools/llvm-exegesis/X86/./LLVMExegesisX86Tests/X86SnippetFileTest.Works (70442 of 70496)
PASS: LLVM-Unit :: tools/llvm-exegesis/X86/./LLVMExegesisX86Tests/X86SnippetFileTest.MissingParam (70443 of 70496)
PASS: LLVM-Unit :: tools/llvm-exegesis/X86/./LLVMExegesisX86Tests/X86SnippetRepetitorTest.Duplicate (70444 of 70496)
PASS: LLVM-Unit :: tools/llvm-exegesis/X86/./LLVMExegesisX86Tests/X86SnippetFileTest.NoAsmStreamer (70445 of 70496)
PASS: LLVM-Unit :: tools/llvm-exegesis/X86/./LLVMExegesisX86Tests/X86SnippetFileTest.NoDefregValue (70446 of 70496)
PASS: LLVM-Unit :: tools/llvm-exegesis/X86/./LLVMExegesisX86Tests/X86SnippetRepetitorTest.Loop (70447 of 70496)
PASS: LLVM-Unit :: tools/llvm-profgen/./LLVMProfgenTests/TestCompression.TestMaxDedupSize (70448 of 70496)
PASS: LLVM-Unit :: tools/llvm-exegesis/X86/./LLVMExegesisX86Tests/SerialSnippetGeneratorTest.DependencyThroughOtherOpcode (70449 of 70496)
PASS: LLVM-Unit :: tools/llvm-profgen/./LLVMProfgenTests/TestCompression.TestNoSizeLimit1 (70450 of 70496)
PASS: LLVM-Unit :: tools/llvm-profgen/./LLVMProfgenTests/TestCompression.TestNoSizeLimit2 (70451 of 70496)
PASS: LLVM-Unit :: tools/llvm-exegesis/X86/./LLVMExegesisX86Tests/SerialSnippetGeneratorTest.LAHF (70452 of 70496)
PASS: LLVM-Unit :: tools/llvm-exegesis/X86/./LLVMExegesisX86Tests/SerialSnippetGeneratorTest.ImplicitSelfDependencyThroughExplicitRegsForbidAll (70453 of 70496)
PASS: lit :: boolean-parsing.py (70454 of 70496)
PASS: lit :: parallelism-groups.py (70455 of 70496)
PASS: lit :: custom-result-category.py (70456 of 70496)
PASS: lit :: progress-bar.py (70457 of 70496)
PASS: lit :: googletest-discovery-failed.py (70458 of 70496)
PASS: lit :: shtest-encoding.py (70459 of 70496)
PASS: lit :: shell-parsing.py (70460 of 70496)
PASS: lit :: reorder.py (70461 of 70496)
PASS: lit :: googletest-upstream-format.py (70462 of 70496)
PASS: lit :: show-used-features.py (70463 of 70496)
PASS: lit :: googletest-format.py (70464 of 70496)
PASS: LLVM-Unit :: Support/./SupportTests/ProgramEnvTest.TestExecuteNoWait (70465 of 70496)
PASS: lit :: ignore-fail.py (70466 of 70496)
PASS: lit :: shtest-format-argv0.py (70467 of 70496)
PASS: lit :: shtest-keyword-parse-errors.py (70468 of 70496)
PASS: lit :: shtest-output-printing.py (70469 of 70496)
PASS: lit :: shtest-format.py (70470 of 70496)
PASS: lit :: shtest-run-at-line.py (70471 of 70496)
PASS: lit :: max-failures.py (70472 of 70496)
PASS: lit :: show-result-codes.py (70473 of 70496)
PASS: lit :: shtest-env.py (70474 of 70496)
PASS: lit :: test-data-micro.py (70475 of 70496)
PASS: lit :: shtest-inject.py (70476 of 70496)
PASS: lit :: test-data.py (70477 of 70496)
PASS: lit :: unit/ShUtil.py (70478 of 70496)
PASS: lit :: test-output-micro.py (70479 of 70496)
PASS: lit :: unit/TestRunner.py (70480 of 70496)
PASS: lit :: unparsed-requirements.py (70481 of 70496)
PASS: lit :: unittest-adaptor.py (70482 of 70496)
PASS: lit :: test-output.py (70483 of 70496)
PASS: lit :: lit-opts.py (70484 of 70496)
PASS: lit :: xunit-output.py (70485 of 70496)
PASS: lit :: usage.py (70486 of 70496)
PASS: lit :: xfail-cl.py (70487 of 70496)
PASS: lit :: allow-retries.py (70488 of 70496)
PASS: lit :: shtest-recursive-substitution.py (70489 of 70496)
PASS: lit :: googletest-timeout.py (70490 of 70496)
PASS: lit :: shtest-not.py (70491 of 70496)
PASS: lit :: discovery.py (70492 of 70496)
PASS: lit :: max-time.py (70493 of 70496)
PASS: lit :: shtest-timeout.py (70494 of 70496)
PASS: lit :: selecting.py (70495 of 70496)
PASS: lit :: shtest-shell.py (70496 of 70496)
********************
Failed Tests (1):
  Clang :: CodeGenCXX/inalloca-stmtexpr.cpp

Hide Details

Hide Details

Testing Time: 470.81s Unsupported : 12774 Passed : 57630 Expectedly Failed: 91 Failed : 1 FAILED: CMakeFiles/check-all cd /Users/buildslave/jenkins/workspace/clang-stage2-Rthinlto/clang-build/Build && /usr/local/Frameworks/Python.framework/Versions/3.7/bin/python3.7 /Users/buildslave/jenkins/workspace/clang-stage2-Rthinlto/clang-build/Build/./bin/llvm-lit --xunit-xml-output=testresults.xunit.xml -v -vv --timeout=600 --param USE_Z3_SOLVER=0 /Users/buildslave/jenkins/workspace/clang-stage2-Rthinlto/clang-build/Build/tools/clang/test /Users/buildslave/jenkins/workspace/clang-stage2-Rthinlto/clang-build/Build/utils/lit /Users/buildslave/jenkins/workspace/clang-stage2-Rthinlto/clang-build/Build/test ninja: build stopped: cannot make progress due to previous errors. Command failed: Command '['env', 'MALLOC_LOG_FILE=/dev/null', '/usr/local/bin/ninja', '-v', '-k', '0', 'check-all']' returned non-zero exit status 1 Command: ['env', 'MALLOC_LOG_FILE=/dev/null', '/usr/local/bin/ninja', '-v', '-k', '0', 'check-all'] [Pipeline] } [Pipeline] // timeout [Pipeline] } [Pipeline] // stage [Pipeline] stage [Pipeline] { (Declarative: Post Actions) [Pipeline] scanForIssues [Clang (LLVM based)] Sleeping for 5 seconds due to JENKINS-32191... [Clang (LLVM based)] Parsing console log (workspace: '/Users/buildslave/jenkins/workspace/clang-stage2-Rthinlto') [Clang (LLVM based)] Successfully parsed console log [Clang (LLVM based)] -> found 10 issues (skipped 29 duplicates) [Clang (LLVM based)] [-ERROR-] Can't create fingerprints for some files: [Clang (LLVM based)] [-ERROR-] - '/tmp/gotsan.Bjv5Ip0MHi/gotsan.cpp', IO exception has been thrown: java.nio.file.NoSuchFileException: /tmp/gotsan.Bjv5Ip0MHi/gotsan.cpp [Clang (LLVM based)] [-ERROR-] - '/tmp/gotsan.Bjv5Ip0MHi/gotsan.cpp', IO exception has been thrown: java.nio.file.NoSuchFileException: /tmp/gotsan.Bjv5Ip0MHi/gotsan.cpp [Clang (LLVM based)] [-ERROR-] - '/tmp/gotsan.Bjv5Ip0MHi/gotsan.cpp', IO exception has been thrown: java.nio.file.NoSuchFileException: /tmp/gotsan.Bjv5Ip0MHi/gotsan.cpp [Clang (LLVM based)] [-ERROR-] - '/tmp/gotsan.Bjv5Ip0MHi/gotsan.cpp', IO exception has been thrown: java.nio.file.NoSuchFileException: /tmp/gotsan.Bjv5Ip0MHi/gotsan.cpp [Clang (LLVM based)] [-ERROR-] - '/tmp/gotsan.Bjv5Ip0MHi/gotsan.cpp', IO exception has been thrown: java.nio.file.NoSuchFileException: /tmp/gotsan.Bjv5Ip0MHi/gotsan.cpp [Clang (LLVM based)] [-ERROR-] - '/tmp/gotsan.Bjv5Ip0MHi/gotsan.cpp', IO exception has been thrown: java.nio.file.NoSuchFileException: /tmp/gotsan.Bjv5Ip0MHi/gotsan.cpp [Clang (LLVM based)] [-ERROR-] - '/tmp/gotsan.Bjv5Ip0MHi/gotsan.cpp', IO exception has been thrown: java.nio.file.NoSuchFileException: /tmp/gotsan.Bjv5Ip0MHi/gotsan.cpp [Clang (LLVM based)] [-ERROR-] - '/tmp/gotsan.Bjv5Ip0MHi/gotsan.cpp', IO exception has been thrown: java.nio.file.NoSuchFileException: /tmp/gotsan.Bjv5Ip0MHi/gotsan.cpp [Clang (LLVM based)] [-ERROR-] - '/Users/buildslave/jenkins/workspace/clang-stage2-Rthinlto/clang-build/Build/tools/clang/runtime/compiler-rt-bins/llvm-lit: /Users/buildslave/jenkins/workspace/clang-stage2-Rthinlto/llvm-project/compiler-rt/test/lit.common.cfg.py', IO exception has been thrown: java.nio.file.NoSuchFileException: /Users/buildslave/jenkins/workspace/clang-stage2-Rthinlto/clang-build/Build/tools/clang/runtime/compiler-rt-bins/llvm-lit: /Users/buildslave/jenkins/workspace/clang-stage2-Rthinlto/llvm-project/compiler-rt/test/lit.common.cfg.py [Clang (LLVM based)] Post processing issues on 'green-dragon-22' with source code encoding 'UTF-8' [Clang (LLVM based)] Creating SCM blamer to obtain author and commit information for affected files [Clang (LLVM based)] -> No blamer installed yet. You need to install the 'git-forensics' plugin to enable blaming for Git. [Clang (LLVM based)] Resolving file names for all issues in source directory '/Users/buildslave/jenkins/workspace/clang-stage2-Rthinlto' [Clang (LLVM based)] -> resolved paths in source directory (1 found, 2 not found) [Clang (LLVM based)] Resolving module names from module definitions (build.xml, pom.xml, or Manifest.mf files) [Clang (LLVM based)] -> resolved module names for 10 issues [Clang (LLVM based)] Resolving package names (or namespaces) by parsing the affected files [Clang (LLVM based)] -> resolved package names of 3 affected files [Clang (LLVM based)] No filter has been set, publishing all 10 issues [Clang (LLVM based)] Creating fingerprints for all affected code blocks to track issues over different builds [Clang (LLVM based)] -> created fingerprints for 1 issues (skipped 9 issues) [Clang (LLVM based)] Copying affected files to Jenkins' build folder '/Users/Shared/Jenkins/Home/jobs/clang-stage2-Rthinlto/builds/3826/files-with-issues' [Clang (LLVM based)] -> 1 copied, 0 not in workspace, 9 not-found, 0 with I/O error [Clang (LLVM based)] Repository miner is not configured, skipping repository mining [Pipeline] emailext Warning: zakk.chen@sifive.com is not a recognized user, but sending mail anyway Warning: Matthew.Arsenault@amd.com is not a recognized user, but sending mail anyway Warning: bjoern@hazardy.de is not a recognized user, but sending mail anyway Warning: steveire@gmail.com is not a recognized user, but sending mail anyway Warning: flo@fhahn.com is not a recognized user, but sending mail anyway Warning: aaron@aaronballman.com is not a recognized user, but sending mail anyway Warning: nikita.ppv@gmail.com is not a recognized user, but sending mail anyway Warning: zakk.chen@sifive.com is not a recognized user, but sending mail anyway Warning: Matthew.Arsenault@amd.com is not a recognized user, but sending mail anyway Warning: bjoern@hazardy.de is not a recognized user, but sending mail anyway Warning: steveire@gmail.com is not a recognized user, but sending mail anyway Warning: flo@fhahn.com is not a recognized user, but sending mail anyway Warning: aaron@aaronballman.com is not a recognized user, but sending mail anyway Warning: nikita.ppv@gmail.com is not a recognized user, but sending mail anyway

Hide Details

Begin Pre-Send Script... Sending email to: zakk.chen@sifive.com Matthew.Arsenault@amd.com stefan.graenitz@gmail.com bjoern@hazardy.de steveire@gmail.com flo@fhahn.com aaron@aaronballman.com nikita.ppv@gmail.com Alex Lorenz <aleksei_lorenz@apple.com> Azhar Mohammed <azhar@apple.com>
[Pipeline] } [Pipeline] // stage [Pipeline] } [Pipeline] // withEnv [Pipeline] } [Pipeline] // node [Pipeline] End of Pipeline ERROR: script returned exit code 1 Finished: FAILURE