SuccessConsole Output

Skipping 23,663 KB.. Full Log
0000000050 0x000f0000 object_getClass
    [ 1120]   1120   X Code            0x000000000000fe38                    0x0000000000000068 0x000f0000 object_getClassName
    [ 1121]   1121   X Code            0x0000000000009844                    0x0000000000000065 0x000f0000 object_getIndexedIvars
    [ 1122]   1122   X Code            0x0000000000014230                    0x000000000000006d 0x000f0000 object_getInstanceVariable
    [ 1123]   1123   X Code            0x0000000000012e98                    0x000000000000006c 0x000f0000 object_getIvar
    [ 1124]   1124   X Code            0x000000000000bc6c                    0x000000000000007f 0x000f0000 object_getMethodImplementation
    [ 1125]   1125   X Code            0x0000000000013dd1                    0x0000000000000056 0x000f0000 object_getMethodImplementation_stret
    [ 1126]   1126   X Code            0x0000000000013da3                    0x000000000000002e 0x000f0000 object_isClass
    [ 1127]   1127   X Code            0x0000000000008b72                    0x0000000000000182 0x000f0000 object_setClass
    [ 1128]   1128   X Code            0x000000000000da7e                    0x00000000000000bc 0x000f0000 object_setInstanceVariable
    [ 1129]   1129   X Code            0x0000000000014177                    0x00000000000000b9 0x000f0000 object_setInstanceVariableWithStrongDefault
    [ 1130]   1130   X Code            0x000000000000dc50                    0x0000000000000094 0x000f0000 object_setIvar
    [ 1131]   1131   X Code            0x00000000000140dc                    0x000000000000009b 0x000f0000 object_setIvarWithStrongDefault
    [ 1132]   1132   X Code            0x000000000000f687                    0x0000000000000156 0x000f0000 property_copyAttributeList
    [ 1133]   1133   X Code            0x000000000001b571                    0x00000000000000cd 0x000f0000 property_copyAttributeValue
    [ 1134]   1134   X Code            0x000000000000ff22                    0x0000000000000011 0x000f0000 property_getAttributes
    [ 1135]   1135   X Code            0x000000000000f67e                    0x0000000000000009 0x000f0000 property_getName
    [ 1136]   1136   X Code            0x000000000001bdad                    0x0000000000000155 0x000f0000 protocol_addMethodDescription
    [ 1137]   1137   X Code            0x000000000001bfdf                    0x0000000000000137 0x000f0000 protocol_addProperty
    [ 1138]   1138   X Code            0x000000000001bc7c                    0x0000000000000131 0x000f0000 protocol_addProtocol
    [ 1139]   1139   X Code            0x0000000000010ae8                    0x0000000000000095 0x000f0000 protocol_conformsToProtocol
    [ 1140]   1140   X Code            0x000000000000c198                    0x000000000000016c 0x000f0000 protocol_copyMethodDescriptionList
    [ 1141]   1141   X Code            0x000000000001b8f5                    0x0000000000000011 0x000f0000 protocol_copyPropertyList
    [ 1142]   1142   X Code            0x000000000001b7f8                    0x00000000000000fd 0x000f0000 protocol_copyPropertyList2
    [ 1143]   1143   X Code            0x000000000000c034                    0x0000000000000164 0x000f0000 protocol_copyProtocolList
    [ 1144]   1144   X Code            0x000000000000c738                    0x0000000000000053 0x000f0000 protocol_getMethodDescription
    [ 1145]   1145   X Code            0x000000000000c647                    0x0000000000000019 0x000f0000 protocol_getName
    [ 1146]   1146   X Code            0x000000000001b63e                    0x00000000000000c8 0x000f0000 protocol_getProperty
    [ 1147]   1147   X Code            0x0000000000010a9b                    0x000000000000004d 0x000f0000 protocol_isEqual
    [ 1148]   1148   X Code            0x000000000000be1c                    0x0000000000000016 0x000f0000 sel_getName
    [ 1149]   1149   X Code            0x0000000000010fbb                    0x0000000000000017 0x000f0000 sel_getUid
    [ 1150]   1150   X Code            0x0000000000010c8a                    0x0000000000000017 0x000f0000 sel_isEqual
    [ 1151]   1151   X Code            0x0000000000020f8b                    0x00000000000000e6 0x000f0000 sel_isMapped
    [ 1152]   1152   X Code            0x000000000000957c                    0x000000000000001d 0x000f0000 sel_registerName
    [ 1153]   1153     Trampoline      0x0000000000024c3a                    0x0000000000000006 0x00010300 _Block_copy
    [ 1154]   1154     Trampoline      0x0000000000024c40                    0x0000000000000006 0x00010300 _Block_has_signature
    [ 1155]   1155     Trampoline      0x0000000000024c46                    0x0000000000000006 0x00010300 _Block_release
    [ 1156]   1156     Trampoline      0x0000000000024c4c                    0x0000000000000006 0x00010300 _Block_use_stret
    [ 1157]   1157   X Undefined       0x0000000000000000                    0x0000000000000000 0x00010300 _DefaultRuneLocale
    [ 1158]   1158     Trampoline      0x0000000000024c52                    0x0000000000000006 0x00010300 _Exit
    [ 1159]   1159   X Undefined       0x0000000000000000                    0x0000000000000000 0x00010300 _NSConcreteStackBlock
    [ 1160]   1160     Trampoline      0x0000000000024c58                    0x0000000000000006 0x00010300 _NSGetEnviron
    [ 1161]   1161     Trampoline      0x0000000000024c5e                    0x0000000000000006 0x00010300 _Unwind_GetCFA
    [ 1162]   1162     Trampoline      0x0000000000024c64                    0x0000000000000006 0x00010300 _Unwind_GetIP
    [ 1163]   1163     Trampoline      0x0000000000024c6a                    0x0000000000000006 0x00010300 _Unwind_Resume
    [ 1164]   1164     Trampoline      0x0000000000024c70                    0x0000000000000006 0x00010100 std::set_terminate(void (*)())
    [ 1165]   1165     Trampoline      0x0000000000024c76                    0x0000000000000006 0x00010100 std::terminate()
    [ 1166]   1166   X Undefined       0x0000000000000000                    0x0000000000000000 0x00010340 ___chkstk_darwin
    [ 1167]   1167     Trampoline      0x0000000000024c7c                    0x0000000000000006 0x00010300 __bzero
    [ 1168]   1168     Trampoline      0x0000000000024c82                    0x0000000000000006 0x00010100 __cxa_allocate_exception
    [ 1169]   1169     Trampoline      0x0000000000024c88                    0x0000000000000006 0x00010100 __cxa_begin_catch
    [ 1170]   1170     Trampoline      0x0000000000024c8e                    0x0000000000000006 0x00010100 __cxa_current_exception_type
    [ 1171]   1171     Trampoline      0x0000000000024c94                    0x0000000000000006 0x00010100 __cxa_end_catch
    [ 1172]   1172     Trampoline      0x0000000000024c9a                    0x0000000000000006 0x00010100 __cxa_rethrow
    [ 1173]   1173     Trampoline      0x0000000000024ca0                    0x0000000000000006 0x00010100 __cxa_throw
    [ 1174]   1174     Trampoline      0x0000000000024ca6                    0x0000000000000006 0x00010300 __error
    [ 1175]   1175     Trampoline      0x0000000000024cac                    0x0000000000000006 0x00010100 __gxx_personality_v0
    [ 1176]   1176   X Undefined       0x0000000000000000                    0x0000000000000000 0x00010300 __progname
    [ 1177]   1177     Trampoline      0x0000000000024cb2                    0x0000000000000006 0x00010300 __stack_chk_fail
    [ 1178]   1178   X Undefined       0x0000000000000000                    0x0000000000000000 0x00010300 __stack_chk_guard
    [ 1179]   1179   X Undefined       0x0000000000000000                    0x0000000000000000 0x00010300 __stderrp
    [ 1180]   1180     Trampoline      0x0000000000024cb8                    0x0000000000000006 0x00010300 _dyld_for_each_objc_class
    [ 1181]   1181     Trampoline      0x0000000000024cbe                    0x0000000000000006 0x00010300 _dyld_for_each_objc_protocol
    [ 1182]   1182     Trampoline      0x0000000000024cc4                    0x0000000000000006 0x00010300 _dyld_get_objc_selector
    [ 1183]   1183     Trampoline      0x0000000000024cca                    0x0000000000000006 0x00010300 _dyld_get_shared_cache_range
    [ 1184]   1184     Trampoline      0x0000000000024cd0                    0x0000000000000006 0x00010300 _dyld_is_memory_immutable
    [ 1185]   1185     Trampoline      0x0000000000024cd6                    0x0000000000000006 0x00010300 _dyld_objc_notify_register
    [ 1186]   1186     Trampoline      0x0000000000024cdc                    0x0000000000000006 0x00010300 _simple_asl_log
    [ 1187]   1187     Trampoline      0x0000000000024ce2                    0x0000000000000006 0x00010300 abort
    [ 1188]   1188     Trampoline      0x0000000000024ce8                    0x0000000000000006 0x00010300 abort_with_reason
    [ 1189]   1189     Trampoline      0x0000000000024cee                    0x0000000000000006 0x00010300 arc4random_buf
    [ 1190]   1190     Trampoline      0x0000000000024cf4                    0x0000000000000006 0x00010300 asprintf
    [ 1191]   1191     Trampoline      0x0000000000024cfa                    0x0000000000000006 0x00010300 backtrace
    [ 1192]   1192     Trampoline      0x0000000000024d00                    0x0000000000000006 0x00010300 backtrace_symbols
    [ 1193]   1193     Trampoline      0x0000000000024d06                    0x0000000000000006 0x00010300 backtrace_symbols_fd
    [ 1194]   1194     Trampoline      0x0000000000024d0c                    0x0000000000000006 0x00010300 bcopy
    [ 1195]   1195     Trampoline      0x0000000000024d12                    0x0000000000000006 0x00010300 calloc
    [ 1196]   1196     Trampoline      0x0000000000024d18                    0x0000000000000006 0x00010300 clock_gettime_nsec_np
    [ 1197]   1197     Trampoline      0x0000000000024d1e                    0x0000000000000006 0x00010300 close
    [ 1198]   1198     Trampoline      0x0000000000024d24                    0x0000000000000006 0x00010300 dispatch_queue_get_label
    [ 1199]   1199     Trampoline      0x0000000000024d2a                    0x0000000000000006 0x00010300 dladdr
    [ 1200]   1200     Trampoline      0x0000000000024d30                    0x0000000000000006 0x00010300 dlerror
    [ 1201]   1201     Trampoline      0x0000000000024d36                    0x0000000000000006 0x00010300 dlopen
    [ 1202]   1202     Trampoline      0x0000000000024d3c                    0x0000000000000006 0x00010300 dlsym
    [ 1203]   1203     Trampoline      0x0000000000024d42                    0x0000000000000006 0x00010300 dyld_get_program_sdk_version
    [ 1204]   1204     Trampoline      0x0000000000024d48                    0x0000000000000006 0x00010300 dyld_image_header_containing_address
    [ 1205]   1205     Trampoline      0x0000000000024d4e                    0x0000000000000006 0x00010300 dyld_image_path_containing_address
    [ 1206]   1206     Trampoline      0x0000000000024d54                    0x0000000000000006 0x00010300 dyld_shared_cache_some_image_overridden
    [ 1207]   1207     Trampoline      0x0000000000024d5a                    0x0000000000000006 0x00010300 fileno
    [ 1208]   1208     Trampoline      0x0000000000024d60                    0x0000000000000006 0x00010300 fls
    [ 1209]   1209     Trampoline      0x0000000000024d66                    0x0000000000000006 0x00010300 free
    [ 1210]   1210     Trampoline      0x0000000000024d6c                    0x0000000000000006 0x00010300 fstat$INODE64
    [ 1211]   1211     Trampoline      0x0000000000024d72                    0x0000000000000006 0x00010300 fsync
    [ 1212]   1212     Trampoline      0x0000000000024d78                    0x0000000000000006 0x00010300 getenv
    [ 1213]   1213     Trampoline      0x0000000000024d7e                    0x0000000000000006 0x00010300 geteuid
    [ 1214]   1214     Trampoline      0x0000000000024d84                    0x0000000000000006 0x00010300 getpid
    [ 1215]   1215     Trampoline      0x0000000000024d8a                    0x0000000000000006 0x00010300 getsectiondata
    [ 1216]   1216     Trampoline      0x0000000000024d90                    0x0000000000000006 0x00010300 getsegmentdata
    [ 1217]   1217     Trampoline      0x0000000000024d96                    0x0000000000000006 0x00010300 issetugid
    [ 1218]   1218     Trampoline      0x0000000000024d9c                    0x0000000000000006 0x00010300 lstat$INODE64
    [ 1219]   1219     Trampoline      0x0000000000024da2                    0x0000000000000006 0x00010300 mach_error_string
    [ 1220]   1220     Trampoline      0x0000000000024da8                    0x0000000000000006 0x00010300 mach_port_deallocate
    [ 1221]   1221   X Undefined       0x0000000000000000                    0x0000000000000000 0x00010300 mach_task_self_
    [ 1222]   1222     Trampoline      0x0000000000024dae                    0x0000000000000006 0x00010300 malloc
    [ 1223]   1223     Trampoline      0x0000000000024db4                    0x0000000000000006 0x00010300 malloc_default_zone
    [ 1224]   1224     Trampoline      0x0000000000024dba                    0x0000000000000006 0x00010300 malloc_size
    [ 1225]   1225     Trampoline      0x0000000000024dc0                    0x0000000000000006 0x00010300 malloc_zone_batch_malloc
    [ 1226]   1226     Trampoline      0x0000000000024dc6                    0x0000000000000006 0x00010300 malloc_zone_calloc
    [ 1227]   1227     Trampoline      0x0000000000024dcc                    0x0000000000000006 0x00010300 malloc_zone_from_ptr
    [ 1228]   1228     Trampoline      0x0000000000024dd2                    0x0000000000000006 0x00010300 malloc_zone_malloc
    [ 1229]   1229     Trampoline      0x0000000000024dd8                    0x0000000000000006 0x00010300 malloc_zone_memalign
    [ 1230]   1230     Trampoline      0x0000000000024dde                    0x0000000000000006 0x00010300 memcmp
    [ 1231]   1231     Trampoline      0x0000000000024de4                    0x0000000000000006 0x00010300 memcpy
    [ 1232]   1232     Trampoline      0x0000000000024dea                    0x0000000000000006 0x00010300 memmove
    [ 1233]   1233     Trampoline      0x0000000000024df0                    0x0000000000000006 0x00010300 memset_pattern16
    [ 1234]   1234     Trampoline      0x0000000000024dfc                    0x0000000000000006 0x00010300 open
    [ 1235]   1235     Trampoline      0x0000000000024e02                    0x0000000000000006 0x00010300 os_unfair_lock_lock_with_options
    [ 1236]   1236     Trampoline      0x0000000000024e08                    0x0000000000000006 0x00010300 os_unfair_lock_unlock
    [ 1237]   1237     Trampoline      0x0000000000024e0e                    0x0000000000000006 0x00010300 os_unfair_recursive_lock_lock_with_options
    [ 1238]   1238     Trampoline      0x0000000000024e14                    0x0000000000000006 0x00010300 os_unfair_recursive_lock_trylock
    [ 1239]   1239     Trampoline      0x0000000000024e1a                    0x0000000000000006 0x00010300 os_unfair_recursive_lock_tryunlock4objc
    [ 1240]   1240     Trampoline      0x0000000000024e20                    0x0000000000000006 0x00010300 os_unfair_recursive_lock_unlock
    [ 1241]   1241     Trampoline      0x0000000000024e26                    0x0000000000000006 0x00010300 posix_memalign
    [ 1242]   1242     Trampoline      0x0000000000024e2c                    0x0000000000000006 0x00010300 pread
    [ 1243]   1243     Trampoline      0x0000000000024e32                    0x0000000000000006 0x00010300 pthread_cond_broadcast
    [ 1244]   1244     Trampoline      0x0000000000024e38                    0x0000000000000006 0x00010300 pthread_cond_wait
    [ 1245]   1245     Trampoline      0x0000000000024e3e                    0x0000000000000006 0x00010300 pthread_getname_np
    [ 1246]   1246     Trampoline      0x0000000000024e44                    0x0000000000000006 0x00010300 pthread_getspecific
    [ 1247]   1247     Trampoline      0x0000000000024e4a                    0x0000000000000006 0x00010300 pthread_is_threaded_np
    [ 1248]   1248     Trampoline      0x0000000000024e50                    0x0000000000000006 0x00010300 pthread_key_init_np
    [ 1249]   1249     Trampoline      0x0000000000024e56                    0x0000000000000006 0x00010300 pthread_mach_thread_np
    [ 1250]   1250     Trampoline      0x0000000000024e5c                    0x0000000000000006 0x00010300 pthread_mutex_lock
    [ 1251]   1251     Trampoline      0x0000000000024e62                    0x0000000000000006 0x00010300 pthread_mutex_unlock
    [ 1252]   1252     Trampoline      0x0000000000024e68                    0x0000000000000006 0x00010300 pthread_setspecific
    [ 1253]   1253     Trampoline      0x0000000000024e6e                    0x0000000000000006 0x00010300 realloc
    [ 1254]   1254     Trampoline      0x0000000000024e74                    0x0000000000000006 0x00010300 reallocf
    [ 1255]   1255     Trampoline      0x0000000000024e7a                    0x0000000000000006 0x00010300 snprintf
    [ 1256]   1256     Trampoline      0x0000000000024e80                    0x0000000000000006 0x00010300 sprintf
    [ 1257]   1257     Trampoline      0x0000000000024e86                    0x0000000000000006 0x00010300 strcat
    [ 1258]   1258     Trampoline      0x0000000000024e8c                    0x0000000000000006 0x00010300 strchr
    [ 1259]   1259     Trampoline      0x0000000000024e92                    0x0000000000000006 0x00010300 strcmp
    [ 1260]   1260     Trampoline      0x0000000000024e98                    0x0000000000000006 0x00010300 strcspn
    [ 1261]   1261     Trampoline      0x0000000000024e9e                    0x0000000000000006 0x00010300 strdup
    [ 1262]   1262     Trampoline      0x0000000000024ea4                    0x0000000000000006 0x00010300 strlcpy
    [ 1263]   1263     Trampoline      0x0000000000024eaa                    0x0000000000000006 0x00010300 strlen
    [ 1264]   1264     Trampoline      0x0000000000024eb0                    0x0000000000000006 0x00010300 strncmp
    [ 1265]   1265     Trampoline      0x0000000000024eb6                    0x0000000000000006 0x00010300 strncpy
    [ 1266]   1266     Trampoline      0x0000000000024ebc                    0x0000000000000006 0x00010300 strstr
    [ 1267]   1267     Trampoline      0x0000000000024ec2                    0x0000000000000006 0x00010300 task_restartable_ranges_register
    [ 1268]   1268     Trampoline      0x0000000000024ec8                    0x0000000000000006 0x00010300 task_restartable_ranges_synchronize
    [ 1269]   1269     Trampoline      0x0000000000024ece                    0x0000000000000006 0x00010300 task_threads
    [ 1270]   1270     Trampoline      0x0000000000024ed4                    0x0000000000000006 0x00010300 thread_get_state
    [ 1271]   1271     Trampoline      0x0000000000024eda                    0x0000000000000006 0x00010300 unw_get_proc_info
    [ 1272]   1272     Trampoline      0x0000000000024ee0                    0x0000000000000006 0x00010300 unw_get_reg
    [ 1273]   1273     Trampoline      0x0000000000024ee6                    0x0000000000000006 0x00010300 unw_getcontext
    [ 1274]   1274     Trampoline      0x0000000000024eec                    0x0000000000000006 0x00010300 unw_init_local
    [ 1275]   1275     Trampoline      0x0000000000024ef2                    0x0000000000000006 0x00010300 unw_step
    [ 1276]   1276     Trampoline      0x0000000000024ef8                    0x0000000000000006 0x00010300 vasprintf
    [ 1277]   1277     Trampoline      0x0000000000024efe                    0x0000000000000006 0x00010300 vm_allocate
    [ 1278]   1278     Trampoline      0x0000000000024f04                    0x0000000000000006 0x00010300 vm_deallocate
    [ 1279]   1279     Trampoline      0x0000000000024f0a                    0x0000000000000006 0x00010300 vm_remap
    [ 1280]   1280     Trampoline      0x0000000000024f10                    0x0000000000000006 0x00010300 write
    [ 1281]   1281   X Undefined       0x0000000000000000                    0x0000000000000000 0x00010300 dyld_stub_binder
    [ 1282]   1282  S  Trampoline      0x0000000000024df6                    0x0000000000000006 0x00000000 objc_release
0x7f81d60a2600:   BreakpointList with 0 Breakpoints:
0x7f81d60a2660:   BreakpointList with 0 Breakpoints:

warning: (x86_64) /Users/buildslave/jenkins/workspace/lldb-cmake-matrix/lldb-build/lldb-test-build.noindex/python_api/target/TestTargetAPI.test_get_platform_dsym/b.out empty dSYM file detected, dSYM was created with an executable with no debug info.
warning: (x86_64) /Users/buildslave/jenkins/workspace/lldb-cmake-matrix/lldb-build/lldb-test-build.noindex/python_api/target/TestTargetAPI.test_launch_new_process_and_redirect_stdout/a.out empty dSYM file detected, dSYM was created with an executable with no debug info.
warning: (x86_64) /Users/buildslave/jenkins/workspace/lldb-cmake-matrix/lldb-build/lldb-test-build.noindex/python_api/target/TestTargetAPI.test_read_memory_dsym/b.out empty dSYM file detected, dSYM was created with an executable with no debug info.
warning: (x86_64) /Users/buildslave/jenkins/workspace/lldb-cmake-matrix/lldb-build/lldb-test-build.noindex/python_api/target/TestTargetAPI.test_resolve_file_address_dsym/b.out empty dSYM file detected, dSYM was created with an executable with no debug info.
warning: (x86_64) /Users/buildslave/jenkins/workspace/lldb-cmake-matrix/lldb-build/lldb-test-build.noindex/python_api/target/TestTargetAPI.test_resolve_symbol_context_with_address_dsym/a.out empty dSYM file detected, dSYM was created with an executable with no debug info.

Expecting sub string: a.out
Matched

Expecting sub string: Target
Matched

Expecting sub string: Module
Matched

Expecting sub string: Breakpoint
Matched

PASS: LLDB (/Users/buildslave/jenkins/workspace/lldb-cmake-matrix/lldb-build/bin/clang-11-x86_64) :: test_get_description_dwarf (TestTargetAPI.TargetAPITestCase)
UNSUPPORTED: LLDB (/Users/buildslave/jenkins/workspace/lldb-cmake-matrix/lldb-build/bin/clang-11-x86_64) :: test_get_description_dwo (TestTargetAPI.TargetAPITestCase) (test case does not fall in any category of interest for this run) 
UNSUPPORTED: LLDB (/Users/buildslave/jenkins/workspace/lldb-cmake-matrix/lldb-build/bin/clang-11-x86_64) :: test_get_description_gmodules (TestTargetAPI.TargetAPITestCase) (test case does not fall in any category of interest for this run) 
runCmd: settings clear -all
output: 

runCmd: settings set symbols.enable-external-lookup false
output: 

runCmd: settings set target.auto-apply-fixits false
output: 

runCmd: settings set plugin.process.gdb-remote.packet-timeout 60
output: 

runCmd: settings set symbols.clang-modules-cache-path "/Users/buildslave/jenkins/workspace/lldb-cmake-matrix/lldb-build/lldb-test-build.noindex/module-cache-lldb/lldb-api"
output: 

runCmd: settings set use-color false
output: 

runCmd: setting set target.prefer-dynamic-value no-dynamic-values
output: 

PASS: LLDB (/Users/buildslave/jenkins/workspace/lldb-cmake-matrix/lldb-build/bin/clang-11-x86_64) :: test_get_platform_dsym (TestTargetAPI.TargetAPITestCase)
runCmd: settings clear -all
output: 

runCmd: settings set symbols.enable-external-lookup false
output: 

runCmd: settings set target.auto-apply-fixits false
output: 

runCmd: settings set plugin.process.gdb-remote.packet-timeout 60
output: 

runCmd: settings set symbols.clang-modules-cache-path "/Users/buildslave/jenkins/workspace/lldb-cmake-matrix/lldb-build/lldb-test-build.noindex/module-cache-lldb/lldb-api"
output: 

runCmd: settings set use-color false
output: 

runCmd: setting set target.prefer-dynamic-value no-dynamic-values
output: 

PASS: LLDB (/Users/buildslave/jenkins/workspace/lldb-cmake-matrix/lldb-build/bin/clang-11-x86_64) :: test_get_platform_dwarf (TestTargetAPI.TargetAPITestCase)
UNSUPPORTED: LLDB (/Users/buildslave/jenkins/workspace/lldb-cmake-matrix/lldb-build/bin/clang-11-x86_64) :: test_get_platform_dwo (TestTargetAPI.TargetAPITestCase) (test case does not fall in any category of interest for this run) 
UNSUPPORTED: LLDB (/Users/buildslave/jenkins/workspace/lldb-cmake-matrix/lldb-build/bin/clang-11-x86_64) :: test_get_platform_gmodules (TestTargetAPI.TargetAPITestCase) (test case does not fall in any category of interest for this run) 
runCmd: settings clear -all
output: 

runCmd: settings set symbols.enable-external-lookup false
output: 

runCmd: settings set target.auto-apply-fixits false
output: 

runCmd: settings set plugin.process.gdb-remote.packet-timeout 60
output: 

runCmd: settings set symbols.clang-modules-cache-path "/Users/buildslave/jenkins/workspace/lldb-cmake-matrix/lldb-build/lldb-test-build.noindex/module-cache-lldb/lldb-api"
output: 

runCmd: settings set use-color false
output: 

runCmd: setting set target.prefer-dynamic-value no-dynamic-values
output: 

looking at: a(1) returns 4
b(2) returns 5
a(3) returns 6


Expecting sub string: a(1)
Matched

Expecting sub string: b(2)
Matched

Expecting sub string: a(3)
Matched

<bound method SBProcess.Kill of <lldb.SBProcess; proxy of <Swig Object of type 'lldb::SBProcess *' at 0x10f4cd0f0> >>: success

PASS: LLDB (/Users/buildslave/jenkins/workspace/lldb-cmake-matrix/lldb-build/bin/clang-11-x86_64) :: test_launch_new_process_and_redirect_stdout (TestTargetAPI.TargetAPITestCase)
runCmd: settings clear -all
output: 

runCmd: settings set symbols.enable-external-lookup false
output: 

runCmd: settings set target.auto-apply-fixits false
output: 

runCmd: settings set plugin.process.gdb-remote.packet-timeout 60
output: 

runCmd: settings set symbols.clang-modules-cache-path "/Users/buildslave/jenkins/workspace/lldb-cmake-matrix/lldb-build/lldb-test-build.noindex/module-cache-lldb/lldb-api"
output: 

runCmd: settings set use-color false
output: 

runCmd: setting set target.prefer-dynamic-value no-dynamic-values
output: 

<bound method SBProcess.Kill of <lldb.SBProcess; proxy of <Swig Object of type 'lldb::SBProcess *' at 0x10a990c90> >>: success

PASS: LLDB (/Users/buildslave/jenkins/workspace/lldb-cmake-matrix/lldb-build/bin/clang-11-x86_64) :: test_read_memory_dsym (TestTargetAPI.TargetAPITestCase)
runCmd: settings clear -all
output: 

runCmd: settings set symbols.enable-external-lookup false
output: 

runCmd: settings set target.auto-apply-fixits false
output: 

runCmd: settings set plugin.process.gdb-remote.packet-timeout 60
output: 

runCmd: settings set symbols.clang-modules-cache-path "/Users/buildslave/jenkins/workspace/lldb-cmake-matrix/lldb-build/lldb-test-build.noindex/module-cache-lldb/lldb-api"
output: 

runCmd: settings set use-color false
output: 

runCmd: setting set target.prefer-dynamic-value no-dynamic-values
output: 

<bound method SBProcess.Kill of <lldb.SBProcess; proxy of <Swig Object of type 'lldb::SBProcess *' at 0x10f4cd690> >>: success

PASS: LLDB (/Users/buildslave/jenkins/workspace/lldb-cmake-matrix/lldb-build/bin/clang-11-x86_64) :: test_read_memory_dwarf (TestTargetAPI.TargetAPITestCase)
UNSUPPORTED: LLDB (/Users/buildslave/jenkins/workspace/lldb-cmake-matrix/lldb-build/bin/clang-11-x86_64) :: test_read_memory_dwo (TestTargetAPI.TargetAPITestCase) (test case does not fall in any category of interest for this run) 
UNSUPPORTED: LLDB (/Users/buildslave/jenkins/workspace/lldb-cmake-matrix/lldb-build/bin/clang-11-x86_64) :: test_read_memory_gmodules (TestTargetAPI.TargetAPITestCase) (test case does not fall in any category of interest for this run) 
runCmd: settings clear -all
output: 

runCmd: settings set symbols.enable-external-lookup false
output: 

runCmd: settings set target.auto-apply-fixits false
output: 

runCmd: settings set plugin.process.gdb-remote.packet-timeout 60
output: 

runCmd: settings set symbols.clang-modules-cache-path "/Users/buildslave/jenkins/workspace/lldb-cmake-matrix/lldb-build/lldb-test-build.noindex/module-cache-lldb/lldb-api"
output: 

runCmd: settings set use-color false
output: 

runCmd: setting set target.prefer-dynamic-value no-dynamic-values
output: 

PASS: LLDB (/Users/buildslave/jenkins/workspace/lldb-cmake-matrix/lldb-build/bin/clang-11-x86_64) :: test_resolve_file_address_dsym (TestTargetAPI.TargetAPITestCase)
runCmd: settings clear -all
output: 

runCmd: settings set symbols.enable-external-lookup false
output: 

runCmd: settings set target.auto-apply-fixits false
output: 

runCmd: settings set plugin.process.gdb-remote.packet-timeout 60
output: 

runCmd: settings set symbols.clang-modules-cache-path "/Users/buildslave/jenkins/workspace/lldb-cmake-matrix/lldb-build/lldb-test-build.noindex/module-cache-lldb/lldb-api"
output: 

runCmd: settings set use-color false
output: 

runCmd: setting set target.prefer-dynamic-value no-dynamic-values
output: 

PASS: LLDB (/Users/buildslave/jenkins/workspace/lldb-cmake-matrix/lldb-build/bin/clang-11-x86_64) :: test_resolve_file_address_dwarf (TestTargetAPI.TargetAPITestCase)
UNSUPPORTED: LLDB (/Users/buildslave/jenkins/workspace/lldb-cmake-matrix/lldb-build/bin/clang-11-x86_64) :: test_resolve_file_address_dwo (TestTargetAPI.TargetAPITestCase) (test case does not fall in any category of interest for this run) 
UNSUPPORTED: LLDB (/Users/buildslave/jenkins/workspace/lldb-cmake-matrix/lldb-build/bin/clang-11-x86_64) :: test_resolve_file_address_gmodules (TestTargetAPI.TargetAPITestCase) (test case does not fall in any category of interest for this run) 
runCmd: settings clear -all
output: 

runCmd: settings set symbols.enable-external-lookup false
output: 

runCmd: settings set target.auto-apply-fixits false
output: 

runCmd: settings set plugin.process.gdb-remote.packet-timeout 60
output: 

runCmd: settings set symbols.clang-modules-cache-path "/Users/buildslave/jenkins/workspace/lldb-cmake-matrix/lldb-build/lldb-test-build.noindex/module-cache-lldb/lldb-api"
output: 

runCmd: settings set use-color false
output: 

runCmd: setting set target.prefer-dynamic-value no-dynamic-values
output: 

breakpoint1: SBBreakpoint: id = 1, file = 'main.c', line = 21, exact_match = 0, locations = 0

breakpoint2: SBBreakpoint: id = 2, file = 'main.c', line = 26, exact_match = 0, locations = 0

FAIL: LLDB (/Users/buildslave/jenkins/workspace/lldb-cmake-matrix/lldb-build/bin/clang-11-x86_64) :: test_resolve_symbol_context_with_address_dsym (TestTargetAPI.TargetAPITestCase)
runCmd: settings clear -all
output: 

runCmd: settings set symbols.enable-external-lookup false
output: 

runCmd: settings set target.auto-apply-fixits false
output: 

runCmd: settings set plugin.process.gdb-remote.packet-timeout 60
output: 

runCmd: settings set symbols.clang-modules-cache-path "/Users/buildslave/jenkins/workspace/lldb-cmake-matrix/lldb-build/lldb-test-build.noindex/module-cache-lldb/lldb-api"
output: 

runCmd: settings set use-color false
output: 

runCmd: setting set target.prefer-dynamic-value no-dynamic-values
output: 

breakpoint1: SBBreakpoint: id = 1, file = 'main.c', line = 21, exact_match = 0, locations = 0

breakpoint2: SBBreakpoint: id = 2, file = 'main.c', line = 26, exact_match = 0, locations = 0

FAIL: LLDB (/Users/buildslave/jenkins/workspace/lldb-cmake-matrix/lldb-build/bin/clang-11-x86_64) :: test_resolve_symbol_context_with_address_dwarf (TestTargetAPI.TargetAPITestCase)
UNSUPPORTED: LLDB (/Users/buildslave/jenkins/workspace/lldb-cmake-matrix/lldb-build/bin/clang-11-x86_64) :: test_resolve_symbol_context_with_address_dwo (TestTargetAPI.TargetAPITestCase) (test case does not fall in any category of interest for this run) 
UNSUPPORTED: LLDB (/Users/buildslave/jenkins/workspace/lldb-cmake-matrix/lldb-build/bin/clang-11-x86_64) :: test_resolve_symbol_context_with_address_gmodules (TestTargetAPI.TargetAPITestCase) (test case does not fall in any category of interest for this run) 
Restore dir to: /Users/buildslave/jenkins/workspace/lldb-cmake-matrix/lldb-build/tools/lldb/test
======================================================================
ERROR: test_find_compile_units_dsym (TestTargetAPI.TargetAPITestCase)
    Exercise SBTarget.FindCompileUnits() API.
----------------------------------------------------------------------
Traceback (most recent call last):
  File "/Users/buildslave/jenkins/workspace/lldb-cmake-matrix/llvm-project/lldb/packages/Python/lldbsuite/test/lldbtest.py", line 1774, in test_method
    return attrvalue(self)
  File "/Users/buildslave/jenkins/workspace/lldb-cmake-matrix/llvm-project/lldb/test/API/python_api/target/TestTargetAPI.py", line 52, in test_find_compile_units
    self.find_compile_units(self.getBuildArtifact('b.out'))
  File "/Users/buildslave/jenkins/workspace/lldb-cmake-matrix/llvm-project/lldb/test/API/python_api/target/TestTargetAPI.py", line 243, in find_compile_units
    list[0].GetCompileUnit().GetFileSpec().GetFilename() == source_name)
  File "/Users/buildslave/jenkins/workspace/lldb-cmake-matrix/lldb-build/lib/python3.7/site-packages/lldb/__init__.py", line 9819, in __getitem__
    raise IndexError
IndexError
Config=x86_64-/Users/buildslave/jenkins/workspace/lldb-cmake-matrix/lldb-build/bin/clang-11
======================================================================
FAIL: test_find_global_variables_dsym (TestTargetAPI.TargetAPITestCase)
    Exercise SBTarget.FindGlobalVariables() API.
----------------------------------------------------------------------
Traceback (most recent call last):
  File "/Users/buildslave/jenkins/workspace/lldb-cmake-matrix/llvm-project/lldb/packages/Python/lldbsuite/test/lldbtest.py", line 1774, in test_method
    return attrvalue(self)
  File "/Users/buildslave/jenkins/workspace/lldb-cmake-matrix/llvm-project/lldb/test/API/python_api/target/TestTargetAPI.py", line 44, in test_find_global_variables
    self.find_global_variables('b.out')
  File "/Users/buildslave/jenkins/workspace/lldb-cmake-matrix/llvm-project/lldb/test/API/python_api/target/TestTargetAPI.py", line 203, in find_global_variables
    self.assertTrue(len(thread_list) == 1)
AssertionError: False is not True
Config=x86_64-/Users/buildslave/jenkins/workspace/lldb-cmake-matrix/lldb-build/bin/clang-11
======================================================================
FAIL: test_find_global_variables_dwarf (TestTargetAPI.TargetAPITestCase)
    Exercise SBTarget.FindGlobalVariables() API.
----------------------------------------------------------------------
Traceback (most recent call last):
  File "/Users/buildslave/jenkins/workspace/lldb-cmake-matrix/llvm-project/lldb/packages/Python/lldbsuite/test/lldbtest.py", line 1774, in test_method
    return attrvalue(self)
  File "/Users/buildslave/jenkins/workspace/lldb-cmake-matrix/llvm-project/lldb/test/API/python_api/target/TestTargetAPI.py", line 44, in test_find_global_variables
    self.find_global_variables('b.out')
  File "/Users/buildslave/jenkins/workspace/lldb-cmake-matrix/llvm-project/lldb/test/API/python_api/target/TestTargetAPI.py", line 203, in find_global_variables
    self.assertTrue(len(thread_list) == 1)
AssertionError: False is not True
Config=x86_64-/Users/buildslave/jenkins/workspace/lldb-cmake-matrix/lldb-build/bin/clang-11
======================================================================
FAIL: test_resolve_symbol_context_with_address_dsym (TestTargetAPI.TargetAPITestCase)
    Exercise SBTarget.ResolveSymbolContextForAddress() API.
----------------------------------------------------------------------
Traceback (most recent call last):
  File "/Users/buildslave/jenkins/workspace/lldb-cmake-matrix/llvm-project/lldb/packages/Python/lldbsuite/test/lldbtest.py", line 1774, in test_method
    return attrvalue(self)
  File "/Users/buildslave/jenkins/workspace/lldb-cmake-matrix/llvm-project/lldb/packages/Python/lldbsuite/test/decorators.py", line 110, in wrapper
    func(*args, **kwargs)
  File "/Users/buildslave/jenkins/workspace/lldb-cmake-matrix/llvm-project/lldb/test/API/python_api/target/TestTargetAPI.py", line 74, in test_resolve_symbol_context_with_address
    self.resolve_symbol_context_with_address()
  File "/Users/buildslave/jenkins/workspace/lldb-cmake-matrix/llvm-project/lldb/test/API/python_api/target/TestTargetAPI.py", line 366, in resolve_symbol_context_with_address
    VALID_BREAKPOINT)
AssertionError: False is not True : Got a valid breakpoint
Config=x86_64-/Users/buildslave/jenkins/workspace/lldb-cmake-matrix/lldb-build/bin/clang-11
======================================================================
FAIL: test_resolve_symbol_context_with_address_dwarf (TestTargetAPI.TargetAPITestCase)
    Exercise SBTarget.ResolveSymbolContextForAddress() API.
----------------------------------------------------------------------
Traceback (most recent call last):
  File "/Users/buildslave/jenkins/workspace/lldb-cmake-matrix/llvm-project/lldb/packages/Python/lldbsuite/test/lldbtest.py", line 1774, in test_method
    return attrvalue(self)
  File "/Users/buildslave/jenkins/workspace/lldb-cmake-matrix/llvm-project/lldb/packages/Python/lldbsuite/test/decorators.py", line 110, in wrapper
    func(*args, **kwargs)
  File "/Users/buildslave/jenkins/workspace/lldb-cmake-matrix/llvm-project/lldb/test/API/python_api/target/TestTargetAPI.py", line 74, in test_resolve_symbol_context_with_address
    self.resolve_symbol_context_with_address()
  File "/Users/buildslave/jenkins/workspace/lldb-cmake-matrix/llvm-project/lldb/test/API/python_api/target/TestTargetAPI.py", line 366, in resolve_symbol_context_with_address
    VALID_BREAKPOINT)
AssertionError: False is not True : Got a valid breakpoint
Config=x86_64-/Users/buildslave/jenkins/workspace/lldb-cmake-matrix/lldb-build/bin/clang-11
----------------------------------------------------------------------
Ran 41 tests in 15.801s

RESULT: FAILED (16 passes, 4 failures, 1 errors, 20 skipped, 0 expected failures, 0 unexpected successes)

--

********************
FAIL: lldb-api :: lang/objc/hidden-ivars/TestHiddenIvars.py (2067 of 2074)
******************** TEST 'lldb-api :: lang/objc/hidden-ivars/TestHiddenIvars.py' FAILED ********************
Script:
--
/usr/local/Frameworks/Python.framework/Versions/3.7/bin/python3.7 /Users/buildslave/jenkins/workspace/lldb-cmake-matrix/llvm-project/lldb/test/API/dotest.py --arch x86_64 -s /Users/buildslave/jenkins/workspace/lldb-cmake-matrix/lldb-build/lldb-test-traces -S nm -u CXXFLAGS -u CFLAGS --codesign-identity lldb_codesign --server /Users/buildslave/jenkins/workspace/lldb-cmake-matrix/lldb-build/./bin/debugserver --arch x86_64 --build-dir /Users/buildslave/jenkins/workspace/lldb-cmake-matrix/lldb-build/lldb-test-build.noindex -s=/Users/buildslave/jenkins/workspace/lldb-cmake-matrix/test/logs -t --env TERM=vt100 --skip-category gmodules --skip-category watchpoint --arch=x86_64 --dwarf-version=5 --env LLVM_LIBS_DIR=/Users/buildslave/jenkins/workspace/lldb-cmake-matrix/lldb-build/./lib --build-dir /Users/buildslave/jenkins/workspace/lldb-cmake-matrix/lldb-build/lldb-test-build.noindex --lldb-module-cache-dir /Users/buildslave/jenkins/workspace/lldb-cmake-matrix/lldb-build/lldb-test-build.noindex/module-cache-lldb/lldb-api --clang-module-cache-dir /Users/buildslave/jenkins/workspace/lldb-cmake-matrix/lldb-build/lldb-test-build.noindex/module-cache-clang/lldb-api --executable /Users/buildslave/jenkins/workspace/lldb-cmake-matrix/lldb-build/./bin/lldb --compiler /Users/buildslave/jenkins/workspace/lldb-cmake-matrix/lldb-build/./bin/clang --dsymutil /Users/buildslave/jenkins/workspace/lldb-cmake-matrix/lldb-build/./bin/dsymutil --filecheck /Users/buildslave/jenkins/workspace/lldb-cmake-matrix/lldb-build/./bin/FileCheck --lldb-libs-dir /Users/buildslave/jenkins/workspace/lldb-cmake-matrix/lldb-build/./lib /Users/buildslave/jenkins/workspace/lldb-cmake-matrix/llvm-project/lldb/test/API/lang/objc/hidden-ivars -p TestHiddenIvars.py
--
Exit Code: 1

Command Output (stdout):
--
lldb version 11.0.99
  clang revision 03640ee0fa73c6eaf8cb12050203027239136789
  llvm revision 03640ee0fa73c6eaf8cb12050203027239136789
LLDB library dir: /Users/buildslave/jenkins/workspace/lldb-cmake-matrix/lldb-build/bin
LLDB import library dir: /Users/buildslave/jenkins/workspace/lldb-cmake-matrix/lldb-build/./lib
libstdcxx tests will not be run because: Don't know how to build with libstdcxx on macosx
Skipping following debug info categories: ['dwo']

--
Command Output (stderr):
--
warning: (x86_64) /Users/buildslave/jenkins/workspace/lldb-cmake-matrix/lldb-build/lldb-test-build.noindex/lang/objc/hidden-ivars/TestHiddenIvars.test_expr_dsym/a.out empty dSYM file detected, dSYM was created with an executable with no debug info.
warning: (x86_64) /Users/buildslave/jenkins/workspace/lldb-cmake-matrix/lldb-build/lldb-test-build.noindex/lang/objc/hidden-ivars/TestHiddenIvars.test_expr_dsym/libInternalDefiner.dylib empty dSYM file detected, dSYM was created with an executable with no debug info.
warning: (x86_64) /Users/buildslave/jenkins/workspace/lldb-cmake-matrix/lldb-build/lldb-test-build.noindex/lang/objc/hidden-ivars/TestHiddenIvars.test_expr_stripped_dsym/stripped/a.out empty dSYM file detected, dSYM was created with an executable with no debug info.
warning: (x86_64) /Users/buildslave/jenkins/workspace/lldb-cmake-matrix/lldb-build/lldb-test-build.noindex/lang/objc/hidden-ivars/TestHiddenIvars.test_expr_stripped_dsym/libInternalDefiner.dylib empty dSYM file detected, dSYM was created with an executable with no debug info.
warning: (x86_64) /Users/buildslave/jenkins/workspace/lldb-cmake-matrix/lldb-build/lldb-test-build.noindex/lang/objc/hidden-ivars/TestHiddenIvars.test_frame_variable_across_modules_dsym/a.out empty dSYM file detected, dSYM was created with an executable with no debug info.
warning: (x86_64) /Users/buildslave/jenkins/workspace/lldb-cmake-matrix/lldb-build/lldb-test-build.noindex/lang/objc/hidden-ivars/TestHiddenIvars.test_frame_variable_across_modules_dsym/libInternalDefiner.dylib empty dSYM file detected, dSYM was created with an executable with no debug info.
warning: (x86_64) /Users/buildslave/jenkins/workspace/lldb-cmake-matrix/lldb-build/lldb-test-build.noindex/lang/objc/hidden-ivars/TestHiddenIvars.test_frame_variable_dsym/a.out empty dSYM file detected, dSYM was created with an executable with no debug info.
warning: (x86_64) /Users/buildslave/jenkins/workspace/lldb-cmake-matrix/lldb-build/lldb-test-build.noindex/lang/objc/hidden-ivars/TestHiddenIvars.test_frame_variable_dsym/libInternalDefiner.dylib empty dSYM file detected, dSYM was created with an executable with no debug info.
warning: (x86_64) /Users/buildslave/jenkins/workspace/lldb-cmake-matrix/lldb-build/lldb-test-build.noindex/lang/objc/hidden-ivars/TestHiddenIvars.test_frame_variable_stripped_dsym/stripped/a.out empty dSYM file detected, dSYM was created with an executable with no debug info.
warning: (x86_64) /Users/buildslave/jenkins/workspace/lldb-cmake-matrix/lldb-build/lldb-test-build.noindex/lang/objc/hidden-ivars/TestHiddenIvars.test_frame_variable_stripped_dsym/libInternalDefiner.dylib empty dSYM file detected, dSYM was created with an executable with no debug info.

Session logs for test failures/errors/unexpected successes will go into directory '/Users/buildslave/jenkins/workspace/lldb-cmake-matrix/test/logs'
Change dir to: /Users/buildslave/jenkins/workspace/lldb-cmake-matrix/llvm-project/lldb/test/API/lang/objc/hidden-ivars
runCmd: settings clear -all
output: 

runCmd: settings set symbols.enable-external-lookup false
output: 

runCmd: settings set target.auto-apply-fixits false
output: 

runCmd: settings set plugin.process.gdb-remote.packet-timeout 60
output: 

runCmd: settings set symbols.clang-modules-cache-path "/Users/buildslave/jenkins/workspace/lldb-cmake-matrix/lldb-build/lldb-test-build.noindex/module-cache-lldb/lldb-api"
output: 

runCmd: settings set use-color false
output: 

runCmd: setting set target.prefer-dynamic-value no-dynamic-values
output: 

runCmd: file /Users/buildslave/jenkins/workspace/lldb-cmake-matrix/lldb-build/lldb-test-build.noindex/lang/objc/hidden-ivars/TestHiddenIvars.test_expr_dsym/a.out
output: Current executable set to '/Users/buildslave/jenkins/workspace/lldb-cmake-matrix/lldb-build/lldb-test-build.noindex/lang/objc/hidden-ivars/TestHiddenIvars.test_expr_dsym/a.out' (x86_64).


runCmd: breakpoint set -f "main.m" -l 49
output: Breakpoint 1: no locations (pending).
WARNING:  Unable to resolve breakpoint to any actual locations.


Expecting pattern: ^Breakpoint (?P<bpno>[0-9]+): (?P<num_locations>[0-9]+) locations\.$
Not matched

Expecting pattern: ^Breakpoint (?P<bpno>[0-9]+): (?P<num_locations>no) locations \(pending\)\.
Matched

FAIL: LLDB (/Users/buildslave/jenkins/workspace/lldb-cmake-matrix/lldb-build/bin/clang-11-x86_64) :: test_expr_dsym (TestHiddenIvars.HiddenIvarsTestCase)
<bound method SBProcess.Kill of <lldb.SBProcess; proxy of <Swig Object of type 'lldb::SBProcess *' at 0x10e0a35a0> >>: success

runCmd: settings clear -all
output: 

runCmd: settings set symbols.enable-external-lookup false
output: 

runCmd: settings set target.auto-apply-fixits false
output: 

runCmd: settings set plugin.process.gdb-remote.packet-timeout 60
output: 

runCmd: settings set symbols.clang-modules-cache-path "/Users/buildslave/jenkins/workspace/lldb-cmake-matrix/lldb-build/lldb-test-build.noindex/module-cache-lldb/lldb-api"
output: 

runCmd: settings set use-color false
output: 

runCmd: setting set target.prefer-dynamic-value no-dynamic-values
output: 

runCmd: file /Users/buildslave/jenkins/workspace/lldb-cmake-matrix/lldb-build/lldb-test-build.noindex/lang/objc/hidden-ivars/TestHiddenIvars.test_expr_dwarf/a.out
output: Current executable set to '/Users/buildslave/jenkins/workspace/lldb-cmake-matrix/lldb-build/lldb-test-build.noindex/lang/objc/hidden-ivars/TestHiddenIvars.test_expr_dwarf/a.out' (x86_64).


runCmd: breakpoint set -f "main.m" -l 49
output: Breakpoint 1: no locations (pending).
WARNING:  Unable to resolve breakpoint to any actual locations.


Expecting pattern: ^Breakpoint (?P<bpno>[0-9]+): (?P<num_locations>[0-9]+) locations\.$
Not matched

Expecting pattern: ^Breakpoint (?P<bpno>[0-9]+): (?P<num_locations>no) locations \(pending\)\.
Matched

FAIL: LLDB (/Users/buildslave/jenkins/workspace/lldb-cmake-matrix/lldb-build/bin/clang-11-x86_64) :: test_expr_dwarf (TestHiddenIvars.HiddenIvarsTestCase)
<bound method SBProcess.Kill of <lldb.SBProcess; proxy of <Swig Object of type 'lldb::SBProcess *' at 0x109559600> >>: success

UNSUPPORTED: LLDB (/Users/buildslave/jenkins/workspace/lldb-cmake-matrix/lldb-build/bin/clang-11-x86_64) :: test_expr_dwo (TestHiddenIvars.HiddenIvarsTestCase) (test case does not fall in any category of interest for this run) 
UNSUPPORTED: LLDB (/Users/buildslave/jenkins/workspace/lldb-cmake-matrix/lldb-build/bin/clang-11-x86_64) :: test_expr_gmodules (TestHiddenIvars.HiddenIvarsTestCase) (test case does not fall in any category of interest for this run) 
runCmd: settings clear -all
output: 

runCmd: settings set symbols.enable-external-lookup false
output: 

runCmd: settings set target.auto-apply-fixits false
output: 

runCmd: settings set plugin.process.gdb-remote.packet-timeout 60
output: 

runCmd: settings set symbols.clang-modules-cache-path "/Users/buildslave/jenkins/workspace/lldb-cmake-matrix/lldb-build/lldb-test-build.noindex/module-cache-lldb/lldb-api"
output: 

runCmd: settings set use-color false
output: 

runCmd: setting set target.prefer-dynamic-value no-dynamic-values
output: 

runCmd: file /Users/buildslave/jenkins/workspace/lldb-cmake-matrix/lldb-build/lldb-test-build.noindex/lang/objc/hidden-ivars/TestHiddenIvars.test_expr_stripped_dsym/stripped/a.out
output: Current executable set to '/Users/buildslave/jenkins/workspace/lldb-cmake-matrix/lldb-build/lldb-test-build.noindex/lang/objc/hidden-ivars/TestHiddenIvars.test_expr_stripped_dsym/stripped/a.out' (x86_64).


runCmd: breakpoint set -f "main.m" -l 49
output: Breakpoint 1: no locations (pending).
WARNING:  Unable to resolve breakpoint to any actual locations.


Expecting pattern: ^Breakpoint (?P<bpno>[0-9]+): (?P<num_locations>[0-9]+) locations\.$
Not matched

Expecting pattern: ^Breakpoint (?P<bpno>[0-9]+): (?P<num_locations>no) locations \(pending\)\.
Matched

FAIL: LLDB (/Users/buildslave/jenkins/workspace/lldb-cmake-matrix/lldb-build/bin/clang-11-x86_64) :: test_expr_stripped_dsym (TestHiddenIvars.HiddenIvarsTestCase)
<bound method SBProcess.Kill of <lldb.SBProcess; proxy of <Swig Object of type 'lldb::SBProcess *' at 0x10e67cd20> >>: success

runCmd: settings clear -all
output: 

runCmd: settings set symbols.enable-external-lookup false
output: 

runCmd: settings set target.auto-apply-fixits false
output: 

runCmd: settings set plugin.process.gdb-remote.packet-timeout 60
output: 

runCmd: settings set symbols.clang-modules-cache-path "/Users/buildslave/jenkins/workspace/lldb-cmake-matrix/lldb-build/lldb-test-build.noindex/module-cache-lldb/lldb-api"
output: 

runCmd: settings set use-color false
output: 

runCmd: setting set target.prefer-dynamic-value no-dynamic-values
output: 

UNSUPPORTED: LLDB (/Users/buildslave/jenkins/workspace/lldb-cmake-matrix/lldb-build/bin/clang-11-x86_64) :: test_expr_stripped_dwarf (TestHiddenIvars.HiddenIvarsTestCase) (skipping due to the following parameter(s): debug info format [This test requires a stripped binary and a dSYM]) 
UNSUPPORTED: LLDB (/Users/buildslave/jenkins/workspace/lldb-cmake-matrix/lldb-build/bin/clang-11-x86_64) :: test_expr_stripped_dwo (TestHiddenIvars.HiddenIvarsTestCase) (test case does not fall in any category of interest for this run) 
UNSUPPORTED: LLDB (/Users/buildslave/jenkins/workspace/lldb-cmake-matrix/lldb-build/bin/clang-11-x86_64) :: test_expr_stripped_gmodules (TestHiddenIvars.HiddenIvarsTestCase) (test case does not fall in any category of interest for this run) 
runCmd: settings clear -all
output: 

runCmd: settings set symbols.enable-external-lookup false
output: 

runCmd: settings set target.auto-apply-fixits false
output: 

runCmd: settings set plugin.process.gdb-remote.packet-timeout 60
output: 

runCmd: settings set symbols.clang-modules-cache-path "/Users/buildslave/jenkins/workspace/lldb-cmake-matrix/lldb-build/lldb-test-build.noindex/module-cache-lldb/lldb-api"
output: 

runCmd: settings set use-color false
output: 

runCmd: setting set target.prefer-dynamic-value no-dynamic-values
output: 

runCmd: file /Users/buildslave/jenkins/workspace/lldb-cmake-matrix/lldb-build/lldb-test-build.noindex/lang/objc/hidden-ivars/TestHiddenIvars.test_frame_variable_across_modules_dsym/a.out
output: Current executable set to '/Users/buildslave/jenkins/workspace/lldb-cmake-matrix/lldb-build/lldb-test-build.noindex/lang/objc/hidden-ivars/TestHiddenIvars.test_frame_variable_across_modules_dsym/a.out' (x86_64).


runCmd: breakpoint set -f "main.m" -l 49
output: Breakpoint 1: no locations (pending).
WARNING:  Unable to resolve breakpoint to any actual locations.


Expecting pattern: ^Breakpoint (?P<bpno>[0-9]+): (?P<num_locations>[0-9]+) locations\.$
Not matched

Expecting pattern: ^Breakpoint (?P<bpno>[0-9]+): (?P<num_locations>no) locations \(pending\)\.
Matched

XFAIL: LLDB (/Users/buildslave/jenkins/workspace/lldb-cmake-matrix/lldb-build/bin/clang-11-x86_64) :: test_frame_variable_across_modules_dsym (TestHiddenIvars.HiddenIvarsTestCase)
<bound method SBProcess.Kill of <lldb.SBProcess; proxy of <Swig Object of type 'lldb::SBProcess *' at 0x10e05cfc0> >>: success

runCmd: settings clear -all
output: 

runCmd: settings set symbols.enable-external-lookup false
output: 

runCmd: settings set target.auto-apply-fixits false
output: 

runCmd: settings set plugin.process.gdb-remote.packet-timeout 60
output: 

runCmd: settings set symbols.clang-modules-cache-path "/Users/buildslave/jenkins/workspace/lldb-cmake-matrix/lldb-build/lldb-test-build.noindex/module-cache-lldb/lldb-api"
output: 

runCmd: settings set use-color false
output: 

runCmd: setting set target.prefer-dynamic-value no-dynamic-values
output: 

runCmd: file /Users/buildslave/jenkins/workspace/lldb-cmake-matrix/lldb-build/lldb-test-build.noindex/lang/objc/hidden-ivars/TestHiddenIvars.test_frame_variable_across_modules_dwarf/a.out
output: Current executable set to '/Users/buildslave/jenkins/workspace/lldb-cmake-matrix/lldb-build/lldb-test-build.noindex/lang/objc/hidden-ivars/TestHiddenIvars.test_frame_variable_across_modules_dwarf/a.out' (x86_64).


runCmd: breakpoint set -f "main.m" -l 49
output: Breakpoint 1: no locations (pending).
WARNING:  Unable to resolve breakpoint to any actual locations.


Expecting pattern: ^Breakpoint (?P<bpno>[0-9]+): (?P<num_locations>[0-9]+) locations\.$
Not matched

Expecting pattern: ^Breakpoint (?P<bpno>[0-9]+): (?P<num_locations>no) locations \(pending\)\.
Matched

XFAIL: LLDB (/Users/buildslave/jenkins/workspace/lldb-cmake-matrix/lldb-build/bin/clang-11-x86_64) :: test_frame_variable_across_modules_dwarf (TestHiddenIvars.HiddenIvarsTestCase)
<bound method SBProcess.Kill of <lldb.SBProcess; proxy of <Swig Object of type 'lldb::SBProcess *' at 0x109559cc0> >>: success

UNSUPPORTED: LLDB (/Users/buildslave/jenkins/workspace/lldb-cmake-matrix/lldb-build/bin/clang-11-x86_64) :: test_frame_variable_across_modules_dwo (TestHiddenIvars.HiddenIvarsTestCase) (test case does not fall in any category of interest for this run) 
UNSUPPORTED: LLDB (/Users/buildslave/jenkins/workspace/lldb-cmake-matrix/lldb-build/bin/clang-11-x86_64) :: test_frame_variable_across_modules_gmodules (TestHiddenIvars.HiddenIvarsTestCase) (test case does not fall in any category of interest for this run) 
runCmd: settings clear -all
output: 

runCmd: settings set symbols.enable-external-lookup false
output: 

runCmd: settings set target.auto-apply-fixits false
output: 

runCmd: settings set plugin.process.gdb-remote.packet-timeout 60
output: 

runCmd: settings set symbols.clang-modules-cache-path "/Users/buildslave/jenkins/workspace/lldb-cmake-matrix/lldb-build/lldb-test-build.noindex/module-cache-lldb/lldb-api"
output: 

runCmd: settings set use-color false
output: 

runCmd: setting set target.prefer-dynamic-value no-dynamic-values
output: 

runCmd: file /Users/buildslave/jenkins/workspace/lldb-cmake-matrix/lldb-build/lldb-test-build.noindex/lang/objc/hidden-ivars/TestHiddenIvars.test_frame_variable_dsym/a.out
output: Current executable set to '/Users/buildslave/jenkins/workspace/lldb-cmake-matrix/lldb-build/lldb-test-build.noindex/lang/objc/hidden-ivars/TestHiddenIvars.test_frame_variable_dsym/a.out' (x86_64).


runCmd: breakpoint set -f "main.m" -l 49
output: Breakpoint 1: no locations (pending).
WARNING:  Unable to resolve breakpoint to any actual locations.


Expecting pattern: ^Breakpoint (?P<bpno>[0-9]+): (?P<num_locations>[0-9]+) locations\.$
Not matched

Expecting pattern: ^Breakpoint (?P<bpno>[0-9]+): (?P<num_locations>no) locations \(pending\)\.
Matched

FAIL: LLDB (/Users/buildslave/jenkins/workspace/lldb-cmake-matrix/lldb-build/bin/clang-11-x86_64) :: test_frame_variable_dsym (TestHiddenIvars.HiddenIvarsTestCase)
<bound method SBProcess.Kill of <lldb.SBProcess; proxy of <Swig Object of type 'lldb::SBProcess *' at 0x10956d1e0> >>: success

runCmd: settings clear -all
output: 

runCmd: settings set symbols.enable-external-lookup false
output: 

runCmd: settings set target.auto-apply-fixits false
output: 

runCmd: settings set plugin.process.gdb-remote.packet-timeout 60
output: 

runCmd: settings set symbols.clang-modules-cache-path "/Users/buildslave/jenkins/workspace/lldb-cmake-matrix/lldb-build/lldb-test-build.noindex/module-cache-lldb/lldb-api"
output: 

runCmd: settings set use-color false
output: 

runCmd: setting set target.prefer-dynamic-value no-dynamic-values
output: 

runCmd: file /Users/buildslave/jenkins/workspace/lldb-cmake-matrix/lldb-build/lldb-test-build.noindex/lang/objc/hidden-ivars/TestHiddenIvars.test_frame_variable_dwarf/a.out
output: Current executable set to '/Users/buildslave/jenkins/workspace/lldb-cmake-matrix/lldb-build/lldb-test-build.noindex/lang/objc/hidden-ivars/TestHiddenIvars.test_frame_variable_dwarf/a.out' (x86_64).


runCmd: breakpoint set -f "main.m" -l 49
output: Breakpoint 1: no locations (pending).
WARNING:  Unable to resolve breakpoint to any actual locations.


Expecting pattern: ^Breakpoint (?P<bpno>[0-9]+): (?P<num_locations>[0-9]+) locations\.$
Not matched

Expecting pattern: ^Breakpoint (?P<bpno>[0-9]+): (?P<num_locations>no) locations \(pending\)\.
Matched

FAIL: LLDB (/Users/buildslave/jenkins/workspace/lldb-cmake-matrix/lldb-build/bin/clang-11-x86_64) :: test_frame_variable_dwarf (TestHiddenIvars.HiddenIvarsTestCase)
<bound method SBProcess.Kill of <lldb.SBProcess; proxy of <Swig Object of type 'lldb::SBProcess *' at 0x10e05cfc0> >>: success

UNSUPPORTED: LLDB (/Users/buildslave/jenkins/workspace/lldb-cmake-matrix/lldb-build/bin/clang-11-x86_64) :: test_frame_variable_dwo (TestHiddenIvars.HiddenIvarsTestCase) (test case does not fall in any category of interest for this run) 
UNSUPPORTED: LLDB (/Users/buildslave/jenkins/workspace/lldb-cmake-matrix/lldb-build/bin/clang-11-x86_64) :: test_frame_variable_gmodules (TestHiddenIvars.HiddenIvarsTestCase) (test case does not fall in any category of interest for this run) 
runCmd: settings clear -all
output: 

runCmd: settings set symbols.enable-external-lookup false
output: 

runCmd: settings set target.auto-apply-fixits false
output: 

runCmd: settings set plugin.process.gdb-remote.packet-timeout 60
output: 

runCmd: settings set symbols.clang-modules-cache-path "/Users/buildslave/jenkins/workspace/lldb-cmake-matrix/lldb-build/lldb-test-build.noindex/module-cache-lldb/lldb-api"
output: 

runCmd: settings set use-color false
output: 

runCmd: setting set target.prefer-dynamic-value no-dynamic-values
output: 

runCmd: file /Users/buildslave/jenkins/workspace/lldb-cmake-matrix/lldb-build/lldb-test-build.noindex/lang/objc/hidden-ivars/TestHiddenIvars.test_frame_variable_stripped_dsym/stripped/a.out
output: Current executable set to '/Users/buildslave/jenkins/workspace/lldb-cmake-matrix/lldb-build/lldb-test-build.noindex/lang/objc/hidden-ivars/TestHiddenIvars.test_frame_variable_stripped_dsym/stripped/a.out' (x86_64).


runCmd: breakpoint set -f "main.m" -l 49
output: Breakpoint 1: no locations (pending).
WARNING:  Unable to resolve breakpoint to any actual locations.


Expecting pattern: ^Breakpoint (?P<bpno>[0-9]+): (?P<num_locations>[0-9]+) locations\.$
Not matched

Expecting pattern: ^Breakpoint (?P<bpno>[0-9]+): (?P<num_locations>no) locations \(pending\)\.
Matched

FAIL: LLDB (/Users/buildslave/jenkins/workspace/lldb-cmake-matrix/lldb-build/bin/clang-11-x86_64) :: test_frame_variable_stripped_dsym (TestHiddenIvars.HiddenIvarsTestCase)
<bound method SBProcess.Kill of <lldb.SBProcess; proxy of <Swig Object of type 'lldb::SBProcess *' at 0x109559cc0> >>: success

runCmd: settings clear -all
output: 

runCmd: settings set symbols.enable-external-lookup false
output: 

runCmd: settings set target.auto-apply-fixits false
output: 

runCmd: settings set plugin.process.gdb-remote.packet-timeout 60
output: 

runCmd: settings set symbols.clang-modules-cache-path "/Users/buildslave/jenkins/workspace/lldb-cmake-matrix/lldb-build/lldb-test-build.noindex/module-cache-lldb/lldb-api"
output: 

runCmd: settings set use-color false
output: 

runCmd: setting set target.prefer-dynamic-value no-dynamic-values
output: 

UNSUPPORTED: LLDB (/Users/buildslave/jenkins/workspace/lldb-cmake-matrix/lldb-build/bin/clang-11-x86_64) :: test_frame_variable_stripped_dwarf (TestHiddenIvars.HiddenIvarsTestCase) (skipping due to the following parameter(s): debug info format [This test requires a stripped binary and a dSYM]) 
UNSUPPORTED: LLDB (/Users/buildslave/jenkins/workspace/lldb-cmake-matrix/lldb-build/bin/clang-11-x86_64) :: test_frame_variable_stripped_dwo (TestHiddenIvars.HiddenIvarsTestCase) (test case does not fall in any category of interest for this run) 
UNSUPPORTED: LLDB (/Users/buildslave/jenkins/workspace/lldb-cmake-matrix/lldb-build/bin/clang-11-x86_64) :: test_frame_variable_stripped_gmodules (TestHiddenIvars.HiddenIvarsTestCase) (test case does not fall in any category of interest for this run) 
Restore dir to: /Users/buildslave/jenkins/workspace/lldb-cmake-matrix/lldb-build/tools/lldb/test
======================================================================
FAIL: test_expr_dsym (TestHiddenIvars.HiddenIvarsTestCase)
----------------------------------------------------------------------
Traceback (most recent call last):
  File "/Users/buildslave/jenkins/workspace/lldb-cmake-matrix/llvm-project/lldb/packages/Python/lldbsuite/test/lldbtest.py", line 1774, in test_method
    return attrvalue(self)
  File "/Users/buildslave/jenkins/workspace/lldb-cmake-matrix/llvm-project/lldb/packages/Python/lldbsuite/test/decorators.py", line 140, in wrapper
    func(*args, **kwargs)
  File "/Users/buildslave/jenkins/workspace/lldb-cmake-matrix/llvm-project/lldb/test/API/lang/objc/hidden-ivars/TestHiddenIvars.py", line 48, in test_expr
    self.expr(False)
  File "/Users/buildslave/jenkins/workspace/lldb-cmake-matrix/llvm-project/lldb/test/API/lang/objc/hidden-ivars/TestHiddenIvars.py", line 124, in expr
    self.common_setup(strip)
  File "/Users/buildslave/jenkins/workspace/lldb-cmake-matrix/llvm-project/lldb/test/API/lang/objc/hidden-ivars/TestHiddenIvars.py", line 110, in common_setup
    self, "main.m", self.line, num_expected_locations=1, loc_exact=True)
  File "/Users/buildslave/jenkins/workspace/lldb-cmake-matrix/llvm-project/lldb/packages/Python/lldbsuite/test/lldbutil.py", line 384, in run_break_set_by_file_and_line
    module_name=module_name)
  File "/Users/buildslave/jenkins/workspace/lldb-cmake-matrix/llvm-project/lldb/packages/Python/lldbsuite/test/lldbutil.py", line 585, in check_breakpoint_result
    out_num_locations))
AssertionError: False is not True : Expecting 1 locations, got 0.
Config=x86_64-/Users/buildslave/jenkins/workspace/lldb-cmake-matrix/lldb-build/bin/clang-11
======================================================================
FAIL: test_expr_dwarf (TestHiddenIvars.HiddenIvarsTestCase)
----------------------------------------------------------------------
Traceback (most recent call last):
  File "/Users/buildslave/jenkins/workspace/lldb-cmake-matrix/llvm-project/lldb/packages/Python/lldbsuite/test/lldbtest.py", line 1774, in test_method
    return attrvalue(self)
  File "/Users/buildslave/jenkins/workspace/lldb-cmake-matrix/llvm-project/lldb/packages/Python/lldbsuite/test/decorators.py", line 140, in wrapper
    func(*args, **kwargs)
  File "/Users/buildslave/jenkins/workspace/lldb-cmake-matrix/llvm-project/lldb/test/API/lang/objc/hidden-ivars/TestHiddenIvars.py", line 48, in test_expr
    self.expr(False)
  File "/Users/buildslave/jenkins/workspace/lldb-cmake-matrix/llvm-project/lldb/test/API/lang/objc/hidden-ivars/TestHiddenIvars.py", line 124, in expr
    self.common_setup(strip)
  File "/Users/buildslave/jenkins/workspace/lldb-cmake-matrix/llvm-project/lldb/test/API/lang/objc/hidden-ivars/TestHiddenIvars.py", line 110, in common_setup
    self, "main.m", self.line, num_expected_locations=1, loc_exact=True)
  File "/Users/buildslave/jenkins/workspace/lldb-cmake-matrix/llvm-project/lldb/packages/Python/lldbsuite/test/lldbutil.py", line 384, in run_break_set_by_file_and_line
    module_name=module_name)
  File "/Users/buildslave/jenkins/workspace/lldb-cmake-matrix/llvm-project/lldb/packages/Python/lldbsuite/test/lldbutil.py", line 585, in check_breakpoint_result
    out_num_locations))
AssertionError: False is not True : Expecting 1 locations, got 0.
Config=x86_64-/Users/buildslave/jenkins/workspace/lldb-cmake-matrix/lldb-build/bin/clang-11
======================================================================
FAIL: test_expr_stripped_dsym (TestHiddenIvars.HiddenIvarsTestCase)
----------------------------------------------------------------------
Traceback (most recent call last):
  File "/Users/buildslave/jenkins/workspace/lldb-cmake-matrix/llvm-project/lldb/packages/Python/lldbsuite/test/lldbtest.py", line 1774, in test_method
    return attrvalue(self)
  File "/Users/buildslave/jenkins/workspace/lldb-cmake-matrix/llvm-project/lldb/packages/Python/lldbsuite/test/decorators.py", line 140, in wrapper
    func(*args, **kwargs)
  File "/Users/buildslave/jenkins/workspace/lldb-cmake-matrix/llvm-project/lldb/packages/Python/lldbsuite/test/decorators.py", line 140, in wrapper
    func(*args, **kwargs)
  File "/Users/buildslave/jenkins/workspace/lldb-cmake-matrix/llvm-project/lldb/test/API/lang/objc/hidden-ivars/TestHiddenIvars.py", line 39, in test_expr_stripped
    self.expr(True)
  File "/Users/buildslave/jenkins/workspace/lldb-cmake-matrix/llvm-project/lldb/test/API/lang/objc/hidden-ivars/TestHiddenIvars.py", line 124, in expr
    self.common_setup(strip)
  File "/Users/buildslave/jenkins/workspace/lldb-cmake-matrix/llvm-project/lldb/test/API/lang/objc/hidden-ivars/TestHiddenIvars.py", line 110, in common_setup
    self, "main.m", self.line, num_expected_locations=1, loc_exact=True)
  File "/Users/buildslave/jenkins/workspace/lldb-cmake-matrix/llvm-project/lldb/packages/Python/lldbsuite/test/lldbutil.py", line 384, in run_break_set_by_file_and_line
    module_name=module_name)
  File "/Users/buildslave/jenkins/workspace/lldb-cmake-matrix/llvm-project/lldb/packages/Python/lldbsuite/test/lldbutil.py", line 585, in check_breakpoint_result
    out_num_locations))
AssertionError: False is not True : Expecting 1 locations, got 0.
Config=x86_64-/Users/buildslave/jenkins/workspace/lldb-cmake-matrix/lldb-build/bin/clang-11
======================================================================
FAIL: test_frame_variable_dsym (TestHiddenIvars.HiddenIvarsTestCase)
----------------------------------------------------------------------
Traceback (most recent call last):
  File "/Users/buildslave/jenkins/workspace/lldb-cmake-matrix/llvm-project/lldb/packages/Python/lldbsuite/test/lldbtest.py", line 1774, in test_method
    return attrvalue(self)
  File "/Users/buildslave/jenkins/workspace/lldb-cmake-matrix/llvm-project/lldb/test/API/lang/objc/hidden-ivars/TestHiddenIvars.py", line 67, in test_frame_variable
    self.frame_var(False)
  File "/Users/buildslave/jenkins/workspace/lldb-cmake-matrix/llvm-project/lldb/test/API/lang/objc/hidden-ivars/TestHiddenIvars.py", line 177, in frame_var
    self.common_setup(strip)
  File "/Users/buildslave/jenkins/workspace/lldb-cmake-matrix/llvm-project/lldb/test/API/lang/objc/hidden-ivars/TestHiddenIvars.py", line 110, in common_setup
    self, "main.m", self.line, num_expected_locations=1, loc_exact=True)
  File "/Users/buildslave/jenkins/workspace/lldb-cmake-matrix/llvm-project/lldb/packages/Python/lldbsuite/test/lldbutil.py", line 384, in run_break_set_by_file_and_line
    module_name=module_name)
  File "/Users/buildslave/jenkins/workspace/lldb-cmake-matrix/llvm-project/lldb/packages/Python/lldbsuite/test/lldbutil.py", line 585, in check_breakpoint_result
    out_num_locations))
AssertionError: False is not True : Expecting 1 locations, got 0.
Config=x86_64-/Users/buildslave/jenkins/workspace/lldb-cmake-matrix/lldb-build/bin/clang-11
======================================================================
FAIL: test_frame_variable_dwarf (TestHiddenIvars.HiddenIvarsTestCase)
----------------------------------------------------------------------
Traceback (most recent call last):
  File "/Users/buildslave/jenkins/workspace/lldb-cmake-matrix/llvm-project/lldb/packages/Python/lldbsuite/test/lldbtest.py", line 1774, in test_method
    return attrvalue(self)
  File "/Users/buildslave/jenkins/workspace/lldb-cmake-matrix/llvm-project/lldb/test/API/lang/objc/hidden-ivars/TestHiddenIvars.py", line 67, in test_frame_variable
    self.frame_var(False)
  File "/Users/buildslave/jenkins/workspace/lldb-cmake-matrix/llvm-project/lldb/test/API/lang/objc/hidden-ivars/TestHiddenIvars.py", line 177, in frame_var
    self.common_setup(strip)
  File "/Users/buildslave/jenkins/workspace/lldb-cmake-matrix/llvm-project/lldb/test/API/lang/objc/hidden-ivars/TestHiddenIvars.py", line 110, in common_setup
    self, "main.m", self.line, num_expected_locations=1, loc_exact=True)
  File "/Users/buildslave/jenkins/workspace/lldb-cmake-matrix/llvm-project/lldb/packages/Python/lldbsuite/test/lldbutil.py", line 384, in run_break_set_by_file_and_line
    module_name=module_name)
  File "/Users/buildslave/jenkins/workspace/lldb-cmake-matrix/llvm-project/lldb/packages/Python/lldbsuite/test/lldbutil.py", line 585, in check_breakpoint_result
    out_num_locations))
AssertionError: False is not True : Expecting 1 locations, got 0.
Config=x86_64-/Users/buildslave/jenkins/workspace/lldb-cmake-matrix/lldb-build/bin/clang-11
======================================================================
FAIL: test_frame_variable_stripped_dsym (TestHiddenIvars.HiddenIvarsTestCase)
----------------------------------------------------------------------
Traceback (most recent call last):
  File "/Users/buildslave/jenkins/workspace/lldb-cmake-matrix/llvm-project/lldb/packages/Python/lldbsuite/test/lldbtest.py", line 1774, in test_method
    return attrvalue(self)
  File "/Users/buildslave/jenkins/workspace/lldb-cmake-matrix/llvm-project/lldb/packages/Python/lldbsuite/test/decorators.py", line 140, in wrapper
    func(*args, **kwargs)
  File "/Users/buildslave/jenkins/workspace/lldb-cmake-matrix/llvm-project/lldb/test/API/lang/objc/hidden-ivars/TestHiddenIvars.py", line 59, in test_frame_variable_stripped
    self.frame_var(True)
  File "/Users/buildslave/jenkins/workspace/lldb-cmake-matrix/llvm-project/lldb/test/API/lang/objc/hidden-ivars/TestHiddenIvars.py", line 177, in frame_var
    self.common_setup(strip)
  File "/Users/buildslave/jenkins/workspace/lldb-cmake-matrix/llvm-project/lldb/test/API/lang/objc/hidden-ivars/TestHiddenIvars.py", line 110, in common_setup
    self, "main.m", self.line, num_expected_locations=1, loc_exact=True)
  File "/Users/buildslave/jenkins/workspace/lldb-cmake-matrix/llvm-project/lldb/packages/Python/lldbsuite/test/lldbutil.py", line 384, in run_break_set_by_file_and_line
    module_name=module_name)
  File "/Users/buildslave/jenkins/workspace/lldb-cmake-matrix/llvm-project/lldb/packages/Python/lldbsuite/test/lldbutil.py", line 585, in check_breakpoint_result
    out_num_locations))
AssertionError: False is not True : Expecting 1 locations, got 0.
Config=x86_64-/Users/buildslave/jenkins/workspace/lldb-cmake-matrix/lldb-build/bin/clang-11
----------------------------------------------------------------------
Ran 20 tests in 37.931s

RESULT: FAILED (0 passes, 6 failures, 0 errors, 12 skipped, 2 expected failures, 0 unexpected successes)

--

********************
PASS: lldb-api :: api/multithreaded/TestMultithreaded.py (2068 of 2074)
PASS: lldb-api :: lang/objc/foundation/TestFoundationDisassembly.py (2069 of 2074)
PASS: lldb-api :: tools/lldb-server/TestLldbGdbServer.py (2070 of 2074)
FAIL: lldb-api :: driver/batch_mode/TestBatchMode.py (2071 of 2074)
******************** TEST 'lldb-api :: driver/batch_mode/TestBatchMode.py' FAILED ********************
Script:
--
/usr/local/Frameworks/Python.framework/Versions/3.7/bin/python3.7 /Users/buildslave/jenkins/workspace/lldb-cmake-matrix/llvm-project/lldb/test/API/dotest.py --arch x86_64 -s /Users/buildslave/jenkins/workspace/lldb-cmake-matrix/lldb-build/lldb-test-traces -S nm -u CXXFLAGS -u CFLAGS --codesign-identity lldb_codesign --server /Users/buildslave/jenkins/workspace/lldb-cmake-matrix/lldb-build/./bin/debugserver --arch x86_64 --build-dir /Users/buildslave/jenkins/workspace/lldb-cmake-matrix/lldb-build/lldb-test-build.noindex -s=/Users/buildslave/jenkins/workspace/lldb-cmake-matrix/test/logs -t --env TERM=vt100 --skip-category gmodules --skip-category watchpoint --arch=x86_64 --dwarf-version=5 --env LLVM_LIBS_DIR=/Users/buildslave/jenkins/workspace/lldb-cmake-matrix/lldb-build/./lib --build-dir /Users/buildslave/jenkins/workspace/lldb-cmake-matrix/lldb-build/lldb-test-build.noindex --lldb-module-cache-dir /Users/buildslave/jenkins/workspace/lldb-cmake-matrix/lldb-build/lldb-test-build.noindex/module-cache-lldb/lldb-api --clang-module-cache-dir /Users/buildslave/jenkins/workspace/lldb-cmake-matrix/lldb-build/lldb-test-build.noindex/module-cache-clang/lldb-api --executable /Users/buildslave/jenkins/workspace/lldb-cmake-matrix/lldb-build/./bin/lldb --compiler /Users/buildslave/jenkins/workspace/lldb-cmake-matrix/lldb-build/./bin/clang --dsymutil /Users/buildslave/jenkins/workspace/lldb-cmake-matrix/lldb-build/./bin/dsymutil --filecheck /Users/buildslave/jenkins/workspace/lldb-cmake-matrix/lldb-build/./bin/FileCheck --lldb-libs-dir /Users/buildslave/jenkins/workspace/lldb-cmake-matrix/lldb-build/./lib /Users/buildslave/jenkins/workspace/lldb-cmake-matrix/llvm-project/lldb/test/API/driver/batch_mode -p TestBatchMode.py
--
Exit Code: 1

Command Output (stdout):
--
lldb version 11.0.99
  clang revision 03640ee0fa73c6eaf8cb12050203027239136789
  llvm revision 03640ee0fa73c6eaf8cb12050203027239136789
(lldb) settings clear -all
(lldb) settings set symbols.enable-external-lookup false
(lldb) settings set target.auto-apply-fixits false
(lldb) settings set plugin.process.gdb-remote.packet-timeout 60
(lldb) settings set symbols.clang-modules-cache-path "/Users/buildslave/jenkins/workspace/lldb-cmake-matrix/lldb-build/lldb-test-build.noindex/module-cache-lldb/lldb-api"
(lldb) settings set use-color false
(lldb) setting set target.prefer-dynamic-value no-dynamic-values
(lldb) target create "/Users/buildslave/jenkins/workspace/lldb-cmake-matrix/lldb-build/lldb-test-build.noindex/driver/batch_mode/TestBatchMode.test_batch_mode_attach_exit/a.out"
warning: (x86_64) /Users/buildslave/jenkins/workspace/lldb-cmake-matrix/lldb-build/lldb-test-build.noindex/driver/batch_mode/TestBatchMode.test_batch_mode_attach_exit/a.out empty dSYM file detected, dSYM was created with an executable with no debug info.
Current executable set to '/Users/buildslave/jenkins/workspace/lldb-cmake-matrix/lldb-build/lldb-test-build.noindex/driver/batch_mode/TestBatchMode.test_batch_mode_attach_exit/a.out' (x86_64).
(lldb) process attach -p 21233
Process 21233 stopped
* thread #1, queue = 'com.apple.main-thread', stop reason = signal SIGSTOP
    frame #0: 0x00007fff67888756 libsystem_kernel.dylib`__semwait_signal + 10
libsystem_kernel.dylib`__semwait_signal:
->  0x7fff67888756 <+10>: jae    0x7fff67888760            ; <+20>
    0x7fff67888758 <+12>: movq   %rax, %rdi
    0x7fff6788875b <+15>: jmp    0x7fff6788722d            ; cerror
    0x7fff67888760 <+20>: retq   

(lldb) breakpoint set --file 'main.c' -p 'Stop here to unset keep_waiting' -N keep_waiting
Breakpoint 1: no locations (pending).
WARNING:  Unable to resolve breakpoint to any actual locations.
(lldb) continue
settings set interpreter.prompt-on-quit false
quit
settings set interpreter.prompt-on-quit false
quit
(lldb) settings clear -all
(lldb) settings set symbols.enable-external-lookup false
(lldb) settings set target.auto-apply-fixits false
(lldb) settings set plugin.process.gdb-remote.packet-timeout 60
(lldb) settings set symbols.clang-modules-cache-path "/Users/buildslave/jenkins/workspace/lldb-cmake-matrix/lldb-build/lldb-test-build.noindex/module-cache-lldb/lldb-api"
(lldb) settings set use-color false
(lldb) setting set target.prefer-dynamic-value no-dynamic-values
(lldb) target create "/Users/buildslave/jenkins/workspace/lldb-cmake-matrix/lldb-build/lldb-test-build.noindex/driver/batch_mode/TestBatchMode.test_batch_mode_launch_stop_at_entry/a.out"
warning: (x86_64) /Users/buildslave/jenkins/workspace/lldb-cmake-matrix/lldb-build/lldb-test-build.noindex/driver/batch_mode/TestBatchMode.test_batch_mode_launch_stop_at_entry/a.out empty dSYM file detected, dSYM was created with an executable with no debug info.
Current executable set to '/Users/buildslave/jenkins/workspace/lldb-cmake-matrix/lldb-build/lldb-test-build.noindex/driver/batch_mode/TestBatchMode.test_batch_mode_launch_stop_at_entry/a.out' (x86_64).
(lldb) process launch --stop-at-entry
Process 42778 launched: '/Users/buildslave/jenkins/workspace/lldb-cmake-matrix/lldb-build/lldb-test-build.noindex/driver/batch_mode/TestBatchMode.test_batch_mode_launch_stop_at_entry/a.out' (x86_64)
(lldb) continue
PID: 42778 END

Got there on time and it did not crash.

Process 42778 resuming
Process 42778 exited with status = 0 (0x00000000) 

(lldb) settings clear -all
(lldb) settings set symbols.enable-external-lookup false
(lldb) settings set target.auto-apply-fixits false
(lldb) settings set plugin.process.gdb-remote.packet-timeout 60
(lldb) settings set symbols.clang-modules-cache-path "/Users/buildslave/jenkins/workspace/lldb-cmake-matrix/lldb-build/lldb-test-build.noindex/module-cache-lldb/lldb-api"
(lldb) settings set use-color false
(lldb) setting set target.prefer-dynamic-value no-dynamic-values
(lldb) target create "/Users/buildslave/jenkins/workspace/lldb-cmake-matrix/lldb-build/lldb-test-build.noindex/driver/batch_mode/TestBatchMode.test_batch_mode_run_crash/a.out"
warning: (x86_64) /Users/buildslave/jenkins/workspace/lldb-cmake-matrix/lldb-build/lldb-test-build.noindex/driver/batch_mode/TestBatchMode.test_batch_mode_run_crash/a.out empty dSYM file detected, dSYM was created with an executable with no debug info.
Current executable set to '/Users/buildslave/jenkins/workspace/lldb-cmake-matrix/lldb-build/lldb-test-build.noindex/driver/batch_mode/TestBatchMode.test_batch_mode_run_crash/a.out' (x86_64).
(lldb) settings set -- target.run-args  "CRASH"
(lldb) break set -n main
Breakpoint 1: where = a.out`main, address = 0x0000000100000dd0
(lldb) run
Process 43063 stopped
* thread #1, queue = 'com.apple.main-thread', stop reason = breakpoint 1.1
    frame #0: 0x0000000100000dd0 a.out`main
a.out`main:
->  0x100000dd0 <+0>: pushq  %rbp
    0x100000dd1 <+1>: movq   %rsp, %rbp
    0x100000dd4 <+4>: subq   $0x30, %rsp
    0x100000dd8 <+8>: movl   $0x0, -0x4(%rbp)

Process 43063 launched: '/Users/buildslave/jenkins/workspace/lldb-cmake-matrix/lldb-build/lldb-test-build.noindex/driver/batch_mode/TestBatchMode.test_batch_mode_run_crash/a.out' (x86_64)
(lldb) continue
PID: 43063 END

About to crash.

Process 43063 resuming
Process 43063 stopped
* thread #1, queue = 'com.apple.main-thread', stop reason = EXC_BAD_ACCESS (code=1, address=0x0)
    frame #0: 0x0000000100000ee3 a.out`main + 275
a.out`main:
->  0x100000ee3 <+275>: movb   $0x61, (%rcx)
    0x100000ee6 <+278>: leaq   0x99(%rip), %rdi          ; "Got there on time and it did not crash.\n"
    0x100000eed <+285>: movb   $0x0, %al
    0x100000eef <+287>: callq  0x100000f08               ; symbol stub for: printf

(lldb) frame var touch_me_not
(lldb) settings set interpreter.prompt-on-quit false
quit
settings set interpreter.prompt-on-quit false
(lldb) quit
(lldb) settings clear -all
(lldb) settings set symbols.enable-external-lookup false
(lldb) settings set target.auto-apply-fixits false
(lldb) settings set plugin.process.gdb-remote.packet-timeout 60
(lldb) settings set symbols.clang-modules-cache-path "/Users/buildslave/jenkins/workspace/lldb-cmake-matrix/lldb-build/lldb-test-build.noindex/module-cache-lldb/lldb-api"
(lldb) settings set use-color false
(lldb) setting set target.prefer-dynamic-value no-dynamic-values
(lldb) target create "/Users/buildslave/jenkins/workspace/lldb-cmake-matrix/lldb-build/lldb-test-build.noindex/driver/batch_mode/TestBatchMode.test_batch_mode_run_exit/a.out"
warning: (x86_64) /Users/buildslave/jenkins/workspace/lldb-cmake-matrix/lldb-build/lldb-test-build.noindex/driver/batch_mode/TestBatchMode.test_batch_mode_run_exit/a.out empty dSYM file detected, dSYM was created with an executable with no debug info.
Current executable set to '/Users/buildslave/jenkins/workspace/lldb-cmake-matrix/lldb-build/lldb-test-build.noindex/driver/batch_mode/TestBatchMode.test_batch_mode_run_exit/a.out' (x86_64).
(lldb) settings set -- target.run-args  "NOCRASH"
(lldb) break set -n main
Breakpoint 1: where = a.out`main, address = 0x0000000100000dd0
(lldb) run
Process 43448 stopped
* thread #1, queue = 'com.apple.main-thread', stop reason = breakpoint 1.1
    frame #0: 0x0000000100000dd0 a.out`main
a.out`main:
->  0x100000dd0 <+0>: pushq  %rbp
    0x100000dd1 <+1>: movq   %rsp, %rbp
    0x100000dd4 <+4>: subq   $0x30, %rsp
    0x100000dd8 <+8>: movl   $0x0, -0x4(%rbp)

Process 43448 launched: '/Users/buildslave/jenkins/workspace/lldb-cmake-matrix/lldb-build/lldb-test-build.noindex/driver/batch_mode/TestBatchMode.test_batch_mode_run_exit/a.out' (x86_64)
(lldb) continue
PID: 43448 END

Got there on time and it did not crash.

Process 43448 resuming
Process 43448 exited with status = 0 (0x00000000) 

LLDB library dir: /Users/buildslave/jenkins/workspace/lldb-cmake-matrix/lldb-build/bin
LLDB import library dir: /Users/buildslave/jenkins/workspace/lldb-cmake-matrix/lldb-build/./lib
libstdcxx tests will not be run because: Don't know how to build with libstdcxx on macosx
Skipping following debug info categories: ['dwo']

--
Command Output (stderr):
--

Session logs for test failures/errors/unexpected successes will go into directory '/Users/buildslave/jenkins/workspace/lldb-cmake-matrix/test/logs'
Change dir to: /Users/buildslave/jenkins/workspace/lldb-cmake-matrix/llvm-project/lldb/test/API/driver/batch_mode
runCmd: settings clear -all
output: 

runCmd: settings set symbols.enable-external-lookup false
output: 

runCmd: settings set target.auto-apply-fixits false
output: 

runCmd: settings set plugin.process.gdb-remote.packet-timeout 60
output: 

runCmd: settings set symbols.clang-modules-cache-path "/Users/buildslave/jenkins/workspace/lldb-cmake-matrix/lldb-build/lldb-test-build.noindex/module-cache-lldb/lldb-api"
output: 

runCmd: settings set use-color false
output: 

runCmd: setting set target.prefer-dynamic-value no-dynamic-values
output: 

Adding tearDown hook:     def closeVictim(self):
        if self.victim is not None:
            self.victim.close()
            self.victim = None


FAIL: LLDB (/Users/buildslave/jenkins/workspace/lldb-cmake-matrix/lldb-build/bin/clang-11-x86_64) :: test_batch_mode_attach_exit (TestBatchMode.DriverBatchModeTest)
tearing down the child process....

Executing tearDown hook:     def closeVictim(self):
        if self.victim is not None:
            self.victim.close()
            self.victim = None


runCmd: settings clear -all
output: 

runCmd: settings set symbols.enable-external-lookup false
output: 

runCmd: settings set target.auto-apply-fixits false
output: 

runCmd: settings set plugin.process.gdb-remote.packet-timeout 60
output: 

runCmd: settings set symbols.clang-modules-cache-path "/Users/buildslave/jenkins/workspace/lldb-cmake-matrix/lldb-build/lldb-test-build.noindex/module-cache-lldb/lldb-api"
output: 

runCmd: settings set use-color false
output: 

runCmd: setting set target.prefer-dynamic-value no-dynamic-values
output: 

PASS: LLDB (/Users/buildslave/jenkins/workspace/lldb-cmake-matrix/lldb-build/bin/clang-11-x86_64) :: test_batch_mode_launch_stop_at_entry (TestBatchMode.DriverBatchModeTest)
runCmd: settings clear -all
output: 

runCmd: settings set symbols.enable-external-lookup false
output: 

runCmd: settings set target.auto-apply-fixits false
output: 

runCmd: settings set plugin.process.gdb-remote.packet-timeout 60
output: 

runCmd: settings set symbols.clang-modules-cache-path "/Users/buildslave/jenkins/workspace/lldb-cmake-matrix/lldb-build/lldb-test-build.noindex/module-cache-lldb/lldb-api"
output: 

runCmd: settings set use-color false
output: 

runCmd: setting set target.prefer-dynamic-value no-dynamic-values
output: 

FAIL: LLDB (/Users/buildslave/jenkins/workspace/lldb-cmake-matrix/lldb-build/bin/clang-11-x86_64) :: test_batch_mode_run_crash (TestBatchMode.DriverBatchModeTest)
tearing down the child process....

runCmd: settings clear -all
output: 

runCmd: settings set symbols.enable-external-lookup false
output: 

runCmd: settings set target.auto-apply-fixits false
output: 

runCmd: settings set plugin.process.gdb-remote.packet-timeout 60
output: 

runCmd: settings set symbols.clang-modules-cache-path "/Users/buildslave/jenkins/workspace/lldb-cmake-matrix/lldb-build/lldb-test-build.noindex/module-cache-lldb/lldb-api"
output: 

runCmd: settings set use-color false
output: 

runCmd: setting set target.prefer-dynamic-value no-dynamic-values
output: 

PASS: LLDB (/Users/buildslave/jenkins/workspace/lldb-cmake-matrix/lldb-build/bin/clang-11-x86_64) :: test_batch_mode_run_exit (TestBatchMode.DriverBatchModeTest)
Restore dir to: /Users/buildslave/jenkins/workspace/lldb-cmake-matrix/lldb-build/tools/lldb/test
======================================================================
ERROR: test_batch_mode_attach_exit (TestBatchMode.DriverBatchModeTest)
   Test that the lldb driver's batch mode works correctly.
----------------------------------------------------------------------
Traceback (most recent call last):
  File "/Users/buildslave/jenkins/workspace/lldb-cmake-matrix/llvm-project/lldb/third_party/Python/module/pexpect-4.6/pexpect/expect.py", line 111, in expect_loop
    incoming = spawn.read_nonblocking(spawn.maxread, timeout)
  File "/Users/buildslave/jenkins/workspace/lldb-cmake-matrix/llvm-project/lldb/third_party/Python/module/pexpect-4.6/pexpect/pty_spawn.py", line 482, in read_nonblocking
    raise TIMEOUT('Timeout exceeded.')
pexpect.exceptions.TIMEOUT: Timeout exceeded.

During handling of the above exception, another exception occurred:

Traceback (most recent call last):
  File "/Users/buildslave/jenkins/workspace/lldb-cmake-matrix/llvm-project/lldb/packages/Python/lldbsuite/test/decorators.py", line 140, in wrapper
    func(*args, **kwargs)
  File "/Users/buildslave/jenkins/workspace/lldb-cmake-matrix/llvm-project/lldb/packages/Python/lldbsuite/test/decorators.py", line 463, in wrapper
    func(*args, **kwargs)
  File "/Users/buildslave/jenkins/workspace/lldb-cmake-matrix/llvm-project/lldb/packages/Python/lldbsuite/test/decorators.py", line 110, in wrapper
    func(*args, **kwargs)
  File "/Users/buildslave/jenkins/workspace/lldb-cmake-matrix/llvm-project/lldb/test/API/driver/batch_mode/TestBatchMode.py", line 158, in test_batch_mode_attach_exit
    child.expect_exact(self.PROMPT + "continue")
  File "/Users/buildslave/jenkins/workspace/lldb-cmake-matrix/llvm-project/lldb/third_party/Python/module/pexpect-4.6/pexpect/spawnbase.py", line 418, in expect_exact
    return exp.expect_loop(timeout)
  File "/Users/buildslave/jenkins/workspace/lldb-cmake-matrix/llvm-project/lldb/third_party/Python/module/pexpect-4.6/pexpect/expect.py", line 119, in expect_loop
    return self.timeout(e)
  File "/Users/buildslave/jenkins/workspace/lldb-cmake-matrix/llvm-project/lldb/third_party/Python/module/pexpect-4.6/pexpect/expect.py", line 82, in timeout
    raise TIMEOUT(msg)
pexpect.exceptions.TIMEOUT: Timeout exceeded.
<pexpect.pty_spawn.spawn object at 0x1141f4c50>
command: /Users/buildslave/jenkins/workspace/lldb-cmake-matrix/lldb-build/bin/lldb
args: ['/Users/buildslave/jenkins/workspace/lldb-cmake-matrix/lldb-build/bin/lldb', '--no-lldbinit', '--no-use-colors', '-O', 'settings clear -all', '-O', 'settings set symbols.enable-external-lookup false', '-O', 'settings set target.auto-apply-fixits false', '-O', 'settings set plugin.process.gdb-remote.packet-timeout 60', '-O', 'settings set symbols.clang-modules-cache-path "/Users/buildslave/jenkins/workspace/lldb-cmake-matrix/lldb-build/lldb-test-build.noindex/module-cache-lldb/lldb-api"', '-O', 'settings set use-color false', '-O', 'setting set target.prefer-dynamic-value no-dynamic-values', '--file', '/Users/buildslave/jenkins/workspace/lldb-cmake-matrix/lldb-build/lldb-test-build.noindex/driver/batch_mode/TestBatchMode.test_batch_mode_attach_exit/a.out', '-b', '-o', 'process attach -p 21233', '-o', "breakpoint set --file 'main.c' -p 'Stop here to unset keep_waiting' -N keep_waiting", '-o', 'continue', '-o', 'break delete keep_waiting', '-o', 'expr keep_waiting = 0', '-o', 'continue']
buffer (last 100 chars): b'\r\n'
before (last 100 chars): b'\r\n'
after: <class 'pexpect.exceptions.TIMEOUT'>
match: None
match_index: None
exitstatus: None
flag_eof: False
pid: 21282
child_fd: 7
closed: False
timeout: 30
delimiter: <class 'pexpect.exceptions.EOF'>
logfile: <_io.BufferedWriter name='<stdout>'>
logfile_read: None
logfile_send: None
maxread: 2000
ignorecase: False
searchwindowsize: None
delaybeforesend: 0.05
delayafterclose: 0.1
delayafterterminate: 0.1
searcher: searcher_string:
    0: b'(lldb) continue'
Config=x86_64-/Users/buildslave/jenkins/workspace/lldb-cmake-matrix/lldb-build/bin/clang-11
======================================================================
ERROR: test_batch_mode_run_crash (TestBatchMode.DriverBatchModeTest)
   Test that the lldb driver's batch mode works correctly.
----------------------------------------------------------------------
Traceback (most recent call last):
  File "/Users/buildslave/jenkins/workspace/lldb-cmake-matrix/llvm-project/lldb/third_party/Python/module/pexpect-4.6/pexpect/expect.py", line 111, in expect_loop
    incoming = spawn.read_nonblocking(spawn.maxread, timeout)
  File "/Users/buildslave/jenkins/workspace/lldb-cmake-matrix/llvm-project/lldb/third_party/Python/module/pexpect-4.6/pexpect/pty_spawn.py", line 482, in read_nonblocking
    raise TIMEOUT('Timeout exceeded.')
pexpect.exceptions.TIMEOUT: Timeout exceeded.

During handling of the above exception, another exception occurred:

Traceback (most recent call last):
  File "/Users/buildslave/jenkins/workspace/lldb-cmake-matrix/llvm-project/lldb/packages/Python/lldbsuite/test/decorators.py", line 140, in wrapper
    func(*args, **kwargs)
  File "/Users/buildslave/jenkins/workspace/lldb-cmake-matrix/llvm-project/lldb/packages/Python/lldbsuite/test/decorators.py", line 463, in wrapper
    func(*args, **kwargs)
  File "/Users/buildslave/jenkins/workspace/lldb-cmake-matrix/llvm-project/lldb/test/API/driver/batch_mode/TestBatchMode.py", line 45, in test_batch_mode_run_crash
    child.expect_exact('(char *) touch_me_not')
  File "/Users/buildslave/jenkins/workspace/lldb-cmake-matrix/llvm-project/lldb/third_party/Python/module/pexpect-4.6/pexpect/spawnbase.py", line 418, in expect_exact
    return exp.expect_loop(timeout)
  File "/Users/buildslave/jenkins/workspace/lldb-cmake-matrix/llvm-project/lldb/third_party/Python/module/pexpect-4.6/pexpect/expect.py", line 119, in expect_loop
    return self.timeout(e)
  File "/Users/buildslave/jenkins/workspace/lldb-cmake-matrix/llvm-project/lldb/third_party/Python/module/pexpect-4.6/pexpect/expect.py", line 82, in timeout
    raise TIMEOUT(msg)
pexpect.exceptions.TIMEOUT: Timeout exceeded.
<pexpect.pty_spawn.spawn object at 0x114209ba8>
command: /Users/buildslave/jenkins/workspace/lldb-cmake-matrix/lldb-build/bin/lldb
args: ['/Users/buildslave/jenkins/workspace/lldb-cmake-matrix/lldb-build/bin/lldb', '--no-lldbinit', '--no-use-colors', '-O', 'settings clear -all', '-O', 'settings set symbols.enable-external-lookup false', '-O', 'settings set target.auto-apply-fixits false', '-O', 'settings set plugin.process.gdb-remote.packet-timeout 60', '-O', 'settings set symbols.clang-modules-cache-path "/Users/buildslave/jenkins/workspace/lldb-cmake-matrix/lldb-build/lldb-test-build.noindex/module-cache-lldb/lldb-api"', '-O', 'settings set use-color false', '-O', 'setting set target.prefer-dynamic-value no-dynamic-values', '--file', '/Users/buildslave/jenkins/workspace/lldb-cmake-matrix/lldb-build/lldb-test-build.noindex/driver/batch_mode/TestBatchMode.test_batch_mode_run_crash/a.out', '-b', '-o', 'break set -n main', '-o', 'run', '-o', 'continue', '-k', 'frame var touch_me_not', '--', 'CRASH']
buffer (last 100 chars): b'callq  0x100000f08               ; symbol stub for: printf\r\n\r\n(lldb) frame var touch_me_not\r\n(lldb) '
before (last 100 chars): b'callq  0x100000f08               ; symbol stub for: printf\r\n\r\n(lldb) frame var touch_me_not\r\n(lldb) '
after: <class 'pexpect.exceptions.TIMEOUT'>
match: None
match_index: None
exitstatus: None
flag_eof: False
pid: 43036
child_fd: 7
closed: False
timeout: 30
delimiter: <class 'pexpect.exceptions.EOF'>
logfile: <_io.BufferedWriter name='<stdout>'>
logfile_read: None
logfile_send: None
maxread: 2000
ignorecase: False
searchwindowsize: None
delaybeforesend: 0.05
delayafterclose: 0.1
delayafterterminate: 0.1
searcher: searcher_string:
    0: b'(char *) touch_me_not'
Config=x86_64-/Users/buildslave/jenkins/workspace/lldb-cmake-matrix/lldb-build/bin/clang-11
----------------------------------------------------------------------
Ran 4 tests in 96.164s

RESULT: FAILED (2 passes, 0 failures, 2 errors, 0 skipped, 0 expected failures, 0 unexpected successes)

--

********************
TIMEOUT: lldb-api :: python_api/lldbutil/iter/TestRegistersIterator.py (2072 of 2074)
******************** TEST 'lldb-api :: python_api/lldbutil/iter/TestRegistersIterator.py' FAILED ********************
Script:
--
/usr/local/Frameworks/Python.framework/Versions/3.7/bin/python3.7 /Users/buildslave/jenkins/workspace/lldb-cmake-matrix/llvm-project/lldb/test/API/dotest.py --arch x86_64 -s /Users/buildslave/jenkins/workspace/lldb-cmake-matrix/lldb-build/lldb-test-traces -S nm -u CXXFLAGS -u CFLAGS --codesign-identity lldb_codesign --server /Users/buildslave/jenkins/workspace/lldb-cmake-matrix/lldb-build/./bin/debugserver --arch x86_64 --build-dir /Users/buildslave/jenkins/workspace/lldb-cmake-matrix/lldb-build/lldb-test-build.noindex -s=/Users/buildslave/jenkins/workspace/lldb-cmake-matrix/test/logs -t --env TERM=vt100 --skip-category gmodules --skip-category watchpoint --arch=x86_64 --dwarf-version=5 --env LLVM_LIBS_DIR=/Users/buildslave/jenkins/workspace/lldb-cmake-matrix/lldb-build/./lib --build-dir /Users/buildslave/jenkins/workspace/lldb-cmake-matrix/lldb-build/lldb-test-build.noindex --lldb-module-cache-dir /Users/buildslave/jenkins/workspace/lldb-cmake-matrix/lldb-build/lldb-test-build.noindex/module-cache-lldb/lldb-api --clang-module-cache-dir /Users/buildslave/jenkins/workspace/lldb-cmake-matrix/lldb-build/lldb-test-build.noindex/module-cache-clang/lldb-api --executable /Users/buildslave/jenkins/workspace/lldb-cmake-matrix/lldb-build/./bin/lldb --compiler /Users/buildslave/jenkins/workspace/lldb-cmake-matrix/lldb-build/./bin/clang --dsymutil /Users/buildslave/jenkins/workspace/lldb-cmake-matrix/lldb-build/./bin/dsymutil --filecheck /Users/buildslave/jenkins/workspace/lldb-cmake-matrix/lldb-build/./bin/FileCheck --lldb-libs-dir /Users/buildslave/jenkins/workspace/lldb-cmake-matrix/lldb-build/./lib /Users/buildslave/jenkins/workspace/lldb-cmake-matrix/llvm-project/lldb/test/API/python_api/lldbutil/iter -p TestRegistersIterator.py
--
Exit Code: -9
Timeout: Reached timeout of 600 seconds

Command Output (stdout):
--
lldb version 11.0.99
  clang revision 03640ee0fa73c6eaf8cb12050203027239136789
  llvm revision 03640ee0fa73c6eaf8cb12050203027239136789

--
Command Output (stderr):
--
warning: (x86_64) /Users/buildslave/jenkins/workspace/lldb-cmake-matrix/lldb-build/lldb-test-build.noindex/python_api/lldbutil/iter/TestRegistersIterator.test_iter_registers_dsym/a.out empty dSYM file detected, dSYM was created with an executable with no debug info.

--

********************
TIMEOUT: lldb-api :: python_api/lldbutil/iter/TestLLDBIterator.py (2073 of 2074)
******************** TEST 'lldb-api :: python_api/lldbutil/iter/TestLLDBIterator.py' FAILED ********************
Script:
--
/usr/local/Frameworks/Python.framework/Versions/3.7/bin/python3.7 /Users/buildslave/jenkins/workspace/lldb-cmake-matrix/llvm-project/lldb/test/API/dotest.py --arch x86_64 -s /Users/buildslave/jenkins/workspace/lldb-cmake-matrix/lldb-build/lldb-test-traces -S nm -u CXXFLAGS -u CFLAGS --codesign-identity lldb_codesign --server /Users/buildslave/jenkins/workspace/lldb-cmake-matrix/lldb-build/./bin/debugserver --arch x86_64 --build-dir /Users/buildslave/jenkins/workspace/lldb-cmake-matrix/lldb-build/lldb-test-build.noindex -s=/Users/buildslave/jenkins/workspace/lldb-cmake-matrix/test/logs -t --env TERM=vt100 --skip-category gmodules --skip-category watchpoint --arch=x86_64 --dwarf-version=5 --env LLVM_LIBS_DIR=/Users/buildslave/jenkins/workspace/lldb-cmake-matrix/lldb-build/./lib --build-dir /Users/buildslave/jenkins/workspace/lldb-cmake-matrix/lldb-build/lldb-test-build.noindex --lldb-module-cache-dir /Users/buildslave/jenkins/workspace/lldb-cmake-matrix/lldb-build/lldb-test-build.noindex/module-cache-lldb/lldb-api --clang-module-cache-dir /Users/buildslave/jenkins/workspace/lldb-cmake-matrix/lldb-build/lldb-test-build.noindex/module-cache-clang/lldb-api --executable /Users/buildslave/jenkins/workspace/lldb-cmake-matrix/lldb-build/./bin/lldb --compiler /Users/buildslave/jenkins/workspace/lldb-cmake-matrix/lldb-build/./bin/clang --dsymutil /Users/buildslave/jenkins/workspace/lldb-cmake-matrix/lldb-build/./bin/dsymutil --filecheck /Users/buildslave/jenkins/workspace/lldb-cmake-matrix/lldb-build/./bin/FileCheck --lldb-libs-dir /Users/buildslave/jenkins/workspace/lldb-cmake-matrix/lldb-build/./lib /Users/buildslave/jenkins/workspace/lldb-cmake-matrix/llvm-project/lldb/test/API/python_api/lldbutil/iter -p TestLLDBIterator.py
--
Exit Code: -9
Timeout: Reached timeout of 600 seconds

Command Output (stdout):
--
lldb version 11.0.99
  clang revision 03640ee0fa73c6eaf8cb12050203027239136789
  llvm revision 03640ee0fa73c6eaf8cb12050203027239136789

--
Command Output (stderr):
--
warning: (x86_64) /Users/buildslave/jenkins/workspace/lldb-cmake-matrix/lldb-build/lldb-test-build.noindex/python_api/lldbutil/iter/TestLLDBIterator.test_lldb_iter_breakpoint_dsym/a.out empty dSYM file detected, dSYM was created with an executable with no debug info.
error: main.o Failed to extract range list table at offset 0xc: parsing .debug_rnglists table at offset 0x0: unexpected end of data at offset 0x0 while reading [0x0, 0x4)
warning: (x86_64) /Users/buildslave/jenkins/workspace/lldb-cmake-matrix/lldb-build/lldb-test-build.noindex/python_api/lldbutil/iter/TestLLDBIterator.test_lldb_iter_frame_dsym/a.out empty dSYM file detected, dSYM was created with an executable with no debug info.

--

********************
TIMEOUT: lldb-api :: lang/objc/foundation/TestObjCMethods.py (2074 of 2074)
******************** TEST 'lldb-api :: lang/objc/foundation/TestObjCMethods.py' FAILED ********************
Script:
--
/usr/local/Frameworks/Python.framework/Versions/3.7/bin/python3.7 /Users/buildslave/jenkins/workspace/lldb-cmake-matrix/llvm-project/lldb/test/API/dotest.py --arch x86_64 -s /Users/buildslave/jenkins/workspace/lldb-cmake-matrix/lldb-build/lldb-test-traces -S nm -u CXXFLAGS -u CFLAGS --codesign-identity lldb_codesign --server /Users/buildslave/jenkins/workspace/lldb-cmake-matrix/lldb-build/./bin/debugserver --arch x86_64 --build-dir /Users/buildslave/jenkins/workspace/lldb-cmake-matrix/lldb-build/lldb-test-build.noindex -s=/Users/buildslave/jenkins/workspace/lldb-cmake-matrix/test/logs -t --env TERM=vt100 --skip-category gmodules --skip-category watchpoint --arch=x86_64 --dwarf-version=5 --env LLVM_LIBS_DIR=/Users/buildslave/jenkins/workspace/lldb-cmake-matrix/lldb-build/./lib --build-dir /Users/buildslave/jenkins/workspace/lldb-cmake-matrix/lldb-build/lldb-test-build.noindex --lldb-module-cache-dir /Users/buildslave/jenkins/workspace/lldb-cmake-matrix/lldb-build/lldb-test-build.noindex/module-cache-lldb/lldb-api --clang-module-cache-dir /Users/buildslave/jenkins/workspace/lldb-cmake-matrix/lldb-build/lldb-test-build.noindex/module-cache-clang/lldb-api --executable /Users/buildslave/jenkins/workspace/lldb-cmake-matrix/lldb-build/./bin/lldb --compiler /Users/buildslave/jenkins/workspace/lldb-cmake-matrix/lldb-build/./bin/clang --dsymutil /Users/buildslave/jenkins/workspace/lldb-cmake-matrix/lldb-build/./bin/dsymutil --filecheck /Users/buildslave/jenkins/workspace/lldb-cmake-matrix/lldb-build/./bin/FileCheck --lldb-libs-dir /Users/buildslave/jenkins/workspace/lldb-cmake-matrix/lldb-build/./lib /Users/buildslave/jenkins/workspace/lldb-cmake-matrix/llvm-project/lldb/test/API/lang/objc/foundation -p TestObjCMethods.py
--
Exit Code: -9
Timeout: Reached timeout of 600 seconds

Command Output (stdout):
--
lldb version 11.0.99
  clang revision 03640ee0fa73c6eaf8cb12050203027239136789
  llvm revision 03640ee0fa73c6eaf8cb12050203027239136789

--
Command Output (stderr):
--
warning: (x86_64) /Users/buildslave/jenkins/workspace/lldb-cmake-matrix/lldb-build/lldb-test-build.noindex/lang/objc/foundation/TestObjCMethods.test_break_dsym/a.out empty dSYM file detected, dSYM was created with an executable with no debug info.
warning: (x86_64) /Users/buildslave/jenkins/workspace/lldb-cmake-matrix/lldb-build/lldb-test-build.noindex/lang/objc/foundation/TestObjCMethods.test_data_type_and_expr_dsym/a.out empty dSYM file detected, dSYM was created with an executable with no debug info.

Session logs for test failures/errors/unexpected successes will go into directory '/Users/buildslave/jenkins/workspace/lldb-cmake-matrix/test/logs'
Change dir to: /Users/buildslave/jenkins/workspace/lldb-cmake-matrix/llvm-project/lldb/test/API/lang/objc/foundation
runCmd: settings clear -all
output: 

runCmd: settings set symbols.enable-external-lookup false
output: 

runCmd: settings set target.auto-apply-fixits false
output: 

runCmd: settings set plugin.process.gdb-remote.packet-timeout 60
output: 

runCmd: settings set symbols.clang-modules-cache-path "/Users/buildslave/jenkins/workspace/lldb-cmake-matrix/lldb-build/lldb-test-build.noindex/module-cache-lldb/lldb-api"
output: 

runCmd: settings set use-color false
output: 

runCmd: setting set target.prefer-dynamic-value no-dynamic-values
output: 

runCmd: file /Users/buildslave/jenkins/workspace/lldb-cmake-matrix/lldb-build/lldb-test-build.noindex/lang/objc/foundation/TestObjCMethods.test_break_dsym/a.out
output: Current executable set to '/Users/buildslave/jenkins/workspace/lldb-cmake-matrix/lldb-build/lldb-test-build.noindex/lang/objc/foundation/TestObjCMethods.test_break_dsym/a.out' (x86_64).


runCmd: _regexp-break +[NSString stringWithFormat:]
output: Breakpoint 1: where = Foundation`+[NSString stringWithFormat:], address = 0x000000000001ad87


Expecting pattern: ^Breakpoint (?P<bpno>[0-9]+): (?P<num_locations>[0-9]+) locations\.$
Not matched

Expecting pattern: ^Breakpoint (?P<bpno>[0-9]+): (?P<num_locations>no) locations \(pending\)\.
Not matched

Expecting pattern: ^Breakpoint (?P<bpno>[0-9]+): where = (?P<module>.*)`(?P<symbol>[+\-]{0,1}[^+]+)( \+ (?P<offset>[0-9]+)){0,1}( \[inlined\] (?P<inline_symbol>.*)){0,1} at (?P<file>[^:]+):(?P<line_no>[0-9]+)(?P<column>(:[0-9]+)?), address = (?P<address>0x[0-9a-fA-F]+)$
Not matched

Expecting pattern: ^Breakpoint (?P<bpno>[0-9]+): where = (?P<module>.*)`(?P<symbol>.*)( \+ (?P<offset>[0-9]+)){0,1}, address = (?P<address>0x[0-9a-fA-F]+)$
Matched

runCmd: breakpoint set -n "-[MyString initWithNSString:]"
output: Breakpoint 2: where = a.out`-[MyString initWithNSString:], address = 0x00000001000014b0


Expecting pattern: ^Breakpoint (?P<bpno>[0-9]+): (?P<num_locations>[0-9]+) locations\.$
Not matched

Expecting pattern: ^Breakpoint (?P<bpno>[0-9]+): (?P<num_locations>no) locations \(pending\)\.
Not matched

Expecting pattern: ^Breakpoint (?P<bpno>[0-9]+): where = (?P<module>.*)`(?P<symbol>[+\-]{0,1}[^+]+)( \+ (?P<offset>[0-9]+)){0,1}( \[inlined\] (?P<inline_symbol>.*)){0,1} at (?P<file>[^:]+):(?P<line_no>[0-9]+)(?P<column>(:[0-9]+)?), address = (?P<address>0x[0-9a-fA-F]+)$
Not matched

Expecting pattern: ^Breakpoint (?P<bpno>[0-9]+): where = (?P<module>.*)`(?P<symbol>.*)( \+ (?P<offset>[0-9]+)){0,1}, address = (?P<address>0x[0-9a-fA-F]+)$
Matched

runCmd: breakpoint set -S "description" --shlib "a.out"
output: Breakpoint 3: where = a.out`-[MyString description], address = 0x00000001000015e0


Expecting pattern: ^Breakpoint (?P<bpno>[0-9]+): (?P<num_locations>[0-9]+) locations\.$
Not matched

Expecting pattern: ^Breakpoint (?P<bpno>[0-9]+): (?P<num_locations>no) locations \(pending\)\.
Not matched

Expecting pattern: ^Breakpoint (?P<bpno>[0-9]+): where = (?P<module>.*)`(?P<symbol>[+\-]{0,1}[^+]+)( \+ (?P<offset>[0-9]+)){0,1}( \[inlined\] (?P<inline_symbol>.*)){0,1} at (?P<file>[^:]+):(?P<line_no>[0-9]+)(?P<column>(:[0-9]+)?), address = (?P<address>0x[0-9a-fA-F]+)$
Not matched

Expecting pattern: ^Breakpoint (?P<bpno>[0-9]+): where = (?P<module>.*)`(?P<symbol>.*)( \+ (?P<offset>[0-9]+)){0,1}, address = (?P<address>0x[0-9a-fA-F]+)$
Matched

runCmd: _regexp-break -[NSAutoreleasePool release]
output: Breakpoint 4: where = Foundation`-[NSAutoreleasePool release], address = 0x000000000001ea40


Expecting pattern: ^Breakpoint (?P<bpno>[0-9]+): (?P<num_locations>[0-9]+) locations\.$
Not matched

Expecting pattern: ^Breakpoint (?P<bpno>[0-9]+): (?P<num_locations>no) locations \(pending\)\.
Not matched

Expecting pattern: ^Breakpoint (?P<bpno>[0-9]+): where = (?P<module>.*)`(?P<symbol>[+\-]{0,1}[^+]+)( \+ (?P<offset>[0-9]+)){0,1}( \[inlined\] (?P<inline_symbol>.*)){0,1} at (?P<file>[^:]+):(?P<line_no>[0-9]+)(?P<column>(:[0-9]+)?), address = (?P<address>0x[0-9a-fA-F]+)$
Not matched

Expecting pattern: ^Breakpoint (?P<bpno>[0-9]+): where = (?P<module>.*)`(?P<symbol>.*)( \+ (?P<offset>[0-9]+)){0,1}, address = (?P<address>0x[0-9a-fA-F]+)$
Matched

runCmd: run
output: Process 86712 stopped
* thread #1, queue = 'com.apple.main-thread', stop reason = breakpoint 1.1
    frame #0: 0x00007fff2fd0ad87 Foundation`+[NSString stringWithFormat:]
Foundation`+[NSString stringWithFormat:]:
->  0x7fff2fd0ad87 <+0>: pushq  %rbp
    0x7fff2fd0ad88 <+1>: movq   %rsp, %rbp
    0x7fff2fd0ad8b <+4>: pushq  %r14
    0x7fff2fd0ad8d <+6>: pushq  %rbx

Process 86712 launched: '/Users/buildslave/jenkins/workspace/lldb-cmake-matrix/lldb-build/lldb-test-build.noindex/lang/objc/foundation/TestObjCMethods.test_break_dsym/a.out' (x86_64)


runCmd: thread backtrace
output: * thread #1, queue = 'com.apple.main-thread', stop reason = breakpoint 1.1
  * frame #0: 0x00007fff2fd0ad87 Foundation`+[NSString stringWithFormat:]
    frame #1: 0x00000001000017ab a.out`Test_NSString + 59
    frame #2: 0x0000000100001b35 a.out`main + 69
    frame #3: 0x00007fff67744cc9 libdyld.dylib`start + 1
    frame #4: 0x00007fff67744cc9 libdyld.dylib`start + 1


Expecting sub string: Foundation`+[NSString stringWithFormat:]
Matched

runCmd: process continue
output: Process 86712 resuming
Process 86712 stopped
* thread #1, queue = 'com.apple.main-thread', stop reason = breakpoint 1.1
    frame #0: 0x00007fff2fd0ad87 Foundation`+[NSString stringWithFormat:]
Foundation`+[NSString stringWithFormat:]:
->  0x7fff2fd0ad87 <+0>: pushq  %rbp
    0x7fff2fd0ad88 <+1>: movq   %rsp, %rbp
    0x7fff2fd0ad8b <+4>: pushq  %r14
    0x7fff2fd0ad8d <+6>: pushq  %rbx



runCmd: thread backtrace
output: * thread #1, queue = 'com.apple.main-thread', stop reason = breakpoint 1.1
  * frame #0: 0x00007fff2fd0ad87 Foundation`+[NSString stringWithFormat:]
    frame #1: 0x00000001000018c9 a.out`Test_MyString + 73
    frame #2: 0x0000000100001b44 a.out`main + 84
    frame #3: 0x00007fff67744cc9 libdyld.dylib`start + 1
    frame #4: 0x00007fff67744cc9 libdyld.dylib`start + 1


Expecting sub string: Foundation`+[NSString stringWithFormat:]
Matched

runCmd: process continue
output: Process 86712 resuming
Process 86712 stopped
* thread #1, queue = 'com.apple.main-thread', stop reason = breakpoint 2.1
    frame #0: 0x00000001000014b0 a.out`-[MyString initWithNSString:]
a.out`-[MyString initWithNSString:]:
->  0x1000014b0 <+0>: pushq  %rbp
    0x1000014b1 <+1>: movq   %rsp, %rbp
    0x1000014b4 <+4>: subq   $0x30, %rsp
    0x1000014b8 <+8>: movq   %rdi, -0x8(%rbp)



runCmd: thread backtrace
output: * thread #1, queue = 'com.apple.main-thread', stop reason = breakpoint 2.1
  * frame #0: 0x00000001000014b0 a.out`-[MyString initWithNSString:]
    frame #1: 0x00000001000018f0 a.out`Test_MyString + 112
    frame #2: 0x0000000100001b44 a.out`main + 84
    frame #3: 0x00007fff67744cc9 libdyld.dylib`start + 1
    frame #4: 0x00007fff67744cc9 libdyld.dylib`start + 1


Expecting sub string: a.out`-[MyString initWithNSString:]
Matched

runCmd: process continue
output: Process 86712 resuming
Process 86712 stopped
* thread #1, queue = 'com.apple.main-thread', stop reason = breakpoint 3.1
    frame #0: 0x00000001000015e0 a.out`-[MyString description]
a.out`-[MyString description]:
->  0x1000015e0 <+0>: pushq  %rbp
    0x1000015e1 <+1>: movq   %rsp, %rbp
    0x1000015e4 <+4>: subq   $0x20, %rsp
    0x1000015e8 <+8>: movq   %rdi, -0x8(%rbp)



runCmd: thread backtrace
output: * thread #1, queue = 'com.apple.main-thread', stop reason = breakpoint 3.1
  * frame #0: 0x00000001000015e0 a.out`-[MyString description]
    frame #1: 0x0000000100001908 a.out`Test_MyString + 136
    frame #2: 0x0000000100001b44 a.out`main + 84
    frame #3: 0x00007fff67744cc9 libdyld.dylib`start + 1
    frame #4: 0x00007fff67744cc9 libdyld.dylib`start + 1


Expecting sub string: a.out`-[MyString description]
Matched

runCmd: process continue
output: Process 86712 resuming
Process 86712 stopped
* thread #1, queue = 'com.apple.main-thread', stop reason = breakpoint 3.1
    frame #0: 0x00000001000015e0 a.out`-[MyString description]
a.out`-[MyString description]:
->  0x1000015e0 <+0>: pushq  %rbp
    0x1000015e1 <+1>: movq   %rsp, %rbp
    0x1000015e4 <+4>: subq   $0x20, %rsp
    0x1000015e8 <+8>: movq   %rdi, -0x8(%rbp)


warning: (x86_64) /Users/buildslave/jenkins/workspace/lldb-cmake-matrix/lldb-build/lldb-test-build.noindex/lang/objc/foundation/TestObjCMethods.test_expression_lookups_objc_dsym/a.out empty dSYM file detected, dSYM was created with an executable with no debug info.

--

********************
Slowest Tests:
--------------------------------------------------------------------------
599.99s: lldb-api :: lang/objc/foundation/TestObjCMethods.py
599.99s: lldb-api :: python_api/lldbutil/iter/TestLLDBIterator.py
599.98s: lldb-api :: python_api/lldbutil/iter/TestRegistersIterator.py
96.59s: lldb-api :: driver/batch_mode/TestBatchMode.py
68.35s: lldb-api :: tools/lldb-server/TestLldbGdbServer.py
68.13s: lldb-api :: macosx/nslog/TestDarwinNSLogOutput.py
61.90s: lldb-api :: commands/expression/multiline-completion/TestMultilineCompletion.py
45.70s: lldb-api :: lang/objc/foundation/TestFoundationDisassembly.py
44.61s: lldb-api :: api/multithreaded/TestMultithreaded.py
38.35s: lldb-api :: lang/objc/hidden-ivars/TestHiddenIvars.py
32.86s: lldb-api :: commands/process/attach-resume/TestAttachResume.py
31.38s: lldb-api :: commands/gui/basic/TestGuiBasic.py
30.14s: lldb-api :: tools/lldb-server/TestGdbRemoteThreadsInStopReply.py
29.84s: lldb-api :: lang/objc/exceptions/TestObjCExceptions.py
22.84s: lldb-api :: lang/objc/foundation/TestObjCMethodsString.py
22.57s: lldb-api :: lang/objc/real-definition/TestRealDefinition.py
21.92s: lldb-api :: commands/settings/TestSettings.py
21.60s: lldb-api :: lang/objc/objc-new-syntax/TestObjCNewSyntaxDictionary.py
21.42s: lldb-api :: lang/objc/objc-new-syntax/TestObjCNewSyntaxLiteral.py
19.85s: lldb-api :: tools/lldb-server/TestAppleSimulatorOSType.py

Tests Times:
--------------------------------------------------------------------------
[   Range   ] :: [               Percentage               ] :: [  Count  ]
--------------------------------------------------------------------------
[550s,600s) :: [                                        ] :: [   3/2074]
[500s,550s) :: [                                        ] :: [   0/2074]
[450s,500s) :: [                                        ] :: [   0/2074]
[400s,450s) :: [                                        ] :: [   0/2074]
[350s,400s) :: [                                        ] :: [   0/2074]
[300s,350s) :: [                                        ] :: [   0/2074]
[250s,300s) :: [                                        ] :: [   0/2074]
[200s,250s) :: [                                        ] :: [   0/2074]
[150s,200s) :: [                                        ] :: [   0/2074]
[100s,150s) :: [                                        ] :: [   0/2074]
[ 50s,100s) :: [                                        ] :: [   4/2074]
[  0s, 50s) :: [*************************************** ] :: [2067/2074]
--------------------------------------------------------------------------
********************
Timed Out Tests (3):
  lldb-api :: python_api/lldbutil/iter/TestRegistersIterator.py
  lldb-api :: python_api/lldbutil/iter/TestLLDBIterator.py
  lldb-api :: lang/objc/foundation/TestObjCMethods.py

********************
Failed Tests (539):
  lldb-api :: python_api/hello_world/TestHelloWorld.py
  lldb-api :: functionalities/data-formatter/builtin-formats/TestBuiltinFormats.py
  lldb-api :: commands/expression/cast_int_to_anonymous_enum/TestCastIntToAnonymousEnum.py
  lldb-api :: types/TestCharType.py
  lldb-api :: lang/cpp/namespace_conflicts/TestNamespaceConflicts.py
  lldb-api :: functionalities/thread/concurrent_events/TestConcurrentCrashWithSignal.py
  lldb-api :: lang/objc/objc-ivar-offsets/TestObjCIvarOffsets.py
  lldb-api :: functionalities/process_crash_info/TestProcessCrashInfo.py
  lldb-api :: lang/objc/objc-checker/TestObjCCheckers.py
  lldb-api :: lang/objc/objc-new-syntax/TestObjCNewSyntaxDictionary.py
  lldb-api :: commands/expression/expr-in-syscall/TestExpressionInSyscall.py
  lldb-api :: commands/expression/import-std-module/vector/TestVectorFromStdModule.py
  lldb-api :: lang/cpp/breakpoint-commands/TestCPPBreakpointCommands.py
  lldb-api :: python_api/interpreter/TestCommandInterpreterAPI.py
  lldb-api :: functionalities/data-formatter/synthupdate/TestSyntheticFilterRecompute.py
  lldb-api :: lang/cpp/class-template-parameter-pack/TestClassTemplateParameterPack.py
  lldb-api :: python_api/sbvalue_persist/TestSBValuePersist.py
  lldb-api :: lang/cpp/gmodules-templates/TestGModules.py
  lldb-api :: lang/objc/modules-cache/TestClangModulesCache.py
  lldb-api :: python_api/value/empty_class/TestValueAPIEmptyClass.py
  lldb-api :: python_api/symbol-context/two-files/TestSymbolContextTwoFiles.py
  lldb-api :: lang/cpp/class_types/TestClassTypes.py
  lldb-api :: functionalities/inferior-assert/TestInferiorAssert.py
  lldb-api :: lang/cpp/global_operators/TestCppGlobalOperators.py
  lldb-api :: functionalities/dynamic_value_child_count/TestDynamicValueChildCount.py
  lldb-api :: python_api/value/change_values/TestChangeValueAPI.py
  lldb-api :: commands/expression/persistent_ptr_update/TestPersistentPtrUpdate.py
  lldb-api :: lang/cpp/call-function/TestCallCPPFunction.py
  lldb-api :: commands/expression/vector_of_enums/TestVectorOfEnums.py
  lldb-api :: lang/c/forward/TestForwardDeclaration.py
  lldb-api :: functionalities/breakpoint/breakpoint_by_line_and_column/TestBreakpointByLineAndColumn.py
  lldb-api :: functionalities/tail_call_frames/unambiguous_sequence/TestUnambiguousTailCalls.py
  lldb-api :: functionalities/memory/read/TestMemoryRead.py
  lldb-api :: lang/cpp/thread_local/TestThreadLocal.py
  lldb-api :: lang/objc/objc-baseclass-sbtype/TestObjCBaseClassSBType.py
  lldb-api :: lang/objc/foundation/TestConstStrings.py
  lldb-api :: types/TestRecursiveTypes.py
  lldb-api :: lang/c/complex/TestComplexC99.py
  lldb-api :: functionalities/breakpoint/inlined_breakpoints/TestInlinedBreakpoints.py
  lldb-api :: functionalities/unwind/sigtramp/TestSigtrampUnwind.py
  lldb-api :: python_api/formatters/TestFormattersSBAPI.py
  lldb-api :: functionalities/data-formatter/data-formatter-stl/libcxx/bitset/TestDataFormatterLibcxxBitset.py
  lldb-api :: functionalities/plugins/python_os_plugin/stepping_plugin_threads/TestOSPluginStepping.py
  lldb-api :: commands/expression/call-throws/TestCallThatThrows.py
  lldb-api :: commands/frame/diagnose/complicated-expression/TestComplicatedExpression.py
  lldb-api :: tools/lldb-vscode/console/TestVSCode_console.py
  lldb-api :: functionalities/data-formatter/data-formatter-proper-plurals/TestFormattersOneIsSingular.py
  lldb-api :: types/TestShortTypeExpr.py
  lldb-api :: commands/expression/anonymous-struct/TestCallUserAnonTypedef.py
  lldb-api :: functionalities/data-formatter/data-formatter-synth/TestDataFormatterSynth.py
  lldb-api :: functionalities/data-formatter/data-formatter-objc/nsindexpath/TestDataFormatterNSIndexPath.py
  lldb-api :: lang/cpp/auto/TestCPPAuto.py
  lldb-api :: commands/expression/issue_11588/Test11588.py
  lldb-api :: python_api/thread/TestThreadAPI.py
  lldb-api :: lang/cpp/accelerator-table/TestCPPAccelerator.py
  lldb-api :: lang/c/bitfields/TestBitfields.py
  lldb-api :: commands/expression/import-std-module/queue/TestQueueFromStdModule.py
  lldb-api :: commands/expression/import-std-module/deque-dbg-info-content/TestDbgInfoContentDequeFromStdModule.py
  lldb-api :: commands/expression/import-std-module/no-std-module/TestMissingStdModule.py
  lldb-api :: lang/cpp/overloaded-functions/TestOverloadedFunctions.py
  lldb-api :: commands/expression/persistent_variables/TestPersistentVariables.py
  lldb-api :: functionalities/data-formatter/data-formatter-stl/libcxx/variant/TestDataFormatterLibcxxVariant.py
  lldb-api :: functionalities/thread/concurrent_events/TestConcurrentTwoBreakpointsOneDelaySignal.py
  lldb-api :: functionalities/data-formatter/refpointer-recursion/TestDataFormatterRefPtrRecursion.py
  lldb-api :: functionalities/data-formatter/data-formatter-stl/libcxx/queue/TestDataFormatterLibcxxQueue.py
  lldb-api :: lang/c/step_over_no_deadlock/TestStepOverDoesntBlock.py
  lldb-api :: functionalities/thread/concurrent_events/TestConcurrentManyBreakpoints.py
  lldb-api :: commands/frame/diagnose/virtual-method-call/TestDiagnoseDereferenceVirtualMethodCall.py
  lldb-api :: commands/expression/import-std-module/basic/TestImportStdModule.py
  lldb-api :: functionalities/thread/concurrent_events/TestConcurrentDelayedCrashWithBreakpointSignal.py
  lldb-api :: lang/objcxx/hide-runtime-values/TestObjCXXHideRuntimeValues.py
  lldb-api :: python_api/value_var_update/TestValueVarUpdate.py
  lldb-api :: commands/expression/formatters/TestFormatters.py
  lldb-api :: functionalities/signal/TestSendSignal.py
  lldb-api :: functionalities/tail_call_frames/ambiguous_tail_call_seq1/TestAmbiguousTailCallSeq1.py
  lldb-api :: commands/expression/timeout/TestCallWithTimeout.py
  lldb-api :: functionalities/breakpoint/breakpoint_language/TestBreakpointLanguage.py
  lldb-api :: lang/cpp/nsimport/TestCppNsImport.py
  lldb-api :: lang/objc/objc-struct-return/TestObjCStructReturn.py
  lldb-api :: functionalities/data-formatter/format-propagation/TestFormatPropagation.py
  lldb-api :: functionalities/breakpoint/breakpoint_hit_count/TestBreakpointHitCount.py
  lldb-api :: functionalities/data-formatter/data-formatter-objc/TestDataFormatterObjCNSDate.py
  lldb-api :: functionalities/data-formatter/data-formatter-stl/libcxx/unique_ptr/TestDataFormatterLibcxxUniquePtr.py
  lldb-api :: lang/objc/modules-non-objc-target/TestObjCModulesNonObjCTarget.py
  lldb-api :: functionalities/data-formatter/synthcapping/TestSyntheticCapping.py
  lldb-api :: commands/expression/persistent_types/TestPersistentTypes.py
  lldb-api :: python_api/function_symbol/TestSymbolAPI.py
  lldb-api :: lang/objc/ptr_refs/TestPtrRefsObjC.py
  lldb-api :: commands/frame/diagnose/array/TestArray.py
  lldb-api :: commands/process/launch-with-shellexpand/TestLaunchWithShellExpand.py
  lldb-api :: lang/cpp/virtual-functions/TestCppVirtualFunctions.py
  lldb-api :: tools/lldb-vscode/stackTrace/TestVSCode_stackTrace.py
  lldb-api :: commands/expression/argument_passing_restrictions/TestArgumentPassingRestrictions.py
  lldb-api :: functionalities/data-formatter/summary-string-onfail/Test-rdar-9974002.py
  lldb-api :: commands/expression/import-std-module/unique_ptr-dbg-info-content/TestUniquePtrDbgInfoContent.py
  lldb-api :: commands/expression/result_numbering/TestResultNumbering.py
  lldb-api :: functionalities/inferior-crashing/TestInferiorCrashing.py
  lldb-api :: functionalities/data-formatter/boolreference/TestFormattersBoolRefPtr.py
  lldb-api :: lang/cpp/unique-types/TestUniqueTypes.py
  lldb-api :: types/TestLongTypesExpr.py
  lldb-api :: lang/objc/objc++/TestObjCXX.py
  lldb-api :: python_api/findvalue_duplist/TestSBFrameFindValue.py
  lldb-api :: functionalities/target_var/TestTargetVar.py
  lldb-api :: functionalities/thread/state_after_expression/TestStateAfterExpression.py
  lldb-api :: macosx/add-dsym/TestAddDsymMidExecutionCommand.py
  lldb-api :: lang/c/array_types/TestArrayTypes.py
  lldb-api :: functionalities/archives/TestBSDArchives.py
  lldb-api :: lang/cpp/namespace/TestNamespace.py
  lldb-api :: commands/expression/function_template_specialization_temp_args/TestFunctionTemplateSpecializationTempArgs.py
  lldb-api :: commands/target/basic/TestTargetCommand.py
  lldb-api :: functionalities/signal/handle-abrt/TestHandleAbort.py
  lldb-api :: lang/cpp/diamond/TestDiamond.py
  lldb-api :: macosx/thread_suspend/TestInternalThreadSuspension.py
  lldb-api :: lang/c/unions/TestUnionMembers.py
  lldb-api :: commands/expression/unwind_expression/TestUnwindExpression.py
  lldb-api :: functionalities/thread/concurrent_events/TestConcurrentCrashWithBreak.py
  lldb-api :: lang/cpp/type_lookup/TestCppTypeLookup.py
  lldb-api :: lang/c/offsetof/TestOffsetof.py
  lldb-api :: functionalities/avoids-fd-leak/TestFdLeak.py
  lldb-api :: python_api/signals/TestSignalsAPI.py
  lldb-api :: lang/objc/foundation/TestObjCMethodsString.py
  lldb-api :: lang/objc/objc-dyn-sbtype/TestObjCDynamicSBType.py
  lldb-api :: functionalities/tail_call_frames/disambiguate_tail_call_seq/TestDisambiguateTailCallSeq.py
  lldb-api :: commands/expression/ir-interpreter/TestIRInterpreter.py
  lldb-api :: lang/cpp/offsetof/TestOffsetofCpp.py
  lldb-api :: functionalities/data-formatter/data-formatter-objc/nsstring/TestDataFormatterNSString.py
  lldb-api :: functionalities/data-formatter/data-formatter-ptr-to-array/TestPtrToArrayFormatting.py
  lldb-api :: functionalities/data-formatter/data-formatter-disabling/TestDataFormatterDisabling.py
  lldb-api :: functionalities/data-formatter/data-formatter-stl/libcxx/vector/TestDataFormatterLibcxxVector.py
  lldb-api :: lang/objc/ivar-IMP/TestObjCiVarIMP.py
  lldb-api :: functionalities/data-formatter/data-formatter-stl/libcxx/unordered/TestDataFormatterUnordered.py
  lldb-api :: functionalities/breakpoint/breakpoint_ids/TestBreakpointIDs.py
  lldb-api :: functionalities/exec/TestExec.py
  lldb-api :: lang/cpp/function-qualifiers/TestCppFunctionQualifiers.py
  lldb-api :: lang/objc/exceptions/TestObjCExceptions.py
  lldb-api :: python_api/sbtype_typeclass/TestSBTypeTypeClass.py
  lldb-api :: commands/frame/diagnose/dereference-function-return/TestDiagnoseDereferenceFunctionReturn.py
  lldb-api :: functionalities/data-formatter/data-formatter-stl/libcxx/tuple/TestDataFormatterLibcxxTuple.py
  lldb-api :: commands/frame/diagnose/dereference-this/TestDiagnoseDereferenceThis.py
  lldb-api :: sample_test/TestSampleTest.py
  lldb-api :: functionalities/breakpoint/address_breakpoints/TestAddressBreakpoints.py
  lldb-api :: functionalities/inferior-changed/TestInferiorChanged.py
  lldb-api :: python_api/function_symbol/TestDisasmAPI.py
  lldb-api :: functionalities/breakpoint/step_over_breakpoint/TestStepOverBreakpoint.py
  lldb-api :: functionalities/breakpoint/breakpoint_command/TestBreakpointCommandsFromPython.py
  lldb-api :: functionalities/data-formatter/data-formatter-stl/libstdcpp/unique_ptr/invalid/TestDataFormatterInvalidStdUniquePtr.py
  lldb-api :: functionalities/data-formatter/data-formatter-synthval/TestDataFormatterSynthVal.py
  lldb-api :: lang/cpp/incomplete-types/TestCppIncompleteTypes.py
  lldb-api :: functionalities/thread/jump/TestThreadJump.py
  lldb-api :: tools/lldb-vscode/attach/TestVSCode_attach.py
  lldb-api :: api/check_public_api_headers/TestPublicAPIHeaders.py
  lldb-api :: python_api/name_lookup/TestNameLookup.py
  lldb-api :: functionalities/data-formatter/data-formatter-stl/libcxx/list/loop/TestDataFormatterLibcxxListLoop.py
  lldb-api :: commands/disassemble/basic/TestFrameDisassemble.py
  lldb-api :: lang/objc/objc-ivar-stripped/TestObjCIvarStripped.py
  lldb-api :: functionalities/data-formatter/data-formatter-skip-summary/TestDataFormatterSkipSummary.py
  lldb-api :: lang/cpp/covariant-return-types/TestCovariantReturnTypes.py
  lldb-api :: functionalities/data-formatter/setvaluefromcstring/TestSetValueFromCString.py
  lldb-api :: commands/expression/import-std-module/unique_ptr/TestUniquePtrFromStdModule.py
  lldb-api :: lang/c/unicode/TestUnicodeSymbols.py
  lldb-api :: functionalities/data-formatter/data-formatter-globals/TestDataFormatterGlobals.py
  lldb-api :: functionalities/thread/exit_during_step/TestExitDuringStep.py
  lldb-api :: lang/objc/modules-compile-error/TestModulesCompileError.py
  lldb-api :: commands/expression/import-std-module/vector-dbg-info-content/TestDbgInfoContentVectorFromStdModule.py
  lldb-api :: macosx/duplicate-archive-members/TestDuplicateMembers.py
  lldb-api :: functionalities/data-formatter/dump_dynamic/TestDumpDynamic.py
  lldb-api :: commands/expression/import-std-module/list-dbg-info-content/TestDbgInfoContentListFromStdModule.py
  lldb-api :: commands/expression/import-std-module/vector-bool/TestVectorBoolFromStdModule.py
  lldb-api :: lang/cpp/dynamic-value/TestCppValueCast.py
  lldb-api :: tools/lldb-vscode/breakpoint-events/TestVSCode_breakpointEvents.py
  lldb-api :: commands/expression/import_base_class_when_class_has_derived_member/TestImportBaseClassWhenClassHasDerivedMember.py
  lldb-api :: commands/expression/test/TestExprs2.py
  lldb-api :: functionalities/thread/concurrent_events/TestConcurrentSignalBreak.py
  lldb-api :: lang/c/modules/TestCModules.py
  lldb-api :: functionalities/breakpoint/consecutive_breakpoints/TestConsecutiveBreakpoints.py
  lldb-api :: functionalities/data-formatter/data-formatter-stl/libcxx/iterator/TestDataFormatterLibccIterator.py
  lldb-api :: functionalities/tail_call_frames/inlining_and_tail_calls/TestInliningAndTailCalls.py
  lldb-api :: lang/objc/foundation/TestObjCMethods2.py
  lldb-api :: commands/expression/import-std-module/stack/TestStackFromStdModule.py
  lldb-api :: commands/settings/TestSettings.py
  lldb-api :: lang/cpp/class_types/TestClassTypesDisassembly.py
  lldb-api :: functionalities/tail_call_frames/cross_dso/TestCrossDSOTailCalls.py
  lldb-api :: lang/cpp/inlines/TestInlines.py
  lldb-api :: functionalities/data-formatter/data-formatter-objc/TestDataFormatterObjCNSData.py
  lldb-api :: lang/cpp/class_static/TestStaticVariables.py
  lldb-api :: commands/command/script/TestCommandScript.py
  lldb-api :: lang/objc/objc-ivar-protocols/TestIvarProtocols.py
  lldb-api :: commands/expression/import-std-module/empty-module/TestEmptyStdModule.py
  lldb-api :: commands/expression/call-function/TestCallStdStringFunction.py
  lldb-api :: functionalities/data-formatter/data-formatter-enum-format/TestDataFormatterEnumFormat.py
  lldb-api :: functionalities/data-formatter/var-in-aggregate-misuse/TestVarInAggregateMisuse.py
  lldb-api :: functionalities/data-formatter/data-formatter-objc/TestDataFormatterObjNSException.py
  lldb-api :: commands/expression/import-std-module/sysroot/TestStdModuleSysroot.py
  lldb-api :: commands/expression/import-std-module/shared_ptr/TestSharedPtrFromStdModule.py
  lldb-api :: functionalities/data-formatter/data-formatter-stl/libcxx/list/TestDataFormatterLibcxxList.py
  lldb-api :: lang/objc/objc-foundation-dictionary-empty/TestNSDictionary0.py
  lldb-api :: lang/cpp/lambdas/TestLambdas.py
  lldb-api :: commands/expression/unicode-in-variable/TestUnicodeInVariable.py
  lldb-api :: functionalities/breakpoint/breakpoint_ignore_count/TestBreakpointIgnoreCount.py
  lldb-api :: commands/process/attach-resume/TestAttachResume.py
  lldb-api :: lang/objc/objc-static-method/TestObjCStaticMethod.py
  lldb-api :: functionalities/data-formatter/data-formatter-objc/cmtime/TestDataFormatterCMTime.py
  lldb-api :: functionalities/data-formatter/data-formatter-stl/libcxx/forward_list/TestDataFormatterLibcxxForwardList.py
  lldb-api :: functionalities/data-formatter/stringprinter/TestStringPrinter.py
  lldb-api :: commands/expression/multiline-completion/TestMultilineCompletion.py
  lldb-api :: lang/objcxx/class-name-clash/TestNameClash.py
  lldb-api :: commands/expression/radar_8638051/Test8638051.py
  lldb-api :: lang/objc/objc-runtime-ivars/TestRuntimeIvars.py
  lldb-api :: functionalities/load_using_paths/TestLoadUsingPaths.py
  lldb-api :: functionalities/tail_call_frames/ambiguous_tail_call_seq2/TestAmbiguousTailCallSeq2.py
  lldb-api :: functionalities/recursion/TestValueObjectRecursion.py
  lldb-api :: functionalities/thread/backtrace_limit/TestBacktraceLimit.py
  lldb-api :: commands/expression/call-function/TestCallUserDefinedFunction.py
  lldb-api :: functionalities/breakpoint/cpp/TestCPPBreakpointLocations.py
  lldb-api :: lang/cpp/this/TestCPPThis.py
  lldb-api :: lang/objc/objc-property/TestObjCProperty.py
  lldb-api :: commands/expression/class_template_specialization_empty_pack/TestClassTemplateSpecializationParametersHandling.py
  lldb-api :: commands/frame/var/TestFrameVar.py
  lldb-api :: lang/c/set_values/TestSetValues.py
  lldb-api :: commands/expression/import-std-module/forward_list-dbg-info-content/TestDbgInfoContentForwardListFromStdModule.py
  lldb-api :: lang/objc/rdar-11355592/TestRdar11355592.py
  lldb-api :: functionalities/data-formatter/data-formatter-stl/libcxx/multiset/TestDataFormatterLibcxxMultiSet.py
  lldb-api :: functionalities/inferior-crashing/recursive-inferior/TestRecursiveInferiorStep.py
  lldb-api :: lang/cpp/char8_t/TestCxxChar8_t.py
  lldb-api :: functionalities/data-formatter/data-formatter-stl/libcxx/string/TestDataFormatterLibcxxString.py
  lldb-api :: functionalities/data-formatter/data-formatter-objc/TestDataFormatterObjCNSContainer.py
  lldb-api :: lang/objc/foundation/TestObjCMethodsNSError.py
  lldb-api :: lang/cpp/typedef/TestCppTypedef.py
  lldb-api :: commands/expression/deleting-implicit-copy-constructor/TestDeletingImplicitCopyConstructor.py
  lldb-api :: functionalities/inline-stepping/TestInlineStepping.py
  lldb-api :: lang/objc/objc-class-method/TestObjCClassMethod.py
  lldb-api :: commands/apropos/with-process/TestAproposWithProcess.py
  lldb-api :: lang/cpp/scope/TestCppScope.py
  lldb-api :: commands/expression/fixits/TestFixIts.py
  lldb-api :: python_api/type/TestTypeList.py
  lldb-api :: types/TestShortType.py
  lldb-api :: functionalities/data-formatter/language_category_updates/TestDataFormatterLanguageCategoryUpdates.py
  lldb-api :: functionalities/data-formatter/parray/TestPrintArray.py
  lldb-api :: functionalities/thread/thread_exit/TestThreadExit.py
  lldb-api :: lang/cpp/signed_types/TestSignedTypes.py
  lldb-api :: commands/expression/ir-interpreter-phi-nodes/TestIRInterpreterPHINodes.py
  lldb-api :: functionalities/optimized_code/TestNoASanExceptionAfterEvalOP_piece.py
  lldb-api :: lang/objc/orderedset/TestOrderedSet.py
  lldb-api :: lang/cpp/modules-import/TestCXXModulesImport.py
  lldb-api :: lang/objc/rdar-10967107/TestRdar10967107.py
  lldb-api :: functionalities/rerun/TestRerun.py
  lldb-api :: commands/expression/dont_allow_jit/TestAllowJIT.py
  lldb-api :: functionalities/breakpoint/breakpoint_command/TestRegexpBreakCommand.py
  lldb-api :: lang/c/global_variables/TestGlobalVariables.py
  lldb-api :: commands/expression/top-level/TestTopLevelExprs.py
  lldb-api :: macosx/DBGSourcePathRemapping/TestDSYMSourcePathRemapping.py
  lldb-api :: macosx/find-app-in-bundle/TestFindAppInBundle.py
  lldb-api :: python_api/value/linked_list/TestValueAPILinkedList.py
  lldb-api :: functionalities/thread/concurrent_events/TestConcurrentBreakpointOneDelayBreakpointThreads.py
  lldb-api :: functionalities/thread/concurrent_events/TestConcurrentDelaySignalBreak.py
  lldb-api :: functionalities/data-formatter/data-formatter-objc/TestDataFormatterObjCCF.py
  lldb-api :: commands/process/signal/TestProcessSignal.py
  lldb-api :: functionalities/data-formatter/typedef_array/TestTypedefArray.py
  lldb-api :: lang/cpp/this_class_type_mixing/TestThisClassTypeMixing.py
  lldb-api :: functionalities/data-formatter/data-formatter-objc/TestDataFormatterObjCExpr.py
  lldb-api :: functionalities/non-overlapping-index-variable-i/TestIndexVariable.py
  lldb-api :: lang/cpp/bitfields/TestCppBitfields.py
  lldb-api :: commands/frame/diagnose/local-variable/TestLocalVariable.py
  lldb-api :: functionalities/value_md5_crash/TestValueMD5Crash.py
  lldb-api :: functionalities/tail_call_frames/thread_step_out_or_return/TestSteppingOutWithArtificialFrames.py
  lldb-api :: types/TestIntegerTypeExpr.py
  lldb-api :: functionalities/thread/concurrent_events/TestConcurrentTwoBreakpointsOneSignal.py
  lldb-api :: functionalities/data-formatter/ptr_ref_typedef/TestPtrRef2Typedef.py
  lldb-api :: tools/lldb-vscode/launch/TestVSCode_launch.py
  lldb-api :: lang/objc/self/TestObjCSelf.py
  lldb-api :: functionalities/data-formatter/nssetsynth/TestNSSetSynthetic.py
  lldb-api :: commands/expression/completion/TestExprCompletion.py
  lldb-api :: types/TestLongTypes.py
  lldb-api :: functionalities/var_path/TestVarPath.py
  lldb-api :: functionalities/pointer_num_children/TestPointerNumChildren.py
  lldb-api :: commands/expression/context-object-objc/TestContextObjectObjc.py
  lldb-api :: lang/cpp/unsigned_types/TestUnsignedTypes.py
  lldb-api :: lang/objcxx/objcxx-ivar-vector/TestIvarVector.py
  lldb-api :: lang/cpp/std-function-step-into-callable/TestStdFunctionStepIntoCallable.py
  lldb-api :: types/TestIntegerType.py
  lldb-api :: sample_test/TestSampleInlineTest.py
  lldb-api :: python_api/value/TestValueAPI.py
  lldb-api :: tools/lldb-vscode/breakpoint/TestVSCode_setFunctionBreakpoints.py
  lldb-api :: lang/objc/foundation/TestObjCMethodsNSArray.py
  lldb-api :: functionalities/data-formatter/nsdictionarysynth/TestNSDictionarySynthetic.py
  lldb-api :: functionalities/thread/thread_specific_break/TestThreadSpecificBreakpoint.py
  lldb-api :: lang/cpp/virtual-overload/TestVirtualOverload.py
  lldb-api :: lang/cpp/constructors/TestCppConstructors.py
  lldb-api :: commands/expression/completion-crash-incomplete-record/TestCompletionCrashIncompleteRecord.py
  lldb-api :: lang/objc/objc-builtin-types/TestObjCBuiltinTypes.py
  lldb-api :: lang/c/function_types/TestFunctionTypes.py
  lldb-api :: commands/expression/static-initializers/TestStaticInitializers.py
  lldb-api :: lang/c/blocks/TestBlocks.py
  lldb-api :: lang/c/enum_types/TestEnumTypes.py
  lldb-api :: types/TestFloatTypesExpr.py
  lldb-api :: functionalities/breakpoint/debugbreak/TestDebugBreak.py
  lldb-api :: functionalities/tail_call_frames/disambiguate_call_site/TestDisambiguateCallSite.py
  lldb-api :: functionalities/breakpoint/global_constructor/TestBreakpointInGlobalConstructor.py
  lldb-api :: commands/expression/completion-in-lambda-and-unnamed-class/TestCompletionInLambdaAndUnnamedClass.py
  lldb-api :: functionalities/data-formatter/data-formatter-objc/TestDataFormatterObjCNSBundle.py
  lldb-api :: functionalities/breakpoint/move_nearest/TestMoveNearest.py
  lldb-api :: commands/expression/context-object/TestContextObject.py
  lldb-api :: functionalities/completion/TestCompletion.py
  lldb-api :: macosx/find-dsym/deep-bundle/TestDeepBundle.py
  lldb-api :: functionalities/data-formatter/data-formatter-stl/libcxx/multimap/TestDataFormatterLibccMultiMap.py
  lldb-api :: lang/objc/foundation/TestObjectDescriptionAPI.py
  lldb-api :: functionalities/memory/cache/TestMemoryCache.py
  lldb-api :: commands/frame/diagnose/dereference-argument/TestDiagnoseDereferenceArgument.py
  lldb-api :: functionalities/data-formatter/data-formatter-advanced/TestDataFormatterAdv.py
  lldb-api :: functionalities/data-formatter/data-formatter-stl/libcxx/map/TestDataFormatterLibccMap.py
  lldb-api :: lang/c/tls_globals/TestTlsGlobals.py
  lldb-api :: functionalities/data-formatter/data-formatter-python-synth/TestDataFormatterPythonSynth.py
  lldb-api :: tools/lldb-vscode/breakpoint/TestVSCode_setBreakpoints.py
  lldb-api :: macosx/find-dsym/bundle-with-dot-in-filename/TestBundleWithDotInFilename.py
  lldb-api :: functionalities/breakpoint/comp_dir_symlink/TestCompDirSymLink.py
  lldb-api :: lang/objcxx/cxx-bridged-po/TestObjCXXBridgedPO.py
  lldb-api :: lang/c/register_variables/TestRegisterVariables.py
  lldb-api :: lang/cpp/nested-class-other-compilation-unit/TestNestedClassWithParentInAnotherCU.py
  lldb-api :: functionalities/inferior-crashing/recursive-inferior/TestRecursiveInferior.py
  lldb-api :: lang/objc/single-entry-dictionary/TestObjCSingleEntryDictionary.py
  lldb-api :: functionalities/data-formatter/data-formatter-objc/TestDataFormatterObjCPlain.py
  lldb-api :: functionalities/type_lookup/TestTypeLookup.py
  lldb-api :: functionalities/thread_plan/TestThreadPlanCommands.py
  lldb-api :: python_api/frame/get-variables/TestGetVariables.py
  lldb-api :: functionalities/data-formatter/array_typedef/TestArrayTypedef.py
  lldb-api :: functionalities/step-avoids-no-debug/TestStepNoDebug.py
  lldb-api :: tools/lldb-vscode/variables/TestVSCode_variables.py
  lldb-api :: commands/expression/regression-access-function-template-in-record/TestRegressionAccessFunctionTemplateInRecord.py
  lldb-api :: functionalities/data-formatter/data-formatter-stl/libcxx/initializerlist/TestInitializerList.py
  lldb-api :: lang/objc/objc-static-method-stripped/TestObjCStaticMethodStripped.py
  lldb-api :: functionalities/thread/exit_during_expression/TestExitDuringExpression.py
  lldb-api :: functionalities/data-formatter/ostypeformatting/TestFormattersOsType.py
  lldb-api :: lang/cpp/dynamic-value-same-basename/TestDynamicValueSameBase.py
  lldb-api :: lang/objc/objc-super/TestObjCSuper.py
  lldb-api :: lang/cpp/template-function/TestTemplateFunctions.py
  lldb-api :: lang/cpp/global_variables/TestCPPGlobalVariables.py
  lldb-api :: lang/cpp/bool/TestCPPBool.py
  lldb-api :: commands/expression/inline-namespace/TestInlineNamespace.py
  lldb-api :: functionalities/thread/concurrent_events/TestConcurrentBreakpointDelayBreakpointOneSignal.py
  lldb-api :: commands/expression/codegen-crash-typedefdecl-not-in_declcontext/TestCodegenCrashTypedefDeclNotInDeclContext.py
  lldb-api :: lang/objc/conflicting-definition/TestConflictingDefinition.py
  lldb-api :: lang/objc/objc_direct-methods/TestObjCDirectMethods.py
  lldb-api :: commands/expression/char/TestExprsChar.py
  lldb-api :: functionalities/limit-debug-info/TestLimitDebugInfo.py
  lldb-api :: lang/cpp/exceptions/TestCPPExceptionBreakpoints.py
  lldb-api :: macosx/nslog/TestDarwinNSLogOutput.py
  lldb-api :: commands/expression/rdar44436068/Test128BitsInteger.py
  lldb-api :: macosx/indirect_symbol/TestIndirectSymbols.py
  lldb-api :: functionalities/data-formatter/data-formatter-stl/libcxx/function/TestLibCxxFunction.py
  lldb-api :: functionalities/thread/step_out/TestThreadStepOut.py
  lldb-api :: commands/expression/import-std-module/vector-of-vectors/TestVectorOfVectorsFromStdModule.py
  lldb-api :: lang/c/conflicting-symbol/TestConflictingSymbol.py
  lldb-api :: commands/statistics/basic/TestStats.py
  lldb-api :: lang/cpp/rvalue-references/TestRvalueReferences.py
  lldb-api :: lang/cpp/enum_types/TestCPP11EnumTypes.py
  lldb-api :: functionalities/tail_call_frames/sbapi_support/TestTailCallFrameSBAPI.py
  lldb-api :: functionalities/thread/backtrace_all/TestBacktraceAll.py
  lldb-api :: functionalities/data-formatter/data-formatter-objc/TestDataFormatterObjCNSError.py
  lldb-api :: lang/objc/modules/TestObjCModules.py
  lldb-api :: python_api/get-value-32bit-int/TestGetValue32BitInt.py
  lldb-api :: functionalities/type_completion/TestTypeCompletion.py
  lldb-api :: functionalities/thread/concurrent_events/TestConcurrentSignalDelayBreak.py
  lldb-api :: commands/frame/diagnose/bad-reference/TestBadReference.py
  lldb-api :: python_api/process/read-mem-cstring/TestReadMemCString.py
  lldb-api :: python_api/sbdata/TestSBData.py
  lldb-api :: functionalities/data-formatter/data-formatter-stl/libcxx/optional/TestDataFormatterLibcxxOptional.py
  lldb-api :: lang/c/stepping/TestThreadStepping.py
  lldb-api :: functionalities/data-formatter/vector-types/TestVectorTypesFormatting.py
  lldb-api :: commands/expression/call-function/TestCallStopAndContinue.py
  lldb-api :: lang/objc/objc-optimized/TestObjcOptimized.py
  lldb-api :: lang/objc/global_ptrs/TestGlobalObjects.py
  lldb-api :: lang/cpp/static_methods/TestCPPStaticMethods.py
  lldb-api :: python_api/lldbutil/process/TestPrintStackTraces.py
  lldb-api :: lang/c/find_struct_type/TestFindStructTypes.py
  lldb-api :: commands/expression/diagnostics/TestExprDiagnostics.py
  lldb-api :: commands/expression/radar_9531204/TestPrintfAfterUp.py
  lldb-api :: lang/objc/radar-9691614/TestObjCMethodReturningBOOL.py
  lldb-api :: python_api/objc_type/TestObjCType.py
  lldb-api :: python_api/process/TestProcessAPI.py
  lldb-api :: commands/disassemble/basic/TestDisassembleBreakpoint.py
  lldb-api :: functionalities/data-formatter/data-formatter-smart-array/TestDataFormatterSmartArray.py
  lldb-api :: lang/cpp/function_refs/TestFunctionRefs.py
  lldb-api :: functionalities/step_scripted/TestStepScripted.py
  lldb-api :: commands/expression/two-files/TestObjCTypeQueryFromOtherCompileUnit.py
  lldb-api :: python_api/lldbutil/frame/TestFrameUtils.py
  lldb-api :: commands/expression/no-deadlock/TestExprDoesntBlock.py
  lldb-api :: lang/cpp/const_this/TestConstThis.py
  lldb-api :: functionalities/breakpoint/hardware_breakpoints/hardware_breakpoint_on_multiple_threads/TestHWBreakMultiThread.py
  lldb-api :: functionalities/data-formatter/cstring-utf8-summary/TestCstringUnicode.py
  lldb-api :: functionalities/breakpoint/breakpoint_set_restart/TestBreakpointSetRestart.py
  lldb-api :: lang/cpp/namespace/TestNamespaceLookup.py
  lldb-api :: lang/c/vla/TestVLA.py
  lldb-api :: commands/expression/weak_symbols/TestWeakSymbols.py
  lldb-api :: functionalities/data-formatter/data-formatter-categories/TestDataFormatterCategories.py
  lldb-api :: functionalities/breakpoint/breakpoint_options/TestBreakpointOptions.py
  lldb-api :: functionalities/thread/num_threads/TestNumThreads.py
  lldb-api :: commands/expression/xvalue/TestXValuePrinting.py
  lldb-api :: lang/cpp/operator-overload/TestOperatorOverload.py
  lldb-api :: commands/source/info/TestSourceInfo.py
  lldb-api :: commands/expression/save_jit_objects/TestSaveJITObjects.py
  lldb-api :: functionalities/lazy-loading/TestLazyLoading.py
  lldb-api :: lang/c/stepping/TestStepAndBreakpoints.py
  lldb-api :: source-manager/TestSourceManager.py
  lldb-api :: commands/expression/pr35310/TestExprsBug35310.py
  lldb-api :: lang/cpp/dynamic-value/TestDynamicValue.py
  lldb-api :: macosx/profile_vrs_detach/TestDetachVrsProfile.py
  lldb-api :: functionalities/float-display/TestFloatDisplay.py
  lldb-api :: functionalities/load_unload/TestLoadUnload.py
  lldb-api :: types/TestFloatTypes.py
  lldb-api :: functionalities/data-formatter/compactvectors/TestCompactVectors.py
  lldb-api :: functionalities/data-formatter/data-formatter-caching/TestDataFormatterCaching.py
  lldb-api :: lang/objc/modules-inline-functions/TestModulesInlineFunctions.py
  lldb-api :: commands/expression/import-std-module/weak_ptr-dbg-info-content/TestDbgInfoContentWeakPtrFromStdModule.py
  lldb-api :: lang/c/complex_int/TestComplexInt.py
  lldb-api :: functionalities/thread/concurrent_events/TestConcurrentTwoBreakpointThreads.py
  lldb-api :: python_api/symbol-context/TestSymbolContext.py
  lldb-api :: functionalities/breakpoint/auto_continue/TestBreakpointAutoContinue.py
  lldb-api :: types/TestCharTypeExpr.py
  lldb-api :: commands/gui/basic/TestGuiBasic.py
  lldb-api :: lang/cpp/member-and-local-vars-with-same-name/TestMembersAndLocalsWithSameName.py
  lldb-api :: commands/target/stop-hooks/TestStopHooks.py
  lldb-api :: lang/objc/objc-new-syntax/TestObjCNewSyntaxLiteral.py
  lldb-api :: lang/cpp/multiple-inheritance/TestCppMultipleInheritance.py
  lldb-api :: lang/objc/forward-decl/TestForwardDecl.py
  lldb-api :: functionalities/memory/find/TestMemoryFind.py
  lldb-api :: functionalities/thread/concurrent_events/TestConcurrentManyCrash.py
  lldb-api :: lang/objc/objc-new-syntax/TestObjCNewSyntaxArray.py
  lldb-api :: functionalities/tail_call_frames/disambiguate_paths_to_common_sink/TestDisambiguatePathsToCommonSink.py
  lldb-api :: functionalities/process_group/TestChangeProcessGroup.py
  lldb-api :: functionalities/data-formatter/data-formatter-stl/libcxx/vbool/TestDataFormatterLibcxxVBool.py
  lldb-api :: lang/objc/foundation/TestRuntimeTypes.py
  lldb-api :: functionalities/unwind/zeroth_frame/TestZerothFrame.py
  lldb-api :: python_api/frame/inlines/TestInlinedFrame.py
  lldb-api :: commands/expression/scoped_enums/TestScopedEnumType.py
  lldb-api :: functionalities/dead-strip/TestDeadStrip.py
  lldb-api :: functionalities/ptr_refs/TestPtrRefs.py
  lldb-api :: python_api/process/io/TestProcessIO.py
  lldb-api :: commands/frame/diagnose/inheritance/TestDiagnoseInheritance.py
  lldb-api :: functionalities/data-formatter/data-formatter-objc/TestDataFormatterObjCKVO.py
  lldb-api :: functionalities/data-formatter/varscript_formatting/TestDataFormatterVarScriptFormatting.py
  lldb-api :: lang/objc/blocks/TestObjCIvarsInBlocks.py
  lldb-api :: lang/cpp/namespace_definitions/TestNamespaceDefinitions.py
  lldb-api :: commands/expression/po_verbosity/TestPoVerbosity.py
  lldb-api :: functionalities/data-formatter/hexcaps/TestDataFormatterHexCaps.py
  lldb-api :: functionalities/set-data/TestSetData.py
  lldb-api :: lang/cpp/template/TestTemplateArgs.py
  lldb-api :: lang/c/const_variables/TestConstVariables.py
  lldb-api :: lang/cpp/trivial_abi/TestTrivialABI.py
  lldb-api :: functionalities/conditional_break/TestConditionalBreak.py
  lldb-api :: commands/expression/import-std-module/deque-basic/TestDequeFromStdModule.py
  lldb-api :: functionalities/thread/crash_during_step/TestCrashDuringStep.py
  lldb-api :: lang/objc/real-definition/TestRealDefinition.py
  lldb-api :: lang/cpp/symbols/TestSymbols.py
  lldb-api :: driver/batch_mode/TestBatchMode.py
  lldb-api :: types/TestDoubleTypes.py
  lldb-api :: functionalities/breakpoint/address_breakpoints/TestBadAddressBreakpoints.py
  lldb-api :: lang/c/local_variables/TestLocalVariables.py
  lldb-api :: functionalities/data-formatter/nsarraysynth/TestNSArraySynthetic.py
  lldb-api :: lang/cpp/llvm-style/TestLLVMStyle.py
  lldb-api :: functionalities/thread/ignore_suspended/TestIgnoreSuspendedThread.py
  lldb-api :: lang/c/struct_types/TestStructTypes.py
  lldb-api :: lang/c/strings/TestCStrings.py
  lldb-api :: functionalities/data-formatter/pyobjsynthprovider/TestPyObjSynthProvider.py
  lldb-api :: lang/objc/variadic_methods/TestVariadicMethods.py
  lldb-api :: python_api/sbvalue_const_addrof/TestSBValueConstAddrOf.py
  lldb-api :: lang/c/anonymous/TestAnonymous.py
  lldb-api :: commands/expression/rdar42038760/TestScalarURem.py
  lldb-api :: commands/command/nested_alias/TestNestedAlias.py
  lldb-api :: functionalities/data-formatter/data-formatter-stl/libcxx/set/TestDataFormatterLibcxxSet.py
  lldb-api :: commands/frame/var-scope/TestFrameVariableScope.py
  lldb-api :: lang/objc/objc-stepping/TestObjCStepping.py
  lldb-api :: functionalities/thread/create_after_attach/TestCreateAfterAttach.py
  lldb-api :: functionalities/thread/exit_during_break/TestExitDuringBreak.py
  lldb-api :: functionalities/data-formatter/data-formatter-synthtype/TestDataFormatterSynthType.py
  lldb-api :: commands/thread/select/TestThreadSelect.py
  lldb-api :: commands/expression/radar_9673664/TestExprHelpExamples.py
  lldb-api :: commands/expression/dollar-in-variable/TestDollarInVariable.py
  lldb-api :: functionalities/breakpoint/scripted_bkpt/TestScriptedResolver.py
  lldb-api :: commands/expression/import-std-module/shared_ptr-dbg-info-content/TestSharedPtrDbgInfoContentFromStdModule.py
  lldb-api :: python_api/frame/TestFrames.py
  lldb-api :: lang/objc/modules-auto-import/TestModulesAutoImport.py
  lldb-api :: functionalities/data-formatter/data-formatter-cpp/TestDataFormatterCpp.py
  lldb-api :: lang/cpp/chained-calls/TestCppChainedCalls.py
  lldb-api :: commands/expression/import-std-module/weak_ptr/TestWeakPtrFromStdModule.py
  lldb-api :: commands/expression/entry-bp/TestExprEntryBP.py
  lldb-api :: functionalities/unwind/noreturn/TestNoreturnUnwind.py
  lldb-api :: lang/c/step-target/TestStepTarget.py
  lldb-api :: commands/expression/import-std-module/list/TestListFromStdModule.py
  lldb-api :: functionalities/data-formatter/poarray/TestPrintObjectArray.py
  lldb-api :: functionalities/param_entry_vals/basic_entry_values/TestBasicEntryValues.py
  lldb-api :: functionalities/breakpoint/breakpoint_command/TestBreakpointCommand.py
  lldb-api :: commands/expression/ignore-artificial-constructors/TestIgnoreArtificialConstructors.py
  lldb-api :: functionalities/data-formatter/user-format-vs-summary/TestUserFormatVsSummary.py
  lldb-api :: macosx/save_crashlog/TestSaveCrashlog.py
  lldb-api :: functionalities/data-formatter/frameformat_smallstruct/TestFrameFormatSmallStruct.py
  lldb-api :: lang/mixed/TestMixedLanguages.py
  lldb-api :: commands/expression/options/TestExprOptions.py
  lldb-api :: lang/objc/hidden-ivars/TestHiddenIvars.py
  lldb-api :: functionalities/plugins/python_os_plugin/TestPythonOSPlugin.py
  lldb-api :: functionalities/breakpoint/dummy_target_breakpoints/TestBreakpointsWithNoTargets.py
  lldb-api :: lang/objc/print-obj/TestPrintObj.py
  lldb-api :: functionalities/breakpoint/source_regexp/TestSourceRegexBreakpoints.py
  lldb-api :: functionalities/tail_call_frames/cross_object/TestCrossObjectTailCalls.py
  lldb-api :: commands/expression/test/TestExprs.py
  lldb-api :: lang/cpp/limit-debug-info/TestWithLimitDebugInfo.py
  lldb-api :: lang/cpp/operators/TestCppOperators.py
  lldb-api :: lang/objc/objc-struct-argument/TestObjCStructArgument.py
  lldb-api :: lang/c/inlines/TestRedefinitionsInInlines.py
  lldb-api :: functionalities/breakpoint/breakpoint_locations/TestBreakpointLocations.py
  lldb-api :: functionalities/breakpoint/breakpoint_conditions/TestBreakpointConditions.py
  lldb-api :: functionalities/data-formatter/data-formatter-stl/libcxx/atomic/TestLibCxxAtomic.py
  lldb-api :: linux/builtin_trap/TestBuiltinTrap.py
  lldb-api :: commands/expression/persist_objc_pointeetype/TestPersistObjCPointeeType.py
  lldb-api :: types/TestDoubleTypesExpr.py
  lldb-api :: commands/process/launch/TestProcessLaunch.py
  lldb-api :: functionalities/inferior-crashing/TestInferiorCrashingStep.py
  lldb-api :: functionalities/data-formatter/data-formatter-objc/TestDataFormatterObjCNSURL.py
  lldb-api :: commands/frame/language/TestGuessLanguage.py
  lldb-api :: functionalities/tail_call_frames/thread_step_out_message/TestArtificialFrameStepOutMessage.py
  lldb-api :: python_api/exprpath_synthetic/TestExprPathSynthetic.py
  lldb-api :: functionalities/thread/step_until/TestStepUntil.py
  lldb-api :: functionalities/data-formatter/data-formatter-named-summaries/TestDataFormatterNamedSummaries.py
  lldb-api :: lang/objc/direct-dispatch-step/TestObjCDirectDispatchStepping.py
  lldb-api :: functionalities/return-value/TestReturnValue.py
  lldb-api :: python_api/class_members/TestSBTypeClassMembers.py
  lldb-api :: python_api/target/TestTargetAPI.py
  lldb-api :: commands/expression/import-std-module/forward_list/TestForwardListFromStdModule.py
  lldb-api :: lang/cpp/extern_c/TestExternCSymbols.py
  lldb-api :: lang/c/shared_lib/TestSharedLib.py
  lldb-api :: commands/expression/import-std-module/conflicts/TestStdModuleWithConflicts.py
  lldb-api :: functionalities/data-formatter/type_summary_list_script/TestTypeSummaryListScript.py
  lldb-api :: lang/objc/unicode-string/TestUnicodeString.py
  lldb-api :: lang/cpp/alignas_base_class/TestAlignAsBaseClass.py
  lldb-api :: commands/frame/select/TestFrameSelect.py
  lldb-api :: functionalities/memory-region/TestMemoryRegion.py
  lldb-api :: lang/c/shared_lib_stripped_symbols/TestSharedLibStrippedSymbols.py
  lldb-api :: tools/lldb-vscode/step/TestVSCode_step.py
  lldb-api :: functionalities/data-formatter/data-formatter-script/TestDataFormatterScript.py
  lldb-api :: lang/cpp/frame-var-anon-unions/TestFrameVariableAnonymousUnions.py


Testing Time: 702.88s
  Unsupported      :  265
  Passed           : 1262
  Expectedly Failed:    5
  Timed Out        :    3
  Failed           :  539
FAILED: tools/lldb/test/CMakeFiles/check-lldb-lit 
cd /Users/buildslave/jenkins/workspace/lldb-cmake-matrix/lldb-build/tools/lldb/test && /usr/local/Frameworks/Python.framework/Versions/3.7/bin/python3.7 /Users/buildslave/jenkins/workspace/lldb-cmake-matrix/lldb-build/./bin/llvm-lit -v --time-tests --shuffle --xunit-xml-output=/Users/buildslave/jenkins/workspace/lldb-cmake-matrix/test/results.xml -v /Users/buildslave/jenkins/workspace/lldb-cmake-matrix/lldb-build/tools/lldb/test
ninja: build stopped: subcommand failed.
Command failed: Command '['/usr/bin/env', 'TERM=vt100', '/usr/local/bin/ninja', '-v', 'check-lldb']' returned non-zero exit status 1.
Command: ['/usr/bin/env', 'TERM=vt100', '/usr/local/bin/ninja', '-v', 'check-lldb']
+ set -e