UnstableConsole Output

Skipping 44,049 KB.. Full Log

Hide Details

Hide Details

Adding tearDown hook: self.addTearDownHook(lambda: os.remove(self.getBuildArtifact(self.inferior)))

Hide Details

Hide Details

FAIL: LLDB (/Users/buildslave/jenkins/workspace/lldb-cmake-matrix/lldb-build/bin/clang-x86_64) :: test_sb_api_listener_event_description (TestMultithreaded.SBBreakpointCallbackCase) Executing tearDown hook: self.addTearDownHook(lambda: os.remove(self.getBuildArtifact(self.inferior)))

Hide Details

Hide Details

Executing tearDown hook: self.addTearDownHook(lambda: os.remove(src))

Hide Details

Hide Details

Executing tearDown hook: self.addTearDownHook(lambda: os.remove(src))

Hide Details

Hide Details

Executing tearDown hook: self.addTearDownHook(lambda: os.remove(src))

Hide Details

Hide Details

Executing tearDown hook: self.addTearDownHook(lambda: os.remove(src))

Hide Details

Hide Details

Executing tearDown hook: self.addTearDownHook(lambda: os.remove(src))

Hide Details

Hide Details

Executing tearDown hook: self.addTearDownHook(lambda: os.remove(src))

Hide Details

Hide Details

Executing tearDown hook: self.addTearDownHook(lambda: os.remove(src))

Hide Details

Hide Details

runCmd: settings clear -all output:

Hide Details

runCmd: settings set symbols.enable-external-lookup false output:

Hide Details

runCmd: settings set target.inherit-tcc true output:

Hide Details

runCmd: settings set target.detach-on-error false output:

Hide Details

runCmd: settings set target.auto-apply-fixits false output:

Hide Details

runCmd: settings set plugin.process.gdb-remote.packet-timeout 60 output:

Hide Details

runCmd: settings set symbols.clang-modules-cache-path "/Users/buildslave/jenkins/workspace/lldb-cmake-matrix/lldb-build/lldb-test-build.noindex/module-cache-lldb/lldb-api" output:

Hide Details

runCmd: settings set use-color false output:

Hide Details

runCmd: setting set target.prefer-dynamic-value no-dynamic-values output:

Hide Details

Adding tearDown hook: self.addTearDownHook(lambda: os.remove(src))

Hide Details

Hide Details

Adding tearDown hook: self.addTearDownHook(lambda: os.remove(src))

Hide Details

Hide Details

Adding tearDown hook: self.addTearDownHook(lambda: os.remove(src))

Hide Details

Hide Details

Adding tearDown hook: self.addTearDownHook(lambda: os.remove(src))

Hide Details

Hide Details

Adding tearDown hook: self.addTearDownHook(lambda: os.remove(src))

Hide Details

Hide Details

Adding tearDown hook: self.addTearDownHook(lambda: os.remove(src))

Hide Details

Hide Details

Adding tearDown hook: self.addTearDownHook(lambda: os.remove(src))

Hide Details

Hide Details

FAIL: LLDB (/Users/buildslave/jenkins/workspace/lldb-cmake-matrix/lldb-build/bin/clang-x86_64) :: test_sb_api_listener_event_process_state (TestMultithreaded.SBBreakpointCallbackCase) Executing tearDown hook: self.addTearDownHook(lambda: os.remove(src))

Hide Details

Hide Details

Executing tearDown hook: self.addTearDownHook(lambda: os.remove(src))

Hide Details

Hide Details

Executing tearDown hook: self.addTearDownHook(lambda: os.remove(src))

Hide Details

Hide Details

Executing tearDown hook: self.addTearDownHook(lambda: os.remove(src))

Hide Details

Hide Details

Executing tearDown hook: self.addTearDownHook(lambda: os.remove(src))

Hide Details

Hide Details

Executing tearDown hook: self.addTearDownHook(lambda: os.remove(src))

Hide Details

Hide Details

Executing tearDown hook: self.addTearDownHook(lambda: os.remove(src))

Hide Details

Hide Details

runCmd: settings clear -all output:

Hide Details

runCmd: settings set symbols.enable-external-lookup false output:

Hide Details

runCmd: settings set target.inherit-tcc true output:

Hide Details

runCmd: settings set target.detach-on-error false output:

Hide Details

runCmd: settings set target.auto-apply-fixits false output:

Hide Details

runCmd: settings set plugin.process.gdb-remote.packet-timeout 60 output:

Hide Details

runCmd: settings set symbols.clang-modules-cache-path "/Users/buildslave/jenkins/workspace/lldb-cmake-matrix/lldb-build/lldb-test-build.noindex/module-cache-lldb/lldb-api" output:

Hide Details

runCmd: settings set use-color false output:

Hide Details

runCmd: setting set target.prefer-dynamic-value no-dynamic-values output:

Hide Details

Adding tearDown hook: self.addTearDownHook(lambda: os.remove(src))

Hide Details

Hide Details

Adding tearDown hook: self.addTearDownHook(lambda: os.remove(src))

Hide Details

Hide Details

Adding tearDown hook: self.addTearDownHook(lambda: os.remove(src))

Hide Details

Hide Details

Adding tearDown hook: self.addTearDownHook(lambda: os.remove(src))

Hide Details

Hide Details

Adding tearDown hook: self.addTearDownHook(lambda: os.remove(src))

Hide Details

Hide Details

Adding tearDown hook: self.addTearDownHook(lambda: os.remove(src))

Hide Details

Hide Details

Adding tearDown hook: self.addTearDownHook(lambda: os.remove(src))

Hide Details

Hide Details

FAIL: LLDB (/Users/buildslave/jenkins/workspace/lldb-cmake-matrix/lldb-build/bin/clang-x86_64) :: test_sb_api_listener_resume (TestMultithreaded.SBBreakpointCallbackCase) Executing tearDown hook: self.addTearDownHook(lambda: os.remove(src))

Hide Details

Hide Details

Executing tearDown hook: self.addTearDownHook(lambda: os.remove(src))

Hide Details

Hide Details

Executing tearDown hook: self.addTearDownHook(lambda: os.remove(src))

Hide Details

Hide Details

Executing tearDown hook: self.addTearDownHook(lambda: os.remove(src))

Hide Details

Hide Details

Executing tearDown hook: self.addTearDownHook(lambda: os.remove(src))

Hide Details

Hide Details

Executing tearDown hook: self.addTearDownHook(lambda: os.remove(src))

Hide Details

Hide Details

Executing tearDown hook: self.addTearDownHook(lambda: os.remove(src))

Hide Details

Hide Details

Restore dir to: /Users/buildslave/jenkins/workspace/lldb-cmake-matrix/lldb-build/tools/lldb/test ====================================================================== ERROR: test_sb_api_listener_event_description (TestMultithreaded.SBBreakpointCallbackCase) Test the description of an SBListener breakpoint event is valid. ---------------------------------------------------------------------- Error when building test subject.

Hide Details

Build Command: make VPATH=/Users/buildslave/jenkins/workspace/lldb-cmake-matrix/llvm-project/lldb/test/API/api/multithreaded -C /Users/buildslave/jenkins/workspace/lldb-cmake-matrix/lldb-build/lldb-test-build.noindex/api/multithreaded/TestMultithreaded.test_sb_api_listener_event_description -I /Users/buildslave/jenkins/workspace/lldb-cmake-matrix/llvm-project/lldb/test/API/api/multithreaded -I /Users/buildslave/jenkins/workspace/lldb-cmake-matrix/llvm-project/lldb/packages/Python/lldbsuite/test/make -f /Users/buildslave/jenkins/workspace/lldb-cmake-matrix/llvm-project/lldb/test/API/api/multithreaded/Makefile all ARCH=x86_64 CC="/Users/buildslave/jenkins/workspace/lldb-cmake-matrix/lldb-build/bin/clang" DSYMUTIL="/Users/buildslave/jenkins/workspace/lldb-cmake-matrix/lldb-build/./bin/dsymutil" CLANG_MODULE_CACHE_DIR=/Users/buildslave/jenkins/workspace/lldb-cmake-matrix/lldb-build/lldb-test-build.noindex/module-cache-clang/lldb-api CXX_SOURCES='driver.cpp listener_test.cpp test_listener_event_description.cpp' EXE='test_listener_event_description' CFLAGS_EXTRAS='-std=c++11 -stdlib=libc++ -I/Users/buildslave/jenkins/workspace/lldb-cmake-matrix/llvm-project/lldb/include' LD_EXTRAS='-L/Users/buildslave/jenkins/workspace/lldb-cmake-matrix/lldb-build/./lib -llldb -Wl,-rpath,/Users/buildslave/jenkins/workspace/lldb-cmake-matrix/lldb-build/./lib'

Hide Details

Build Command Output: /Users/buildslave/jenkins/workspace/lldb-cmake-matrix/lldb-build/bin/clang -std=c++11 -g -O0 -fno-builtin -isysroot "/Applications/Xcode.app/Contents/Developer/Platforms/MacOSX.platform/Developer/SDKs/MacOSX10.15.sdk" -arch x86_64 -I/Users/buildslave/jenkins/workspace/lldb-cmake-matrix/llvm-project/lldb/packages/Python/lldbsuite/test/make/../../../../../include -I/Users/buildslave/jenkins/workspace/lldb-cmake-matrix/llvm-project/lldb/test/API/api/multithreaded -I/Users/buildslave/jenkins/workspace/lldb-cmake-matrix/llvm-project/lldb/packages/Python/lldbsuite/test/make -include /Users/buildslave/jenkins/workspace/lldb-cmake-matrix/llvm-project/lldb/packages/Python/lldbsuite/test/make/test_common.h -fno-limit-debug-info -std=c++11 -stdlib=libc++ -I/Users/buildslave/jenkins/workspace/lldb-cmake-matrix/llvm-project/lldb/include --driver-mode=g++ -c -o driver.o driver.cpp /Users/buildslave/jenkins/workspace/lldb-cmake-matrix/lldb-build/bin/clang -std=c++11 -g -O0 -fno-builtin -isysroot "/Applications/Xcode.app/Contents/Developer/Platforms/MacOSX.platform/Developer/SDKs/MacOSX10.15.sdk" -arch x86_64 -I/Users/buildslave/jenkins/workspace/lldb-cmake-matrix/llvm-project/lldb/packages/Python/lldbsuite/test/make/../../../../../include -I/Users/buildslave/jenkins/workspace/lldb-cmake-matrix/llvm-project/lldb/test/API/api/multithreaded -I/Users/buildslave/jenkins/workspace/lldb-cmake-matrix/llvm-project/lldb/packages/Python/lldbsuite/test/make -include /Users/buildslave/jenkins/workspace/lldb-cmake-matrix/llvm-project/lldb/packages/Python/lldbsuite/test/make/test_common.h -fno-limit-debug-info -std=c++11 -stdlib=libc++ -I/Users/buildslave/jenkins/workspace/lldb-cmake-matrix/llvm-project/lldb/include --driver-mode=g++ -c -o listener_test.o listener_test.cpp /Users/buildslave/jenkins/workspace/lldb-cmake-matrix/lldb-build/bin/clang -std=c++11 -g -O0 -fno-builtin -isysroot "/Applications/Xcode.app/Contents/Developer/Platforms/MacOSX.platform/Developer/SDKs/MacOSX10.15.sdk" -arch x86_64 -I/Users/buildslave/jenkins/workspace/lldb-cmake-matrix/llvm-project/lldb/packages/Python/lldbsuite/test/make/../../../../../include -I/Users/buildslave/jenkins/workspace/lldb-cmake-matrix/llvm-project/lldb/test/API/api/multithreaded -I/Users/buildslave/jenkins/workspace/lldb-cmake-matrix/llvm-project/lldb/packages/Python/lldbsuite/test/make -include /Users/buildslave/jenkins/workspace/lldb-cmake-matrix/llvm-project/lldb/packages/Python/lldbsuite/test/make/test_common.h -fno-limit-debug-info -std=c++11 -stdlib=libc++ -I/Users/buildslave/jenkins/workspace/lldb-cmake-matrix/llvm-project/lldb/include --driver-mode=g++ -c -o test_listener_event_description.o test_listener_event_description.cpp make: *** [test_listener_event_description.o] Killed: 9

Hide Details

Test Directory: /Users/buildslave/jenkins/workspace/lldb-cmake-matrix/llvm-project/lldb/test/API/api/multithreaded ====================================================================== ERROR: test_sb_api_listener_event_process_state (TestMultithreaded.SBBreakpointCallbackCase) Test that a registered SBListener receives events when a process ---------------------------------------------------------------------- Traceback (most recent call last): File "/Users/buildslave/jenkins/workspace/lldb-cmake-matrix/llvm-project/lldb/packages/Python/lldbsuite/test/decorators.py", line 135, in wrapper return func(*args, **kwargs) File "/Users/buildslave/jenkins/workspace/lldb-cmake-matrix/llvm-project/lldb/packages/Python/lldbsuite/test/decorators.py", line 437, in wrapper func(*args, **kwargs) File "/Users/buildslave/jenkins/workspace/lldb-cmake-matrix/llvm-project/lldb/test/API/api/multithreaded/TestMultithreaded.py", line 70, in test_sb_api_listener_event_process_state 'test_listener_event_process_state') File "/Users/buildslave/jenkins/workspace/lldb-cmake-matrix/llvm-project/lldb/test/API/api/multithreaded/TestMultithreaded.py", line 91, in build_and_test if self.getLldbArchitecture() != self.getArchitecture(): File "/Users/buildslave/jenkins/workspace/lldb-cmake-matrix/llvm-project/lldb/packages/Python/lldbsuite/test/lldbtest.py", line 1341, in getLldbArchitecture output = check_output(command) File "/usr/local/Cellar/python/3.7.0/Frameworks/Python.framework/Versions/3.7/lib/python3.7/subprocess.py", line 376, in check_output **kwargs).stdout File "/usr/local/Cellar/python/3.7.0/Frameworks/Python.framework/Versions/3.7/lib/python3.7/subprocess.py", line 468, in run output=stdout, stderr=stderr) subprocess.CalledProcessError: Command '['/Users/buildslave/jenkins/workspace/lldb-cmake-matrix/lldb-build/bin/lldb', '-o', 'file /Users/buildslave/jenkins/workspace/lldb-cmake-matrix/lldb-build/bin/lldb', '-o', 'quit']' died with <Signals.SIGKILL: 9>. Config=x86_64-/Users/buildslave/jenkins/workspace/lldb-cmake-matrix/lldb-build/bin/clang ====================================================================== ERROR: test_sb_api_listener_resume (TestMultithreaded.SBBreakpointCallbackCase) Test that a process can be resumed from a non-main thread. ---------------------------------------------------------------------- Traceback (most recent call last): File "/Users/buildslave/jenkins/workspace/lldb-cmake-matrix/llvm-project/lldb/packages/Python/lldbsuite/test/decorators.py", line 135, in wrapper return func(*args, **kwargs) File "/Users/buildslave/jenkins/workspace/lldb-cmake-matrix/llvm-project/lldb/packages/Python/lldbsuite/test/decorators.py", line 437, in wrapper func(*args, **kwargs) File "/Users/buildslave/jenkins/workspace/lldb-cmake-matrix/llvm-project/lldb/packages/Python/lldbsuite/test/decorators.py", line 135, in wrapper return func(*args, **kwargs) File "/Users/buildslave/jenkins/workspace/lldb-cmake-matrix/llvm-project/lldb/test/API/api/multithreaded/TestMultithreaded.py", line 82, in test_sb_api_listener_resume 'test_listener_resume') File "/Users/buildslave/jenkins/workspace/lldb-cmake-matrix/llvm-project/lldb/test/API/api/multithreaded/TestMultithreaded.py", line 91, in build_and_test if self.getLldbArchitecture() != self.getArchitecture(): File "/Users/buildslave/jenkins/workspace/lldb-cmake-matrix/llvm-project/lldb/packages/Python/lldbsuite/test/lldbtest.py", line 1341, in getLldbArchitecture output = check_output(command) File "/usr/local/Cellar/python/3.7.0/Frameworks/Python.framework/Versions/3.7/lib/python3.7/subprocess.py", line 376, in check_output **kwargs).stdout File "/usr/local/Cellar/python/3.7.0/Frameworks/Python.framework/Versions/3.7/lib/python3.7/subprocess.py", line 468, in run output=stdout, stderr=stderr) subprocess.CalledProcessError: Command '['/Users/buildslave/jenkins/workspace/lldb-cmake-matrix/lldb-build/bin/lldb', '-o', 'file /Users/buildslave/jenkins/workspace/lldb-cmake-matrix/lldb-build/bin/lldb', '-o', 'quit']' died with <Signals.SIGKILL: 9>. Config=x86_64-/Users/buildslave/jenkins/workspace/lldb-cmake-matrix/lldb-build/bin/clang ---------------------------------------------------------------------- Ran 5 tests in 41.553s

Hide Details

RESULT: FAILED (2 passes, 0 failures, 3 errors, 0 skipped, 0 expected failures, 0 unexpected successes)

Hide Details

--

Hide Details

******************** FAIL: lldb-shell :: Reproducer/TestVerify.test (2238 of 2238) ******************** TEST 'lldb-shell :: Reproducer/TestVerify.test' FAILED ******************** Script: -- : 'RUN: at line 1'; rm -rf /Users/buildslave/jenkins/workspace/lldb-cmake-matrix/lldb-build/tools/lldb/test/Reproducer/Output/TestVerify.test.tmp.repro : 'RUN: at line 2'; rm -rf /Users/buildslave/jenkins/workspace/lldb-cmake-matrix/lldb-build/tools/lldb/test/Reproducer/Output/TestVerify.test.tmp.repro2 : 'RUN: at line 3'; /Users/buildslave/jenkins/workspace/lldb-cmake-matrix/lldb-build/bin/clang --target=specify-a-target-or-use-a-_host-substitution --target=x86_64-apple-darwin19.5.0 -isysroot /Applications/Xcode.app/Contents/Developer/Platforms/MacOSX.platform/Developer/SDKs/MacOSX.sdk -fmodules-cache-path=/Users/buildslave/jenkins/workspace/lldb-cmake-matrix/lldb-build/lldb-test-build.noindex/module-cache-clang/lldb-shell /Users/buildslave/jenkins/workspace/lldb-cmake-matrix/llvm-project/lldb/test/Shell/Reproducer/Inputs/simple.c -g -o /Users/buildslave/jenkins/workspace/lldb-cmake-matrix/lldb-build/tools/lldb/test/Reproducer/Output/TestVerify.test.tmp.out : 'RUN: at line 4'; /Users/buildslave/jenkins/workspace/lldb-cmake-matrix/lldb-build/bin/lldb --no-lldbinit -S /Users/buildslave/jenkins/workspace/lldb-cmake-matrix/lldb-build/tools/lldb/test/Shell/lit-lldb-init -x -b -s /Users/buildslave/jenkins/workspace/lldb-cmake-matrix/llvm-project/lldb/test/Shell/Reproducer/Inputs/GDBRemoteCapture.in --capture --capture-path /Users/buildslave/jenkins/workspace/lldb-cmake-matrix/lldb-build/tools/lldb/test/Reproducer/Output/TestVerify.test.tmp.repro /Users/buildslave/jenkins/workspace/lldb-cmake-matrix/lldb-build/tools/lldb/test/Reproducer/Output/TestVerify.test.tmp.out : 'RUN: at line 5'; /Users/buildslave/jenkins/workspace/lldb-cmake-matrix/lldb-build/bin/lldb --no-lldbinit -S /Users/buildslave/jenkins/workspace/lldb-cmake-matrix/lldb-build/tools/lldb/test/Shell/lit-lldb-init --replay /Users/buildslave/jenkins/workspace/lldb-cmake-matrix/lldb-build/tools/lldb/test/Reproducer/Output/TestVerify.test.tmp.repro : 'RUN: at line 7'; echo "/bogus/home/dir" > /Users/buildslave/jenkins/workspace/lldb-cmake-matrix/lldb-build/tools/lldb/test/Reproducer/Output/TestVerify.test.tmp.repro/home.txt : 'RUN: at line 8'; echo "/bogus/current/working/dir" > /Users/buildslave/jenkins/workspace/lldb-cmake-matrix/lldb-build/tools/lldb/test/Reproducer/Output/TestVerify.test.tmp.repro/cwd.txt : 'RUN: at line 10'; not /Users/buildslave/jenkins/workspace/lldb-cmake-matrix/lldb-build/bin/lldb --no-lldbinit -S /Users/buildslave/jenkins/workspace/lldb-cmake-matrix/lldb-build/tools/lldb/test/Shell/lit-lldb-init -b -o 'reproducer verify -f /Users/buildslave/jenkins/workspace/lldb-cmake-matrix/lldb-build/tools/lldb/test/Reproducer/Output/TestVerify.test.tmp.repro' 2>&1 | /Users/buildslave/jenkins/workspace/lldb-cmake-matrix/lldb-build/bin/FileCheck /Users/buildslave/jenkins/workspace/lldb-cmake-matrix/llvm-project/lldb/test/Shell/Reproducer/TestVerify.test : 'RUN: at line 14'; rm /Users/buildslave/jenkins/workspace/lldb-cmake-matrix/lldb-build/tools/lldb/test/Reproducer/Output/TestVerify.test.tmp.repro/root//Users/buildslave/jenkins/workspace/lldb-cmake-matrix/llvm-project/lldb/test/Shell/Reproducer/Inputs/GDBRemoteCapture.in : 'RUN: at line 15'; echo "CHECK: '/Users/buildslave/jenkins/workspace/lldb-cmake-matrix/llvm-project/lldb/test/Shell/Reproducer/Inputs/GDBRemoteCapture.in': No such file or directory" > /Users/buildslave/jenkins/workspace/lldb-cmake-matrix/lldb-build/tools/lldb/test/Reproducer/Output/TestVerify.test.tmp.check : 'RUN: at line 16'; not /Users/buildslave/jenkins/workspace/lldb-cmake-matrix/lldb-build/bin/lldb --no-lldbinit -S /Users/buildslave/jenkins/workspace/lldb-cmake-matrix/lldb-build/tools/lldb/test/Shell/lit-lldb-init -b -o 'reproducer verify -f /Users/buildslave/jenkins/workspace/lldb-cmake-matrix/lldb-build/tools/lldb/test/Reproducer/Output/TestVerify.test.tmp.repro' 2>&1 | /Users/buildslave/jenkins/workspace/lldb-cmake-matrix/lldb-build/bin/FileCheck /Users/buildslave/jenkins/workspace/lldb-cmake-matrix/lldb-build/tools/lldb/test/Reproducer/Output/TestVerify.test.tmp.check : 'RUN: at line 18'; not /Users/buildslave/jenkins/workspace/lldb-cmake-matrix/lldb-build/bin/lldb --no-lldbinit -S /Users/buildslave/jenkins/workspace/lldb-cmake-matrix/lldb-build/tools/lldb/test/Shell/lit-lldb-init --replay /Users/buildslave/jenkins/workspace/lldb-cmake-matrix/lldb-build/tools/lldb/test/Reproducer/Output/TestVerify.test.tmp.repro 2>&1 | /Users/buildslave/jenkins/workspace/lldb-cmake-matrix/lldb-build/bin/FileCheck /Users/buildslave/jenkins/workspace/lldb-cmake-matrix/llvm-project/lldb/test/Shell/Reproducer/TestVerify.test : 'RUN: at line 24'; /Users/buildslave/jenkins/workspace/lldb-cmake-matrix/lldb-build/bin/lldb --no-lldbinit -S /Users/buildslave/jenkins/workspace/lldb-cmake-matrix/lldb-build/tools/lldb/test/Shell/lit-lldb-init -x -b -s /Users/buildslave/jenkins/workspace/lldb-cmake-matrix/llvm-project/lldb/test/Shell/Reproducer/Inputs/GDBRemoteCapture.in --capture --capture-path /Users/buildslave/jenkins/workspace/lldb-cmake-matrix/lldb-build/tools/lldb/test/Reproducer/Output/TestVerify.test.tmp.repro2 /Users/buildslave/jenkins/workspace/lldb-cmake-matrix/lldb-build/tools/lldb/test/Reproducer/Output/TestVerify.test.tmp.out : 'RUN: at line 25'; echo "/bogus/home/dir" > /Users/buildslave/jenkins/workspace/lldb-cmake-matrix/lldb-build/tools/lldb/test/Reproducer/Output/TestVerify.test.tmp.repro2/home.txt : 'RUN: at line 26'; /Users/buildslave/jenkins/workspace/lldb-cmake-matrix/lldb-build/bin/lldb --no-lldbinit -S /Users/buildslave/jenkins/workspace/lldb-cmake-matrix/lldb-build/tools/lldb/test/Shell/lit-lldb-init --replay /Users/buildslave/jenkins/workspace/lldb-cmake-matrix/lldb-build/tools/lldb/test/Reproducer/Output/TestVerify.test.tmp.repro2 --reproducer-no-verify 2>&1 | /Users/buildslave/jenkins/workspace/lldb-cmake-matrix/lldb-build/bin/FileCheck /Users/buildslave/jenkins/workspace/lldb-cmake-matrix/llvm-project/lldb/test/Shell/Reproducer/TestVerify.test --check-prefix NO-VERIFY -- Exit Code: 137

Hide Details

Command Output (stdout): -- (lldb) command source -s 0 '/Users/buildslave/jenkins/workspace/lldb-cmake-matrix/lldb-build/tools/lldb/test/Shell/lit-lldb-init' Executing commands in '/Users/buildslave/jenkins/workspace/lldb-cmake-matrix/lldb-build/tools/lldb/test/Shell/lit-lldb-init'. (lldb) # LLDB init file for the LIT tests. (lldb) settings set symbols.enable-external-lookup false (lldb) settings set plugin.process.gdb-remote.packet-timeout 60 (lldb) settings set interpreter.echo-comment-commands false (lldb) settings set symbols.clang-modules-cache-path "/Users/buildslave/jenkins/workspace/lldb-cmake-matrix/lldb-build/lldb-test-build.noindex/module-cache-lldb" (lldb) settings set target.auto-apply-fixits false (lldb) settings set target.inherit-tcc true (lldb) settings set target.detach-on-error false (lldb) target create "/Users/buildslave/jenkins/workspace/lldb-cmake-matrix/lldb-build/tools/lldb/test/Reproducer/Output/TestVerify.test.tmp.out" Current executable set to '/Users/buildslave/jenkins/workspace/lldb-cmake-matrix/lldb-build/tools/lldb/test/Reproducer/Output/TestVerify.test.tmp.out' (x86_64). (lldb) command source -s 0 '/Users/buildslave/jenkins/workspace/lldb-cmake-matrix/llvm-project/lldb/test/Shell/Reproducer/Inputs/GDBRemoteCapture.in' Executing commands in '/Users/buildslave/jenkins/workspace/lldb-cmake-matrix/llvm-project/lldb/test/Shell/Reproducer/Inputs/GDBRemoteCapture.in'. (lldb) breakpoint set -f simple.c -l 4 Breakpoint 1: where = TestVerify.test.tmp.out`foo + 4 at simple.c:4:5, address = 0x0000000100000f44 (lldb) run Process 923 stopped * thread #1, queue = 'com.apple.main-thread', stop reason = breakpoint 1.1 frame #0: 0x0000000100000f44 TestVerify.test.tmp.out`foo at simple.c:4:5 1 #include <stdio.h> 2 3 void foo() { -> 4 printf("testing\n"); ^ 5 } 6 7 int main (int argc, char const *argv[]) {

Hide Details

Process 923 launched: '/Users/buildslave/jenkins/workspace/lldb-cmake-matrix/lldb-build/tools/lldb/test/Reproducer/Output/TestVerify.test.tmp.out' (x86_64) (lldb) bt * thread #1, queue = 'com.apple.main-thread', stop reason = breakpoint 1.1 * frame #0: 0x0000000100000f44 TestVerify.test.tmp.out`foo at simple.c:4:5 frame #1: 0x0000000100000f7b TestVerify.test.tmp.out`main(argc=1, argv=0x00007ffeefbffb40) at simple.c:8:5 frame #2: 0x00007fff6f4d6cc9 libdyld.dylib`start + 1 (lldb) cont testing Process 923 resuming Process 923 exited with status = 0 (0x00000000)

Hide Details

(lldb) reproducer status Reproducer is in capture mode. Path: /Users/buildslave/jenkins/workspace/lldb-cmake-matrix/lldb-build/tools/lldb/test/Reproducer/Output/TestVerify.test.tmp.repro (lldb) reproducer generate Reproducer written to '/Users/buildslave/jenkins/workspace/lldb-cmake-matrix/lldb-build/tools/lldb/test/Reproducer/Output/TestVerify.test.tmp.repro' Please have a look at the directory to assess if you're willing to share the contained information. (lldb) command source -s 0 '/Users/buildslave/jenkins/workspace/lldb-cmake-matrix/lldb-build/tools/lldb/test/Shell/lit-lldb-init' Executing commands in '/Users/buildslave/jenkins/workspace/lldb-cmake-matrix/lldb-build/tools/lldb/test/Shell/lit-lldb-init'. (lldb) # LLDB init file for the LIT tests. (lldb) settings set symbols.enable-external-lookup false (lldb) settings set plugin.process.gdb-remote.packet-timeout 60 (lldb) settings set interpreter.echo-comment-commands false (lldb) settings set symbols.clang-modules-cache-path "/Users/buildslave/jenkins/workspace/lldb-cmake-matrix/lldb-build/lldb-test-build.noindex/module-cache-lldb" (lldb) settings set target.auto-apply-fixits false (lldb) settings set target.inherit-tcc true (lldb) settings set target.detach-on-error false (lldb) target create "/Users/buildslave/jenkins/workspace/lldb-cmake-matrix/lldb-build/tools/lldb/test/Reproducer/Output/TestVerify.test.tmp.out" Current executable set to '/Users/buildslave/jenkins/workspace/lldb-cmake-matrix/lldb-build/tools/lldb/test/Reproducer/Output/TestVerify.test.tmp.out' (x86_64). (lldb) command source -s 0 '/Users/buildslave/jenkins/workspace/lldb-cmake-matrix/llvm-project/lldb/test/Shell/Reproducer/Inputs/GDBRemoteCapture.in' Executing commands in '/Users/buildslave/jenkins/workspace/lldb-cmake-matrix/llvm-project/lldb/test/Shell/Reproducer/Inputs/GDBRemoteCapture.in'. (lldb) breakpoint set -f simple.c -l 4 Breakpoint 1: where = TestVerify.test.tmp.out`foo + 4 at simple.c:4:5, address = 0x0000000100000f44 (lldb) run Process 1116 stopped * thread #1, queue = 'com.apple.main-thread', stop reason = breakpoint 1.1 frame #0: 0x0000000100000f44 TestVerify.test.tmp.out`foo at simple.c:4:5 1 #include <stdio.h> 2 3 void foo() { -> 4 printf("testing\n"); ^ 5 } 6 7 int main (int argc, char const *argv[]) {

Hide Details

Process 1116 launched: '/Users/buildslave/jenkins/workspace/lldb-cmake-matrix/lldb-build/tools/lldb/test/Reproducer/Output/TestVerify.test.tmp.out' (x86_64) (lldb) bt * thread #1, queue = 'com.apple.main-thread', stop reason = breakpoint 1.1 * frame #0: 0x0000000100000f44 TestVerify.test.tmp.out`foo at simple.c:4:5 frame #1: 0x0000000100000f7b TestVerify.test.tmp.out`main(argc=1, argv=0x00007ffeefbffb40) at simple.c:8:5 frame #2: 0x00007fff6f4d6cc9 libdyld.dylib`start + 1 (lldb) cont Process 1116 resuming Process 1116 exited with status = 0 (0x00000000)

Hide Details

(lldb) reproducer status Reproducer is in replay mode. Path: /Users/buildslave/jenkins/workspace/lldb-cmake-matrix/lldb-build/tools/lldb/test/Reproducer/Output/TestVerify.test.tmp.repro (lldb) reproducer generate

Hide Details

-- Command Output (stderr): -- clang-12: warning: argument unused during compilation: '-fmodules-cache-path=/Users/buildslave/jenkins/workspace/lldb-cmake-matrix/lldb-build/lldb-test-build.noindex/module-cache-clang/lldb-shell' [-Wunused-command-line-argument] /Users/buildslave/jenkins/workspace/lldb-cmake-matrix/lldb-build/tools/lldb/test/Reproducer/Output/TestVerify.test.script: line 15: 4335 Killed: 9 not /Users/buildslave/jenkins/workspace/lldb-cmake-matrix/lldb-build/bin/lldb --no-lldbinit -S /Users/buildslave/jenkins/workspace/lldb-cmake-matrix/lldb-build/tools/lldb/test/Shell/lit-lldb-init -b -o 'reproducer verify -f /Users/buildslave/jenkins/workspace/lldb-cmake-matrix/lldb-build/tools/lldb/test/Reproducer/Output/TestVerify.test.tmp.repro' 2>&1 4336 | /Users/buildslave/jenkins/workspace/lldb-cmake-matrix/lldb-build/bin/FileCheck /Users/buildslave/jenkins/workspace/lldb-cmake-matrix/llvm-project/lldb/test/Shell/Reproducer/TestVerify.test

Hide Details

--

Hide Details

******************** Slowest Tests: -------------------------------------------------------------------------- 78.36s: lldb-api :: tools/lldb-server/TestLldbGdbServer.py 53.22s: lldb-api :: lang/objc/exceptions/TestObjCExceptions.py 46.21s: lldb-api :: macosx/simulator/TestSimulatorPlatform.py 42.09s: lldb-api :: api/multithreaded/TestMultithreaded.py 34.53s: lldb-api :: types/TestLongTypesExpr.py 34.30s: lldb-api :: lang/cpp/namespace/TestNamespaceLookup.py 30.64s: lldb-api :: lang/objc/objc-new-syntax/TestObjCNewSyntaxArray.py 29.53s: lldb-api :: lang/objc/hidden-ivars/TestHiddenIvars.py 24.69s: lldb-api :: functionalities/load_unload/TestLoadUnload.py 24.25s: lldb-api :: types/TestLongTypes.py 21.33s: lldb-api :: commands/expression/import-std-module/stack/TestStackFromStdModule.py 18.89s: lldb-api :: commands/expression/import-std-module/shared_ptr/TestSharedPtrFromStdModule.py 17.11s: lldb-api :: tools/lldb-server/TestAppleSimulatorOSType.py 16.48s: lldb-api :: lang/objc/foundation/TestObjectDescriptionAPI.py 16.26s: lldb-api :: functionalities/mtc/simple/TestMTCSimple.py 14.78s: lldb-api :: commands/expression/expr-in-syscall/TestExpressionInSyscall.py 14.55s: lldb-api :: commands/expression/import-std-module/basic/TestImportStdModule.py 14.09s: lldb-api :: commands/expression/import-std-module/list-dbg-info-content/TestDbgInfoContentListFromStdModule.py 13.85s: lldb-api :: commands/expression/two-files/TestObjCTypeQueryFromOtherCompileUnit.py 13.65s: lldb-api :: functionalities/data-formatter/poarray/TestPrintObjectArray.py

Hide Details

Tests Times: -------------------------------------------------------------------------- [ Range ] :: [ Percentage ] :: [ Count ] -------------------------------------------------------------------------- [75.0s,80.0s) :: [ ] :: [ 1/2238] [70.0s,75.0s) :: [ ] :: [ 0/2238] [65.0s,70.0s) :: [ ] :: [ 0/2238] [60.0s,65.0s) :: [ ] :: [ 0/2238] [55.0s,60.0s) :: [ ] :: [ 0/2238] [50.0s,55.0s) :: [ ] :: [ 1/2238] [45.0s,50.0s) :: [ ] :: [ 1/2238] [40.0s,45.0s) :: [ ] :: [ 1/2238] [35.0s,40.0s) :: [ ] :: [ 2/2238] [30.0s,35.0s) :: [ ] :: [ 2/2238] [25.0s,30.0s) :: [ ] :: [ 1/2238] [20.0s,25.0s) :: [ ] :: [ 2/2238] [15.0s,20.0s) :: [ ] :: [ 5/2238] [10.0s,15.0s) :: [ ] :: [ 17/2238] [ 5.0s,10.0s) :: [ ] :: [ 45/2238] [ 0.0s, 5.0s) :: [************************************** ] :: [2160/2238] -------------------------------------------------------------------------- ******************** Failed Tests (1598): lldb-api :: tools/lldb-server/TestLldbGdbServer.py lldb-api :: api/multithreaded/TestMultithreaded.py lldb-api :: lang/objc/hidden-ivars/TestHiddenIvars.py lldb-api :: functionalities/data-formatter/data-formatter-objc/TestDataFormatterObjCNSError.py lldb-api :: lang/objc/foundation/TestRuntimeTypes.py lldb-api :: functionalities/thread/backtrace_all/TestBacktraceAll.py lldb-api :: functionalities/data-formatter/data-formatter-objc/TestDataFormatterObjCExpr.py lldb-api :: functionalities/data-formatter/data-formatter-objc/TestDataFormatterObjCPlain.py lldb-api :: functionalities/type_completion/TestTypeCompletion.py lldb-shell :: Reproducer/TestVerify.test lldb-api :: commands/expression/diagnostics/TestExprDiagnostics.py lldb-api :: functionalities/inferior-crashing/TestInferiorCrashingStep.py lldb-api :: lang/cpp/chained-calls/TestCppChainedCalls.py lldb-shell :: Reproducer/TestReuseDirectory.test lldb-api :: tools/lldb-vscode/breakpoint-events/TestVSCode_breakpointEvents.py lldb-api :: commands/frame/diagnose/complicated-expression/TestComplicatedExpression.py lldb-unit :: Host/./HostTests/HostInfoTest.GetHostname lldb-api :: lang/cpp/template-arguments/TestCppTemplateArguments.py lldb-unit :: Utility/./UtilityTests/StringListTest.ShiftStdString lldb-api :: lang/c/struct_types/TestStructTypes.py lldb-api :: functionalities/data-formatter/nsdictionarysynth/TestNSDictionarySynthetic.py lldb-api :: functionalities/tail_call_frames/disambiguate_tail_call_seq/TestDisambiguateTailCallSeq.py lldb-api :: functionalities/testid/TestTestId.py lldb-api :: api/check_public_api_headers/TestPublicAPIHeaders.py lldb-shell :: SymbolFile/DWARF/DW_AT_data_bit_offset-DW_OP_stack_value.s lldb-shell :: SymbolFile/DWARF/debug_loclists-dwo.s lldb-api :: functionalities/postmortem/elf-core/gcore/TestGCore.py lldb-unit :: Symbol/./SymbolTests/TestTypeSystemClang.TestOwningModule lldb-unit :: Process/gdb-remote/./ProcessGdbRemoteTests/GDBRemoteCommunicationClientTest.GetModulesInfo_UUID20 lldb-api :: lang/cpp/scope/TestCppScope.py lldb-api :: lang/c/complex/TestComplexC99.py lldb-unit :: Utility/./UtilityTests/NameMatchesTest.Contains lldb-unit :: Expression/./ExpressionTests/CppModuleConfigurationTest.Xcode lldb-shell :: Breakpoint/dummy-target.test lldb-unit :: Utility/./UtilityTests/RegisterValueTest.GetSet8 lldb-unit :: Utility/./UtilityTests/FileSpecTest.Yaml lldb-unit :: Utility/./UtilityTests/RangeDataVector.CustomSort lldb-unit :: Language/Highlighting/./HighlighterTests/HighlighterTest.ClangCursorPosInOtherToken lldb-unit :: Language/Highlighting/./HighlighterTests/HighlighterTest.ClangCommas lldb-api :: functionalities/breakpoint/cpp/TestCPPBreakpointLocations.py lldb-unit :: Utility/./UtilityTests/LogTest.Unregister lldb-api :: commands/expression/timeout/TestCallWithTimeout.py lldb-unit :: Expression/./ExpressionTests/CppModuleConfigurationTest.IgnoreLibStdCpp lldb-unit :: Expression/./ExpressionTests/DiagnosticManagerTest.PutStringMultiple lldb-unit :: Process/gdb-remote/./ProcessGdbRemoteTests/GDBRemoteClientBaseTest.SendContinueAndInterrupt2PacketBug lldb-api :: commands/expression/call-function/TestCallStopAndContinue.py lldb-unit :: Utility/./UtilityTests/BinaryStreamTest.PutULEB128Zero lldb-api :: functionalities/thread/concurrent_events/TestConcurrentDelayWatchBreak.py lldb-unit :: SymbolFile/DWARF/./SymbolFileDWARFTests/SymbolFileDWARFTests.TestAbbrevMissingTerminator lldb-api :: lang/cpp/nested-class-other-compilation-unit/TestNestedClassWithParentInAnotherCU.py lldb-shell :: ScriptInterpreter/Python/Crashlog/text.test lldb-unit :: Expression/./ExpressionTests/ClangExpressionDeclMapTest.TestUnknownIdentifierLookup lldb-unit :: Utility/./UtilityTests/RangeTest.NotEqual lldb-api :: commands/register/register/intel_xtended_registers/mpx_offset_intersection/TestMPXOffsetIntersection.py lldb-api :: sanity/TestModuleCacheSanity.py lldb-api :: lang/c/cpp_keyword_identifiers/TestCppKeywordsAsCIdentifiers.py lldb-shell :: Minidump/Windows/broken-unwind.test lldb-api :: lang/objc/modules/TestObjCModules.py lldb-api :: lang/cpp/constructors/TestCppConstructors.py lldb-unit :: Language/Highlighting/./HighlighterTests/HighlighterTest.DefaultHighlighter lldb-unit :: Utility/./UtilityTests/StringExtractorTest.GetHexU8_Exact_NoEof lldb-shell :: Driver/TestProcessAttach.test lldb-unit :: Language/Highlighting/./HighlighterTests/HighlighterTest.ClangCursorOutOfBounds lldb-unit :: Utility/./UtilityTests/UriParserTest.SchemeHostSeparator4 lldb-unit :: Process/Utility/./ProcessUtilityTests/ProcMapTests/LinuxProcMapsTestFixture.ParseMapRegions/6 lldb-api :: commands/expression/po_verbosity/TestPoVerbosity.py lldb-api :: android/platform/TestDefaultCacheLineSize.py lldb-api :: functionalities/thread/concurrent_events/TestConcurrentDelaySignalWatch.py lldb-api :: functionalities/thread/concurrent_events/TestConcurrentTwoBreakpointsOneWatchpoint.py lldb-api :: functionalities/data-formatter/data-formatter-objc/nsstring/TestDataFormatterNSString.py lldb-api :: functionalities/data-formatter/data-formatter-advanced/TestDataFormatterAdv.py lldb-unit :: SymbolFile/NativePDB/./SymbolFileNativePDBTests/PDBFPOProgramToDWARFExpressionTests.UnresolvedRegisterReference lldb-unit :: Language/Highlighting/./HighlighterTests/HighlighterTest.ClangOperators lldb-api :: tools/lldb-server/TestGdbRemote_vCont.py lldb-api :: lang/cpp/class-template-parameter-pack/TestClassTemplateParameterPack.py lldb-api :: functionalities/avoids-fd-leak/TestFdLeak.py lldb-unit :: ScriptInterpreter/Python/./ScriptInterpreterPythonTests/PythonDataObjectsTest.TestRun lldb-api :: commands/expression/inline-namespace/TestInlineNamespace.py lldb-api :: tools/lldb-vscode/coreFile/TestVSCode_coreFile.py lldb-unit :: Core/./LLDBCoreTests/MangledTest.NameIndexes_FindFunctionSymbols lldb-unit :: SymbolFile/NativePDB/./SymbolFileNativePDBTests/PDBFPOProgramToDWARFExpressionTests.DependencyChain lldb-api :: lang/objc/foundation/TestObjCMethodsNSArray.py lldb-unit :: Process/gdb-remote/./ProcessGdbRemoteTests/GDBRemoteCommunicationClientTest.SendSignalsToIgnore lldb-api :: functionalities/data-formatter/data-formatter-named-summaries/TestDataFormatterNamedSummaries.py lldb-unit :: ScriptInterpreter/Python/./ScriptInterpreterPythonTests/PythonDataObjectsTest.TestInstanceNameResolutionNoDot lldb-api :: functionalities/abbreviation/TestCommonShortSpellings.py lldb-unit :: Symbol/./SymbolTests/TestTypeSystemClang.TestBuiltinTypeForEncodingAndBitSize lldb-unit :: Utility/./UtilityTests/OptionsWithRawTest.LeadingSpaceArgs lldb-unit :: UnwindAssembly/x86/./UnwindAssemblyx86Tests/Testx86AssemblyInspectionEngine.TestSubRSP lldb-unit :: Process/minidump/./LLDBMinidumpTests/MinidumpParserTest.GetMemory lldb-unit :: Utility/./UtilityTests/GeneratorTest.YamlMultiProvider lldb-api :: lang/objc/objc-runtime-ivars/TestRuntimeIvars.py lldb-unit :: ObjectFile/ELF/./ObjectFileELFTests/ObjectFileELFTest.SectionsResolveConsistently lldb-shell :: SymbolFile/DWARF/parallel-indexing-stress.s lldb-shell :: Register/x86-64-ymm-read.test lldb-api :: functionalities/unwind/standard/TestStandardUnwind.py lldb-api :: python_api/file_handle/TestFileHandle.py lldb-api :: functionalities/data-formatter/data-formatter-stl/libcxx/initializerlist/TestInitializerList.py lldb-unit :: Utility/./UtilityTests/ArgsTest.TestSingleQuotedArgWithSpace lldb-unit :: Signals/./SignalsTests/UnixSignalsTest.Iteration lldb-unit :: Process/gdb-remote/./ProcessGdbRemoteTests/GDBRemoteCommunicationServerTest.SendErrorResponse_StringError lldb-api :: python_api/function_symbol/TestDisasmAPI.py lldb-unit :: Symbol/./SymbolTests/TestClangASTImporter.RecordLayout lldb-api :: commands/expression/ignore-artificial-constructors/TestIgnoreArtificialConstructors.py lldb-api :: functionalities/inferior-assert/TestInferiorAssert.py lldb-shell :: Process/UnsupportedLanguage.test lldb-unit :: Symbol/./SymbolTests/TestTypeSystemClang.TestConvertAccessTypeToAccessSpecifier lldb-unit :: Host/./HostTests/SocketTests/SocketTest.TCPGetConnectURI/ipv6 lldb-shell :: SymbolFile/Breakpad/unwind-via-stack-win.test lldb-unit :: SymbolFile/DWARF/./SymbolFileDWARFTests/SymbolFileDWARFTests.TestAbbrevNullAttrValidForm lldb-unit :: ScriptInterpreter/Python/./ScriptInterpreterPythonTests/PythonDataObjectsTest.TestPythonTupleSize lldb-shell :: Quit/TestQuitExitCode-30.test lldb-api :: tools/lldb-vscode/stackTrace/TestVSCode_stackTrace.py lldb-unit :: Utility/./UtilityTests/StringExtractorTest.GetHexBytesAvail_Underflow lldb-api :: functionalities/breakpoint/debugbreak/TestDebugBreak.py lldb-api :: functionalities/longjmp/TestLongjmp.py lldb-unit :: Utility/./UtilityTests/DataExtractorTest.GetSLEB128_bit63 lldb-unit :: Utility/./UtilityTests/DataExtractorTest.GetCStr lldb-api :: commands/trace/TestTraceLoad.py lldb-api :: functionalities/data-formatter/data-formatter-objc/TestDataFormatterObjCNSURL.py lldb-unit :: Language/Highlighting/./HighlighterTests/HighlighterTest.ClangTrailingBackslashWithWhitespace lldb-api :: functionalities/recursion/TestValueObjectRecursion.py lldb-api :: lang/c/strings/TestCStrings.py lldb-unit :: Utility/./UtilityTests/RangeTest.ContainsRangeStartingFromZero lldb-unit :: Utility/./UtilityTests/FileSpecTest.CopyByAppendingPathComponent lldb-unit :: Process/gdb-remote/./ProcessGdbRemoteTests/GDBRemoteCommunicationClientTest.SendTraceSupportedTypePacket lldb-unit :: Utility/./UtilityTests/StringExtractorTest.GetHexBytesAvail lldb-shell :: SymbolFile/DWARF/dwo-type-in-main-file.s lldb-api :: commands/expression/persistent_types/TestNestedPersistentTypes.py lldb-api :: lang/objc/objc-ivar-stripped/TestObjCIvarStripped.py lldb-api :: functionalities/breakpoint/consecutive_breakpoints/TestConsecutiveBreakpoints.py lldb-api :: commands/watchpoints/watchpoint_commands/command/TestWatchpointCommandPython.py lldb-unit :: Utility/./UtilityTests/SerializationRountripTest.SerializeDeserializeCStringNull lldb-unit :: Process/gdb-remote/./ProcessGdbRemoteTests/GDBRemoteClientBaseTest.SendContinueDelegateInterface lldb-unit :: Utility/./UtilityTests/StreamTeeTest.Flush lldb-shell :: Driver/TestConvenienceVariables.test lldb-api :: functionalities/data-formatter/data-formatter-stl/libcxx/forward_list/TestDataFormatterLibcxxForwardList.py lldb-api :: python_api/interpreter/TestCommandInterpreterAPI.py lldb-unit :: ObjectFile/ELF/./ObjectFileELFTests/ObjectFileELFTest.GetSymtab_NoSymEntryPointArmAddressClass lldb-unit :: Utility/./UtilityTests/StringExtractorTest.GetHexU8_Exact lldb-api :: functionalities/ubsan/basic/TestUbsanBasic.py lldb-api :: commands/frame/diagnose/dereference-this/TestDiagnoseDereferenceThis.py lldb-api :: functionalities/data-formatter/data-formatter-stl/libcxx/set/TestDataFormatterLibcxxSet.py lldb-api :: lang/cpp/this_class_type_mixing/TestThisClassTypeMixing.py lldb-api :: functionalities/completion/TestCompletion.py lldb-unit :: Host/./HostTests/FileSystemTest.MakeAbsolute lldb-unit :: Expression/./ExpressionTests/DWARFExpression.DW_OP_piece lldb-api :: functionalities/gdb_remote_client/TestNestedRegDefinitions.py lldb-unit :: SymbolFile/NativePDB/./SymbolFileNativePDBTests/PDBFPOProgramToDWARFExpressionTests.InvalidOpUnary lldb-unit :: Utility/./UtilityTests/TimerTest.CategoryTimes2 lldb-api :: functionalities/data-formatter/data-formatter-stl/libstdcpp/unique_ptr/invalid/TestDataFormatterInvalidStdUniquePtr.py lldb-unit :: Utility/./UtilityTests/StringExtractorTest.GetHexBytesAvail_FullString lldb-unit :: Expression/./ExpressionTests/CppModuleConfigurationTest.UnrelatedLibrary lldb-unit :: ScriptInterpreter/Python/./ScriptInterpreterPythonTests/PythonDataObjectsTest.TestPythonCallableCheck lldb-api :: functionalities/var_path/TestVarPath.py lldb-unit :: Process/Utility/./ProcessUtilityTests/ProcSMapTests/LinuxProcSMapsTestFixture.ParseSMapRegions/3 lldb-unit :: Process/gdb-remote/./ProcessGdbRemoteTests/GDBRemoteCommunicationClientTest.SendGetTraceConfigPacket lldb-api :: lang/objc/objc-optimized/TestObjcOptimized.py lldb-api :: benchmarks/stepping/TestSteppingSpeed.py lldb-api :: lang/c/conflicting-symbol/TestConflictingSymbol.py lldb-api :: commands/trace/TestTraceSchema.py lldb-api :: commands/watchpoints/watchpoint_commands/command/TestWatchpointCommandLLDB.py lldb-unit :: Host/./HostTests/MainLoopTest.ReadObject lldb-api :: types/TestIntegerTypeExpr.py lldb-api :: types/TestCharType.py lldb-api :: commands/expression/error-limit/TestExprErrorLimit.py lldb-api :: commands/expression/test/TestExprs2.py lldb-api :: functionalities/gdb_remote_client/TestRestartBug.py lldb-api :: python_api/lldbutil/TestSwigVersion.py lldb-unit :: Utility/./UtilityTests/SerializationRountripTest.SerializeDeserializeCString lldb-shell :: Commands/command-disassemble.s lldb-api :: functionalities/unwind/noreturn/TestNoreturnUnwind.py lldb-unit :: Expression/./ExpressionTests/CppModuleConfigurationTest.UnknownLibCppFile lldb-api :: lang/c/stepping/TestThreadStepInAvoidRegexp.py lldb-api :: commands/expression/import-std-module/vector-dbg-info-content/TestDbgInfoContentVectorFromStdModule.py lldb-api :: functionalities/data-formatter/data-formatter-objc/TestDataFormatterObjCCF.py lldb-api :: commands/expression/call-restarts/TestCallThatRestarts.py lldb-shell :: Breakpoint/debug_rnglist_basic.test lldb-unit :: Utility/./UtilityTests/StreamTest.SetIndentLevel lldb-api :: lang/c/anonymous/TestAnonymous.py lldb-unit :: Utility/./UtilityTests/FileSpecTest.EqualSeparator lldb-unit :: Utility/./UtilityTests/LogChannelEnabledTest.LogThread lldb-unit :: Utility/./UtilityTests/StringListTest.GetSize lldb-api :: functionalities/data-formatter/data-formatter-stl/libstdcpp/string/TestDataFormatterStdString.py lldb-shell :: Reproducer/TestMultipleTargets.test lldb-api :: functionalities/darwin_log/source/info/TestDarwinLogSourceInfo.py lldb-unit :: Utility/./UtilityTests/ProcessInstanceInfo.DumpTable_invalidUID lldb-api :: python_api/watchpoint/TestSetWatchpoint.py lldb-api :: functionalities/thread/concurrent_events/TestConcurrentWatchpointWithDelayWatchpointThreads.py lldb-unit :: UnwindAssembly/x86/./UnwindAssemblyx86Tests/Testx86AssemblyInspectionEngine.TestPushEAX lldb-unit :: Symbol/./SymbolTests/TestTypeSystemClang.TestIsClangType lldb-api :: functionalities/value_md5_crash/TestValueMD5Crash.py lldb-shell :: ObjectFile/ELF/section-overlap.yaml lldb-api :: functionalities/data-formatter/ostypeformatting/TestFormattersOsType.py lldb-shell :: ScriptInterpreter/Python/fail_breakpoint_oneline.test lldb-unit :: Process/gdb-remote/./ProcessGdbRemoteTests/PortMapTest.AllowPort lldb-unit :: Process/gdb-remote/./ProcessGdbRemoteTests/GDBRemoteClientBaseTest.SendContinueAndAsyncSignal lldb-unit :: Process/minidump/./LLDBMinidumpTests/MinidumpParserTest.GetMiscInfo_no_stream lldb-unit :: Utility/./UtilityTests/ScalarTest.SetValueFromData lldb-api :: lang/c/unions/TestUnionMembers.py lldb-api :: commands/register/register/intel_xtended_registers/mpx_bound_violation/TestBoundViolation.py lldb-unit :: ObjectFile/Breakpad/./ObjectFileBreakpadTests/PublicRecord.parse lldb-api :: commands/expression/completion/TestExprCompletion.py lldb-unit :: ObjectFile/ELF/./ObjectFileELFTests/ObjectFileELFTest.GetSymtab_NoSymEntryPointArmThumbAddressClass lldb-api :: lang/objc/modules-cache/TestClangModulesCache.py lldb-api :: functionalities/thread/concurrent_events/TestConcurrentCrashWithSignal.py lldb-api :: functionalities/tail_call_frames/cross_dso/TestCrossDSOTailCalls.py lldb-unit :: Expression/./ExpressionTests/DWARFExpression.DW_OP_unknown lldb-api :: python_api/sbvalue_persist/TestSBValuePersist.py lldb-unit :: Utility/./UtilityTests/OptionsWithRawTest.WhitespaceSuffix lldb-api :: tools/lldb-server/TestGdbRemote_qThreadStopInfo.py lldb-api :: functionalities/thread/concurrent_events/TestConcurrentBreakpointOneDelayBreakpointThreads.py lldb-shell :: Settings/TestStopCommandSourceOnError.test lldb-unit :: Utility/./UtilityTests/StreamTest.PutBytesAsRawHex8ToBigEndian lldb-shell :: SymbolFile/DWARF/clang-ast-from-dwarf-objc-property.m lldb-unit :: Utility/./UtilityTests/ScalarTest.Division lldb-api :: tools/lldb-server/thread-name/TestGdbRemoteThreadName.py lldb-shell :: SymbolFile/DWARF/DW_AT_declaration-with-children.s lldb-api :: functionalities/tty/TestTerminal.py lldb-api :: functionalities/tsan/cpp_global_location/TestTsanCPPGlobalLocation.py lldb-api :: functionalities/thread/state/TestThreadStates.py lldb-unit :: SymbolFile/NativePDB/./SymbolFileNativePDBTests/PDBFPOProgramToDWARFExpressionTests.SingleAssignmentRegisterRef lldb-api :: lang/cpp/printf/TestPrintf.py lldb-api :: lang/objc/modules-non-objc-target/TestObjCModulesNonObjCTarget.py lldb-api :: commands/version/TestVersion.py lldb-api :: commands/expression/persistent_ptr_update/TestPersistentPtrUpdate.py lldb-unit :: UnwindAssembly/x86/./UnwindAssemblyx86Tests/Testx86AssemblyInspectionEngine.TestPopEBP lldb-unit :: Utility/./UtilityTests/UriParserTest.MinimalPath lldb-unit :: Utility/./UtilityTests/StringLexerTest.NextIfList lldb-unit :: Utility/./UtilityTests/SerializationRountripTest.SerializeDeserializeCStringArrayNullptr lldb-shell :: SymbolFile/DWARF/DW_AT_const_value-bitfields.s lldb-api :: functionalities/object-file/TestImageListMultiArchitecture.py lldb-api :: lang/objc/foundation/TestSymbolTable.py lldb-unit :: ObjectFile/PECOFF/./ObjectFilePECOFFTests/PECallFrameInfoTest.Basic_eh lldb-unit :: Utility/./UtilityTests/StringListTest.AppendStringCString lldb-unit :: Symbol/./SymbolTests/TestTypeSystemClang.TestGetEnumIntegerTypeBasicTypes lldb-unit :: Utility/./UtilityTests/StatusTest.ErrorConstructor lldb-unit :: Interpreter/./InterpreterTests/CompletionTest.FileCompletionAbsolute lldb-api :: functionalities/data-formatter/data-formatter-stl/libcxx/list/loop/TestDataFormatterLibcxxListLoop.py lldb-unit :: Utility/./UtilityTests/DataExtractorTest.GetDouble lldb-api :: commands/expression/import-std-module/vector-of-vectors/TestVectorOfVectorsFromStdModule.py lldb-shell :: Driver/LocalLLDBInit.test lldb-api :: functionalities/thread/concurrent_events/TestConcurrentCrashWithWatchpoint.py lldb-unit :: Core/./LLDBCoreTests/ModuleSpecTest.TestCOFFFile lldb-api :: commands/expression/import-std-module/array/TestArrayFromStdModule.py lldb-unit :: Utility/./UtilityTests/RangeTest.DefaultConstructor lldb-unit :: Utility/./UtilityTests/ArgsTest.DoubleQuotedItem lldb-shell :: ObjectFile/PECOFF/section-types.yaml lldb-api :: tools/lldb-server/TestGdbRemoteSingleStep.py lldb-api :: commands/expression/dont_allow_jit/TestAllowJIT.py lldb-unit :: Utility/./UtilityTests/StatusTest.Formatv lldb-unit :: Utility/./UtilityTests/XcodeSDKTest.GetSDKTypeForTriple lldb-unit :: Core/./LLDBCoreTests/StreamCallbackTest.Callback lldb-unit :: Utility/./UtilityTests/ConstStringTest.FromMidOfBufferStringRef lldb-api :: functionalities/breakpoint/breakpoint_by_line_and_column/TestBreakpointByLineAndColumn.py lldb-unit :: Symbol/./SymbolTests/Type.GetTypeScopeAndBasename lldb-unit :: Process/gdb-remote/./ProcessGdbRemoteTests/GDBRemoteCommunicationClientTest.SendStopTracePacket lldb-unit :: Utility/./UtilityTests/DataExtractorTest.GetBitfield lldb-unit :: Utility/./UtilityTests/DataExtractorTest.GetMaxU64_unchecked lldb-api :: lang/c/array_types/TestArrayTypes.py lldb-api :: commands/expression/cast_int_to_anonymous_enum/TestCastIntToAnonymousEnum.py lldb-api :: lang/c/function_types/TestFunctionTypes.py lldb-api :: functionalities/signal/handle-segv/TestHandleSegv.py lldb-unit :: Symbol/./SymbolTests/TestTypeSystemClang.TestGetEnumIntegerTypeUnexpectedType lldb-api :: commands/log/invalid-args/TestInvalidArgsLog.py lldb-unit :: Utility/./UtilityTests/UriParserTest.PortOverflow lldb-unit :: Utility/./UtilityTests/StringLexerTest.PutBack lldb-api :: functionalities/type_get_module/TestTypeGetModule.py lldb-unit :: Utility/./UtilityTests/StringListTest.LongestCommonPrefixDuplicateElement lldb-shell :: Quit/TestQuitExitCodeHex0.test lldb-shell :: Reproducer/TestDebugSymbols.test lldb-unit :: Utility/./UtilityTests/UriParserTest.SchemeHostSeparator2 lldb-unit :: Core/./LLDBCoreTests/MangledTest.ResultForBlockInvocation lldb-unit :: Utility/./UtilityTests/AnsiTerminal.Basic lldb-unit :: Utility/./UtilityTests/CompletionRequest.TryCompleteCurrentArgMode lldb-unit :: Utility/./UtilityTests/SubsystemRAIITest.SubsystemWithErrorSuccess lldb-api :: commands/expression/ir-interpreter-phi-nodes/TestIRInterpreterPHINodes.py lldb-api :: functionalities/data-formatter/data-formatter-stl/libstdcpp/vector/TestDataFormatterStdVector.py lldb-unit :: Host/./HostTests/SocketTests/SocketTest.TCPGetConnectURI/ipv4 lldb-unit :: Utility/./UtilityTests/StreamTeeTest.SetStreamAtIndexOutOfBounds lldb-unit :: Platform/./LLDBPlatformTests/PlatformAppleSimulatorTest.TestHostPlatformToSim lldb-api :: tools/lldb-server/TestGdbRemoteHostInfo.py lldb-unit :: ScriptInterpreter/Python/./ScriptInterpreterPythonTests/PythonDataObjectsTest.TestExceptions lldb-api :: commands/command/script/import/TestImport.py lldb-unit :: Language/Highlighting/./HighlighterTests/HighlighterTest.ClangEmptyInput lldb-api :: commands/expression/result_numbering/TestResultNumbering.py lldb-unit :: Interpreter/./InterpreterTests/CompletionTest.DirCompletionUsername lldb-api :: lang/c/blocks/TestBlocks.py lldb-unit :: Utility/./UtilityTests/VMRange.Clear lldb-api :: functionalities/data-formatter/data-formatter-stl/libcxx/bitset/TestDataFormatterLibcxxBitset.py lldb-api :: types/TestFloatTypes.py lldb-api :: lang/cpp/namespace_definitions/TestNamespaceDefinitions.py lldb-unit :: Utility/./UtilityTests/VASprintfTest.EncodingError lldb-unit :: Utility/./UtilityTests/DataExtractorTest.GetFloatUnaligned lldb-api :: functionalities/gdb_remote_client/TestThreadSelectionBug.py lldb-shell :: SymbolFile/DWARF/debug_loc-aslr.s lldb-api :: commands/expression/import-std-module/weak_ptr/TestWeakPtrFromStdModule.py lldb-shell :: lldb-server/TestGdbserverPort.test lldb-api :: commands/target/stop-hook/disable/TestTargetStopHookDisable.py lldb-unit :: ObjectFile/MachO/./ObjectFileMachOTests/ObjectFileMachOTest.ModuleFromSharedCacheInfo lldb-unit :: Utility/./UtilityTests/AnsiTerminal.AtStart lldb-api :: functionalities/thread/concurrent_events/TestConcurrentDelaySignalBreak.py lldb-unit :: Utility/./UtilityTests/LogChannelEnabledTest.LogGetLogThread lldb-unit :: Utility/./UtilityTests/StringLexerTest.Next lldb-unit :: Process/gdb-remote/./ProcessGdbRemoteTests/GDBRemoteCommunicationClientTest.SyncThreadState lldb-api :: functionalities/backticks/TestBackticksWithoutATarget.py lldb-unit :: Utility/./UtilityTests/IndexToObjectTest.ObjectForIndex lldb-api :: functionalities/thread/concurrent_events/TestConcurrentSignalWatchBreak.py lldb-shell :: SymbolFile/DWARF/DW_TAG_variable-DW_AT_const_value.s lldb-api :: types/TestShortTypeExpr.py lldb-unit :: Utility/./UtilityTests/StreamTest.PutHex64ByteOrderBig lldb-api :: commands/frame/diagnose/inheritance/TestDiagnoseInheritance.py lldb-api :: functionalities/breakpoint/breakpoint_locations/TestBreakpointLocations.py lldb-api :: functionalities/archives/TestBSDArchives.py lldb-unit :: Utility/./UtilityTests/RecordReplayTest.InstrumentedBarRef lldb-api :: functionalities/data-formatter/data-formatter-disabling/TestDataFormatterDisabling.py lldb-unit :: ScriptInterpreter/Python/./ScriptInterpreterPythonTests/PythonDataObjectsTest.TestPythonBytes lldb-unit :: Utility/./UtilityTests/RecordReplayTest.InstrumentedBarPtr lldb-unit :: Host/./HostTests/NativeProcessProtocolTest.ReadCStringFromMemory_MaxSize lldb-unit :: Utility/./UtilityTests/TimerTest.CategoryTimes lldb-api :: lang/cpp/non-type-template-param/TestCppNonTypeTemplateParam.py lldb-unit :: Utility/./UtilityTests/ArgsTest.GetQuotedCommandString lldb-unit :: Utility/./UtilityTests/RangeVector.CombineConsecutiveRanges lldb-api :: tools/lldb-vscode/variables/TestVSCode_variables.py lldb-api :: lang/cpp/trivial_abi/TestTrivialABI.py lldb-api :: functionalities/data-formatter/nssetsynth/TestNSSetSynthetic.py lldb-shell :: ScriptInterpreter/None/none.test lldb-unit :: UnwindAssembly/x86/./UnwindAssemblyx86Tests/Testx86AssemblyInspectionEngine.Test32bitFramelessSmallStackFrame lldb-unit :: UnwindAssembly/x86/./UnwindAssemblyx86Tests/Testx86AssemblyInspectionEngine.TestDisassemblyJunkBytes lldb-unit :: Utility/./UtilityTests/DataExtractorTest.GetCStrUnterminated lldb-api :: lang/objc/bitfield_ivars/TestBitfieldIvars.py lldb-unit :: Utility/./UtilityTests/OptionsWithRawTest.EmptyArgsOnlySuffix lldb-unit :: Expression/./ExpressionTests/DiagnosticManagerTest.AddDiagnostic lldb-api :: tools/lldb-vscode/completions/TestVSCode_completions.py lldb-shell :: SymbolFile/DWARF/split-dwarf-inlining.cpp lldb-unit :: UnwindAssembly/x86/./UnwindAssemblyx86Tests/Testx86AssemblyInspectionEngine.TestPushRBX lldb-shell :: ObjectFile/ELF/netbsd-core-amd64.test lldb-api :: commands/session/history/TestSessionHistory.py lldb-api :: functionalities/thread/concurrent_events/TestConcurrentWatchBreak.py lldb-api :: functionalities/breakpoint/breakpoint_command/TestRegexpBreakCommand.py lldb-api :: terminal/TestEditline.py lldb-shell :: Reproducer/TestRelativePath.test lldb-shell :: Driver/TestPositionalArgs.test lldb-api :: commands/expression/formatters/TestFormatters.py lldb-unit :: ObjectFile/Breakpad/./ObjectFileBreakpadTests/FuncRecord.parse lldb-unit :: Utility/./UtilityTests/ProcessInstanceInfo.Yaml lldb-shell :: Driver/TestFile.test lldb-shell :: ScriptInterpreter/Python/sb_address_exception.test lldb-unit :: ObjectFile/Breakpad/./ObjectFileBreakpadTests/LineRecord.parse lldb-unit :: Utility/./UtilityTests/EnvironmentTest.EnvpConstruction lldb-api :: functionalities/memory/read/TestMemoryRead.py lldb-unit :: Utility/./UtilityTests/BinaryStreamTest.PutSLEB128SevenBytes lldb-api :: commands/expression/persistent_types/TestPersistentTypes.py lldb-unit :: Expression/./ExpressionTests/DWARFExpression.DW_OP_stack_value lldb-api :: functionalities/data-formatter/data-formatter-stl/libcxx/variant/TestDataFormatterLibcxxVariant.py lldb-unit :: Utility/./UtilityTests/Predicate.WaitForValueEqualTo lldb-api :: functionalities/thread/concurrent_events/TestConcurrentNWatchNBreak.py lldb-unit :: ObjectFile/PECOFF/./ObjectFilePECOFFTests/PECallFrameInfoTest.Frame_reg_eh lldb-unit :: Utility/./UtilityTests/EnvironmentTest.EnvpConversion lldb-api :: commands/command/source/TestCommandSource.py lldb-unit :: Utility/./UtilityTests/UUIDTest.Validity lldb-unit :: Utility/./UtilityTests/StringExtractorTest.GetHexBytesAvail_OddPair lldb-unit :: Host/./HostTests/SocketTests/SocketTest.UDPConnect/ipv6 lldb-api :: lang/cpp/typeof/TestTypeOfDeclTypeExpr.py lldb-api :: functionalities/process_group/TestChangeProcessGroup.py lldb-api :: lang/cpp/diamond/TestDiamond.py lldb-unit :: Utility/./UtilityTests/OptionsWithRawTest.EmptySuffix lldb-unit :: Utility/./UtilityTests/UriParserTest.BracketedHostnameWithPortIPv6 lldb-shell :: Commands/command-regex-delete.test lldb-unit :: Process/Utility/./ProcessUtilityTests/ProcSMapTests/LinuxProcSMapsTestFixture.ParseSMapRegions/4 lldb-api :: functionalities/thread/concurrent_events/TestConcurrentManySignals.py lldb-unit :: Utility/./UtilityTests/FileSpecTest.GetPath lldb-api :: tools/lldb-server/inferior-crash/TestGdbRemoteSegFault.py lldb-api :: lang/objcxx/objcxx-ivar-vector/TestIvarVector.py lldb-unit :: Utility/./UtilityTests/RangeTest.EqualInvalid lldb-unit :: UnwindAssembly/x86/./UnwindAssemblyx86Tests/Testx86AssemblyInspectionEngine.TestPopEBX lldb-unit :: Utility/./UtilityTests/ProcessInstanceInfoMatch.Name lldb-api :: lang/c/step-target/TestStepTarget.py lldb-unit :: UnwindAssembly/x86/./UnwindAssemblyx86Tests/Testx86AssemblyInspectionEngine.Test32BitOnlyInstruction lldb-unit :: Utility/./UtilityTests/BinaryStreamTest.PutULEB128FourBytes lldb-unit :: Language/Highlighting/./HighlighterTests/HighlighterTest.ClangPPDirectives lldb-unit :: Process/Utility/./ProcessUtilityTests/RegisterContext_x86Test.AbridgedToFullTagWord lldb-api :: driver/batch_mode/TestBatchMode.py lldb-api :: functionalities/process_save_core/TestProcessSaveCore.py lldb-api :: lang/c/tls_globals/TestTlsGlobals.py lldb-shell :: ObjectFile/MachO/subsections.yaml lldb-api :: iohandler/unicode/TestUnicode.py lldb-unit :: Utility/./UtilityTests/StreamTest.AddressSize lldb-api :: lang/objc/modules-inline-functions/TestModulesInlineFunctions.py lldb-unit :: UnwindAssembly/x86/./UnwindAssemblyx86Tests/Testx86AssemblyInspectionEngine.TestStackRealignMSVC_i386 lldb-api :: python_api/value/change_values/TestChangeValueAPI.py lldb-unit :: Process/minidump/./LLDBMinidumpTests/MinidumpParserTest.GetThreadsAndGetThreadContext lldb-shell :: Reproducer/TestFinalize.test lldb-unit :: Utility/./UtilityTests/RangeTest.ContainsRange lldb-unit :: Core/./LLDBCoreTests/SourceFileCache.FindSourceFileNotFound lldb-api :: lang/objc/cpp_keyword_identifiers/TestCppKeywordsAsObjCIdentifiers.py lldb-shell :: Driver/TestTarget.test lldb-api :: benchmarks/libcxxlist/TestBenchmarkLibcxxList.py lldb-api :: lang/cpp/function-qualifiers/TestCppFunctionQualifiers.py lldb-unit :: Utility/./UtilityTests/StringExtractorTest.InitEmpty lldb-unit :: Process/minidump/./LLDBMinidumpTests/MinidumpParserTest.GetLinuxProcStatus lldb-unit :: Expression/./ExpressionTests/DWARFExpression.DW_OP_convert lldb-shell :: SymbolFile/DWARF/debug-types-line-tables.s lldb-unit :: Utility/./UtilityTests/UriParserTest.BracketedHostnameWithPortIPv4 lldb-api :: functionalities/data-formatter/synthcapping/TestSyntheticCapping.py lldb-shell :: SymbolFile/DWARF/DW_OP_piece-smaller-than-struct.s lldb-api :: commands/watchpoints/step_over_watchpoint/TestStepOverWatchpoint.py lldb-unit :: Expression/./ExpressionTests/DiagnosticManagerTest.GetStringNoDiags lldb-api :: functionalities/thread/concurrent_events/TestConcurrentTwoBreakpointsOneSignal.py lldb-api :: functionalities/conditional_break/TestConditionalBreak.py lldb-unit :: Utility/./UtilityTests/ArchSpecTest.Compatibility lldb-api :: macosx/duplicate-archive-members/TestDuplicateMembers.py lldb-api :: python_api/frame/TestFrames.py lldb-api :: commands/help/TestHelp.py lldb-unit :: Utility/./UtilityTests/OptionsWithRawTest.ArgsButNoLeadingDash lldb-unit :: UnwindAssembly/x86/./UnwindAssemblyx86Tests/Testx86AssemblyInspectionEngine.TestPushEBX lldb-shell :: ObjectFile/Breakpad/sections.test lldb-unit :: Utility/./UtilityTests/PassiveReplayTest.InstrumentedBar lldb-shell :: Reproducer/Functionalities/TestExpressionEvaluation.test lldb-unit :: Process/minidump/./LLDBMinidumpTests/MinidumpParserTest.MinidumpDuplicateModuleMinAddress lldb-unit :: Utility/./UtilityTests/ConstStringTest.format_provider lldb-unit :: Interpreter/./InterpreterTests/OptionArgParserTest.toChar lldb-api :: macosx/indirect_symbol/TestIndirectSymbols.py lldb-shell :: Settings/TestSettingsWrite.test lldb-unit :: Language/Highlighting/./HighlighterTests/HighlighterTest.ClangSquareBrackets lldb-api :: functionalities/darwin_log/filter/exact_match/subsystem/TestDarwinLogFilterMatchSubsystem.py lldb-api :: lang/objc/modules-compile-error/TestModulesCompileError.py lldb-unit :: Utility/./UtilityTests/LogChannelEnabledTest.log_options lldb-unit :: SymbolFile/DWARF/./SymbolFileDWARFTests/DWARFASTParserClangTests.EnsureAllDIEsInDeclContextHaveBeenParsedParsesOnlyMatchingEntries lldb-api :: lang/c/step_over_no_deadlock/TestStepOverDoesntBlock.py lldb-api :: macosx/find-app-in-bundle/TestFindAppInBundle.py lldb-unit :: Process/minidump/./LLDBMinidumpTests/MinidumpParserTest.GetLinuxProcStatus_no_stream lldb-unit :: Language/Highlighting/./HighlighterTests/HighlighterTest.DefaultHighlighterWithCursorOutOfBounds lldb-unit :: SymbolFile/NativePDB/./SymbolFileNativePDBTests/PDBFPOProgramToDWARFExpressionTests.MultipleIndependentAssignments lldb-api :: lang/objc/radar-9691614/TestObjCMethodReturningBOOL.py lldb-unit :: Utility/./UtilityTests/UUIDTest.SetFromStringRef lldb-api :: commands/expression/import-std-module/weak_ptr-dbg-info-content/TestDbgInfoContentWeakPtrFromStdModule.py lldb-unit :: Utility/./UtilityTests/BinaryStreamTest.PutSLEB128EightBytes lldb-api :: lang/cpp/template-specialization-type/TestTemplateSpecializationType.py lldb-api :: lang/objc/modules-incomplete/TestIncompleteModules.py lldb-unit :: Utility/./UtilityTests/Flags.GetBitSize lldb-shell :: Breakpoint/debug_rnglist_offset_pair.test lldb-unit :: Utility/./UtilityTests/ScalarTest.Getters lldb-unit :: Expression/./ExpressionTests/CppModuleConfigurationTest.MissingLibCpp lldb-unit :: ScriptInterpreter/Python/./ScriptInterpreterPythonTests/PythonDataObjectsTest.TestPythonString lldb-unit :: Utility/./UtilityTests/AnsiTerminal.KnownPrefix lldb-unit :: Utility/./UtilityTests/UriParserTest.MinimalPort lldb-api :: commands/expression/multiline-completion/TestMultilineCompletion.py lldb-unit :: Process/gdb-remote/./ProcessGdbRemoteTests/GDBRemoteCommunicationClientTest.GetModulesInfoInvalidResponse lldb-api :: macosx/thread_suspend/TestInternalThreadSuspension.py lldb-unit :: Symbol/./SymbolTests/TestClangASTImporter.MetadataPropagationAfterCopying lldb-api :: commands/command/script/import/rdar-12586188/TestRdar12586188.py lldb-api :: functionalities/thread/concurrent_events/TestConcurrentTwoBreakpointThreads.py lldb-unit :: Utility/./UtilityTests/DataExtractorTest.UncommonAddressSize lldb-unit :: Utility/./UtilityTests/StringExtractorTest.GetHexU8_Underflow lldb-api :: commands/process/launch/TestProcessLaunch.py lldb-unit :: Utility/./UtilityTests/StringListTest.GetMaxStringLengthDecreasingSize lldb-api :: api/listeners/TestListener.py lldb-api :: python_api/function_symbol/TestSymbolAPI.py lldb-api :: lang/objc/foundation/TestObjCMethodsString.py lldb-unit :: Utility/./UtilityTests/StreamTest.PutHex8 lldb-unit :: Process/Utility/./ProcessUtilityTests/ProcMapTests/LinuxProcMapsTestFixture.ParseMapRegions/2 lldb-unit :: Utility/./UtilityTests/StringListTest.GetMaxStringLengthMixed lldb-api :: lang/cpp/static_members/TestCPPStaticMembers.py lldb-shell :: Reproducer/Functionalities/TestImageList.test lldb-api :: functionalities/data-formatter/data-formatter-stl/libcxx/iterator/TestDataFormatterLibccIterator.py lldb-shell :: Register/x86-64-read.test lldb-api :: commands/register/register/intel_xtended_registers/TestMPXRegisters.py lldb-api :: functionalities/thread/create_after_attach/TestCreateAfterAttach.py lldb-unit :: Utility/./UtilityTests/ScalarTest.ComparisonFloat lldb-api :: tools/lldb-server/TestGdbRemoteModuleInfo.py lldb-api :: functionalities/thread/thread_specific_break_plus_condition/TestThreadSpecificBpPlusCondition.py lldb-unit :: Utility/./UtilityTests/NameMatchesTest.EndsWith lldb-api :: functionalities/gdb_remote_client/TestGDBRemoteDiskFileCompletion.py lldb-unit :: UnwindAssembly/x86/./UnwindAssemblyx86Tests/Testx86AssemblyInspectionEngine.TestSimple64bitFrameFunction lldb-unit :: Utility/./UtilityTests/UriParserTest.BracketedHostnameWithColon lldb-api :: functionalities/data-formatter/data-formatter-stl/libcxx/tuple/TestDataFormatterLibcxxTuple.py lldb-shell :: Settings/TestModuleCacheSanity.test lldb-unit :: UnwindAssembly/x86/./UnwindAssemblyx86Tests/Testx86AssemblyInspectionEngine.Test32bitFramelessBigStackFrame lldb-api :: functionalities/step_scripted/TestStepScripted.py lldb-api :: python_api/name_lookup/TestNameLookup.py lldb-unit :: Utility/./UtilityTests/ArgsTest.TestAppendArg lldb-api :: functionalities/lazy-loading/TestLazyLoading.py lldb-shell :: ObjectFile/ELF/section-types-edgecases.yaml lldb-unit :: Utility/./UtilityTests/StringExtractorTest.GetHexU8_InvalidHex lldb-unit :: Utility/./UtilityTests/Predicate.WaitForValueNotEqualTo lldb-api :: commands/expression/import-std-module/deque-basic/TestDequeFromStdModule.py lldb-shell :: ObjectFile/Breakpad/sections-trailing-func.test lldb-api :: functionalities/data-formatter/data-formatter-objc/TestDataFormatterObjCNSDate.py lldb-api :: commands/watchpoints/watchpoint_set_command/TestWatchLocationWithWatchSet.py lldb-unit :: ScriptInterpreter/Python/./ScriptInterpreterPythonTests/PythonDataObjectsTest.TestExtractingUInt64ThroughStructuredData lldb-unit :: Utility/./UtilityTests/ScalarTest.SetValueFromCString lldb-unit :: Utility/./UtilityTests/PassiveReplayTest.InstrumentedFoo lldb-api :: functionalities/data-formatter/data-formatter-stl/libcxx/vector/TestDataFormatterLibcxxVector.py lldb-api :: lang/c/const_variables/TestConstVariables.py lldb-api :: commands/log/basic/TestLogging.py lldb-unit :: Core/./LLDBCoreTests/CommunicationTest.SynchronizeWhileClosing lldb-api :: commands/expression/namespace_local_var_same_name_cpp_and_c/TestNamespaceLocalVarSameNameCppAndC.py lldb-api :: commands/settings/quoting/TestQuoting.py lldb-api :: functionalities/breakpoint/address_breakpoints/TestBadAddressBreakpoints.py lldb-unit :: Target/./TargetTests/PathMappingListTest.AbsoluteTests lldb-unit :: SymbolFile/NativePDB/./SymbolFileNativePDBTests/PDBFPOProgramToDWARFExpressionTests.UnresolvedRegisterAssignmentReference lldb-shell :: SymbolFile/DWARF/module-ownership.mm lldb-shell :: Settings/TestEchoCommands.test lldb-unit :: Host/./HostTests/HostInfoTest.GetXcodeSDK lldb-unit :: Host/./HostTests/NativeProcessProtocolTest.SetBreakpointFailRead lldb-unit :: Host/./HostTests/NativeProcessProtocolTest.ReadMemoryWithoutTrap lldb-api :: functionalities/inline-stepping/TestInlineStepping.py lldb-api :: commands/expression/import-std-module/non-module-type-separation/TestNonModuleTypeSeparation.py lldb-api :: functionalities/data-formatter/synthupdate/TestSyntheticFilterRecompute.py lldb-shell :: Minidump/breakpad-symbols.test lldb-api :: arm/emulation/TestEmulations.py lldb-api :: lang/cpp/offsetof/TestOffsetofCpp.py lldb-api :: commands/target/basic/TestTargetCommand.py lldb-api :: lang/objc/conflicting-definition/TestConflictingDefinition.py lldb-api :: functionalities/data-formatter/data-formatter-synthval/TestDataFormatterSynthVal.py lldb-unit :: Language/Highlighting/./HighlighterTests/HighlighterTest.FallbackHighlighter lldb-api :: lang/cpp/stl/TestSTL.py lldb-api :: lang/cpp/subst_template_type_param/TestSubstTemplateTypeParam.py lldb-unit :: Platform/./LLDBPlatformTests/PlatformAppleSimulatorTest.TestSimHasSimEnvionament lldb-unit :: Language/CPlusPlus/./LanguageCPlusPlusTests/CPlusPlusLanguage.MethodNameParsing lldb-api :: functionalities/breakpoint/address_breakpoints/TestAddressBreakpoints.py lldb-api :: functionalities/gdb_remote_client/TestNoGPacketSupported.py lldb-api :: functionalities/gdb_remote_client/TestNoWatchpointSupportInfo.py lldb-unit :: Utility/./UtilityTests/SerializationRountripTest.SerializeDeserializeCStringArrayNullptrElem lldb-api :: lang/objc/foundation/TestObjCMethods2.py lldb-unit :: Utility/./UtilityTests/OptionsWithRawTest.EmptySuffixSingleWhitespace lldb-unit :: Utility/./UtilityTests/DataExtractorTest.GetCStrEmpty lldb-api :: lang/objcxx/cxx-bridged-po/TestObjCXXBridgedPO.py lldb-unit :: Expression/./ExpressionTests/CppModuleConfigurationTest.Linux lldb-api :: lang/c/modules/TestCModules.py lldb-unit :: Utility/./UtilityTests/RangeTest.SlideZero lldb-unit :: Platform/./LLDBPlatformTests/PlatformDarwinTest.TestParseVersionBuildDir lldb-shell :: Reproducer/TestGDBRemoteRepro.test lldb-unit :: Utility/./UtilityTests/StringListTest.CopyListEmpty lldb-api :: lang/cpp/global_operators/TestCppGlobalOperators.py lldb-unit :: Utility/./UtilityTests/StreamTeeTest.Constructor1Stream lldb-unit :: Utility/./UtilityTests/StatusTest.ErrorCodeConstructor lldb-api :: macosx/safe-to-func-call/TestSafeFuncCalls.py lldb-unit :: UnwindAssembly/x86/./UnwindAssemblyx86Tests/Testx86AssemblyInspectionEngine.TestPushRBPWithREX lldb-unit :: Symbol/./SymbolTests/TestTypeSystemClang.TemplateArguments lldb-shell :: SymbolFile/DWARF/debug_line-relative_path.s lldb-shell :: Reproducer/TestDriverOptions.test lldb-unit :: SymbolFile/DWARF/./SymbolFileDWARFTests/SymbolFileDWARFTests.TestAbbrevOrder1Start5 lldb-api :: iohandler/completion/TestIOHandlerCompletion.py lldb-unit :: Utility/./UtilityTests/FileSpecTest.IsRelative lldb-unit :: Language/Highlighting/./HighlighterTests/HighlighterTest.ClangIdentifiers lldb-unit :: ScriptInterpreter/Python/./ScriptInterpreterPythonTests/PythonDataObjectsTest.TestPythonInteger lldb-unit :: Utility/./UtilityTests/StreamTest.AddressEmptyPrefix lldb-api :: functionalities/jitloader_gdb/TestJITLoaderGDB.py lldb-unit :: Language/Highlighting/./HighlighterTests/HighlighterTest.Keywords lldb-unit :: UnwindAssembly/x86/./UnwindAssemblyx86Tests/Testx86AssemblyInspectionEngine.Testi386IgnoredRegisters lldb-shell :: Reproducer/TestCrash.test lldb-unit :: Utility/./UtilityTests/StringExtractorTest.GetHexU8_Underflow2 lldb-unit :: Process/minidump/./LLDBMinidumpTests/MinidumpParserTest.GetPid lldb-unit :: Utility/./UtilityTests/UriParserTest.MinimalPortPath lldb-shell :: ObjectFile/wasm/basic.yaml lldb-api :: commands/register/register/aarch64_sve_registers/rw_access_static_config/TestSVERegisters.py lldb-unit :: Utility/./UtilityTests/RegularExpression.Match lldb-api :: functionalities/data-formatter/frameformat_smallstruct/TestFrameFormatSmallStruct.py lldb-unit :: Language/CPlusPlus/./LanguageCPlusPlusTests/CPlusPlusLanguage.CPlusPlusNameParser lldb-unit :: Process/minidump/./LLDBMinidumpTests/RegisterContextMinidump.ConvertMinidumpContext_x86_32 lldb-api :: commands/thread/select/TestThreadSelect.py lldb-unit :: Utility/./UtilityTests/RecordReplayTest.InstrumentedFoo lldb-unit :: Utility/./UtilityTests/ProcessInstanceInfo.Dump lldb-shell :: ObjectFile/ELF/base-address.yaml lldb-unit :: Utility/./UtilityTests/StringExtractorTest.DecodeHexU8_Underflow lldb-shell :: SymbolFile/DWARF/dwp-debug-types.s lldb-api :: tools/lldb-server/commandline/TestStubSetSID.py lldb-api :: functionalities/data-formatter/data-formatter-stl/libcxx/map/TestDataFormatterLibccMap.py lldb-unit :: Utility/./UtilityTests/TimeoutTest.Format lldb-api :: sample_test/TestSampleInlineTest.py lldb-shell :: SymbolFile/Breakpad/line-table-discontinuous-file-ids.test lldb-api :: lang/cpp/modules-import/TestCXXModulesImport.py lldb-api :: lang/cpp/struct_with_keyword_name/TestStructWithKeywordName.py lldb-api :: lang/objc/real-definition/TestRealDefinition.py lldb-unit :: Utility/./UtilityTests/StreamTest.QuotedCString lldb-unit :: Symbol/./SymbolTests/TestTypeSystemClang.TestDisplayName lldb-api :: functionalities/gdb_remote_client/TestStopPCs.py lldb-unit :: Process/minidump/./LLDBMinidumpTests/MinidumpParserTest.GetMiscInfoWindows lldb-api :: commands/expression/namespace_local_var_same_name_obj_c/TestNamespaceLocalVarSameNameObjC.py lldb-unit :: Process/gdb-remote/./ProcessGdbRemoteTests/GDBRemoteCommunicationClientTest.WriteRegister lldb-api :: commands/command/script_alias/TestCommandScriptAlias.py lldb-shell :: Commands/command-target-modules-dump-sections.yaml lldb-unit :: Utility/./UtilityTests/OptionsWithRawTest.QuotedSuffix lldb-shell :: BuildScript/modes.test lldb-unit :: Process/Utility/./ProcessUtilityTests/ProcSMapTests/LinuxProcSMapsTestFixture.ParseSMapRegions/6 lldb-api :: commands/register/register/register_command/TestRegisters.py lldb-unit :: tools/lldb-server/tests/./LLDBServerTests/StandardStartupTest.TestStopReplyContainsThreadPcs lldb-api :: functionalities/tail_call_frames/inlining_and_tail_calls/TestInliningAndTailCalls.py lldb-api :: functionalities/return-value/TestReturnValue.py lldb-api :: lang/cpp/dynamic-value-same-basename/TestDynamicValueSameBase.py lldb-unit :: Utility/./UtilityTests/StreamTest.PutMaxHex64ByteOrderBig lldb-api :: functionalities/float-display/TestFloatDisplay.py lldb-unit :: Utility/./UtilityTests/RegularExpression.Invalid lldb-api :: lang/objcxx/objc-builtin-types/TestObjCBuiltinTypes.py lldb-shell :: Settings/TestFrameFormatColor.test lldb-unit :: Utility/./UtilityTests/XcodeSDKTest.FindXcodeContentsDirectoryInPath lldb-unit :: Utility/./UtilityTests/StringListTest.ForRange lldb-unit :: Process/gdb-remote/./ProcessGdbRemoteTests/GDBRemoteCommunicationServerTest.SendErrorResponse_Status lldb-unit :: Utility/./UtilityTests/BroadcasterTest.BroadcastEvent lldb-shell :: ScriptInterpreter/None/import_module.test lldb-unit :: Utility/./UtilityTests/RangeTest.Union lldb-api :: macosx/nslog/TestDarwinNSLogOutput.py lldb-api :: lang/c/local_variables/TestLocalVariables.py lldb-unit :: Process/gdb-remote/./ProcessGdbRemoteTests/GDBRemoteCommunicationServerTest.SendErrorResponse_ErrorNumber lldb-api :: lang/objc/blocks/TestObjCIvarsInBlocks.py lldb-unit :: Process/minidump/./LLDBMinidumpTests/MinidumpParserTest.MinidumpDuplicateModuleMappedSecond lldb-unit :: Process/Utility/./ProcessUtilityTests/ProcMapTests/LinuxProcMapsTestFixture.ParseMapRegions/0 lldb-api :: functionalities/inferior-crashing/recursive-inferior/TestRecursiveInferiorStep.py lldb-unit :: Utility/./UtilityTests/StringListTest.GetMaxStringLengthEmpty lldb-unit :: Utility/./UtilityTests/RecordReplayTest.InvalidSequence lldb-shell :: Driver/TestCommands.test lldb-api :: python_api/disassemble-raw-data/TestDisassembleRawData.py lldb-shell :: Quit/TestQuitExitCodeTooManyArgs.test lldb-unit :: Utility/./UtilityTests/RegularExpression.Empty lldb-api :: lang/objc/ivar-IMP/TestObjCiVarIMP.py lldb-api :: lang/cpp/signed_types/TestSignedTypes.py lldb-shell :: Settings/TestDefaultModuleCachePath.test lldb-unit :: UnwindAssembly/x86/./UnwindAssemblyx86Tests/Testx86AssemblyInspectionEngine.TestPopEDI lldb-shell :: SymbolFile/DWARF/dwarf5-debug_line.s lldb-api :: commands/settings/TestSettings.py lldb-api :: lang/cpp/multiple-inheritance/TestCppMultipleInheritance.py lldb-api :: functionalities/data-formatter/data-formatter-synthtype/TestDataFormatterSynthType.py lldb-shell :: ObjectFile/ELF/avr-basic-info.yaml lldb-unit :: SymbolFile/NativePDB/./SymbolFileNativePDBTests/PDBFPOProgramToDWARFExpressionTests.InvalidAssignmentSingle lldb-api :: linux/add-symbols/TestTargetSymbolsAddCommand.py lldb-api :: tools/lldb-server/TestGdbRemote_vContThreads.py lldb-unit :: UnwindAssembly/x86/./UnwindAssemblyx86Tests/Testx86AssemblyInspectionEngine.TestSpillRegToStackViaMOVx86_64 lldb-unit :: UnwindAssembly/x86/./UnwindAssemblyx86Tests/Testx86AssemblyInspectionEngine.TestPushECX lldb-unit :: Utility/./UtilityTests/StringListTest.InsertStringAtIndexOutOfBounds lldb-unit :: Target/./TargetTests/StackFrameRecognizerTest.NullModuleRegex lldb-shell :: Minidump/dump-all.test lldb-api :: lang/objc/global_ptrs/TestGlobalObjects.py lldb-api :: lang/objc/objc-struct-return/TestObjCStructReturn.py lldb-shell :: ScriptInterpreter/Python/command_relative_import.test lldb-unit :: Utility/./UtilityTests/UriParserTest.Empty lldb-unit :: Host/./HostTests/SocketTests/SocketTest.DomainGetConnectURI/ipv6 lldb-shell :: ObjectFile/ELF/compressed-sections.yaml lldb-unit :: Utility/./UtilityTests/BinaryStreamTest.PutSLEB128Zero lldb-api :: functionalities/load_using_paths/TestLoadUsingPaths.py lldb-shell :: SymbolFile/DWARF/debug_ranges-missing-section.s lldb-unit :: Utility/./UtilityTests/Flags.AnyClear lldb-api :: functionalities/gdb_remote_client/TestJLink6Armv7RegisterDefinition.py lldb-unit :: Language/Highlighting/./HighlighterTests/HighlighterTest.ClangCursorPosAfterOtherToken lldb-api :: python_api/symbol-context/TestSymbolContext.py lldb-api :: functionalities/data-formatter/hexcaps/TestDataFormatterHexCaps.py lldb-api :: commands/watchpoints/watchpoint_disable/TestWatchpointDisable.py lldb-shell :: Quit/TestQuitExitCode30.test lldb-unit :: Utility/./UtilityTests/StringListTest.LongestCommonPrefix lldb-shell :: Reproducer/Modules/TestModuleCXX.test lldb-shell :: Watchpoint/SetErrorCases.test lldb-api :: functionalities/breakpoint/move_nearest/TestMoveNearest.py lldb-api :: lang/cpp/incomplete-types/TestCppIncompleteTypes.py lldb-unit :: Utility/./UtilityTests/DataExtractorTest.GetCStrAtNullOffset lldb-unit :: Utility/./UtilityTests/NameMatchesTest.Equals lldb-api :: commands/expression/entry-bp/TestExprEntryBP.py lldb-api :: python_api/lldbutil/iter/TestLLDBIterator.py lldb-unit :: Target/./TargetTests/RemoteAwarePlatformTest.TestResolveExecutabelOnClientByPlatform lldb-api :: python_api/formatters/TestFormattersSBAPI.py lldb-unit :: tools/lldb-server/tests/./LLDBServerTests/TestBase.DebugserverEnv lldb-api :: commands/expression/import-std-module/conflicts/TestStdModuleWithConflicts.py lldb-unit :: Utility/./UtilityTests/RecordReplayTest.InstrumentedBar lldb-shell :: Recognizer/assert.test lldb-unit :: Utility/./UtilityTests/RangeTest.Copy lldb-api :: functionalities/breakpoint/breakpoint_names/TestBreakpointNames.py lldb-unit :: Utility/./UtilityTests/StreamTest.PutRawBytesToLittleEndian lldb-shell :: SymbolFile/DWARF/DW_TAG_variable-invalid_location.s lldb-api :: functionalities/fat_archives/TestFatArchives.py lldb-unit :: Utility/./UtilityTests/BinaryStreamTest.PutULEB128OneByte lldb-unit :: Target/./TargetTests/MemoryRegionInfoTest.Formatv lldb-api :: commands/frame/var-scope/TestFrameVariableScope.py lldb-unit :: Symbol/./SymbolTests/LineEntryTest.GetSameLineContiguousAddressRangeNestedInline lldb-unit :: Utility/./UtilityTests/OptionsWithRawTest.TerminatedQuote lldb-shell :: ObjectFile/ELF/PT_LOAD-empty.yaml lldb-unit :: Utility/./UtilityTests/BinaryStreamTest.PutULEB128EightBytes lldb-api :: commands/expression/import-std-module/vector/TestVectorFromStdModule.py lldb-shell :: Breakpoint/debug_rnglistx_rlex.test lldb-unit :: UnwindAssembly/x86/./UnwindAssemblyx86Tests/Testx86AssemblyInspectionEngine.TestStackRealign8BitDisp_i386 lldb-shell :: Quit/TestQuitExitCodeHexA.test lldb-api :: functionalities/thread/concurrent_events/TestConcurrentTwoWatchpointsOneBreakpoint.py lldb-api :: functionalities/thread/break_after_join/TestBreakAfterJoin.py lldb-unit :: Language/Highlighting/./HighlighterTests/HighlighterTest.ClangCursorPosBeforeOtherToken lldb-unit :: Utility/./UtilityTests/StringExtractorTest.GetNameColonValueSuccess lldb-unit :: Utility/./UtilityTests/ArgsTest.TestUnknownEscape lldb-api :: functionalities/gdb_remote_client/TestqOffsets.py lldb-shell :: Minidump/Windows/Sigsegv/sigsegv.test lldb-unit :: Utility/./UtilityTests/StringExtractorTest.GetHexBytes lldb-shell :: ObjectFile/ELF/section-addresses.yaml lldb-api :: functionalities/breakpoint/scripted_bkpt/TestScriptedResolver.py lldb-unit :: Utility/./UtilityTests/RangeTest.LessThan lldb-unit :: UnwindAssembly/x86/./UnwindAssemblyx86Tests/Testx86AssemblyInspectionEngine.TestLEAVE lldb-unit :: Utility/./UtilityTests/ProcessInstanceInfoList.Yaml lldb-api :: functionalities/dlopen_other_executable/TestDlopenOtherExecutable.py lldb-api :: lang/objc/self/TestObjCSelf.py lldb-unit :: Expression/./ExpressionTests/DiagnosticManagerTest.HasFixits lldb-api :: functionalities/tail_call_frames/disambiguate_call_site/TestDisambiguateCallSite.py lldb-api :: functionalities/thread/concurrent_events/TestConcurrentTwoWatchpointsOneDelayBreakpoint.py lldb-shell :: ObjectFile/ELF/section-permissions.yaml lldb-api :: commands/expression/import-std-module/forward_list/TestForwardListFromStdModule.py lldb-unit :: Utility/./UtilityTests/DataExtractorTest.GetULEB128_bit63 lldb-shell :: SymbolFile/DWARF/find-method-local-struct.cpp lldb-api :: functionalities/memory/find/TestMemoryFind.py lldb-api :: lang/cpp/bitfields/TestCppBitfields.py lldb-unit :: Language/Highlighting/./HighlighterTests/HighlighterTest.HighlighterSelectionPath lldb-api :: commands/watchpoints/watchpoint_events/TestWatchpointEvents.py lldb-api :: functionalities/abbreviation/TestAbbreviations.py lldb-unit :: Process/minidump/./LLDBMinidumpTests/MinidumpParserTest.GetPidWindows lldb-unit :: Process/Utility/./ProcessUtilityTests/ProcMapTests/LinuxProcMapsTestFixture.ParseMapRegions/1 lldb-unit :: Utility/./UtilityTests/AnsiTerminal.Incomplete lldb-api :: functionalities/data-formatter/data-formatter-stl/libcxx/unique_ptr/TestDataFormatterLibcxxUniquePtr.py lldb-unit :: Utility/./UtilityTests/RangeTest.ContainsAddr lldb-unit :: Utility/./UtilityTests/StringListTest.InsertStringAtIndexStart lldb-shell :: ObjectFile/PECOFF/sections-names.yaml lldb-api :: functionalities/postmortem/minidump-new/TestMiniDumpUUID.py lldb-api :: commands/target/stop-hook/delete/TestTargetStopHookDelete.py lldb-api :: functionalities/data-formatter/data-formatter-objc/TestDataFormatterObjCKVO.py lldb-unit :: DataFormatter/./LLDBFormatterTests/TypeMatcherTests.CreatedBySameMatchString lldb-unit :: Utility/./UtilityTests/StreamTest.PutRawBytesToMixedEndian lldb-unit :: SymbolFile/NativePDB/./SymbolFileNativePDBTests/PDBFPOProgramToDWARFExpressionTests.UnknownOp lldb-unit :: Host/./HostTests/FileSystemTest.GetPermissions lldb-api :: types/TestFloatTypesExpr.py lldb-shell :: Settings/TestDisableColor.test lldb-unit :: ScriptInterpreter/Python/./ScriptInterpreterPythonTests/PythonDataObjectsTest.TestPythonDictionaryManipulation lldb-unit :: Utility/./UtilityTests/StringExtractorTest.GetHexBytes_Partial lldb-unit :: Utility/./UtilityTests/BinaryStreamTest.PutSLEB128FiveBytes lldb-api :: python_api/watchpoint/condition/TestWatchpointConditionAPI.py lldb-shell :: Reproducer/TestFileRepro.test lldb-api :: lang/cpp/std-function-step-into-callable/TestStdFunctionStepIntoCallable.py lldb-unit :: Utility/./UtilityTests/FileSpecTest.Equal lldb-api :: lang/objc/objc-dyn-sbtype/TestObjCDynamicSBType.py lldb-unit :: Utility/./UtilityTests/StructuredDataTest.StringDump lldb-unit :: Target/./TargetTests/PathMappingListTest.RelativeTests lldb-unit :: Process/minidump/./LLDBMinidumpTests/MinidumpParserTest.InvalidMinidump lldb-api :: arm/breakpoint-it/TestBreakpointIt.py lldb-unit :: Utility/./UtilityTests/ArgsTest.ReplaceArgumentAtIndexFarOutOfRange lldb-shell :: Reproducer/TestProcessList.test lldb-api :: tools/lldb-vscode/console/TestVSCode_console.py lldb-unit :: Target/./TargetTests/ExecutionContextTest.GetByteOrder lldb-unit :: UnwindAssembly/x86/./UnwindAssemblyx86Tests/Testx86AssemblyInspectionEngine.TestPushEBP lldb-shell :: Minidump/disassemble-no-module.yaml lldb-shell :: ObjectFile/ELF/minidebuginfo-corrupt-xz.yaml lldb-unit :: Utility/./UtilityTests/VMRange.Reset lldb-api :: types/TestDoubleTypesExpr.py lldb-unit :: Utility/./UtilityTests/StringLexerTest.NextIf lldb-unit :: Utility/./UtilityTests/StringListTest.Clear lldb-api :: commands/expression/import-std-module/shared_ptr-dbg-info-content/TestSharedPtrDbgInfoContentFromStdModule.py lldb-unit :: Core/./LLDBCoreTests/ModuleSpecTest.InvalidInMemoryBuffer lldb-api :: lang/objc/rdar-12408181/TestRdar12408181.py lldb-unit :: Utility/./UtilityTests/StreamTeeTest.Constructor2Streams lldb-unit :: Utility/./UtilityTests/LogChannelTest.EnableOptions lldb-api :: commands/expression/import-std-module/empty-module/TestEmptyStdModule.py lldb-api :: tools/lldb-server/TestGdbRemoteProcessInfo.py lldb-api :: functionalities/source-map/TestTargetSourceMap.py lldb-unit :: UnwindAssembly/x86/./UnwindAssemblyx86Tests/Testx86AssemblyInspectionEngine.TestSimplex86_64Augmented lldb-unit :: ScriptInterpreter/Python/./ScriptInterpreterPythonTests/PythonDataObjectsTest.TestGlobalNameResolutionWithDot lldb-unit :: UnwindAssembly/x86/./UnwindAssemblyx86Tests/Testx86AssemblyInspectionEngine.TestSimple32bitFrameFunction lldb-unit :: Utility/./UtilityTests/CompletionRequest.TryCompleteCurrentArgGood lldb-api :: functionalities/data-formatter/vector-types/TestVectorTypesFormatting.py lldb-api :: lang/cpp/auto/TestCPPAuto.py lldb-api :: functionalities/data-formatter/var-in-aggregate-misuse/TestVarInAggregateMisuse.py lldb-api :: python_api/frame/get-variables/TestGetVariables.py lldb-api :: lang/cpp/operators/TestCppOperators.py lldb-unit :: Utility/./UtilityTests/StringListTest.AppendListCStringArray lldb-unit :: Utility/./UtilityTests/StringExtractorTest.GetHexU8_Underflow_NoEof lldb-api :: tools/lldb-vscode/step/TestVSCode_step.py lldb-api :: functionalities/data-formatter/pyobjsynthprovider/TestPyObjSynthProvider.py lldb-api :: commands/expression/import-std-module/vector-bool/TestVectorBoolFromStdModule.py lldb-api :: commands/target/create-deps/TestTargetCreateDeps.py lldb-unit :: Utility/./UtilityTests/LogTest.Register lldb-shell :: ObjectFile/MachO/lc_build_version.yaml lldb-api :: functionalities/gdb_remote_client/TestWriteMemory.py lldb-api :: commands/expression/char/TestExprsChar.py lldb-unit :: Utility/./UtilityTests/StringLexerTest.AdvanceIf lldb-api :: python_api/sbplatform/TestSBPlatform.py lldb-unit :: debugserver/./debugserverTests/RNBSocket.LoopBackListenIPv4 lldb-api :: python_api/target/TestTargetAPI.py lldb-api :: tools/lldb-server/TestGdbRemoteExitCode.py lldb-api :: functionalities/target-new-solib-notifications/TestModuleLoadedNotifys.py lldb-shell :: SymbolFile/DWARF/split-dwarf-multiple-cu.ll lldb-unit :: Utility/./UtilityTests/UriParserTest.BadPort lldb-shell :: Driver/TestNoUseColor.test lldb-api :: commands/target/stop-hooks/TestStopHookScripted.py lldb-unit :: Utility/./UtilityTests/VMRange.ContainsAddr lldb-api :: functionalities/breakpoint/cpp_exception/TestCPPExceptionBreakpoint.py lldb-unit :: Utility/./UtilityTests/StringListTest.RemoveBlankLines lldb-api :: functionalities/data-formatter/boolreference/TestFormattersBoolRefPtr.py lldb-unit :: Utility/./UtilityTests/BinaryStreamTest.PutULEB128SixBytes lldb-unit :: Symbol/./SymbolTests/TestTypeSystemClang.TestGetBasicTypeFromEnum lldb-unit :: Utility/./UtilityTests/LogTest.LLDB_LOG_nullptr lldb-unit :: Utility/./UtilityTests/ArgsTest.TestSingleArg lldb-unit :: ScriptInterpreter/Python/./ScriptInterpreterPythonTests/PythonDataObjectsTest.TestObjectAttributes lldb-api :: commands/expression/context-object/TestContextObject.py lldb-unit :: Host/./HostTests/HostInfoTest.GetAugmentedArchSpec lldb-unit :: Process/minidump/./LLDBMinidumpTests/MinidumpParserTest.MinidumpModuleOrder lldb-unit :: Platform/./LLDBPlatformTests/PlatformDarwinTest.FindComponentInPath lldb-api :: commands/watchpoints/multi_watchpoint_slots/TestWatchpointMultipleSlots.py lldb-shell :: ObjectFile/ELF/aarch64-relocations.yaml lldb-api :: commands/expression/call-function/TestCallUserDefinedFunction.py lldb-api :: functionalities/breakpoint/hardware_breakpoints/require_hw_breakpoints/TestRequireHWBreakpoints.py lldb-shell :: ObjectFile/PECOFF/basic-info-arm.yaml lldb-unit :: UnwindAssembly/x86/./UnwindAssemblyx86Tests/Testx86AssemblyInspectionEngine.TestPushRBP lldb-unit :: DataFormatter/./LLDBFormatterTests/StringPrinterTests.SwiftUTF8 lldb-unit :: Utility/./UtilityTests/StringExtractorTest.GetHexBytes_Underflow lldb-api :: functionalities/data-formatter/array_typedef/TestArrayTypedef.py lldb-unit :: Utility/./UtilityTests/StringExtractorTest.GetHexU8_Extra_NoEof lldb-unit :: Utility/./UtilityTests/RangeTest.ContainsEndInclusive lldb-unit :: ScriptInterpreter/Python/./ScriptInterpreterPythonTests/PythonDataObjectsTest.TestPythonFile lldb-api :: functionalities/tail_call_frames/disambiguate_paths_to_common_sink/TestDisambiguatePathsToCommonSink.py lldb-unit :: Utility/./UtilityTests/ArgsTest.ReplaceArgumentAtIndexShort lldb-unit :: Core/./LLDBCoreTests/RichManglingContextTest.SwitchProvider lldb-api :: lang/cpp/thread_local/TestThreadLocal.py lldb-unit :: Utility/./UtilityTests/Flags.Reset lldb-unit :: Process/gdb-remote/./ProcessGdbRemoteTests/GDBRemoteCommunicationClientTest.GetMemoryRegionInfoInvalidResponse lldb-api :: macosx/find-dsym/bundle-with-dot-in-filename/TestBundleWithDotInFilename.py lldb-api :: functionalities/paths/TestPaths.py lldb-unit :: Utility/./UtilityTests/ScalarTest.CastOperations lldb-unit :: Utility/./UtilityTests/StringExtractorTest.GetU64LittleEndian lldb-unit :: Target/./TargetTests/ModuleCacheTest.GetAndPut lldb-unit :: Utility/./UtilityTests/RecordReplayTest.InstrumentedFooSameThis lldb-unit :: Utility/./UtilityTests/ArchSpecTest.OperatorBool lldb-unit :: Expression/./ExpressionTests/CppModuleConfigurationTest.MissingUsrInclude lldb-unit :: Utility/./UtilityTests/CompletionRequest.ShiftArguments lldb-unit :: debugserver/./debugserverTests/RNBSocket.LoopBackConnectIPv6 lldb-api :: lang/cpp/template-function/TestTemplateFunctions.py lldb-unit :: Host/./HostTests/FileSystemTest.Exists lldb-api :: functionalities/data-formatter/data-formatter-enum-format/TestDataFormatterEnumFormat.py lldb-unit :: Utility/./UtilityTests/StreamTest.PutMaxHex64ByteOrderLittle lldb-unit :: Utility/./UtilityTests/StreamTest.PutHex64ByteOrderLittle lldb-unit :: UnwindAssembly/x86/./UnwindAssemblyx86Tests/Testx86AssemblyInspectionEngine.TestPushR15 lldb-shell :: Unwind/thread-step-out-ret-addr-check.test lldb-unit :: SymbolFile/DWARF/./SymbolFileDWARFTests/SymbolFileDWARFTests.TestAbbrevValidAttrNullForm lldb-unit :: debugserver/./debugserverTests/RNBSocket.AnyListen lldb-api :: lang/objc/foundation/TestFoundationDisassembly.py lldb-unit :: UnwindAssembly/x86/./UnwindAssemblyx86Tests/Testx86AssemblyInspectionEngine.TestSpillRegToStackViaMOVi386 lldb-unit :: Expression/./ExpressionTests/DiagnosticManagerTest.GetStringMultiline lldb-api :: tools/lldb-server/TestGdbRemoteRegisterState.py lldb-api :: commands/watchpoints/variable_out_of_scope/TestWatchedVarHitWhenInScope.py lldb-api :: functionalities/data-formatter/data-formatter-smart-array/TestDataFormatterSmartArray.py lldb-unit :: Utility/./UtilityTests/NameMatchesTest.RegularExpression lldb-unit :: Utility/./UtilityTests/StringExtractorTest.GetNameColonValueNoColon lldb-unit :: Symbol/./SymbolTests/PostfixExpression.ParseOneExpression lldb-api :: functionalities/gdb_remote_client/TestRegDefinitionInParts.py lldb-api :: functionalities/postmortem/mach-core/TestMachCore.py lldb-shell :: Breakpoint/jitbp_elf.test lldb-api :: commands/expression/call-throws/TestCallThatThrows.py lldb-unit :: Utility/./UtilityTests/ProcessInfoTest.Constructor lldb-api :: functionalities/postmortem/netbsd-core/TestNetBSDCore.py lldb-unit :: Utility/./UtilityTests/AnsiTerminal.WhiteSpace lldb-api :: commands/platform/basic/TestPlatformPython.py lldb-shell :: SymbolFile/Breakpad/line-table-mixed-path-styles.test lldb-api :: commands/expression/import-std-module/sysroot/TestStdModuleSysroot.py lldb-api :: api/multiple-targets/TestMultipleTargets.py lldb-shell :: ScriptInterpreter/Python/scripted_breakpoint_lua.test lldb-unit :: Utility/./UtilityTests/StreamTest.AddressNoSuffix lldb-api :: functionalities/data-formatter/type_summary_list_arg/TestTypeSummaryListArg.py lldb-api :: lang/cpp/enum_types/TestCPP11EnumTypes.py lldb-unit :: SymbolFile/DWARF/./SymbolFileDWARFTests/XcodeSDKModuleTests.TestModuleGetXcodeSDK lldb-unit :: Utility/./UtilityTests/ArchSpecTest.TestParseMachCPUDashSubtypeTripleExtra lldb-api :: lang/cpp/this/TestCPPThis.py lldb-shell :: SymbolFile/Breakpad/unwind-via-raSearch.test lldb-api :: benchmarks/frame_variable/TestFrameVariableResponse.py lldb-unit :: Utility/./UtilityTests/ArgsTest.AppendArguments lldb-unit :: Platform/Android/./AdbClientTests/AdbClientTest.CreateByDeviceId_ByEnvVar lldb-api :: functionalities/darwin_log/filter/regex/message/TestDarwinLogFilterRegexMessage.py lldb-unit :: Symbol/./SymbolTests/TestTypeSystemClang.OnlyPackName lldb-shell :: SymbolFile/DWARF/debug-types-dwarf5.s lldb-api :: lang/objc/variadic_methods/TestVariadicMethods.py lldb-unit :: Expression/./ExpressionTests/DiagnosticManagerTest.GetStringSeverityLabels lldb-api :: functionalities/gdb_remote_client/TestIOSSimulator.py lldb-unit :: Utility/./UtilityTests/StringListTest.AppendListCStringArrayEmpty lldb-unit :: Expression/./ExpressionTests/DWARFExpression.DW_OP_const lldb-unit :: ScriptInterpreter/Python/./ScriptInterpreterPythonTests/PythonDataObjectsTest.TestPythonDictionaryValueEquality lldb-api :: commands/breakpoint/command/list/TestBreakpointCommandList.py lldb-api :: macosx/debugserver-exit-code/TestDebugServerExitCode.py lldb-api :: types/TestIntegerType.py lldb-shell :: ObjectFile/MachO/lc_version_min.yaml lldb-unit :: ScriptInterpreter/Python/./ScriptInterpreterPythonTests/PythonDataObjectsTest.TestPythonIntegerToStr lldb-unit :: Utility/./UtilityTests/AnsiTerminal.AtEnd lldb-unit :: debugserver/./debugserverTests/RNBSocket.LoopBackConnectIPv4 lldb-shell :: SymbolFile/DWARF/debug_loc_and_loclists.s lldb-shell :: Commands/command-regex-unalias.test lldb-unit :: Host/./HostTests/FileSystemTest.Readable lldb-unit :: Symbol/./SymbolTests/TestTypeSystemClang.TestGetTypeClassTypeOfExpr lldb-unit :: Symbol/./SymbolTests/TestTypeSystemClang.TestFunctionTemplateInRecordConstruction lldb-api :: commands/command/nested_alias/TestNestedAlias.py lldb-api :: commands/expression/import-std-module/pair/TestPairFromStdModule.py lldb-api :: commands/expression/options/TestExprOptions.py lldb-unit :: Utility/./UtilityTests/StringExtractorTest.GetHexU8_Underflow2_NoEof lldb-unit :: Core/./LLDBCoreTests/ModuleSpecTest.TestMachOFile lldb-unit :: Language/Highlighting/./HighlighterTests/HighlighterTest.Colons lldb-api :: tools/lldb-server/inferior-crash/TestGdbRemoteAbort.py lldb-api :: functionalities/data-formatter/summary-string-onfail/Test-rdar-9974002.py lldb-unit :: Utility/./UtilityTests/Flags.AnySet lldb-unit :: Process/gdb-remote/./ProcessGdbRemoteTests/GDBRemoteCommunicationClientTest.WriteRegisterNoSuffix lldb-api :: lang/objc/modules-app-update/TestClangModulesAppUpdate.py lldb-api :: python_api/thread/TestThreadAPI.py lldb-unit :: Core/./LLDBCoreTests/UniqueCStringMap.NoDefaultConstructor lldb-shell :: SymbolFile/Breakpad/unwind-via-stack-cfi.test lldb-unit :: ScriptInterpreter/Python/./ScriptInterpreterPythonTests/PythonDataObjectsTest.TestModuleNameResolutionNoDot lldb-shell :: ObjectFile/MachO/lc_build_version_notools.yaml lldb-api :: commands/frame/recognizer/TestFrameRecognizer.py lldb-unit :: Expression/./ExpressionTests/DiagnosticManagerTest.PutStringSeverities lldb-api :: functionalities/tail_call_frames/unambiguous_sequence/TestUnambiguousTailCalls.py lldb-api :: macosx/thread-names/TestInterruptThreadNames.py lldb-unit :: Utility/./UtilityTests/ScalarTest.ExtractBitfield lldb-unit :: UnwindAssembly/x86/./UnwindAssemblyx86Tests/Testx86AssemblyInspectionEngine.TestMovRSPtoRBP lldb-api :: commands/frame/var/TestFrameVar.py lldb-api :: lang/cpp/namespace_conflicts/TestNamespaceConflicts.py lldb-unit :: Utility/./UtilityTests/ArgsTest.TestArgv lldb-unit :: DataFormatter/./LLDBFormatterTests/TypeMatcherTests.CreatedBySameMatchStringExactNamePrefixes lldb-api :: commands/process/attach/attach_denied/TestAttachDenied.py lldb-unit :: Utility/./UtilityTests/StreamTeeTest.GetStreamAtIndexOutOfBoundsEmpty lldb-unit :: Utility/./UtilityTests/RegularExpression.CopyAssignment lldb-unit :: Utility/./UtilityTests/StringListTest.GetMaxStringLengthEqualSize lldb-shell :: Commands/command-backtrace.test lldb-unit :: Symbol/./SymbolTests/TestScratchTypeSystemClang.InferSubASTFromLangOpts lldb-api :: commands/quit/TestQuit.py lldb-unit :: Utility/./UtilityTests/StringListTest.AppendStringStdString lldb-unit :: Process/gdb-remote/./ProcessGdbRemoteTests/GDBRemoteCommunicationClientTest.TestPacketSpeedJSON lldb-api :: functionalities/unwind/sigtramp/TestSigtrampUnwind.py lldb-unit :: UnwindAssembly/x86/./UnwindAssemblyx86Tests/Testx86AssemblyInspectionEngine.TestAddESP lldb-unit :: Language/Highlighting/./HighlighterTests/HighlighterTest.ClangTrailingBackslashBeforeNewline lldb-api :: lang/c/forward/TestForwardDeclaration.py lldb-api :: functionalities/thread/concurrent_events/TestConcurrentWatchpointDelayWatchpointOneBreakpoint.py lldb-shell :: Commands/command-stop-hook-output.test lldb-unit :: Utility/./UtilityTests/StringListTest.JoinEmpty lldb-api :: lang/cpp/dynamic-value/TestDynamicValue.py lldb-unit :: Utility/./UtilityTests/ScalarTest.Equality lldb-unit :: Interpreter/./InterpreterTests/OptionArgParserTest.toScriptLanguage lldb-unit :: Process/./ProcessEventDataTests/ProcessEventDataTest.ShouldStop lldb-api :: python_api/sbdata/TestSBData.py lldb-unit :: Symbol/./SymbolTests/TestClangASTImporter.CompleteFwdDeclWithOtherOrigin lldb-unit :: Utility/./UtilityTests/RangeDataVector.FindEntryIndexesThatContain_Overlap lldb-unit :: Process/minidump/./LLDBMinidumpTests/MinidumpParserTest.GetMemoryRegionInfoLinuxMapsError lldb-unit :: Utility/./UtilityTests/OptionsWithRawTest.EmptyInput lldb-unit :: Utility/./UtilityTests/StreamTest.PutSLEB128 lldb-api :: tools/lldb-server/TestGdbRemoteKill.py lldb-unit :: Utility/./UtilityTests/StatusTest.ErrorConversion lldb-unit :: Utility/./UtilityTests/StringLexerTest.HasAtLeast lldb-unit :: Expression/./ExpressionTests/DWARFExpression.DW_OP_pick lldb-unit :: Utility/./UtilityTests/SerializationRountripTest.SerializeDeserializeCStringArray lldb-unit :: Utility/./UtilityTests/RangeDataVector.FindEntryIndexesThatContain lldb-shell :: Quit/TestQuitExitCodeImplicit0.test lldb-unit :: Utility/./UtilityTests/StringListTest.Join lldb-unit :: Utility/./UtilityTests/ReproducerTest.SetCapture lldb-shell :: Host/TestCustomShell.test lldb-unit :: Language/CPlusPlus/./LanguageCPlusPlusTests/CPlusPlusLanguage.FindAlternateFunctionManglings lldb-unit :: Utility/./UtilityTests/RangeTest.SizeTypes lldb-unit :: Utility/./UtilityTests/UriParserTest.SchemeHostSeparator lldb-api :: commands/process/attach-resume/TestAttachResume.py lldb-api :: functionalities/asan/TestMemoryHistory.py lldb-api :: lang/cpp/exceptions/TestCPPExceptionBreakpoints.py lldb-unit :: Process/minidump/./LLDBMinidumpTests/RegisterContextMinidump.CheckRegisterContextMinidump_ARM lldb-unit :: ScriptInterpreter/Python/./ScriptInterpreterPythonTests/PythonDataObjectsTest.TestPythonListManipulation lldb-api :: macosx/lc-note/firmware-corefile/TestFirmwareCorefiles.py lldb-api :: lang/objc/modules-auto-import/TestModulesAutoImport.py lldb-api :: lang/objc/rdar-11355592/TestRdar11355592.py lldb-unit :: Utility/./UtilityTests/AnsiTerminal.Unknown lldb-api :: tools/lldb-server/TestGdbRemoteExpeditedRegisters.py lldb-shell :: Unwind/eh-frame-dwarf-unwind.test lldb-unit :: ObjectFile/Breakpad/./ObjectFileBreakpadTests/InfoRecord.parse lldb-api :: commands/gui/invalid-args/TestInvalidArgsGui.py lldb-unit :: Process/minidump/./LLDBMinidumpTests/MinidumpParserTest.GetThreadContext_x86_32 lldb-unit :: Utility/./UtilityTests/CompletionRequest.DuplicateFiltering lldb-api :: benchmarks/turnaround/TestCompileRunToBreakpointTurnaround.py lldb-api :: commands/expression/import-std-module/forward_decl_from_module/TestForwardDeclFromStdModule.py lldb-api :: lang/objc/objc-property/TestObjCProperty.py lldb-api :: functionalities/data-formatter/data-formatter-stl/libcxx/deque/TestDataFormatterLibcxxDeque.py lldb-unit :: Utility/./UtilityTests/ArgsTest.ReplaceArgumentAtIndexLonger lldb-unit :: Utility/./UtilityTests/BinaryStreamTest.PutSLEB128NineBytes lldb-unit :: Utility/./UtilityTests/BinaryStreamTest.PutSLEB128OneByte lldb-api :: functionalities/data-formatter/data-formatter-ptr-to-array/TestPtrToArrayFormatting.py lldb-api :: functionalities/step-avoids-no-debug/TestStepNoDebug.py lldb-unit :: UnwindAssembly/x86/./UnwindAssemblyx86Tests/Testx86AssemblyInspectionEngine.TestPushEDI lldb-api :: tools/lldb-vscode/runInTerminal/TestVSCode_runInTerminal.py lldb-shell :: SymbolFile/DWARF/clang-ast-from-dwarf-unamed-and-anon-structs.cpp lldb-api :: commands/platform/process/list/TestProcessList.py lldb-api :: macosx/builtin-debugtrap/TestBuiltinDebugTrap.py lldb-unit :: Utility/./UtilityTests/StreamTest.PutStringAsRawHex8 lldb-api :: functionalities/data-formatter/refpointer-recursion/TestDataFormatterRefPtrRecursion.py lldb-unit :: Utility/./UtilityTests/CompletionRequest.Constructor lldb-api :: lang/c/offsetof/TestOffsetof.py lldb-api :: lang/cpp/const_this/TestConstThis.py lldb-unit :: Utility/./UtilityTests/StringListTest.Assignment lldb-api :: functionalities/breakpoint/step_over_breakpoint/TestStepOverBreakpoint.py lldb-api :: commands/process/signal/TestProcessSignal.py lldb-unit :: Host/./HostTests/SocketTests/SocketTest.TCPGetAddress/ipv6 lldb-unit :: Utility/./UtilityTests/BinaryStreamTest.PutULEB128TwoBytes lldb-api :: functionalities/memory-region/TestMemoryRegion.py lldb-api :: commands/expression/calculator_mode/TestCalculatorMode.py lldb-unit :: Process/minidump/./LLDBMinidumpTests/MinidumpParserTest.GetPidWow64 lldb-unit :: Utility/./UtilityTests/StreamTest.ShiftOperatorPtr lldb-api :: functionalities/data-formatter/data-formatter-stl/libcxx/multiset/TestDataFormatterLibcxxMultiSet.py lldb-unit :: Utility/./UtilityTests/StreamTest.AddressRangeEmptyRange lldb-api :: commands/expression/top-level/TestTopLevelExprs.py lldb-api :: functionalities/darwin_log/filter/exact_match/message/TestDarwinLogFilterMatchMessage.py lldb-shell :: ObjectFile/Breakpad/breakpad-identification.test lldb-unit :: Utility/./UtilityTests/ScalarTest.RightShiftOperator lldb-unit :: Utility/./UtilityTests/StringExtractorTest.GetHexBytesAvail_OddPair2 lldb-unit :: Symbol/./SymbolTests/TestClangASTImporter.CopyDeclTagDecl lldb-api :: lang/objc/orderedset/TestOrderedSet.py lldb-unit :: Utility/./UtilityTests/RangeTest.Slide lldb-api :: benchmarks/libcxxmap/TestBenchmarkLibcxxMap.py lldb-unit :: Utility/./UtilityTests/DataExtractorTest.GetMaxU64 lldb-api :: lang/mixed/TestMixedLanguages.py lldb-api :: functionalities/plugins/command_plugin/TestPluginCommands.py lldb-api :: functionalities/tsan/thread_leak/TestTsanThreadLeak.py lldb-unit :: UnwindAssembly/x86/./UnwindAssemblyx86Tests/Testx86AssemblyInspectionEngine.TestAddRSP lldb-api :: commands/expression/rdar42038760/TestScalarURem.py lldb-api :: functionalities/thread/create_during_step/TestCreateDuringStep.py lldb-api :: functionalities/data-formatter/data-formatter-objc/TestDataFormatterObjCNSData.py lldb-api :: functionalities/thread/concurrent_events/TestConcurrentCrashWithBreak.py lldb-api :: python_api/lldbutil/process/TestPrintStackTraces.py lldb-shell :: Commands/command-breakpoint-col.test lldb-unit :: SymbolFile/NativePDB/./SymbolFileNativePDBTests/PDBFPOProgramToDWARFExpressionTests.MissingTargetRegister lldb-unit :: Host/./HostTests/SocketAddressTest.Set lldb-shell :: Minidump/Windows/find-module.test lldb-unit :: Utility/./UtilityTests/StringListTest.DefaultConstructor lldb-unit :: Process/Utility/./ProcessUtilityTests/ProcSMapTests/LinuxProcSMapsTestFixture.ParseSMapRegions/0 lldb-api :: lang/objc/objc-static-method/TestObjCStaticMethod.py lldb-unit :: Utility/./UtilityTests/GeneratorTest.Get lldb-shell :: ObjectFile/ELF/build-id-case.yaml lldb-unit :: Utility/./UtilityTests/ArgsTest.ReplaceArgumentAtIndexOutOfRange lldb-api :: functionalities/tsan/multiple/TestTsanMultiple.py lldb-shell :: Reproducer/TestCaptureEnvOverride.test lldb-api :: commands/target/select/TestTargetSelect.py lldb-api :: functionalities/thread/concurrent_events/TestConcurrentBreakpointsDelayedBreakpointOneWatchpoint.py lldb-unit :: Process/Utility/./ProcessUtilityTests/ProcMapTests/LinuxProcMapsTestFixture.ParseMapRegions/8 lldb-api :: lang/c/shared_lib_stripped_symbols/TestSharedLibStrippedSymbols.py lldb-shell :: Register/x86-64-gp-read.test lldb-api :: commands/target/stop-hooks/TestStopHooks.py lldb-unit :: Utility/./UtilityTests/StreamTest.AddressRangeSize lldb-api :: commands/expression/completion-in-lambda-and-unnamed-class/TestCompletionInLambdaAndUnnamedClass.py lldb-unit :: Utility/./UtilityTests/StreamTest.PutULEB128 lldb-unit :: Utility/./UtilityTests/StreamTest.PutHex16ByteOrderLittle lldb-api :: tools/lldb-server/registers-target-xml-reading/TestGdbRemoteTargetXmlPacket.py lldb-api :: lang/c/global_variables/TestGlobalVariables.py lldb-unit :: Process/Utility/./ProcessUtilityTests/ProcMapTests/LinuxProcMapsTestFixture.ParseMapRegions/3 lldb-api :: functionalities/thread/num_threads/TestNumThreads.py lldb-api :: commands/target/create-no-such-arch/TestNoSuchArch.py lldb-unit :: UnwindAssembly/x86/./UnwindAssemblyx86Tests/Testx86AssemblyInspectionEngine.Test64bitFramelessBigStackFrame lldb-unit :: Utility/./UtilityTests/RangeTest.NotEqualInvalid lldb-api :: tools/lldb-server/TestGdbRemoteCompletion.py lldb-unit :: Utility/./UtilityTests/RangeTest.DoesAdjoinOrIntersect lldb-unit :: Utility/./UtilityTests/StreamTest.PutRawBytesToBigEndian lldb-shell :: SymbolFile/DWARF/DW_AT_low_pc-addrx.s lldb-api :: python_api/sbenvironment/TestSBEnvironment.py lldb-api :: lang/cpp/accelerator-table/TestCPPAccelerator.py lldb-shell :: Register/x86-multithread-read.test lldb-api :: functionalities/darwin_log/filter/exact_match/activity/TestDarwinLogFilterMatchActivity.py lldb-api :: commands/gui/basicdebug/TestGuiBasicDebug.py lldb-unit :: Process/minidump/./LLDBMinidumpTests/MinidumpParserTest.MinidumpDuplicateModuleSeparateCode lldb-unit :: Utility/./UtilityTests/StringListTest.CopyListSingle lldb-unit :: Target/./TargetTests/ModuleCacheTest.GetAndPutStrangeHostname lldb-api :: functionalities/gdb_remote_client/TestProcessConnect.py lldb-api :: python_api/get-value-32bit-int/TestGetValue32BitInt.py lldb-api :: commands/session/save/TestSessionSave.py lldb-shell :: SymbolFile/DWARF/DW_AT_loclists_base.s lldb-unit :: Utility/./UtilityTests/StringLexerTest.Peek lldb-api :: commands/target/auto-install-main-executable/TestAutoInstallMainExecutable.py lldb-api :: api/command-return-object/TestSBCommandReturnObject.py lldb-unit :: Host/./HostTests/SocketTests/SocketTest.UDPConnect/ipv4 lldb-api :: commands/expression/import_builtin_fileid/TestImportBuiltinFileID.py lldb-api :: commands/command/script/TestCommandScript.py lldb-api :: commands/expression/dollar-in-variable/TestDollarInVariable.py lldb-api :: functionalities/data-formatter/data-formatter-stl/libstdcpp/iterator/TestDataFormatterStdIterator.py lldb-api :: functionalities/data-formatter/data-formatter-stl/libcxx/multimap/TestDataFormatterLibccMultiMap.py lldb-unit :: Symbol/./SymbolTests/PostfixExpression.ParseFPOProgram lldb-unit :: Host/./HostTests/SocketTests/SocketTest.DomainListenConnectAccept/ipv4 lldb-unit :: Utility/./UtilityTests/ArgsTest.TestSingleArgWithQuotedSpace lldb-api :: functionalities/inferior-crashing/TestInferiorCrashing.py lldb-api :: macosx/save_crashlog/TestSaveCrashlog.py lldb-unit :: Process/minidump/./LLDBMinidumpTests/MinidumpParserTest.GetArchitecture lldb-unit :: Utility/./UtilityTests/StreamTest.ShiftOperatorChars lldb-api :: commands/watchpoints/watchpoint_size/TestWatchpointSizes.py lldb-shell :: Heap/heap-cstr.test lldb-unit :: Utility/./UtilityTests/StringExtractorTest.GetHexBytes_OddPair lldb-shell :: SymbolFile/DWARF/debug-types-missing-signature.test lldb-unit :: Core/./LLDBCoreTests/RichManglingContextTest.FromCxxMethodName lldb-unit :: SymbolFile/DWARF/./SymbolFileDWARFTests/SymbolFileDWARFTests.TestAbbrevInvalidNULLTag lldb-unit :: Expression/./ExpressionTests/CppModuleConfigurationTest.LinuxLocalLibCpp lldb-api :: tools/lldb-vscode/module/TestVSCode_module.py lldb-unit :: Utility/./UtilityTests/FileSpecTest.PrependPathComponent lldb-api :: lang/c/typedef/Testtypedef.py lldb-unit :: Utility/./UtilityTests/CompletionRequest.TestCompletionOwnership lldb-unit :: Utility/./UtilityTests/Flags.IsClear lldb-api :: functionalities/target_var/no_vars/TestTargetVarNoVars.py lldb-api :: sample_test/TestSampleTest.py lldb-unit :: Utility/./UtilityTests/StringExtractorTest.GetHexU8_InvalidHex_NoEof lldb-api :: lang/objcxx/hide-runtime-values/TestObjCXXHideRuntimeValues.py lldb-api :: lang/objc/foundation/TestObjCMethods.py lldb-unit :: Expression/./ExpressionTests/DWARFExpression.DW_OP_implicit_value lldb-shell :: ObjectFile/ELF/PT_LOAD.yaml lldb-api :: commands/watchpoints/multiple_threads/TestWatchpointMultipleThreads.py lldb-unit :: Utility/./UtilityTests/AnsiTerminal.Empty lldb-api :: functionalities/optimized_code/TestNoASanExceptionAfterEvalOP_piece.py lldb-unit :: Language/Highlighting/./HighlighterTests/HighlighterTest.ClangPreserveNewLine lldb-unit :: Utility/./UtilityTests/ConstStringTest.NullAndEmptyStates lldb-unit :: Signals/./SignalsTests/UnixSignalsTest.GetInfo lldb-api :: python_api/signals/TestSignalsAPI.py lldb-unit :: UnwindAssembly/x86/./UnwindAssemblyx86Tests/Testx86AssemblyInspectionEngine.TestPushEDX lldb-api :: commands/expression/anonymous-struct/TestCallUserAnonTypedef.py lldb-unit :: ScriptInterpreter/Python/./ScriptInterpreterPythonTests/PythonDataObjectsTest.TestPythonByteArray lldb-unit :: SymbolFile/NativePDB/./SymbolFileNativePDBTests/PDBFPOProgramToDWARFExpressionTests.MultipleDependentAssignments lldb-api :: sanity/TestSettingSkipping.py lldb-shell :: ObjectFile/ELF/minidebuginfo-find-symbols.yaml lldb-api :: commands/expression/save_jit_objects/TestSaveJITObjects.py lldb-unit :: Host/./HostTests/MainLoopTest.TerminatesImmediately lldb-unit :: Host/./HostTests/SocketTests/SocketTest.TCPListen0GetPort/ipv6 lldb-unit :: Utility/./UtilityTests/StringExtractorTest.GetHexU8_Extra lldb-unit :: Utility/./UtilityTests/UserIDResolver.GetGroupName lldb-api :: tools/lldb-server/libraries-svr4/TestGdbRemoteLibrariesSvr4Support.py lldb-api :: lang/cpp/alignas_base_class/TestAlignAsBaseClass.py lldb-api :: functionalities/thread/exit_during_expression/TestExitDuringExpression.py lldb-api :: lang/cpp/unicode-literals/TestUnicodeLiterals.py lldb-unit :: Expression/./ExpressionTests/DiagnosticManagerTest.PutString lldb-unit :: Utility/./UtilityTests/StringListTest.SetSize lldb-api :: functionalities/thread_plan/TestThreadPlanCommands.py lldb-unit :: Utility/./UtilityTests/StringListTest.ShiftMove lldb-unit :: Utility/./UtilityTests/VMRange.IsValid lldb-api :: lang/cpp/template/TestTemplateArgs.py lldb-api :: functionalities/data-formatter/type_summary_list_script/TestTypeSummaryListScript.py lldb-shell :: SymbolFile/DWARF/debug_ranges.s lldb-api :: macosx/universal/TestUniversal.py lldb-api :: functionalities/breakpoint/breakpoint_by_file_colon_line/TestBreakpointByFileColonLine.py lldb-unit :: Utility/./UtilityTests/BinaryStreamTest.PutSLEB128TwoBytes lldb-api :: functionalities/breakpoint/breakpoint_language/TestBreakpointLanguage.py lldb-shell :: Reproducer/Functionalities/TestStepping.test lldb-unit :: Utility/./UtilityTests/ArgsTest.GetShellSafeArgument lldb-shell :: Reproducer/TestDump.test lldb-api :: python_api/default-constructor/TestDefaultConstructorForAPIObjects.py lldb-api :: functionalities/data-formatter/ptr_ref_typedef/TestPtrRef2Typedef.py lldb-unit :: Utility/./UtilityTests/FileSpecTest.FileAndDirectoryComponents lldb-api :: functionalities/data-formatter/builtin-formats/TestBuiltinFormats.py lldb-api :: commands/expression/codegen-crash-import-def-arraytype-element/TestImportDefinitionArrayType.py lldb-api :: functionalities/tsan/global_location/TestTsanGlobalLocation.py lldb-api :: functionalities/signal/TestSendSignal.py lldb-api :: python_api/watchpoint/TestWatchpointIter.py lldb-api :: functionalities/thread/concurrent_events/TestConcurrentSignalBreak.py lldb-api :: functionalities/breakpoint/breakpoint_ids/TestBreakpointIDs.py lldb-api :: lang/cpp/typedef/TestCppTypedef.py lldb-unit :: ScriptInterpreter/Python/./ScriptInterpreterPythonTests/PythonDataObjectsTest.TestBorrowedReferences lldb-api :: linux/mix-dwo-and-regular-objects/TestMixedDwarfBinary.py lldb-unit :: Utility/./UtilityTests/TildeExpressionResolver.ResolveFullPath lldb-unit :: Utility/./UtilityTests/SubsystemRAIITest.SubsystemWithErrorFailure lldb-api :: commands/expression/codegen-crash-typedefdecl-not-in_declcontext/TestCodegenCrashTypedefDeclNotInDeclContext.py lldb-unit :: Language/Highlighting/./HighlighterTests/HighlighterTest.ClangBraces lldb-unit :: Editline/./EditlineTests/EditlineTestFixture.EditlineReceivesSingleLineText lldb-unit :: Utility/./UtilityTests/StreamTeeTest.SetStreamAtIndexOverwrite lldb-api :: python_api/event/TestEvents.py lldb-unit :: Utility/./UtilityTests/StringListTest.JoinThree lldb-api :: functionalities/gdb_remote_client/TestRecognizeBreakpoint.py lldb-api :: lang/objc/unicode-string/TestUnicodeString.py lldb-api :: python_api/process/io/TestProcessIO.py lldb-unit :: ScriptInterpreter/Python/./ScriptInterpreterPythonTests/PythonDataObjectsTest.TestPythonBoolean lldb-api :: lang/cpp/llvm-style/TestLLVMStyle.py lldb-api :: functionalities/tsan/basic/TestTsanBasic.py lldb-shell :: BuildScript/compiler-full-path.test lldb-unit :: Process/gdb-remote/./ProcessGdbRemoteTests/GDBRemoteClientBaseTest.InterruptNoResponse lldb-api :: functionalities/tail_call_frames/ambiguous_tail_call_seq1/TestAmbiguousTailCallSeq1.py lldb-api :: tools/lldb-vscode/breakpoint/TestVSCode_setExceptionBreakpoints.py lldb-unit :: UnwindAssembly/x86/./UnwindAssemblyx86Tests/Testx86AssemblyInspectionEngine.TestPopRBP lldb-unit :: Expression/./ExpressionTests/ClangHostTest.ComputeClangResourceDirectory lldb-unit :: Process/gdb-remote/./ProcessGdbRemoteTests/PortMapTest.FreePortForProcess lldb-unit :: UnwindAssembly/x86/./UnwindAssemblyx86Tests/Testx86AssemblyInspectionEngine.TestSpArithx86_64Augmented lldb-shell :: SymbolFile/DWARF/debug_aranges-empty-section.s lldb-api :: tools/lldb-vscode/breakpoint/TestVSCode_setBreakpoints.py lldb-unit :: Utility/./UtilityTests/SerializationRountripTest.SerializeDeserializePodPointers lldb-api :: lang/cpp/member-and-local-vars-with-same-name/TestMembersAndLocalsWithSameName.py lldb-api :: lang/c/complex_int/TestComplexInt.py lldb-unit :: Utility/./UtilityTests/UUIDTest.StringConverion lldb-api :: lang/cpp/namespace/TestNamespace.py lldb-unit :: Utility/./UtilityTests/PassiveReplayTest.InstrumentedBarRef lldb-api :: commands/expression/xvalue/TestXValuePrinting.py lldb-api :: functionalities/thread/concurrent_events/TestConcurrentDelayedCrashWithBreakpointSignal.py lldb-shell :: Reproducer/TestWorkingDir.test lldb-api :: functionalities/breakpoint/hardware_breakpoints/write_memory_with_hw_breakpoint/TestWriteMemoryWithHWBreakpoint.py lldb-api :: lang/c/stepping/TestStepAndBreakpoints.py lldb-unit :: Utility/./UtilityTests/TimerTest.CategoryTimesNested lldb-api :: lang/c/enum_types/TestEnumTypes.py lldb-api :: lang/c/find_struct_type/TestFindStructTypes.py lldb-shell :: ObjectFile/PDB/object.test lldb-unit :: Utility/./UtilityTests/StreamTeeTest.CopyConstructor lldb-unit :: ScriptInterpreter/Python/./ScriptInterpreterPythonTests/PythonDataObjectsTest.TestPythonIntegerToStructuredInteger lldb-unit :: ObjectFile/Breakpad/./ObjectFileBreakpadTests/Record.classify lldb-api :: functionalities/limit-debug-info/TestLimitDebugInfo.py lldb-unit :: Utility/./UtilityTests/StringListTest.JoinMultiCharSeparator lldb-api :: python_api/lldbutil/frame/TestFrameUtils.py lldb-api :: lang/cpp/extern_c/TestExternCSymbols.py lldb-api :: functionalities/data-formatter/format-propagation/TestFormatPropagation.py lldb-api :: functionalities/breakpoint/auto_continue/TestBreakpointAutoContinue.py lldb-unit :: Utility/./UtilityTests/StreamTest.PutChar lldb-unit :: Utility/./UtilityTests/SharedCluster.ClusterManager lldb-api :: lang/cpp/global_variables/TestCPPGlobalVariables.py lldb-api :: lang/cpp/function-template-parameter-pack/TestFunctionTemplateParameterPack.py lldb-unit :: UnwindAssembly/x86/./UnwindAssemblyx86Tests/Testx86AssemblyInspectionEngine.TestPopR14 lldb-unit :: Utility/./UtilityTests/XcodeSDKTest.SDKSupportsSwift lldb-api :: commands/expression/issue_11588/Test11588.py lldb-unit :: Utility/./UtilityTests/RangeTest.ClearWithStarAddress lldb-api :: functionalities/set-data/TestSetData.py lldb-shell :: VSCode/TestOptions.test lldb-unit :: Language/Highlighting/./HighlighterTests/HighlighterTest.ClangStringLiterals lldb-api :: functionalities/tail_call_frames/cross_object/TestCrossObjectTailCalls.py lldb-unit :: ScriptInterpreter/Python/./ScriptInterpreterPythonTests/PythonDataObjectsTest.TestPythonTupleToStructuredList lldb-api :: python_api/value/linked_list/TestValueAPILinkedList.py lldb-shell :: Breakpoint/single-file-split-dwarf.test lldb-shell :: Minidump/no-process-id.yaml lldb-unit :: Symbol/./SymbolTests/PostfixExpression.ToDWARF lldb-shell :: Breakpoint/debug_addrx.test lldb-unit :: Symbol/./SymbolTests/TestTypeSystemClang.TestDisplayNameEmpty lldb-api :: functionalities/breakpoint/comp_dir_symlink/TestCompDirSymLink.py lldb-unit :: Utility/./UtilityTests/ArgsTest.TestMultipleArgs lldb-api :: functionalities/process_crash_info/TestProcessCrashInfo.py lldb-api :: functionalities/data-formatter/cstring-utf8-summary/TestCstringUnicode.py lldb-shell :: ObjectFile/wasm/stripped-debug-sections.yaml lldb-shell :: Reproducer/Functionalities/TestDataFormatter.test lldb-unit :: Utility/./UtilityTests/UriParserTest.BadPort2 lldb-shell :: ObjectFile/PECOFF/sections.yaml lldb-unit :: Host/./HostTests/SocketTests/SocketTest.UDPGetConnectURI/ipv4 lldb-unit :: UnwindAssembly/x86/./UnwindAssemblyx86Tests/Testx86AssemblyInspectionEngine.TestDisassemblyMidFunctionEpilogues lldb-api :: commands/expression/radar_9673664/TestExprHelpExamples.py lldb-unit :: Utility/./UtilityTests/ScalarTest.LongLongAssigmentOperator lldb-api :: functionalities/data-formatter/data-formatter-stl/libcxx/optional/TestDataFormatterLibcxxOptional.py lldb-unit :: Host/./HostTests/SocketTests/SocketTest.TCPGetAddress/ipv4 lldb-unit :: DataFormatter/./LLDBFormatterTests/StringPrinterTests.CxxUTF8 lldb-api :: functionalities/gdb_remote_client/TestPlatformClient.py lldb-unit :: DataFormatter/./LLDBFormatterTests/StringPrinterTests.CxxASCII lldb-api :: lang/objc/objc-ivar-offsets/TestObjCIvarOffsets.py lldb-unit :: ScriptInterpreter/Python/./ScriptInterpreterPythonTests/PythonDataObjectsTest.TestTypeNameResolutionNoDot lldb-unit :: Process/minidump/./LLDBMinidumpTests/MinidumpParserTest.GetThreadContext_x86_32_wow64 lldb-api :: python_api/value/empty_class/TestValueAPIEmptyClass.py lldb-shell :: SymbolFile/DWARF/gnu-style-compression.cpp lldb-unit :: Utility/./UtilityTests/OptionsWithRawTest.ArgsButNoDelimiter lldb-unit :: Utility/./UtilityTests/StringExtractorTest.GetNameColonValueContainsColon lldb-api :: lang/cpp/default-template-args/TestDefaultTemplateArgs.py lldb-api :: functionalities/unwind/zeroth_frame/TestZerothFrame.py lldb-shell :: ObjectFile/wasm/unified-debug-sections.yaml lldb-api :: functionalities/data-formatter/stringprinter/TestStringPrinter.py lldb-unit :: Utility/./UtilityTests/SerializationRountripTest.SerializeDeserializePodReferences lldb-api :: functionalities/breakpoint/source_regexp/TestSourceRegexBreakpoints.py lldb-unit :: Host/./HostTests/NativeProcessProtocolTest.ReadCStringFromMemory lldb-api :: lang/cpp/call-function/TestCallCPPFunction.py lldb-unit :: Host/./HostTests/SocketTests/SocketTest.TCPListen0ConnectAccept/ipv6 lldb-api :: macosx/function-starts/TestFunctionStarts.py lldb-shell :: ObjectFile/Breakpad/discontiguous-sections.test lldb-unit :: Utility/./UtilityTests/ScalarTest.Comparison lldb-unit :: Utility/./UtilityTests/ConstStringTest.MangledCounterpart lldb-api :: tools/lldb-vscode/disconnect/TestVSCode_disconnect.py lldb-unit :: Symbol/./SymbolTests/TestClangASTImporter.DeportDeclTagDecl lldb-unit :: Process/gdb-remote/./ProcessGdbRemoteTests/GDBRemoteClientBaseTest.SendPacketAndReceiveResponseWithOutputSupport lldb-shell :: Reproducer/TestDiscard.test lldb-api :: commands/expression/import-std-module/retry-with-std-module/TestRetryWithStdModule.py lldb-unit :: Target/./TargetTests/ExecutionContextTest.GetByteOrderTarget lldb-unit :: Interpreter/./InterpreterTests/OptionValueFileColonLine.setFromString lldb-api :: types/TestDoubleTypes.py lldb-unit :: ScriptInterpreter/Python/./ScriptInterpreterPythonTests/PythonDataObjectsTest.TestPythonListToStructuredList lldb-unit :: Utility/./UtilityTests/CompletionRequest.FakeLastArg lldb-unit :: Process/Utility/./ProcessUtilityTests/RegisterContext_x86Test.FullToAbridgedTagWord lldb-api :: commands/expression/persistent_variables/TestPersistentVariables.py lldb-unit :: Expression/./ExpressionTests/CppModuleConfigurationTest.AmbiguousLibCpp lldb-unit :: Host/./HostTests/MainLoopTest.UnmonitoredSignal lldb-unit :: UnwindAssembly/x86/./UnwindAssemblyx86Tests/Testx86AssemblyInspectionEngine.TestSubESP lldb-api :: functionalities/darwin_log/basic/TestDarwinLogBasic.py lldb-shell :: Settings/TestFrameFormatNoColor.test lldb-unit :: Utility/./UtilityTests/RangeTest.DoesIntersect lldb-api :: macosx/profile_vrs_detach/TestDetachVrsProfile.py lldb-unit :: Process/gdb-remote/./ProcessGdbRemoteTests/GDBRemoteCommunicationClientTest.ReadRegister lldb-api :: functionalities/gdb_remote_client/TestArmRegisterDefinition.py lldb-api :: lang/objc/objc++/TestObjCXX.py lldb-unit :: ObjectFile/Breakpad/./ObjectFileBreakpadTests/FileRecord.parse lldb-unit :: UnwindAssembly/x86/./UnwindAssemblyx86Tests/Testx86AssemblyInspectionEngine.TestCALLNextInsn lldb-unit :: Utility/./UtilityTests/StreamTeeTest.AppendStream lldb-api :: lang/c/record_decl_in_expr/TestRecordDeclInExpr.py lldb-shell :: Commands/command-source.test lldb-unit :: Utility/./UtilityTests/BinaryStreamTest.PutULEB128ThreeBytes lldb-unit :: Utility/./UtilityTests/RangeDataVector.FindEntryThatContains lldb-api :: functionalities/data-formatter/data-formatter-stl/libcxx/queue/TestDataFormatterLibcxxQueue.py lldb-api :: lang/objc/forward-decl/TestForwardDecl.py lldb-unit :: UnwindAssembly/x86/./UnwindAssemblyx86Tests/Testx86AssemblyInspectionEngine.TestPushR13 lldb-unit :: Utility/./UtilityTests/RegisterValueTest.GetScalarValue lldb-unit :: Utility/./UtilityTests/ArchSpecTest.YAML lldb-api :: commands/expression/persist_objc_pointeetype/TestPersistObjCPointeeType.py lldb-api :: commands/expression/import-std-module/queue/TestQueueFromStdModule.py lldb-api :: functionalities/thread/concurrent_events/TestConcurrentBreakpointDelayBreakpointOneSignal.py lldb-api :: benchmarks/continue/TestBenchmarkContinue.py lldb-api :: functionalities/stats_api/TestStatisticsAPI.py lldb-unit :: Utility/./UtilityTests/BinaryStreamTest.PutULEB128MaxValue lldb-api :: lang/cpp/class_types/TestClassTypesDisassembly.py lldb-api :: lang/objc/objc-ivar-protocols/TestIvarProtocols.py lldb-unit :: Utility/./UtilityTests/ArchSpecTest.MergeFrom lldb-api :: python_api/sbtype_typeclass/TestSBTypeTypeClass.py lldb-unit :: UnwindAssembly/x86/./UnwindAssemblyx86Tests/Testx86AssemblyInspectionEngine.Test64bitFramelessSmallStackFrame lldb-unit :: Utility/./UtilityTests/StringListTest.LongestCommonPrefixSingleElement lldb-unit :: SymbolFile/DWARF/./SymbolFileDWARFTests/SymbolFileDWARFTests.ParseArangesNonzeroSegmentSize lldb-api :: functionalities/unwind/noreturn/module-end/TestNoReturnModuleEnd.py lldb-unit :: Utility/./UtilityTests/StringExtractorTest.GetHexBytesAvail_Partial lldb-api :: functionalities/darwin_log/filter/regex/activity-chain/TestDarwinLogFilterRegexActivityChain.py lldb-shell :: lldb-server/TestErrorMessages.test lldb-api :: lang/cpp/frame-var-anon-unions/TestFrameVariableAnonymousUnions.py lldb-api :: lang/cpp/breakpoint_in_member_func_w_non_primitive_params/TestBreakpointInMemberFuncWNonPrimitiveParams.py lldb-shell :: Breakpoint/split-dwarf-5-addrbase.test lldb-unit :: Utility/./UtilityTests/StringListTest.LongestCommonPrefixNoPrefix lldb-api :: tools/lldb-vscode/launch/TestVSCode_launch.py lldb-unit :: Utility/./UtilityTests/UUIDTest.RelationalOperators lldb-api :: functionalities/data-formatter/data-formatter-objc/TestDataFormatterObjNSException.py lldb-unit :: DataFormatter/./LLDBFormatterTests/TypeMatcherTests.GetMatchStringExactName lldb-api :: tools/lldb-server/TestGdbRemoteAuxvSupport.py lldb-unit :: SymbolFile/NativePDB/./SymbolFileNativePDBTests/PDBFPOProgramToDWARFExpressionTests.UnresolvedCyclicRegisterAssignmentReference lldb-unit :: Process/gdb-remote/./ProcessGdbRemoteTests/GDBRemoteCommunicationClientTest.SendGetMetaDataPacket lldb-unit :: Core/./LLDBCoreTests/MangledTest.EmptyForInvalidName lldb-api :: functionalities/data-formatter/compactvectors/TestCompactVectors.py lldb-api :: commands/expression/radar_8638051/Test8638051.py lldb-api :: lang/cpp/dynamic-value/TestCppValueCast.py lldb-unit :: Utility/./UtilityTests/StreamTeeTest.DefaultConstructor lldb-api :: lang/c/set_values/TestSetValues.py lldb-unit :: Host/./HostTests/MainLoopTest.DetectsEOF lldb-unit :: ScriptInterpreter/Python/./ScriptInterpreterPythonTests/PythonDataObjectsTest.TestPythonStringToStructuredString lldb-api :: functionalities/thread/concurrent_events/TestConcurrentTwoWatchpointThreads.py lldb-unit :: Host/./HostTests/NativeProcessProtocolTest.ReadCStringFromMemory_CrossPageBoundary lldb-api :: linux/aarch64/mte_memory_region/TestAArch64LinuxMTEMemoryRegion.py lldb-api :: commands/expression/test/TestExprs.py lldb-api :: tools/lldb-server/memory-allocation/TestGdbRemoteMemoryAllocation.py lldb-api :: functionalities/data-formatter/language_category_updates/TestDataFormatterLanguageCategoryUpdates.py lldb-api :: functionalities/pointer_num_children/TestPointerNumChildren.py lldb-unit :: Expression/./ExpressionTests/ClangHostTest.MacOSX lldb-shell :: ObjectFile/ELF/section-types.yaml lldb-unit :: Host/./HostTests/Host.WaitStatusFormat lldb-unit :: Utility/./UtilityTests/VMRange.SetEndAddress lldb-api :: commands/expression/import-std-module/unique_ptr-dbg-info-content/TestUniquePtrDbgInfoContent.py lldb-shell :: SymbolFile/DWARF/anon_class_w_and_wo_export_symbols.ll lldb-unit :: Utility/./UtilityTests/TimerTest.CategoryTimesStats lldb-unit :: Utility/./UtilityTests/StringExtractorTest.DecodeHexU8_Exact lldb-api :: tools/lldb-server/commandline/TestGdbRemoteConnection.py lldb-unit :: Utility/./UtilityTests/TimeoutTest.Construction lldb-api :: tools/lldb-vscode/breakpoint/TestVSCode_setFunctionBreakpoints.py lldb-unit :: UnwindAssembly/x86/./UnwindAssemblyx86Tests/Testx86AssemblyInspectionEngine.TestPush0 lldb-api :: functionalities/data-formatter/data-formatter-objc/TestDataFormatterObjCNSBundle.py lldb-unit :: Utility/./UtilityTests/OptionsWithRawTest.MultiWordSuffix lldb-api :: lang/objc/rdar-10967107/TestRdar10967107.py lldb-api :: functionalities/thread/state_after_expression/TestStateAfterExpression.py lldb-shell :: ObjectFile/Breakpad/uuid-matching-mac.test lldb-unit :: UnwindAssembly/x86/./UnwindAssemblyx86Tests/Testx86AssemblyInspectionEngine.TestPopRBPWithREX lldb-unit :: Utility/./UtilityTests/StreamTest.PutHex32ByteOrderLittle lldb-unit :: Utility/./UtilityTests/RangeTest.ContainsAddrInvalid lldb-unit :: Utility/./UtilityTests/ArchSpecTest.TripleComponentsWereSpecified lldb-unit :: Utility/./UtilityTests/XcodeSDKTest.MergeTest lldb-api :: functionalities/inferior-changed/TestInferiorChanged.py lldb-unit :: Utility/./UtilityTests/OptionsWithRawTest.SingleWhitespaceInput lldb-unit :: Symbol/./SymbolTests/TestTypeSystemClang.TestGetEnumIntegerTypeInvalid lldb-unit :: Host/./HostTests/FileSystemTest.Resolve lldb-api :: python_api/sbstructureddata/TestStructuredDataAPI.py lldb-api :: python_api/type/TestTypeList.py lldb-shell :: ObjectFile/ELF/PT_TLS-overlap-PT_LOAD.yaml lldb-api :: iohandler/resize/TestIOHandlerResizeNoEditline.py lldb-shell :: Breakpoint/split-dwarf5-debug-stroffsets.test lldb-api :: commands/frame/diagnose/dereference-argument/TestDiagnoseDereferenceArgument.py lldb-api :: functionalities/memory/cache/TestMemoryCache.py lldb-unit :: Utility/./UtilityTests/ArgsTest.BareSingleQuote lldb-unit :: UnwindAssembly/x86/./UnwindAssemblyx86Tests/Testx86AssemblyInspectionEngine.TestPushR12 lldb-unit :: ScriptInterpreter/Python/./ScriptInterpreterPythonTests/PythonDataObjectsTest.TestPythonTupleValues lldb-unit :: Host/./HostTests/File.GetWaitableHandleFileno lldb-api :: functionalities/thread/crash_during_step/TestCrashDuringStep.py lldb-shell :: SymbolFile/DWARF/debug_line-tombstone.s lldb-api :: commands/apropos/with-process/TestAproposWithProcess.py lldb-unit :: Process/minidump/./LLDBMinidumpTests/MinidumpParserTest.GetExceptionStream lldb-api :: functionalities/postmortem/elf-core/TestLinuxCore.py lldb-api :: python_api/process/TestProcessAPI.py lldb-api :: lang/cpp/virtual-overload/TestVirtualOverload.py lldb-unit :: Utility/./UtilityTests/SerializationRountripTest.SerializeDeserializePod lldb-shell :: SymbolFile/Breakpad/line-table-edgecases.test lldb-unit :: Utility/./UtilityTests/StreamTest.AddressPrefixAndSuffix lldb-api :: functionalities/pre_run_dylibs/TestPreRunDylibs.py lldb-api :: functionalities/darwin_log/format/TestDarwinLogMessageFormat.py lldb-api :: functionalities/breakpoint/breakpoint_callback_command_source/TestBreakpointCallbackCommandSource.py lldb-shell :: Driver/TestHelp.test lldb-unit :: Breakpoint/./LLDBBreakpointTests/BreakpointIDTest.StringIsBreakpointName lldb-api :: functionalities/signal/raise/TestRaise.py lldb-shell :: ObjectFile/wasm/embedded-debug-sections.yaml lldb-api :: lang/c/local_types/TestUseClosestType.py lldb-unit :: Utility/./UtilityTests/RangeTest.ContainsEndInclusiveInvalid lldb-api :: commands/expression/import-std-module/unique_ptr/TestUniquePtrFromStdModule.py lldb-unit :: Symbol/./SymbolTests/SymbolsTest.LocateExecutableSymbolFileForUnknownExecutableAndMissingSymbolFile lldb-api :: functionalities/data-formatter/data-formatter-skip-summary/TestDataFormatterSkipSummary.py lldb-unit :: Utility/./UtilityTests/ArgsTest.TestInsertArg lldb-unit :: Utility/./UtilityTests/DataExtractorTest.PeekData lldb-api :: commands/expression/unwind_expression/TestUnwindExpression.py lldb-api :: functionalities/data-formatter/data-formatter-stl/libcxx/vbool/TestDataFormatterLibcxxVBool.py lldb-unit :: Symbol/./SymbolTests/TestClangASTImporter.MetadataPropagation lldb-api :: functionalities/postmortem/minidump-new/TestMiniDumpNew.py lldb-api :: commands/expression/import-std-module/deque-dbg-info-content/TestDbgInfoContentDequeFromStdModule.py lldb-unit :: Host/./HostTests/File.GetStreamFromDescriptor lldb-api :: lang/cpp/virtual-functions/TestCppVirtualFunctions.py lldb-unit :: Utility/./UtilityTests/StructuredDataTest.ParseJSONFromFile lldb-api :: python_api/value_var_update/TestValueVarUpdate.py lldb-api :: commands/gui/breakpoints/TestGuiBreakpoints.py lldb-shell :: ScriptInterpreter/Python/eof.test lldb-unit :: Symbol/./SymbolTests/TestClangASTImporter.MetadataPropagationIndirectImport lldb-api :: functionalities/thread/backtrace_limit/TestBacktraceLimit.py lldb-unit :: Utility/./UtilityTests/ScalarTest.Promotion lldb-unit :: Utility/./UtilityTests/Flags.AllClear lldb-unit :: Language/Highlighting/./HighlighterTests/HighlighterTest.ClangUnterminatedString lldb-api :: macosx/dyld-trie-symbols/TestDyldTrieSymbols.py lldb-shell :: SymbolFile/DWARF/apple-index-is-used.cpp lldb-unit :: Utility/./UtilityTests/FileSpecTest.EqualDotsPosix lldb-unit :: Symbol/./SymbolTests/TestTypeSystemClang.TestDeletingImplicitCopyCstrDueToMoveCStr lldb-api :: functionalities/thread/exit_during_step/TestExitDuringStep.py lldb-unit :: ScriptInterpreter/Python/./ScriptInterpreterPythonTests/PythonDataObjectsTest.TestPythonStringToStr lldb-shell :: Driver/TestError.test lldb-shell :: BuildScript/toolchain-clang.test lldb-unit :: Utility/./UtilityTests/ScalarTest.GetValue lldb-api :: lang/cpp/overloaded-functions/TestOverloadedFunctions.py lldb-unit :: Language/CPlusPlus/./LanguageCPlusPlusTests/CPlusPlusLanguage.ExtractContextAndIdentifier lldb-api :: commands/expression/macros/TestMacros.py lldb-api :: functionalities/dead-strip/TestDeadStrip.py lldb-api :: functionalities/breakpoint/breakpoint_conditions/TestBreakpointConditions.py lldb-api :: functionalities/thread/step_until/TestStepUntil.py lldb-unit :: Host/./HostTests/FileSystemTest.EnumerateDirectory lldb-unit :: Utility/./UtilityTests/StreamTest.ChangingByteOrder lldb-shell :: Reproducer/TestSynchronous.test lldb-unit :: UnwindAssembly/x86/./UnwindAssemblyx86Tests/Testx86AssemblyInspectionEngine.TestPopESI lldb-unit :: Utility/./UtilityTests/ScalarTest.Scalar_512 lldb-api :: types/TestCharTypeExpr.py lldb-unit :: Language/Highlighting/./HighlighterTests/HighlighterTest.DefaultHighlighterWithCursor lldb-api :: lang/cpp/stl/TestStdCXXDisassembly.py lldb-unit :: Process/gdb-remote/./ProcessGdbRemoteTests/GDBRemoteClientBaseTest.SendContinueDelegateStructuredDataReceipt lldb-unit :: Utility/./UtilityTests/FileSpecTest.Match lldb-shell :: ScriptInterpreter/Python/Crashlog/json.test lldb-api :: lang/objc/objc-static-method-stripped/TestObjCStaticMethodStripped.py lldb-unit :: Utility/./UtilityTests/RangeDataVector.FindEntryThatContains_Overlap lldb-api :: benchmarks/startup/TestStartupDelays.py lldb-unit :: Utility/./UtilityTests/StringListTest.AppendStringMove lldb-api :: functionalities/unwind/ehframe/TestEhFrameUnwind.py lldb-api :: functionalities/thread/concurrent_events/TestConcurrentTwoWatchpointsOneSignal.py lldb-api :: lang/cpp/class-template-type-parameter-pack/TestClassTemplateTypeParameterPack.py lldb-unit :: Process/gdb-remote/./ProcessGdbRemoteTests/GDBRemoteClientBaseTest.SendContinueAndAsyncPacket lldb-api :: lang/cpp/breakpoint-commands/TestCPPBreakpointCommands.py lldb-unit :: Utility/./UtilityTests/ArgsTest.EscapeLLDBCommandArgument lldb-unit :: Language/Highlighting/./HighlighterTests/HighlighterTest.ClangCursorPos lldb-unit :: ScriptInterpreter/Python/./ScriptInterpreterPythonTests/PythonDataObjectsTest.TestResetting lldb-unit :: Process/gdb-remote/./ProcessGdbRemoteTests/GDBRemoteCommunicationTest.ReadPacket_checksum lldb-api :: functionalities/type_lookup/TestTypeLookup.py lldb-unit :: Utility/./UtilityTests/BinaryStreamTest.PutSLEB128FourBytes lldb-api :: python_api/disassemble-raw-data/TestDisassemble_VST1_64.py lldb-api :: functionalities/data-formatter/data-formatter-stl/libstdcpp/tuple/TestDataFormatterStdTuple.py lldb-api :: functionalities/tail_call_frames/thread_step_out_or_return/TestSteppingOutWithArtificialFrames.py lldb-unit :: Utility/./UtilityTests/UriParserTest.TypicalPortPathIPv6 lldb-unit :: SymbolFile/DWARF/./SymbolFileDWARFTests/SymbolFileDWARFTests.ParseAranges lldb-shell :: ObjectFile/ELF/PT_LOAD-overlap.yaml lldb-unit :: Utility/./UtilityTests/FileSpecTest.RemoveLastPathComponent lldb-unit :: Utility/./UtilityTests/StringExtractorTest.DecodeHexU8_InvalidHex2 lldb-unit :: Utility/./UtilityTests/StreamTeeTest.GetStreamAtIndexOutOfBounds lldb-unit :: Utility/./UtilityTests/NameMatchesTest.Ignore lldb-api :: functionalities/thread/thread_specific_break/TestThreadSpecificBreakpoint.py lldb-shell :: Quit/TestQuitExitCode0.test lldb-api :: macosx/lc-note/kern-ver-str/TestKernVerStrLCNOTE.py lldb-api :: functionalities/postmortem/minidump/TestMiniDump.py lldb-api :: commands/expression/ir-interpreter/TestIRInterpreter.py lldb-unit :: Utility/./UtilityTests/UriParserTest.BracketedHostnamePort lldb-api :: commands/disassemble/basic/TestFrameDisassemble.py lldb-unit :: SymbolFile/NativePDB/./SymbolFileNativePDBTests/PDBFPOProgramToDWARFExpressionTests.InvalidOpBinary lldb-unit :: Utility/./UtilityTests/StringListTest.SplitIntoLines lldb-api :: functionalities/data-formatter/data-formatter-script/TestDataFormatterScript.py lldb-unit :: Utility/./UtilityTests/ConstStringTest.CompareConstString lldb-unit :: Utility/./UtilityTests/ProcessInstanceInfo.DumpTable lldb-api :: functionalities/postmortem/wow64_minidump/TestWow64MiniDump.py lldb-shell :: Process/TestEnvironment.test lldb-unit :: Target/./TargetTests/ModuleCacheTest.GetAndPutUuidExists lldb-api :: python_api/module_section/TestModuleAndSection.py lldb-unit :: SymbolFile/NativePDB/./SymbolFileNativePDBTests/PDBFPOProgramToDWARFExpressionTests.UnsupportedRASearch lldb-unit :: Utility/./UtilityTests/DataExtractorTest.GetFloat lldb-unit :: Host/./HostTests/NativeProcessProtocolTest.SetBreakpoint lldb-shell :: ScriptInterpreter/Python/scripted_breakpoint.test lldb-api :: commands/expression/call-function/TestCallBuiltinFunction.py lldb-api :: lang/objc/ptr_refs/TestPtrRefsObjC.py lldb-api :: commands/breakpoint/set/func-regex/TestBreakpointRegexError.py lldb-api :: functionalities/thread/concurrent_events/TestConcurrentManyBreakpoints.py lldb-unit :: Process/minidump/./LLDBMinidumpTests/MinidumpParserTest.FindMemoryRangeWithFullMemoryMinidump lldb-unit :: Signals/./SignalsTests/UnixSignalsTest.GetFilteredSignals lldb-api :: functionalities/gdb_remote_client/TestQemuAArch64TargetXml.py lldb-api :: functionalities/thread/concurrent_events/TestConcurrentTwoBreakpointsOneDelaySignal.py lldb-unit :: Utility/./UtilityTests/StringListTest.InsertStringAtIndexMove lldb-api :: tools/lldb-server/TestGdbRemoteThreadsInStopReply.py lldb-api :: lang/objc/objc-new-syntax/TestObjCNewSyntaxDictionary.py lldb-api :: commands/frame/diagnose/bad-reference/TestBadReference.py lldb-unit :: Utility/./UtilityTests/Flags.Clear lldb-unit :: Utility/./UtilityTests/UriParserTest.LongPath lldb-api :: test_utils/TestPExpectTest.py lldb-api :: types/TestShortType.py lldb-api :: functionalities/gdb_remote_client/TestWasm.py lldb-unit :: Utility/./UtilityTests/CompletionRequest.DuplicateFilteringWithComments lldb-api :: commands/add-dsym/uuid/TestAddDsymCommand.py lldb-api :: lang/cpp/rvalue-references/TestRvalueReferences.py lldb-unit :: ScriptInterpreter/Python/./ScriptInterpreterPythonTests/PythonDataObjectsTest.TestPythonTupleInitializerList lldb-unit :: Language/Highlighting/./HighlighterTests/HighlighterTest.HighlighterSelectionType lldb-api :: functionalities/gdb_remote_client/TestGDBRemoteLoad.py lldb-unit :: Utility/./UtilityTests/VMRange.CollectionContains lldb-api :: functionalities/tail_call_frames/sbapi_support/TestTailCallFrameSBAPI.py lldb-api :: commands/source/info/TestSourceInfo.py lldb-api :: commands/frame/diagnose/local-variable/TestLocalVariable.py lldb-unit :: Host/./HostTests/SocketTests/SocketTest.TCPListen0ConnectAccept/ipv4 lldb-unit :: Utility/./UtilityTests/StringExtractorTest.InitMisc lldb-unit :: Process/gdb-remote/./ProcessGdbRemoteTests/GDBRemoteClientBaseTest.SendContinueAndInterrupt lldb-unit :: Target/./TargetTests/PathMappingListTest.RemapRoot lldb-api :: commands/expression/regression-access-function-template-in-record/TestRegressionAccessFunctionTemplateInRecord.py lldb-unit :: Expression/./ExpressionTests/CppModuleConfigurationTest.LibCppV2 lldb-api :: functionalities/darwin_log/filter/regex/subsystem/TestDarwinLogFilterRegexSubsystem.py lldb-unit :: Utility/./UtilityTests/VMRange.ContainsRange lldb-api :: assert_messages_test/TestAssertMessages.py lldb-api :: commands/watchpoints/watchpoint_commands/TestWatchpointCommands.py lldb-unit :: Utility/./UtilityTests/BinaryStreamTest.PutULEB128FiveBytes lldb-api :: functionalities/data-formatter/data-formatter-cpp/TestDataFormatterCpp.py lldb-api :: functionalities/data-formatter/nsarraysynth/TestNSArraySynthetic.py lldb-shell :: Reproducer/TestPythonImport.test lldb-unit :: Process/gdb-remote/./ProcessGdbRemoteTests/GDBRemoteClientBaseTest.SendContinueAndWait lldb-api :: lang/objc/objc-baseclass-sbtype/TestObjCBaseClassSBType.py lldb-api :: macosx/find-dsym/deep-bundle/TestDeepBundle.py lldb-unit :: ObjectFile/Breakpad/./ObjectFileBreakpadTests/StackWinRecord.parse lldb-unit :: SymbolFile/NativePDB/./SymbolFileNativePDBTests/PDBFPOProgramToDWARFExpressionTests.InvalidAssignmentMultiple lldb-api :: commands/watchpoints/watchpoint_count/TestWatchpointCount.py lldb-unit :: Target/./TargetTests/ExecutionContextTest.GetByteOrderProcess lldb-unit :: Process/minidump/./LLDBMinidumpTests/MinidumpParserTest.GetFilteredModuleList lldb-api :: functionalities/deleted-executable/TestDeletedExecutable.py lldb-api :: functionalities/signal/handle-abrt/TestHandleAbort.py lldb-api :: lang/objc/objc-new-syntax/TestObjCNewSyntaxLiteral.py lldb-api :: commands/trace/TestTraceStartStop.py lldb-unit :: Process/minidump/./LLDBMinidumpTests/MinidumpParserTest.MinidumpDuplicateModuleMappedFirst lldb-unit :: Utility/./UtilityTests/LogChannelEnabledTest.LogVerboseThread lldb-api :: functionalities/multidebugger_commands/TestMultipleDebuggersCommands.py lldb-api :: functionalities/data-formatter/data-formatter-objc/TestDataFormatterObjCNSContainer.py lldb-api :: functionalities/breakpoint/breakpoint_set_restart/TestBreakpointSetRestart.py lldb-unit :: Utility/./UtilityTests/SerializationRountripTest.SerializeDeserializeObjectReference lldb-unit :: Utility/./UtilityTests/StringListTest.CopyList lldb-unit :: Symbol/./SymbolTests/TestTypeSystemClang.TestUnifyAccessSpecifiers lldb-api :: functionalities/thread/step_out/TestThreadStepOut.py lldb-unit :: Symbol/./SymbolTests/TestTypeSystemClang.TestGetTypeClassDeclType lldb-api :: lang/objc/objc-super/TestObjCSuper.py lldb-shell :: Minidump/memory-region-from-module.yaml lldb-shell :: SymbolFile/Breakpad/symtab-macho.test lldb-unit :: Utility/./UtilityTests/Flags.AllSet lldb-shell :: SymbolFile/DWARF/dwarf5-atomic.s lldb-api :: python_api/sblaunchinfo/TestSBLaunchInfo.py lldb-unit :: UnwindAssembly/x86/./UnwindAssemblyx86Tests/Testx86AssemblyInspectionEngine.TestPushESI lldb-unit :: Core/./LLDBCoreTests/RichManglingContextTest.Basic lldb-unit :: Interpreter/./InterpreterTests/OptionArgParserTest.toBoolean lldb-api :: commands/command/invalid-args/TestInvalidArgsCommand.py lldb-unit :: DataFormatter/./LLDBFormatterTests/TypeMatcherTests.ExactName lldb-unit :: Core/./LLDBCoreTests/SourceFileCache.FindSourceFileFound lldb-unit :: Utility/./UtilityTests/CompletionRequest.TryCompleteCurrentArgBad lldb-api :: python_api/exprpath_synthetic/TestExprPathSynthetic.py lldb-api :: commands/command/delete/TestCommandDelete.py lldb-unit :: Language/Highlighting/./HighlighterTests/HighlighterTest.ClangComments lldb-unit :: Process/Utility/./ProcessUtilityTests/ProcSMapTests/LinuxProcSMapsTestFixture.ParseSMapRegions/7 lldb-api :: commands/expression/unicode-in-variable/TestUnicodeInVariable.py lldb-api :: lang/objc/foundation/TestObjCMethodsNSError.py lldb-unit :: Utility/./UtilityTests/ListenerTest.GetEventWait lldb-shell :: SymbolFile/Breakpad/symtab.test lldb-unit :: Process/gdb-remote/./ProcessGdbRemoteTests/PortMapTest.Constructors lldb-unit :: Utility/./UtilityTests/OptionsWithRawTest.WhitespaceInput lldb-api :: functionalities/thread/ignore_suspended/TestIgnoreSuspendedThread.py lldb-unit :: Utility/./UtilityTests/GeneratorTest.GetOrCreate lldb-unit :: ObjectFile/Breakpad/./ObjectFileBreakpadTests/StackCFIRecord.parse lldb-unit :: Host/./HostTests/ConnectionFileDescriptorTest.TCPGetURIv4 lldb-api :: lang/objc/foundation/TestConstStrings.py lldb-unit :: Process/gdb-remote/./ProcessGdbRemoteTests/GDBRemoteCommunicationClientTest.GetModulesInfo lldb-api :: lang/objc/objc-foundation-dictionary-empty/TestNSDictionary0.py lldb-shell :: ObjectFile/ELF/duplicate-section.yaml lldb-api :: tools/lldb-server/register-reading/TestGdbRemoteGPacket.py lldb-api :: commands/platform/file/read/TestPlatformFileRead.py lldb-unit :: Utility/./UtilityTests/ScalarTest.APIntConstructor lldb-unit :: Host/./HostTests/ProcessLaunchInfoTest.Constructor lldb-unit :: Utility/./UtilityTests/StreamTest.Indent lldb-api :: functionalities/data-formatter/data-formatter-stl/libstdcpp/vbool/TestDataFormatterStdVBool.py lldb-api :: lang/objcxx/cpp_keywords_enabled/TestObjCppKeywordsEnabled.py lldb-shell :: SymbolFile/DWARF/DW_AT_location-DW_AT_const_value.s lldb-shell :: SymbolFile/DWARF/debug_rnglists-dwo.s lldb-api :: commands/expression/fixits/TestFixIts.py lldb-shell :: ObjectFile/ELF/short-build-id.yaml lldb-api :: lang/objcxx/class-name-clash/TestNameClash.py lldb-api :: commands/expression/scoped_enums/TestScopedEnumType.py lldb-unit :: Utility/./UtilityTests/ConstStringTest.YAML lldb-api :: functionalities/wrong_commands/TestWrongCommands.py lldb-shell :: SymbolFile/DWARF/childless-compile-unit.s lldb-unit :: DataFormatter/./LLDBFormatterTests/TypeMatcherTests.RegexName lldb-unit :: DataFormatter/./LLDBFormatterTests/FormatManagerTests.CompatibleLangs lldb-unit :: Symbol/./SymbolTests/TestTypeSystemClang.TestRecordHasFields lldb-unit :: Process/gdb-remote/./ProcessGdbRemoteTests/GDBRemoteCommunicationServerTest.SendErrorResponse_UnimplementedError lldb-api :: commands/platform/file/close/TestPlatformFileClose.py lldb-api :: commands/frame/diagnose/array/TestArray.py lldb-unit :: Symbol/./SymbolTests/DWARFCallFrameInfoTest.Basic_dwarf3 lldb-unit :: Symbol/./SymbolTests/TestTypeSystemClang.TestFunctionTemplateConstruction lldb-shell :: SymbolFile/Breakpad/stack-cfi-parsing.test lldb-unit :: Expression/./ExpressionTests/DiagnosticManagerTest.AppendMessageSubsequentDiags lldb-shell :: SymbolFile/symbol-binding.test lldb-api :: python_api/sberror/TestSBError.py lldb-api :: functionalities/param_entry_vals/basic_entry_values/TestBasicEntryValues.py lldb-api :: terminal/TestSTTYBeforeAndAfter.py lldb-api :: lang/c/unicode/TestUnicodeSymbols.py

Hide Details

Hide Details

Testing Time: 88.79s Unsupported : 177 Passed : 453 Expectedly Failed: 10 Failed : 1598 FAILED: tools/lldb/test/CMakeFiles/check-lldb-lit cd /Users/buildslave/jenkins/workspace/lldb-cmake-matrix/lldb-build/tools/lldb/test && /usr/local/Frameworks/Python.framework/Versions/3.7/bin/python3.7 /Users/buildslave/jenkins/workspace/lldb-cmake-matrix/lldb-build/./bin/llvm-lit -v --time-tests --shuffle --xunit-xml-output=/Users/buildslave/jenkins/workspace/lldb-cmake-matrix/test/results.xml -v /Users/buildslave/jenkins/workspace/lldb-cmake-matrix/lldb-build/tools/lldb/test ninja: build stopped: subcommand failed. Command failed: Command '['/usr/bin/env', 'TERM=vt100', '/usr/local/bin/ninja', '-v', 'check-lldb']' returned non-zero exit status 1. Command: ['/usr/bin/env', 'TERM=vt100', '/usr/local/bin/ninja', '-v', 'check-lldb'] + set -e [Pipeline] } [Pipeline] // timeout [Pipeline] junit Recording test results [Checks API] No suitable checks publisher found. [Pipeline] } [Pipeline] // stage [Pipeline] } [Pipeline] // withEnv [Pipeline] } [Pipeline] // node [Pipeline] End of Pipeline Finished: UNSTABLE