SuccessConsole Output

Skipping 40,548 KB.. Full Log
dynamic-values
output: 

looking at: log disable lldb 

Checking string:
"log disable lldb "

Expecting regex pattern: "lldb" (was found, matched "lldb")

looking at: log disable dwarf 

Checking string:
"log disable dwarf "

Expecting regex pattern: "dwarf" (was found, matched "dwarf")

looking at: log disable lldb all 

Checking string:
"log disable lldb all "

Expecting regex pattern: "all" (was found, matched "all")

looking at: log disable lldb symbol 

Checking string:
"log disable lldb symbol "

Expecting regex pattern: "symbol" (was found, matched "symbol")

PASS: LLDB (/Users/buildslave/jenkins/workspace/lldb-cmake-matrix/lldb-build/bin/clang-x86_64) :: test_log_enable (TestCompletion.CommandLineCompletionTestCase)
runCmd: settings clear -all
output: 

runCmd: settings set symbols.enable-external-lookup false
output: 

runCmd: settings set target.inherit-tcc true
output: 

runCmd: settings set target.detach-on-error false
output: 

runCmd: settings set target.auto-apply-fixits false
output: 

runCmd: settings set plugin.process.gdb-remote.packet-timeout 60
output: 

runCmd: settings set symbols.clang-modules-cache-path "/Users/buildslave/jenkins/workspace/lldb-cmake-matrix/lldb-build/lldb-test-build.noindex/module-cache-lldb/lldb-api"
output: 

runCmd: settings set use-color false
output: 

runCmd: setting set target.prefer-dynamic-value no-dynamic-values
output: 

looking at: /Users/buildslave/jenkins/workspace/lldb-cmake-matrix/llvm-project/lldb/test/API/functionalities/completion/thread_plan_script.py
/Users/buildslave/jenkins/workspace/lldb-cmake-matrix/llvm-project/lldb/test/API/functionalities/completion/TestCompletion.py
/Users/buildslave/jenkins/workspace/lldb-cmake-matrix/llvm-project/lldb/test/API/functionalities/completion/Makefile
/Users/buildslave/jenkins/workspace/lldb-cmake-matrix/llvm-project/lldb/test/API/functionalities/completion/breakpoints_invalid.json
/Users/buildslave/jenkins/workspace/lldb-cmake-matrix/llvm-project/lldb/test/API/functionalities/completion/__pycache__/
/Users/buildslave/jenkins/workspace/lldb-cmake-matrix/llvm-project/lldb/test/API/functionalities/completion/breakpoints.json
/Users/buildslave/jenkins/workspace/lldb-cmake-matrix/llvm-project/lldb/test/API/functionalities/completion/shared.cpp
/Users/buildslave/jenkins/workspace/lldb-cmake-matrix/llvm-project/lldb/test/API/functionalities/completion/categories
/Users/buildslave/jenkins/workspace/lldb-cmake-matrix/llvm-project/lldb/test/API/functionalities/completion/main.cpp


Checking string:
"/Users/buildslave/jenkins/workspace/lldb-cmake-matrix/llvm-project/lldb/test/API/functionalities/completion/thread_plan_script.py
/Users/buildslave/jenkins/workspace/lldb-cmake-matrix/llvm-project/lldb/test/API/functionalities/completion/TestCompletion.py
/Users/buildslave/jenkins/workspace/lldb-cmake-matrix/llvm-project/lldb/test/API/functionalities/completion/Makefile
/Users/buildslave/jenkins/workspace/lldb-cmake-matrix/llvm-project/lldb/test/API/functionalities/completion/breakpoints_invalid.json
/Users/buildslave/jenkins/workspace/lldb-cmake-matrix/llvm-project/lldb/test/API/functionalities/completion/__pycache__/
/Users/buildslave/jenkins/workspace/lldb-cmake-matrix/llvm-project/lldb/test/API/functionalities/completion/breakpoints.json
/Users/buildslave/jenkins/workspace/lldb-cmake-matrix/llvm-project/lldb/test/API/functionalities/completion/shared.cpp
/Users/buildslave/jenkins/workspace/lldb-cmake-matrix/llvm-project/lldb/test/API/functionalities/completion/categories
/Users/buildslave/jenkins/workspace/lldb-cmake-matrix/llvm-project/lldb/test/API/functionalities/completion/main.cpp
"

Expecting regex pattern: "main.cpp" (was found, matched "main.cpp")

PASS: LLDB (/Users/buildslave/jenkins/workspace/lldb-cmake-matrix/lldb-build/bin/clang-x86_64) :: test_log_file (TestCompletion.CommandLineCompletionTestCase)
runCmd: settings clear -all
output: 

runCmd: settings set symbols.enable-external-lookup false
output: 

runCmd: settings set target.inherit-tcc true
output: 

runCmd: settings set target.detach-on-error false
output: 

runCmd: settings set target.auto-apply-fixits false
output: 

runCmd: settings set plugin.process.gdb-remote.packet-timeout 60
output: 

runCmd: settings set symbols.clang-modules-cache-path "/Users/buildslave/jenkins/workspace/lldb-cmake-matrix/lldb-build/lldb-test-build.noindex/module-cache-lldb/lldb-api"
output: 

runCmd: settings set use-color false
output: 

runCmd: setting set target.prefer-dynamic-value no-dynamic-values
output: 

looking at: log list lldb 

Checking string:
"log list lldb "

Expecting regex pattern: "lldb" (was found, matched "lldb")

looking at: log list dwarf 

Checking string:
"log list dwarf "

Expecting regex pattern: "dwarf" (was found, matched "dwarf")

looking at: log list lldb 

Checking string:
"log list lldb "

Expecting regex pattern: "lldb" (was found, matched "lldb")

looking at: log list lldb dwarf 

Checking string:
"log list lldb dwarf "

Expecting regex pattern: "dwarf" (was found, matched "dwarf")

PASS: LLDB (/Users/buildslave/jenkins/workspace/lldb-cmake-matrix/lldb-build/bin/clang-x86_64) :: test_log_list (TestCompletion.CommandLineCompletionTestCase)
runCmd: settings clear -all
output: 

runCmd: settings set symbols.enable-external-lookup false
output: 

runCmd: settings set target.inherit-tcc true
output: 

runCmd: settings set target.detach-on-error false
output: 

runCmd: settings set target.auto-apply-fixits false
output: 

runCmd: settings set plugin.process.gdb-remote.packet-timeout 60
output: 

runCmd: settings set symbols.clang-modules-cache-path "/Users/buildslave/jenkins/workspace/lldb-cmake-matrix/lldb-build/lldb-test-build.noindex/module-cache-lldb/lldb-api"
output: 

runCmd: settings set use-color false
output: 

runCmd: setting set target.prefer-dynamic-value no-dynamic-values
output: 

looking at: platform target-install main.cpp 

Checking string:
"platform target-install main.cpp "

Expecting regex pattern: "platform target-install main.cpp" (was found, matched "platform target-install main.cpp")

PASS: LLDB (/Users/buildslave/jenkins/workspace/lldb-cmake-matrix/lldb-build/bin/clang-x86_64) :: test_platform_install_local_file (TestCompletion.CommandLineCompletionTestCase)
runCmd: settings clear -all
output: 

runCmd: settings set symbols.enable-external-lookup false
output: 

runCmd: settings set target.inherit-tcc true
output: 

runCmd: settings set target.detach-on-error false
output: 

runCmd: settings set target.auto-apply-fixits false
output: 

runCmd: settings set plugin.process.gdb-remote.packet-timeout 60
output: 

runCmd: settings set symbols.clang-modules-cache-path "/Users/buildslave/jenkins/workspace/lldb-cmake-matrix/lldb-build/lldb-test-build.noindex/module-cache-lldb/lldb-api"
output: 

runCmd: settings set use-color false
output: 

runCmd: setting set target.prefer-dynamic-value no-dynamic-values
output: 

PASS: LLDB (/Users/buildslave/jenkins/workspace/lldb-cmake-matrix/lldb-build/bin/clang-x86_64) :: test_plugin_load (TestCompletion.CommandLineCompletionTestCase)
runCmd: settings clear -all
output: 

runCmd: settings set symbols.enable-external-lookup false
output: 

runCmd: settings set target.inherit-tcc true
output: 

runCmd: settings set target.detach-on-error false
output: 

runCmd: settings set target.auto-apply-fixits false
output: 

runCmd: settings set plugin.process.gdb-remote.packet-timeout 60
output: 
warning: (x86_64) /Users/buildslave/jenkins/workspace/lldb-cmake-matrix/lldb-build/lldb-test-build.noindex/functionalities/completion/TestCompletion.test_process_signal/a.out empty dSYM file detected, dSYM was created with an executable with no debug info.
warning: (x86_64) /Users/buildslave/jenkins/workspace/lldb-cmake-matrix/lldb-build/lldb-test-build.noindex/functionalities/completion/TestCompletion.test_register_read_and_write_on_x86/a.out empty dSYM file detected, dSYM was created with an executable with no debug info.

runCmd: settings set symbols.clang-modules-cache-path "/Users/buildslave/jenkins/workspace/lldb-cmake-matrix/lldb-build/lldb-test-build.noindex/module-cache-lldb/lldb-api"
output: 

runCmd: settings set use-color false
output: 

runCmd: setting set target.prefer-dynamic-value no-dynamic-values
output: 

looking at: process attach --continue 

Checking string:
"process attach --continue "

Expecting regex pattern: "process attach --continue " (was found, matched "process attach --continue ")

PASS: LLDB (/Users/buildslave/jenkins/workspace/lldb-cmake-matrix/lldb-build/bin/clang-x86_64) :: test_process_attach_dash_dash_con (TestCompletion.CommandLineCompletionTestCase)
runCmd: settings clear -all
output: 

runCmd: settings set symbols.enable-external-lookup false
output: 

runCmd: settings set target.inherit-tcc true
output: 

runCmd: settings set target.detach-on-error false
output: 

runCmd: settings set target.auto-apply-fixits false
output: 

runCmd: settings set plugin.process.gdb-remote.packet-timeout 60
output: 

runCmd: settings set symbols.clang-modules-cache-path "/Users/buildslave/jenkins/workspace/lldb-cmake-matrix/lldb-build/lldb-test-build.noindex/module-cache-lldb/lldb-api"
output: 

runCmd: settings set use-color false
output: 

runCmd: setting set target.prefer-dynamic-value no-dynamic-values
output: 

looking at: arm
armv4
armv4t
armv5
armv5e
armv5t
armv6
armv6m
armv7
armv7l
armv7f
armv7s
armv7k
armv7m
armv7em
xscale
thumb
thumbv4t
thumbv5
thumbv5e
thumbv6
thumbv6m
thumbv7
thumbv7f
thumbv7s
thumbv7k
thumbv7m
thumbv7em
arm64
armv8
armv8l
arm64_32
aarch64
mips
mipsr2
mipsr3
mipsr5
mipsr6
mipsel
mipsr2el
mipsr3el
mipsr5el
mipsr6el
mips64
mips64r2
mips64r3
mips64r5
mips64r6
mips64el
mips64r2el
mips64r3el
mips64r5el
mips64r6el
powerpc
ppc601
ppc602
ppc603
ppc603e
ppc603ev
ppc604
ppc604e
ppc620
ppc750
ppc7400
ppc7450
ppc970
powerpc64le
powerpc64
ppc970-64
s390x
sparc
sparcv9
i386
i486
i486sx
i686
x86_64
x86_64h
hexagon
hexagonv4
hexagonv5
riscv32
riscv64
unknown-mach-32
unknown-mach-64
arc
avr
wasm32


Checking string:
"arm
armv4
armv4t
armv5
armv5e
armv5t
armv6
armv6m
armv7
armv7l
armv7f
armv7s
armv7k
armv7m
armv7em
xscale
thumb
thumbv4t
thumbv5
thumbv5e
thumbv6
thumbv6m
thumbv7
thumbv7f
thumbv7s
thumbv7k
thumbv7m
thumbv7em
arm64
armv8
armv8l
arm64_32
aarch64
mips
mipsr2
mipsr3
mipsr5
mipsr6
mipsel
mipsr2el
mipsr3el
mipsr5el
mipsr6el
mips64
mips64r2
mips64r3
mips64r5
mips64r6
mips64el
mips64r2el
mips64r3el
mips64r5el
mips64r6el
powerpc
ppc601
ppc602
ppc603
ppc603e
ppc603ev
ppc604
ppc604e
ppc620
ppc750
ppc7400
ppc7450
ppc970
powerpc64le
powerpc64
ppc970-64
s390x
sparc
sparcv9
i386
i486
i486sx
i686
x86_64
x86_64h
hexagon
hexagonv4
hexagonv5
riscv32
riscv64
unknown-mach-32
unknown-mach-64
arc
avr
wasm32
"

Expecting regex pattern: "mips" (was found, matched "mips")

looking at: arm
armv4
armv4t
armv5
armv5e
armv5t
armv6
armv6m
armv7
armv7l
armv7f
armv7s
armv7k
armv7m
armv7em
xscale
thumb
thumbv4t
thumbv5
thumbv5e
thumbv6
thumbv6m
thumbv7
thumbv7f
thumbv7s
thumbv7k
thumbv7m
thumbv7em
arm64
armv8
armv8l
arm64_32
aarch64
mips
mipsr2
mipsr3
mipsr5
mipsr6
mipsel
mipsr2el
mipsr3el
mipsr5el
mipsr6el
mips64
mips64r2
mips64r3
mips64r5
mips64r6
mips64el
mips64r2el
mips64r3el
mips64r5el
mips64r6el
powerpc
ppc601
ppc602
ppc603
ppc603e
ppc603ev
ppc604
ppc604e
ppc620
ppc750
ppc7400
ppc7450
ppc970
powerpc64le
powerpc64
ppc970-64
s390x
sparc
sparcv9
i386
i486
i486sx
i686
x86_64
x86_64h
hexagon
hexagonv4
hexagonv5
riscv32
riscv64
unknown-mach-32
unknown-mach-64
arc
avr
wasm32


Checking string:
"arm
armv4
armv4t
armv5
armv5e
armv5t
armv6
armv6m
armv7
armv7l
armv7f
armv7s
armv7k
armv7m
armv7em
xscale
thumb
thumbv4t
thumbv5
thumbv5e
thumbv6
thumbv6m
thumbv7
thumbv7f
thumbv7s
thumbv7k
thumbv7m
thumbv7em
arm64
armv8
armv8l
arm64_32
aarch64
mips
mipsr2
mipsr3
mipsr5
mipsr6
mipsel
mipsr2el
mipsr3el
mipsr5el
mipsr6el
mips64
mips64r2
mips64r3
mips64r5
mips64r6
mips64el
mips64r2el
mips64r3el
mips64r5el
mips64r6el
powerpc
ppc601
ppc602
ppc603
ppc603e
ppc603ev
ppc604
ppc604e
ppc620
ppc750
ppc7400
ppc7450
ppc970
powerpc64le
powerpc64
ppc970-64
s390x
sparc
sparcv9
i386
i486
i486sx
i686
x86_64
x86_64h
hexagon
hexagonv4
hexagonv5
riscv32
riscv64
unknown-mach-32
unknown-mach-64
arc
avr
wasm32
"

Expecting regex pattern: "arm64" (was found, matched "arm64")

PASS: LLDB (/Users/buildslave/jenkins/workspace/lldb-cmake-matrix/lldb-build/bin/clang-x86_64) :: test_process_launch_arch (TestCompletion.CommandLineCompletionTestCase)
runCmd: settings clear -all
output: 

runCmd: settings set symbols.enable-external-lookup false
output: 

runCmd: settings set target.inherit-tcc true
output: 

runCmd: settings set target.detach-on-error false
output: 

runCmd: settings set target.auto-apply-fixits false
output: 

runCmd: settings set plugin.process.gdb-remote.packet-timeout 60
output: 

runCmd: settings set symbols.clang-modules-cache-path "/Users/buildslave/jenkins/workspace/lldb-cmake-matrix/lldb-build/lldb-test-build.noindex/module-cache-lldb/lldb-api"
output: 

runCmd: settings set use-color false
output: 

runCmd: setting set target.prefer-dynamic-value no-dynamic-values
output: 

looking at: arm
armv4
armv4t
armv5
armv5e
armv5t
armv6
armv6m
armv7
armv7l
armv7f
armv7s
armv7k
armv7m
armv7em
arm64
armv8
armv8l
arm64_32


Checking string:
"arm
armv4
armv4t
armv5
armv5e
armv5t
armv6
armv6m
armv7
armv7l
armv7f
armv7s
armv7k
armv7m
armv7em
arm64
armv8
armv8l
arm64_32
"

Expecting regex pattern: "arm64" (was found, matched "arm64")

PASS: LLDB (/Users/buildslave/jenkins/workspace/lldb-cmake-matrix/lldb-build/bin/clang-x86_64) :: test_process_launch_arch_arm (TestCompletion.CommandLineCompletionTestCase)
runCmd: settings clear -all
output: 

runCmd: settings set symbols.enable-external-lookup false
output: 

runCmd: settings set target.inherit-tcc true
output: 

runCmd: settings set target.detach-on-error false
output: 

runCmd: settings set target.auto-apply-fixits false
output: 

runCmd: settings set plugin.process.gdb-remote.packet-timeout 60
output: 

runCmd: settings set symbols.clang-modules-cache-path "/Users/buildslave/jenkins/workspace/lldb-cmake-matrix/lldb-build/lldb-test-build.noindex/module-cache-lldb/lldb-api"
output: 

runCmd: settings set use-color false
output: 

runCmd: setting set target.prefer-dynamic-value no-dynamic-values
output: 

FAIL: LLDB (/Users/buildslave/jenkins/workspace/lldb-cmake-matrix/lldb-build/bin/clang-x86_64) :: test_process_load (TestCompletion.CommandLineCompletionTestCase)
runCmd: settings clear -all
output: 

runCmd: settings set symbols.enable-external-lookup false
output: 

runCmd: settings set target.inherit-tcc true
output: 

runCmd: settings set target.detach-on-error false
output: 

runCmd: settings set target.auto-apply-fixits false
output: 

runCmd: settings set plugin.process.gdb-remote.packet-timeout 60
output: 

runCmd: settings set symbols.clang-modules-cache-path "/Users/buildslave/jenkins/workspace/lldb-cmake-matrix/lldb-build/lldb-test-build.noindex/module-cache-lldb/lldb-api"
output: 

runCmd: settings set use-color false
output: 

runCmd: setting set target.prefer-dynamic-value no-dynamic-values
output: 

looking at: process attach -P mach-o-core 

Checking string:
"process attach -P mach-o-core "

Expecting regex pattern: "process attach -P mach-o-core" (was found, matched "process attach -P mach-o-core")

looking at: process connect -p mach-o-core 

Checking string:
"process connect -p mach-o-core "

Expecting regex pattern: "process connect -p mach-o-core" (was found, matched "process connect -p mach-o-core")

looking at: process launch -p mach-o-core 

Checking string:
"process launch -p mach-o-core "

Expecting regex pattern: "process launch -p mach-o-core" (was found, matched "process launch -p mach-o-core")

PASS: LLDB (/Users/buildslave/jenkins/workspace/lldb-cmake-matrix/lldb-build/bin/clang-x86_64) :: test_process_plugin_completion (TestCompletion.CommandLineCompletionTestCase)
runCmd: settings clear -all
output: 

runCmd: settings set symbols.enable-external-lookup false
output: 

runCmd: settings set target.inherit-tcc true
output: 

runCmd: settings set target.detach-on-error false
output: 

runCmd: settings set target.auto-apply-fixits false
output: 

runCmd: settings set plugin.process.gdb-remote.packet-timeout 60
output: 

runCmd: settings set symbols.clang-modules-cache-path "/Users/buildslave/jenkins/workspace/lldb-cmake-matrix/lldb-build/lldb-test-build.noindex/module-cache-lldb/lldb-api"
output: 

runCmd: settings set use-color false
output: 

runCmd: setting set target.prefer-dynamic-value no-dynamic-values
output: 

looking at: process signal 

Checking string:
"process signal "

Expecting regex pattern: "process signal " (was found, matched "process signal ")

FAIL: LLDB (/Users/buildslave/jenkins/workspace/lldb-cmake-matrix/lldb-build/bin/clang-x86_64) :: test_process_signal (TestCompletion.CommandLineCompletionTestCase)
UNSUPPORTED: LLDB (/Users/buildslave/jenkins/workspace/lldb-cmake-matrix/lldb-build/bin/clang-x86_64) :: test_process_unload (TestCompletion.CommandLineCompletionTestCase) (requires one of linux) 
runCmd: settings clear -all
output: 

runCmd: settings set symbols.enable-external-lookup false
output: 

runCmd: settings set target.inherit-tcc true
output: 

runCmd: settings set target.detach-on-error false
output: 

runCmd: settings set target.auto-apply-fixits false
output: 

runCmd: settings set plugin.process.gdb-remote.packet-timeout 60
output: 

runCmd: settings set symbols.clang-modules-cache-path "/Users/buildslave/jenkins/workspace/lldb-cmake-matrix/lldb-build/lldb-test-build.noindex/module-cache-lldb/lldb-api"
output: 

runCmd: settings set use-color false
output: 

runCmd: setting set target.prefer-dynamic-value no-dynamic-values
output: 

looking at: "settings" "replace" 

Checking string:
""settings" "replace" "

Expecting regex pattern: ""replace" " (was found, matched ""replace" ")

PASS: LLDB (/Users/buildslave/jenkins/workspace/lldb-cmake-matrix/lldb-build/bin/clang-x86_64) :: test_quoted_arg_with_quoted_command (TestCompletion.CommandLineCompletionTestCase)
runCmd: settings clear -all
output: 

runCmd: settings set symbols.enable-external-lookup false
output: 

runCmd: settings set target.inherit-tcc true
output: 

runCmd: settings set target.detach-on-error false
output: 

runCmd: settings set target.auto-apply-fixits false
output: 

runCmd: settings set plugin.process.gdb-remote.packet-timeout 60
output: 

runCmd: settings set symbols.clang-modules-cache-path "/Users/buildslave/jenkins/workspace/lldb-cmake-matrix/lldb-build/lldb-test-build.noindex/module-cache-lldb/lldb-api"
output: 

runCmd: settings set use-color false
output: 

runCmd: setting set target.prefer-dynamic-value no-dynamic-values
output: 

looking at: settings "replace" 

Checking string:
"settings "replace" "

Expecting regex pattern: ""replace" " (was found, matched ""replace" ")

PASS: LLDB (/Users/buildslave/jenkins/workspace/lldb-cmake-matrix/lldb-build/bin/clang-x86_64) :: test_quoted_arg_without_quoted_command (TestCompletion.CommandLineCompletionTestCase)
runCmd: settings clear -all
output: 

runCmd: settings set symbols.enable-external-lookup false
output: 

runCmd: settings set target.inherit-tcc true
output: 

runCmd: settings set target.detach-on-error false
output: 

runCmd: settings set target.auto-apply-fixits false
output: 

runCmd: settings set plugin.process.gdb-remote.packet-timeout 60
output: 

runCmd: settings set symbols.clang-modules-cache-path "/Users/buildslave/jenkins/workspace/lldb-cmake-matrix/lldb-build/lldb-test-build.noindex/module-cache-lldb/lldb-api"
output: 

runCmd: settings set use-color false
output: 

runCmd: setting set target.prefer-dynamic-value no-dynamic-values
output: 

looking at: "settings" 

Checking string:
""settings" "

Expecting regex pattern: ""settings" " (was found, matched ""settings" ")

PASS: LLDB (/Users/buildslave/jenkins/workspace/lldb-cmake-matrix/lldb-build/bin/clang-x86_64) :: test_quoted_command (TestCompletion.CommandLineCompletionTestCase)
runCmd: settings clear -all
output: 

runCmd: settings set symbols.enable-external-lookup false
output: 

runCmd: settings set target.inherit-tcc true
output: 

runCmd: settings set target.detach-on-error false
output: 

runCmd: settings set target.auto-apply-fixits false
output: 

runCmd: settings set plugin.process.gdb-remote.packet-timeout 60
output: 

runCmd: settings set symbols.clang-modules-cache-path "/Users/buildslave/jenkins/workspace/lldb-cmake-matrix/lldb-build/lldb-test-build.noindex/module-cache-lldb/lldb-api"
output: 

runCmd: settings set use-color false
output: 

runCmd: setting set target.prefer-dynamic-value no-dynamic-values
output: 

looking at: register read 

Checking string:
"register read "

Expecting regex pattern: "register read " (was found, matched "register read ")

looking at: register write 

Checking string:
"register write "

Expecting regex pattern: "register write " (was found, matched "register write ")

FAIL: LLDB (/Users/buildslave/jenkins/workspace/lldb-cmake-matrix/lldb-build/bin/clang-x86_64) :: test_register_read_and_write_on_x86 (TestCompletion.CommandLineCompletionTestCase)
runCmd: settings clear -all
output: 

runCmd: settings set symbols.enable-external-lookup false
output: 

runCmd: settings set target.inherit-tcc true
output: 

runCmd: settings set target.detach-on-error false
output: 

runCmd: settings set target.auto-apply-fixits false
output: 

runCmd: settings set plugin.process.gdb-remote.packet-timeout 60
output: 

runCmd: settings set symbols.clang-modules-cache-path "/Users/buildslave/jenkins/workspace/lldb-cmake-matrix/lldb-build/lldb-test-build.noindex/module-cache-lldb/lldb-api"
output: 

runCmd: settings set use-color false
output: 

runCmd: setting set target.prefer-dynamic-value no-dynamic-values
output: 

looking at: settings append target.error-path 

Checking string:
"settings append target.error-path "

Expecting regex pattern: "settings append target.error-path" (was found, matched "settings append target.error-path")

PASS: LLDB (/Users/buildslave/jenkins/workspace/lldb-cmake-matrix/lldb-build/bin/clang-x86_64) :: test_settings_append_target_er (TestCompletion.CommandLineCompletionTestCase)
runCmd: settings clear -all
output: 

runCmd: settings set symbols.enable-external-lookup false
output: 

runCmd: settings set target.inherit-tcc true
output: 

runCmd: settings set target.detach-on-error false
output: 

runCmd: settings set target.auto-apply-fixits false
output: 

runCmd: settings set plugin.process.gdb-remote.packet-timeout 60
output: 

runCmd: settings set symbols.clang-modules-cache-path "/Users/buildslave/jenkins/workspace/lldb-cmake-matrix/lldb-build/lldb-test-build.noindex/module-cache-lldb/lldb-api"
output: 

runCmd: settings set use-color false
output: 

runCmd: setting set target.prefer-dynamic-value no-dynamic-values
output: 

looking at: settings clear thread-format 

Checking string:
"settings clear thread-format "

Expecting regex pattern: "settings clear thread-format" (was found, matched "settings clear thread-format")

PASS: LLDB (/Users/buildslave/jenkins/workspace/lldb-cmake-matrix/lldb-build/bin/clang-x86_64) :: test_settings_clear_th (TestCompletion.CommandLineCompletionTestCase)
runCmd: settings clear -all
output: 

runCmd: settings set symbols.enable-external-lookup false
output: 

runCmd: settings set target.inherit-tcc true
output: 

runCmd: settings set target.detach-on-error false
output: 

runCmd: settings set target.auto-apply-fixits false
output: 

runCmd: settings set plugin.process.gdb-remote.packet-timeout 60
output: 

runCmd: settings set symbols.clang-modules-cache-path "/Users/buildslave/jenkins/workspace/lldb-cmake-matrix/lldb-build/lldb-test-build.noindex/module-cache-lldb/lldb-api"
output: 

runCmd: settings set use-color false
output: 

runCmd: setting set target.prefer-dynamic-value no-dynamic-values
output: 

looking at: settings insert-after target.env-vars 

Checking string:
"settings insert-after target.env-vars "

Expecting regex pattern: "settings insert-after target.env-vars" (was found, matched "settings insert-after target.env-vars")

PASS: LLDB (/Users/buildslave/jenkins/workspace/lldb-cmake-matrix/lldb-build/bin/clang-x86_64) :: test_settings_insert_after_target_en (TestCompletion.CommandLineCompletionTestCase)
runCmd: settings clear -all
output: 

runCmd: settings set symbols.enable-external-lookup false
output: 

runCmd: settings set target.inherit-tcc true
output: 

runCmd: settings set target.detach-on-error false
output: 

runCmd: settings set target.auto-apply-fixits false
output: 

runCmd: settings set plugin.process.gdb-remote.packet-timeout 60
output: 

runCmd: settings set symbols.clang-modules-cache-path "/Users/buildslave/jenkins/workspace/lldb-cmake-matrix/lldb-build/lldb-test-build.noindex/module-cache-lldb/lldb-api"
output: 

runCmd: settings set use-color false
output: 

runCmd: setting set target.prefer-dynamic-value no-dynamic-values
output: 

looking at: settings insert-before target.env-vars 

Checking string:
"settings insert-before target.env-vars "

Expecting regex pattern: "settings insert-before target.env-vars" (was found, matched "settings insert-before target.env-vars")

PASS: LLDB (/Users/buildslave/jenkins/workspace/lldb-cmake-matrix/lldb-build/bin/clang-x86_64) :: test_settings_insert_before_target_en (TestCompletion.CommandLineCompletionTestCase)
runCmd: settings clear -all
output: 

runCmd: settings set symbols.enable-external-lookup false
output: 

runCmd: settings set target.inherit-tcc true
output: 

runCmd: settings set target.detach-on-error false
output: 

runCmd: settings set target.auto-apply-fixits false
output: 

runCmd: settings set plugin.process.gdb-remote.packet-timeout 60
output: 

runCmd: settings set symbols.clang-modules-cache-path "/Users/buildslave/jenkins/workspace/lldb-cmake-matrix/lldb-build/lldb-test-build.noindex/module-cache-lldb/lldb-api"
output: 

runCmd: settings set use-color false
output: 

runCmd: setting set target.prefer-dynamic-value no-dynamic-values
output: 

looking at: settings list term-width 

Checking string:
"settings list term-width "

Expecting regex pattern: "settings list term-width" (was found, matched "settings list term-width")

PASS: LLDB (/Users/buildslave/jenkins/workspace/lldb-cmake-matrix/lldb-build/bin/clang-x86_64) :: test_settings_list_term (TestCompletion.CommandLineCompletionTestCase)
runCmd: settings clear -all
output: 

runCmd: settings set symbols.enable-external-lookup false
output: 

runCmd: settings set target.inherit-tcc true
output: 

runCmd: settings set target.detach-on-error false
output: 

runCmd: settings set target.auto-apply-fixits false
output: 

runCmd: settings set plugin.process.gdb-remote.packet-timeout 60
output: 

runCmd: settings set symbols.clang-modules-cache-path "/Users/buildslave/jenkins/workspace/lldb-cmake-matrix/lldb-build/lldb-test-build.noindex/module-cache-lldb/lldb-api"
output: 

runCmd: settings set use-color false
output: 

runCmd: setting set target.prefer-dynamic-value no-dynamic-values
output: 

looking at: settings remove term-width 

Checking string:
"settings remove term-width "

Expecting regex pattern: "settings remove term-width" (was found, matched "settings remove term-width")

PASS: LLDB (/Users/buildslave/jenkins/workspace/lldb-cmake-matrix/lldb-build/bin/clang-x86_64) :: test_settings_remove_term (TestCompletion.CommandLineCompletionTestCase)
runCmd: settings clear -all
output: 

runCmd: settings set symbols.enable-external-lookup false
output: 

runCmd: settings set target.inherit-tcc true
output: 

runCmd: settings set target.detach-on-error false
output: 

runCmd: settings set target.auto-apply-fixits false
output: 

runCmd: settings set plugin.process.gdb-remote.packet-timeout 60
output: 

runCmd: settings set symbols.clang-modules-cache-path "/Users/buildslave/jenkins/workspace/lldb-cmake-matrix/lldb-build/lldb-test-build.noindex/module-cache-lldb/lldb-api"
output: 

runCmd: settings set use-color false
output: 

runCmd: setting set target.prefer-dynamic-value no-dynamic-values
output: 

looking at: settings replace target.run-args 

Checking string:
"settings replace target.run-args "

Expecting regex pattern: "settings replace target.run-args" (was found, matched "settings replace target.run-args")

PASS: LLDB (/Users/buildslave/jenkins/workspace/lldb-cmake-matrix/lldb-build/bin/clang-x86_64) :: test_settings_replace_target_ru (TestCompletion.CommandLineCompletionTestCase)
runCmd: settings clear -all
output: 

runCmd: settings set symbols.enable-external-lookup false
output: 

runCmd: settings set target.inherit-tcc true
output: 

runCmd: settings set target.detach-on-error false
output: 

runCmd: settings set target.auto-apply-fixits false
output: 

runCmd: settings set plugin.process.gdb-remote.packet-timeout 60
output: 

runCmd: settings set symbols.clang-modules-cache-path "/Users/buildslave/jenkins/workspace/lldb-cmake-matrix/lldb-build/lldb-test-build.noindex/module-cache-lldb/lldb-api"
output: 

runCmd: settings set use-color false
output: 

runCmd: setting set target.prefer-dynamic-value no-dynamic-values
output: 

looking at: set
show


Checking string:
"set
show
"

Expecting regex pattern: "set" (was found, matched "set")

looking at: set
show


Checking string:
"set
show
"

Expecting regex pattern: "show" (was found, matched "show")

PASS: LLDB (/Users/buildslave/jenkins/workspace/lldb-cmake-matrix/lldb-build/bin/clang-x86_64) :: test_settings_s (TestCompletion.CommandLineCompletionTestCase)
runCmd: settings clear -all
output: 

runCmd: settings set symbols.enable-external-lookup false
output: 

runCmd: settings set target.inherit-tcc true
output: 

runCmd: settings set target.detach-on-error false
output: 

runCmd: settings set target.auto-apply-fixits false
output: 

runCmd: settings set plugin.process.gdb-remote.packet-timeout 60
output: 

runCmd: settings set symbols.clang-modules-cache-path "/Users/buildslave/jenkins/workspace/lldb-cmake-matrix/lldb-build/lldb-test-build.noindex/module-cache-lldb/lldb-api"
output: 

runCmd: settings set use-color false
output: 

runCmd: setting set target.prefer-dynamic-value no-dynamic-values
output: 

looking at: settings set --global 

Checking string:
"settings set --global "

Expecting regex pattern: "settings set --global" (was found, matched "settings set --global")

PASS: LLDB (/Users/buildslave/jenkins/workspace/lldb-cmake-matrix/lldb-build/bin/clang-x86_64) :: test_settings_s_dash (TestCompletion.CommandLineCompletionTestCase)
runCmd: settings clear -all
output: 

runCmd: settings set symbols.enable-external-lookup false
output: 

runCmd: settings set target.inherit-tcc true
output: 

runCmd: settings set target.detach-on-error false
output: 

runCmd: settings set target.auto-apply-fixits false
output: 

runCmd: settings set plugin.process.gdb-remote.packet-timeout 60
output: 

runCmd: settings set symbols.clang-modules-cache-path "/Users/buildslave/jenkins/workspace/lldb-cmake-matrix/lldb-build/lldb-test-build.noindex/module-cache-lldb/lldb-api"
output: 

runCmd: settings set use-color false
output: 

runCmd: setting set target.prefer-dynamic-value no-dynamic-values
output: 

looking at: settings set target.max-

Checking string:
"settings set target.max-"

Expecting regex pattern: "settings set target.max-" (was found, matched "settings set target.max-")

PASS: LLDB (/Users/buildslave/jenkins/workspace/lldb-cmake-matrix/lldb-build/bin/clang-x86_64) :: test_settings_set_ta (TestCompletion.CommandLineCompletionTestCase)
runCmd: settings clear -all
output: 

runCmd: settings set symbols.enable-external-lookup false
output: 

runCmd: settings set target.inherit-tcc true
output: 

runCmd: settings set target.detach-on-error false
output: 

runCmd: settings set target.auto-apply-fixits false
output: 

runCmd: settings set plugin.process.gdb-remote.packet-timeout 60
output: 

runCmd: settings set symbols.clang-modules-cache-path "/Users/buildslave/jenkins/workspace/lldb-cmake-matrix/lldb-build/lldb-test-build.noindex/module-cache-lldb/lldb-api"
output: 

runCmd: settings set use-color false
output: 

runCmd: setting set target.prefer-dynamic-value no-dynamic-values
output: 

looking at: settings set target.exec-search-paths 

Checking string:
"settings set target.exec-search-paths "

Expecting regex pattern: "settings set target.exec-search-paths" (was found, matched "settings set target.exec-search-paths")

PASS: LLDB (/Users/buildslave/jenkins/workspace/lldb-cmake-matrix/lldb-build/bin/clang-x86_64) :: test_settings_set_target_exec (TestCompletion.CommandLineCompletionTestCase)
warning: (x86_64) /Users/buildslave/jenkins/workspace/lldb-cmake-matrix/lldb-build/lldb-test-build.noindex/functionalities/completion/TestCompletion.test_symbol_name/a.out empty dSYM file detected, dSYM was created with an executable with no debug info.
warning: (x86_64) /Users/buildslave/jenkins/workspace/lldb-cmake-matrix/lldb-build/lldb-test-build.noindex/functionalities/completion/TestCompletion.test_target_modules_dump_line_table/a.out empty dSYM file detected, dSYM was created with an executable with no debug info.
warning: (x86_64) /Users/buildslave/jenkins/workspace/lldb-cmake-matrix/lldb-build/lldb-test-build.noindex/functionalities/completion/TestCompletion.test_target_modules_load_aout/a.out empty dSYM file detected, dSYM was created with an executable with no debug info.
runCmd: settings clear -all
output: 

runCmd: settings set symbols.enable-external-lookup false
output: 

runCmd: settings set target.inherit-tcc true
output: 

runCmd: settings set target.detach-on-error false
output: 

runCmd: settings set target.auto-apply-fixits false
output: 

runCmd: settings set plugin.process.gdb-remote.packet-timeout 60
output: 

runCmd: settings set symbols.clang-modules-cache-path "/Users/buildslave/jenkins/workspace/lldb-cmake-matrix/lldb-build/lldb-test-build.noindex/module-cache-lldb/lldb-api"
output: 

runCmd: settings set use-color false
output: 

runCmd: setting set target.prefer-dynamic-value no-dynamic-values
output: 

looking at: target.prefer-dynamic-value
target.preload-symbols
target.process.detach-keeps-stopped
target.process.disable-memory-cache
target.process.extra-startup-command
target.process.ignore-breakpoints-in-expressions
target.process.memory-cache-line-size
target.process.python-os-plugin-path
target.process.run-all-threads
target.process.stop-on-exec
target.process.stop-on-sharedlibrary-events
target.process.unwind-on-error-in-expressions
target.process.utility-expression-timeout
target.process.optimization-warnings
target.process.unsupported-language-warnings
target.process.thread.trace-thread
target.process.thread.max-backtrace-depth
target.process.thread.step-avoid-libraries
target.process.thread.step-avoid-regexp
target.process.thread.step-in-avoid-nodebug
target.process.thread.step-out-avoid-nodebug
target.process.experimental.os-plugin-reports-all-threads


Checking string:
"target.prefer-dynamic-value
target.preload-symbols
target.process.detach-keeps-stopped
target.process.disable-memory-cache
target.process.extra-startup-command
target.process.ignore-breakpoints-in-expressions
target.process.memory-cache-line-size
target.process.python-os-plugin-path
target.process.run-all-threads
target.process.stop-on-exec
target.process.stop-on-sharedlibrary-events
target.process.unwind-on-error-in-expressions
target.process.utility-expression-timeout
target.process.optimization-warnings
target.process.unsupported-language-warnings
target.process.thread.trace-thread
target.process.thread.max-backtrace-depth
target.process.thread.step-avoid-libraries
target.process.thread.step-avoid-regexp
target.process.thread.step-in-avoid-nodebug
target.process.thread.step-out-avoid-nodebug
target.process.experimental.os-plugin-reports-all-threads
"

Expecting regex pattern: "target.prefer-dynamic-value" (was found, matched "target.prefer-dynamic-value")

looking at: target.prefer-dynamic-value
target.preload-symbols
target.process.detach-keeps-stopped
target.process.disable-memory-cache
target.process.extra-startup-command
target.process.ignore-breakpoints-in-expressions
target.process.memory-cache-line-size
target.process.python-os-plugin-path
target.process.run-all-threads
target.process.stop-on-exec
target.process.stop-on-sharedlibrary-events
target.process.unwind-on-error-in-expressions
target.process.utility-expression-timeout
target.process.optimization-warnings
target.process.unsupported-language-warnings
target.process.thread.trace-thread
target.process.thread.max-backtrace-depth
target.process.thread.step-avoid-libraries
target.process.thread.step-avoid-regexp
target.process.thread.step-in-avoid-nodebug
target.process.thread.step-out-avoid-nodebug
target.process.experimental.os-plugin-reports-all-threads


Checking string:
"target.prefer-dynamic-value
target.preload-symbols
target.process.detach-keeps-stopped
target.process.disable-memory-cache
target.process.extra-startup-command
target.process.ignore-breakpoints-in-expressions
target.process.memory-cache-line-size
target.process.python-os-plugin-path
target.process.run-all-threads
target.process.stop-on-exec
target.process.stop-on-sharedlibrary-events
target.process.unwind-on-error-in-expressions
target.process.utility-expression-timeout
target.process.optimization-warnings
target.process.unsupported-language-warnings
target.process.thread.trace-thread
target.process.thread.max-backtrace-depth
target.process.thread.step-avoid-libraries
target.process.thread.step-avoid-regexp
target.process.thread.step-in-avoid-nodebug
target.process.thread.step-out-avoid-nodebug
target.process.experimental.os-plugin-reports-all-threads
"

Expecting regex pattern: "target.process." (was found, matched "target.process.")

PASS: LLDB (/Users/buildslave/jenkins/workspace/lldb-cmake-matrix/lldb-build/bin/clang-x86_64) :: test_settings_set_target_pr (TestCompletion.CommandLineCompletionTestCase)
runCmd: settings clear -all
output: 

runCmd: settings set symbols.enable-external-lookup false
output: 

runCmd: settings set target.inherit-tcc true
output: 

runCmd: settings set target.detach-on-error false
output: 

runCmd: settings set target.auto-apply-fixits false
output: 

runCmd: settings set plugin.process.gdb-remote.packet-timeout 60
output: 

runCmd: settings set symbols.clang-modules-cache-path "/Users/buildslave/jenkins/workspace/lldb-cmake-matrix/lldb-build/lldb-test-build.noindex/module-cache-lldb/lldb-api"
output: 

runCmd: settings set use-color false
output: 

runCmd: setting set target.prefer-dynamic-value no-dynamic-values
output: 

looking at: settings set target.process.

Checking string:
"settings set target.process."

Expecting regex pattern: "settings set target.process." (was found, matched "settings set target.process.")

PASS: LLDB (/Users/buildslave/jenkins/workspace/lldb-cmake-matrix/lldb-build/bin/clang-x86_64) :: test_settings_set_target_process (TestCompletion.CommandLineCompletionTestCase)
runCmd: settings clear -all
output: 

runCmd: settings set symbols.enable-external-lookup false
output: 

runCmd: settings set target.inherit-tcc true
output: 

runCmd: settings set target.detach-on-error false
output: 

runCmd: settings set target.auto-apply-fixits false
output: 

runCmd: settings set plugin.process.gdb-remote.packet-timeout 60
output: 

runCmd: settings set symbols.clang-modules-cache-path "/Users/buildslave/jenkins/workspace/lldb-cmake-matrix/lldb-build/lldb-test-build.noindex/module-cache-lldb/lldb-api"
output: 

runCmd: settings set use-color false
output: 

runCmd: setting set target.prefer-dynamic-value no-dynamic-values
output: 

looking at: settings set target.process.thread.

Checking string:
"settings set target.process.thread."

Expecting regex pattern: "settings set target.process.thread." (was found, matched "settings set target.process.thread.")

PASS: LLDB (/Users/buildslave/jenkins/workspace/lldb-cmake-matrix/lldb-build/bin/clang-x86_64) :: test_settings_set_target_process_dot (TestCompletion.CommandLineCompletionTestCase)
runCmd: settings clear -all
output: 

runCmd: settings set symbols.enable-external-lookup false
output: 

runCmd: settings set target.inherit-tcc true
output: 

runCmd: settings set target.detach-on-error false
output: 

runCmd: settings set target.auto-apply-fixits false
output: 

runCmd: settings set plugin.process.gdb-remote.packet-timeout 60
output: 

runCmd: settings set symbols.clang-modules-cache-path "/Users/buildslave/jenkins/workspace/lldb-cmake-matrix/lldb-build/lldb-test-build.noindex/module-cache-lldb/lldb-api"
output: 

runCmd: settings set use-color false
output: 

runCmd: setting set target.prefer-dynamic-value no-dynamic-values
output: 

looking at: target.process.thread.trace-thread
target.process.thread.max-backtrace-depth
target.process.thread.step-avoid-libraries
target.process.thread.step-avoid-regexp
target.process.thread.step-in-avoid-nodebug
target.process.thread.step-out-avoid-nodebug


Checking string:
"target.process.thread.trace-thread
target.process.thread.max-backtrace-depth
target.process.thread.step-avoid-libraries
target.process.thread.step-avoid-regexp
target.process.thread.step-in-avoid-nodebug
target.process.thread.step-out-avoid-nodebug
"

Expecting regex pattern: "target.process.thread.step-avoid-regexp" (was found, matched "target.process.thread.step-avoid-regexp")

looking at: target.process.thread.trace-thread
target.process.thread.max-backtrace-depth
target.process.thread.step-avoid-libraries
target.process.thread.step-avoid-regexp
target.process.thread.step-in-avoid-nodebug
target.process.thread.step-out-avoid-nodebug

warning: (x86_64) /Users/buildslave/jenkins/workspace/lldb-cmake-matrix/lldb-build/lldb-test-build.noindex/functionalities/completion/TestCompletion.test_target_modules_load_dash_u/a.out empty dSYM file detected, dSYM was created with an executable with no debug info.
warning: (x86_64) /Users/buildslave/jenkins/workspace/lldb-cmake-matrix/lldb-build/lldb-test-build.noindex/functionalities/completion/TestCompletion.test_target_modules_search_paths_insert/a.out empty dSYM file detected, dSYM was created with an executable with no debug info.

Checking string:
"target.process.thread.trace-thread
target.process.thread.max-backtrace-depth
target.process.thread.step-avoid-libraries
target.process.thread.step-avoid-regexp
target.process.thread.step-in-avoid-nodebug
target.process.thread.step-out-avoid-nodebug
"

Expecting regex pattern: "target.process.thread.trace-thread" (was found, matched "target.process.thread.trace-thread")

PASS: LLDB (/Users/buildslave/jenkins/workspace/lldb-cmake-matrix/lldb-build/bin/clang-x86_64) :: test_settings_set_target_process_thread_dot (TestCompletion.CommandLineCompletionTestCase)
runCmd: settings clear -all
output: 

runCmd: settings set symbols.enable-external-lookup false
output: 

runCmd: settings set target.inherit-tcc true
output: 

runCmd: settings set target.detach-on-error false
output: 

runCmd: settings set target.auto-apply-fixits false
output: 

runCmd: settings set plugin.process.gdb-remote.packet-timeout 60
output: 

runCmd: settings set symbols.clang-modules-cache-path "/Users/buildslave/jenkins/workspace/lldb-cmake-matrix/lldb-build/lldb-test-build.noindex/module-cache-lldb/lldb-api"
output: 

runCmd: settings set use-color false
output: 

runCmd: setting set target.prefer-dynamic-value no-dynamic-values
output: 

looking at: settings set thread-format 

Checking string:
"settings set thread-format "

Expecting regex pattern: "settings set thread-format" (was found, matched "settings set thread-format")

PASS: LLDB (/Users/buildslave/jenkins/workspace/lldb-cmake-matrix/lldb-build/bin/clang-x86_64) :: test_settings_set_th (TestCompletion.CommandLineCompletionTestCase)
runCmd: settings clear -all
output: 

runCmd: settings set symbols.enable-external-lookup false
output: 

runCmd: settings set target.inherit-tcc true
output: 

runCmd: settings set target.detach-on-error false
output: 

runCmd: settings set target.auto-apply-fixits false
output: 

runCmd: settings set plugin.process.gdb-remote.packet-timeout 60
output: 

runCmd: settings set symbols.clang-modules-cache-path "/Users/buildslave/jenkins/workspace/lldb-cmake-matrix/lldb-build/lldb-test-build.noindex/module-cache-lldb/lldb-api"
output: 

runCmd: settings set use-color false
output: 

runCmd: setting set target.prefer-dynamic-value no-dynamic-values
output: 

looking at: settings show term-width 

Checking string:
"settings show term-width "

Expecting regex pattern: "settings show term-width" (was found, matched "settings show term-width")

PASS: LLDB (/Users/buildslave/jenkins/workspace/lldb-cmake-matrix/lldb-build/bin/clang-x86_64) :: test_settings_show_term (TestCompletion.CommandLineCompletionTestCase)
runCmd: settings clear -all
output: 

runCmd: settings set symbols.enable-external-lookup false
output: 

runCmd: settings set target.inherit-tcc true
output: 

runCmd: settings set target.detach-on-error false
output: 

runCmd: settings set target.auto-apply-fixits false
output: 

runCmd: settings set plugin.process.gdb-remote.packet-timeout 60
output: 

runCmd: settings set symbols.clang-modules-cache-path "/Users/buildslave/jenkins/workspace/lldb-cmake-matrix/lldb-build/lldb-test-build.noindex/module-cache-lldb/lldb-api"
output: 

runCmd: settings set use-color false
output: 

runCmd: setting set target.prefer-dynamic-value no-dynamic-values
output: 

looking at: 'settings' 

Checking string:
"'settings' "

Expecting regex pattern: "'settings' " (was found, matched "'settings' ")

PASS: LLDB (/Users/buildslave/jenkins/workspace/lldb-cmake-matrix/lldb-build/bin/clang-x86_64) :: test_single_quote_command (TestCompletion.CommandLineCompletionTestCase)
runCmd: settings clear -all
output: 

runCmd: settings set symbols.enable-external-lookup false
output: 

runCmd: settings set target.inherit-tcc true
output: 

runCmd: settings set target.detach-on-error false
output: 

runCmd: settings set target.auto-apply-fixits false
output: 

runCmd: settings set plugin.process.gdb-remote.packet-timeout 60
output: 

runCmd: settings set symbols.clang-modules-cache-path "/Users/buildslave/jenkins/workspace/lldb-cmake-matrix/lldb-build/lldb-test-build.noindex/module-cache-lldb/lldb-api"
output: 

runCmd: settings set use-color false
output: 

runCmd: setting set target.prefer-dynamic-value no-dynamic-values
output: 

looking at: breakpoint set -n Foo::Bar(int,\ int) 

Checking string:
"breakpoint set -n Foo::Bar(int,\ int) "

Expecting sub string: "breakpoint set -n Foo::Bar(int,\ int)" (was found)

looking at: breakpoint set -n Qu

Checking string:
"breakpoint set -n Qu"

Expecting regex pattern: "" (was found, matched "")

PASS: LLDB (/Users/buildslave/jenkins/workspace/lldb-cmake-matrix/lldb-build/bin/clang-x86_64) :: test_symbol_name (TestCompletion.CommandLineCompletionTestCase)
runCmd: settings clear -all
output: 

runCmd: settings set symbols.enable-external-lookup false
output: 

runCmd: settings set target.inherit-tcc true
output: 

runCmd: settings set target.detach-on-error false
output: 

runCmd: settings set target.auto-apply-fixits false
output: 

runCmd: settings set plugin.process.gdb-remote.packet-timeout 60
output: 

runCmd: settings set symbols.clang-modules-cache-path "/Users/buildslave/jenkins/workspace/lldb-cmake-matrix/lldb-build/lldb-test-build.noindex/module-cache-lldb/lldb-api"
output: 

runCmd: settings set use-color false
output: 

runCmd: setting set target.prefer-dynamic-value no-dynamic-values
output: 

looking at: target create --core 

Checking string:
"target create --core "

Expecting regex pattern: "target create --core " (was found, matched "target create --core ")

PASS: LLDB (/Users/buildslave/jenkins/workspace/lldb-cmake-matrix/lldb-build/bin/clang-x86_64) :: test_target_create_dash_co (TestCompletion.CommandLineCompletionTestCase)
runCmd: settings clear -all
output: 

runCmd: settings set symbols.enable-external-lookup false
output: 

runCmd: settings set target.inherit-tcc true
output: 

runCmd: settings set target.detach-on-error false
output: 

runCmd: settings set target.auto-apply-fixits false
output: 

runCmd: settings set plugin.process.gdb-remote.packet-timeout 60
output: 

runCmd: settings set symbols.clang-modules-cache-path "/Users/buildslave/jenkins/workspace/lldb-cmake-matrix/lldb-build/lldb-test-build.noindex/module-cache-lldb/lldb-api"
output: 

runCmd: settings set use-color false
output: 

runCmd: setting set target.prefer-dynamic-value no-dynamic-values
output: 

looking at: target modules dump line-table main.cp

Checking string:
"target modules dump line-table main.cp"

Expecting regex pattern: "main.cpp" (was not found)
'target modules dump line-table main.cp' successfully completes to 'main.cpp', but completions were:


FAIL: LLDB (/Users/buildslave/jenkins/workspace/lldb-cmake-matrix/lldb-build/bin/clang-x86_64) :: test_target_modules_dump_line_table (TestCompletion.CommandLineCompletionTestCase)
runCmd: settings clear -all
output: 

runCmd: settings set symbols.enable-external-lookup false
output: 

runCmd: settings set target.inherit-tcc true
output: 

runCmd: settings set target.detach-on-error false
output: 

runCmd: settings set target.auto-apply-fixits false
output: 

runCmd: settings set plugin.process.gdb-remote.packet-timeout 60
output: 

runCmd: settings set symbols.clang-modules-cache-path "/Users/buildslave/jenkins/workspace/lldb-cmake-matrix/lldb-build/lldb-test-build.noindex/module-cache-lldb/lldb-api"
output: 

runCmd: settings set use-color false
output: 

runCmd: setting set target.prefer-dynamic-value no-dynamic-values
output: 

looking at: target modules load a.out 

Checking string:
"target modules load a.out "

Expecting regex pattern: "a.out" (was found, matched "a.out")

PASS: LLDB (/Users/buildslave/jenkins/workspace/lldb-cmake-matrix/lldb-build/bin/clang-x86_64) :: test_target_modules_load_aout (TestCompletion.CommandLineCompletionTestCase)
runCmd: settings clear -all
output: 

runCmd: settings set symbols.enable-external-lookup false
output: 

runCmd: settings set target.inherit-tcc true
output: 

runCmd: settings set target.detach-on-error false
output: 

runCmd: settings set target.auto-apply-fixits false
output: 

runCmd: settings set plugin.process.gdb-remote.packet-timeout 60
output: 

runCmd: settings set symbols.clang-modules-cache-path "/Users/buildslave/jenkins/workspace/lldb-cmake-matrix/lldb-build/lldb-test-build.noindex/module-cache-lldb/lldb-api"
output: 
warning: (x86_64) /Users/buildslave/jenkins/workspace/lldb-cmake-matrix/lldb-build/lldb-test-build.noindex/functionalities/completion/TestCompletion.test_thread_plan_discard/a.out empty dSYM file detected, dSYM was created with an executable with no debug info.

runCmd: settings set use-color false
output: 

runCmd: setting set target.prefer-dynamic-value no-dynamic-values
output: 

looking at: 1C1E8BBF-6B36-325B-A12B-58558C9314A5
E4698FBD-806A-3396-B279-E685BA37430B
B6FDA8A9-3D2B-3BD5-B5B0-57D311C0FF3D
AD0805FE-F98B-3E2F-B072-83782B22DAC9
A5ECC751-A681-30D8-B33C-D192C15D25C8
C321A74A-AA91-3785-BEBF-BEDC6975026C
652A6012-7E5C-3F4F-9438-86BC094526F3
40113A69-A81C-3397-ADC6-1D16B9A22C3E
5E4B0E50-24DD-3E04-9374-EDA9FFD6257B
201EDBF3-0B36-31BA-A7CB-443CE35C05D4
7E711A46-5E4D-393C-AEA6-440E2A5CCD0C
52662CAA-DB1F-30A3-BE13-D6274B1A6D7B
07CF647B-F9DC-3907-AD98-2F85FCB34A72
D91DFF00-E22F-3796-8A1C-4C1F5F8FA03C
D3B7D02C-7646-3FB4-8529-B36DCC2419EA
B5E88D9B-C2BE-3496-BBB2-C996317E18A3
1170348D-2491-33F1-AA79-E2A05B4A287C
7AFBCAA6-81BE-36C3-8DB0-AAE0A4ACE4C5
935DDCE9-4ED0-3F79-A05A-A123DDE399CC
EA9BC2B1-5001-3463-9FAF-39FF61CAC87C
3D0A3AA8-8415-37B2-AAE3-66C03BCE8B55
6EEC9975-EE3B-3C95-AA5B-030FD10587BC
0115092A-E61B-317D-8670-41C7C34B1A82
AFDB5095-0472-34AC-BA7E-497921BF030A
851693E9-C079-3547-AD41-353F8C248BE8
1E6FACE8-8EB2-3478-A77D-220617855B30
D4BA7DF2-57AC-33B0-B948-A688EE43C799
6DE86DB0-8CD2-361E-BD6A-A34282B47847
7E9E2FC8-DF26-340C-B196-B81B11850C46
20C93D69-6452-3C82-9521-8AE54345C66F
E851113D-D5B1-3FB0-9D29-9C7647A71961
9F9902C9-A46F-3CA9-B7F9-5CCFE98FBF75
736920EA-6AE0-3B1B-BBDA-7DCDF0C229DF
77488669-19A3-3993-AD65-CA5377E2475A
25C3866B-004E-3621-9CD3-B1E9C4D887EB
A1ED1D3A-5FAD-3559-A1D6-1BE4E1C5756A
253A12E2-F88F-3838-A666-C5306F833CB8
68D433B6-DCFF-385D-8620-F847FB7D4A5A
771E9263-E832-3985-9477-8F1B2D73B771
720155DE-4837-3A43-A8AD-C00C8659FDF5


Checking string:
"1C1E8BBF-6B36-325B-A12B-58558C9314A5
E4698FBD-806A-3396-B279-E685BA37430B
B6FDA8A9-3D2B-3BD5-B5B0-57D311C0FF3D
AD0805FE-F98B-3E2F-B072-83782B22DAC9
A5ECC751-A681-30D8-B33C-D192C15D25C8
C321A74A-AA91-3785-BEBF-BEDC6975026C
652A6012-7E5C-3F4F-9438-86BC094526F3
40113A69-A81C-3397-ADC6-1D16B9A22C3E
5E4B0E50-24DD-3E04-9374-EDA9FFD6257B
201EDBF3-0B36-31BA-A7CB-443CE35C05D4
7E711A46-5E4D-393C-AEA6-440E2A5CCD0C
52662CAA-DB1F-30A3-BE13-D6274B1A6D7B
07CF647B-F9DC-3907-AD98-2F85FCB34A72
D91DFF00-E22F-3796-8A1C-4C1F5F8FA03C
D3B7D02C-7646-3FB4-8529-B36DCC2419EA
B5E88D9B-C2BE-3496-BBB2-C996317E18A3
1170348D-2491-33F1-AA79-E2A05B4A287C
7AFBCAA6-81BE-36C3-8DB0-AAE0A4ACE4C5
935DDCE9-4ED0-3F79-A05A-A123DDE399CC
EA9BC2B1-5001-3463-9FAF-39FF61CAC87C
3D0A3AA8-8415-37B2-AAE3-66C03BCE8B55
6EEC9975-EE3B-3C95-AA5B-030FD10587BC
0115092A-E61B-317D-8670-41C7C34B1A82
AFDB5095-0472-34AC-BA7E-497921BF030A
851693E9-C079-3547-AD41-353F8C248BE8
1E6FACE8-8EB2-3478-A77D-220617855B30
D4BA7DF2-57AC-33B0-B948-A688EE43C799
6DE86DB0-8CD2-361E-BD6A-A34282B47847
7E9E2FC8-DF26-340C-B196-B81B11850C46
20C93D69-6452-3C82-9521-8AE54345C66F
E851113D-D5B1-3FB0-9D29-9C7647A71961
9F9902C9-A46F-3CA9-B7F9-5CCFE98FBF75
736920EA-6AE0-3B1B-BBDA-7DCDF0C229DF
77488669-19A3-3993-AD65-CA5377E2475A
25C3866B-004E-3621-9CD3-B1E9C4D887EB
A1ED1D3A-5FAD-3559-A1D6-1BE4E1C5756A
253A12E2-F88F-3838-A666-C5306F833CB8
68D433B6-DCFF-385D-8620-F847FB7D4A5A
771E9263-E832-3985-9477-8F1B2D73B771
720155DE-4837-3A43-A8AD-C00C8659FDF5
"

Expecting regex pattern: "1C1E8BBF-6B36-325B-A12B-58558C9314A5" (was found, matched "1C1E8BBF-6B36-325B-A12B-58558C9314A5")

PASS: LLDB (/Users/buildslave/jenkins/workspace/lldb-cmake-matrix/lldb-build/bin/clang-x86_64) :: test_target_modules_load_dash_u (TestCompletion.CommandLineCompletionTestCase)
runCmd: settings clear -all
output: 

runCmd: settings set symbols.enable-external-lookup false
output: 

runCmd: settings set target.inherit-tcc true
output: 

runCmd: settings set target.detach-on-error false
output: 

runCmd: settings set target.auto-apply-fixits false
output: 

runCmd: settings set plugin.process.gdb-remote.packet-timeout 60
output: 

runCmd: settings set symbols.clang-modules-cache-path "/Users/buildslave/jenkins/workspace/lldb-cmake-matrix/lldb-build/lldb-test-build.noindex/module-cache-lldb/lldb-api"
output: 

runCmd: settings set use-color false
output: 

runCmd: setting set target.prefer-dynamic-value no-dynamic-values
output: 

looking at: target modules search-paths insert 

Checking string:
"target modules search-paths insert "

Expecting regex pattern: "target modules search-paths insert " (was found, matched "target modules search-paths insert ")

looking at: target modules search-paths insert 

Checking string:
"target modules search-paths insert "

Expecting regex pattern: "target modules search-paths insert " (was found, matched "target modules search-paths insert ")

runCmd: target modules search-paths add a b
output: 

looking at: target modules search-paths insert 0 

Checking string:
"target modules search-paths insert 0 "

Expecting regex pattern: "target modules search-paths insert 0" (was found, matched "target modules search-paths insert 0")

looking at: target modules search-paths insert 0 

Checking string:
"target modules search-paths insert 0 "

Expecting regex pattern: "target modules search-paths insert 0 " (was found, matched "target modules search-paths insert 0 ")

PASS: LLDB (/Users/buildslave/jenkins/workspace/lldb-cmake-matrix/lldb-build/bin/clang-x86_64) :: test_target_modules_search_paths_insert (TestCompletion.CommandLineCompletionTestCase)
runCmd: settings clear -all
output: 

runCmd: settings set symbols.enable-external-lookup false
output: 

runCmd: settings set target.inherit-tcc true
output: 

runCmd: settings set target.detach-on-error false
output: 

runCmd: settings set target.auto-apply-fixits false
output: 

runCmd: settings set plugin.process.gdb-remote.packet-timeout 60
output: 

runCmd: settings set symbols.clang-modules-cache-path "/Users/buildslave/jenkins/workspace/lldb-cmake-matrix/lldb-build/lldb-test-build.noindex/module-cache-lldb/lldb-api"
output: 

runCmd: settings set use-color false
output: 

runCmd: setting set target.prefer-dynamic-value no-dynamic-values
output: 

looking at: create
delete
list
modules
select
show-launch-environment
stop-hook
symbols
variable


Checking string:
"create
delete
list
modules
select
show-launch-environment
stop-hook
symbols
variable
"

Expecting regex pattern: "create" (was found, matched "create")

looking at: create
delete
list
modules
select
show-launch-environment
stop-hook
symbols
variable


Checking string:
"create
delete
list
modules
select
show-launch-environment
stop-hook
symbols
variable
"

Expecting regex pattern: "delete" (was found, matched "delete")

looking at: create
delete
list
modules
select
show-launch-environment
stop-hook
symbols
variable


Checking string:
"create
delete
list
modules
select
show-launch-environment
stop-hook
symbols
variable
"

Expecting regex pattern: "list" (was found, matched "list")

looking at: create
delete
list
modules
select
show-launch-environment
stop-hook
symbols
variable


Checking string:
"create
delete
list
modules
select
show-launch-environment
stop-hook
symbols
variable
"

Expecting regex pattern: "modules" (was found, matched "modules")

looking at: create
delete
list
modules
select
show-launch-environment
stop-hook
symbols
variable


Checking string:
"create
delete
list
modules
select
show-launch-environment
stop-hook
symbols
variable
"

Expecting regex pattern: "select" (was found, matched "select")

looking at: create
delete
list
modules
select
show-launch-environment
stop-hook
symbols
variable


Checking string:
"create
delete
list
modules
select
show-launch-environment
stop-hook
symbols
variable
"

Expecting regex pattern: "stop-hook" (was found, matched "stop-hook")

looking at: create
delete
list
modules
select
show-launch-environment
stop-hook
symbols
variable


Checking string:
"create
delete
list
modules
select
show-launch-environment
stop-hook
symbols
variable
"

Expecting regex pattern: "variable" (was found, matched "variable")

PASS: LLDB (/Users/buildslave/jenkins/workspace/lldb-cmake-matrix/lldb-build/bin/clang-x86_64) :: test_target_space (TestCompletion.CommandLineCompletionTestCase)
runCmd: settings clear -all
output: 

runCmd: settings set symbols.enable-external-lookup false
output: 

runCmd: settings set target.inherit-tcc true
output: 

runCmd: settings set target.detach-on-error false
output: 
warning: (x86_64) /Users/buildslave/jenkins/workspace/lldb-cmake-matrix/lldb-build/lldb-test-build.noindex/functionalities/completion/TestCompletion.test_watchpoint_set_variable_foo/a.out empty dSYM file detected, dSYM was created with an executable with no debug info.

runCmd: settings set target.auto-apply-fixits false
output: 

runCmd: settings set plugin.process.gdb-remote.packet-timeout 60
output: 

runCmd: settings set symbols.clang-modules-cache-path "/Users/buildslave/jenkins/workspace/lldb-cmake-matrix/lldb-build/lldb-test-build.noindex/module-cache-lldb/lldb-api"
output: 

runCmd: settings set use-color false
output: 

runCmd: setting set target.prefer-dynamic-value no-dynamic-values
output: 

PASS: LLDB (/Users/buildslave/jenkins/workspace/lldb-cmake-matrix/lldb-build/bin/clang-x86_64) :: test_target_symbols_add_shlib (TestCompletion.CommandLineCompletionTestCase)
runCmd: settings clear -all
output: 

runCmd: settings set symbols.enable-external-lookup false
output: 

runCmd: settings set target.inherit-tcc true
output: 

runCmd: settings set target.detach-on-error false
output: 

runCmd: settings set target.auto-apply-fixits false
output: 

runCmd: settings set plugin.process.gdb-remote.packet-timeout 60
output: 

runCmd: settings set symbols.clang-modules-cache-path "/Users/buildslave/jenkins/workspace/lldb-cmake-matrix/lldb-build/lldb-test-build.noindex/module-cache-lldb/lldb-api"
output: 

runCmd: settings set use-color false
output: 

runCmd: setting set target.prefer-dynamic-value no-dynamic-values
output: 

looking at: target variable 

Checking string:
"target variable "

Expecting regex pattern: "target variable " (was found, matched "target variable ")

PASS: LLDB (/Users/buildslave/jenkins/workspace/lldb-cmake-matrix/lldb-build/bin/clang-x86_64) :: test_target_va (TestCompletion.CommandLineCompletionTestCase)
runCmd: settings clear -all
output: 

runCmd: settings set symbols.enable-external-lookup false
output: 

runCmd: settings set target.inherit-tcc true
output: 

runCmd: settings set target.detach-on-error false
output: 

runCmd: settings set target.auto-apply-fixits false
output: 

runCmd: settings set plugin.process.gdb-remote.packet-timeout 60
output: 

runCmd: settings set symbols.clang-modules-cache-path "/Users/buildslave/jenkins/workspace/lldb-cmake-matrix/lldb-build/lldb-test-build.noindex/module-cache-lldb/lldb-api"
output: 

runCmd: settings set use-color false
output: 

runCmd: setting set target.prefer-dynamic-value no-dynamic-values
output: 

PASS: LLDB (/Users/buildslave/jenkins/workspace/lldb-cmake-matrix/lldb-build/bin/clang-x86_64) :: test_terminated_quote_command (TestCompletion.CommandLineCompletionTestCase)
runCmd: settings clear -all
output: 

runCmd: settings set symbols.enable-external-lookup false
output: 

runCmd: settings set target.inherit-tcc true
output: 

runCmd: settings set target.detach-on-error false
output: 

runCmd: settings set target.auto-apply-fixits false
output: 

runCmd: settings set plugin.process.gdb-remote.packet-timeout 60
output: 

runCmd: settings set symbols.clang-modules-cache-path "/Users/buildslave/jenkins/workspace/lldb-cmake-matrix/lldb-build/lldb-test-build.noindex/module-cache-lldb/lldb-api"
output: 

runCmd: settings set use-color false
output: 

runCmd: setting set target.prefer-dynamic-value no-dynamic-values
output: 

FAIL: LLDB (/Users/buildslave/jenkins/workspace/lldb-cmake-matrix/lldb-build/bin/clang-x86_64) :: test_thread_plan_discard (TestCompletion.CommandLineCompletionTestCase)
runCmd: settings clear -all
output: 

runCmd: settings set symbols.enable-external-lookup false
output: 

runCmd: settings set target.inherit-tcc true
output: 

runCmd: settings set target.detach-on-error false
output: 

runCmd: settings set target.auto-apply-fixits false
output: 

runCmd: settings set plugin.process.gdb-remote.packet-timeout 60
output: 

runCmd: settings set symbols.clang-modules-cache-path "/Users/buildslave/jenkins/workspace/lldb-cmake-matrix/lldb-build/lldb-test-build.noindex/module-cache-lldb/lldb-api"
output: 

runCmd: settings set use-color false
output: 

runCmd: setting set target.prefer-dynamic-value no-dynamic-values
output: 

looking at: watchpoint command 

Checking string:
"watchpoint command "

Expecting regex pattern: "watchpoint command " (was found, matched "watchpoint command ")

PASS: LLDB (/Users/buildslave/jenkins/workspace/lldb-cmake-matrix/lldb-build/bin/clang-x86_64) :: test_watchpoint_co (TestCompletion.CommandLineCompletionTestCase)
runCmd: settings clear -all
output: 

runCmd: settings set symbols.enable-external-lookup false
output: 

runCmd: settings set target.inherit-tcc true
output: 

runCmd: settings set target.detach-on-error false
output: 

runCmd: settings set target.auto-apply-fixits false
output: 

runCmd: settings set plugin.process.gdb-remote.packet-timeout 60
output: 

runCmd: settings set symbols.clang-modules-cache-path "/Users/buildslave/jenkins/workspace/lldb-cmake-matrix/lldb-build/lldb-test-build.noindex/module-cache-lldb/lldb-api"
output: 

runCmd: settings set use-color false
output: 

runCmd: setting set target.prefer-dynamic-value no-dynamic-values
output: 

looking at: watchpoint command add 

Checking string:
"watchpoint command add "

Expecting regex pattern: "watchpoint command add " (was found, matched "watchpoint command add ")

PASS: LLDB (/Users/buildslave/jenkins/workspace/lldb-cmake-matrix/lldb-build/bin/clang-x86_64) :: test_watchpoint_command_a (TestCompletion.CommandLineCompletionTestCase)
runCmd: settings clear -all
output: 

runCmd: settings set symbols.enable-external-lookup false
output: 

runCmd: settings set target.inherit-tcc true
output: 

runCmd: settings set target.detach-on-error false
output: 

runCmd: settings set target.auto-apply-fixits false
output: 

runCmd: settings set plugin.process.gdb-remote.packet-timeout 60
output: 

runCmd: settings set symbols.clang-modules-cache-path "/Users/buildslave/jenkins/workspace/lldb-cmake-matrix/lldb-build/lldb-test-build.noindex/module-cache-lldb/lldb-api"
output: 

runCmd: settings set use-color false
output: 

runCmd: setting set target.prefer-dynamic-value no-dynamic-values
output: 

looking at: add
delete
list


Checking string:
"add
delete
list
"

Expecting regex pattern: "add" (was found, matched "add")

looking at: add
delete
list


Checking string:
"add
delete
list
"

Expecting regex pattern: "delete" (was found, matched "delete")

looking at: add
delete
list


Checking string:
"add
delete
list
"

Expecting regex pattern: "list" (was found, matched "list")

PASS: LLDB (/Users/buildslave/jenkins/workspace/lldb-cmake-matrix/lldb-build/bin/clang-x86_64) :: test_watchpoint_command_space (TestCompletion.CommandLineCompletionTestCase)
runCmd: settings clear -all
output: 

runCmd: settings set symbols.enable-external-lookup false
output: 

runCmd: settings set target.inherit-tcc true
output: 

runCmd: settings set target.detach-on-error false
output: 

runCmd: settings set target.auto-apply-fixits false
output: 

runCmd: settings set plugin.process.gdb-remote.packet-timeout 60
output: 

runCmd: settings set symbols.clang-modules-cache-path "/Users/buildslave/jenkins/workspace/lldb-cmake-matrix/lldb-build/lldb-test-build.noindex/module-cache-lldb/lldb-api"
output: 

runCmd: settings set use-color false
output: 

runCmd: setting set target.prefer-dynamic-value no-dynamic-values
output: 

looking at: watchpoint set expression 

Checking string:
"watchpoint set expression "

Expecting regex pattern: "watchpoint set expression " (was found, matched "watchpoint set expression ")

PASS: LLDB (/Users/buildslave/jenkins/workspace/lldb-cmake-matrix/lldb-build/bin/clang-x86_64) :: test_watchpoint_set_ex (TestCompletion.CommandLineCompletionTestCase)
runCmd: settings clear -all
output: 

runCmd: settings set symbols.enable-external-lookup false
output: 

runCmd: settings set target.inherit-tcc true
output: 

runCmd: settings set target.detach-on-error false
output: 

runCmd: settings set target.auto-apply-fixits false
output: 

runCmd: settings set plugin.process.gdb-remote.packet-timeout 60
output: 

runCmd: settings set symbols.clang-modules-cache-path "/Users/buildslave/jenkins/workspace/lldb-cmake-matrix/lldb-build/lldb-test-build.noindex/module-cache-lldb/lldb-api"
output: 

runCmd: settings set use-color false
output: 

runCmd: setting set target.prefer-dynamic-value no-dynamic-values
output: 

looking at: watchpoint set variable 

Checking string:
"watchpoint set variable "

Expecting regex pattern: "watchpoint set variable " (was found, matched "watchpoint set variable ")

PASS: LLDB (/Users/buildslave/jenkins/workspace/lldb-cmake-matrix/lldb-build/bin/clang-x86_64) :: test_watchpoint_set_var (TestCompletion.CommandLineCompletionTestCase)
runCmd: settings clear -all
output: 

runCmd: settings set symbols.enable-external-lookup false
output: 

runCmd: settings set target.inherit-tcc true
output: 

runCmd: settings set target.detach-on-error false
output: 

runCmd: settings set target.auto-apply-fixits false
output: 

runCmd: settings set plugin.process.gdb-remote.packet-timeout 60
output: 

runCmd: settings set symbols.clang-modules-cache-path "/Users/buildslave/jenkins/workspace/lldb-cmake-matrix/lldb-build/lldb-test-build.noindex/module-cache-lldb/lldb-api"
output: 

runCmd: settings set use-color false
output: 

runCmd: setting set target.prefer-dynamic-value no-dynamic-values
output: 

FAIL: LLDB (/Users/buildslave/jenkins/workspace/lldb-cmake-matrix/lldb-build/bin/clang-x86_64) :: test_watchpoint_set_variable_foo (TestCompletion.CommandLineCompletionTestCase)
Call class-specific cleanup function for class: <class 'TestCompletion.CommandLineCompletionTestCase'>
Restore dir to: /Users/buildslave/jenkins/workspace/lldb-cmake-matrix/lldb-build/tools/lldb/test
======================================================================
FAIL: test_common_complete_watchpoint_ids (TestCompletion.CommandLineCompletionTestCase)
----------------------------------------------------------------------
Traceback (most recent call last):
  File "/Users/buildslave/jenkins/workspace/lldb-cmake-matrix/llvm-project/lldb/packages/Python/lldbsuite/test/decorators.py", line 105, in wrapper
    func(*args, **kwargs)
  File "/Users/buildslave/jenkins/workspace/lldb-cmake-matrix/llvm-project/lldb/test/API/functionalities/completion/TestCompletion.py", line 305, in test_common_complete_watchpoint_ids
    lldbutil.run_to_source_breakpoint(self, '// Break here', lldb.SBFileSpec("main.cpp"))
  File "/Users/buildslave/jenkins/workspace/lldb-cmake-matrix/llvm-project/lldb/packages/Python/lldbsuite/test/lldbutil.py", line 952, in run_to_source_breakpoint
    %(bkpt_pattern, source_spec.GetFilename(), source_spec.GetDirectory()))
AssertionError: False is not True : No locations found for source breakpoint: "// Break here", file: "main.cpp", dir: "/Users/buildslave/jenkins/workspace/lldb-cmake-matrix/llvm-project/lldb/test/API/functionalities/completion"
Config=x86_64-/Users/buildslave/jenkins/workspace/lldb-cmake-matrix/lldb-build/bin/clang
======================================================================
FAIL: test_common_completion_frame_index (TestCompletion.CommandLineCompletionTestCase)
----------------------------------------------------------------------
Traceback (most recent call last):
  File "/Users/buildslave/jenkins/workspace/lldb-cmake-matrix/llvm-project/lldb/test/API/functionalities/completion/TestCompletion.py", line 563, in test_common_completion_frame_index
    lldbutil.run_to_source_breakpoint(self, '// Break here', lldb.SBFileSpec("main.cpp"))
  File "/Users/buildslave/jenkins/workspace/lldb-cmake-matrix/llvm-project/lldb/packages/Python/lldbsuite/test/lldbutil.py", line 952, in run_to_source_breakpoint
    %(bkpt_pattern, source_spec.GetFilename(), source_spec.GetDirectory()))
AssertionError: False is not True : No locations found for source breakpoint: "// Break here", file: "main.cpp", dir: "/Users/buildslave/jenkins/workspace/lldb-cmake-matrix/llvm-project/lldb/test/API/functionalities/completion"
Config=x86_64-/Users/buildslave/jenkins/workspace/lldb-cmake-matrix/lldb-build/bin/clang
======================================================================
FAIL: test_common_completion_thread_index (TestCompletion.CommandLineCompletionTestCase)
----------------------------------------------------------------------
Traceback (most recent call last):
  File "/Users/buildslave/jenkins/workspace/lldb-cmake-matrix/llvm-project/lldb/test/API/functionalities/completion/TestCompletion.py", line 477, in test_common_completion_thread_index
    lldbutil.run_to_source_breakpoint(self, '// Break here', lldb.SBFileSpec("main.cpp"))
  File "/Users/buildslave/jenkins/workspace/lldb-cmake-matrix/llvm-project/lldb/packages/Python/lldbsuite/test/lldbutil.py", line 952, in run_to_source_breakpoint
    %(bkpt_pattern, source_spec.GetFilename(), source_spec.GetDirectory()))
AssertionError: False is not True : No locations found for source breakpoint: "// Break here", file: "main.cpp", dir: "/Users/buildslave/jenkins/workspace/lldb-cmake-matrix/llvm-project/lldb/test/API/functionalities/completion"
Config=x86_64-/Users/buildslave/jenkins/workspace/lldb-cmake-matrix/lldb-build/bin/clang
======================================================================
FAIL: test_frame_variable (TestCompletion.CommandLineCompletionTestCase)
----------------------------------------------------------------------
Traceback (most recent call last):
  File "/Users/buildslave/jenkins/workspace/lldb-cmake-matrix/llvm-project/lldb/test/API/functionalities/completion/TestCompletion.py", line 45, in test_frame_variable
    '// Break here', self.main_source_spec)
  File "/Users/buildslave/jenkins/workspace/lldb-cmake-matrix/llvm-project/lldb/packages/Python/lldbsuite/test/lldbutil.py", line 952, in run_to_source_breakpoint
    %(bkpt_pattern, source_spec.GetFilename(), source_spec.GetDirectory()))
AssertionError: False is not True : No locations found for source breakpoint: "// Break here", file: "main.cpp", dir: "/Users/buildslave/jenkins/workspace/lldb-cmake-matrix/llvm-project/lldb/test/API/functionalities/completion"
Config=x86_64-/Users/buildslave/jenkins/workspace/lldb-cmake-matrix/lldb-build/bin/clang
======================================================================
FAIL: test_process_load (TestCompletion.CommandLineCompletionTestCase)
----------------------------------------------------------------------
Traceback (most recent call last):
  File "/Users/buildslave/jenkins/workspace/lldb-cmake-matrix/llvm-project/lldb/test/API/functionalities/completion/TestCompletion.py", line 91, in test_process_load
    lldbutil.run_to_source_breakpoint(self, '// Break here', lldb.SBFileSpec("main.cpp"))
  File "/Users/buildslave/jenkins/workspace/lldb-cmake-matrix/llvm-project/lldb/packages/Python/lldbsuite/test/lldbutil.py", line 952, in run_to_source_breakpoint
    %(bkpt_pattern, source_spec.GetFilename(), source_spec.GetDirectory()))
AssertionError: False is not True : No locations found for source breakpoint: "// Break here", file: "main.cpp", dir: "/Users/buildslave/jenkins/workspace/lldb-cmake-matrix/llvm-project/lldb/test/API/functionalities/completion"
Config=x86_64-/Users/buildslave/jenkins/workspace/lldb-cmake-matrix/lldb-build/bin/clang
======================================================================
FAIL: test_process_signal (TestCompletion.CommandLineCompletionTestCase)
----------------------------------------------------------------------
Traceback (most recent call last):
  File "/Users/buildslave/jenkins/workspace/lldb-cmake-matrix/llvm-project/lldb/test/API/functionalities/completion/TestCompletion.py", line 163, in test_process_signal
    lldbutil.run_to_source_breakpoint(self, '// Break here', self.main_source_spec)
  File "/Users/buildslave/jenkins/workspace/lldb-cmake-matrix/llvm-project/lldb/packages/Python/lldbsuite/test/lldbutil.py", line 952, in run_to_source_breakpoint
    %(bkpt_pattern, source_spec.GetFilename(), source_spec.GetDirectory()))
AssertionError: False is not True : No locations found for source breakpoint: "// Break here", file: "main.cpp", dir: "/Users/buildslave/jenkins/workspace/lldb-cmake-matrix/llvm-project/lldb/test/API/functionalities/completion"
Config=x86_64-/Users/buildslave/jenkins/workspace/lldb-cmake-matrix/lldb-build/bin/clang
======================================================================
FAIL: test_register_read_and_write_on_x86 (TestCompletion.CommandLineCompletionTestCase)
    Test the completion of the commands register read and write on x86
----------------------------------------------------------------------
Traceback (most recent call last):
  File "/Users/buildslave/jenkins/workspace/lldb-cmake-matrix/llvm-project/lldb/packages/Python/lldbsuite/test/decorators.py", line 135, in wrapper
    return func(*args, **kwargs)
  File "/Users/buildslave/jenkins/workspace/lldb-cmake-matrix/llvm-project/lldb/test/API/functionalities/completion/TestCompletion.py", line 619, in test_register_read_and_write_on_x86
    lldbutil.run_to_source_breakpoint(self, '// Break here', self.main_source_spec)
  File "/Users/buildslave/jenkins/workspace/lldb-cmake-matrix/llvm-project/lldb/packages/Python/lldbsuite/test/lldbutil.py", line 952, in run_to_source_breakpoint
    %(bkpt_pattern, source_spec.GetFilename(), source_spec.GetDirectory()))
AssertionError: False is not True : No locations found for source breakpoint: "// Break here", file: "main.cpp", dir: "/Users/buildslave/jenkins/workspace/lldb-cmake-matrix/llvm-project/lldb/test/API/functionalities/completion"
Config=x86_64-/Users/buildslave/jenkins/workspace/lldb-cmake-matrix/lldb-build/bin/clang
======================================================================
FAIL: test_target_modules_dump_line_table (TestCompletion.CommandLineCompletionTestCase)
    Tests source file completion by completing the line-table argument.
----------------------------------------------------------------------
Traceback (most recent call last):
  File "/Users/buildslave/jenkins/workspace/lldb-cmake-matrix/llvm-project/lldb/test/API/functionalities/completion/TestCompletion.py", line 438, in test_target_modules_dump_line_table
    ['main.cpp'])
  File "/Users/buildslave/jenkins/workspace/lldb-cmake-matrix/llvm-project/lldb/packages/Python/lldbsuite/test/lldbtest.py", line 2318, in complete_from_to
    str_input, p, match_strings), exe=False, patterns=[p])
  File "/Users/buildslave/jenkins/workspace/lldb-cmake-matrix/llvm-project/lldb/packages/Python/lldbsuite/test/lldbtest.py", line 2552, in expect
    self.fail(log_msg)
AssertionError: Checking string:
"target modules dump line-table main.cp"

Expecting regex pattern: "main.cpp" (was not found)
'target modules dump line-table main.cp' successfully completes to 'main.cpp', but completions were:

Config=x86_64-/Users/buildslave/jenkins/workspace/lldb-cmake-matrix/lldb-build/bin/clang
======================================================================
FAIL: test_thread_plan_discard (TestCompletion.CommandLineCompletionTestCase)
----------------------------------------------------------------------
Traceback (most recent call last):
  File "/Users/buildslave/jenkins/workspace/lldb-cmake-matrix/llvm-project/lldb/test/API/functionalities/completion/TestCompletion.py", line 411, in test_thread_plan_discard
    'ptr_foo', lldb.SBFileSpec("main.cpp"))
  File "/Users/buildslave/jenkins/workspace/lldb-cmake-matrix/llvm-project/lldb/packages/Python/lldbsuite/test/lldbutil.py", line 952, in run_to_source_breakpoint
    %(bkpt_pattern, source_spec.GetFilename(), source_spec.GetDirectory()))
AssertionError: False is not True : No locations found for source breakpoint: "ptr_foo", file: "main.cpp", dir: "/Users/buildslave/jenkins/workspace/lldb-cmake-matrix/llvm-project/lldb/test/API/functionalities/completion"
Config=x86_64-/Users/buildslave/jenkins/workspace/lldb-cmake-matrix/lldb-build/bin/clang
======================================================================
FAIL: test_watchpoint_set_variable_foo (TestCompletion.CommandLineCompletionTestCase)
----------------------------------------------------------------------
Traceback (most recent call last):
  File "/Users/buildslave/jenkins/workspace/lldb-cmake-matrix/llvm-project/lldb/test/API/functionalities/completion/TestCompletion.py", line 279, in test_watchpoint_set_variable_foo
    lldbutil.run_to_source_breakpoint(self, '// Break here', lldb.SBFileSpec("main.cpp"))
  File "/Users/buildslave/jenkins/workspace/lldb-cmake-matrix/llvm-project/lldb/packages/Python/lldbsuite/test/lldbutil.py", line 952, in run_to_source_breakpoint
    %(bkpt_pattern, source_spec.GetFilename(), source_spec.GetDirectory()))
AssertionError: False is not True : No locations found for source breakpoint: "// Break here", file: "main.cpp", dir: "/Users/buildslave/jenkins/workspace/lldb-cmake-matrix/llvm-project/lldb/test/API/functionalities/completion"
Config=x86_64-/Users/buildslave/jenkins/workspace/lldb-cmake-matrix/lldb-build/bin/clang
----------------------------------------------------------------------
Ran 77 tests in 28.886s

RESULT: FAILED (66 passes, 10 failures, 0 errors, 1 skipped, 0 expected failures, 0 unexpected successes)

--

********************
FAIL: lldb-api :: commands/expression/multiline-completion/TestMultilineCompletion.py (2239 of 2242)
******************** TEST 'lldb-api :: commands/expression/multiline-completion/TestMultilineCompletion.py' FAILED ********************
Script:
--
/usr/local/Frameworks/Python.framework/Versions/3.7/bin/python3.7 /Users/buildslave/jenkins/workspace/lldb-cmake-matrix/llvm-project/lldb/test/API/dotest.py -u CXXFLAGS -u CFLAGS --codesign-identity lldb_codesign --arch x86_64 --build-dir /Users/buildslave/jenkins/workspace/lldb-cmake-matrix/lldb-build/lldb-test-build.noindex -t --env TERM=vt100 --skip-category gmodules --skip-category watchpoint --arch=x86_64 --dwarf-version=5 --env LLVM_LIBS_DIR=/Users/buildslave/jenkins/workspace/lldb-cmake-matrix/lldb-build/./lib --arch x86_64 --build-dir /Users/buildslave/jenkins/workspace/lldb-cmake-matrix/lldb-build/lldb-test-build.noindex --lldb-module-cache-dir /Users/buildslave/jenkins/workspace/lldb-cmake-matrix/lldb-build/lldb-test-build.noindex/module-cache-lldb/lldb-api --clang-module-cache-dir /Users/buildslave/jenkins/workspace/lldb-cmake-matrix/lldb-build/lldb-test-build.noindex/module-cache-clang/lldb-api --executable /Users/buildslave/jenkins/workspace/lldb-cmake-matrix/lldb-build/./bin/lldb --compiler /Users/buildslave/jenkins/workspace/lldb-cmake-matrix/lldb-build/./bin/clang --dsymutil /Users/buildslave/jenkins/workspace/lldb-cmake-matrix/lldb-build/./bin/dsymutil --filecheck /Users/buildslave/jenkins/workspace/lldb-cmake-matrix/lldb-build/./bin/FileCheck --yaml2obj /Users/buildslave/jenkins/workspace/lldb-cmake-matrix/lldb-build/./bin/yaml2obj --server /Users/buildslave/jenkins/workspace/lldb-cmake-matrix/lldb-build/./bin/debugserver --lldb-libs-dir /Users/buildslave/jenkins/workspace/lldb-cmake-matrix/lldb-build/./lib /Users/buildslave/jenkins/workspace/lldb-cmake-matrix/llvm-project/lldb/test/API/commands/expression/multiline-completion -p TestMultilineCompletion.py
--
Exit Code: 1

Command Output (stdout):
--
lldb version 12.0.99 (http://labmaster3.local/git/llvm-project.git revision 0875a9da2a387ce8e6aa28db9db933d605c3e6cc)
  clang revision 0875a9da2a387ce8e6aa28db9db933d605c3e6cc
  llvm revision 0875a9da2a387ce8e6aa28db9db933d605c3e6cc
(lldb) settings clear -all
(lldb) settings set symbols.enable-external-lookup false
(lldb) settings set target.inherit-tcc true
(lldb) settings set target.detach-on-error false
(lldb) settings set target.auto-apply-fixits false
(lldb) settings set plugin.process.gdb-remote.packet-timeout 60
(lldb) settings set symbols.clang-modules-cache-path "/Users/buildslave/jenkins/workspace/lldb-cmake-matrix/lldb-build/lldb-test-build.noindex/module-cache-lldb/lldb-api"
(lldb) settings set use-color false
(lldb) setting set target.prefer-dynamic-value no-dynamic-values
(lldb) target create "/Users/buildslave/jenkins/workspace/lldb-cmake-matrix/lldb-build/lldb-test-build.noindex/commands/expression/multiline-completion/TestMultilineCompletion.test_basic_completion/a.out"
warning: (x86_64) /Users/buildslave/jenkins/workspace/lldb-cmake-matrix/lldb-build/lldb-test-build.noindex/commands/expression/multiline-completion/TestMultilineCompletion.test_basic_completion/a.out empty dSYM file detected, dSYM was created with an executable with no debug info.
Current executable set to '/Users/buildslave/jenkins/workspace/lldb-cmake-matrix/lldb-build/lldb-test-build.noindex/commands/expression/multiline-completion/TestMultilineCompletion.test_basic_completion/a.out' (x86_64).
(lldb) b main
b main
Breakpoint 1: where = a.out`main, address = 0x0000000100000f80
(lldb) run
run
Process 66016 launched: '/Users/buildslave/jenkins/workspace/lldb-cmake-matrix/lldb-build/lldb-test-build.noindex/commands/expression/multiline-completion/TestMultilineCompletion.test_basic_completion/a.out' (x86_64)
Process 66016 stopped
* thread #1, queue = 'com.apple.main-thread', stop reason = breakpoint 1.1
    frame #0: 0x0000000100000f80 a.out`main
a.out`main:
->  0x100000f80 <+0>: pushq  %rbp
    0x100000f81 <+1>: movq   %rsp, %rbp
    0x100000f84 <+4>: subq   $0x20, %rsp
    0x100000f88 <+8>: movl   $0x0, -0x4(%rbp)
(lldb) expression
expression
Enter expressions, then terminate with an empty line to evaluate:
to_	  1:    1: to_	to_settings set interpreter.prompt-on-quit false
quit
settings set interpreter.prompt-on-quit false  1: to_settings set interpreter.prompt-on-quit false 
  2:    2: quit  2: quit 
  3:    3: libstdcxx tests will not be run because: Don't know how to build with libstdcxx on macosx
Skipping following debug info categories: ['dwo']

--
Command Output (stderr):
--
Change dir to: /Users/buildslave/jenkins/workspace/lldb-cmake-matrix/llvm-project/lldb/test/API/commands/expression/multiline-completion
runCmd: settings clear -all
output: 

runCmd: settings set symbols.enable-external-lookup false
output: 

runCmd: settings set target.inherit-tcc true
output: 

runCmd: settings set target.detach-on-error false
output: 

runCmd: settings set target.auto-apply-fixits false
output: 

runCmd: settings set plugin.process.gdb-remote.packet-timeout 60
output: 

runCmd: settings set symbols.clang-modules-cache-path "/Users/buildslave/jenkins/workspace/lldb-cmake-matrix/lldb-build/lldb-test-build.noindex/module-cache-lldb/lldb-api"
output: 

runCmd: settings set use-color false
output: 

runCmd: setting set target.prefer-dynamic-value no-dynamic-values
output: 

FAIL: LLDB (/Users/buildslave/jenkins/workspace/lldb-cmake-matrix/lldb-build/bin/clang-x86_64) :: test_basic_completion (TestMultilineCompletion.MultilineCompletionTest)
tearing down the child process....

Restore dir to: /Users/buildslave/jenkins/workspace/lldb-cmake-matrix/lldb-build/tools/lldb/test
======================================================================
ERROR: test_basic_completion (TestMultilineCompletion.MultilineCompletionTest)
   Test that we can complete a simple multiline expression
----------------------------------------------------------------------
Traceback (most recent call last):
  File "/Users/buildslave/jenkins/workspace/lldb-cmake-matrix/llvm-project/lldb/third_party/Python/module/pexpect-4.6/pexpect/expect.py", line 111, in expect_loop
    incoming = spawn.read_nonblocking(spawn.maxread, timeout)
  File "/Users/buildslave/jenkins/workspace/lldb-cmake-matrix/llvm-project/lldb/third_party/Python/module/pexpect-4.6/pexpect/pty_spawn.py", line 482, in read_nonblocking
    raise TIMEOUT('Timeout exceeded.')
pexpect.exceptions.TIMEOUT: Timeout exceeded.

During handling of the above exception, another exception occurred:

Traceback (most recent call last):
  File "/Users/buildslave/jenkins/workspace/lldb-cmake-matrix/llvm-project/lldb/packages/Python/lldbsuite/test/decorators.py", line 135, in wrapper
    return func(*args, **kwargs)
  File "/Users/buildslave/jenkins/workspace/lldb-cmake-matrix/llvm-project/lldb/test/API/commands/expression/multiline-completion/TestMultilineCompletion.py", line 45, in test_basic_completion
    self.child.expect(re.compile(b"to_(\r" + self.cursor_forward_escape_seq(len("  1: to_")) + b")?complete"))
  File "/Users/buildslave/jenkins/workspace/lldb-cmake-matrix/llvm-project/lldb/third_party/Python/module/pexpect-4.6/pexpect/spawnbase.py", line 341, in expect
    timeout, searchwindowsize, async_)
  File "/Users/buildslave/jenkins/workspace/lldb-cmake-matrix/llvm-project/lldb/third_party/Python/module/pexpect-4.6/pexpect/spawnbase.py", line 369, in expect_list
    return exp.expect_loop(timeout)
  File "/Users/buildslave/jenkins/workspace/lldb-cmake-matrix/llvm-project/lldb/third_party/Python/module/pexpect-4.6/pexpect/expect.py", line 119, in expect_loop
    return self.timeout(e)
  File "/Users/buildslave/jenkins/workspace/lldb-cmake-matrix/llvm-project/lldb/third_party/Python/module/pexpect-4.6/pexpect/expect.py", line 82, in timeout
    raise TIMEOUT(msg)
pexpect.exceptions.TIMEOUT: Timeout exceeded.
<pexpect.pty_spawn.spawn object at 0x115061da0>
command: /Users/buildslave/jenkins/workspace/lldb-cmake-matrix/lldb-build/bin/lldb
args: ['/Users/buildslave/jenkins/workspace/lldb-cmake-matrix/lldb-build/bin/lldb', '--no-lldbinit', '--no-use-colors', '-O', 'settings clear -all', '-O', 'settings set symbols.enable-external-lookup false', '-O', 'settings set target.inherit-tcc true', '-O', 'settings set target.detach-on-error false', '-O', 'settings set target.auto-apply-fixits false', '-O', 'settings set plugin.process.gdb-remote.packet-timeout 60', '-O', 'settings set symbols.clang-modules-cache-path "/Users/buildslave/jenkins/workspace/lldb-cmake-matrix/lldb-build/lldb-test-build.noindex/module-cache-lldb/lldb-api"', '-O', 'settings set use-color false', '-O', 'setting set target.prefer-dynamic-value no-dynamic-values', '--file', '/Users/buildslave/jenkins/workspace/lldb-cmake-matrix/lldb-build/lldb-test-build.noindex/commands/expression/multiline-completion/TestMultilineCompletion.test_basic_completion/a.out']
buffer (last 100 chars): b':\r\n\x1b[1G\x1b[J  1:  \x1b[1G  1: to_\tto_\x07'
before (last 100 chars): b':\r\n\x1b[1G\x1b[J  1:  \x1b[1G  1: to_\tto_\x07'
after: <class 'pexpect.exceptions.TIMEOUT'>
match: None
match_index: None
exitstatus: None
flag_eof: False
pid: 65886
child_fd: 6
closed: False
timeout: 30
delimiter: <class 'pexpect.exceptions.EOF'>
logfile: <_io.BufferedWriter name='<stdout>'>
logfile_read: None
logfile_send: None
maxread: 2000
ignorecase: False
searchwindowsize: None
delaybeforesend: 0.05
delayafterclose: 0.1
delayafterterminate: 0.1
searcher: searcher_re:
    0: re.compile(b'to_(\r\x1b\\[8C)?complete')
Config=x86_64-/Users/buildslave/jenkins/workspace/lldb-cmake-matrix/lldb-build/bin/clang
----------------------------------------------------------------------
Ran 1 test in 61.366s

RESULT: FAILED (0 passes, 0 failures, 1 errors, 0 skipped, 0 expected failures, 0 unexpected successes)

--

********************
TIMEOUT: lldb-api :: lang/objc/foundation/TestObjCMethods.py (2240 of 2242)
******************** TEST 'lldb-api :: lang/objc/foundation/TestObjCMethods.py' FAILED ********************
Script:
--
/usr/local/Frameworks/Python.framework/Versions/3.7/bin/python3.7 /Users/buildslave/jenkins/workspace/lldb-cmake-matrix/llvm-project/lldb/test/API/dotest.py -u CXXFLAGS -u CFLAGS --codesign-identity lldb_codesign --arch x86_64 --build-dir /Users/buildslave/jenkins/workspace/lldb-cmake-matrix/lldb-build/lldb-test-build.noindex -t --env TERM=vt100 --skip-category gmodules --skip-category watchpoint --arch=x86_64 --dwarf-version=5 --env LLVM_LIBS_DIR=/Users/buildslave/jenkins/workspace/lldb-cmake-matrix/lldb-build/./lib --arch x86_64 --build-dir /Users/buildslave/jenkins/workspace/lldb-cmake-matrix/lldb-build/lldb-test-build.noindex --lldb-module-cache-dir /Users/buildslave/jenkins/workspace/lldb-cmake-matrix/lldb-build/lldb-test-build.noindex/module-cache-lldb/lldb-api --clang-module-cache-dir /Users/buildslave/jenkins/workspace/lldb-cmake-matrix/lldb-build/lldb-test-build.noindex/module-cache-clang/lldb-api --executable /Users/buildslave/jenkins/workspace/lldb-cmake-matrix/lldb-build/./bin/lldb --compiler /Users/buildslave/jenkins/workspace/lldb-cmake-matrix/lldb-build/./bin/clang --dsymutil /Users/buildslave/jenkins/workspace/lldb-cmake-matrix/lldb-build/./bin/dsymutil --filecheck /Users/buildslave/jenkins/workspace/lldb-cmake-matrix/lldb-build/./bin/FileCheck --yaml2obj /Users/buildslave/jenkins/workspace/lldb-cmake-matrix/lldb-build/./bin/yaml2obj --server /Users/buildslave/jenkins/workspace/lldb-cmake-matrix/lldb-build/./bin/debugserver --lldb-libs-dir /Users/buildslave/jenkins/workspace/lldb-cmake-matrix/lldb-build/./lib /Users/buildslave/jenkins/workspace/lldb-cmake-matrix/llvm-project/lldb/test/API/lang/objc/foundation -p TestObjCMethods.py
--
Exit Code: -9
Timeout: Reached timeout of 600 seconds

Command Output (stdout):
--
lldb version 12.0.99 (http://labmaster3.local/git/llvm-project.git revision 0875a9da2a387ce8e6aa28db9db933d605c3e6cc)
  clang revision 0875a9da2a387ce8e6aa28db9db933d605c3e6cc
  llvm revision 0875a9da2a387ce8e6aa28db9db933d605c3e6cc

--
Command Output (stderr):
--
warning: (x86_64) /Users/buildslave/jenkins/workspace/lldb-cmake-matrix/lldb-build/lldb-test-build.noindex/lang/objc/foundation/TestObjCMethods.test_break_dsym/a.out empty dSYM file detected, dSYM was created with an executable with no debug info.
warning: (x86_64) /Users/buildslave/jenkins/workspace/lldb-cmake-matrix/lldb-build/lldb-test-build.noindex/lang/objc/foundation/TestObjCMethods.test_data_type_and_expr_dsym/a.out empty dSYM file detected, dSYM was created with an executable with no debug info.
Change dir to: /Users/buildslave/jenkins/workspace/lldb-cmake-matrix/llvm-project/lldb/test/API/lang/objc/foundation
runCmd: settings clear -all
output: 

runCmd: settings set symbols.enable-external-lookup false
output: 

runCmd: settings set target.inherit-tcc true
output: 

runCmd: settings set target.detach-on-error false
output: 

runCmd: settings set target.auto-apply-fixits false
output: 

runCmd: settings set plugin.process.gdb-remote.packet-timeout 60
output: 

runCmd: settings set symbols.clang-modules-cache-path "/Users/buildslave/jenkins/workspace/lldb-cmake-matrix/lldb-build/lldb-test-build.noindex/module-cache-lldb/lldb-api"
output: 

runCmd: settings set use-color false
output: 

runCmd: setting set target.prefer-dynamic-value no-dynamic-values
output: 

runCmd: file /Users/buildslave/jenkins/workspace/lldb-cmake-matrix/lldb-build/lldb-test-build.noindex/lang/objc/foundation/TestObjCMethods.test_break_dsym/a.out
output: Current executable set to '/Users/buildslave/jenkins/workspace/lldb-cmake-matrix/lldb-build/lldb-test-build.noindex/lang/objc/foundation/TestObjCMethods.test_break_dsym/a.out' (x86_64).


runCmd: _regexp-break +[NSString stringWithFormat:]
output: Breakpoint 1: where = Foundation`+[NSString stringWithFormat:], address = 0x00007fff2f839d87


Expecting pattern: ^Breakpoint (?P<bpno>[0-9]+): (?P<num_locations>[0-9]+) locations\.$
Not matched

Expecting pattern: ^Breakpoint (?P<bpno>[0-9]+): (?P<num_locations>no) locations \(pending\)\.
Not matched

Expecting pattern: ^Breakpoint (?P<bpno>[0-9]+): where = (?P<module>.*)`(?P<symbol>[+\-]{0,1}[^+]+)( \+ (?P<offset>[0-9]+)){0,1}( \[inlined\] (?P<inline_symbol>.*)){0,1} at (?P<file>[^:]+):(?P<line_no>[0-9]+)(?P<column>(:[0-9]+)?), address = (?P<address>0x[0-9a-fA-F]+)$
Not matched

Expecting pattern: ^Breakpoint (?P<bpno>[0-9]+): where = (?P<module>.*)`(?P<symbol>.*)( \+ (?P<offset>[0-9]+)){0,1}, address = (?P<address>0x[0-9a-fA-F]+)$
Matched

runCmd: breakpoint set -n "-[MyString initWithNSString:]"
output: Breakpoint 2: where = a.out`-[MyString initWithNSString:], address = 0x0000000100001570


Expecting pattern: ^Breakpoint (?P<bpno>[0-9]+): (?P<num_locations>[0-9]+) locations\.$
Not matched

Expecting pattern: ^Breakpoint (?P<bpno>[0-9]+): (?P<num_locations>no) locations \(pending\)\.
Not matched

Expecting pattern: ^Breakpoint (?P<bpno>[0-9]+): where = (?P<module>.*)`(?P<symbol>[+\-]{0,1}[^+]+)( \+ (?P<offset>[0-9]+)){0,1}( \[inlined\] (?P<inline_symbol>.*)){0,1} at (?P<file>[^:]+):(?P<line_no>[0-9]+)(?P<column>(:[0-9]+)?), address = (?P<address>0x[0-9a-fA-F]+)$
Not matched

Expecting pattern: ^Breakpoint (?P<bpno>[0-9]+): where = (?P<module>.*)`(?P<symbol>.*)( \+ (?P<offset>[0-9]+)){0,1}, address = (?P<address>0x[0-9a-fA-F]+)$
Matched

runCmd: breakpoint set -S "description" --shlib "a.out"
output: Breakpoint 3: where = a.out`-[MyString description], address = 0x00000001000016a0


Expecting pattern: ^Breakpoint (?P<bpno>[0-9]+): (?P<num_locations>[0-9]+) locations\.$
Not matched

Expecting pattern: ^Breakpoint (?P<bpno>[0-9]+): (?P<num_locations>no) locations \(pending\)\.
Not matched

Expecting pattern: ^Breakpoint (?P<bpno>[0-9]+): where = (?P<module>.*)`(?P<symbol>[+\-]{0,1}[^+]+)( \+ (?P<offset>[0-9]+)){0,1}( \[inlined\] (?P<inline_symbol>.*)){0,1} at (?P<file>[^:]+):(?P<line_no>[0-9]+)(?P<column>(:[0-9]+)?), address = (?P<address>0x[0-9a-fA-F]+)$
Not matched

Expecting pattern: ^Breakpoint (?P<bpno>[0-9]+): where = (?P<module>.*)`(?P<symbol>.*)( \+ (?P<offset>[0-9]+)){0,1}, address = (?P<address>0x[0-9a-fA-F]+)$
Matched

runCmd: _regexp-break -[NSAutoreleasePool release]
output: Breakpoint 4: where = Foundation`-[NSAutoreleasePool release], address = 0x00007fff2f83da40


Expecting pattern: ^Breakpoint (?P<bpno>[0-9]+): (?P<num_locations>[0-9]+) locations\.$
Not matched

Expecting pattern: ^Breakpoint (?P<bpno>[0-9]+): (?P<num_locations>no) locations \(pending\)\.
Not matched

Expecting pattern: ^Breakpoint (?P<bpno>[0-9]+): where = (?P<module>.*)`(?P<symbol>[+\-]{0,1}[^+]+)( \+ (?P<offset>[0-9]+)){0,1}( \[inlined\] (?P<inline_symbol>.*)){0,1} at (?P<file>[^:]+):(?P<line_no>[0-9]+)(?P<column>(:[0-9]+)?), address = (?P<address>0x[0-9a-fA-F]+)$
Not matched

Expecting pattern: ^Breakpoint (?P<bpno>[0-9]+): where = (?P<module>.*)`(?P<symbol>.*)( \+ (?P<offset>[0-9]+)){0,1}, address = (?P<address>0x[0-9a-fA-F]+)$
Matched

runCmd: run
output: Process 4599 stopped
* thread #1, queue = 'com.apple.main-thread', stop reason = breakpoint 1.1
    frame #0: 0x00007fff38aedd87 Foundation`+[NSString stringWithFormat:]
Foundation`+[NSString stringWithFormat:]:
->  0x7fff38aedd87 <+0>: pushq  %rbp
    0x7fff38aedd88 <+1>: movq   %rsp, %rbp
    0x7fff38aedd8b <+4>: pushq  %r14
    0x7fff38aedd8d <+6>: pushq  %rbx

Process 4599 launched: '/Users/buildslave/jenkins/workspace/lldb-cmake-matrix/lldb-build/lldb-test-build.noindex/lang/objc/foundation/TestObjCMethods.test_break_dsym/a.out' (x86_64)


runCmd: thread backtrace
output: * thread #1, queue = 'com.apple.main-thread', stop reason = breakpoint 1.1
  * frame #0: 0x00007fff38aedd87 Foundation`+[NSString stringWithFormat:]
    frame #1: 0x000000010000183d a.out`Test_NSString + 45
    frame #2: 0x0000000100001b3c a.out`main + 60
    frame #3: 0x00007fff70527cc9 libdyld.dylib`start + 1


Ran command:
"thread backtrace"

Got output:
* thread #1, queue = 'com.apple.main-thread', stop reason = breakpoint 1.1
  * frame #0: 0x00007fff38aedd87 Foundation`+[NSString stringWithFormat:]
    frame #1: 0x000000010000183d a.out`Test_NSString + 45
    frame #2: 0x0000000100001b3c a.out`main + 60
    frame #3: 0x00007fff70527cc9 libdyld.dylib`start + 1

Expecting sub string: "Foundation`+[NSString stringWithFormat:]" (was found)

runCmd: process continue
output: Process 4599 resuming
Process 4599 stopped
* thread #1, queue = 'com.apple.main-thread', stop reason = breakpoint 1.1
    frame #0: 0x00007fff38aedd87 Foundation`+[NSString stringWithFormat:]
Foundation`+[NSString stringWithFormat:]:
->  0x7fff38aedd87 <+0>: pushq  %rbp
    0x7fff38aedd88 <+1>: movq   %rsp, %rbp
    0x7fff38aedd8b <+4>: pushq  %r14
    0x7fff38aedd8d <+6>: pushq  %rbx



runCmd: thread backtrace
output: * thread #1, queue = 'com.apple.main-thread', stop reason = breakpoint 1.1
  * frame #0: 0x00007fff38aedd87 Foundation`+[NSString stringWithFormat:]
    frame #1: 0x000000010000193b a.out`Test_MyString + 59
    frame #2: 0x0000000100001b48 a.out`main + 72
    frame #3: 0x00007fff70527cc9 libdyld.dylib`start + 1


Ran command:
"thread backtrace"

Got output:
* thread #1, queue = 'com.apple.main-thread', stop reason = breakpoint 1.1
  * frame #0: 0x00007fff38aedd87 Foundation`+[NSString stringWithFormat:]
    frame #1: 0x000000010000193b a.out`Test_MyString + 59
    frame #2: 0x0000000100001b48 a.out`main + 72
    frame #3: 0x00007fff70527cc9 libdyld.dylib`start + 1

Expecting sub string: "Foundation`+[NSString stringWithFormat:]" (was found)

runCmd: process continue
output: Process 4599 resuming
Process 4599 stopped
* thread #1, queue = 'com.apple.main-thread', stop reason = breakpoint 2.1
    frame #0: 0x0000000100001570 a.out`-[MyString initWithNSString:]
a.out`-[MyString initWithNSString:]:
->  0x100001570 <+0>: pushq  %rbp
    0x100001571 <+1>: movq   %rsp, %rbp
    0x100001574 <+4>: subq   $0x30, %rsp
    0x100001578 <+8>: movq   %rdi, -0x8(%rbp)



runCmd: thread backtrace
output: * thread #1, queue = 'com.apple.main-thread', stop reason = breakpoint 2.1
  * frame #0: 0x0000000100001570 a.out`-[MyString initWithNSString:]
    frame #1: 0x000000010000195f a.out`Test_MyString + 95
    frame #2: 0x0000000100001b48 a.out`main + 72
    frame #3: 0x00007fff70527cc9 libdyld.dylib`start + 1


Ran command:
"thread backtrace"

Got output:
* thread #1, queue = 'com.apple.main-thread', stop reason = breakpoint 2.1
  * frame #0: 0x0000000100001570 a.out`-[MyString initWithNSString:]
    frame #1: 0x000000010000195f a.out`Test_MyString + 95
    frame #2: 0x0000000100001b48 a.out`main + 72
    frame #3: 0x00007fff70527cc9 libdyld.dylib`start + 1

Expecting sub string: "a.out`-[MyString initWithNSString:]" (was found)

runCmd: process continue
output: Process 4599 resuming
Process 4599 stopped
* thread #1, queue = 'com.apple.main-thread', stop reason = breakpoint 3.1
    frame #0: 0x00000001000016a0 a.out`-[MyString description]
a.out`-[MyString description]:
->  0x1000016a0 <+0>: pushq  %rbp
    0x1000016a1 <+1>: movq   %rsp, %rbp
    0x1000016a4 <+4>: subq   $0x10, %rsp
    0x1000016a8 <+8>: movq   %rdi, -0x8(%rbp)


warning: (x86_64) /Users/buildslave/jenkins/workspace/lldb-cmake-matrix/lldb-build/lldb-test-build.noindex/lang/objc/foundation/TestObjCMethods.test_expression_lookups_objc_dsym/a.out empty dSYM file detected, dSYM was created with an executable with no debug info.

--

********************
TIMEOUT: lldb-api :: python_api/lldbutil/iter/TestRegistersIterator.py (2241 of 2242)
******************** TEST 'lldb-api :: python_api/lldbutil/iter/TestRegistersIterator.py' FAILED ********************
Script:
--
/usr/local/Frameworks/Python.framework/Versions/3.7/bin/python3.7 /Users/buildslave/jenkins/workspace/lldb-cmake-matrix/llvm-project/lldb/test/API/dotest.py -u CXXFLAGS -u CFLAGS --codesign-identity lldb_codesign --arch x86_64 --build-dir /Users/buildslave/jenkins/workspace/lldb-cmake-matrix/lldb-build/lldb-test-build.noindex -t --env TERM=vt100 --skip-category gmodules --skip-category watchpoint --arch=x86_64 --dwarf-version=5 --env LLVM_LIBS_DIR=/Users/buildslave/jenkins/workspace/lldb-cmake-matrix/lldb-build/./lib --arch x86_64 --build-dir /Users/buildslave/jenkins/workspace/lldb-cmake-matrix/lldb-build/lldb-test-build.noindex --lldb-module-cache-dir /Users/buildslave/jenkins/workspace/lldb-cmake-matrix/lldb-build/lldb-test-build.noindex/module-cache-lldb/lldb-api --clang-module-cache-dir /Users/buildslave/jenkins/workspace/lldb-cmake-matrix/lldb-build/lldb-test-build.noindex/module-cache-clang/lldb-api --executable /Users/buildslave/jenkins/workspace/lldb-cmake-matrix/lldb-build/./bin/lldb --compiler /Users/buildslave/jenkins/workspace/lldb-cmake-matrix/lldb-build/./bin/clang --dsymutil /Users/buildslave/jenkins/workspace/lldb-cmake-matrix/lldb-build/./bin/dsymutil --filecheck /Users/buildslave/jenkins/workspace/lldb-cmake-matrix/lldb-build/./bin/FileCheck --yaml2obj /Users/buildslave/jenkins/workspace/lldb-cmake-matrix/lldb-build/./bin/yaml2obj --server /Users/buildslave/jenkins/workspace/lldb-cmake-matrix/lldb-build/./bin/debugserver --lldb-libs-dir /Users/buildslave/jenkins/workspace/lldb-cmake-matrix/lldb-build/./lib /Users/buildslave/jenkins/workspace/lldb-cmake-matrix/llvm-project/lldb/test/API/python_api/lldbutil/iter -p TestRegistersIterator.py
--
Exit Code: -9
Timeout: Reached timeout of 600 seconds

Command Output (stdout):
--
lldb version 12.0.99 (http://labmaster3.local/git/llvm-project.git revision 0875a9da2a387ce8e6aa28db9db933d605c3e6cc)
  clang revision 0875a9da2a387ce8e6aa28db9db933d605c3e6cc
  llvm revision 0875a9da2a387ce8e6aa28db9db933d605c3e6cc

--
Command Output (stderr):
--
warning: (x86_64) /Users/buildslave/jenkins/workspace/lldb-cmake-matrix/lldb-build/lldb-test-build.noindex/python_api/lldbutil/iter/TestRegistersIterator.test_iter_registers_dsym/a.out empty dSYM file detected, dSYM was created with an executable with no debug info.

--

********************
TIMEOUT: lldb-api :: python_api/lldbutil/iter/TestLLDBIterator.py (2242 of 2242)
******************** TEST 'lldb-api :: python_api/lldbutil/iter/TestLLDBIterator.py' FAILED ********************
Script:
--
/usr/local/Frameworks/Python.framework/Versions/3.7/bin/python3.7 /Users/buildslave/jenkins/workspace/lldb-cmake-matrix/llvm-project/lldb/test/API/dotest.py -u CXXFLAGS -u CFLAGS --codesign-identity lldb_codesign --arch x86_64 --build-dir /Users/buildslave/jenkins/workspace/lldb-cmake-matrix/lldb-build/lldb-test-build.noindex -t --env TERM=vt100 --skip-category gmodules --skip-category watchpoint --arch=x86_64 --dwarf-version=5 --env LLVM_LIBS_DIR=/Users/buildslave/jenkins/workspace/lldb-cmake-matrix/lldb-build/./lib --arch x86_64 --build-dir /Users/buildslave/jenkins/workspace/lldb-cmake-matrix/lldb-build/lldb-test-build.noindex --lldb-module-cache-dir /Users/buildslave/jenkins/workspace/lldb-cmake-matrix/lldb-build/lldb-test-build.noindex/module-cache-lldb/lldb-api --clang-module-cache-dir /Users/buildslave/jenkins/workspace/lldb-cmake-matrix/lldb-build/lldb-test-build.noindex/module-cache-clang/lldb-api --executable /Users/buildslave/jenkins/workspace/lldb-cmake-matrix/lldb-build/./bin/lldb --compiler /Users/buildslave/jenkins/workspace/lldb-cmake-matrix/lldb-build/./bin/clang --dsymutil /Users/buildslave/jenkins/workspace/lldb-cmake-matrix/lldb-build/./bin/dsymutil --filecheck /Users/buildslave/jenkins/workspace/lldb-cmake-matrix/lldb-build/./bin/FileCheck --yaml2obj /Users/buildslave/jenkins/workspace/lldb-cmake-matrix/lldb-build/./bin/yaml2obj --server /Users/buildslave/jenkins/workspace/lldb-cmake-matrix/lldb-build/./bin/debugserver --lldb-libs-dir /Users/buildslave/jenkins/workspace/lldb-cmake-matrix/lldb-build/./lib /Users/buildslave/jenkins/workspace/lldb-cmake-matrix/llvm-project/lldb/test/API/python_api/lldbutil/iter -p TestLLDBIterator.py
--
Exit Code: -9
Timeout: Reached timeout of 600 seconds

Command Output (stdout):
--
lldb version 12.0.99 (http://labmaster3.local/git/llvm-project.git revision 0875a9da2a387ce8e6aa28db9db933d605c3e6cc)
  clang revision 0875a9da2a387ce8e6aa28db9db933d605c3e6cc
  llvm revision 0875a9da2a387ce8e6aa28db9db933d605c3e6cc

--
Command Output (stderr):
--
warning: (x86_64) /Users/buildslave/jenkins/workspace/lldb-cmake-matrix/lldb-build/lldb-test-build.noindex/python_api/lldbutil/iter/TestLLDBIterator.test_lldb_iter_breakpoint_dsym/a.out empty dSYM file detected, dSYM was created with an executable with no debug info.
error: main.o Failed to extract range list table at offset 0xc: parsing .debug_rnglists table at offset 0x0: unexpected end of data at offset 0x0 while reading [0x0, 0x4)
warning: (x86_64) /Users/buildslave/jenkins/workspace/lldb-cmake-matrix/lldb-build/lldb-test-build.noindex/python_api/lldbutil/iter/TestLLDBIterator.test_lldb_iter_frame_dsym/a.out empty dSYM file detected, dSYM was created with an executable with no debug info.

--

********************
Slowest Tests:
--------------------------------------------------------------------------
600.00s: lldb-api :: lang/objc/foundation/TestObjCMethods.py
599.98s: lldb-api :: python_api/lldbutil/iter/TestLLDBIterator.py
599.98s: lldb-api :: python_api/lldbutil/iter/TestRegistersIterator.py
97.31s: lldb-api :: driver/batch_mode/TestBatchMode.py
91.40s: lldb-api :: tools/lldb-server/TestLldbGdbServer.py
86.33s: lldb-api :: lang/objc/foundation/TestFoundationDisassembly.py
74.15s: lldb-api :: api/multithreaded/TestMultithreaded.py
67.95s: lldb-api :: macosx/nslog/TestDarwinNSLogOutput.py
61.79s: lldb-api :: commands/expression/multiline-completion/TestMultilineCompletion.py
44.86s: lldb-api :: lang/objc/hidden-ivars/TestHiddenIvars.py
34.14s: lldb-api :: tools/lldb-server/TestGdbRemoteThreadsInStopReply.py
33.55s: lldb-api :: python_api/target/TestTargetAPI.py
32.99s: lldb-api :: commands/process/attach-resume/TestAttachResume.py
31.40s: lldb-api :: commands/gui/viewlarge/TestGuiViewLarge.py
31.37s: lldb-api :: commands/gui/basic/TestGuiBasic.py
31.32s: lldb-api :: commands/gui/breakpoints/TestGuiBreakpoints.py
31.32s: lldb-api :: commands/gui/basicdebug/TestGuiBasicDebug.py
29.30s: lldb-api :: functionalities/completion/TestCompletion.py
26.42s: lldb-api :: lang/objc/exceptions/TestObjCExceptions.py
26.13s: lldb-api :: lang/objc/real-definition/TestRealDefinition.py

Tests Times:
--------------------------------------------------------------------------
[   Range   ] :: [               Percentage               ] :: [  Count  ]
--------------------------------------------------------------------------
[550s,600s) :: [                                        ] :: [   3/2242]
[500s,550s) :: [                                        ] :: [   0/2242]
[450s,500s) :: [                                        ] :: [   0/2242]
[400s,450s) :: [                                        ] :: [   0/2242]
[350s,400s) :: [                                        ] :: [   0/2242]
[300s,350s) :: [                                        ] :: [   0/2242]
[250s,300s) :: [                                        ] :: [   0/2242]
[200s,250s) :: [                                        ] :: [   0/2242]
[150s,200s) :: [                                        ] :: [   0/2242]
[100s,150s) :: [                                        ] :: [   0/2242]
[ 50s,100s) :: [                                        ] :: [   6/2242]
[  0s, 50s) :: [*************************************** ] :: [2233/2242]
--------------------------------------------------------------------------
********************
Timed Out Tests (3):
  lldb-api :: lang/objc/foundation/TestObjCMethods.py
  lldb-api :: python_api/lldbutil/iter/TestRegistersIterator.py
  lldb-api :: python_api/lldbutil/iter/TestLLDBIterator.py

********************
Failed Tests (571):
  lldb-api :: functionalities/data-formatter/data-formatter-objc/TestDataFormatterObjCPlain.py
  lldb-api :: commands/expression/codegen-crash-typedefdecl-not-in_declcontext/TestCodegenCrashTypedefDeclNotInDeclContext.py
  lldb-api :: lang/objc/blocks/TestObjCIvarsInBlocks.py
  lldb-api :: lang/cpp/accelerator-table/TestCPPAccelerator.py
  lldb-api :: lang/cpp/call-function/TestCallCPPFunction.py
  lldb-api :: lang/cpp/unsigned_types/TestUnsignedTypes.py
  lldb-api :: python_api/lldbutil/frame/TestFrameUtils.py
  lldb-api :: commands/expression/dollar-in-variable/TestDollarInVariable.py
  lldb-api :: functionalities/rerun/TestRerun.py
  lldb-api :: functionalities/thread/thread_exit/TestThreadExit.py
  lldb-api :: functionalities/inferior-crashing/TestInferiorCrashing.py
  lldb-api :: lang/objc/objc-static-method/TestObjCStaticMethod.py
  lldb-api :: commands/expression/function_template_specialization_temp_args/TestFunctionTemplateSpecializationTempArgs.py
  lldb-api :: tools/lldb-vscode/stackTrace/TestVSCode_stackTrace.py
  lldb-api :: functionalities/breakpoint/breakpoint_locations/TestBreakpointLocations.py
  lldb-api :: functionalities/data-formatter/user-format-vs-summary/TestUserFormatVsSummary.py
  lldb-api :: commands/expression/test/TestExprs.py
  lldb-api :: functionalities/thread/exit_during_expression/TestExitDuringExpression.py
  lldb-api :: commands/settings/TestSettings.py
  lldb-api :: commands/statistics/basic/TestStats.py
  lldb-api :: lang/cpp/modules-import/TestCXXModulesImport.py
  lldb-api :: commands/expression/rdar42038760/TestScalarURem.py
  lldb-api :: commands/expression/test/TestExprs2.py
  lldb-api :: commands/expression/call-throws/TestCallThatThrows.py
  lldb-api :: functionalities/optimized_code/TestNoASanExceptionAfterEvalOP_piece.py
  lldb-api :: commands/expression/anonymous-struct/TestCallUserAnonTypedef.py
  lldb-api :: commands/expression/context-object-objc/TestContextObjectObjc.py
  lldb-api :: functionalities/breakpoint/global_constructor/TestBreakpointInGlobalConstructor.py
  lldb-api :: functionalities/target_var/no_vars/TestTargetVarNoVars.py
  lldb-api :: macosx/macCatalyst/TestMacCatalyst.py
  lldb-api :: functionalities/breakpoint/auto_continue/TestBreakpointAutoContinue.py
  lldb-api :: commands/expression/import-std-module/vector-of-vectors/TestVectorOfVectorsFromStdModule.py
  lldb-api :: functionalities/plugins/python_os_plugin/stepping_plugin_threads/TestOSPluginStepping.py
  lldb-api :: functionalities/type_completion/TestTypeCompletion.py
  lldb-api :: python_api/process/TestProcessAPI.py
  lldb-api :: lang/cpp/non-type-template-param/TestCppNonTypeTemplateParam.py
  lldb-api :: lang/cpp/elaborated-types/TestElaboratedTypes.py
  lldb-api :: functionalities/data-formatter/array_typedef/TestArrayTypedef.py
  lldb-api :: lang/cpp/template-arguments/TestCppTemplateArguments.py
  lldb-api :: functionalities/process_crash_info/TestProcessCrashInfo.py
  lldb-api :: functionalities/memory/read/TestMemoryRead.py
  lldb-api :: functionalities/thread/backtrace_limit/TestBacktraceLimit.py
  lldb-api :: functionalities/data-formatter/language_category_updates/TestDataFormatterLanguageCategoryUpdates.py
  lldb-api :: commands/target/stop-hooks/TestStopHookScripted.py
  lldb-api :: functionalities/breakpoint/breakpoint_language/TestBreakpointLanguage.py
  lldb-api :: lang/c/bitfields/TestBitfields.py
  lldb-api :: python_api/name_lookup/TestNameLookup.py
  lldb-api :: commands/expression/result_numbering/TestResultNumbering.py
  lldb-api :: functionalities/archives/TestBSDArchives.py
  lldb-api :: functionalities/data-formatter/data-formatter-cpp/TestDataFormatterCpp.py
  lldb-api :: functionalities/data-formatter/hexcaps/TestDataFormatterHexCaps.py
  lldb-api :: types/TestLongTypes.py
  lldb-api :: commands/frame/diagnose/local-variable/TestLocalVariable.py
  lldb-api :: python_api/type/TestTypeList.py
  lldb-api :: lang/cpp/default-template-args/TestDefaultTemplateArgs.py
  lldb-api :: commands/expression/completion-in-lambda-and-unnamed-class/TestCompletionInLambdaAndUnnamedClass.py
  lldb-api :: commands/expression/issue_11588/Test11588.py
  lldb-api :: functionalities/data-formatter/frameformat_smallstruct/TestFrameFormatSmallStruct.py
  lldb-api :: commands/expression/unwind_expression/TestUnwindExpression.py
  lldb-api :: functionalities/set-data/TestSetData.py
  lldb-api :: types/TestIntegerTypeExpr.py
  lldb-api :: functionalities/breakpoint/move_nearest/TestMoveNearest.py
  lldb-api :: types/TestCharTypeExpr.py
  lldb-api :: lang/objc/objc-class-method/TestObjCClassMethod.py
  lldb-api :: functionalities/thread/concurrent_events/TestConcurrentCrashWithBreak.py
  lldb-api :: functionalities/lazy-loading/TestLazyLoading.py
  lldb-api :: commands/expression/import-std-module/deque-basic/TestDequeFromStdModule.py
  lldb-api :: macosx/duplicate-archive-members/TestDuplicateMembers.py
  lldb-api :: functionalities/tail_call_frames/inlining_and_tail_calls/TestInliningAndTailCalls.py
  lldb-api :: lang/objc/radar-9691614/TestObjCMethodReturningBOOL.py
  lldb-api :: functionalities/inline-stepping/TestInlineStepping.py
  lldb-api :: lang/c/forward/TestForwardDeclaration.py
  lldb-api :: functionalities/exec/TestExec.py
  lldb-api :: lang/objc/single-entry-dictionary/TestObjCSingleEntryDictionary.py
  lldb-api :: commands/expression/class_template_specialization_empty_pack/TestClassTemplateSpecializationParametersHandling.py
  lldb-api :: macosx/DBGSourcePathRemapping/TestDSYMSourcePathRemapping.py
  lldb-api :: commands/expression/import-std-module/deque-dbg-info-content/TestDbgInfoContentDequeFromStdModule.py
  lldb-api :: functionalities/ptr_refs/TestPtrRefs.py
  lldb-api :: commands/expression/vector_of_enums/TestVectorOfEnums.py
  lldb-api :: driver/batch_mode/TestBatchMode.py
  lldb-api :: functionalities/breakpoint/cpp/TestCPPBreakpointLocations.py
  lldb-api :: commands/gui/viewlarge/TestGuiViewLarge.py
  lldb-api :: lang/cpp/class-template-non-type-parameter-pack/TestClassTemplateNonTypeParameterPack.py
  lldb-api :: lang/cpp/this_class_type_mixing/TestThisClassTypeMixing.py
  lldb-api :: commands/expression/import-std-module/list/TestListFromStdModule.py
  lldb-api :: commands/frame/diagnose/dereference-function-return/TestDiagnoseDereferenceFunctionReturn.py
  lldb-api :: lang/cpp/typedef/TestCppTypedef.py
  lldb-api :: commands/expression/regression-access-function-template-in-record/TestRegressionAccessFunctionTemplateInRecord.py
  lldb-api :: commands/process/signal/TestProcessSignal.py
  lldb-api :: functionalities/data-formatter/data-formatter-objc/TestDataFormatterObjCNSError.py
  lldb-api :: functionalities/tail_call_frames/thread_step_out_or_return/TestSteppingOutWithArtificialFrames.py
  lldb-api :: commands/expression/weak_symbols/TestWeakSymbols.py
  lldb-api :: commands/process/launch-with-shellexpand/TestLaunchWithShellExpand.py
  lldb-api :: lang/cpp/extern_c/TestExternCSymbols.py
  lldb-api :: lang/c/anonymous/TestAnonymous.py
  lldb-api :: macosx/save_crashlog/TestSaveCrashlog.py
  lldb-api :: lang/c/conflicting-symbol/TestConflictingSymbol.py
  lldb-api :: functionalities/data-formatter/data-formatter-categories/TestDataFormatterCategories.py
  lldb-api :: functionalities/tail_call_frames/thread_step_out_message/TestArtificialFrameStepOutMessage.py
  lldb-api :: functionalities/breakpoint/breakpoint_options/TestBreakpointOptions.py
  lldb-api :: lang/cpp/alignas_base_class/TestAlignAsBaseClass.py
  lldb-api :: commands/target/stop-hooks/TestStopHooks.py
  lldb-api :: commands/expression/static-initializers/TestStaticInitializers.py
  lldb-api :: functionalities/data-formatter/data-formatter-objc/TestDataFormatterObjCNSData.py
  lldb-api :: python_api/objc_type/TestObjCType.py
  lldb-api :: commands/expression/import-std-module/pair/TestPairFromStdModule.py
  lldb-api :: lang/cpp/unique-types/TestUniqueTypes.py
  lldb-api :: lang/cpp/overloaded-functions/TestOverloadedFunctions.py
  lldb-api :: functionalities/data-formatter/parray/TestPrintArray.py
  lldb-api :: functionalities/data-formatter/data-formatter-stl/libcxx/multimap/TestDataFormatterLibccMultiMap.py
  lldb-api :: functionalities/dlopen_other_executable/TestDlopenOtherExecutable.py
  lldb-api :: lang/c/step_over_no_deadlock/TestStepOverDoesntBlock.py
  lldb-api :: lang/cpp/multiple-inheritance/TestCppMultipleInheritance.py
  lldb-api :: lang/objc/foundation/TestObjCMethodsNSError.py
  lldb-api :: commands/expression/completion/TestExprCompletion.py
  lldb-api :: lang/objc/objc-runtime-ivars/TestRuntimeIvars.py
  lldb-api :: lang/cpp/namespace/TestNamespaceLookup.py
  lldb-api :: functionalities/pointer_num_children/TestPointerNumChildren.py
  lldb-api :: functionalities/data-formatter/summary-string-onfail/Test-rdar-9974002.py
  lldb-api :: commands/apropos/with-process/TestAproposWithProcess.py
  lldb-api :: functionalities/type_get_module/TestTypeGetModule.py
  lldb-api :: functionalities/thread/crash_during_step/TestCrashDuringStep.py
  lldb-api :: lang/cpp/offsetof/TestOffsetofCpp.py
  lldb-api :: functionalities/signal/TestSendSignal.py
  lldb-api :: commands/expression/two-files/TestObjCTypeQueryFromOtherCompileUnit.py
  lldb-api :: functionalities/tail_call_frames/sbapi_support/TestTailCallFrameSBAPI.py
  lldb-api :: functionalities/data-formatter/data-formatter-objc/cmtime/TestDataFormatterCMTime.py
  lldb-api :: commands/expression/timeout/TestCallWithTimeout.py
  lldb-api :: commands/frame/diagnose/virtual-method-call/TestDiagnoseDereferenceVirtualMethodCall.py
  lldb-api :: commands/expression/import-std-module/sysroot/TestStdModuleSysroot.py
  lldb-api :: lang/cpp/constructors/TestCppConstructors.py
  lldb-api :: lang/objc/foundation/TestObjCMethodsNSArray.py
  lldb-api :: commands/expression/import-std-module/weak_ptr-dbg-info-content/TestDbgInfoContentWeakPtrFromStdModule.py
  lldb-api :: functionalities/tail_call_frames/disambiguate_call_site/TestDisambiguateCallSite.py
  lldb-api :: lang/objc/ptr_refs/TestPtrRefsObjC.py
  lldb-api :: commands/expression/import-std-module/shared_ptr/TestSharedPtrFromStdModule.py
  lldb-api :: python_api/value_var_update/TestValueVarUpdate.py
  lldb-api :: lang/c/modules/TestCModules.py
  lldb-api :: functionalities/data-formatter/data-formatter-synthval/TestDataFormatterSynthVal.py
  lldb-api :: lang/objc/hidden-ivars/TestHiddenIvars.py
  lldb-api :: commands/process/attach-resume/TestAttachResume.py
  lldb-api :: tools/lldb-vscode/step/TestVSCode_step.py
  lldb-api :: tools/lldb-vscode/variables/TestVSCode_variables.py
  lldb-api :: commands/expression/import-std-module/vector-dbg-info-content/TestDbgInfoContentVectorFromStdModule.py
  lldb-api :: lang/objc/objc-struct-argument/TestObjCStructArgument.py
  lldb-api :: python_api/get-value-32bit-int/TestGetValue32BitInt.py
  lldb-api :: lang/objc/objc-new-syntax/TestObjCNewSyntaxLiteral.py
  lldb-api :: lang/objc/bitfield_ivars/TestBitfieldIvars.py
  lldb-api :: python_api/process/read-mem-cstring/TestReadMemCString.py
  lldb-api :: functionalities/data-formatter/data-formatter-stl/libcxx/vbool/TestDataFormatterLibcxxVBool.py
  lldb-api :: functionalities/data-formatter/data-formatter-objc/TestDataFormatterObjCNSURL.py
  lldb-api :: functionalities/data-formatter/data-formatter-skip-summary/TestDataFormatterSkipSummary.py
  lldb-api :: commands/command/nested_alias/TestNestedAlias.py
  lldb-api :: functionalities/breakpoint/breakpoint_by_line_and_column/TestBreakpointByLineAndColumn.py
  lldb-api :: python_api/symbol-context/two-files/TestSymbolContextTwoFiles.py
  lldb-api :: lang/cpp/symbols/TestSymbols.py
  lldb-api :: functionalities/data-formatter/data-formatter-stl/libcxx/deque/TestDataFormatterLibcxxDeque.py
  lldb-api :: lang/cpp/bool/TestCPPBool.py
  lldb-api :: functionalities/thread/exit_during_break/TestExitDuringBreak.py
  lldb-api :: tools/lldb-vscode/attach/TestVSCode_attach.py
  lldb-api :: commands/expression/import-std-module/forward_decl_from_module/TestForwardDeclFromStdModule.py
  lldb-api :: functionalities/data-formatter/type_summary_list_script/TestTypeSummaryListScript.py
  lldb-api :: tools/lldb-vscode/breakpoint/TestVSCode_setBreakpoints.py
  lldb-api :: macosx/simulator/TestSimulatorPlatform.py
  lldb-api :: lang/objc/objc-new-syntax/TestObjCNewSyntaxArray.py
  lldb-api :: linux/builtin_trap/TestBuiltinTrap.py
  lldb-api :: lang/objc/modules-non-objc-target/TestObjCModulesNonObjCTarget.py
  lldb-api :: python_api/findvalue_duplist/TestSBFrameFindValue.py
  lldb-api :: functionalities/data-formatter/data-formatter-stl/libcxx/atomic/TestLibCxxAtomic.py
  lldb-api :: functionalities/thread/concurrent_events/TestConcurrentSignalBreak.py
  lldb-api :: lang/objc/rdar-10967107/TestRdar10967107.py
  lldb-api :: functionalities/value_md5_crash/TestValueMD5Crash.py
  lldb-api :: lang/c/const_variables/TestConstVariables.py
  lldb-api :: functionalities/param_entry_vals/basic_entry_values/TestBasicEntryValues.py
  lldb-api :: lang/c/shared_lib/TestSharedLib.py
  lldb-api :: lang/c/tls_globals/TestTlsGlobals.py
  lldb-api :: commands/gui/basicdebug/TestGuiBasicDebug.py
  lldb-api :: functionalities/inferior-crashing/TestInferiorCrashingStep.py
  lldb-api :: commands/thread/select/TestThreadSelect.py
  lldb-api :: lang/objc/conflicting-definition/TestConflictingDefinition.py
  lldb-api :: macosx/find-dsym/deep-bundle/TestDeepBundle.py
  lldb-api :: functionalities/inferior-crashing/recursive-inferior/TestRecursiveInferiorStep.py
  lldb-api :: functionalities/breakpoint/breakpoint_ids/TestBreakpointIDs.py
  lldb-api :: lang/cpp/class-template-type-parameter-pack/TestClassTemplateTypeParameterPack.py
  lldb-api :: lang/objc/objc-optimized/TestObjcOptimized.py
  lldb-api :: lang/c/unions/TestUnionMembers.py
  lldb-api :: lang/c/set_values/TestSetValues.py
  lldb-api :: lang/objc/cpp_keyword_identifiers/TestCppKeywordsAsObjCIdentifiers.py
  lldb-api :: functionalities/step_scripted/TestStepScripted.py
  lldb-api :: commands/frame/diagnose/dereference-argument/TestDiagnoseDereferenceArgument.py
  lldb-api :: api/check_public_api_headers/TestPublicAPIHeaders.py
  lldb-api :: functionalities/var_path/TestVarPath.py
  lldb-api :: types/TestRecursiveTypes.py
  lldb-api :: functionalities/inferior-changed/TestInferiorChanged.py
  lldb-api :: functionalities/data-formatter/data-formatter-synthtype/TestDataFormatterSynthType.py
  lldb-api :: functionalities/data-formatter/data-formatter-stl/libcxx/unordered/TestDataFormatterUnordered.py
  lldb-api :: lang/c/inlines/TestRedefinitionsInInlines.py
  lldb-api :: commands/expression/formatters/TestFormatters.py
  lldb-api :: lang/cpp/function-qualifiers/TestCppFunctionQualifiers.py
  lldb-api :: functionalities/data-formatter/data-formatter-named-summaries/TestDataFormatterNamedSummaries.py
  lldb-api :: commands/expression/import-std-module/weak_ptr/TestWeakPtrFromStdModule.py
  lldb-api :: functionalities/data-formatter/data-formatter-ptr-to-array/TestPtrToArrayFormatting.py
  lldb-api :: functionalities/breakpoint/source_regexp/TestSourceRegexBreakpoints.py
  lldb-api :: lang/cpp/nsimport/TestCppNsImport.py
  lldb-api :: functionalities/breakpoint/breakpoint_ignore_count/TestBreakpointIgnoreCount.py
  lldb-api :: functionalities/data-formatter/data-formatter-globals/TestDataFormatterGlobals.py
  lldb-api :: python_api/sbvalue_const_addrof/TestSBValueConstAddrOf.py
  lldb-api :: functionalities/thread/concurrent_events/TestConcurrentBreakpointDelayBreakpointOneSignal.py
  lldb-api :: functionalities/thread/exit_during_step/TestExitDuringStep.py
  lldb-api :: lang/cpp/enum_types/TestCPP11EnumTypes.py
  lldb-api :: lang/objc/objc-foundation-dictionary-empty/TestNSDictionary0.py
  lldb-api :: lang/cpp/class-template-parameter-pack/TestClassTemplateParameterPack.py
  lldb-api :: lang/objc/objc-ivar-stripped/TestObjCIvarStripped.py
  lldb-api :: lang/cpp/template-function/TestTemplateFunctions.py
  lldb-api :: functionalities/thread/thread_specific_break/TestThreadSpecificBreakpoint.py
  lldb-api :: functionalities/data-formatter/cstring-utf8-summary/TestCstringUnicode.py
  lldb-api :: python_api/exprpath_synthetic/TestExprPathSynthetic.py
  lldb-api :: functionalities/memory/find/TestMemoryFind.py
  lldb-api :: commands/expression/import-std-module/forward_list/TestForwardListFromStdModule.py
  lldb-api :: functionalities/data-formatter/data-formatter-stl/libcxx/unique_ptr/TestDataFormatterLibcxxUniquePtr.py
  lldb-api :: lang/cpp/covariant-return-types/TestCovariantReturnTypes.py
  lldb-api :: functionalities/data-formatter/nssetsynth/TestNSSetSynthetic.py
  lldb-api :: functionalities/data-formatter/var-in-aggregate-misuse/TestVarInAggregateMisuse.py
  lldb-api :: functionalities/dead-strip/TestDeadStrip.py
  lldb-api :: sample_test/TestSampleInlineTest.py
  lldb-api :: lang/objcxx/hide-runtime-values/TestObjCXXHideRuntimeValues.py
  lldb-api :: functionalities/data-formatter/data-formatter-stl/libcxx/iterator/TestDataFormatterLibccIterator.py
  lldb-api :: functionalities/data-formatter/data-formatter-stl/libcxx/list/loop/TestDataFormatterLibcxxListLoop.py
  lldb-api :: lang/cpp/llvm-style/TestLLVMStyle.py
  lldb-api :: python_api/lldbutil/process/TestPrintStackTraces.py
  lldb-api :: lang/mixed/TestMixedLanguages.py
  lldb-api :: functionalities/breakpoint/breakpoint_command/TestBreakpointCommandsFromPython.py
  lldb-api :: functionalities/thread_plan/TestThreadPlanCommands.py
  lldb-api :: functionalities/data-formatter/format-propagation/TestFormatPropagation.py
  lldb-api :: lang/cpp/inlines/TestInlines.py
  lldb-api :: lang/c/array_types/TestArrayTypes.py
  lldb-api :: commands/expression/import-std-module/list-dbg-info-content/TestDbgInfoContentListFromStdModule.py
  lldb-api :: lang/objc/forward-decl/TestForwardDecl.py
  lldb-api :: functionalities/data-formatter/varscript_formatting/TestDataFormatterVarScriptFormatting.py
  lldb-api :: functionalities/data-formatter/poarray/TestPrintObjectArray.py
  lldb-api :: lang/objc/objc-dyn-sbtype/TestObjCDynamicSBType.py
  lldb-api :: functionalities/target_var/TestTargetVar.py
  lldb-api :: commands/expression/options/TestExprOptions.py
  lldb-api :: lang/cpp/auto/TestCPPAuto.py
  lldb-api :: functionalities/inferior-crashing/recursive-inferior/TestRecursiveInferior.py
  lldb-api :: macosx/indirect_symbol/TestIndirectSymbols.py
  lldb-api :: functionalities/unwind/sigtramp/TestSigtrampUnwind.py
  lldb-api :: lang/objc/foundation/TestConstStrings.py
  lldb-api :: lang/cpp/global_variables/TestCPPGlobalVariables.py
  lldb-api :: functionalities/dynamic_value_child_count/TestDynamicValueChildCount.py
  lldb-api :: commands/expression/import-std-module/basic/TestImportStdModule.py
  lldb-api :: functionalities/data-formatter/data-formatter-advanced/TestDataFormatterAdv.py
  lldb-api :: macosx/find-app-in-bundle/TestFindAppInBundle.py
  lldb-api :: functionalities/data-formatter/vector-types/TestVectorTypesFormatting.py
  lldb-api :: lang/cpp/namespace_definitions/TestNamespaceDefinitions.py
  lldb-api :: python_api/value/linked_list/TestValueAPILinkedList.py
  lldb-api :: functionalities/data-formatter/data-formatter-objc/TestDataFormatterObjCNSContainer.py
  lldb-api :: commands/expression/import-std-module/array/TestArrayFromStdModule.py
  lldb-api :: functionalities/return-value/TestReturnValue.py
  lldb-api :: lang/c/struct_types/TestStructTypes.py
  lldb-api :: lang/c/stepping/TestThreadStepInAvoidRegexp.py
  lldb-api :: lang/objc/variadic_methods/TestVariadicMethods.py
  lldb-api :: commands/frame/var-scope/TestFrameVariableScope.py
  lldb-api :: commands/expression/persistent_variables/TestPersistentVariables.py
  lldb-api :: functionalities/data-formatter/builtin-formats/TestBuiltinFormats.py
  lldb-api :: tools/lldb-vscode/module/TestVSCode_module.py
  lldb-api :: functionalities/thread/concurrent_events/TestConcurrentManyCrash.py
  lldb-api :: lang/objc/objc-checker/TestObjCCheckers.py
  lldb-api :: functionalities/load_using_paths/TestLoadUsingPaths.py
  lldb-api :: commands/expression/import_base_class_when_class_has_derived_member/TestImportBaseClassWhenClassHasDerivedMember.py
  lldb-api :: commands/expression/inline-namespace/TestInlineNamespace.py
  lldb-api :: python_api/sbdata/TestSBData.py
  lldb-api :: functionalities/thread/concurrent_events/TestConcurrentTwoBreakpointThreads.py
  lldb-api :: commands/gui/breakpoints/TestGuiBreakpoints.py
  lldb-api :: commands/expression/import-std-module/retry-with-std-module/TestRetryWithStdModule.py
  lldb-api :: types/TestLongTypesExpr.py
  lldb-api :: functionalities/breakpoint/step_over_breakpoint/TestStepOverBreakpoint.py
  lldb-api :: lang/c/cpp_keyword_identifiers/TestCppKeywordsAsCIdentifiers.py
  lldb-api :: functionalities/data-formatter/data-formatter-stl/libcxx/multiset/TestDataFormatterLibcxxMultiSet.py
  lldb-api :: functionalities/inferior-assert/TestInferiorAssert.py
  lldb-api :: functionalities/data-formatter/refpointer-recursion/TestDataFormatterRefPtrRecursion.py
  lldb-api :: lang/cpp/diamond/TestDiamond.py
  lldb-api :: lang/c/stepping/TestStepAndBreakpoints.py
  lldb-api :: python_api/value/change_values/TestChangeValueAPI.py
  lldb-api :: functionalities/data-formatter/compactvectors/TestCompactVectors.py
  lldb-api :: lang/cpp/gmodules-templates/TestGModules.py
  lldb-api :: lang/c/enum_types/TestEnumTypes.py
  lldb-api :: commands/expression/import-std-module/queue/TestQueueFromStdModule.py
  lldb-api :: lang/objc/foundation/TestObjCMethodsString.py
  lldb-api :: lang/cpp/dynamic-value/TestDynamicValue.py
  lldb-api :: functionalities/data-formatter/pyobjsynthprovider/TestPyObjSynthProvider.py
  lldb-api :: tools/lldb-vscode/console/TestVSCode_console.py
  lldb-api :: functionalities/thread/concurrent_events/TestConcurrentManyBreakpoints.py
  lldb-api :: types/TestFloatTypes.py
  lldb-api :: functionalities/data-formatter/data-formatter-objc/TestDataFormatterObjCNSBundle.py
  lldb-api :: lang/cpp/namespace_conflicts/TestNamespaceConflicts.py
  lldb-api :: functionalities/breakpoint/breakpoint_command/TestBreakpointCommand.py
  lldb-api :: commands/expression/cast_int_to_anonymous_enum/TestCastIntToAnonymousEnum.py
  lldb-api :: commands/expression/import-std-module/unique_ptr/TestUniquePtrFromStdModule.py
  lldb-api :: commands/expression/xvalue/TestXValuePrinting.py
  lldb-api :: commands/expression/top-level/TestTopLevelExprs.py
  lldb-api :: commands/expression/import-std-module/unique_ptr-dbg-info-content/TestUniquePtrDbgInfoContent.py
  lldb-api :: lang/objc/objc-stepping/TestObjCStepping.py
  lldb-api :: python_api/target/TestTargetAPI.py
  lldb-api :: python_api/signals/TestSignalsAPI.py
  lldb-api :: commands/expression/radar_9531204/TestPrintfAfterUp.py
  lldb-api :: lang/c/find_struct_type/TestFindStructTypes.py
  lldb-api :: commands/expression/po_verbosity/TestPoVerbosity.py
  lldb-api :: commands/expression/codegen-crash-import-def-arraytype-element/TestImportDefinitionArrayType.py
  lldb-api :: functionalities/data-formatter/data-formatter-objc/TestDataFormatterObjNSException.py
  lldb-api :: lang/objc/objc-static-method-stripped/TestObjCStaticMethodStripped.py
  lldb-api :: commands/expression/call-function/TestCallStdStringFunction.py
  lldb-api :: lang/objc/exceptions/TestObjCExceptions.py
  lldb-api :: lang/objc/real-definition/TestRealDefinition.py
  lldb-api :: functionalities/data-formatter/data-formatter-stl/libcxx/map/TestDataFormatterLibccMap.py
  lldb-api :: commands/gui/basic/TestGuiBasic.py
  lldb-api :: functionalities/breakpoint/breakpoint_by_file_colon_line/TestBreakpointByFileColonLine.py
  lldb-api :: python_api/thread/TestThreadAPI.py
  lldb-api :: lang/c/complex_int/TestComplexInt.py
  lldb-api :: functionalities/data-formatter/data-formatter-stl/libcxx/tuple/TestDataFormatterLibcxxTuple.py
  lldb-api :: lang/cpp/scope/TestCppScope.py
  lldb-api :: types/TestShortTypeExpr.py
  lldb-api :: python_api/value/TestValueAPI.py
  lldb-api :: lang/cpp/class_types/TestClassTypes.py
  lldb-api :: functionalities/data-formatter/synthupdate/TestSyntheticFilterRecompute.py
  lldb-api :: lang/cpp/template-specialization-type/TestTemplateSpecializationType.py
  lldb-api :: commands/disassemble/basic/TestDisassembleBreakpoint.py
  lldb-api :: python_api/frame/get-variables/TestGetVariables.py
  lldb-api :: lang/cpp/frame-var-anon-unions/TestFrameVariableAnonymousUnions.py
  lldb-api :: functionalities/breakpoint/breakpoint_conditions/TestBreakpointConditions.py
  lldb-api :: functionalities/tail_call_frames/cross_object/TestCrossObjectTailCalls.py
  lldb-api :: macosx/nslog/TestDarwinNSLogOutput.py
  lldb-api :: python_api/interpreter/TestCommandInterpreterAPI.py
  lldb-api :: python_api/symbol-context/TestSymbolContext.py
  lldb-api :: python_api/sbvalue_persist/TestSBValuePersist.py
  lldb-api :: functionalities/thread/concurrent_events/TestConcurrentSignalDelayBreak.py
  lldb-api :: functionalities/thread/concurrent_events/TestConcurrentBreakpointOneDelayBreakpointThreads.py
  lldb-api :: commands/expression/import-std-module/stack/TestStackFromStdModule.py
  lldb-api :: commands/frame/diagnose/complicated-expression/TestComplicatedExpression.py
  lldb-api :: lang/objc/objc++/TestObjCXX.py
  lldb-api :: commands/expression/dont_allow_jit/TestAllowJIT.py
  lldb-api :: lang/objc/ivar-IMP/TestObjCiVarIMP.py
  lldb-api :: lang/objc/objc-ivar-offsets/TestObjCIvarOffsets.py
  lldb-api :: functionalities/thread/concurrent_events/TestConcurrentCrashWithSignal.py
  lldb-api :: functionalities/thread/step_out/TestThreadStepOut.py
  lldb-api :: lang/objc/objc_direct-methods/TestObjCDirectMethods.py
  lldb-api :: commands/expression/persistent_types/TestPersistentTypes.py
  lldb-api :: commands/expression/ignore-artificial-constructors/TestIgnoreArtificialConstructors.py
  lldb-api :: lang/c/local_variables/TestLocalVariables.py
  lldb-api :: types/TestFloatTypesExpr.py
  lldb-api :: tools/lldb-vscode/breakpoint/TestVSCode_setFunctionBreakpoints.py
  lldb-api :: functionalities/breakpoint/breakpoint_hit_count/TestBreakpointHitCount.py
  lldb-api :: lang/objcxx/objc-builtin-types/TestObjCBuiltinTypes.py
  lldb-api :: functionalities/data-formatter/synthcapping/TestSyntheticCapping.py
  lldb-api :: lang/cpp/struct_with_keyword_name/TestStructWithKeywordName.py
  lldb-api :: functionalities/tail_call_frames/cross_dso/TestCrossDSOTailCalls.py
  lldb-api :: lang/objcxx/cxx-bridged-po/TestObjCXXBridgedPO.py
  lldb-api :: functionalities/step-avoids-no-debug/TestStepNoDebug.py
  lldb-api :: functionalities/type_lookup/TestTypeLookup.py
  lldb-api :: functionalities/tail_call_frames/ambiguous_tail_call_seq1/TestAmbiguousTailCallSeq1.py
  lldb-api :: lang/cpp/type_lookup/TestCppTypeLookup.py
  lldb-api :: functionalities/data-formatter/data-formatter-stl/libcxx/optional/TestDataFormatterLibcxxOptional.py
  lldb-api :: lang/objc/modules-compile-error/TestModulesCompileError.py
  lldb-api :: lang/cpp/const_this/TestConstThis.py
  lldb-api :: functionalities/data-formatter/ptr_ref_typedef/TestPtrRef2Typedef.py
  lldb-api :: lang/cpp/virtual-overload/TestVirtualOverload.py
  lldb-api :: lang/cpp/breakpoint-commands/TestCPPBreakpointCommands.py
  lldb-api :: lang/cpp/signed_types/TestSignedTypes.py
  lldb-api :: functionalities/unwind/noreturn/TestNoreturnUnwind.py
  lldb-api :: python_api/function_symbol/TestSymbolAPI.py
  lldb-api :: lang/objc/objc-baseclass-sbtype/TestObjCBaseClassSBType.py
  lldb-api :: commands/target/basic/TestTargetCommand.py
  lldb-api :: lang/c/function_types/TestFunctionTypes.py
  lldb-api :: lang/objc/rdar-11355592/TestRdar11355592.py
  lldb-api :: commands/expression/persistent_ptr_update/TestPersistentPtrUpdate.py
  lldb-api :: macosx/thread_suspend/TestInternalThreadSuspension.py
  lldb-api :: commands/expression/radar_9673664/TestExprHelpExamples.py
  lldb-api :: functionalities/data-formatter/data-formatter-synth/TestDataFormatterSynth.py
  lldb-api :: commands/expression/no-deadlock/TestExprDoesntBlock.py
  lldb-api :: lang/objc/modules-cache/TestClangModulesCache.py
  lldb-api :: python_api/frame/TestFrames.py
  lldb-api :: sample_test/TestSampleTest.py
  lldb-api :: commands/frame/language/TestGuessLanguage.py
  lldb-api :: functionalities/data-formatter/data-formatter-objc/TestDataFormatterObjCNSDate.py
  lldb-api :: functionalities/signal/handle-abrt/TestHandleAbort.py
  lldb-api :: functionalities/memory/cache/TestMemoryCache.py
  lldb-api :: commands/expression/import-std-module/non-module-type-separation/TestNonModuleTypeSeparation.py
  lldb-api :: functionalities/limit-debug-info/TestLimitDebugInfo.py
  lldb-api :: lang/objc/modules-inline-functions/TestModulesInlineFunctions.py
  lldb-api :: lang/objc/objc-struct-return/TestObjCStructReturn.py
  lldb-api :: lang/cpp/dynamic-value/TestCppValueCast.py
  lldb-api :: python_api/process/io/TestProcessIO.py
  lldb-api :: lang/c/register_variables/TestRegisterVariables.py
  lldb-api :: functionalities/breakpoint/debugbreak/TestDebugBreak.py
  lldb-api :: python_api/hello_world/TestHelloWorld.py
  lldb-api :: functionalities/data-formatter/data-formatter-stl/libcxx/forward_list/TestDataFormatterLibcxxForwardList.py
  lldb-api :: functionalities/tail_call_frames/disambiguate_tail_call_seq/TestDisambiguateTailCallSeq.py
  lldb-api :: lang/cpp/operator-overload/TestOperatorOverload.py
  lldb-api :: lang/cpp/global_operators/TestCppGlobalOperators.py
  lldb-api :: functionalities/data-formatter/data-formatter-objc/TestDataFormatterObjCExpr.py
  lldb-api :: source-manager/TestSourceManager.py
  lldb-api :: commands/frame/diagnose/inheritance/TestDiagnoseInheritance.py
  lldb-api :: functionalities/float-display/TestFloatDisplay.py
  lldb-api :: commands/expression/deleting-implicit-copy-constructor/TestDeletingImplicitCopyConstructor.py
  lldb-api :: lang/objc/objc-new-syntax/TestObjCNewSyntaxDictionary.py
  lldb-api :: types/TestIntegerType.py
  lldb-api :: tools/lldb-vscode/launch/TestVSCode_launch.py
  lldb-api :: lang/objc/modules-auto-import/TestModulesAutoImport.py
  lldb-api :: commands/expression/persist_objc_pointeetype/TestPersistObjCPointeeType.py
  lldb-api :: functionalities/unwind/zeroth_frame/TestZerothFrame.py
  lldb-api :: functionalities/data-formatter/data-formatter-objc/TestDataFormatterObjCKVO.py
  lldb-api :: functionalities/thread/concurrent_events/TestConcurrentTwoBreakpointsOneDelaySignal.py
  lldb-api :: commands/frame/diagnose/dereference-this/TestDiagnoseDereferenceThis.py
  lldb-api :: lang/cpp/class_types/TestClassTypesDisassembly.py
  lldb-api :: functionalities/data-formatter/data-formatter-objc/nsindexpath/TestDataFormatterNSIndexPath.py
  lldb-api :: functionalities/data-formatter/nsdictionarysynth/TestNSDictionarySynthetic.py
  lldb-api :: macosx/profile_vrs_detach/TestDetachVrsProfile.py
  lldb-api :: functionalities/data-formatter/stringprinter/TestStringPrinter.py
  lldb-api :: lang/cpp/nested-class-other-compilation-unit/TestNestedClassWithParentInAnotherCU.py
  lldb-api :: commands/expression/expr-in-syscall/TestExpressionInSyscall.py
  lldb-api :: lang/objc/objc-super/TestObjCSuper.py
  lldb-api :: commands/expression/radar_8638051/Test8638051.py
  lldb-api :: commands/expression/fixits/TestFixIts.py
  lldb-api :: functionalities/data-formatter/nsarraysynth/TestNSArraySynthetic.py
  lldb-api :: lang/cpp/trivial_abi/TestTrivialABI.py
  lldb-api :: lang/objc/foundation/TestObjectDescriptionAPI.py
  lldb-api :: functionalities/thread/num_threads/TestNumThreads.py
  lldb-api :: functionalities/breakpoint/dummy_target_breakpoints/TestBreakpointsWithNoTargets.py
  lldb-api :: functionalities/data-formatter/data-formatter-python-synth/TestDataFormatterPythonSynth.py
  lldb-api :: lang/objcxx/class-name-clash/TestNameClash.py
  lldb-api :: functionalities/data-formatter/data-formatter-objc/TestDataFormatterObjCCF.py
  lldb-api :: lang/cpp/class_static/TestStaticVariables.py
  lldb-api :: commands/expression/argument_passing_restrictions/TestArgumentPassingRestrictions.py
  lldb-api :: lang/objc/objc-property/TestObjCProperty.py
  lldb-api :: functionalities/avoids-fd-leak/TestFdLeak.py
  lldb-api :: functionalities/tail_call_frames/ambiguous_tail_call_seq2/TestAmbiguousTailCallSeq2.py
  lldb-api :: functionalities/data-formatter/ostypeformatting/TestFormattersOsType.py
  lldb-api :: lang/cpp/incomplete-types/TestCppIncompleteTypes.py
  lldb-api :: commands/expression/char/TestExprsChar.py
  lldb-api :: lang/c/vla/TestVLA.py
  lldb-api :: functionalities/data-formatter/boolreference/TestFormattersBoolRefPtr.py
  lldb-api :: lang/c/step-target/TestStepTarget.py
  lldb-api :: lang/cpp/rvalue-references/TestRvalueReferences.py
  lldb-api :: commands/source/info/TestSourceInfo.py
  lldb-api :: python_api/value/empty_class/TestValueAPIEmptyClass.py
  lldb-api :: functionalities/thread/step_until/TestStepUntil.py
  lldb-api :: types/TestDoubleTypes.py
  lldb-api :: functionalities/breakpoint/address_breakpoints/TestAddressBreakpoints.py
  lldb-api :: commands/expression/scoped_enums/TestScopedEnumType.py
  lldb-api :: functionalities/data-formatter/data-formatter-stl/libcxx/queue/TestDataFormatterLibcxxQueue.py
  lldb-api :: functionalities/tail_call_frames/unambiguous_sequence/TestUnambiguousTailCalls.py
  lldb-api :: functionalities/process_group/TestChangeProcessGroup.py
  lldb-api :: lang/c/complex/TestComplexC99.py
  lldb-api :: functionalities/data-formatter/setvaluefromcstring/TestSetValueFromCString.py
  lldb-api :: functionalities/data-formatter/data-formatter-stl/libcxx/vector/TestDataFormatterLibcxxVector.py
  lldb-api :: lang/cpp/std-function-step-into-callable/TestStdFunctionStepIntoCallable.py
  lldb-api :: functionalities/tail_call_frames/disambiguate_paths_to_common_sink/TestDisambiguatePathsToCommonSink.py
  lldb-api :: lang/cpp/virtual-functions/TestCppVirtualFunctions.py
  lldb-api :: tools/lldb-vscode/runInTerminal/TestVSCode_runInTerminal.py
  lldb-api :: python_api/frame/inlines/TestInlinedFrame.py
  lldb-api :: lang/cpp/chained-calls/TestCppChainedCalls.py
  lldb-api :: lang/cpp/function_refs/TestFunctionRefs.py
  lldb-api :: commands/frame/diagnose/bad-reference/TestBadReference.py
  lldb-api :: commands/expression/import-std-module/conflicts/TestStdModuleWithConflicts.py
  lldb-api :: commands/expression/pr35310/TestExprsBug35310.py
  lldb-api :: commands/expression/call-function/TestCallUserDefinedFunction.py
  lldb-api :: commands/expression/import-std-module/empty-module/TestEmptyStdModule.py
  lldb-api :: functionalities/conditional_break/TestConditionalBreak.py
  lldb-api :: lang/c/offsetof/TestOffsetof.py
  lldb-api :: commands/expression/multiline-completion/TestMultilineCompletion.py
  lldb-api :: functionalities/data-formatter/dump_dynamic/TestDumpDynamic.py
  lldb-api :: lang/cpp/thread_local/TestThreadLocal.py
  lldb-api :: functionalities/data-formatter/typedef_array/TestTypedefArray.py
  lldb-api :: functionalities/data-formatter/data-formatter-stl/libcxx/list/TestDataFormatterLibcxxList.py
  lldb-api :: lang/objc/objc-ivar-protocols/TestIvarProtocols.py
  lldb-api :: commands/expression/completion-crash-incomplete-record/TestCompletionCrashIncompleteRecord.py
  lldb-api :: functionalities/load_unload/TestLoadUnload.py
  lldb-api :: commands/expression/entry-bp/TestExprEntryBP.py
  lldb-api :: functionalities/data-formatter/data-formatter-stl/libcxx/string/TestDataFormatterLibcxxString.py
  lldb-api :: commands/process/launch/TestProcessLaunch.py
  lldb-api :: commands/frame/var/TestFrameVar.py
  lldb-api :: lang/cpp/dynamic-value-same-basename/TestDynamicValueSameBase.py
  lldb-api :: functionalities/data-formatter/data-formatter-caching/TestDataFormatterCaching.py
  lldb-api :: functionalities/thread/concurrent_events/TestConcurrentDelayedCrashWithBreakpointSignal.py
  lldb-api :: functionalities/recursion/TestValueObjectRecursion.py
  lldb-api :: macosx/find-dsym/bundle-with-dot-in-filename/TestBundleWithDotInFilename.py
  lldb-api :: functionalities/data-formatter/data-formatter-stl/libcxx/bitset/TestDataFormatterLibcxxBitset.py
  lldb-api :: lang/c/unicode/TestUnicodeSymbols.py
  lldb-api :: lang/objc/foundation/TestObjCMethods2.py
  lldb-api :: functionalities/thread/concurrent_events/TestConcurrentTwoBreakpointsOneSignal.py
  lldb-api :: lang/objc/unicode-string/TestUnicodeString.py
  lldb-api :: functionalities/thread/create_after_attach/TestCreateAfterAttach.py
  lldb-api :: commands/disassemble/basic/TestFrameDisassemble.py
  lldb-api :: lang/cpp/this/TestCPPThis.py
  lldb-api :: functionalities/thread/concurrent_events/TestConcurrentDelaySignalBreak.py
  lldb-api :: commands/expression/save_jit_objects/TestSaveJITObjects.py
  lldb-api :: functionalities/breakpoint/breakpoint_set_restart/TestBreakpointSetRestart.py
  lldb-api :: lang/objc/orderedset/TestOrderedSet.py
  lldb-api :: lang/cpp/lambdas/TestLambdas.py
  lldb-api :: commands/expression/call-function/TestCallStopAndContinue.py
  lldb-api :: functionalities/breakpoint/inlined_breakpoints/TestInlinedBreakpoints.py
  lldb-api :: commands/expression/import-std-module/vector/TestVectorFromStdModule.py
  lldb-api :: lang/objc/print-obj/TestPrintObj.py
  lldb-api :: python_api/function_symbol/TestDisasmAPI.py
  lldb-api :: lang/cpp/operators/TestCppOperators.py
  lldb-api :: functionalities/data-formatter/data-formatter-smart-array/TestDataFormatterSmartArray.py
  lldb-api :: functionalities/data-formatter/data-formatter-stl/libcxx/set/TestDataFormatterLibcxxSet.py
  lldb-api :: python_api/formatters/TestFormattersSBAPI.py
  lldb-api :: lang/cpp/char8_t/TestCxxChar8_t.py
  lldb-api :: types/TestCharType.py
  lldb-api :: commands/expression/import-std-module/no-std-module/TestMissingStdModule.py
  lldb-api :: commands/expression/import-std-module/vector-bool/TestVectorBoolFromStdModule.py
  lldb-api :: lang/cpp/namespace/TestNamespace.py
  lldb-api :: functionalities/breakpoint/address_breakpoints/TestBadAddressBreakpoints.py
  lldb-api :: lang/objc/direct-dispatch-step/TestObjCDirectDispatchStepping.py
  lldb-api :: lang/cpp/member-and-local-vars-with-same-name/TestMembersAndLocalsWithSameName.py
  lldb-api :: functionalities/memory-region/TestMemoryRegion.py
  lldb-api :: functionalities/data-formatter/data-formatter-objc/nsstring/TestDataFormatterNSString.py
  lldb-api :: commands/expression/rdar44436068/Test128BitsInteger.py
  lldb-api :: commands/frame/diagnose/array/TestArray.py
  lldb-api :: lang/cpp/static_methods/TestCPPStaticMethods.py
  lldb-api :: functionalities/breakpoint/comp_dir_symlink/TestCompDirSymLink.py
  lldb-api :: lang/objc/self/TestObjCSelf.py
  lldb-api :: lang/c/shared_lib_stripped_symbols/TestSharedLibStrippedSymbols.py
  lldb-api :: lang/cpp/exceptions/TestCPPExceptionBreakpoints.py
  lldb-api :: python_api/sbtype_typeclass/TestSBTypeTypeClass.py
  lldb-api :: lang/objcxx/objcxx-ivar-vector/TestIvarVector.py
  lldb-api :: commands/expression/ir-interpreter/TestIRInterpreter.py
  lldb-api :: functionalities/thread/jump/TestThreadJump.py
  lldb-api :: lang/objc/modules/TestObjCModules.py
  lldb-api :: commands/frame/select/TestFrameSelect.py
  lldb-api :: commands/command/script/TestCommandScript.py
  lldb-api :: functionalities/data-formatter/data-formatter-stl/libstdcpp/unique_ptr/invalid/TestDataFormatterInvalidStdUniquePtr.py
  lldb-api :: functionalities/thread/state_after_expression/TestStateAfterExpression.py
  lldb-api :: commands/expression/import-std-module/forward_list-dbg-info-content/TestDbgInfoContentForwardListFromStdModule.py
  lldb-api :: commands/expression/unicode-in-variable/TestUnicodeInVariable.py
  lldb-api :: functionalities/completion/TestCompletion.py
  lldb-api :: functionalities/plugins/python_os_plugin/TestPythonOSPlugin.py
  lldb-api :: functionalities/data-formatter/data-formatter-disabling/TestDataFormatterDisabling.py
  lldb-api :: functionalities/non-overlapping-index-variable-i/TestIndexVariable.py
  lldb-api :: commands/expression/import-std-module/shared_ptr-dbg-info-content/TestSharedPtrDbgInfoContentFromStdModule.py
  lldb-api :: functionalities/breakpoint/scripted_bkpt/TestScriptedResolver.py
  lldb-api :: types/TestDoubleTypesExpr.py
  lldb-api :: lang/cpp/template/TestTemplateArgs.py
  lldb-api :: types/TestShortType.py
  lldb-api :: lang/c/blocks/TestBlocks.py
  lldb-api :: functionalities/data-formatter/data-formatter-stl/libcxx/variant/TestDataFormatterLibcxxVariant.py
  lldb-api :: lang/c/global_variables/TestGlobalVariables.py
  lldb-api :: lang/objc/foundation/TestRuntimeTypes.py
  lldb-api :: lang/c/stepping/TestThreadStepping.py
  lldb-api :: commands/expression/diagnostics/TestExprDiagnostics.py
  lldb-api :: macosx/add-dsym/TestAddDsymMidExecutionCommand.py
  lldb-api :: tools/lldb-vscode/breakpoint-events/TestVSCode_breakpointEvents.py
  lldb-api :: functionalities/breakpoint/consecutive_breakpoints/TestConsecutiveBreakpoints.py
  lldb-api :: lang/c/strings/TestCStrings.py
  lldb-api :: functionalities/thread/ignore_suspended/TestIgnoreSuspendedThread.py
  lldb-api :: commands/expression/context-object/TestContextObject.py
  lldb-api :: commands/expression/ir-interpreter-phi-nodes/TestIRInterpreterPHINodes.py
  lldb-api :: functionalities/data-formatter/data-formatter-enum-format/TestDataFormatterEnumFormat.py
  lldb-api :: lang/cpp/limit-debug-info/TestWithLimitDebugInfo.py
  lldb-api :: lang/objc/global_ptrs/TestGlobalObjects.py
  lldb-api :: macosx/builtin-debugtrap/TestBuiltinDebugTrap.py
  lldb-api :: lang/cpp/bitfields/TestCppBitfields.py
  lldb-api :: functionalities/data-formatter/data-formatter-stl/libcxx/function/TestLibCxxFunction.py
  lldb-api :: functionalities/data-formatter/data-formatter-proper-plurals/TestFormattersOneIsSingular.py
  lldb-api :: functionalities/data-formatter/data-formatter-stl/libcxx/initializerlist/TestInitializerList.py
  lldb-api :: commands/process/attach/TestProcessAttach.py
  lldb-api :: functionalities/data-formatter/data-formatter-script/TestDataFormatterScript.py
  lldb-api :: python_api/class_members/TestSBTypeClassMembers.py
  lldb-api :: functionalities/breakpoint/breakpoint_command/TestRegexpBreakCommand.py
  lldb-api :: functionalities/thread/backtrace_all/TestBacktraceAll.py


Testing Time: 827.42s
  Unsupported      :  284
  Passed           : 1375
  Expectedly Failed:    9
  Timed Out        :    3
  Failed           :  571
FAILED: tools/lldb/test/CMakeFiles/check-lldb-lit 
cd /Users/buildslave/jenkins/workspace/lldb-cmake-matrix/lldb-build/tools/lldb/test && /usr/local/Frameworks/Python.framework/Versions/3.7/bin/python3.7 /Users/buildslave/jenkins/workspace/lldb-cmake-matrix/lldb-build/./bin/llvm-lit -v --time-tests --shuffle --xunit-xml-output=/Users/buildslave/jenkins/workspace/lldb-cmake-matrix/test/results.xml -v /Users/buildslave/jenkins/workspace/lldb-cmake-matrix/lldb-build/tools/lldb/test
ninja: build stopped: subcommand failed.
Command failed: Command '['/usr/bin/env', 'TERM=vt100', '/usr/local/bin/ninja', '-v', 'check-lldb']' returned non-zero exit status 1.
Command: ['/usr/bin/env', 'TERM=vt100', '/usr/local/bin/ninja', '-v', 'check-lldb']
+ set -e