SuccessConsole Output

Skipping 105,605 KB.. Full Log
f)
  File "/Users/buildslave/jenkins/workspace/lldb-cmake-matrix/llvm-project/lldb/test/API/functionalities/non-overlapping-index-variable-i/TestIndexVariable.py", line 33, in test_eval_index_variable
    loc_exact=True)
  File "/Users/buildslave/jenkins/workspace/lldb-cmake-matrix/llvm-project/lldb/packages/Python/lldbsuite/test/lldbutil.py", line 421, in run_break_set_by_file_and_line
    module_name=module_name)
  File "/Users/buildslave/jenkins/workspace/lldb-cmake-matrix/llvm-project/lldb/packages/Python/lldbsuite/test/lldbutil.py", line 647, in check_breakpoint_result
    out_num_locations))
AssertionError: False is not True : Expecting 1 locations, got 0.
Config=x86_64-/Users/buildslave/jenkins/workspace/lldb-cmake-matrix/lldb-build/bin/clang
======================================================================
FAIL: test_eval_index_variable_dwarf (TestIndexVariable.NonOverlappingIndexVariableCase)
   Test expressions of variable 'i' which appears in two for loops.
----------------------------------------------------------------------
Traceback (most recent call last):
  File "/Users/buildslave/jenkins/workspace/lldb-cmake-matrix/llvm-project/lldb/packages/Python/lldbsuite/test/lldbtest.py", line 1846, in test_method
    return attrvalue(self)
  File "/Users/buildslave/jenkins/workspace/lldb-cmake-matrix/llvm-project/lldb/test/API/functionalities/non-overlapping-index-variable-i/TestIndexVariable.py", line 33, in test_eval_index_variable
    loc_exact=True)
  File "/Users/buildslave/jenkins/workspace/lldb-cmake-matrix/llvm-project/lldb/packages/Python/lldbsuite/test/lldbutil.py", line 421, in run_break_set_by_file_and_line
    module_name=module_name)
  File "/Users/buildslave/jenkins/workspace/lldb-cmake-matrix/llvm-project/lldb/packages/Python/lldbsuite/test/lldbutil.py", line 647, in check_breakpoint_result
    out_num_locations))
AssertionError: False is not True : Expecting 1 locations, got 0.
Config=x86_64-/Users/buildslave/jenkins/workspace/lldb-cmake-matrix/lldb-build/bin/clang
----------------------------------------------------------------------
Ran 4 tests in 0.459s

RESULT: FAILED (0 passes, 2 failures, 0 errors, 2 skipped, 0 expected failures, 0 unexpected successes)

--

********************
FAIL: lldb-api :: functionalities/thread/concurrent_events/TestConcurrentTwoBreakpointsOneDelaySignal.py (2253 of 2261)
******************** TEST 'lldb-api :: functionalities/thread/concurrent_events/TestConcurrentTwoBreakpointsOneDelaySignal.py' FAILED ********************
Script:
--
/usr/local/Frameworks/Python.framework/Versions/3.7/bin/python3.7 /Users/buildslave/jenkins/workspace/lldb-cmake-matrix/llvm-project/lldb/test/API/dotest.py -u CXXFLAGS -u CFLAGS --codesign-identity lldb_codesign --arch x86_64 --build-dir /Users/buildslave/jenkins/workspace/lldb-cmake-matrix/lldb-build/lldb-test-build.noindex -t --env TERM=vt100 --skip-category gmodules --skip-category watchpoint --arch=x86_64 --dwarf-version=5 --env LLVM_LIBS_DIR=/Users/buildslave/jenkins/workspace/lldb-cmake-matrix/lldb-build/./lib --arch x86_64 --build-dir /Users/buildslave/jenkins/workspace/lldb-cmake-matrix/lldb-build/lldb-test-build.noindex --lldb-module-cache-dir /Users/buildslave/jenkins/workspace/lldb-cmake-matrix/lldb-build/lldb-test-build.noindex/module-cache-lldb/lldb-api --clang-module-cache-dir /Users/buildslave/jenkins/workspace/lldb-cmake-matrix/lldb-build/lldb-test-build.noindex/module-cache-clang/lldb-api --executable /Users/buildslave/jenkins/workspace/lldb-cmake-matrix/lldb-build/./bin/lldb --compiler /Users/buildslave/jenkins/workspace/lldb-cmake-matrix/lldb-build/./bin/clang --dsymutil /Users/buildslave/jenkins/workspace/lldb-cmake-matrix/lldb-build/./bin/dsymutil --llvm-tools-dir /Users/buildslave/jenkins/workspace/lldb-cmake-matrix/lldb-build/./bin --lldb-libs-dir /Users/buildslave/jenkins/workspace/lldb-cmake-matrix/lldb-build/./lib /Users/buildslave/jenkins/workspace/lldb-cmake-matrix/llvm-project/lldb/test/API/functionalities/thread/concurrent_events -p TestConcurrentTwoBreakpointsOneDelaySignal.py
--
Exit Code: 1

Command Output (stdout):
--
lldb version 13.0.99 (http://labmaster3.local/git/llvm-project.git revision 532d4814ac8e2594c3a5d93338cd9f6b9b391e47)
  clang revision 532d4814ac8e2594c3a5d93338cd9f6b9b391e47
  llvm revision 532d4814ac8e2594c3a5d93338cd9f6b9b391e47
libstdcxx tests will not be run because: Don't know how to build with libstdcxx on macosx
Skipping following debug info categories: ['dwo']

--
Command Output (stderr):
--
error: a.out Failed to extract range list table at offset 0xc: parsing .debug_rnglists table at offset 0x0: unexpected end of data at offset 0x0 while reading [0x0, 0x4)
Change dir to: /Users/buildslave/jenkins/workspace/lldb-cmake-matrix/llvm-project/lldb/test/API/functionalities/thread/concurrent_events
runCmd: settings clear -all
output: 

runCmd: settings set symbols.enable-external-lookup false
output: 

runCmd: settings set target.inherit-tcc true
output: 

runCmd: settings set target.detach-on-error false
output: 

runCmd: settings set target.auto-apply-fixits false
output: 

runCmd: settings set plugin.process.gdb-remote.packet-timeout 60
output: 

runCmd: settings set symbols.clang-modules-cache-path "/Users/buildslave/jenkins/workspace/lldb-cmake-matrix/lldb-build/lldb-test-build.noindex/module-cache-lldb/lldb-api"
output: 

runCmd: settings set use-color false
output: 

runCmd: setting set target.prefer-dynamic-value no-dynamic-values
output: 

runCmd: file /Users/buildslave/jenkins/workspace/lldb-cmake-matrix/lldb-build/lldb-test-build.noindex/functionalities/thread/concurrent_events/TestConcurrentTwoBreakpointsOneDelaySignal.test/a.out
output: Current executable set to '/Users/buildslave/jenkins/workspace/lldb-cmake-matrix/lldb-build/lldb-test-build.noindex/functionalities/thread/concurrent_events/TestConcurrentTwoBreakpointsOneDelaySignal.test/a.out' (x86_64).


runCmd: breakpoint set -f "main.cpp" -l 130
output: Breakpoint 1: no locations (pending).
WARNING:  Unable to resolve breakpoint to any actual locations.


Expecting pattern: ^Breakpoint (?P<bpno>[0-9]+): (?P<num_locations>[0-9]+) locations\.$
Not matched

Expecting pattern: ^Breakpoint (?P<bpno>[0-9]+): (?P<num_locations>no) locations \(pending\)\.
Matched

FAIL: LLDB (/Users/buildslave/jenkins/workspace/lldb-cmake-matrix/lldb-build/bin/clang-x86_64) :: test (TestConcurrentTwoBreakpointsOneDelaySignal.ConcurrentTwoBreakpointsOneDelaySignal)
Restore dir to: /Users/buildslave/jenkins/workspace/lldb-cmake-matrix/lldb-build/tools/lldb/test
======================================================================
FAIL: test (TestConcurrentTwoBreakpointsOneDelaySignal.ConcurrentTwoBreakpointsOneDelaySignal)
   Test two threads that trigger a breakpoint and one (1 second delay) signal thread.
----------------------------------------------------------------------
Traceback (most recent call last):
  File "/Users/buildslave/jenkins/workspace/lldb-cmake-matrix/llvm-project/lldb/packages/Python/lldbsuite/test/decorators.py", line 149, in wrapper
    return func(*args, **kwargs)
  File "/Users/buildslave/jenkins/workspace/lldb-cmake-matrix/llvm-project/lldb/packages/Python/lldbsuite/test/decorators.py", line 451, in wrapper
    func(*args, **kwargs)
  File "/Users/buildslave/jenkins/workspace/lldb-cmake-matrix/llvm-project/lldb/test/API/functionalities/thread/concurrent_events/TestConcurrentTwoBreakpointsOneDelaySignal.py", line 22, in test
    num_delay_signal_threads=1)
  File "/Users/buildslave/jenkins/workspace/lldb-cmake-matrix/llvm-project/lldb/packages/Python/lldbsuite/test/concurrent_base.py", line 123, in do_thread_actions
    self.setup_breakpoint_line, expected_bps)
  File "/Users/buildslave/jenkins/workspace/lldb-cmake-matrix/llvm-project/lldb/packages/Python/lldbsuite/test/concurrent_base.py", line 75, in add_breakpoint
    self, self.filename, line, num_expected_locations=-1)
  File "/Users/buildslave/jenkins/workspace/lldb-cmake-matrix/llvm-project/lldb/packages/Python/lldbsuite/test/lldbutil.py", line 426, in run_break_set_by_file_and_line
    num_locations=num_expected_locations)
  File "/Users/buildslave/jenkins/workspace/lldb-cmake-matrix/llvm-project/lldb/packages/Python/lldbsuite/test/lldbutil.py", line 641, in check_breakpoint_result
    "Expecting one or more locations, got none.")
AssertionError: False is not True : Expecting one or more locations, got none.
Config=x86_64-/Users/buildslave/jenkins/workspace/lldb-cmake-matrix/lldb-build/bin/clang
----------------------------------------------------------------------
Ran 1 test in 1.133s

RESULT: FAILED (0 passes, 1 failures, 0 errors, 0 skipped, 0 expected failures, 0 unexpected successes)

--

********************
PASS: lldb-api :: tools/lldb-server/TestAppleSimulatorOSType.py (2254 of 2261)
PASS: lldb-shell :: Reproducer/Functionalities/TestExpressionEvaluation.test (2255 of 2261)
FAIL: lldb-api :: python_api/objc_type/TestObjCType.py (2256 of 2261)
******************** TEST 'lldb-api :: python_api/objc_type/TestObjCType.py' FAILED ********************
Script:
--
/usr/local/Frameworks/Python.framework/Versions/3.7/bin/python3.7 /Users/buildslave/jenkins/workspace/lldb-cmake-matrix/llvm-project/lldb/test/API/dotest.py -u CXXFLAGS -u CFLAGS --codesign-identity lldb_codesign --arch x86_64 --build-dir /Users/buildslave/jenkins/workspace/lldb-cmake-matrix/lldb-build/lldb-test-build.noindex -t --env TERM=vt100 --skip-category gmodules --skip-category watchpoint --arch=x86_64 --dwarf-version=5 --env LLVM_LIBS_DIR=/Users/buildslave/jenkins/workspace/lldb-cmake-matrix/lldb-build/./lib --arch x86_64 --build-dir /Users/buildslave/jenkins/workspace/lldb-cmake-matrix/lldb-build/lldb-test-build.noindex --lldb-module-cache-dir /Users/buildslave/jenkins/workspace/lldb-cmake-matrix/lldb-build/lldb-test-build.noindex/module-cache-lldb/lldb-api --clang-module-cache-dir /Users/buildslave/jenkins/workspace/lldb-cmake-matrix/lldb-build/lldb-test-build.noindex/module-cache-clang/lldb-api --executable /Users/buildslave/jenkins/workspace/lldb-cmake-matrix/lldb-build/./bin/lldb --compiler /Users/buildslave/jenkins/workspace/lldb-cmake-matrix/lldb-build/./bin/clang --dsymutil /Users/buildslave/jenkins/workspace/lldb-cmake-matrix/lldb-build/./bin/dsymutil --llvm-tools-dir /Users/buildslave/jenkins/workspace/lldb-cmake-matrix/lldb-build/./bin --lldb-libs-dir /Users/buildslave/jenkins/workspace/lldb-cmake-matrix/lldb-build/./lib /Users/buildslave/jenkins/workspace/lldb-cmake-matrix/llvm-project/lldb/test/API/python_api/objc_type -p TestObjCType.py
--
Exit Code: 1

Command Output (stdout):
--
lldb version 13.0.99 (http://labmaster3.local/git/llvm-project.git revision 532d4814ac8e2594c3a5d93338cd9f6b9b391e47)
  clang revision 532d4814ac8e2594c3a5d93338cd9f6b9b391e47
  llvm revision 532d4814ac8e2594c3a5d93338cd9f6b9b391e47
libstdcxx tests will not be run because: Don't know how to build with libstdcxx on macosx
Skipping following debug info categories: ['dwo']

--
Command Output (stderr):
--
Change dir to: /Users/buildslave/jenkins/workspace/lldb-cmake-matrix/llvm-project/lldb/test/API/python_api/objc_type
runCmd: settings clear -all
output: 

runCmd: settings set symbols.enable-external-lookup false
output: 

runCmd: settings set target.inherit-tcc true
output: 

runCmd: settings set target.detach-on-error false
output: 

runCmd: settings set target.auto-apply-fixits false
output: 

runCmd: settings set plugin.process.gdb-remote.packet-timeout 60
output: 

runCmd: settings set symbols.clang-modules-cache-path "/Users/buildslave/jenkins/workspace/lldb-cmake-matrix/lldb-build/lldb-test-build.noindex/module-cache-lldb/lldb-api"
output: 

runCmd: settings set use-color false
output: 

runCmd: setting set target.prefer-dynamic-value no-dynamic-values
output: 

FAIL: LLDB (/Users/buildslave/jenkins/workspace/lldb-cmake-matrix/lldb-build/bin/clang-x86_64) :: test_dsym (TestObjCType.ObjCSBTypeTestCase)
<bound method SBProcess.Kill of <lldb.SBProcess; proxy of <Swig Object of type 'lldb::SBProcess *' at 0x10b95e1b0> >>: success

runCmd: settings clear -all
output: 

runCmd: settings set symbols.enable-external-lookup false
output: 

runCmd: settings set target.inherit-tcc true
output: 

runCmd: settings set target.detach-on-error false
output: 

runCmd: settings set target.auto-apply-fixits false
output: 

runCmd: settings set plugin.process.gdb-remote.packet-timeout 60
output: 

runCmd: settings set symbols.clang-modules-cache-path "/Users/buildslave/jenkins/workspace/lldb-cmake-matrix/lldb-build/lldb-test-build.noindex/module-cache-lldb/lldb-api"
output: 

runCmd: settings set use-color false
output: 

runCmd: setting set target.prefer-dynamic-value no-dynamic-values
output: 

FAIL: LLDB (/Users/buildslave/jenkins/workspace/lldb-cmake-matrix/lldb-build/bin/clang-x86_64) :: test_dwarf (TestObjCType.ObjCSBTypeTestCase)
<bound method SBProcess.Kill of <lldb.SBProcess; proxy of <Swig Object of type 'lldb::SBProcess *' at 0x10680bc60> >>: success

UNSUPPORTED: LLDB (/Users/buildslave/jenkins/workspace/lldb-cmake-matrix/lldb-build/bin/clang-x86_64) :: test_dwo (TestObjCType.ObjCSBTypeTestCase) (test case does not fall in any category of interest for this run) 
UNSUPPORTED: LLDB (/Users/buildslave/jenkins/workspace/lldb-cmake-matrix/lldb-build/bin/clang-x86_64) :: test_gmodules (TestObjCType.ObjCSBTypeTestCase) (test case does not fall in any category of interest for this run) 
Restore dir to: /Users/buildslave/jenkins/workspace/lldb-cmake-matrix/lldb-build/tools/lldb/test
======================================================================
ERROR: test_dsym (TestObjCType.ObjCSBTypeTestCase)
   Test SBType for ObjC classes.
----------------------------------------------------------------------
Traceback (most recent call last):
  File "/Users/buildslave/jenkins/workspace/lldb-cmake-matrix/llvm-project/lldb/packages/Python/lldbsuite/test/lldbtest.py", line 1846, in test_method
    return attrvalue(self)
  File "/Users/buildslave/jenkins/workspace/lldb-cmake-matrix/llvm-project/lldb/test/API/python_api/objc_type/TestObjCType.py", line 46, in test
    thread.IsValid(),
AttributeError: 'NoneType' object has no attribute 'IsValid'
Config=x86_64-/Users/buildslave/jenkins/workspace/lldb-cmake-matrix/lldb-build/bin/clang
======================================================================
ERROR: test_dwarf (TestObjCType.ObjCSBTypeTestCase)
   Test SBType for ObjC classes.
----------------------------------------------------------------------
Traceback (most recent call last):
  File "/Users/buildslave/jenkins/workspace/lldb-cmake-matrix/llvm-project/lldb/packages/Python/lldbsuite/test/lldbtest.py", line 1846, in test_method
    return attrvalue(self)
  File "/Users/buildslave/jenkins/workspace/lldb-cmake-matrix/llvm-project/lldb/test/API/python_api/objc_type/TestObjCType.py", line 46, in test
    thread.IsValid(),
AttributeError: 'NoneType' object has no attribute 'IsValid'
Config=x86_64-/Users/buildslave/jenkins/workspace/lldb-cmake-matrix/lldb-build/bin/clang
----------------------------------------------------------------------
Ran 4 tests in 4.175s

RESULT: FAILED (0 passes, 0 failures, 2 errors, 2 skipped, 0 expected failures, 0 unexpected successes)

--

********************
FAIL: lldb-api :: functionalities/load_unload/TestLoadUnload.py (2257 of 2261)
******************** TEST 'lldb-api :: functionalities/load_unload/TestLoadUnload.py' FAILED ********************
Script:
--
/usr/local/Frameworks/Python.framework/Versions/3.7/bin/python3.7 /Users/buildslave/jenkins/workspace/lldb-cmake-matrix/llvm-project/lldb/test/API/dotest.py -u CXXFLAGS -u CFLAGS --codesign-identity lldb_codesign --arch x86_64 --build-dir /Users/buildslave/jenkins/workspace/lldb-cmake-matrix/lldb-build/lldb-test-build.noindex -t --env TERM=vt100 --skip-category gmodules --skip-category watchpoint --arch=x86_64 --dwarf-version=5 --env LLVM_LIBS_DIR=/Users/buildslave/jenkins/workspace/lldb-cmake-matrix/lldb-build/./lib --arch x86_64 --build-dir /Users/buildslave/jenkins/workspace/lldb-cmake-matrix/lldb-build/lldb-test-build.noindex --lldb-module-cache-dir /Users/buildslave/jenkins/workspace/lldb-cmake-matrix/lldb-build/lldb-test-build.noindex/module-cache-lldb/lldb-api --clang-module-cache-dir /Users/buildslave/jenkins/workspace/lldb-cmake-matrix/lldb-build/lldb-test-build.noindex/module-cache-clang/lldb-api --executable /Users/buildslave/jenkins/workspace/lldb-cmake-matrix/lldb-build/./bin/lldb --compiler /Users/buildslave/jenkins/workspace/lldb-cmake-matrix/lldb-build/./bin/clang --dsymutil /Users/buildslave/jenkins/workspace/lldb-cmake-matrix/lldb-build/./bin/dsymutil --llvm-tools-dir /Users/buildslave/jenkins/workspace/lldb-cmake-matrix/lldb-build/./bin --lldb-libs-dir /Users/buildslave/jenkins/workspace/lldb-cmake-matrix/lldb-build/./lib /Users/buildslave/jenkins/workspace/lldb-cmake-matrix/llvm-project/lldb/test/API/functionalities/load_unload -p TestLoadUnload.py
--
Exit Code: 1

Command Output (stdout):
--
lldb version 13.0.99 (http://labmaster3.local/git/llvm-project.git revision 532d4814ac8e2594c3a5d93338cd9f6b9b391e47)
  clang revision 532d4814ac8e2594c3a5d93338cd9f6b9b391e47
  llvm revision 532d4814ac8e2594c3a5d93338cd9f6b9b391e47
libstdcxx tests will not be run because: Don't know how to build with libstdcxx on macosx
Skipping following debug info categories: ['dwo']
Set environment to:  settings replace target.env-vars DYLD_LIBRARY_PATH=/Users/buildslave/jenkins/workspace/lldb-cmake-matrix/lldb-build/lldb-test-build.noindex/functionalities/load_unload/TestLoadUnload.test_modules_search_paths/hidden

--
Command Output (stderr):
--
error: libloadunload_d.dylib Failed to extract range list table at offset 0xc: parsing .debug_rnglists table at offset 0x0: unexpected end of data at offset 0x0 while reading [0x0, 0x4)
error: libloadunload_d.dylib Failed to extract range list table at offset 0xc: parsing .debug_rnglists table at offset 0x0: unexpected end of data at offset 0x0 while reading [0x0, 0x4)
error: libloadunload_d.dylib Failed to extract range list table at offset 0xc: parsing .debug_rnglists table at offset 0x0: unexpected end of data at offset 0x0 while reading [0x0, 0x4)
error: libloadunload_a.dylib Failed to extract range list table at offset 0xc: parsing .debug_rnglists table at offset 0x0: unexpected end of data at offset 0x0 while reading [0x0, 0x4)
Change dir to: /Users/buildslave/jenkins/workspace/lldb-cmake-matrix/llvm-project/lldb/test/API/functionalities/load_unload
runCmd: settings clear -all
output: 

runCmd: settings set symbols.enable-external-lookup false
output: 

runCmd: settings set target.inherit-tcc true
output: 

runCmd: settings set target.detach-on-error false
output: 

runCmd: settings set target.auto-apply-fixits false
output: 

runCmd: settings set plugin.process.gdb-remote.packet-timeout 60
output: 

runCmd: settings set symbols.clang-modules-cache-path "/Users/buildslave/jenkins/workspace/lldb-cmake-matrix/lldb-build/lldb-test-build.noindex/module-cache-lldb/lldb-api"
output: 

runCmd: settings set use-color false
output: 

runCmd: setting set target.prefer-dynamic-value no-dynamic-values
output: 

runCmd: settings append target.env-vars 'DYLD_LIBRARY_PATH=/Users/buildslave/jenkins/workspace/lldb-cmake-matrix/lldb-build/lldb-test-build.noindex/functionalities/load_unload/TestLoadUnload.test_dyld_library_path'
output: 

runCmd: file /Users/buildslave/jenkins/workspace/lldb-cmake-matrix/lldb-build/lldb-test-build.noindex/functionalities/load_unload/TestLoadUnload.test_dyld_library_path/a.out
output: Current executable set to '/Users/buildslave/jenkins/workspace/lldb-cmake-matrix/lldb-build/lldb-test-build.noindex/functionalities/load_unload/TestLoadUnload.test_dyld_library_path/a.out' (x86_64).


runCmd: target modules list
output: [  0] 598AABAE-C516-33ED-8EEF-2A461E6C458B 0x0000000100000000 /Users/buildslave/jenkins/workspace/lldb-cmake-matrix/lldb-build/lldb-test-build.noindex/functionalities/load_unload/TestLoadUnload.test_dyld_library_path/a.out 
      /Users/buildslave/jenkins/workspace/lldb-cmake-matrix/lldb-build/lldb-test-build.noindex/functionalities/load_unload/TestLoadUnload.test_dyld_library_path/a.out.dSYM/Contents/Resources/DWARF/a.out
[  1] E4698FBD-806A-3396-B279-E685BA37430B 0x0000000000000000 /usr/lib/dyld 
[  2] B6FDA8A9-3D2B-3BD5-B5B0-57D311C0FF3D 0x00007fff641cb000 /usr/lib/libSystem.B.dylib 
[  3] AD0805FE-F98B-3E2F-B072-83782B22DAC9 0x00007fff64547000 /usr/lib/libc++.1.dylib 
[  4] 18EA5EE0-5B22-315B-9444-461E12765DE6 0x0000000000000000 /Users/buildslave/jenkins/workspace/lldb-cmake-matrix/lldb-build/lldb-test-build.noindex/functionalities/load_unload/TestLoadUnload.test_dyld_library_path/libloadunload_d.dylib 
      /Users/buildslave/jenkins/workspace/lldb-cmake-matrix/lldb-build/lldb-test-build.noindex/functionalities/load_unload/TestLoadUnload.test_dyld_library_path/libloadunload_d.dylib.dSYM/Contents/Resources/DWARF/libloadunload_d.dylib
[  5] A5ECC751-A681-30D8-B33C-D192C15D25C8 0x00007fff67055000 /usr/lib/system/libcache.dylib 
[  6] C321A74A-AA91-3785-BEBF-BEDC6975026C 0x00007fff6705b000 /usr/lib/system/libcommonCrypto.dylib 
[  7] 652A6012-7E5C-3F4F-9438-86BC094526F3 0x00007fff67067000 /usr/lib/system/libcompiler_rt.dylib 
[  8] 40113A69-A81C-3397-ADC6-1D16B9A22C3E 0x00007fff6706f000 /usr/lib/system/libcopyfile.dylib 
[  9] 5E4B0E50-24DD-3E04-9374-EDA9FFD6257B 0x00007fff67079000 /usr/lib/system/libcorecrypto.dylib 
[ 10] 201EDBF3-0B36-31BA-A7CB-443CE35C05D4 0x00007fff67218000 /usr/lib/system/libdispatch.dylib 
[ 11] 7E711A46-5E4D-393C-AEA6-440E2A5CCD0C 0x00007fff67259000 /usr/lib/system/libdyld.dylib 
[ 12] 52662CAA-DB1F-30A3-BE13-D6274B1A6D7B 0x00007fff67290000 /usr/lib/system/libkeymgr.dylib 
[ 13] 07CF647B-F9DC-3907-AD98-2F85FCB34A72 0x00007fff6729e000 /usr/lib/system/liblaunch.dylib 
[ 14] D91DFF00-E22F-3796-8A1C-4C1F5F8FA03C 0x00007fff6729f000 /usr/lib/system/libmacho.dylib 
[ 15] D3B7D02C-7646-3FB4-8529-B36DCC2419EA 0x00007fff672a5000 /usr/lib/system/libquarantine.dylib 
[ 16] B5E88D9B-C2BE-3496-BBB2-C996317E18A3 0x00007fff672a8000 /usr/lib/system/libremovefile.dylib 
[ 17] 1170348D-2491-33F1-AA79-E2A05B4A287C 0x00007fff672aa000 /usr/lib/system/libsystem_asl.dylib 
[ 18] 7AFBCAA6-81BE-36C3-8DB0-AAE0A4ACE4C5 0x00007fff672c2000 /usr/lib/system/libsystem_blocks.dylib 
[ 19] 935DDCE9-4ED0-3F79-A05A-A123DDE399CC 0x00007fff672c3000 /usr/lib/system/libsystem_c.dylib 
[ 20] EA9BC2B1-5001-3463-9FAF-39FF61CAC87C 0x00007fff6734b000 /usr/lib/system/libsystem_configuration.dylib 
[ 21] 3D0A3AA8-8415-37B2-AAE3-66C03BCE8B55 0x00007fff6734f000 /usr/lib/system/libsystem_coreservices.dylib 
[ 22] 6EEC9975-EE3B-3C95-AA5B-030FD10587BC 0x00007fff67353000 /usr/lib/system/libsystem_darwin.dylib 
[ 23] 0115092A-E61B-317D-8670-41C7C34B1A82 0x00007fff6735c000 /usr/lib/system/libsystem_dnssd.dylib 
[ 24] AFDB5095-0472-34AC-BA7E-497921BF030A 0x00007fff67364000 /usr/lib/system/libsystem_featureflags.dylib 
[ 25] 851693E9-C079-3547-AD41-353F8C248BE8 0x00007fff67366000 /usr/lib/system/libsystem_info.dylib 
[ 26] 1E6FACE8-8EB2-3478-A77D-220617855B30 0x00007fff673e1000 /usr/lib/system/libsystem_m.dylib 
[ 27] D4BA7DF2-57AC-33B0-B948-A688EE43C799 0x00007fff6742d000 /usr/lib/system/libsystem_malloc.dylib 
[ 28] 6DE86DB0-8CD2-361E-BD6A-A34282B47847 0x00007fff67455000 /usr/lib/system/libsystem_networkextension.dylib 
[ 29] 7E9E2FC8-DF26-340C-B196-B81B11850C46 0x00007fff67463000 /usr/lib/system/libsystem_notify.dylib 
[ 30] 20C93D69-6452-3C82-9521-8AE54345C66F 0x00007fff67481000 /usr/lib/system/libsystem_sandbox.dylib 
[ 31] E851113D-D5B1-3FB0-9D29-9C7647A71961 0x00007fff67486000 /usr/lib/system/libsystem_secinit.dylib 
[ 32] 9F9902C9-A46F-3CA9-B7F9-5CCFE98FBF75 0x00007fff673b4000 /usr/lib/system/libsystem_kernel.dylib 
[ 33] 736920EA-6AE0-3B1B-BBDA-7DCDF0C229DF 0x00007fff6746d000 /usr/lib/system/libsystem_platform.dylib 
[ 34] 77488669-19A3-3993-AD65-CA5377E2475A 0x00007fff67476000 /usr/lib/system/libsystem_pthread.dylib 
[ 35] 25C3866B-004E-3621-9CD3-B1E9C4D887EB 0x00007fff67489000 /usr/lib/system/libsystem_symptoms.dylib 
[ 36] A1ED1D3A-5FAD-3559-A1D6-1BE4E1C5756A 0x00007fff67491000 /usr/lib/system/libsystem_trace.dylib 
[ 37] 253A12E2-F88F-3838-A666-C5306F833CB8 0x00007fff674a9000 /usr/lib/system/libunwind.dylib 
[ 38] 68D433B6-DCFF-385D-8620-F847FB7D4A5A 0x00007fff674af000 /usr/lib/system/libxpc.dylib 
[ 39] 771E9263-E832-3985-9477-8F1B2D73B771 0x00007fff6459a000 /usr/lib/libc++abi.dylib 
[ 40] 720155DE-4837-3A43-A8AD-C00C8659FDF5 0x00007fff660c2000 /usr/lib/libobjc.A.dylib 


Ran command:
"target modules list"

Got output:
[  0] 598AABAE-C516-33ED-8EEF-2A461E6C458B 0x0000000100000000 /Users/buildslave/jenkins/workspace/lldb-cmake-matrix/lldb-build/lldb-test-build.noindex/functionalities/load_unload/TestLoadUnload.test_dyld_library_path/a.out 
      /Users/buildslave/jenkins/workspace/lldb-cmake-matrix/lldb-build/lldb-test-build.noindex/functionalities/load_unload/TestLoadUnload.test_dyld_library_path/a.out.dSYM/Contents/Resources/DWARF/a.out
[  1] E4698FBD-806A-3396-B279-E685BA37430B 0x0000000000000000 /usr/lib/dyld 
[  2] B6FDA8A9-3D2B-3BD5-B5B0-57D311C0FF3D 0x00007fff641cb000 /usr/lib/libSystem.B.dylib 
[  3] AD0805FE-F98B-3E2F-B072-83782B22DAC9 0x00007fff64547000 /usr/lib/libc++.1.dylib 
[  4] 18EA5EE0-5B22-315B-9444-461E12765DE6 0x0000000000000000 /Users/buildslave/jenkins/workspace/lldb-cmake-matrix/lldb-build/lldb-test-build.noindex/functionalities/load_unload/TestLoadUnload.test_dyld_library_path/libloadunload_d.dylib 
      /Users/buildslave/jenkins/workspace/lldb-cmake-matrix/lldb-build/lldb-test-build.noindex/functionalities/load_unload/TestLoadUnload.test_dyld_library_path/libloadunload_d.dylib.dSYM/Contents/Resources/DWARF/libloadunload_d.dylib
[  5] A5ECC751-A681-30D8-B33C-D192C15D25C8 0x00007fff67055000 /usr/lib/system/libcache.dylib 
[  6] C321A74A-AA91-3785-BEBF-BEDC6975026C 0x00007fff6705b000 /usr/lib/system/libcommonCrypto.dylib 
[  7] 652A6012-7E5C-3F4F-9438-86BC094526F3 0x00007fff67067000 /usr/lib/system/libcompiler_rt.dylib 
[  8] 40113A69-A81C-3397-ADC6-1D16B9A22C3E 0x00007fff6706f000 /usr/lib/system/libcopyfile.dylib 
[  9] 5E4B0E50-24DD-3E04-9374-EDA9FFD6257B 0x00007fff67079000 /usr/lib/system/libcorecrypto.dylib 
[ 10] 201EDBF3-0B36-31BA-A7CB-443CE35C05D4 0x00007fff67218000 /usr/lib/system/libdispatch.dylib 
[ 11] 7E711A46-5E4D-393C-AEA6-440E2A5CCD0C 0x00007fff67259000 /usr/lib/system/libdyld.dylib 
[ 12] 52662CAA-DB1F-30A3-BE13-D6274B1A6D7B 0x00007fff67290000 /usr/lib/system/libkeymgr.dylib 
[ 13] 07CF647B-F9DC-3907-AD98-2F85FCB34A72 0x00007fff6729e000 /usr/lib/system/liblaunch.dylib 
[ 14] D91DFF00-E22F-3796-8A1C-4C1F5F8FA03C 0x00007fff6729f000 /usr/lib/system/libmacho.dylib 
[ 15] D3B7D02C-7646-3FB4-8529-B36DCC2419EA 0x00007fff672a5000 /usr/lib/system/libquarantine.dylib 
[ 16] B5E88D9B-C2BE-3496-BBB2-C996317E18A3 0x00007fff672a8000 /usr/lib/system/libremovefile.dylib 
[ 17] 1170348D-2491-33F1-AA79-E2A05B4A287C 0x00007fff672aa000 /usr/lib/system/libsystem_asl.dylib 
[ 18] 7AFBCAA6-81BE-36C3-8DB0-AAE0A4ACE4C5 0x00007fff672c2000 /usr/lib/system/libsystem_blocks.dylib 
[ 19] 935DDCE9-4ED0-3F79-A05A-A123DDE399CC 0x00007fff672c3000 /usr/lib/system/libsystem_c.dylib 
[ 20] EA9BC2B1-5001-3463-9FAF-39FF61CAC87C 0x00007fff6734b000 /usr/lib/system/libsystem_configuration.dylib 
[ 21] 3D0A3AA8-8415-37B2-AAE3-66C03BCE8B55 0x00007fff6734f000 /usr/lib/system/libsystem_coreservices.dylib 
[ 22] 6EEC9975-EE3B-3C95-AA5B-030FD10587BC 0x00007fff67353000 /usr/lib/system/libsystem_darwin.dylib 
[ 23] 0115092A-E61B-317D-8670-41C7C34B1A82 0x00007fff6735c000 /usr/lib/system/libsystem_dnssd.dylib 
[ 24] AFDB5095-0472-34AC-BA7E-497921BF030A 0x00007fff67364000 /usr/lib/system/libsystem_featureflags.dylib 
[ 25] 851693E9-C079-3547-AD41-353F8C248BE8 0x00007fff67366000 /usr/lib/system/libsystem_info.dylib 
[ 26] 1E6FACE8-8EB2-3478-A77D-220617855B30 0x00007fff673e1000 /usr/lib/system/libsystem_m.dylib 
[ 27] D4BA7DF2-57AC-33B0-B948-A688EE43C799 0x00007fff6742d000 /usr/lib/system/libsystem_malloc.dylib 
[ 28] 6DE86DB0-8CD2-361E-BD6A-A34282B47847 0x00007fff67455000 /usr/lib/system/libsystem_networkextension.dylib 
[ 29] 7E9E2FC8-DF26-340C-B196-B81B11850C46 0x00007fff67463000 /usr/lib/system/libsystem_notify.dylib 
[ 30] 20C93D69-6452-3C82-9521-8AE54345C66F 0x00007fff67481000 /usr/lib/system/libsystem_sandbox.dylib 
[ 31] E851113D-D5B1-3FB0-9D29-9C7647A71961 0x00007fff67486000 /usr/lib/system/libsystem_secinit.dylib 
[ 32] 9F9902C9-A46F-3CA9-B7F9-5CCFE98FBF75 0x00007fff673b4000 /usr/lib/system/libsystem_kernel.dylib 
[ 33] 736920EA-6AE0-3B1B-BBDA-7DCDF0C229DF 0x00007fff6746d000 /usr/lib/system/libsystem_platform.dylib 
[ 34] 77488669-19A3-3993-AD65-CA5377E2475A 0x00007fff67476000 /usr/lib/system/libsystem_pthread.dylib 
[ 35] 25C3866B-004E-3621-9CD3-B1E9C4D887EB 0x00007fff67489000 /usr/lib/system/libsystem_symptoms.dylib 
[ 36] A1ED1D3A-5FAD-3559-A1D6-1BE4E1C5756A 0x00007fff67491000 /usr/lib/system/libsystem_trace.dylib 
[ 37] 253A12E2-F88F-3838-A666-C5306F833CB8 0x00007fff674a9000 /usr/lib/system/libunwind.dylib 
[ 38] 68D433B6-DCFF-385D-8620-F847FB7D4A5A 0x00007fff674af000 /usr/lib/system/libxpc.dylib 
[ 39] 771E9263-E832-3985-9477-8F1B2D73B771 0x00007fff6459a000 /usr/lib/libc++abi.dylib 
[ 40] 720155DE-4837-3A43-A8AD-C00C8659FDF5 0x00007fff660c2000 /usr/lib/libobjc.A.dylib 

Expecting sub string: "libloadunload_d.dylib" (was found)
error: libloadunload_a.dylib Failed to extract range list table at offset 0xc: parsing .debug_rnglists table at offset 0x0: unexpected end of data at offset 0x0 while reading [0x0, 0x4)

runCmd: breakpoint set -f "d.cpp" -l 9
output: Breakpoint 1: no locations (pending).
WARNING:  Unable to resolve breakpoint to any actual locations.


Expecting pattern: ^Breakpoint (?P<bpno>[0-9]+): (?P<num_locations>[0-9]+) locations\.$
Not matched

Expecting pattern: ^Breakpoint (?P<bpno>[0-9]+): (?P<num_locations>no) locations \(pending\)\.
Matched

FAIL: LLDB (/Users/buildslave/jenkins/workspace/lldb-cmake-matrix/lldb-build/bin/clang-x86_64) :: test_dyld_library_path (TestLoadUnload.LoadUnloadTestCase)
runCmd: settings clear -all
output: 

runCmd: settings set symbols.enable-external-lookup false
output: 

runCmd: settings set target.inherit-tcc true
output: 

runCmd: settings set target.detach-on-error false
output: 

runCmd: settings set target.auto-apply-fixits false
output: 

runCmd: settings set plugin.process.gdb-remote.packet-timeout 60
output: 

runCmd: settings set symbols.clang-modules-cache-path "/Users/buildslave/jenkins/workspace/lldb-cmake-matrix/lldb-build/lldb-test-build.noindex/module-cache-lldb/lldb-api"
output: 

runCmd: settings set use-color false
output: 

runCmd: setting set target.prefer-dynamic-value no-dynamic-values
output: 

runCmd: settings append target.env-vars 'DYLD_LIBRARY_PATH=/Users/buildslave/jenkins/workspace/lldb-cmake-matrix/lldb-build/lldb-test-build.noindex/functionalities/load_unload/TestLoadUnload.test_lldb_process_load_and_unload_commands'
output: 

runCmd: settings set plugin.process.gdb-remote.use-libraries-svr4 false
output: 

runCmd: file /Users/buildslave/jenkins/workspace/lldb-cmake-matrix/lldb-build/lldb-test-build.noindex/functionalities/load_unload/TestLoadUnload.test_lldb_process_load_and_unload_commands/a.out
output: Current executable set to '/Users/buildslave/jenkins/workspace/lldb-cmake-matrix/lldb-build/lldb-test-build.noindex/functionalities/load_unload/TestLoadUnload.test_lldb_process_load_and_unload_commands/a.out' (x86_64).


runCmd: breakpoint set -f "main.cpp" -l 11
output: Breakpoint 1: no locations (pending).
WARNING:  Unable to resolve breakpoint to any actual locations.


Expecting pattern: ^Breakpoint (?P<bpno>[0-9]+): (?P<num_locations>[0-9]+) locations\.$
Not matched

Expecting pattern: ^Breakpoint (?P<bpno>[0-9]+): (?P<num_locations>no) locations \(pending\)\.
Matched

FAIL: LLDB (/Users/buildslave/jenkins/workspace/lldb-cmake-matrix/lldb-build/bin/clang-x86_64) :: test_lldb_process_load_and_unload_commands (TestLoadUnload.LoadUnloadTestCase)
runCmd: settings clear -all
output: 

runCmd: settings set symbols.enable-external-lookup false
output: 

runCmd: settings set target.inherit-tcc true
output: 

runCmd: settings set target.detach-on-error false
output: 

runCmd: settings set target.auto-apply-fixits false
output: 

runCmd: settings set plugin.process.gdb-remote.packet-timeout 60
output: 

runCmd: settings set symbols.clang-modules-cache-path "/Users/buildslave/jenkins/workspace/lldb-cmake-matrix/lldb-build/lldb-test-build.noindex/module-cache-lldb/lldb-api"
output: 

runCmd: settings set use-color false
output: 

runCmd: setting set target.prefer-dynamic-value no-dynamic-values
output: 

runCmd: settings append target.env-vars 'DYLD_LIBRARY_PATH=/Users/buildslave/jenkins/workspace/lldb-cmake-matrix/lldb-build/lldb-test-build.noindex/functionalities/load_unload/TestLoadUnload.test_lldb_process_load_and_unload_commands_with_svr4'
output: 

runCmd: settings set plugin.process.gdb-remote.use-libraries-svr4 true
output: 

runCmd: file /Users/buildslave/jenkins/workspace/lldb-cmake-matrix/lldb-build/lldb-test-build.noindex/functionalities/load_unload/TestLoadUnload.test_lldb_process_load_and_unload_commands_with_svr4/a.out
output: Current executable set to '/Users/buildslave/jenkins/workspace/lldb-cmake-matrix/lldb-build/lldb-test-build.noindex/functionalities/load_unload/TestLoadUnload.test_lldb_process_load_and_unload_commands_with_svr4/a.out' (x86_64).


runCmd: breakpoint set -f "main.cpp" -l 11
output: Breakpoint 1: no locations (pending).
WARNING:  Unable to resolve breakpoint to any actual locations.


Expecting pattern: ^Breakpoint (?P<bpno>[0-9]+): (?P<num_locations>[0-9]+) locations\.$
Not matched

Expecting pattern: ^Breakpoint (?P<bpno>[0-9]+): (?P<num_locations>no) locations \(pending\)\.
Matched

FAIL: LLDB (/Users/buildslave/jenkins/workspace/lldb-cmake-matrix/lldb-build/bin/clang-x86_64) :: test_lldb_process_load_and_unload_commands_with_svr4 (TestLoadUnload.LoadUnloadTestCase)
runCmd: settings clear -all
output: 

runCmd: settings set symbols.enable-external-lookup false
output: 

runCmd: settings set target.inherit-tcc true
output: 

runCmd: settings set target.detach-on-error false
output: 

runCmd: settings set target.auto-apply-fixits false
output: 

runCmd: settings set plugin.process.gdb-remote.packet-timeout 60
output: 

runCmd: settings set symbols.clang-modules-cache-path "/Users/buildslave/jenkins/workspace/lldb-cmake-matrix/lldb-build/lldb-test-build.noindex/module-cache-lldb/lldb-api"
output: 

runCmd: settings set use-color false
output: 

runCmd: setting set target.prefer-dynamic-value no-dynamic-values
output: 

runCmd: settings append target.env-vars 'DYLD_LIBRARY_PATH=/Users/buildslave/jenkins/workspace/lldb-cmake-matrix/lldb-build/lldb-test-build.noindex/functionalities/load_unload/TestLoadUnload.test_load_unload'
output: 

runCmd: settings set plugin.process.gdb-remote.use-libraries-svr4 false
output: 

runCmd: file /Users/buildslave/jenkins/workspace/lldb-cmake-matrix/lldb-build/lldb-test-build.noindex/functionalities/load_unload/TestLoadUnload.test_load_unload/a.out
output: Current executable set to '/Users/buildslave/jenkins/workspace/lldb-cmake-matrix/lldb-build/lldb-test-build.noindex/functionalities/load_unload/TestLoadUnload.test_load_unload/a.out' (x86_64).


runCmd: breakpoint set -n "a_function"
output: Breakpoint 1: no locations (pending).
WARNING:  Unable to resolve breakpoint to any actual locations.


Expecting pattern: ^Breakpoint (?P<bpno>[0-9]+): (?P<num_locations>[0-9]+) locations\.$
Not matched

Expecting pattern: ^Breakpoint (?P<bpno>[0-9]+): (?P<num_locations>no) locations \(pending\)\.
Matched

runCmd: run
output: Process 69851 stopped
* thread #1, queue = 'com.apple.main-thread', stop reason = breakpoint 1.1
    frame #0: 0x0000000100139f44 libloadunload_a.dylib`a_init()
Process 69851 launched: '/Users/buildslave/jenkins/workspace/lldb-cmake-matrix/lldb-build/lldb-test-build.noindex/functionalities/load_unload/TestLoadUnload.test_load_unload/a.out' (x86_64)


runCmd: thread list
output: Process 69851 stopped
* thread #1: tid = 0x9fe5ab, 0x0000000100139f44 libloadunload_a.dylib`a_init(), queue = 'com.apple.main-thread', stop reason = breakpoint 1.1


Ran command:
"thread list"

Got output:
Process 69851 stopped
* thread #1: tid = 0x9fe5ab, 0x0000000100139f44 libloadunload_a.dylib`a_init(), queue = 'com.apple.main-thread', stop reason = breakpoint 1.1

Expecting sub string: "stopped" (was found)
Expecting sub string: "a_function" (was not found)
Process should be stopped due to breakpoint

FAIL: LLDB (/Users/buildslave/jenkins/workspace/lldb-cmake-matrix/lldb-build/bin/clang-x86_64) :: test_load_unload (TestLoadUnload.LoadUnloadTestCase)
<bound method SBProcess.Kill of <lldb.SBProcess; proxy of <Swig Object of type 'lldb::SBProcess *' at 0x10583fba0> >>: success

runCmd: settings clear -all
output: 

runCmd: settings set symbols.enable-external-lookup false
output: 

runCmd: settings set target.inherit-tcc true
output: 

runCmd: settings set target.detach-on-error false
output: 

runCmd: settings set target.auto-apply-fixits false
output: 

runCmd: settings set plugin.process.gdb-remote.packet-timeout 60
output: 

runCmd: settings set symbols.clang-modules-cache-path "/Users/buildslave/jenkins/workspace/lldb-cmake-matrix/lldb-build/lldb-test-build.noindex/module-cache-lldb/lldb-api"
output: 

runCmd: settings set use-color false
output: 

runCmd: setting set target.prefer-dynamic-value no-dynamic-values
output: 

runCmd: settings append target.env-vars 'DYLD_LIBRARY_PATH=/Users/buildslave/jenkins/workspace/lldb-cmake-matrix/lldb-build/lldb-test-build.noindex/functionalities/load_unload/TestLoadUnload.test_load_unload_with_svr4'
output: 

runCmd: settings set plugin.process.gdb-remote.use-libraries-svr4 true
output: 

runCmd: file /Users/buildslave/jenkins/workspace/lldb-cmake-matrix/lldb-build/lldb-test-build.noindex/functionalities/load_unload/TestLoadUnload.test_load_unload_with_svr4/a.out
output: Current executable set to '/Users/buildslave/jenkins/workspace/lldb-cmake-matrix/lldb-build/lldb-test-build.noindex/functionalities/load_unload/TestLoadUnload.test_load_unload_with_svr4/a.out' (x86_64).


runCmd: breakpoint set -n "a_function"
output: Breakpoint 1: no locations (pending).
WARNING:  Unable to resolve breakpoint to any actual locations.


Expecting pattern: ^Breakpoint (?P<bpno>[0-9]+): (?P<num_locations>[0-9]+) locations\.$
Not matched

Expecting pattern: ^Breakpoint (?P<bpno>[0-9]+): (?P<num_locations>no) locations \(pending\)\.
Matched

runCmd: run
output: Process 69936 stopped
* thread #1, queue = 'com.apple.main-thread', stop reason = breakpoint 1.1
    frame #0: 0x0000000100139f44 libloadunload_a.dylib`a_init()
Process 69936 launched: '/Users/buildslave/jenkins/workspace/lldb-cmake-matrix/lldb-build/lldb-test-build.noindex/functionalities/load_unload/TestLoadUnload.test_load_unload_with_svr4/a.out' (x86_64)


runCmd: thread list
output: Process 69936 stopped
* thread #1: tid = 0x9fe6d2, 0x0000000100139f44 libloadunload_a.dylib`a_init(), queue = 'com.apple.main-thread', stop reason = breakpoint 1.1


Ran command:
"thread list"

Got output:
Process 69936 stopped
* thread #1: tid = 0x9fe6d2, 0x0000000100139f44 libloadunload_a.dylib`a_init(), queue = 'com.apple.main-thread', stop reason = breakpoint 1.1

Expecting sub string: "stopped" (was found)
Expecting sub string: "a_function" (was not found)
Process should be stopped due to breakpoint

FAIL: LLDB (/Users/buildslave/jenkins/workspace/lldb-cmake-matrix/lldb-build/bin/clang-x86_64) :: test_load_unload_with_svr4 (TestLoadUnload.LoadUnloadTestCase)
<bound method SBProcess.Kill of <lldb.SBProcess; proxy of <Swig Object of type 'lldb::SBProcess *' at 0x105aa4fc0> >>: success

runCmd: settings clear -all
output: 

runCmd: settings set symbols.enable-external-lookup false
output: 

runCmd: settings set target.inherit-tcc true
output: 

runCmd: settings set target.detach-on-error false
output: 

runCmd: settings set target.auto-apply-fixits false
output: 

runCmd: settings set plugin.process.gdb-remote.packet-timeout 60
output: 

runCmd: settings set symbols.clang-modules-cache-path "/Users/buildslave/jenkins/workspace/lldb-cmake-matrix/lldb-build/lldb-test-build.noindex/module-cache-lldb/lldb-api"
output: 

runCmd: settings set use-color false
output: 

runCmd: setting set target.prefer-dynamic-value no-dynamic-values
output: 

runCmd: settings append target.env-vars 'DYLD_LIBRARY_PATH=/Users/buildslave/jenkins/workspace/lldb-cmake-matrix/lldb-build/lldb-test-build.noindex/functionalities/load_unload/TestLoadUnload.test_modules_search_paths'
output: 

runCmd: file /Users/buildslave/jenkins/workspace/lldb-cmake-matrix/lldb-build/lldb-test-build.noindex/functionalities/load_unload/TestLoadUnload.test_modules_search_paths/a.out
output: Current executable set to '/Users/buildslave/jenkins/workspace/lldb-cmake-matrix/lldb-build/lldb-test-build.noindex/functionalities/load_unload/TestLoadUnload.test_modules_search_paths/a.out' (x86_64).


runCmd: target modules list
output: [  0] 598AABAE-C516-33ED-8EEF-2A461E6C458B 0x0000000100000000 /Users/buildslave/jenkins/workspace/lldb-cmake-matrix/lldb-build/lldb-test-build.noindex/functionalities/load_unload/TestLoadUnload.test_modules_search_paths/a.out 
      /Users/buildslave/jenkins/workspace/lldb-cmake-matrix/lldb-build/lldb-test-build.noindex/functionalities/load_unload/TestLoadUnload.test_modules_search_paths/a.out.dSYM/Contents/Resources/DWARF/a.out
[  1] E4698FBD-806A-3396-B279-E685BA37430B 0x0000000000000000 /usr/lib/dyld 
[  2] B6FDA8A9-3D2B-3BD5-B5B0-57D311C0FF3D 0x00007fff641cb000 /usr/lib/libSystem.B.dylib 
[  3] AD0805FE-F98B-3E2F-B072-83782B22DAC9 0x00007fff64547000 /usr/lib/libc++.1.dylib 
[  4] 18EA5EE0-5B22-315B-9444-461E12765DE6 0x0000000000000000 /Users/buildslave/jenkins/workspace/lldb-cmake-matrix/lldb-build/lldb-test-build.noindex/functionalities/load_unload/TestLoadUnload.test_modules_search_paths/libloadunload_d.dylib 
      /Users/buildslave/jenkins/workspace/lldb-cmake-matrix/lldb-build/lldb-test-build.noindex/functionalities/load_unload/TestLoadUnload.test_modules_search_paths/libloadunload_d.dylib.dSYM/Contents/Resources/DWARF/libloadunload_d.dylib
[  5] A5ECC751-A681-30D8-B33C-D192C15D25C8 0x00007fff67055000 /usr/lib/system/libcache.dylib 
[  6] C321A74A-AA91-3785-BEBF-BEDC6975026C 0x00007fff6705b000 /usr/lib/system/libcommonCrypto.dylib 
[  7] 652A6012-7E5C-3F4F-9438-86BC094526F3 0x00007fff67067000 /usr/lib/system/libcompiler_rt.dylib 
[  8] 40113A69-A81C-3397-ADC6-1D16B9A22C3E 0x00007fff6706f000 /usr/lib/system/libcopyfile.dylib 
[  9] 5E4B0E50-24DD-3E04-9374-EDA9FFD6257B 0x00007fff67079000 /usr/lib/system/libcorecrypto.dylib 
[ 10] 201EDBF3-0B36-31BA-A7CB-443CE35C05D4 0x00007fff67218000 /usr/lib/system/libdispatch.dylib 
[ 11] 7E711A46-5E4D-393C-AEA6-440E2A5CCD0C 0x00007fff67259000 /usr/lib/system/libdyld.dylib 
[ 12] 52662CAA-DB1F-30A3-BE13-D6274B1A6D7B 0x00007fff67290000 /usr/lib/system/libkeymgr.dylib 
[ 13] 07CF647B-F9DC-3907-AD98-2F85FCB34A72 0x00007fff6729e000 /usr/lib/system/liblaunch.dylib 
[ 14] D91DFF00-E22F-3796-8A1C-4C1F5F8FA03C 0x00007fff6729f000 /usr/lib/system/libmacho.dylib 
[ 15] D3B7D02C-7646-3FB4-8529-B36DCC2419EA 0x00007fff672a5000 /usr/lib/system/libquarantine.dylib 
[ 16] B5E88D9B-C2BE-3496-BBB2-C996317E18A3 0x00007fff672a8000 /usr/lib/system/libremovefile.dylib 
[ 17] 1170348D-2491-33F1-AA79-E2A05B4A287C 0x00007fff672aa000 /usr/lib/system/libsystem_asl.dylib 
[ 18] 7AFBCAA6-81BE-36C3-8DB0-AAE0A4ACE4C5 0x00007fff672c2000 /usr/lib/system/libsystem_blocks.dylib 
[ 19] 935DDCE9-4ED0-3F79-A05A-A123DDE399CC 0x00007fff672c3000 /usr/lib/system/libsystem_c.dylib 
[ 20] EA9BC2B1-5001-3463-9FAF-39FF61CAC87C 0x00007fff6734b000 /usr/lib/system/libsystem_configuration.dylib 
[ 21] 3D0A3AA8-8415-37B2-AAE3-66C03BCE8B55 0x00007fff6734f000 /usr/lib/system/libsystem_coreservices.dylib 
[ 22] 6EEC9975-EE3B-3C95-AA5B-030FD10587BC 0x00007fff67353000 /usr/lib/system/libsystem_darwin.dylib 
[ 23] 0115092A-E61B-317D-8670-41C7C34B1A82 0x00007fff6735c000 /usr/lib/system/libsystem_dnssd.dylib 
[ 24] AFDB5095-0472-34AC-BA7E-497921BF030A 0x00007fff67364000 /usr/lib/system/libsystem_featureflags.dylib 
[ 25] 851693E9-C079-3547-AD41-353F8C248BE8 0x00007fff67366000 /usr/lib/system/libsystem_info.dylib 
[ 26] 1E6FACE8-8EB2-3478-A77D-220617855B30 0x00007fff673e1000 /usr/lib/system/libsystem_m.dylib 
[ 27] D4BA7DF2-57AC-33B0-B948-A688EE43C799 0x00007fff6742d000 /usr/lib/system/libsystem_malloc.dylib 
[ 28] 6DE86DB0-8CD2-361E-BD6A-A34282B47847 0x00007fff67455000 /usr/lib/system/libsystem_networkextension.dylib 
[ 29] 7E9E2FC8-DF26-340C-B196-B81B11850C46 0x00007fff67463000 /usr/lib/system/libsystem_notify.dylib 
[ 30] 20C93D69-6452-3C82-9521-8AE54345C66F 0x00007fff67481000 /usr/lib/system/libsystem_sandbox.dylib 
[ 31] E851113D-D5B1-3FB0-9D29-9C7647A71961 0x00007fff67486000 /usr/lib/system/libsystem_secinit.dylib 
[ 32] 9F9902C9-A46F-3CA9-B7F9-5CCFE98FBF75 0x00007fff673b4000 /usr/lib/system/libsystem_kernel.dylib 
[ 33] 736920EA-6AE0-3B1B-BBDA-7DCDF0C229DF 0x00007fff6746d000 /usr/lib/system/libsystem_platform.dylib 
[ 34] 77488669-19A3-3993-AD65-CA5377E2475A 0x00007fff67476000 /usr/lib/system/libsystem_pthread.dylib 
[ 35] 25C3866B-004E-3621-9CD3-B1E9C4D887EB 0x00007fff67489000 /usr/lib/system/libsystem_symptoms.dylib 
[ 36] A1ED1D3A-5FAD-3559-A1D6-1BE4E1C5756A 0x00007fff67491000 /usr/lib/system/libsystem_trace.dylib 
[ 37] 253A12E2-F88F-3838-A666-C5306F833CB8 0x00007fff674a9000 /usr/lib/system/libunwind.dylib 
[ 38] 68D433B6-DCFF-385D-8620-F847FB7D4A5A 0x00007fff674af000 /usr/lib/system/libxpc.dylib 
[ 39] 771E9263-E832-3985-9477-8F1B2D73B771 0x00007fff6459a000 /usr/lib/libc++abi.dylib 
[ 40] 720155DE-4837-3A43-A8AD-C00C8659FDF5 0x00007fff660c2000 /usr/lib/libobjc.A.dylib 


Ran command:
"target modules list"

Got output:
[  0] 598AABAE-C516-33ED-8EEF-2A461E6C458B 0x0000000100000000 /Users/buildslave/jenkins/workspace/lldb-cmake-matrix/lldb-build/lldb-test-build.noindex/functionalities/load_unload/TestLoadUnload.test_modules_search_paths/a.out 
      /Users/buildslave/jenkins/workspace/lldb-cmake-matrix/lldb-build/lldb-test-build.noindex/functionalities/load_unload/TestLoadUnload.test_modules_search_paths/a.out.dSYM/Contents/Resources/DWARF/a.out
[  1] E4698FBD-806A-3396-B279-E685BA37430B 0x0000000000000000 /usr/lib/dyld 
[  2] B6FDA8A9-3D2B-3BD5-B5B0-57D311C0FF3D 0x00007fff641cb000 /usr/lib/libSystem.B.dylib 
[  3] AD0805FE-F98B-3E2F-B072-83782B22DAC9 0x00007fff64547000 /usr/lib/libc++.1.dylib 
[  4] 18EA5EE0-5B22-315B-9444-461E12765DE6 0x0000000000000000 /Users/buildslave/jenkins/workspace/lldb-cmake-matrix/lldb-build/lldb-test-build.noindex/functionalities/load_unload/TestLoadUnload.test_modules_search_paths/libloadunload_d.dylib 
      /Users/buildslave/jenkins/workspace/lldb-cmake-matrix/lldb-build/lldb-test-build.noindex/functionalities/load_unload/TestLoadUnload.test_modules_search_paths/libloadunload_d.dylib.dSYM/Contents/Resources/DWARF/libloadunload_d.dylib
[  5] A5ECC751-A681-30D8-B33C-D192C15D25C8 0x00007fff67055000 /usr/lib/system/libcache.dylib 
[  6] C321A74A-AA91-3785-BEBF-BEDC6975026C 0x00007fff6705b000 /usr/lib/system/libcommonCrypto.dylib 
[  7] 652A6012-7E5C-3F4F-9438-86BC094526F3 0x00007fff67067000 /usr/lib/system/libcompiler_rt.dylib 
[  8] 40113A69-A81C-3397-ADC6-1D16B9A22C3E 0x00007fff6706f000 /usr/lib/system/libcopyfile.dylib 
[  9] 5E4B0E50-24DD-3E04-9374-EDA9FFD6257B 0x00007fff67079000 /usr/lib/system/libcorecrypto.dylib 
[ 10] 201EDBF3-0B36-31BA-A7CB-443CE35C05D4 0x00007fff67218000 /usr/lib/system/libdispatch.dylib 
[ 11] 7E711A46-5E4D-393C-AEA6-440E2A5CCD0C 0x00007fff67259000 /usr/lib/system/libdyld.dylib 
[ 12] 52662CAA-DB1F-30A3-BE13-D6274B1A6D7B 0x00007fff67290000 /usr/lib/system/libkeymgr.dylib 
[ 13] 07CF647B-F9DC-3907-AD98-2F85FCB34A72 0x00007fff6729e000 /usr/lib/system/liblaunch.dylib 
[ 14] D91DFF00-E22F-3796-8A1C-4C1F5F8FA03C 0x00007fff6729f000 /usr/lib/system/libmacho.dylib 
[ 15] D3B7D02C-7646-3FB4-8529-B36DCC2419EA 0x00007fff672a5000 /usr/lib/system/libquarantine.dylib 
[ 16] B5E88D9B-C2BE-3496-BBB2-C996317E18A3 0x00007fff672a8000 /usr/lib/system/libremovefile.dylib 
[ 17] 1170348D-2491-33F1-AA79-E2A05B4A287C 0x00007fff672aa000 /usr/lib/system/libsystem_asl.dylib 
[ 18] 7AFBCAA6-81BE-36C3-8DB0-AAE0A4ACE4C5 0x00007fff672c2000 /usr/lib/system/libsystem_blocks.dylib 
[ 19] 935DDCE9-4ED0-3F79-A05A-A123DDE399CC 0x00007fff672c3000 /usr/lib/system/libsystem_c.dylib 
[ 20] EA9BC2B1-5001-3463-9FAF-39FF61CAC87C 0x00007fff6734b000 /usr/lib/system/libsystem_configuration.dylib 
[ 21] 3D0A3AA8-8415-37B2-AAE3-66C03BCE8B55 0x00007fff6734f000 /usr/lib/system/libsystem_coreservices.dylib 
[ 22] 6EEC9975-EE3B-3C95-AA5B-030FD10587BC 0x00007fff67353000 /usr/lib/system/libsystem_darwin.dylib 
[ 23] 0115092A-E61B-317D-8670-41C7C34B1A82 0x00007fff6735c000 /usr/lib/system/libsystem_dnssd.dylib 
[ 24] AFDB5095-0472-34AC-BA7E-497921BF030A 0x00007fff67364000 /usr/lib/system/libsystem_featureflags.dylib 
[ 25] 851693E9-C079-3547-AD41-353F8C248BE8 0x00007fff67366000 /usr/lib/system/libsystem_info.dylib 
[ 26] 1E6FACE8-8EB2-3478-A77D-220617855B30 0x00007fff673e1000 /usr/lib/system/libsystem_m.dylib 
[ 27] D4BA7DF2-57AC-33B0-B948-A688EE43C799 0x00007fff6742d000 /usr/lib/system/libsystem_malloc.dylib 
[ 28] 6DE86DB0-8CD2-361E-BD6A-A34282B47847 0x00007fff67455000 /usr/lib/system/libsystem_networkextension.dylib 
[ 29] 7E9E2FC8-DF26-340C-B196-B81B11850C46 0x00007fff67463000 /usr/lib/system/libsystem_notify.dylib 
[ 30] 20C93D69-6452-3C82-9521-8AE54345C66F 0x00007fff67481000 /usr/lib/system/libsystem_sandbox.dylib 
[ 31] E851113D-D5B1-3FB0-9D29-9C7647A71961 0x00007fff67486000 /usr/lib/system/libsystem_secinit.dylib 
[ 32] 9F9902C9-A46F-3CA9-B7F9-5CCFE98FBF75 0x00007fff673b4000 /usr/lib/system/libsystem_kernel.dylib 
[ 33] 736920EA-6AE0-3B1B-BBDA-7DCDF0C229DF 0x00007fff6746d000 /usr/lib/system/libsystem_platform.dylib 
[ 34] 77488669-19A3-3993-AD65-CA5377E2475A 0x00007fff67476000 /usr/lib/system/libsystem_pthread.dylib 
[ 35] 25C3866B-004E-3621-9CD3-B1E9C4D887EB 0x00007fff67489000 /usr/lib/system/libsystem_symptoms.dylib 
[ 36] A1ED1D3A-5FAD-3559-A1D6-1BE4E1C5756A 0x00007fff67491000 /usr/lib/system/libsystem_trace.dylib 
[ 37] 253A12E2-F88F-3838-A666-C5306F833CB8 0x00007fff674a9000 /usr/lib/system/libunwind.dylib 
[ 38] 68D433B6-DCFF-385D-8620-F847FB7D4A5A 0x00007fff674af000 /usr/lib/system/libxpc.dylib 
[ 39] 771E9263-E832-3985-9477-8F1B2D73B771 0x00007fff6459a000 /usr/lib/libc++abi.dylib 
[ 40] 720155DE-4837-3A43-A8AD-C00C8659FDF5 0x00007fff660c2000 /usr/lib/libobjc.A.dylib 

Expecting sub string: "/Users/buildslave/jenkins/workspace/lldb-cmake-matrix/lldb-build/lldb-test-build.noindex/functionalities/load_unload/TestLoadUnload.test_modules_search_paths/libloadunload_d.dylib" (was found)
error: libloadunload_d.dylib Failed to extract range list table at offset 0xc: parsing .debug_rnglists table at offset 0x0: unexpected end of data at offset 0x0 while reading [0x0, 0x4)
error: libloadunload_a.dylib Failed to extract range list table at offset 0xc: parsing .debug_rnglists table at offset 0x0: unexpected end of data at offset 0x0 while reading [0x0, 0x4)
error: libloadunload_b.dylib Failed to extract range list table at offset 0xc: parsing .debug_rnglists table at offset 0x0: unexpected end of data at offset 0x0 while reading [0x0, 0x4)

runCmd: target modules search-paths add /Users/buildslave/jenkins/workspace/lldb-cmake-matrix/lldb-build/lldb-test-build.noindex/functionalities/load_unload/TestLoadUnload.test_modules_search_paths /Users/buildslave/jenkins/workspace/lldb-cmake-matrix/lldb-build/lldb-test-build.noindex/functionalities/load_unload/TestLoadUnload.test_modules_search_paths/hidden
output: 

runCmd: target modules search-paths list
output: [0] "/Users/buildslave/jenkins/workspace/lldb-cmake-matrix/lldb-build/lldb-test-build.noindex/functionalities/load_unload/TestLoadUnload.test_modules_search_paths" -> "/Users/buildslave/jenkins/workspace/lldb-cmake-matrix/lldb-build/lldb-test-build.noindex/functionalities/load_unload/TestLoadUnload.test_modules_search_paths/hidden"


Ran command:
"target modules search-paths list"

Got output:
[0] "/Users/buildslave/jenkins/workspace/lldb-cmake-matrix/lldb-build/lldb-test-build.noindex/functionalities/load_unload/TestLoadUnload.test_modules_search_paths" -> "/Users/buildslave/jenkins/workspace/lldb-cmake-matrix/lldb-build/lldb-test-build.noindex/functionalities/load_unload/TestLoadUnload.test_modules_search_paths/hidden"

Expecting sub string: "/Users/buildslave/jenkins/workspace/lldb-cmake-matrix/lldb-build/lldb-test-build.noindex/functionalities/load_unload/TestLoadUnload.test_modules_search_paths" (was found)
Expecting sub string: "/Users/buildslave/jenkins/workspace/lldb-cmake-matrix/lldb-build/lldb-test-build.noindex/functionalities/load_unload/TestLoadUnload.test_modules_search_paths/hidden" (was found)

runCmd: target modules search-paths query /Users/buildslave/jenkins/workspace/lldb-cmake-matrix/lldb-build/lldb-test-build.noindex/functionalities/load_unload/TestLoadUnload.test_modules_search_paths
output: /Users/buildslave/jenkins/workspace/lldb-cmake-matrix/lldb-build/lldb-test-build.noindex/functionalities/load_unload/TestLoadUnload.test_modules_search_paths/hidden


Ran command:
"target modules search-paths query /Users/buildslave/jenkins/workspace/lldb-cmake-matrix/lldb-build/lldb-test-build.noindex/functionalities/load_unload/TestLoadUnload.test_modules_search_paths"

Got output:
/Users/buildslave/jenkins/workspace/lldb-cmake-matrix/lldb-build/lldb-test-build.noindex/functionalities/load_unload/TestLoadUnload.test_modules_search_paths/hidden

Expecting sub string: "/Users/buildslave/jenkins/workspace/lldb-cmake-matrix/lldb-build/lldb-test-build.noindex/functionalities/load_unload/TestLoadUnload.test_modules_search_paths/hidden" (was found)

runCmd: settings replace target.env-vars DYLD_LIBRARY_PATH=/Users/buildslave/jenkins/workspace/lldb-cmake-matrix/lldb-build/lldb-test-build.noindex/functionalities/load_unload/TestLoadUnload.test_modules_search_paths/hidden
output: 

runCmd: settings show target.env-vars
output: target.env-vars (dictionary of strings) =
  DYLD_LIBRARY_PATH=/Users/buildslave/jenkins/workspace/lldb-cmake-matrix/lldb-build/lldb-test-build.noindex/functionalities/load_unload/TestLoadUnload.test_modules_search_paths/hidden


runCmd: run
output: Process 70009 exited with status = 1 (0x00000001)
Process 70009 launched: '/Users/buildslave/jenkins/workspace/lldb-cmake-matrix/lldb-build/lldb-test-build.noindex/functionalities/load_unload/TestLoadUnload.test_modules_search_paths/a.out' (x86_64)


runCmd: target modules list
output: [  0] 598AABAE-C516-33ED-8EEF-2A461E6C458B 0x0000000100000000 /Users/buildslave/jenkins/workspace/lldb-cmake-matrix/lldb-build/lldb-test-build.noindex/functionalities/load_unload/TestLoadUnload.test_modules_search_paths/a.out 
      /Users/buildslave/jenkins/workspace/lldb-cmake-matrix/lldb-build/lldb-test-build.noindex/functionalities/load_unload/TestLoadUnload.test_modules_search_paths/a.out.dSYM/Contents/Resources/DWARF/a.out
[  1] E4698FBD-806A-3396-B279-E685BA37430B 0x0000000100004000 /usr/lib/dyld 
[  2] 92192F7E-3FCC-3F3C-8131-FB6F028C2C61 0x0000000100109000 /Users/buildslave/jenkins/workspace/lldb-cmake-matrix/lldb-build/lldb-test-build.noindex/functionalities/load_unload/TestLoadUnload.test_modules_search_paths/hidden/libloadunload_d.dylib 
      /Users/buildslave/jenkins/workspace/lldb-cmake-matrix/lldb-build/lldb-test-build.noindex/functionalities/load_unload/TestLoadUnload.test_modules_search_paths/hidden/libloadunload_d.dylib.dSYM/Contents/Resources/DWARF/libloadunload_d.dylib
[  3] B6FDA8A9-3D2B-3BD5-B5B0-57D311C0FF3D 0x00007fff69da5000 /usr/lib/libSystem.B.dylib 
[  4] AD0805FE-F98B-3E2F-B072-83782B22DAC9 0x00007fff6a121000 /usr/lib/libc++.1.dylib 
[  5] 771E9263-E832-3985-9477-8F1B2D73B771 0x00007fff6a174000 /usr/lib/libc++abi.dylib 
[  6] A5ECC751-A681-30D8-B33C-D192C15D25C8 0x00007fff6cc2f000 /usr/lib/system/libcache.dylib 
[  7] C321A74A-AA91-3785-BEBF-BEDC6975026C 0x00007fff6cc35000 /usr/lib/system/libcommonCrypto.dylib 
[  8] 652A6012-7E5C-3F4F-9438-86BC094526F3 0x00007fff6cc41000 /usr/lib/system/libcompiler_rt.dylib 
[  9] 40113A69-A81C-3397-ADC6-1D16B9A22C3E 0x00007fff6cc49000 /usr/lib/system/libcopyfile.dylib 
[ 10] 5E4B0E50-24DD-3E04-9374-EDA9FFD6257B 0x00007fff6cc53000 /usr/lib/system/libcorecrypto.dylib 
[ 11] 201EDBF3-0B36-31BA-A7CB-443CE35C05D4 0x00007fff6cdf2000 /usr/lib/system/libdispatch.dylib 
[ 12] 7E711A46-5E4D-393C-AEA6-440E2A5CCD0C 0x00007fff6ce33000 /usr/lib/system/libdyld.dylib 
[ 13] 52662CAA-DB1F-30A3-BE13-D6274B1A6D7B 0x00007fff6ce6a000 /usr/lib/system/libkeymgr.dylib 
[ 14] 07CF647B-F9DC-3907-AD98-2F85FCB34A72 0x00007fff6ce78000 /usr/lib/system/liblaunch.dylib 
[ 15] D91DFF00-E22F-3796-8A1C-4C1F5F8FA03C 0x00007fff6ce79000 /usr/lib/system/libmacho.dylib 
[ 16] D3B7D02C-7646-3FB4-8529-B36DCC2419EA 0x00007fff6ce7f000 /usr/lib/system/libquarantine.dylib 
[ 17] B5E88D9B-C2BE-3496-BBB2-C996317E18A3 0x00007fff6ce82000 /usr/lib/system/libremovefile.dylib 
[ 18] 1170348D-2491-33F1-AA79-E2A05B4A287C 0x00007fff6ce84000 /usr/lib/system/libsystem_asl.dylib 
[ 19] 7AFBCAA6-81BE-36C3-8DB0-AAE0A4ACE4C5 0x00007fff6ce9c000 /usr/lib/system/libsystem_blocks.dylib 
[ 20] 935DDCE9-4ED0-3F79-A05A-A123DDE399CC 0x00007fff6ce9d000 /usr/lib/system/libsystem_c.dylib 
[ 21] EA9BC2B1-5001-3463-9FAF-39FF61CAC87C 0x00007fff6cf25000 /usr/lib/system/libsystem_configuration.dylib 
[ 22] 3D0A3AA8-8415-37B2-AAE3-66C03BCE8B55 0x00007fff6cf29000 /usr/lib/system/libsystem_coreservices.dylib 
[ 23] 6EEC9975-EE3B-3C95-AA5B-030FD10587BC 0x00007fff6cf2d000 /usr/lib/system/libsystem_darwin.dylib 
[ 24] 0115092A-E61B-317D-8670-41C7C34B1A82 0x00007fff6cf36000 /usr/lib/system/libsystem_dnssd.dylib 
[ 25] AFDB5095-0472-34AC-BA7E-497921BF030A 0x00007fff6cf3e000 /usr/lib/system/libsystem_featureflags.dylib 
[ 26] 851693E9-C079-3547-AD41-353F8C248BE8 0x00007fff6cf40000 /usr/lib/system/libsystem_info.dylib 
[ 27] 1E6FACE8-8EB2-3478-A77D-220617855B30 0x00007fff6cfbb000 /usr/lib/system/libsystem_m.dylib 
[ 28] D4BA7DF2-57AC-33B0-B948-A688EE43C799 0x00007fff6d007000 /usr/lib/system/libsystem_malloc.dylib 
[ 29] 6DE86DB0-8CD2-361E-BD6A-A34282B47847 0x00007fff6d02f000 /usr/lib/system/libsystem_networkextension.dylib 
[ 30] 7E9E2FC8-DF26-340C-B196-B81B11850C46 0x00007fff6d03d000 /usr/lib/system/libsystem_notify.dylib 
[ 31] 20C93D69-6452-3C82-9521-8AE54345C66F 0x00007fff6d05b000 /usr/lib/system/libsystem_sandbox.dylib 
[ 32] E851113D-D5B1-3FB0-9D29-9C7647A71961 0x00007fff6d060000 /usr/lib/system/libsystem_secinit.dylib 
[ 33] 9F9902C9-A46F-3CA9-B7F9-5CCFE98FBF75 0x00007fff6cf8e000 /usr/lib/system/libsystem_kernel.dylib 
[ 34] 736920EA-6AE0-3B1B-BBDA-7DCDF0C229DF 0x00007fff6d047000 /usr/lib/system/libsystem_platform.dylib 
[ 35] 77488669-19A3-3993-AD65-CA5377E2475A 0x00007fff6d050000 /usr/lib/system/libsystem_pthread.dylib 
[ 36] 25C3866B-004E-3621-9CD3-B1E9C4D887EB 0x00007fff6d063000 /usr/lib/system/libsystem_symptoms.dylib 
[ 37] A1ED1D3A-5FAD-3559-A1D6-1BE4E1C5756A 0x00007fff6d06b000 /usr/lib/system/libsystem_trace.dylib 
[ 38] 253A12E2-F88F-3838-A666-C5306F833CB8 0x00007fff6d083000 /usr/lib/system/libunwind.dylib 
[ 39] 68D433B6-DCFF-385D-8620-F847FB7D4A5A 0x00007fff6d089000 /usr/lib/system/libxpc.dylib 
[ 40] 720155DE-4837-3A43-A8AD-C00C8659FDF5 0x00007fff6bc9c000 /usr/lib/libobjc.A.dylib 


Ran command:
"target modules list"

Got output:
[  0] 598AABAE-C516-33ED-8EEF-2A461E6C458B 0x0000000100000000 /Users/buildslave/jenkins/workspace/lldb-cmake-matrix/lldb-build/lldb-test-build.noindex/functionalities/load_unload/TestLoadUnload.test_modules_search_paths/a.out 
      /Users/buildslave/jenkins/workspace/lldb-cmake-matrix/lldb-build/lldb-test-build.noindex/functionalities/load_unload/TestLoadUnload.test_modules_search_paths/a.out.dSYM/Contents/Resources/DWARF/a.out
[  1] E4698FBD-806A-3396-B279-E685BA37430B 0x0000000100004000 /usr/lib/dyld 
[  2] 92192F7E-3FCC-3F3C-8131-FB6F028C2C61 0x0000000100109000 /Users/buildslave/jenkins/workspace/lldb-cmake-matrix/lldb-build/lldb-test-build.noindex/functionalities/load_unload/TestLoadUnload.test_modules_search_paths/hidden/libloadunload_d.dylib 
      /Users/buildslave/jenkins/workspace/lldb-cmake-matrix/lldb-build/lldb-test-build.noindex/functionalities/load_unload/TestLoadUnload.test_modules_search_paths/hidden/libloadunload_d.dylib.dSYM/Contents/Resources/DWARF/libloadunload_d.dylib
[  3] B6FDA8A9-3D2B-3BD5-B5B0-57D311C0FF3D 0x00007fff69da5000 /usr/lib/libSystem.B.dylib 
[  4] AD0805FE-F98B-3E2F-B072-83782B22DAC9 0x00007fff6a121000 /usr/lib/libc++.1.dylib 
[  5] 771E9263-E832-3985-9477-8F1B2D73B771 0x00007fff6a174000 /usr/lib/libc++abi.dylib 
[  6] A5ECC751-A681-30D8-B33C-D192C15D25C8 0x00007fff6cc2f000 /usr/lib/system/libcache.dylib 
[  7] C321A74A-AA91-3785-BEBF-BEDC6975026C 0x00007fff6cc35000 /usr/lib/system/libcommonCrypto.dylib 
[  8] 652A6012-7E5C-3F4F-9438-86BC094526F3 0x00007fff6cc41000 /usr/lib/system/libcompiler_rt.dylib 
[  9] 40113A69-A81C-3397-ADC6-1D16B9A22C3E 0x00007fff6cc49000 /usr/lib/system/libcopyfile.dylib 
[ 10] 5E4B0E50-24DD-3E04-9374-EDA9FFD6257B 0x00007fff6cc53000 /usr/lib/system/libcorecrypto.dylib 
[ 11] 201EDBF3-0B36-31BA-A7CB-443CE35C05D4 0x00007fff6cdf2000 /usr/lib/system/libdispatch.dylib 
[ 12] 7E711A46-5E4D-393C-AEA6-440E2A5CCD0C 0x00007fff6ce33000 /usr/lib/system/libdyld.dylib 
[ 13] 52662CAA-DB1F-30A3-BE13-D6274B1A6D7B 0x00007fff6ce6a000 /usr/lib/system/libkeymgr.dylib 
[ 14] 07CF647B-F9DC-3907-AD98-2F85FCB34A72 0x00007fff6ce78000 /usr/lib/system/liblaunch.dylib 
[ 15] D91DFF00-E22F-3796-8A1C-4C1F5F8FA03C 0x00007fff6ce79000 /usr/lib/system/libmacho.dylib 
[ 16] D3B7D02C-7646-3FB4-8529-B36DCC2419EA 0x00007fff6ce7f000 /usr/lib/system/libquarantine.dylib 
[ 17] B5E88D9B-C2BE-3496-BBB2-C996317E18A3 0x00007fff6ce82000 /usr/lib/system/libremovefile.dylib 
[ 18] 1170348D-2491-33F1-AA79-E2A05B4A287C 0x00007fff6ce84000 /usr/lib/system/libsystem_asl.dylib 
[ 19] 7AFBCAA6-81BE-36C3-8DB0-AAE0A4ACE4C5 0x00007fff6ce9c000 /usr/lib/system/libsystem_blocks.dylib 
[ 20] 935DDCE9-4ED0-3F79-A05A-A123DDE399CC 0x00007fff6ce9d000 /usr/lib/system/libsystem_c.dylib 
[ 21] EA9BC2B1-5001-3463-9FAF-39FF61CAC87C 0x00007fff6cf25000 /usr/lib/system/libsystem_configuration.dylib 
[ 22] 3D0A3AA8-8415-37B2-AAE3-66C03BCE8B55 0x00007fff6cf29000 /usr/lib/system/libsystem_coreservices.dylib 
[ 23] 6EEC9975-EE3B-3C95-AA5B-030FD10587BC 0x00007fff6cf2d000 /usr/lib/system/libsystem_darwin.dylib 
[ 24] 0115092A-E61B-317D-8670-41C7C34B1A82 0x00007fff6cf36000 /usr/lib/system/libsystem_dnssd.dylib 
[ 25] AFDB5095-0472-34AC-BA7E-497921BF030A 0x00007fff6cf3e000 /usr/lib/system/libsystem_featureflags.dylib 
[ 26] 851693E9-C079-3547-AD41-353F8C248BE8 0x00007fff6cf40000 /usr/lib/system/libsystem_info.dylib 
[ 27] 1E6FACE8-8EB2-3478-A77D-220617855B30 0x00007fff6cfbb000 /usr/lib/system/libsystem_m.dylib 
[ 28] D4BA7DF2-57AC-33B0-B948-A688EE43C799 0x00007fff6d007000 /usr/lib/system/libsystem_malloc.dylib 
[ 29] 6DE86DB0-8CD2-361E-BD6A-A34282B47847 0x00007fff6d02f000 /usr/lib/system/libsystem_networkextension.dylib 
[ 30] 7E9E2FC8-DF26-340C-B196-B81B11850C46 0x00007fff6d03d000 /usr/lib/system/libsystem_notify.dylib 
[ 31] 20C93D69-6452-3C82-9521-8AE54345C66F 0x00007fff6d05b000 /usr/lib/system/libsystem_sandbox.dylib 
[ 32] E851113D-D5B1-3FB0-9D29-9C7647A71961 0x00007fff6d060000 /usr/lib/system/libsystem_secinit.dylib 
[ 33] 9F9902C9-A46F-3CA9-B7F9-5CCFE98FBF75 0x00007fff6cf8e000 /usr/lib/system/libsystem_kernel.dylib 
[ 34] 736920EA-6AE0-3B1B-BBDA-7DCDF0C229DF 0x00007fff6d047000 /usr/lib/system/libsystem_platform.dylib 
[ 35] 77488669-19A3-3993-AD65-CA5377E2475A 0x00007fff6d050000 /usr/lib/system/libsystem_pthread.dylib 
[ 36] 25C3866B-004E-3621-9CD3-B1E9C4D887EB 0x00007fff6d063000 /usr/lib/system/libsystem_symptoms.dylib 
[ 37] A1ED1D3A-5FAD-3559-A1D6-1BE4E1C5756A 0x00007fff6d06b000 /usr/lib/system/libsystem_trace.dylib 
[ 38] 253A12E2-F88F-3838-A666-C5306F833CB8 0x00007fff6d083000 /usr/lib/system/libunwind.dylib 
[ 39] 68D433B6-DCFF-385D-8620-F847FB7D4A5A 0x00007fff6d089000 /usr/lib/system/libxpc.dylib 
[ 40] 720155DE-4837-3A43-A8AD-C00C8659FDF5 0x00007fff6bc9c000 /usr/lib/libobjc.A.dylib 

Expecting sub string: "/Users/buildslave/jenkins/workspace/lldb-cmake-matrix/lldb-build/lldb-test-build.noindex/functionalities/load_unload/TestLoadUnload.test_modules_search_paths/hidden/libloadunload_d.dylib" (was found)
error: libloadunload_d.dylib Failed to extract range list table at offset 0xc: parsing .debug_rnglists table at offset 0x0: unexpected end of data at offset 0x0 while reading [0x0, 0x4)
error: libloadunload_d.dylib Failed to extract range list table at offset 0xc: parsing .debug_rnglists table at offset 0x0: unexpected end of data at offset 0x0 while reading [0x0, 0x4)

<bound method SBProcess.Kill of <lldb.SBProcess; proxy of <Swig Object of type 'lldb::SBProcess *' at 0x10583fb70> >>: success

PASS: LLDB (/Users/buildslave/jenkins/workspace/lldb-cmake-matrix/lldb-build/bin/clang-x86_64) :: test_modules_search_paths (TestLoadUnload.LoadUnloadTestCase)
runCmd: settings clear -all
output: 

runCmd: settings set symbols.enable-external-lookup false
output: 

runCmd: settings set target.inherit-tcc true
output: 

runCmd: settings set target.detach-on-error false
output: 

runCmd: settings set target.auto-apply-fixits false
output: 

runCmd: settings set plugin.process.gdb-remote.packet-timeout 60
output: 

runCmd: settings set symbols.clang-modules-cache-path "/Users/buildslave/jenkins/workspace/lldb-cmake-matrix/lldb-build/lldb-test-build.noindex/module-cache-lldb/lldb-api"
output: 

runCmd: settings set use-color false
output: 

runCmd: setting set target.prefer-dynamic-value no-dynamic-values
output: 

runCmd: settings append target.env-vars 'DYLD_LIBRARY_PATH=/Users/buildslave/jenkins/workspace/lldb-cmake-matrix/lldb-build/lldb-test-build.noindex/functionalities/load_unload/TestLoadUnload.test_static_init_during_load'
output: 

runCmd: file /Users/buildslave/jenkins/workspace/lldb-cmake-matrix/lldb-build/lldb-test-build.noindex/functionalities/load_unload/TestLoadUnload.test_static_init_during_load/a.out
output: Current executable set to '/Users/buildslave/jenkins/workspace/lldb-cmake-matrix/lldb-build/lldb-test-build.noindex/functionalities/load_unload/TestLoadUnload.test_static_init_during_load/a.out' (x86_64).


runCmd: breakpoint set -n "a_init"
output: Breakpoint 1: no locations (pending).
WARNING:  Unable to resolve breakpoint to any actual locations.


Expecting pattern: ^Breakpoint (?P<bpno>[0-9]+): (?P<num_locations>[0-9]+) locations\.$
Not matched

Expecting pattern: ^Breakpoint (?P<bpno>[0-9]+): (?P<num_locations>no) locations \(pending\)\.
Matched

runCmd: breakpoint set -n "b_init"
output: Breakpoint 2: no locations (pending).
WARNING:  Unable to resolve breakpoint to any actual locations.


Expecting pattern: ^Breakpoint (?P<bpno>[0-9]+): (?P<num_locations>[0-9]+) locations\.$
Not matched

Expecting pattern: ^Breakpoint (?P<bpno>[0-9]+): (?P<num_locations>no) locations \(pending\)\.
Matched

runCmd: breakpoint set -n "d_init"
output: Breakpoint 3: where = libloadunload_d.dylib`d_init() + 4 at 3:5, address = 0x0000000000000f64


Expecting pattern: ^Breakpoint (?P<bpno>[0-9]+): (?P<num_locations>[0-9]+) locations\.$
Not matched

Expecting pattern: ^Breakpoint (?P<bpno>[0-9]+): (?P<num_locations>no) locations \(pending\)\.
Not matched

Expecting pattern: ^Breakpoint (?P<bpno>[0-9]+): where = (?P<module>.*)`(?P<symbol>[+\-]{0,1}[^+]+)( \+ (?P<offset>[0-9]+)){0,1}( \[inlined\] (?P<inline_symbol>.*)){0,1} at (?P<file>[^:]+):(?P<line_no>[0-9]+)(?P<column>(:[0-9]+)?), address = (?P<address>0x[0-9a-fA-F]+)$
Matched

runCmd: run
output: Process 70078 stopped
* thread #1, queue = 'com.apple.main-thread', stop reason = breakpoint 3.1
    frame #0: 0x0000000100109f64 libloadunload_d.dylib`d_init()
Process 70078 launched: '/Users/buildslave/jenkins/workspace/lldb-cmake-matrix/lldb-build/lldb-test-build.noindex/functionalities/load_unload/TestLoadUnload.test_static_init_during_load/a.out' (x86_64)


runCmd: thread list
output: Process 70078 stopped
* thread #1: tid = 0x9fe867, 0x0000000100109f64 libloadunload_d.dylib`d_init(), queue = 'com.apple.main-thread', stop reason = breakpoint 3.1


Ran command:
"thread list"

Got output:
Process 70078 stopped
* thread #1: tid = 0x9fe867, 0x0000000100109f64 libloadunload_d.dylib`d_init(), queue = 'com.apple.main-thread', stop reason = breakpoint 3.1

Expecting sub string: "stopped" (was found)
Expecting sub string: "d_init" (was found)
Expecting sub string: "stop reason = breakpoint 3" (was found)

runCmd: continue
output: Process 70078 resuming
Process 70078 stopped
* thread #1, queue = 'com.apple.main-thread', stop reason = breakpoint 2.1
    frame #0: 0x000000010013df64 libloadunload_b.dylib`b_init()


runCmd: thread list
output: Process 70078 stopped
* thread #1: tid = 0x9fe867, 0x000000010013df64 libloadunload_b.dylib`b_init(), queue = 'com.apple.main-thread', stop reason = breakpoint 2.1


Ran command:
"thread list"

Got output:
Process 70078 stopped
* thread #1: tid = 0x9fe867, 0x000000010013df64 libloadunload_b.dylib`b_init(), queue = 'com.apple.main-thread', stop reason = breakpoint 2.1

Expecting sub string: "stopped" (was found)
Expecting sub string: "b_init" (was found)
Expecting sub string: "stop reason = breakpoint 2" (was found)

runCmd: thread backtrace
output: * thread #1, queue = 'com.apple.main-thread', stop reason = breakpoint 2.1
  * frame #0: 0x000000010013df64 libloadunload_b.dylib`b_init()
    frame #1: 0x000000010013df89 libloadunload_b.dylib`__cxx_global_var_init
    frame #2: 0x000000010013dfa9 libloadunload_b.dylib`_GLOBAL__sub_I_b.cpp
    frame #3: 0x000000010001f1e3 dyld`ImageLoaderMachO::doModInitFunctions(ImageLoader::LinkContext const&) + 535
    frame #4: 0x000000010001f5ee dyld`ImageLoaderMachO::doInitialization(ImageLoader::LinkContext const&) + 40
    frame #5: 0x000000010001a00b dyld`ImageLoader::recursiveInitialization(ImageLoader::LinkContext const&, unsigned int, char const*, ImageLoader::InitializerTimingList&, ImageLoader::UninitedUpwards&) + 493
    frame #6: 0x0000000100019f76 dyld`ImageLoader::recursiveInitialization(ImageLoader::LinkContext const&, unsigned int, char const*, ImageLoader::InitializerTimingList&, ImageLoader::UninitedUpwards&) + 344
    frame #7: 0x0000000100018014 dyld`ImageLoader::processInitializers(ImageLoader::LinkContext const&, unsigned int, ImageLoader::InitializerTimingList&, ImageLoader::UninitedUpwards&) + 188
    frame #8: 0x00000001000180b4 dyld`ImageLoader::runInitializers(ImageLoader::LinkContext const&, ImageLoader::InitializerTimingList&) + 82
    frame #9: 0x0000000100009e30 dyld`dyld::runInitializers(ImageLoader*) + 82
    frame #10: 0x0000000100013dfb dyld`dlopen_internal + 609
    frame #11: 0x00007fff6ce38d8a libdyld.dylib`dlopen + 171
    frame #12: 0x0000000100000e12 a.out`dylib_open(name="loadunload_a")
    frame #13: 0x0000000100000b55 a.out`main(argc=1, argv=0x00007ffeefbff868)
    frame #14: 0x00007fff6ce4dcc9 libdyld.dylib`start + 1
    frame #15: 0x00007fff6ce4dcc9 libdyld.dylib`start + 1


Ran command:
"thread backtrace"

Got output:
* thread #1, queue = 'com.apple.main-thread', stop reason = breakpoint 2.1
  * frame #0: 0x000000010013df64 libloadunload_b.dylib`b_init()
    frame #1: 0x000000010013df89 libloadunload_b.dylib`__cxx_global_var_init
    frame #2: 0x000000010013dfa9 libloadunload_b.dylib`_GLOBAL__sub_I_b.cpp
    frame #3: 0x000000010001f1e3 dyld`ImageLoaderMachO::doModInitFunctions(ImageLoader::LinkContext const&) + 535
    frame #4: 0x000000010001f5ee dyld`ImageLoaderMachO::doInitialization(ImageLoader::LinkContext const&) + 40
    frame #5: 0x000000010001a00b dyld`ImageLoader::recursiveInitialization(ImageLoader::LinkContext const&, unsigned int, char const*, ImageLoader::InitializerTimingList&, ImageLoader::UninitedUpwards&) + 493
    frame #6: 0x0000000100019f76 dyld`ImageLoader::recursiveInitialization(ImageLoader::LinkContext const&, unsigned int, char const*, ImageLoader::InitializerTimingList&, ImageLoader::UninitedUpwards&) + 344
    frame #7: 0x0000000100018014 dyld`ImageLoader::processInitializers(ImageLoader::LinkContext const&, unsigned int, ImageLoader::InitializerTimingList&, ImageLoader::UninitedUpwards&) + 188
    frame #8: 0x00000001000180b4 dyld`ImageLoader::runInitializers(ImageLoader::LinkContext const&, ImageLoader::InitializerTimingList&) + 82
    frame #9: 0x0000000100009e30 dyld`dyld::runInitializers(ImageLoader*) + 82
    frame #10: 0x0000000100013dfb dyld`dlopen_internal + 609
    frame #11: 0x00007fff6ce38d8a libdyld.dylib`dlopen + 171
    frame #12: 0x0000000100000e12 a.out`dylib_open(name="loadunload_a")
    frame #13: 0x0000000100000b55 a.out`main(argc=1, argv=0x00007ffeefbff868)
    frame #14: 0x00007fff6ce4dcc9 libdyld.dylib`start + 1
    frame #15: 0x00007fff6ce4dcc9 libdyld.dylib`start + 1

Expecting sub string: "b_init" (was found)
Expecting sub string: "dylib_open" (was found)
Expecting sub string: "main" (was found)

runCmd: continue
output: Process 70078 resuming
Process 70078 stopped
* thread #1, queue = 'com.apple.main-thread', stop reason = breakpoint 1.1
    frame #0: 0x0000000100139f44 libloadunload_a.dylib`a_init()


runCmd: thread list
output: Process 70078 stopped
* thread #1: tid = 0x9fe867, 0x0000000100139f44 libloadunload_a.dylib`a_init(), queue = 'com.apple.main-thread', stop reason = breakpoint 1.1


Ran command:
"thread list"

Got output:
Process 70078 stopped
* thread #1: tid = 0x9fe867, 0x0000000100139f44 libloadunload_a.dylib`a_init(), queue = 'com.apple.main-thread', stop reason = breakpoint 1.1

Expecting sub string: "stopped" (was found)
Expecting sub string: "a_init" (was found)
Expecting sub string: "stop reason = breakpoint 1" (was found)

runCmd: thread backtrace
output: * thread #1, queue = 'com.apple.main-thread', stop reason = breakpoint 1.1
  * frame #0: 0x0000000100139f44 libloadunload_a.dylib`a_init()
    frame #1: 0x0000000100139f69 libloadunload_a.dylib`__cxx_global_var_init
    frame #2: 0x0000000100139f89 libloadunload_a.dylib`_GLOBAL__sub_I_a.cpp
    frame #3: 0x000000010001f1e3 dyld`ImageLoaderMachO::doModInitFunctions(ImageLoader::LinkContext const&) + 535
    frame #4: 0x000000010001f5ee dyld`ImageLoaderMachO::doInitialization(ImageLoader::LinkContext const&) + 40
    frame #5: 0x000000010001a00b dyld`ImageLoader::recursiveInitialization(ImageLoader::LinkContext const&, unsigned int, char const*, ImageLoader::InitializerTimingList&, ImageLoader::UninitedUpwards&) + 493
    frame #6: 0x0000000100018014 dyld`ImageLoader::processInitializers(ImageLoader::LinkContext const&, unsigned int, ImageLoader::InitializerTimingList&, ImageLoader::UninitedUpwards&) + 188
    frame #7: 0x00000001000180b4 dyld`ImageLoader::runInitializers(ImageLoader::LinkContext const&, ImageLoader::InitializerTimingList&) + 82
    frame #8: 0x0000000100009e30 dyld`dyld::runInitializers(ImageLoader*) + 82
    frame #9: 0x0000000100013dfb dyld`dlopen_internal + 609
    frame #10: 0x00007fff6ce38d8a libdyld.dylib`dlopen + 171
    frame #11: 0x0000000100000e12 a.out`dylib_open(name="loadunload_a")
    frame #12: 0x0000000100000b55 a.out`main(argc=1, argv=0x00007ffeefbff868)
    frame #13: 0x00007fff6ce4dcc9 libdyld.dylib`start + 1
    frame #14: 0x00007fff6ce4dcc9 libdyld.dylib`start + 1


Ran command:
"thread backtrace"

Got output:
* thread #1, queue = 'com.apple.main-thread', stop reason = breakpoint 1.1
  * frame #0: 0x0000000100139f44 libloadunload_a.dylib`a_init()
    frame #1: 0x0000000100139f69 libloadunload_a.dylib`__cxx_global_var_init
    frame #2: 0x0000000100139f89 libloadunload_a.dylib`_GLOBAL__sub_I_a.cpp
    frame #3: 0x000000010001f1e3 dyld`ImageLoaderMachO::doModInitFunctions(ImageLoader::LinkContext const&) + 535
    frame #4: 0x000000010001f5ee dyld`ImageLoaderMachO::doInitialization(ImageLoader::LinkContext const&) + 40
    frame #5: 0x000000010001a00b dyld`ImageLoader::recursiveInitialization(ImageLoader::LinkContext const&, unsigned int, char const*, ImageLoader::InitializerTimingList&, ImageLoader::UninitedUpwards&) + 493
    frame #6: 0x0000000100018014 dyld`ImageLoader::processInitializers(ImageLoader::LinkContext const&, unsigned int, ImageLoader::InitializerTimingList&, ImageLoader::UninitedUpwards&) + 188
    frame #7: 0x00000001000180b4 dyld`ImageLoader::runInitializers(ImageLoader::LinkContext const&, ImageLoader::InitializerTimingList&) + 82
    frame #8: 0x0000000100009e30 dyld`dyld::runInitializers(ImageLoader*) + 82
    frame #9: 0x0000000100013dfb dyld`dlopen_internal + 609
    frame #10: 0x00007fff6ce38d8a libdyld.dylib`dlopen + 171
    frame #11: 0x0000000100000e12 a.out`dylib_open(name="loadunload_a")
    frame #12: 0x0000000100000b55 a.out`main(argc=1, argv=0x00007ffeefbff868)
    frame #13: 0x00007fff6ce4dcc9 libdyld.dylib`start + 1
    frame #14: 0x00007fff6ce4dcc9 libdyld.dylib`start + 1

Expecting sub string: "a_init" (was found)
Expecting sub string: "dylib_open" (was found)
Expecting sub string: "main" (was found)

<bound method SBProcess.Kill of <lldb.SBProcess; proxy of <Swig Object of type 'lldb::SBProcess *' at 0x105aa4fc0> >>: success

PASS: LLDB (/Users/buildslave/jenkins/workspace/lldb-cmake-matrix/lldb-build/bin/clang-x86_64) :: test_static_init_during_load (TestLoadUnload.LoadUnloadTestCase)
runCmd: settings clear -all
output: 

runCmd: settings set symbols.enable-external-lookup false
output: 

runCmd: settings set target.inherit-tcc true
output: 

runCmd: settings set target.detach-on-error false
output: 

runCmd: settings set target.auto-apply-fixits false
output: 

runCmd: settings set plugin.process.gdb-remote.packet-timeout 60
output: 

runCmd: settings set symbols.clang-modules-cache-path "/Users/buildslave/jenkins/workspace/lldb-cmake-matrix/lldb-build/lldb-test-build.noindex/module-cache-lldb/lldb-api"
output: 

runCmd: settings set use-color false
output: 

runCmd: setting set target.prefer-dynamic-value no-dynamic-values
output: 

runCmd: settings append target.env-vars 'DYLD_LIBRARY_PATH=/Users/buildslave/jenkins/workspace/lldb-cmake-matrix/lldb-build/lldb-test-build.noindex/functionalities/load_unload/TestLoadUnload.test_step_over_load'
output: 

runCmd: settings set plugin.process.gdb-remote.use-libraries-svr4 false
output: 

runCmd: file /Users/buildslave/jenkins/workspace/lldb-cmake-matrix/lldb-build/lldb-test-build.noindex/functionalities/load_unload/TestLoadUnload.test_step_over_load/a.out
output: Current executable set to '/Users/buildslave/jenkins/workspace/lldb-cmake-matrix/lldb-build/lldb-test-build.noindex/functionalities/load_unload/TestLoadUnload.test_step_over_load/a.out' (x86_64).


runCmd: breakpoint set -f "main.cpp" -l 11
output: Breakpoint 1: no locations (pending).
WARNING:  Unable to resolve breakpoint to any actual locations.


Expecting pattern: ^Breakpoint (?P<bpno>[0-9]+): (?P<num_locations>[0-9]+) locations\.$
Not matched

Expecting pattern: ^Breakpoint (?P<bpno>[0-9]+): (?P<num_locations>no) locations \(pending\)\.
Matched

FAIL: LLDB (/Users/buildslave/jenkins/workspace/lldb-cmake-matrix/lldb-build/bin/clang-x86_64) :: test_step_over_load (TestLoadUnload.LoadUnloadTestCase)
runCmd: settings clear -all
output: 

runCmd: settings set symbols.enable-external-lookup false
output: 

runCmd: settings set target.inherit-tcc true
output: 

runCmd: settings set target.detach-on-error false
output: 

runCmd: settings set target.auto-apply-fixits false
output: 

runCmd: settings set plugin.process.gdb-remote.packet-timeout 60
output: 

runCmd: settings set symbols.clang-modules-cache-path "/Users/buildslave/jenkins/workspace/lldb-cmake-matrix/lldb-build/lldb-test-build.noindex/module-cache-lldb/lldb-api"
output: 

runCmd: settings set use-color false
output: 

runCmd: setting set target.prefer-dynamic-value no-dynamic-values
output: 

runCmd: settings append target.env-vars 'DYLD_LIBRARY_PATH=/Users/buildslave/jenkins/workspace/lldb-cmake-matrix/lldb-build/lldb-test-build.noindex/functionalities/load_unload/TestLoadUnload.test_step_over_load_with_svr4'
output: 

runCmd: settings set plugin.process.gdb-remote.use-libraries-svr4 true
output: 

runCmd: file /Users/buildslave/jenkins/workspace/lldb-cmake-matrix/lldb-build/lldb-test-build.noindex/functionalities/load_unload/TestLoadUnload.test_step_over_load_with_svr4/a.out
output: Current executable set to '/Users/buildslave/jenkins/workspace/lldb-cmake-matrix/lldb-build/lldb-test-build.noindex/functionalities/load_unload/TestLoadUnload.test_step_over_load_with_svr4/a.out' (x86_64).


runCmd: breakpoint set -f "main.cpp" -l 11
output: Breakpoint 1: no locations (pending).
WARNING:  Unable to resolve breakpoint to any actual locations.


Expecting pattern: ^Breakpoint (?P<bpno>[0-9]+): (?P<num_locations>[0-9]+) locations\.$
Not matched

Expecting pattern: ^Breakpoint (?P<bpno>[0-9]+): (?P<num_locations>no) locations \(pending\)\.
Matched

FAIL: LLDB (/Users/buildslave/jenkins/workspace/lldb-cmake-matrix/lldb-build/bin/clang-x86_64) :: test_step_over_load_with_svr4 (TestLoadUnload.LoadUnloadTestCase)
Restore dir to: /Users/buildslave/jenkins/workspace/lldb-cmake-matrix/lldb-build/tools/lldb/test
======================================================================
FAIL: test_dyld_library_path (TestLoadUnload.LoadUnloadTestCase)
   Test (DY)LD_LIBRARY_PATH after moving libd.dylib, which defines d_function, somewhere else.
----------------------------------------------------------------------
Traceback (most recent call last):
  File "/Users/buildslave/jenkins/workspace/lldb-cmake-matrix/llvm-project/lldb/packages/Python/lldbsuite/test/decorators.py", line 119, in wrapper
    func(*args, **kwargs)
  File "/Users/buildslave/jenkins/workspace/lldb-cmake-matrix/llvm-project/lldb/packages/Python/lldbsuite/test/decorators.py", line 119, in wrapper
    func(*args, **kwargs)
  File "/Users/buildslave/jenkins/workspace/lldb-cmake-matrix/llvm-project/lldb/test/API/functionalities/load_unload/TestLoadUnload.py", line 187, in test_dyld_library_path
    self, "d.cpp", self.line_d_function, num_expected_locations=1)
  File "/Users/buildslave/jenkins/workspace/lldb-cmake-matrix/llvm-project/lldb/packages/Python/lldbsuite/test/lldbutil.py", line 426, in run_break_set_by_file_and_line
    num_locations=num_expected_locations)
  File "/Users/buildslave/jenkins/workspace/lldb-cmake-matrix/llvm-project/lldb/packages/Python/lldbsuite/test/lldbutil.py", line 647, in check_breakpoint_result
    out_num_locations))
AssertionError: False is not True : Expecting 1 locations, got 0.
Config=x86_64-/Users/buildslave/jenkins/workspace/lldb-cmake-matrix/lldb-build/bin/clang
======================================================================
FAIL: test_lldb_process_load_and_unload_commands (TestLoadUnload.LoadUnloadTestCase)
----------------------------------------------------------------------
Traceback (most recent call last):
  File "/Users/buildslave/jenkins/workspace/lldb-cmake-matrix/llvm-project/lldb/packages/Python/lldbsuite/test/decorators.py", line 119, in wrapper
    func(*args, **kwargs)
  File "/Users/buildslave/jenkins/workspace/lldb-cmake-matrix/llvm-project/lldb/packages/Python/lldbsuite/test/decorators.py", line 119, in wrapper
    func(*args, **kwargs)
  File "/Users/buildslave/jenkins/workspace/lldb-cmake-matrix/llvm-project/lldb/test/API/functionalities/load_unload/TestLoadUnload.py", line 209, in test_lldb_process_load_and_unload_commands
    self.run_lldb_process_load_and_unload_commands()
  File "/Users/buildslave/jenkins/workspace/lldb-cmake-matrix/llvm-project/lldb/test/API/functionalities/load_unload/TestLoadUnload.py", line 232, in run_lldb_process_load_and_unload_commands
    self, "main.cpp", self.line, num_expected_locations=1, loc_exact=True)
  File "/Users/buildslave/jenkins/workspace/lldb-cmake-matrix/llvm-project/lldb/packages/Python/lldbsuite/test/lldbutil.py", line 421, in run_break_set_by_file_and_line
    module_name=module_name)
  File "/Users/buildslave/jenkins/workspace/lldb-cmake-matrix/llvm-project/lldb/packages/Python/lldbsuite/test/lldbutil.py", line 647, in check_breakpoint_result
    out_num_locations))
AssertionError: False is not True : Expecting 1 locations, got 0.
Config=x86_64-/Users/buildslave/jenkins/workspace/lldb-cmake-matrix/lldb-build/bin/clang
======================================================================
FAIL: test_lldb_process_load_and_unload_commands_with_svr4 (TestLoadUnload.LoadUnloadTestCase)
----------------------------------------------------------------------
Traceback (most recent call last):
  File "/Users/buildslave/jenkins/workspace/lldb-cmake-matrix/llvm-project/lldb/packages/Python/lldbsuite/test/decorators.py", line 119, in wrapper
    func(*args, **kwargs)
  File "/Users/buildslave/jenkins/workspace/lldb-cmake-matrix/llvm-project/lldb/packages/Python/lldbsuite/test/decorators.py", line 119, in wrapper
    func(*args, **kwargs)
  File "/Users/buildslave/jenkins/workspace/lldb-cmake-matrix/llvm-project/lldb/test/API/functionalities/load_unload/TestLoadUnload.py", line 218, in test_lldb_process_load_and_unload_commands_with_svr4
    self.run_lldb_process_load_and_unload_commands()
  File "/Users/buildslave/jenkins/workspace/lldb-cmake-matrix/llvm-project/lldb/test/API/functionalities/load_unload/TestLoadUnload.py", line 232, in run_lldb_process_load_and_unload_commands
    self, "main.cpp", self.line, num_expected_locations=1, loc_exact=True)
  File "/Users/buildslave/jenkins/workspace/lldb-cmake-matrix/llvm-project/lldb/packages/Python/lldbsuite/test/lldbutil.py", line 421, in run_break_set_by_file_and_line
    module_name=module_name)
  File "/Users/buildslave/jenkins/workspace/lldb-cmake-matrix/llvm-project/lldb/packages/Python/lldbsuite/test/lldbutil.py", line 647, in check_breakpoint_result
    out_num_locations))
AssertionError: False is not True : Expecting 1 locations, got 0.
Config=x86_64-/Users/buildslave/jenkins/workspace/lldb-cmake-matrix/lldb-build/bin/clang
======================================================================
FAIL: test_load_unload (TestLoadUnload.LoadUnloadTestCase)
----------------------------------------------------------------------
Traceback (most recent call last):
  File "/Users/buildslave/jenkins/workspace/lldb-cmake-matrix/llvm-project/lldb/packages/Python/lldbsuite/test/decorators.py", line 119, in wrapper
    func(*args, **kwargs)
  File "/Users/buildslave/jenkins/workspace/lldb-cmake-matrix/llvm-project/lldb/test/API/functionalities/load_unload/TestLoadUnload.py", line 294, in test_load_unload
    self.run_load_unload()
  File "/Users/buildslave/jenkins/workspace/lldb-cmake-matrix/llvm-project/lldb/test/API/functionalities/load_unload/TestLoadUnload.py", line 318, in run_load_unload
    'stop reason = breakpoint'])
  File "/Users/buildslave/jenkins/workspace/lldb-cmake-matrix/llvm-project/lldb/packages/Python/lldbsuite/test/lldbtest.py", line 2566, in expect
    self.fail(log_msg)
AssertionError: Ran command:
"thread list"

Got output:
Process 69851 stopped
* thread #1: tid = 0x9fe5ab, 0x0000000100139f44 libloadunload_a.dylib`a_init(), queue = 'com.apple.main-thread', stop reason = breakpoint 1.1

Expecting sub string: "stopped" (was found)
Expecting sub string: "a_function" (was not found)
Process should be stopped due to breakpoint
Config=x86_64-/Users/buildslave/jenkins/workspace/lldb-cmake-matrix/lldb-build/bin/clang
======================================================================
FAIL: test_load_unload_with_svr4 (TestLoadUnload.LoadUnloadTestCase)
----------------------------------------------------------------------
Traceback (most recent call last):
  File "/Users/buildslave/jenkins/workspace/lldb-cmake-matrix/llvm-project/lldb/packages/Python/lldbsuite/test/decorators.py", line 119, in wrapper
    func(*args, **kwargs)
  File "/Users/buildslave/jenkins/workspace/lldb-cmake-matrix/llvm-project/lldb/test/API/functionalities/load_unload/TestLoadUnload.py", line 299, in test_load_unload_with_svr4
    self.run_load_unload()
  File "/Users/buildslave/jenkins/workspace/lldb-cmake-matrix/llvm-project/lldb/test/API/functionalities/load_unload/TestLoadUnload.py", line 318, in run_load_unload
    'stop reason = breakpoint'])
  File "/Users/buildslave/jenkins/workspace/lldb-cmake-matrix/llvm-project/lldb/packages/Python/lldbsuite/test/lldbtest.py", line 2566, in expect
    self.fail(log_msg)
AssertionError: Ran command:
"thread list"

Got output:
Process 69936 stopped
* thread #1: tid = 0x9fe6d2, 0x0000000100139f44 libloadunload_a.dylib`a_init(), queue = 'com.apple.main-thread', stop reason = breakpoint 1.1

Expecting sub string: "stopped" (was found)
Expecting sub string: "a_function" (was not found)
Process should be stopped due to breakpoint
Config=x86_64-/Users/buildslave/jenkins/workspace/lldb-cmake-matrix/lldb-build/bin/clang
======================================================================
FAIL: test_step_over_load (TestLoadUnload.LoadUnloadTestCase)
----------------------------------------------------------------------
Traceback (most recent call last):
  File "/Users/buildslave/jenkins/workspace/lldb-cmake-matrix/llvm-project/lldb/test/API/functionalities/load_unload/TestLoadUnload.py", line 341, in test_step_over_load
    self.run_step_over_load()
  File "/Users/buildslave/jenkins/workspace/lldb-cmake-matrix/llvm-project/lldb/test/API/functionalities/load_unload/TestLoadUnload.py", line 356, in run_step_over_load
    self, "main.cpp", self.line, num_expected_locations=1, loc_exact=True)
  File "/Users/buildslave/jenkins/workspace/lldb-cmake-matrix/llvm-project/lldb/packages/Python/lldbsuite/test/lldbutil.py", line 421, in run_break_set_by_file_and_line
    module_name=module_name)
  File "/Users/buildslave/jenkins/workspace/lldb-cmake-matrix/llvm-project/lldb/packages/Python/lldbsuite/test/lldbutil.py", line 647, in check_breakpoint_result
    out_num_locations))
AssertionError: False is not True : Expecting 1 locations, got 0.
Config=x86_64-/Users/buildslave/jenkins/workspace/lldb-cmake-matrix/lldb-build/bin/clang
======================================================================
FAIL: test_step_over_load_with_svr4 (TestLoadUnload.LoadUnloadTestCase)
----------------------------------------------------------------------
Traceback (most recent call last):
  File "/Users/buildslave/jenkins/workspace/lldb-cmake-matrix/llvm-project/lldb/test/API/functionalities/load_unload/TestLoadUnload.py", line 345, in test_step_over_load_with_svr4
    self.run_step_over_load()
  File "/Users/buildslave/jenkins/workspace/lldb-cmake-matrix/llvm-project/lldb/test/API/functionalities/load_unload/TestLoadUnload.py", line 356, in run_step_over_load
    self, "main.cpp", self.line, num_expected_locations=1, loc_exact=True)
  File "/Users/buildslave/jenkins/workspace/lldb-cmake-matrix/llvm-project/lldb/packages/Python/lldbsuite/test/lldbutil.py", line 421, in run_break_set_by_file_and_line
    module_name=module_name)
  File "/Users/buildslave/jenkins/workspace/lldb-cmake-matrix/llvm-project/lldb/packages/Python/lldbsuite/test/lldbutil.py", line 647, in check_breakpoint_result
    out_num_locations))
AssertionError: False is not True : Expecting 1 locations, got 0.
Config=x86_64-/Users/buildslave/jenkins/workspace/lldb-cmake-matrix/lldb-build/bin/clang
----------------------------------------------------------------------
Ran 9 tests in 10.101s

RESULT: FAILED (2 passes, 7 failures, 0 errors, 0 skipped, 0 expected failures, 0 unexpected successes)

--

********************
FAIL: lldb-api :: commands/gui/basicdebug/TestGuiBasicDebug.py (2258 of 2261)
******************** TEST 'lldb-api :: commands/gui/basicdebug/TestGuiBasicDebug.py' FAILED ********************
Script:
--
/usr/local/Frameworks/Python.framework/Versions/3.7/bin/python3.7 /Users/buildslave/jenkins/workspace/lldb-cmake-matrix/llvm-project/lldb/test/API/dotest.py -u CXXFLAGS -u CFLAGS --codesign-identity lldb_codesign --arch x86_64 --build-dir /Users/buildslave/jenkins/workspace/lldb-cmake-matrix/lldb-build/lldb-test-build.noindex -t --env TERM=vt100 --skip-category gmodules --skip-category watchpoint --arch=x86_64 --dwarf-version=5 --env LLVM_LIBS_DIR=/Users/buildslave/jenkins/workspace/lldb-cmake-matrix/lldb-build/./lib --arch x86_64 --build-dir /Users/buildslave/jenkins/workspace/lldb-cmake-matrix/lldb-build/lldb-test-build.noindex --lldb-module-cache-dir /Users/buildslave/jenkins/workspace/lldb-cmake-matrix/lldb-build/lldb-test-build.noindex/module-cache-lldb/lldb-api --clang-module-cache-dir /Users/buildslave/jenkins/workspace/lldb-cmake-matrix/lldb-build/lldb-test-build.noindex/module-cache-clang/lldb-api --executable /Users/buildslave/jenkins/workspace/lldb-cmake-matrix/lldb-build/./bin/lldb --compiler /Users/buildslave/jenkins/workspace/lldb-cmake-matrix/lldb-build/./bin/clang --dsymutil /Users/buildslave/jenkins/workspace/lldb-cmake-matrix/lldb-build/./bin/dsymutil --llvm-tools-dir /Users/buildslave/jenkins/workspace/lldb-cmake-matrix/lldb-build/./bin --lldb-libs-dir /Users/buildslave/jenkins/workspace/lldb-cmake-matrix/lldb-build/./lib /Users/buildslave/jenkins/workspace/lldb-cmake-matrix/llvm-project/lldb/test/API/commands/gui/basicdebug -p TestGuiBasicDebug.py
--
Exit Code: 1

Command Output (stdout):
--
lldb version 13.0.99 (http://labmaster3.local/git/llvm-project.git revision 532d4814ac8e2594c3a5d93338cd9f6b9b391e47)
  clang revision 532d4814ac8e2594c3a5d93338cd9f6b9b391e47
  llvm revision 532d4814ac8e2594c3a5d93338cd9f6b9b391e47
(lldb) settings clear -all
(lldb) settings set symbols.enable-external-lookup false
(lldb) settings set target.inherit-tcc true
(lldb) settings set target.detach-on-error false
(lldb) settings set target.auto-apply-fixits false
(lldb) settings set plugin.process.gdb-remote.packet-timeout 60
(lldb) settings set symbols.clang-modules-cache-path "/Users/buildslave/jenkins/workspace/lldb-cmake-matrix/lldb-build/lldb-test-build.noindex/module-cache-lldb/lldb-api"
(lldb) settings set use-color false
(lldb) setting set target.prefer-dynamic-value no-dynamic-values
(lldb) target create "/Users/buildslave/jenkins/workspace/lldb-cmake-matrix/lldb-build/lldb-test-build.noindex/commands/gui/basicdebug/TestGuiBasicDebug.test_gui/a.out"
Current executable set to '/Users/buildslave/jenkins/workspace/lldb-cmake-matrix/lldb-build/lldb-test-build.noindex/commands/gui/basicdebug/TestGuiBasicDebug.test_gui/a.out' (x86_64).
(lldb) br set -f main.c -p "// Break here"
br set -f main.c -p "// Break here"
Breakpoint 1: no locations (pending).
WARNING:  Unable to resolve breakpoint to any actual locations.
(lldb) settings set interpreter.prompt-on-quit false
quit
settings set interpreter.prompt-on-quit false
(lldb) quit
libstdcxx tests will not be run because: Don't know how to build with libstdcxx on macosx
Skipping following debug info categories: ['dwo']

--
Command Output (stderr):
--
Change dir to: /Users/buildslave/jenkins/workspace/lldb-cmake-matrix/llvm-project/lldb/test/API/commands/gui/basicdebug
runCmd: settings clear -all
output: 

runCmd: settings set symbols.enable-external-lookup false
output: 

runCmd: settings set target.inherit-tcc true
output: 

runCmd: settings set target.detach-on-error false
output: 

runCmd: settings set target.auto-apply-fixits false
output: 

runCmd: settings set plugin.process.gdb-remote.packet-timeout 60
output: 

runCmd: settings set symbols.clang-modules-cache-path "/Users/buildslave/jenkins/workspace/lldb-cmake-matrix/lldb-build/lldb-test-build.noindex/module-cache-lldb/lldb-api"
output: 

runCmd: settings set use-color false
output: 

runCmd: setting set target.prefer-dynamic-value no-dynamic-values
output: 

FAIL: LLDB (/Users/buildslave/jenkins/workspace/lldb-cmake-matrix/lldb-build/bin/clang-x86_64) :: test_gui (TestGuiBasicDebug.TestGuiBasicDebugCommandTest)
tearing down the child process....

Restore dir to: /Users/buildslave/jenkins/workspace/lldb-cmake-matrix/lldb-build/tools/lldb/test
======================================================================
ERROR: test_gui (TestGuiBasicDebug.TestGuiBasicDebugCommandTest)
----------------------------------------------------------------------
Traceback (most recent call last):
  File "/Users/buildslave/jenkins/workspace/lldb-cmake-matrix/llvm-project/lldb/third_party/Python/module/pexpect-4.6/pexpect/expect.py", line 111, in expect_loop
    incoming = spawn.read_nonblocking(spawn.maxread, timeout)
  File "/Users/buildslave/jenkins/workspace/lldb-cmake-matrix/llvm-project/lldb/third_party/Python/module/pexpect-4.6/pexpect/pty_spawn.py", line 482, in read_nonblocking
    raise TIMEOUT('Timeout exceeded.')
pexpect.exceptions.TIMEOUT: Timeout exceeded.

During handling of the above exception, another exception occurred:

Traceback (most recent call last):
  File "/Users/buildslave/jenkins/workspace/lldb-cmake-matrix/llvm-project/lldb/packages/Python/lldbsuite/test/decorators.py", line 149, in wrapper
    return func(*args, **kwargs)
  File "/Users/buildslave/jenkins/workspace/lldb-cmake-matrix/llvm-project/lldb/test/API/commands/gui/basicdebug/TestGuiBasicDebug.py", line 22, in test_gui
    self.expect('br set -f main.c -p "// Break here"', substrs=["Breakpoint 1", "address ="])
  File "/Users/buildslave/jenkins/workspace/lldb-cmake-matrix/llvm-project/lldb/packages/Python/lldbsuite/test/lldbpexpect.py", line 64, in expect
    self.child.expect_exact(s)
  File "/Users/buildslave/jenkins/workspace/lldb-cmake-matrix/llvm-project/lldb/third_party/Python/module/pexpect-4.6/pexpect/spawnbase.py", line 418, in expect_exact
    return exp.expect_loop(timeout)
  File "/Users/buildslave/jenkins/workspace/lldb-cmake-matrix/llvm-project/lldb/third_party/Python/module/pexpect-4.6/pexpect/expect.py", line 119, in expect_loop
    return self.timeout(e)
  File "/Users/buildslave/jenkins/workspace/lldb-cmake-matrix/llvm-project/lldb/third_party/Python/module/pexpect-4.6/pexpect/expect.py", line 82, in timeout
    raise TIMEOUT(msg)
pexpect.exceptions.TIMEOUT: Timeout exceeded.
<pexpect.pty_spawn.spawn object at 0x11248aa20>
command: /Users/buildslave/jenkins/workspace/lldb-cmake-matrix/lldb-build/bin/lldb
args: ['/Users/buildslave/jenkins/workspace/lldb-cmake-matrix/lldb-build/bin/lldb', '--no-lldbinit', '--no-use-colors', '-O', 'settings clear -all', '-O', 'settings set symbols.enable-external-lookup false', '-O', 'settings set target.inherit-tcc true', '-O', 'settings set target.detach-on-error false', '-O', 'settings set target.auto-apply-fixits false', '-O', 'settings set plugin.process.gdb-remote.packet-timeout 60', '-O', 'settings set symbols.clang-modules-cache-path "/Users/buildslave/jenkins/workspace/lldb-cmake-matrix/lldb-build/lldb-test-build.noindex/module-cache-lldb/lldb-api"', '-O', 'settings set use-color false', '-O', 'setting set target.prefer-dynamic-value no-dynamic-values', '--file', '/Users/buildslave/jenkins/workspace/lldb-cmake-matrix/lldb-build/lldb-test-build.noindex/commands/gui/basicdebug/TestGuiBasicDebug.test_gui/a.out']
buffer (last 100 chars): b': no locations (pending).\r\nWARNING:  Unable to resolve breakpoint to any actual locations.\r\n(lldb) '
before (last 100 chars): b': no locations (pending).\r\nWARNING:  Unable to resolve breakpoint to any actual locations.\r\n(lldb) '
after: <class 'pexpect.exceptions.TIMEOUT'>
match: None
match_index: None
exitstatus: None
flag_eof: False
pid: 69155
child_fd: 6
closed: False
timeout: 30
delimiter: <class 'pexpect.exceptions.EOF'>
logfile: <_io.BufferedWriter name='<stdout>'>
logfile_read: None
logfile_send: None
maxread: 2000
ignorecase: False
searchwindowsize: None
delaybeforesend: 0.05
delayafterclose: 0.1
delayafterterminate: 0.1
searcher: searcher_string:
    0: b'address ='
Config=x86_64-/Users/buildslave/jenkins/workspace/lldb-cmake-matrix/lldb-build/bin/clang
----------------------------------------------------------------------
Ran 1 test in 30.810s

RESULT: FAILED (0 passes, 0 failures, 1 errors, 0 skipped, 0 expected failures, 0 unexpected successes)

--

********************
TIMEOUT: lldb-api :: commands/expression/persistent_ptr_update/TestPersistentPtrUpdate.py (2259 of 2261)
******************** TEST 'lldb-api :: commands/expression/persistent_ptr_update/TestPersistentPtrUpdate.py' FAILED ********************
Script:
--
/usr/local/Frameworks/Python.framework/Versions/3.7/bin/python3.7 /Users/buildslave/jenkins/workspace/lldb-cmake-matrix/llvm-project/lldb/test/API/dotest.py -u CXXFLAGS -u CFLAGS --codesign-identity lldb_codesign --arch x86_64 --build-dir /Users/buildslave/jenkins/workspace/lldb-cmake-matrix/lldb-build/lldb-test-build.noindex -t --env TERM=vt100 --skip-category gmodules --skip-category watchpoint --arch=x86_64 --dwarf-version=5 --env LLVM_LIBS_DIR=/Users/buildslave/jenkins/workspace/lldb-cmake-matrix/lldb-build/./lib --arch x86_64 --build-dir /Users/buildslave/jenkins/workspace/lldb-cmake-matrix/lldb-build/lldb-test-build.noindex --lldb-module-cache-dir /Users/buildslave/jenkins/workspace/lldb-cmake-matrix/lldb-build/lldb-test-build.noindex/module-cache-lldb/lldb-api --clang-module-cache-dir /Users/buildslave/jenkins/workspace/lldb-cmake-matrix/lldb-build/lldb-test-build.noindex/module-cache-clang/lldb-api --executable /Users/buildslave/jenkins/workspace/lldb-cmake-matrix/lldb-build/./bin/lldb --compiler /Users/buildslave/jenkins/workspace/lldb-cmake-matrix/lldb-build/./bin/clang --dsymutil /Users/buildslave/jenkins/workspace/lldb-cmake-matrix/lldb-build/./bin/dsymutil --llvm-tools-dir /Users/buildslave/jenkins/workspace/lldb-cmake-matrix/lldb-build/./bin --lldb-libs-dir /Users/buildslave/jenkins/workspace/lldb-cmake-matrix/lldb-build/./lib /Users/buildslave/jenkins/workspace/lldb-cmake-matrix/llvm-project/lldb/test/API/commands/expression/persistent_ptr_update -p TestPersistentPtrUpdate.py
--
Exit Code: -9
Timeout: Reached timeout of 600 seconds

Command Output (stdout):
--
lldb version 13.0.99 (http://labmaster3.local/git/llvm-project.git revision 532d4814ac8e2594c3a5d93338cd9f6b9b391e47)
  clang revision 532d4814ac8e2594c3a5d93338cd9f6b9b391e47
  llvm revision 532d4814ac8e2594c3a5d93338cd9f6b9b391e47

--

********************
TIMEOUT: lldb-api :: python_api/lldbutil/iter/TestLLDBIterator.py (2260 of 2261)
******************** TEST 'lldb-api :: python_api/lldbutil/iter/TestLLDBIterator.py' FAILED ********************
Script:
--
/usr/local/Frameworks/Python.framework/Versions/3.7/bin/python3.7 /Users/buildslave/jenkins/workspace/lldb-cmake-matrix/llvm-project/lldb/test/API/dotest.py -u CXXFLAGS -u CFLAGS --codesign-identity lldb_codesign --arch x86_64 --build-dir /Users/buildslave/jenkins/workspace/lldb-cmake-matrix/lldb-build/lldb-test-build.noindex -t --env TERM=vt100 --skip-category gmodules --skip-category watchpoint --arch=x86_64 --dwarf-version=5 --env LLVM_LIBS_DIR=/Users/buildslave/jenkins/workspace/lldb-cmake-matrix/lldb-build/./lib --arch x86_64 --build-dir /Users/buildslave/jenkins/workspace/lldb-cmake-matrix/lldb-build/lldb-test-build.noindex --lldb-module-cache-dir /Users/buildslave/jenkins/workspace/lldb-cmake-matrix/lldb-build/lldb-test-build.noindex/module-cache-lldb/lldb-api --clang-module-cache-dir /Users/buildslave/jenkins/workspace/lldb-cmake-matrix/lldb-build/lldb-test-build.noindex/module-cache-clang/lldb-api --executable /Users/buildslave/jenkins/workspace/lldb-cmake-matrix/lldb-build/./bin/lldb --compiler /Users/buildslave/jenkins/workspace/lldb-cmake-matrix/lldb-build/./bin/clang --dsymutil /Users/buildslave/jenkins/workspace/lldb-cmake-matrix/lldb-build/./bin/dsymutil --llvm-tools-dir /Users/buildslave/jenkins/workspace/lldb-cmake-matrix/lldb-build/./bin --lldb-libs-dir /Users/buildslave/jenkins/workspace/lldb-cmake-matrix/lldb-build/./lib /Users/buildslave/jenkins/workspace/lldb-cmake-matrix/llvm-project/lldb/test/API/python_api/lldbutil/iter -p TestLLDBIterator.py
--
Exit Code: -9
Timeout: Reached timeout of 600 seconds

Command Output (stdout):
--
lldb version 13.0.99 (http://labmaster3.local/git/llvm-project.git revision 532d4814ac8e2594c3a5d93338cd9f6b9b391e47)
  clang revision 532d4814ac8e2594c3a5d93338cd9f6b9b391e47
  llvm revision 532d4814ac8e2594c3a5d93338cd9f6b9b391e47

--
Command Output (stderr):
--
error: a.out Failed to extract range list table at offset 0xc: parsing .debug_rnglists table at offset 0x0: unexpected end of data at offset 0x0 while reading [0x0, 0x4)
error: main.o Failed to extract range list table at offset 0xc: parsing .debug_rnglists table at offset 0x0: unexpected end of data at offset 0x0 while reading [0x0, 0x4)
error: a.out Failed to extract range list table at offset 0xc: parsing .debug_rnglists table at offset 0x0: unexpected end of data at offset 0x0 while reading [0x0, 0x4)

--

********************
TIMEOUT: lldb-api :: python_api/lldbutil/iter/TestRegistersIterator.py (2261 of 2261)
******************** TEST 'lldb-api :: python_api/lldbutil/iter/TestRegistersIterator.py' FAILED ********************
Script:
--
/usr/local/Frameworks/Python.framework/Versions/3.7/bin/python3.7 /Users/buildslave/jenkins/workspace/lldb-cmake-matrix/llvm-project/lldb/test/API/dotest.py -u CXXFLAGS -u CFLAGS --codesign-identity lldb_codesign --arch x86_64 --build-dir /Users/buildslave/jenkins/workspace/lldb-cmake-matrix/lldb-build/lldb-test-build.noindex -t --env TERM=vt100 --skip-category gmodules --skip-category watchpoint --arch=x86_64 --dwarf-version=5 --env LLVM_LIBS_DIR=/Users/buildslave/jenkins/workspace/lldb-cmake-matrix/lldb-build/./lib --arch x86_64 --build-dir /Users/buildslave/jenkins/workspace/lldb-cmake-matrix/lldb-build/lldb-test-build.noindex --lldb-module-cache-dir /Users/buildslave/jenkins/workspace/lldb-cmake-matrix/lldb-build/lldb-test-build.noindex/module-cache-lldb/lldb-api --clang-module-cache-dir /Users/buildslave/jenkins/workspace/lldb-cmake-matrix/lldb-build/lldb-test-build.noindex/module-cache-clang/lldb-api --executable /Users/buildslave/jenkins/workspace/lldb-cmake-matrix/lldb-build/./bin/lldb --compiler /Users/buildslave/jenkins/workspace/lldb-cmake-matrix/lldb-build/./bin/clang --dsymutil /Users/buildslave/jenkins/workspace/lldb-cmake-matrix/lldb-build/./bin/dsymutil --llvm-tools-dir /Users/buildslave/jenkins/workspace/lldb-cmake-matrix/lldb-build/./bin --lldb-libs-dir /Users/buildslave/jenkins/workspace/lldb-cmake-matrix/lldb-build/./lib /Users/buildslave/jenkins/workspace/lldb-cmake-matrix/llvm-project/lldb/test/API/python_api/lldbutil/iter -p TestRegistersIterator.py
--
Exit Code: -9
Timeout: Reached timeout of 600 seconds

Command Output (stdout):
--
lldb version 13.0.99 (http://labmaster3.local/git/llvm-project.git revision 532d4814ac8e2594c3a5d93338cd9f6b9b391e47)
  clang revision 532d4814ac8e2594c3a5d93338cd9f6b9b391e47
  llvm revision 532d4814ac8e2594c3a5d93338cd9f6b9b391e47

--
Command Output (stderr):
--
error: a.out Failed to extract range list table at offset 0xc: parsing .debug_rnglists table at offset 0x0: unexpected end of data at offset 0x0 while reading [0x0, 0x4)

--

********************
Slowest Tests:
--------------------------------------------------------------------------
600.00s: lldb-api :: commands/expression/persistent_ptr_update/TestPersistentPtrUpdate.py
600.00s: lldb-api :: python_api/lldbutil/iter/TestRegistersIterator.py
599.99s: lldb-api :: python_api/lldbutil/iter/TestLLDBIterator.py
96.68s: lldb-api :: driver/batch_mode/TestBatchMode.py
81.96s: lldb-api :: tools/lldb-server/TestLldbGdbServer.py
78.59s: lldb-api :: lang/objc/foundation/TestFoundationDisassembly.py
67.65s: lldb-api :: api/multithreaded/TestMultithreaded.py
66.98s: lldb-api :: macosx/nslog/TestDarwinNSLogOutput.py
35.02s: lldb-api :: lang/objc/hidden-ivars/TestHiddenIvars.py
34.36s: lldb-api :: lang/objc/foundation/TestObjCMethods.py
32.64s: lldb-api :: commands/process/attach-resume/TestAttachResume.py
32.37s: lldb-api :: commands/expression/multiline-completion/TestMultilineCompletion.py
32.21s: lldb-api :: python_api/target/TestTargetAPI.py
32.09s: lldb-api :: functionalities/completion/TestCompletion.py
31.95s: lldb-api :: tools/lldb-server/TestGdbRemoteThreadsInStopReply.py
31.63s: lldb-api :: commands/gui/breakpoints/TestGuiBreakpoints.py
31.32s: lldb-api :: commands/gui/viewlarge/TestGuiViewLarge.py
31.30s: lldb-api :: commands/gui/basic/TestGuiBasic.py
31.26s: lldb-api :: commands/gui/basicdebug/TestGuiBasicDebug.py
26.28s: lldb-api :: lang/objc/exceptions/TestObjCExceptions.py

Tests Times:
--------------------------------------------------------------------------
[   Range   ] :: [               Percentage               ] :: [  Count  ]
--------------------------------------------------------------------------
[550s,600s) :: [                                        ] :: [   3/2261]
[500s,550s) :: [                                        ] :: [   0/2261]
[450s,500s) :: [                                        ] :: [   0/2261]
[400s,450s) :: [                                        ] :: [   0/2261]
[350s,400s) :: [                                        ] :: [   0/2261]
[300s,350s) :: [                                        ] :: [   0/2261]
[250s,300s) :: [                                        ] :: [   0/2261]
[200s,250s) :: [                                        ] :: [   0/2261]
[150s,200s) :: [                                        ] :: [   0/2261]
[100s,150s) :: [                                        ] :: [   0/2261]
[ 50s,100s) :: [                                        ] :: [   5/2261]
[  0s, 50s) :: [*************************************** ] :: [2253/2261]
--------------------------------------------------------------------------
********************
Timed Out Tests (3):
  lldb-api :: commands/expression/persistent_ptr_update/TestPersistentPtrUpdate.py
  lldb-api :: python_api/lldbutil/iter/TestLLDBIterator.py
  lldb-api :: python_api/lldbutil/iter/TestRegistersIterator.py

********************
Failed Tests (572):
  lldb-api :: lang/c/stepping/TestStepAndBreakpoints.py
  lldb-api :: commands/gui/breakpoints/TestGuiBreakpoints.py
  lldb-api :: commands/frame/diagnose/dereference-this/TestDiagnoseDereferenceThis.py
  lldb-api :: functionalities/data-formatter/data-formatter-objc/TestDataFormatterObjNSException.py
  lldb-api :: commands/expression/persistent_variables/TestPersistentVariables.py
  lldb-api :: python_api/formatters/TestFormattersSBAPI.py
  lldb-api :: commands/expression/weak_symbols/TestWeakSymbols.py
  lldb-api :: commands/expression/import-std-module/list/TestListFromStdModule.py
  lldb-api :: functionalities/breakpoint/breakpoint_command/TestBreakpointCommand.py
  lldb-api :: python_api/signals/TestSignalsAPI.py
  lldb-api :: lang/objcxx/class-name-clash/TestNameClash.py
  lldb-api :: functionalities/thread/concurrent_events/TestConcurrentCrashWithSignal.py
  lldb-api :: lang/objc/variadic_methods/TestVariadicMethods.py
  lldb-api :: functionalities/param_entry_vals/basic_entry_values/TestBasicEntryValues.py
  lldb-api :: commands/command/script/TestCommandScript.py
  lldb-api :: lang/objc/modules/TestObjCModules.py
  lldb-api :: lang/cpp/type_lookup/TestCppTypeLookup.py
  lldb-api :: lang/cpp/class-template-non-type-parameter-pack/TestClassTemplateNonTypeParameterPack.py
  lldb-api :: functionalities/signal/handle-abrt/TestHandleAbort.py
  lldb-api :: commands/expression/import_base_class_when_class_has_derived_member/TestImportBaseClassWhenClassHasDerivedMember.py
  lldb-api :: functionalities/exec/TestExec.py
  lldb-api :: functionalities/thread/state_after_expression/TestStateAfterExpression.py
  lldb-api :: commands/expression/import-std-module/array/TestArrayFromStdModule.py
  lldb-api :: functionalities/data-formatter/hexcaps/TestDataFormatterHexCaps.py
  lldb-api :: functionalities/breakpoint/breakpoint_by_line_and_column/TestBreakpointByLineAndColumn.py
  lldb-api :: commands/expression/options/TestExprOptions.py
  lldb-api :: commands/frame/diagnose/dereference-function-return/TestDiagnoseDereferenceFunctionReturn.py
  lldb-api :: commands/expression/expr-in-syscall/TestExpressionInSyscall.py
  lldb-api :: commands/expression/import-std-module/deque-dbg-info-content/TestDbgInfoContentDequeFromStdModule.py
  lldb-api :: lang/cpp/bool/TestCPPBool.py
  lldb-api :: functionalities/data-formatter/data-formatter-stl/libcxx/unordered/TestDataFormatterUnordered.py
  lldb-api :: python_api/get-value-32bit-int/TestGetValue32BitInt.py
  lldb-api :: commands/expression/codegen-crash-typedefdecl-not-in_declcontext/TestCodegenCrashTypedefDeclNotInDeclContext.py
  lldb-api :: functionalities/data-formatter/data-formatter-proper-plurals/TestFormattersOneIsSingular.py
  lldb-api :: functionalities/thread/concurrent_events/TestConcurrentManyCrash.py
  lldb-api :: functionalities/data-formatter/data-formatter-stl/libcxx/multiset/TestDataFormatterLibcxxMultiSet.py
  lldb-api :: lang/cpp/auto/TestCPPAuto.py
  lldb-api :: functionalities/tail_call_frames/ambiguous_tail_call_seq1/TestAmbiguousTailCallSeq1.py
  lldb-api :: lang/cpp/nested-class-other-compilation-unit/TestNestedClassWithParentInAnotherCU.py
  lldb-api :: lang/cpp/rvalue-references/TestRvalueReferences.py
  lldb-api :: functionalities/breakpoint/inlined_breakpoints/TestInlinedBreakpoints.py
  lldb-api :: lang/objc/unicode-string/TestUnicodeString.py
  lldb-api :: commands/frame/diagnose/local-variable/TestLocalVariable.py
  lldb-api :: commands/frame/diagnose/bad-reference/TestBadReference.py
  lldb-api :: linux/builtin_trap/TestBuiltinTrap.py
  lldb-api :: functionalities/data-formatter/vector-types/TestVectorTypesFormatting.py
  lldb-api :: lang/cpp/diamond/TestDiamond.py
  lldb-api :: functionalities/inferior-crashing/recursive-inferior/TestRecursiveInferiorStep.py
  lldb-api :: python_api/lldbutil/frame/TestFrameUtils.py
  lldb-api :: lang/cpp/non-type-template-param/TestCppNonTypeTemplateParam.py
  lldb-api :: python_api/findvalue_duplist/TestSBFrameFindValue.py
  lldb-api :: functionalities/data-formatter/data-formatter-advanced/TestDataFormatterAdv.py
  lldb-api :: commands/frame/language/TestGuessLanguage.py
  lldb-api :: lang/cpp/covariant-return-types/TestCovariantReturnTypes.py
  lldb-api :: functionalities/data-formatter/nsdictionarysynth/TestNSDictionarySynthetic.py
  lldb-api :: functionalities/data-formatter/data-formatter-stl/libcxx/initializerlist/TestInitializerList.py
  lldb-api :: lang/c/step-target/TestStepTarget.py
  lldb-api :: lang/objc/direct-dispatch-step/TestObjCDirectDispatchStepping.py
  lldb-api :: functionalities/thread/backtrace_limit/TestBacktraceLimit.py
  lldb-api :: macosx/builtin-debugtrap/TestBuiltinDebugTrap.py
  lldb-api :: python_api/class_members/TestSBTypeClassMembers.py
  lldb-api :: lang/objc/objc-property/TestObjCProperty.py
  lldb-api :: functionalities/data-formatter/data-formatter-stl/libcxx/shared_ptr/TestDataFormatterLibcxxSharedPtr.py
  lldb-api :: functionalities/data-formatter/data-formatter-stl/libcxx/list/TestDataFormatterLibcxxList.py
  lldb-api :: lang/c/tls_globals/TestTlsGlobals.py
  lldb-api :: python_api/process/read-mem-cstring/TestReadMemCString.py
  lldb-api :: lang/objc/objc-runtime-ivars/TestRuntimeIvars.py
  lldb-api :: tools/lldb-vscode/breakpoint-events/TestVSCode_breakpointEvents.py
  lldb-api :: functionalities/type_lookup/TestTypeLookup.py
  lldb-api :: types/TestIntegerTypeExpr.py
  lldb-api :: commands/expression/pr35310/TestExprsBug35310.py
  lldb-api :: functionalities/breakpoint/address_breakpoints/TestAddressBreakpoints.py
  lldb-api :: types/TestShortType.py
  lldb-api :: functionalities/thread/step_until/TestStepUntil.py
  lldb-api :: tools/lldb-vscode/variables/TestVSCode_variables.py
  lldb-api :: functionalities/inferior-changed/TestInferiorChanged.py
  lldb-api :: commands/gui/viewlarge/TestGuiViewLarge.py
  lldb-api :: functionalities/type_completion/TestTypeCompletion.py
  lldb-api :: commands/expression/persist_objc_pointeetype/TestPersistObjCPointeeType.py
  lldb-api :: functionalities/thread/concurrent_events/TestConcurrentBreakpointDelayBreakpointOneSignal.py
  lldb-api :: functionalities/dead-strip/TestDeadStrip.py
  lldb-api :: commands/expression/import-std-module/shared_ptr-dbg-info-content/TestSharedPtrDbgInfoContentFromStdModule.py
  lldb-api :: functionalities/breakpoint/breakpoint_locations/TestBreakpointLocations.py
  lldb-api :: functionalities/data-formatter/poarray/TestPrintObjectArray.py
  lldb-api :: lang/cpp/std-function-step-into-callable/TestStdFunctionStepIntoCallable.py
  lldb-api :: commands/expression/import-std-module/missing-module-sources/TestStdModuleSourcesMissing.py
  lldb-api :: python_api/value/empty_class/TestValueAPIEmptyClass.py
  lldb-api :: functionalities/data-formatter/data-formatter-objc/TestDataFormatterObjCNSData.py
  lldb-api :: python_api/name_lookup/TestNameLookup.py
  lldb-api :: functionalities/unwind/sigtramp/TestSigtrampUnwind.py
  lldb-api :: functionalities/data-formatter/data-formatter-globals/TestDataFormatterGlobals.py
  lldb-api :: lang/cpp/frame-var-anon-unions/TestFrameVariableAnonymousUnions.py
  lldb-api :: functionalities/data-formatter/ostypeformatting/TestFormattersOsType.py
  lldb-api :: lang/c/anonymous/TestAnonymous.py
  lldb-api :: lang/objc/modules-compile-error/TestModulesCompileError.py
  lldb-api :: functionalities/data-formatter/data-formatter-objc/TestDataFormatterObjCNSDate.py
  lldb-api :: commands/expression/import-std-module/iterator/TestIteratorFromStdModule.py
  lldb-api :: functionalities/process_crash_info/TestProcessCrashInfo.py
  lldb-api :: functionalities/memory-region/TestMemoryRegion.py
  lldb-api :: functionalities/inferior-crashing/recursive-inferior/TestRecursiveInferior.py
  lldb-api :: python_api/symbol-context/two-files/TestSymbolContextTwoFiles.py
  lldb-api :: commands/expression/unicode-in-variable/TestUnicodeInVariable.py
  lldb-api :: commands/expression/import-std-module/basic/TestImportStdModule.py
  lldb-api :: functionalities/data-formatter/data-formatter-stl/libcxx/deque/TestDataFormatterLibcxxDeque.py
  lldb-api :: functionalities/memory/cache/TestMemoryCache.py
  lldb-api :: sample_test/TestSampleTest.py
  lldb-api :: commands/expression/radar_9673664/TestExprHelpExamples.py
  lldb-api :: lang/c/set_values/TestSetValues.py
  lldb-api :: source-manager/TestSourceManager.py
  lldb-api :: lang/mixed/TestMixedLanguages.py
  lldb-api :: functionalities/data-formatter/compactvectors/TestCompactVectors.py
  lldb-api :: functionalities/tail_call_frames/disambiguate_tail_call_seq/TestDisambiguateTailCallSeq.py
  lldb-api :: lang/objc/conflicting-definition/TestConflictingDefinition.py
  lldb-api :: lang/c/register_variables/TestRegisterVariables.py
  lldb-api :: functionalities/data-formatter/builtin-formats/TestBuiltinFormats.py
  lldb-api :: functionalities/step-avoids-no-debug/TestStepNoDebug.py
  lldb-api :: commands/expression/radar_9531204/TestPrintfAfterUp.py
  lldb-api :: functionalities/thread/num_threads/TestNumThreads.py
  lldb-api :: functionalities/data-formatter/data-formatter-stl/libcxx/forward_list/TestDataFormatterLibcxxForwardList.py
  lldb-api :: lang/cpp/inlines/TestInlines.py
  lldb-api :: functionalities/data-formatter/data-formatter-objc/TestDataFormatterObjCNSURL.py
  lldb-api :: functionalities/type_get_module/TestTypeGetModule.py
  lldb-api :: lang/cpp/function-qualifiers/TestCppFunctionQualifiers.py
  lldb-api :: commands/expression/xvalue/TestXValuePrinting.py
  lldb-api :: commands/settings/TestSettings.py
  lldb-api :: commands/frame/diagnose/array/TestArray.py
  lldb-api :: functionalities/data-formatter/data-formatter-synthtype/TestDataFormatterSynthType.py
  lldb-api :: lang/objc/global_ptrs/TestGlobalObjects.py
  lldb-api :: lang/cpp/global_variables/TestCPPGlobalVariables.py
  lldb-api :: commands/expression/cast_int_to_anonymous_enum/TestCastIntToAnonymousEnum.py
  lldb-api :: commands/expression/import-std-module/sysroot/TestStdModuleSysroot.py
  lldb-api :: python_api/sbdata/TestSBData.py
  lldb-api :: functionalities/data-formatter/synthupdate/TestSyntheticFilterRecompute.py
  lldb-api :: commands/process/launch-with-shellexpand/TestLaunchWithShellExpand.py
  lldb-api :: functionalities/thread/concurrent_events/TestConcurrentCrashWithBreak.py
  lldb-api :: lang/c/inlines/TestRedefinitionsInInlines.py
  lldb-api :: functionalities/signal/TestSendSignal.py
  lldb-api :: functionalities/dynamic_value_child_count/TestDynamicValueChildCount.py
  lldb-api :: lang/objc/exceptions/TestObjCExceptions.py
  lldb-api :: commands/expression/import-std-module/empty-module/TestEmptyStdModule.py
  lldb-api :: lang/cpp/operator-overload/TestOperatorOverload.py
  lldb-api :: lang/objc/ptr_refs/TestPtrRefsObjC.py
  lldb-api :: lang/objc/foundation/TestConstStrings.py
  lldb-api :: functionalities/data-formatter/data-formatter-stl/libcxx/atomic/TestLibCxxAtomic.py
  lldb-api :: functionalities/thread/step_out/TestThreadStepOut.py
  lldb-api :: lang/objcxx/cxx-bridged-po/TestObjCXXBridgedPO.py
  lldb-api :: commands/expression/import-std-module/list-dbg-info-content/TestDbgInfoContentListFromStdModule.py
  lldb-api :: tools/lldb-vscode/launch/TestVSCode_launch.py
  lldb-api :: commands/expression/timeout/TestCallWithTimeout.py
  lldb-api :: functionalities/data-formatter/data-formatter-stl/libcxx/string/TestDataFormatterLibcxxString.py
  lldb-api :: commands/expression/ir-interpreter-phi-nodes/TestIRInterpreterPHINodes.py
  lldb-api :: functionalities/breakpoint/breakpoint_ignore_count/TestBreakpointIgnoreCount.py
  lldb-api :: functionalities/breakpoint/source_regexp/TestSourceRegexBreakpoints.py
  lldb-api :: functionalities/data-formatter/data-formatter-skip-summary/TestDataFormatterSkipSummary.py
  lldb-api :: functionalities/inferior-crashing/TestInferiorCrashingStep.py
  lldb-api :: commands/expression/dollar-in-variable/TestDollarInVariable.py
  lldb-api :: lang/cpp/template-arguments/TestCppTemplateArguments.py
  lldb-api :: lang/c/blocks/TestBlocks.py
  lldb-api :: functionalities/breakpoint/global_constructor/TestBreakpointInGlobalConstructor.py
  lldb-api :: functionalities/process_group/TestChangeProcessGroup.py
  lldb-api :: commands/frame/diagnose/complicated-expression/TestComplicatedExpression.py
  lldb-api :: commands/expression/issue_11588/Test11588.py
  lldb-api :: lang/cpp/struct_with_keyword_name/TestStructWithKeywordName.py
  lldb-api :: macosx/macCatalyst/TestMacCatalyst.py
  lldb-api :: functionalities/conditional_break/TestConditionalBreak.py
  lldb-api :: commands/command/nested_alias/TestNestedAlias.py
  lldb-api :: functionalities/breakpoint/move_nearest/TestMoveNearest.py
  lldb-api :: lang/c/enum_types/TestEnumTypes.py
  lldb-api :: lang/objc/objc++/TestObjCXX.py
  lldb-api :: commands/expression/call-function/TestCallStdStringFunction.py
  lldb-api :: functionalities/tail_call_frames/cross_dso/TestCrossDSOTailCalls.py
  lldb-api :: functionalities/data-formatter/data-formatter-objc/nsindexpath/TestDataFormatterNSIndexPath.py
  lldb-api :: functionalities/data-formatter/data-formatter-synthval/TestDataFormatterSynthVal.py
  lldb-api :: commands/expression/anonymous-struct/TestCallUserAnonTypedef.py
  lldb-api :: commands/expression/persistent_types/TestPersistentTypes.py
  lldb-api :: lang/cpp/class_types/TestClassTypes.py
  lldb-api :: functionalities/data-formatter/data-formatter-objc/TestDataFormatterObjCNSError.py
  lldb-api :: functionalities/limit-debug-info/TestLimitDebugInfo.py
  lldb-api :: functionalities/float-display/TestFloatDisplay.py
  lldb-api :: lang/objc/ivar-IMP/TestObjCiVarIMP.py
  lldb-api :: python_api/frame/TestFrames.py
  lldb-api :: lang/cpp/virtual-functions/TestCppVirtualFunctions.py
  lldb-api :: lang/objc/forward-decl/TestForwardDecl.py
  lldb-api :: functionalities/rerun/TestRerun.py
  lldb-api :: commands/expression/import-std-module/unique_ptr/TestUniquePtrFromStdModule.py
  lldb-api :: commands/expression/import-std-module/retry-with-std-module/TestRetryWithStdModule.py
  lldb-api :: lang/cpp/call-function/TestCallCPPFunction.py
  lldb-api :: commands/process/signal/TestProcessSignal.py
  lldb-api :: commands/expression/result_numbering/TestResultNumbering.py
  lldb-api :: lang/objc/objc-struct-return/TestObjCStructReturn.py
  lldb-api :: python_api/value_var_update/TestValueVarUpdate.py
  lldb-api :: macosx/indirect_symbol/TestIndirectSymbols.py
  lldb-api :: lang/cpp/overloaded-functions/TestOverloadedFunctions.py
  lldb-api :: commands/expression/save_jit_objects/TestSaveJITObjects.py
  lldb-api :: commands/expression/call-function/TestCallUserDefinedFunction.py
  lldb-api :: functionalities/data-formatter/summary-string-onfail/Test-rdar-9974002.py
  lldb-api :: lang/objc/foundation/TestObjCMethods.py
  lldb-api :: functionalities/tail_call_frames/unambiguous_sequence/TestUnambiguousTailCalls.py
  lldb-api :: functionalities/data-formatter/data-formatter-stl/libcxx/list/loop/TestDataFormatterLibcxxListLoop.py
  lldb-api :: types/TestRecursiveTypes.py
  lldb-api :: lang/cpp/template-function/TestTemplateFunctions.py
  lldb-api :: functionalities/breakpoint/breakpoint_conditions/TestBreakpointConditions.py
  lldb-api :: lang/cpp/constructors/TestCppConstructors.py
  lldb-api :: commands/expression/call-throws/TestCallThatThrows.py
  lldb-api :: lang/c/step_over_no_deadlock/TestStepOverDoesntBlock.py
  lldb-api :: functionalities/tail_call_frames/disambiguate_call_site/TestDisambiguateCallSite.py
  lldb-api :: lang/cpp/enum_types/TestCPP11EnumTypes.py
  lldb-api :: lang/objc/rdar-10967107/TestRdar10967107.py
  lldb-api :: functionalities/thread/thread_exit/TestThreadExit.py
  lldb-api :: commands/expression/ir-interpreter/TestIRInterpreter.py
  lldb-api :: functionalities/data-formatter/language_category_updates/TestDataFormatterLanguageCategoryUpdates.py
  lldb-api :: lang/cpp/signed_types/TestSignedTypes.py
  lldb-api :: lang/objcxx/hide-runtime-values/TestObjCXXHideRuntimeValues.py
  lldb-api :: commands/expression/import-std-module/stack/TestStackFromStdModule.py
  lldb-api :: commands/expression/regression-access-function-template-in-record/TestRegressionAccessFunctionTemplateInRecord.py
  lldb-api :: python_api/sbvalue_persist/TestSBValuePersist.py
  lldb-api :: commands/expression/import-std-module/pair/TestPairFromStdModule.py
  lldb-api :: lang/objc/objc-class-method/TestObjCClassMethod.py
  lldb-api :: functionalities/thread/create_after_attach/TestCreateAfterAttach.py
  lldb-api :: types/TestIntegerType.py
  lldb-api :: functionalities/var_path/TestVarPath.py
  lldb-api :: lang/objc/bitfield_ivars/TestBitfieldIvars.py
  lldb-api :: functionalities/thread/jump/TestThreadJump.py
  lldb-api :: functionalities/breakpoint/breakpoint_language/TestBreakpointLanguage.py
  lldb-api :: python_api/exprpath_synthetic/TestExprPathSynthetic.py
  lldb-api :: functionalities/data-formatter/pyobjsynthprovider/TestPyObjSynthProvider.py
  lldb-api :: commands/expression/import-std-module/forward_decl_from_module/TestForwardDeclFromStdModule.py
  lldb-api :: sample_test/TestSampleInlineTest.py
  lldb-api :: functionalities/data-formatter/data-formatter-objc/nsstring/TestDataFormatterNSString.py
  lldb-api :: driver/batch_mode/TestBatchMode.py
  lldb-api :: commands/expression/completion/TestExprCompletion.py
  lldb-api :: commands/statistics/basic/TestStats.py
  lldb-api :: lang/objc/cpp_keyword_identifiers/TestCppKeywordsAsObjCIdentifiers.py
  lldb-api :: functionalities/data-formatter/stringprinter/TestStringPrinter.py
  lldb-api :: types/TestFloatTypes.py
  lldb-api :: functionalities/thread/concurrent_events/TestConcurrentBreakpointOneDelayBreakpointThreads.py
  lldb-api :: macosx/thread_suspend/TestInternalThreadSuspension.py
  lldb-api :: lang/objc/rdar-11355592/TestRdar11355592.py
  lldb-api :: functionalities/tail_call_frames/disambiguate_paths_to_common_sink/TestDisambiguatePathsToCommonSink.py
  lldb-api :: commands/expression/import-std-module/vector-dbg-info-content/TestDbgInfoContentVectorFromStdModule.py
  lldb-api :: types/TestLongTypesExpr.py
  lldb-api :: lang/cpp/function_refs/TestFunctionRefs.py
  lldb-api :: functionalities/data-formatter/data-formatter-objc/TestDataFormatterObjCExpr.py
  lldb-api :: commands/expression/import-std-module/shared_ptr/TestSharedPtrFromStdModule.py
  lldb-api :: macosx/profile_vrs_detach/TestDetachVrsProfile.py
  lldb-api :: functionalities/data-formatter/data-formatter-stl/libcxx/queue/TestDataFormatterLibcxxQueue.py
  lldb-api :: functionalities/data-formatter/data-formatter-script/TestDataFormatterScript.py
  lldb-api :: functionalities/data-formatter/array_typedef/TestArrayTypedef.py
  lldb-api :: functionalities/recursion/TestValueObjectRecursion.py
  lldb-api :: functionalities/return-value/TestReturnValue.py
  lldb-api :: lang/cpp/global_operators/TestCppGlobalOperators.py
  lldb-api :: functionalities/breakpoint/breakpoint_set_restart/TestBreakpointSetRestart.py
  lldb-api :: lang/objc/objc-foundation-dictionary-empty/TestNSDictionary0.py
  lldb-api :: functionalities/completion/TestCompletion.py
  lldb-api :: lang/c/function_types/TestFunctionTypes.py
  lldb-api :: lang/cpp/incomplete-types/TestCppIncompleteTypes.py
  lldb-api :: lang/cpp/default-template-args/TestDefaultTemplateArgs.py
  lldb-api :: commands/expression/import-std-module/deque-basic/TestDequeFromStdModule.py
  lldb-api :: lang/cpp/template-specialization-type/TestTemplateSpecializationType.py
  lldb-api :: commands/expression/deleting-implicit-copy-constructor/TestDeletingImplicitCopyConstructor.py
  lldb-api :: lang/c/local_variables/TestLocalVariables.py
  lldb-api :: python_api/function_symbol/TestSymbolAPI.py
  lldb-api :: lang/c/complex/TestComplexC99.py
  lldb-api :: types/TestShortTypeExpr.py
  lldb-api :: commands/expression/inline-namespace/TestInlineNamespace.py
  lldb-api :: functionalities/data-formatter/data-formatter-ptr-to-array/TestPtrToArrayFormatting.py
  lldb-api :: commands/expression/function_template_specialization_temp_args/TestFunctionTemplateSpecializationTempArgs.py
  lldb-api :: python_api/process/TestProcessAPI.py
  lldb-api :: commands/disassemble/basic/TestFrameDisassemble.py
  lldb-api :: functionalities/data-formatter/data-formatter-objc/TestDataFormatterObjCNSBundle.py
  lldb-api :: commands/expression/static-initializers/TestStaticInitializers.py
  lldb-api :: lang/cpp/limit-debug-info/TestWithLimitDebugInfo.py
  lldb-api :: lang/objc/objc-baseclass-sbtype/TestObjCBaseClassSBType.py
  lldb-api :: commands/thread/select/TestThreadSelect.py
  lldb-api :: functionalities/data-formatter/data-formatter-enum-format/TestDataFormatterEnumFormat.py
  lldb-api :: commands/expression/po_verbosity/TestPoVerbosity.py
  lldb-api :: commands/frame/var-scope/TestFrameVariableScope.py
  lldb-api :: lang/cpp/dynamic-value/TestCppValueCast.py
  lldb-api :: functionalities/thread/exit_during_step/TestExitDuringStep.py
  lldb-api :: commands/expression/test/TestExprs2.py
  lldb-api :: python_api/value/TestValueAPI.py
  lldb-api :: lang/objc/print-obj/TestPrintObj.py
  lldb-api :: lang/objc/objc-static-method/TestObjCStaticMethod.py
  lldb-api :: macosx/simulator/TestSimulatorPlatform.py
  lldb-api :: types/TestCharType.py
  lldb-api :: commands/target/basic/TestTargetCommand.py
  lldb-api :: functionalities/thread/concurrent_events/TestConcurrentSignalBreak.py
  lldb-api :: lang/objc/objc-stepping/TestObjCStepping.py
  lldb-api :: lang/cpp/extern_c/TestExternCSymbols.py
  lldb-api :: lang/cpp/break-on-initializers/TestBreakOnCPP11Initializers.py
  lldb-api :: lang/cpp/bitfields/TestCppBitfields.py
  lldb-api :: functionalities/inline-stepping/TestInlineStepping.py
  lldb-api :: python_api/value/change_values/TestChangeValueAPI.py
  lldb-api :: lang/cpp/namespace_definitions/TestNamespaceDefinitions.py
  lldb-api :: functionalities/pointer_num_children/TestPointerNumChildren.py
  lldb-api :: lang/c/global_variables/TestGlobalVariables.py
  lldb-api :: lang/c/unicode/TestUnicodeSymbols.py
  lldb-api :: commands/expression/import-std-module/non-module-type-separation/TestNonModuleTypeSeparation.py
  lldb-api :: python_api/value/linked_list/TestValueAPILinkedList.py
  lldb-api :: functionalities/data-formatter/frameformat_smallstruct/TestFrameFormatSmallStruct.py
  lldb-api :: commands/apropos/with-process/TestAproposWithProcess.py
  lldb-api :: functionalities/breakpoint/comp_dir_symlink/TestCompDirSymLink.py
  lldb-api :: commands/expression/radar_8638051/Test8638051.py
  lldb-api :: functionalities/data-formatter/parray/TestPrintArray.py
  lldb-api :: functionalities/breakpoint/auto_continue/TestBreakpointAutoContinue.py
  lldb-api :: lang/cpp/lambdas/TestLambdas.py
  lldb-api :: commands/source/info/TestSourceInfo.py
  lldb-api :: commands/expression/multiline-completion/TestMultilineCompletion.py
  lldb-api :: lang/objc/foundation/TestFoundationDisassembly.py
  lldb-api :: lang/c/cpp_keyword_identifiers/TestCppKeywordsAsCIdentifiers.py
  lldb-api :: functionalities/data-formatter/typedef_array/TestTypedefArray.py
  lldb-api :: lang/objc/objc-new-syntax/TestObjCNewSyntaxArray.py
  lldb-api :: lang/objc/foundation/TestObjCMethodsNSError.py
  lldb-api :: tools/lldb-vscode/runInTerminal/TestVSCode_runInTerminal.py
  lldb-api :: commands/target/stop-hooks/TestStopHookScripted.py
  lldb-api :: lang/cpp/multiple-inheritance/TestCppMultipleInheritance.py
  lldb-api :: lang/objc/modules-auto-import/TestModulesAutoImport.py
  lldb-api :: lang/objc/objc-struct-argument/TestObjCStructArgument.py
  lldb-api :: python_api/frame/inlines/TestInlinedFrame.py
  lldb-api :: lang/objc/modules-inline-functions/TestModulesInlineFunctions.py
  lldb-api :: commands/frame/diagnose/virtual-method-call/TestDiagnoseDereferenceVirtualMethodCall.py
  lldb-api :: functionalities/tail_call_frames/thread_step_out_message/TestArtificialFrameStepOutMessage.py
  lldb-api :: lang/objc/objc-checker/TestObjCCheckers.py
  lldb-api :: tools/lldb-vscode/breakpoint/TestVSCode_setBreakpoints.py
  lldb-api :: functionalities/memory/read/TestMemoryRead.py
  lldb-api :: functionalities/data-formatter/data-formatter-objc/TestDataFormatterObjCPlain.py
  lldb-api :: lang/objc/objc-new-syntax/TestObjCNewSyntaxDictionary.py
  lldb-api :: functionalities/data-formatter/cstring-utf8-summary/TestCstringUnicode.py
  lldb-api :: python_api/sbvalue_const_addrof/TestSBValueConstAddrOf.py
  lldb-api :: functionalities/thread/concurrent_events/TestConcurrentTwoBreakpointsOneSignal.py
  lldb-api :: commands/disassemble/basic/TestDisassembleBreakpoint.py
  lldb-api :: commands/expression/scoped_enums/TestScopedEnumType.py
  lldb-api :: commands/expression/completion-crash-incomplete-record/TestCompletionCrashIncompleteRecord.py
  lldb-api :: functionalities/data-formatter/data-formatter-stl/libcxx/multimap/TestDataFormatterLibccMultiMap.py
  lldb-api :: lang/cpp/symbols/TestSymbols.py
  lldb-api :: functionalities/data-formatter/varscript_formatting/TestDataFormatterVarScriptFormatting.py
  lldb-api :: python_api/hello_world/TestHelloWorld.py
  lldb-api :: python_api/target/TestTargetAPI.py
  lldb-api :: lang/objc/objc-super/TestObjCSuper.py
  lldb-api :: functionalities/data-formatter/data-formatter-objc/TestDataFormatterObjCNSContainer.py
  lldb-api :: commands/target/stop-hooks/TestStopHooks.py
  lldb-api :: types/TestCharTypeExpr.py
  lldb-api :: functionalities/data-formatter/data-formatter-stl/libcxx/bitset/TestDataFormatterLibcxxBitset.py
  lldb-api :: commands/expression/entry-bp/TestExprEntryBP.py
  lldb-api :: macosx/nslog/TestDarwinNSLogOutput.py
  lldb-api :: commands/frame/select/TestFrameSelect.py
  lldb-api :: functionalities/data-formatter/type_summary_list_script/TestTypeSummaryListScript.py
  lldb-api :: lang/objc/foundation/TestObjCMethodsString.py
  lldb-api :: functionalities/data-formatter/data-formatter-synth/TestDataFormatterSynth.py
  lldb-api :: functionalities/data-formatter/var-in-aggregate-misuse/TestVarInAggregateMisuse.py
  lldb-api :: lang/objc/single-entry-dictionary/TestObjCSingleEntryDictionary.py
  lldb-api :: functionalities/data-formatter/data-formatter-disabling/TestDataFormatterDisabling.py
  lldb-api :: types/TestDoubleTypesExpr.py
  lldb-api :: python_api/interpreter/TestCommandInterpreterAPI.py
  lldb-api :: lang/objc/real-definition/TestRealDefinition.py
  lldb-api :: functionalities/data-formatter/data-formatter-objc/cmtime/TestDataFormatterCMTime.py
  lldb-api :: lang/cpp/static_methods/TestCPPStaticMethods.py
  lldb-api :: lang/c/bitfields/TestBitfields.py
  lldb-api :: functionalities/data-formatter/data-formatter-stl/libcxx/function/TestLibCxxFunction.py
  lldb-api :: lang/c/const_variables/TestConstVariables.py
  lldb-api :: functionalities/tail_call_frames/inlining_and_tail_calls/TestInliningAndTailCalls.py
  lldb-api :: functionalities/thread/ignore_suspended/TestIgnoreSuspendedThread.py
  lldb-api :: functionalities/data-formatter/data-formatter-objc/TestDataFormatterObjCCF.py
  lldb-api :: commands/expression/fixits/TestFixIts.py
  lldb-api :: lang/cpp/thread_local/TestThreadLocal.py
  lldb-api :: functionalities/unwind/zeroth_frame/TestZerothFrame.py
  lldb-api :: macosx/save_crashlog/TestSaveCrashlog.py
  lldb-api :: functionalities/target_var/TestTargetVar.py
  lldb-api :: lang/c/strings/TestCStrings.py
  lldb-api :: macosx/add-dsym/TestAddDsymMidExecutionCommand.py
  lldb-api :: lang/cpp/unique-types/TestUniqueTypes.py
  lldb-api :: lang/c/stepping/TestThreadStepping.py
  lldb-api :: functionalities/data-formatter/data-formatter-objc/TestDataFormatterObjCKVO.py
  lldb-api :: lang/cpp/trivial_abi/TestTrivialABI.py
  lldb-api :: lang/objc/objc_direct-methods/TestObjCDirectMethods.py
  lldb-api :: lang/c/modules/TestCModules.py
  lldb-api :: lang/objc/radar-9691614/TestObjCMethodReturningBOOL.py
  lldb-api :: commands/expression/top-level/TestTopLevelExprs.py
  lldb-api :: functionalities/data-formatter/setvaluefromcstring/TestSetValueFromCString.py
  lldb-api :: lang/objc/self/TestObjCSelf.py
  lldb-api :: lang/cpp/class-template-type-parameter-pack/TestClassTemplateTypeParameterPack.py
  lldb-api :: lang/objc/foundation/TestObjectDescriptionAPI.py
  lldb-api :: functionalities/thread/concurrent_events/TestConcurrentDelaySignalBreak.py
  lldb-api :: functionalities/thread/backtrace_all/TestBacktraceAll.py
  lldb-api :: tools/lldb-vscode/module/TestVSCode_module.py
  lldb-api :: commands/process/attach-resume/TestAttachResume.py
  lldb-api :: lang/objc/hidden-ivars/TestHiddenIvars.py
  lldb-api :: functionalities/data-formatter/data-formatter-python-synth/TestDataFormatterPythonSynth.py
  lldb-api :: lang/objc/modules-non-objc-target/TestObjCModulesNonObjCTarget.py
  lldb-api :: lang/cpp/virtual-overload/TestVirtualOverload.py
  lldb-api :: functionalities/data-formatter/data-formatter-stl/libcxx/variant/TestDataFormatterLibcxxVariant.py
  lldb-api :: functionalities/plugins/python_os_plugin/stepping_plugin_threads/TestOSPluginStepping.py
  lldb-api :: functionalities/inferior-crashing/TestInferiorCrashing.py
  lldb-api :: types/TestDoubleTypes.py
  lldb-api :: commands/expression/context-object/TestContextObject.py
  lldb-api :: functionalities/tail_call_frames/sbapi_support/TestTailCallFrameSBAPI.py
  lldb-api :: commands/expression/no-deadlock/TestExprDoesntBlock.py
  lldb-api :: lang/cpp/gmodules-templates/TestGModules.py
  lldb-api :: commands/expression/vector_of_enums/TestVectorOfEnums.py
  lldb-api :: lang/objc/objc-ivar-offsets/TestObjCIvarOffsets.py
  lldb-api :: functionalities/thread/concurrent_events/TestConcurrentTwoBreakpointThreads.py
  lldb-api :: functionalities/data-formatter/data-formatter-stl/libcxx/optional/TestDataFormatterLibcxxOptional.py
  lldb-api :: commands/expression/import-std-module/forward_list-dbg-info-content/TestDbgInfoContentForwardListFromStdModule.py
  lldb-api :: lang/cpp/modules-import/TestCXXModulesImport.py
  lldb-api :: functionalities/thread/exit_during_expression/TestExitDuringExpression.py
  lldb-api :: functionalities/data-formatter/synthcapping/TestSyntheticCapping.py
  lldb-api :: lang/objc/objc-dyn-sbtype/TestObjCDynamicSBType.py
  lldb-api :: commands/expression/import-std-module/no-std-module/TestMissingStdModule.py
  lldb-api :: lang/cpp/operators/TestCppOperators.py
  lldb-api :: lang/cpp/namespace_conflicts/TestNamespaceConflicts.py
  lldb-api :: lang/cpp/this_class_type_mixing/TestThisClassTypeMixing.py
  lldb-api :: functionalities/breakpoint/breakpoint_options/TestBreakpointOptions.py
  lldb-api :: functionalities/plugins/python_os_plugin/TestPythonOSPlugin.py
  lldb-api :: lang/objc/foundation/TestRuntimeTypes.py
  lldb-api :: functionalities/data-formatter/refpointer-recursion/TestDataFormatterRefPtrRecursion.py
  lldb-api :: lang/cpp/exceptions/TestCPPExceptionBreakpoints.py
  lldb-api :: lang/objc/objc-static-method-stripped/TestObjCStaticMethodStripped.py
  lldb-api :: functionalities/breakpoint/breakpoint_command/TestBreakpointCommandsFromPython.py
  lldb-api :: commands/expression/argument_passing_restrictions/TestArgumentPassingRestrictions.py
  lldb-api :: functionalities/data-formatter/ptr_ref_typedef/TestPtrRef2Typedef.py
  lldb-api :: functionalities/breakpoint/step_over_breakpoint/TestStepOverBreakpoint.py
  lldb-api :: lang/cpp/unsigned_types/TestUnsignedTypes.py
  lldb-api :: commands/expression/formatters/TestFormatters.py
  lldb-api :: lang/c/shared_lib/TestSharedLib.py
  lldb-api :: lang/objc/objc-optimized/TestObjcOptimized.py
  lldb-api :: functionalities/data-formatter/data-formatter-categories/TestDataFormatterCategories.py
  lldb-api :: lang/cpp/breakpoint-commands/TestCPPBreakpointCommands.py
  lldb-api :: lang/objc/orderedset/TestOrderedSet.py
  lldb-api :: macosx/find-app-in-bundle/TestFindAppInBundle.py
  lldb-api :: lang/c/conflicting-symbol/TestConflictingSymbol.py
  lldb-api :: functionalities/step_scripted/TestStepScripted.py
  lldb-api :: lang/cpp/class-template-parameter-pack/TestClassTemplateParameterPack.py
  lldb-api :: macosx/DBGSourcePathRemapping/TestDSYMSourcePathRemapping.py
  lldb-api :: functionalities/breakpoint/breakpoint_ids/TestBreakpointIDs.py
  lldb-api :: lang/cpp/class_static/TestStaticVariables.py
  lldb-api :: types/TestFloatTypesExpr.py
  lldb-api :: functionalities/data-formatter/nssetsynth/TestNSSetSynthetic.py
  lldb-api :: commands/expression/import-std-module/conflicts/TestStdModuleWithConflicts.py
  lldb-api :: lang/cpp/this/TestCPPThis.py
  lldb-api :: functionalities/avoids-fd-leak/TestFdLeak.py
  lldb-api :: lang/cpp/namespace/TestNamespace.py
  lldb-api :: commands/expression/call-function/TestCallStopAndContinue.py
  lldb-api :: commands/expression/import-std-module/vector-of-vectors/TestVectorOfVectorsFromStdModule.py
  lldb-api :: api/check_public_api_headers/TestPublicAPIHeaders.py
  lldb-api :: functionalities/data-formatter/format-propagation/TestFormatPropagation.py
  lldb-api :: python_api/thread/TestThreadAPI.py
  lldb-api :: functionalities/thread/concurrent_events/TestConcurrentSignalDelayBreak.py
  lldb-api :: tools/lldb-vscode/stackTrace/TestVSCode_stackTrace.py
  lldb-api :: functionalities/thread/concurrent_events/TestConcurrentDelayedCrashWithBreakpointSignal.py
  lldb-api :: python_api/symbol-context/TestSymbolContext.py
  lldb-api :: functionalities/unwind/noreturn/TestNoreturnUnwind.py
  lldb-api :: commands/expression/import-std-module/vector-bool/TestVectorBoolFromStdModule.py
  lldb-api :: python_api/lldbutil/process/TestPrintStackTraces.py
  lldb-api :: commands/expression/context-object-objc/TestContextObjectObjc.py
  lldb-api :: functionalities/thread/crash_during_step/TestCrashDuringStep.py
  lldb-api :: functionalities/lazy-loading/TestLazyLoading.py
  lldb-api :: commands/expression/class_template_specialization_empty_pack/TestClassTemplateSpecializationParametersHandling.py
  lldb-api :: lang/cpp/typedef/TestCppTypedef.py
  lldb-api :: functionalities/data-formatter/data-formatter-smart-array/TestDataFormatterSmartArray.py
  lldb-api :: lang/c/array_types/TestArrayTypes.py
  lldb-api :: commands/gui/basic/TestGuiBasic.py
  lldb-api :: lang/cpp/scope/TestCppScope.py
  lldb-api :: lang/cpp/dynamic-value/TestDynamicValue.py
  lldb-api :: commands/expression/import-std-module/forward_list/TestForwardListFromStdModule.py
  lldb-api :: macosx/queues/TestQueues.py
  lldb-api :: commands/expression/rdar44436068/Test128BitsInteger.py
  lldb-api :: lang/objc/blocks/TestObjCIvarsInBlocks.py
  lldb-api :: lang/cpp/namespace/TestNamespaceLookup.py
  lldb-api :: commands/expression/test/TestExprs.py
  lldb-api :: macosx/find-dsym/bundle-with-dot-in-filename/TestBundleWithDotInFilename.py
  lldb-api :: functionalities/set-data/TestSetData.py
  lldb-api :: lang/c/shared_lib_stripped_symbols/TestSharedLibStrippedSymbols.py
  lldb-api :: functionalities/tail_call_frames/thread_step_out_or_return/TestSteppingOutWithArtificialFrames.py
  lldb-api :: functionalities/tail_call_frames/ambiguous_tail_call_seq2/TestAmbiguousTailCallSeq2.py
  lldb-api :: functionalities/data-formatter/dump_dynamic/TestDumpDynamic.py
  lldb-api :: lang/cpp/dynamic-value-same-basename/TestDynamicValueSameBase.py
  lldb-api :: functionalities/data-formatter/user-format-vs-summary/TestUserFormatVsSummary.py
  lldb-api :: lang/cpp/char8_t/TestCxxChar8_t.py
  lldb-api :: macosx/duplicate-archive-members/TestDuplicateMembers.py
  lldb-api :: commands/expression/import-std-module/vector/TestVectorFromStdModule.py
  lldb-api :: lang/c/struct_types/TestStructTypes.py
  lldb-api :: functionalities/data-formatter/data-formatter-stl/libcxx/set/TestDataFormatterLibcxxSet.py
  lldb-api :: functionalities/data-formatter/data-formatter-stl/libcxx/unique_ptr/TestDataFormatterLibcxxUniquePtr.py
  lldb-api :: functionalities/data-formatter/boolreference/TestFormattersBoolRefPtr.py
  lldb-api :: functionalities/data-formatter/data-formatter-cpp/TestDataFormatterCpp.py
  lldb-api :: functionalities/inferior-assert/TestInferiorAssert.py
  lldb-api :: commands/expression/import-std-module/weak_ptr/TestWeakPtrFromStdModule.py
  lldb-api :: commands/expression/unwind_expression/TestUnwindExpression.py
  lldb-api :: lang/cpp/llvm-style/TestLLVMStyle.py
  lldb-api :: lang/objcxx/objcxx-ivar-vector/TestIvarVector.py
  lldb-api :: lang/c/vla/TestVLA.py
  lldb-api :: commands/expression/rdar42038760/TestScalarURem.py
  lldb-api :: functionalities/optimized_code/TestNoASanExceptionAfterEvalOP_piece.py
  lldb-api :: lang/objc/objc-ivar-stripped/TestObjCIvarStripped.py
  lldb-api :: functionalities/thread/exit_during_break/TestExitDuringBreak.py
  lldb-api :: functionalities/breakpoint/address_breakpoints/TestBadAddressBreakpoints.py
  lldb-api :: lang/objc/objc-ivar-protocols/TestIvarProtocols.py
  lldb-api :: functionalities/data-formatter/data-formatter-named-summaries/TestDataFormatterNamedSummaries.py
  lldb-api :: types/TestLongTypes.py
  lldb-api :: python_api/process/io/TestProcessIO.py
  lldb-api :: lang/cpp/offsetof/TestOffsetofCpp.py
  lldb-api :: lang/objc/objc-new-syntax/TestObjCNewSyntaxLiteral.py
  lldb-api :: commands/expression/import-std-module/queue/TestQueueFromStdModule.py
  lldb-api :: commands/process/attach/TestProcessAttach.py
  lldb-api :: functionalities/thread_plan/TestThreadPlanCommands.py
  lldb-api :: functionalities/data-formatter/data-formatter-stl/libcxx/vbool/TestDataFormatterLibcxxVBool.py
  lldb-api :: functionalities/breakpoint/cpp/TestCPPBreakpointLocations.py
  lldb-api :: commands/expression/import-std-module/weak_ptr-dbg-info-content/TestDbgInfoContentWeakPtrFromStdModule.py
  lldb-api :: functionalities/data-formatter/data-formatter-stl/libcxx/iterator/TestDataFormatterLibccIterator.py
  lldb-api :: commands/expression/char/TestExprsChar.py
  lldb-api :: tools/lldb-vscode/attach/TestVSCode_attach.py
  lldb-api :: commands/frame/diagnose/inheritance/TestDiagnoseInheritance.py
  lldb-api :: functionalities/breakpoint/breakpoint_by_file_colon_line/TestBreakpointByFileColonLine.py
  lldb-api :: functionalities/data-formatter/data-formatter-stl/libcxx/vector/TestDataFormatterLibcxxVector.py
  lldb-api :: functionalities/breakpoint/dummy_target_breakpoints/TestBreakpointsWithNoTargets.py
  lldb-api :: lang/c/stepping/TestThreadStepInAvoidRegexp.py
  lldb-api :: lang/cpp/alignas_base_class/TestAlignAsBaseClass.py
  lldb-api :: python_api/sbtype_typeclass/TestSBTypeTypeClass.py
  lldb-api :: functionalities/thread/concurrent_events/TestConcurrentManyBreakpoints.py
  lldb-api :: lang/c/unions/TestUnionMembers.py
  lldb-api :: lang/objc/foundation/TestObjCMethods2.py
  lldb-api :: functionalities/data-formatter/data-formatter-stl/libstdcpp/unique_ptr/invalid/TestDataFormatterInvalidStdUniquePtr.py
  lldb-api :: lang/objc/foundation/TestObjCMethodsNSArray.py
  lldb-api :: functionalities/ptr_refs/TestPtrRefs.py
  lldb-api :: functionalities/value_md5_crash/TestValueMD5Crash.py
  lldb-api :: commands/expression/diagnostics/TestExprDiagnostics.py
  lldb-api :: python_api/frame/get-variables/TestGetVariables.py
  lldb-api :: tools/lldb-vscode/console/TestVSCode_console.py
  lldb-api :: functionalities/breakpoint/consecutive_breakpoints/TestConsecutiveBreakpoints.py
  lldb-api :: functionalities/memory/find/TestMemoryFind.py
  lldb-api :: python_api/type/TestTypeList.py
  lldb-api :: lang/objc/warnings-in-expr-parser/TestObjCWarningsInExprParser.py
  lldb-api :: lang/cpp/accelerator-table/TestCPPAccelerator.py
  lldb-api :: python_api/function_symbol/TestDisasmAPI.py
  lldb-api :: lang/objcxx/objc-builtin-types/TestObjCBuiltinTypes.py
  lldb-api :: functionalities/data-formatter/nsarraysynth/TestNSArraySynthetic.py
  lldb-api :: commands/frame/diagnose/dereference-argument/TestDiagnoseDereferenceArgument.py
  lldb-api :: commands/expression/import-std-module/unique_ptr-dbg-info-content/TestUniquePtrDbgInfoContent.py
  lldb-api :: tools/lldb-vscode/step/TestVSCode_step.py
  lldb-api :: macosx/find-dsym/deep-bundle/TestDeepBundle.py
  lldb-api :: commands/expression/ignore-artificial-constructors/TestIgnoreArtificialConstructors.py
  lldb-api :: functionalities/data-formatter/data-formatter-stl/libcxx/map/TestDataFormatterLibccMap.py
  lldb-api :: commands/expression/two-files/TestObjCTypeQueryFromOtherCompileUnit.py
  lldb-api :: functionalities/breakpoint/breakpoint_command/TestRegexpBreakCommand.py
  lldb-api :: commands/expression/completion-in-lambda-and-unnamed-class/TestCompletionInLambdaAndUnnamedClass.py
  lldb-api :: functionalities/data-formatter/data-formatter-stl/libcxx/tuple/TestDataFormatterLibcxxTuple.py
  lldb-api :: lang/cpp/member-and-local-vars-with-same-name/TestMembersAndLocalsWithSameName.py
  lldb-api :: functionalities/breakpoint/scripted_bkpt/TestScriptedResolver.py
  lldb-api :: functionalities/dlopen_other_executable/TestDlopenOtherExecutable.py
  lldb-api :: commands/frame/var/TestFrameVar.py
  lldb-api :: functionalities/load_using_paths/TestLoadUsingPaths.py
  lldb-api :: lang/cpp/template/TestTemplateArgs.py
  lldb-api :: lang/c/forward/TestForwardDeclaration.py
  lldb-api :: lang/objc/modules-cache/TestClangModulesCache.py
  lldb-api :: functionalities/tail_call_frames/cross_object/TestCrossObjectTailCalls.py
  lldb-api :: commands/expression/codegen-crash-import-def-arraytype-element/TestImportDefinitionArrayType.py
  lldb-api :: lang/cpp/const_this/TestConstThis.py
  lldb-api :: lang/cpp/class_types/TestClassTypesDisassembly.py
  lldb-api :: commands/expression/dont_allow_jit/TestAllowJIT.py
  lldb-api :: commands/process/launch/TestProcessLaunch.py
  lldb-api :: lang/c/complex_int/TestComplexInt.py
  lldb-api :: commands/gui/basicdebug/TestGuiBasicDebug.py
  lldb-api :: functionalities/thread/thread_specific_break/TestThreadSpecificBreakpoint.py
  lldb-api :: functionalities/data-formatter/data-formatter-caching/TestDataFormatterCaching.py
  lldb-api :: functionalities/load_unload/TestLoadUnload.py
  lldb-api :: lang/c/offsetof/TestOffsetof.py
  lldb-api :: functionalities/archives/TestBSDArchives.py
  lldb-api :: lang/cpp/nsimport/TestCppNsImport.py
  lldb-api :: lang/cpp/chained-calls/TestCppChainedCalls.py
  lldb-api :: functionalities/thread/concurrent_events/TestConcurrentTwoBreakpointsOneDelaySignal.py
  lldb-api :: functionalities/non-overlapping-index-variable-i/TestIndexVariable.py
  lldb-api :: python_api/objc_type/TestObjCType.py


Testing Time: 801.59s
  Unsupported      :  287
  Passed           : 1390
  Expectedly Failed:    9
  Timed Out        :    3
  Failed           :  572
FAILED: tools/lldb/test/CMakeFiles/check-lldb-lit 
cd /Users/buildslave/jenkins/workspace/lldb-cmake-matrix/lldb-build/tools/lldb/test && /usr/local/Frameworks/Python.framework/Versions/3.7/bin/python3.7 /Users/buildslave/jenkins/workspace/lldb-cmake-matrix/lldb-build/./bin/llvm-lit -v --time-tests --shuffle --xunit-xml-output=/Users/buildslave/jenkins/workspace/lldb-cmake-matrix/test/results.xml -v /Users/buildslave/jenkins/workspace/lldb-cmake-matrix/lldb-build/tools/lldb/test
ninja: build stopped: subcommand failed.
Command failed: Command '['/usr/bin/env', 'TERM=vt100', '/usr/local/bin/ninja', '-v', 'check-lldb']' returned non-zero exit status 1.
Command: ['/usr/bin/env', 'TERM=vt100', '/usr/local/bin/ninja', '-v', 'check-lldb']
+ set -e