SuccessConsole Output

Skipping 105,607 KB.. Full Log
 movl   %eax, %esi
0x7fff390edbf2 <+96>:  callq  0x7fff2fb277bc            ; symbol stub for: htmlCreateMemoryParserCtxt
0x7fff390edbf7 <+101>: movq   %rax, %r15
0x7fff390edbfa <+104>: movq   %rax, %rdi
0x7fff390edbfd <+107>: movl   $0x860, %esi              ; imm = 0x860 
0x7fff390edc02 <+112>: callq  0x7fff2fb277c2            ; symbol stub for: htmlCtxtUseOptions
0x7fff390edc07 <+117>: orb    $0x1, 0x234(%r15)
0x7fff390edc0f <+125>: testq  %r12, %r12
0x7fff390edc12 <+128>: je     0x7fff2fa77c2c            ; <+154>
0x7fff390edc14 <+130>: movq   %r12, %rdi
0x7fff390edc17 <+133>: callq  0x7fff2fb280fe            ; symbol stub for: xmlFindCharEncodingHandler
0x7fff390edc1c <+138>: testq  %rax, %rax
0x7fff390edc1f <+141>: je     0x7fff2fa77c2c            ; <+154>
0x7fff390edc21 <+143>: movq   %r15, %rdi
0x7fff390edc24 <+146>: movq   %rax, %rsi
0x7fff390edc27 <+149>: callq  0x7fff2fb28266            ; symbol stub for: xmlSwitchToEncoding
0x7fff390edc2c <+154>: movq   %r15, %rdi
0x7fff390edc2f <+157>: callq  0x7fff2fb277c8            ; symbol stub for: htmlParseDocument
0x7fff390edc34 <+162>: movq   0x10(%r15), %r12
0x7fff390edc38 <+166>: testq  %r12, %r12
0x7fff390edc3b <+169>: je     0x7fff2fa77c6b            ; <+217>
0x7fff390edc3d <+171>: cmpq   $0x0, 0x50(%r12)
0x7fff390edc43 <+177>: movq   0x18(%r12), %rbx
0x7fff390edc48 <+182>: jne    0x7fff2fa77c5a            ; <+200>
0x7fff390edc4a <+184>: jmp    0x7fff2fa77c5e            ; <+204>
0x7fff390edc4c <+186>: movq   %rbx, %rdi
0x7fff390edc4f <+189>: movq   %r13, %rsi
0x7fff390edc52 <+192>: movq   %r14, %rdx
0x7fff390edc55 <+195>: callq  0x7fff2fa78455            ; _contentFromLibxml2Node
0x7fff390edc5a <+200>: movq   0x30(%rbx), %rbx
0x7fff390edc5e <+204>: testq  %rbx, %rbx
0x7fff390edc61 <+207>: jne    0x7fff2fa77c4c            ; <+186>
0x7fff390edc63 <+209>: movq   %r12, %rdi
0x7fff390edc66 <+212>: callq  0x7fff2fb28104            ; symbol stub for: xmlFreeDoc
0x7fff390edc6b <+217>: movq   %r15, %rdi
0x7fff390edc6e <+220>: callq  0x7fff2fb28116            ; symbol stub for: xmlFreeParserCtxt
0x7fff390edc73 <+225>: movq   %r13, %rax
0x7fff390edc76 <+228>: addq   $0x8, %rsp
0x7fff390edc7a <+232>: popq   %rbx
0x7fff390edc7b <+233>: popq   %r12
0x7fff390edc7d <+235>: popq   %r13
0x7fff390edc7f <+237>: popq   %r14
0x7fff390edc81 <+239>: popq   %r15
0x7fff390edc83 <+241>: popq   %rbp
0x7fff390edc84 <+242>: retq   


runCmd: image lookup -s "_NS_OSAGetSource"
output: 1 symbols match '_NS_OSAGetSource' in /System/Library/Frameworks/Foundation.framework/Versions/C/Foundation:
        Address: Foundation[0x00007fff2fa95d84] (Foundation.__TEXT.__text + 2576148)
        Summary: Foundation`_NS_OSAGetSource


runCmd: disassemble --force -n "_NS_OSAGetSource"
output: Foundation`_NS_OSAGetSource:
0x7fff3910bd84 <+0>:  pushq  %rbp
0x7fff3910bd85 <+1>:  movq   %rsp, %rbp
0x7fff3910bd88 <+4>:  pushq  %r15
0x7fff3910bd8a <+6>:  pushq  %r14
0x7fff3910bd8c <+8>:  pushq  %r12
0x7fff3910bd8e <+10>: pushq  %rbx
0x7fff3910bd8f <+11>: movq   %rcx, %r14
0x7fff3910bd92 <+14>: movl   %edx, %r15d
0x7fff3910bd95 <+17>: movl   %esi, %r12d
0x7fff3910bd98 <+20>: movq   %rdi, %rbx
0x7fff3910bd9b <+23>: movq   0x555b8cae(%rip), %rax    ; _NS_OSAGetSource.funcPtr
0x7fff3910bda2 <+30>: testq  %rax, %rax
0x7fff3910bda5 <+33>: jne    0x7fff2fa95dcf            ; <+75>
0x7fff3910bda7 <+35>: leaq   0x554ccaea(%rip), %rdi    ; @"Carbon"
0x7fff3910bdae <+42>: leaq   0x554ccb03(%rip), %rsi    ; @"OpenScripting"
0x7fff3910bdb5 <+49>: leaq   0xcbc49(%rip), %rdx       ; "OSAGetSource"
0x7fff3910bdbc <+56>: leaq   0x555b5555(%rip), %rcx    ; GetFrameworkFuncPtr.libraryHandle
0x7fff3910bdc3 <+63>: callq  0x7fff2f8b4437            ; _NSSoftLinkingGetFrameworkFunction
0x7fff3910bdc8 <+68>: movq   %rax, 0x555b8c81(%rip)    ; _NS_OSAGetSource.funcPtr
0x7fff3910bdcf <+75>: movq   %rbx, %rdi
0x7fff3910bdd2 <+78>: movl   %r12d, %esi
0x7fff3910bdd5 <+81>: movl   %r15d, %edx
0x7fff3910bdd8 <+84>: movq   %r14, %rcx
0x7fff3910bddb <+87>: popq   %rbx
0x7fff3910bddc <+88>: popq   %r12
0x7fff3910bdde <+90>: popq   %r14
0x7fff3910bde0 <+92>: popq   %r15
0x7fff3910bde2 <+94>: popq   %rbp
0x7fff3910bde3 <+95>: jmpq   *%rax


runCmd: image lookup -s "_NS_os_log_callback"
output: 1 symbols match '_NS_os_log_callback' in /System/Library/Frameworks/Foundation.framework/Versions/C/Foundation:
        Address: Foundation[0x00007fff2f840ee1] (Foundation.__TEXT.__text + 131185)
        Summary: Foundation`_NS_os_log_callback


runCmd: disassemble --force -n "_NS_os_log_callback"
output: Foundation`_NS_os_log_callback:
0x7fff38eb6ee1 <+0>:   pushq  %rbp
0x7fff38eb6ee2 <+1>:   movq   %rsp, %rbp
0x7fff38eb6ee5 <+4>:   pushq  %r15
0x7fff38eb6ee7 <+6>:   pushq  %r14
0x7fff38eb6ee9 <+8>:   pushq  %r13
0x7fff38eb6eeb <+10>:  pushq  %r12
0x7fff38eb6eed <+12>:  pushq  %rbx
0x7fff38eb6eee <+13>:  subq   $0x78, %rsp
0x7fff38eb6ef2 <+17>:  movq   0x5570f72f(%rip), %rax    ; (void *)0x00007fff96f46d40: __stack_chk_guard
0x7fff38eb6ef9 <+24>:  movq   (%rax), %rax
0x7fff38eb6efc <+27>:  movq   %rax, -0x30(%rbp)
0x7fff38eb6f00 <+31>:  testq  %rdi, %rdi
0x7fff38eb6f03 <+34>:  je     0x7fff2f840fd5            ; <+244>
0x7fff38eb6f09 <+40>:  movq   %rcx, %r13
0x7fff38eb6f0c <+43>:  movq   %rdx, %r12
0x7fff38eb6f0f <+46>:  movq   %rsi, %r15
0x7fff38eb6f12 <+49>:  movq   %rdi, %rbx
0x7fff38eb6f15 <+52>:  callq  0x7fff2fb279fc            ; symbol stub for: objc_autoreleasePoolPush
0x7fff38eb6f1a <+57>:  movq   %rax, -0x68(%rbp)
0x7fff38eb6f1e <+61>:  movq   0x557ebc9b(%rip), %rsi    ; "isProxy"
0x7fff38eb6f25 <+68>:  movq   %rbx, %rdi
0x7fff38eb6f28 <+71>:  callq  *0x5570fd0a(%rip)         ; (void *)0x00007fff6f73de40: objc_msgSend
0x7fff38eb6f2e <+77>:  testb  %al, %al
0x7fff38eb6f30 <+79>:  jne    0x7fff2f840f3e            ; <+93>
0x7fff38eb6f32 <+81>:  movq   %rbx, %rdi
0x7fff38eb6f35 <+84>:  callq  0x7fff2fb27b22            ; symbol stub for: object_isClass
0x7fff38eb6f3a <+89>:  testb  %al, %al
0x7fff38eb6f3c <+91>:  je     0x7fff2f840f51            ; <+112>
0x7fff38eb6f3e <+93>:  movq   0x557e72c3(%rip), %rsi    ; "description"
0x7fff38eb6f45 <+100>: movq   %rbx, %rdi
0x7fff38eb6f48 <+103>: callq  *0x5570fcea(%rip)         ; (void *)0x00007fff6f73de40: objc_msgSend
0x7fff38eb6f4e <+109>: movq   %rax, %rbx
0x7fff38eb6f51 <+112>: movq   %rbx, %rdi
0x7fff38eb6f54 <+115>: callq  0x7fff2fb27150            ; symbol stub for: _NSIsNSObject
0x7fff38eb6f59 <+120>: testb  %al, %al
0x7fff38eb6f5b <+122>: je     0x7fff2f840fcc            ; <+235>
0x7fff38eb6f5d <+124>: testq  %r13, %r13
0x7fff38eb6f60 <+127>: je     0x7fff2f840f69            ; <+136>
0x7fff38eb6f62 <+129>: cmpb   $0x0, (%r13)
0x7fff38eb6f67 <+134>: je     0x7fff2f840fe5            ; <+260>
0x7fff38eb6f69 <+136>: movq   %rbx, %rdi
0x7fff38eb6f6c <+139>: callq  0x7fff2fb2714a            ; symbol stub for: _NSIsNSNumber
0x7fff38eb6f71 <+144>: testb  %al, %al
0x7fff38eb6f73 <+146>: je     0x7fff2f840f7a            ; <+153>
0x7fff38eb6f75 <+148>: movb   $0x0, (%r13)
0x7fff38eb6f7a <+153>: movq   %rbx, %rdi
0x7fff38eb6f7d <+156>: callq  0x7fff2fb27132            ; symbol stub for: _NSIsNSCFConstantString
0x7fff38eb6f82 <+161>: testb  %al, %al
0x7fff38eb6f84 <+163>: je     0x7fff2f840f8b            ; <+170>
0x7fff38eb6f86 <+165>: movb   $0x0, (%r13)
0x7fff38eb6f8b <+170>: movq   0x557e7166(%rip), %rsi    ; "class"
0x7fff38eb6f92 <+177>: movq   %rbx, %rdi
0x7fff38eb6f95 <+180>: callq  *0x5570fc9d(%rip)         ; (void *)0x00007fff6f73de40: objc_msgSend
0x7fff38eb6f9b <+186>: movq   0x557ebc26(%rip), %r14    ; "redactedDescription"
0x7fff38eb6fa2 <+193>: movq   %rax, %rdi
0x7fff38eb6fa5 <+196>: movq   %r14, %rsi
0x7fff38eb6fa8 <+199>: callq  0x7fff2fb2746e            ; symbol stub for: class_respondsToSelector
0x7fff38eb6fad <+204>: testb  %al, %al
0x7fff38eb6faf <+206>: je     0x7fff2f840fdc            ; <+251>
0x7fff38eb6fb1 <+208>: movq   %rbx, %rdi
0x7fff38eb6fb4 <+211>: movq   %r14, %rsi
0x7fff38eb6fb7 <+214>: callq  *0x5570fc7b(%rip)         ; (void *)0x00007fff6f73de40: objc_msgSend
0x7fff38eb6fbd <+220>: movq   %rax, %r14
0x7fff38eb6fc0 <+223>: testq  %r13, %r13
0x7fff38eb6fc3 <+226>: je     0x7fff2f840ff8            ; <+279>
0x7fff38eb6fc5 <+228>: movb   $0x0, (%r13)
0x7fff38eb6fca <+233>: jmp    0x7fff2f840ff8            ; <+279>
0x7fff38eb6fcc <+235>: movq   -0x68(%rbp), %rdi
0x7fff38eb6fd0 <+239>: callq  0x7fff2fb279f6            ; symbol stub for: objc_autoreleasePoolPop
0x7fff38eb6fd5 <+244>: xorl   %ebx, %ebx
0x7fff38eb6fd7 <+246>: jmp    0x7fff2f841258            ; <+887>
0x7fff38eb6fdc <+251>: leaq   0x55720f35(%rip), %r14    ; @""
0x7fff38eb6fe3 <+258>: jmp    0x7fff2f840ff8            ; <+279>
0x7fff38eb6fe5 <+260>: movq   0x557e721c(%rip), %rsi    ; "description"
0x7fff38eb6fec <+267>: movq   %rbx, %rdi
0x7fff38eb6fef <+270>: callq  *0x5570fc43(%rip)         ; (void *)0x00007fff6f73de40: objc_msgSend
0x7fff38eb6ff5 <+276>: movq   %rax, %r14
0x7fff38eb6ff8 <+279>: movq   0x557e74a9(%rip), %rsi    ; "length"
0x7fff38eb6fff <+286>: movq   %r14, %rdi
0x7fff38eb7002 <+289>: callq  *0x5570fc30(%rip)         ; (void *)0x00007fff6f73de40: objc_msgSend
0x7fff38eb7008 <+295>: testq  %rax, %rax
0x7fff38eb700b <+298>: je     0x7fff2f8410cb            ; <+490>
0x7fff38eb7011 <+304>: cmpq   $0x2, %r12
0x7fff38eb7015 <+308>: jb     0x7fff2f84124d            ; <+876>
0x7fff38eb701b <+314>: xorl   %ecx, %ecx
0x7fff38eb701d <+316>: movq   %rcx, -0x58(%rbp)
0x7fff38eb7021 <+320>: movq   %rax, -0x50(%rbp)
0x7fff38eb7025 <+324>: leaq   -0x1(%r12), %r13
0x7fff38eb702a <+329>: leaq   -0x60(%rbp), %r8
0x7fff38eb702e <+333>: movq   %rcx, (%r8)
0x7fff38eb7031 <+336>: movq   0x557e76b0(%rip), %rsi    ; "getBytes:maxLength:usedLength:encoding:options:range:remainingRange:"
0x7fff38eb7038 <+343>: movq   -0x58(%rbp), %rax
0x7fff38eb703c <+347>: movq   -0x50(%rbp), %rdx
0x7fff38eb7040 <+351>: movq   %rdx, 0x10(%rsp)
0x7fff38eb7045 <+356>: movq   %rax, 0x8(%rsp)
0x7fff38eb704a <+361>: movq   %rcx, 0x18(%rsp)
0x7fff38eb704f <+366>: movq   $0x2, (%rsp)
0x7fff38eb7057 <+374>: movl   $0x4, %r9d
0x7fff38eb705d <+380>: movq   %r14, %rdi
0x7fff38eb7060 <+383>: movq   %r15, %rdx
0x7fff38eb7063 <+386>: movq   %r13, %rcx
0x7fff38eb7066 <+389>: callq  *0x5570fbcc(%rip)         ; (void *)0x00007fff6f73de40: objc_msgSend
0x7fff38eb706c <+395>: testb  %al, %al
0x7fff38eb706e <+397>: jne    0x7fff2f8410bb            ; <+474>
0x7fff38eb7070 <+399>: movq   -0x58(%rbp), %rax
0x7fff38eb7074 <+403>: movq   -0x50(%rbp), %rcx
0x7fff38eb7078 <+407>: movq   %rcx, 0x10(%rsp)
0x7fff38eb707d <+412>: movq   %rax, 0x8(%rsp)
0x7fff38eb7082 <+417>: movq   $0x0, 0x18(%rsp)
0x7fff38eb708b <+426>: movq   $0x2, (%rsp)
0x7fff38eb7093 <+434>: leaq   -0x60(%rbp), %r8
0x7fff38eb7097 <+438>: movl   $0x7, %r9d
0x7fff38eb709d <+444>: movq   %r14, %rdi
0x7fff38eb70a0 <+447>: movq   0x557e7641(%rip), %rsi    ; "getBytes:maxLength:usedLength:encoding:options:range:remainingRange:"
0x7fff38eb70a7 <+454>: movq   %r15, %rdx
0x7fff38eb70aa <+457>: movq   %r13, %rcx
0x7fff38eb70ad <+460>: callq  *0x5570fb85(%rip)         ; (void *)0x00007fff6f73de40: objc_msgSend
0x7fff38eb70b3 <+466>: testb  %al, %al
0x7fff38eb70b5 <+468>: je     0x7fff2f84124d            ; <+876>
0x7fff38eb70bb <+474>: movq   -0x60(%rbp), %rax
0x7fff38eb70bf <+478>: movb   $0x0, (%r15,%rax)
0x7fff38eb70c4 <+483>: movb   $0x1, %bl
0x7fff38eb70c6 <+485>: jmp    0x7fff2f84124f            ; <+878>
0x7fff38eb70cb <+490>: movb   $0x1, %bl
0x7fff38eb70cd <+492>: testq  %r15, %r15
0x7fff38eb70d0 <+495>: je     0x7fff2f84124f            ; <+878>
0x7fff38eb70d6 <+501>: testq  %r12, %r12
0x7fff38eb70d9 <+504>: je     0x7fff2f84124f            ; <+878>
0x7fff38eb70df <+510>: movb   $0x0, (%r15)
0x7fff38eb70e3 <+514>: jmp    0x7fff2f84124f            ; <+878>
0x7fff38eb70e8 <+519>: jmp    0x7fff2f8410ea            ; <+521>
0x7fff38eb70ea <+521>: movq   %rdx, %r14
0x7fff38eb70ed <+524>: movq   %rax, %rdi
0x7fff38eb70f0 <+527>: callq  0x7fff2fb27a02            ; symbol stub for: objc_begin_catch
0x7fff38eb70f5 <+532>: cmpl   $0x2, %r14d
0x7fff38eb70f9 <+536>: jne    0x7fff2f841248            ; <+871>
0x7fff38eb70ff <+542>: movq   %rax, %r13
0x7fff38eb7102 <+545>: movq   0x557f23e7(%rip), %rax    ; (void *)0x00007fff8e6bae08: NSString
0x7fff38eb7109 <+552>: movq   %rax, -0x80(%rbp)
0x7fff38eb710d <+556>: movq   0x557e6fe4(%rip), %rsi    ; "class"
0x7fff38eb7114 <+563>: movq   %rbx, %rdi
0x7fff38eb7117 <+566>: callq  *0x5570fb1b(%rip)         ; (void *)0x00007fff6f73de40: objc_msgSend
0x7fff38eb711d <+572>: movq   %rax, -0x78(%rbp)
0x7fff38eb7121 <+576>: movq   0x557e81e0(%rip), %rsi    ; "name"
0x7fff38eb7128 <+583>: movq   %r13, %rdi
0x7fff38eb712b <+586>: callq  *0x5570fb07(%rip)         ; (void *)0x00007fff6f73de40: objc_msgSend
0x7fff38eb7131 <+592>: movq   %rax, -0x70(%rbp)
0x7fff38eb7135 <+596>: movq   0x557e865c(%rip), %rsi    ; "reason"
0x7fff38eb713c <+603>: movq   %r13, %rdi
0x7fff38eb713f <+606>: callq  *0x5570faf3(%rip)         ; (void *)0x00007fff6f73de40: objc_msgSend
0x7fff38eb7145 <+612>: movq   %rax, %r14
0x7fff38eb7148 <+615>: movq   0x557e95b9(%rip), %rsi    ; "callStackSymbols"
0x7fff38eb714f <+622>: movq   %r13, %rdi
0x7fff38eb7152 <+625>: callq  *0x5570fae0(%rip)         ; (void *)0x00007fff6f73de40: objc_msgSend
0x7fff38eb7158 <+631>: movq   0x557e6fa1(%rip), %rsi    ; "stringWithFormat:"
0x7fff38eb715f <+638>: movq   %rax, 0x8(%rsp)
0x7fff38eb7164 <+643>: movq   %r14, (%rsp)
0x7fff38eb7168 <+647>: leaq   0x55731689(%rip), %rdx    ; @"-[%@:%p description] raised exception: name:%@ reason:%@ backtrace:%@"
0x7fff38eb716f <+654>: movq   -0x80(%rbp), %rdi
0x7fff38eb7173 <+658>: movq   -0x78(%rbp), %rcx
0x7fff38eb7177 <+662>: movq   %rbx, %r8
0x7fff38eb717a <+665>: movq   -0x70(%rbp), %r9
0x7fff38eb717e <+669>: xorl   %eax, %eax
0x7fff38eb7180 <+671>: callq  *0x5570fab2(%rip)         ; (void *)0x00007fff6f73de40: objc_msgSend
0x7fff38eb7186 <+677>: movq   %rax, %rbx
0x7fff38eb7189 <+680>: testq  %rax, %rax
0x7fff38eb718c <+683>: je     0x7fff2f84128b            ; <+938>
0x7fff38eb7192 <+689>: movq   0x557e730f(%rip), %rsi    ; "length"
0x7fff38eb7199 <+696>: movq   %rbx, %rdi
0x7fff38eb719c <+699>: callq  *0x5570fa96(%rip)         ; (void *)0x00007fff6f73de40: objc_msgSend
0x7fff38eb71a2 <+705>: xorl   %ecx, %ecx
0x7fff38eb71a4 <+707>: movq   %rcx, -0x40(%rbp)
0x7fff38eb71a8 <+711>: movq   %rax, -0x38(%rbp)
0x7fff38eb71ac <+715>: decq   %r12
0x7fff38eb71af <+718>: leaq   -0x48(%rbp), %r8
0x7fff38eb71b3 <+722>: movq   %rcx, (%r8)
0x7fff38eb71b6 <+725>: movq   0x557e752b(%rip), %r14    ; "getBytes:maxLength:usedLength:encoding:options:range:remainingRange:"
0x7fff38eb71bd <+732>: movq   -0x40(%rbp), %rax
0x7fff38eb71c1 <+736>: movq   -0x38(%rbp), %rdx
0x7fff38eb71c5 <+740>: movq   %rdx, 0x10(%rsp)
0x7fff38eb71ca <+745>: movq   %rax, 0x8(%rsp)
0x7fff38eb71cf <+750>: movq   %rcx, 0x18(%rsp)
0x7fff38eb71d4 <+755>: movq   $0x2, (%rsp)
0x7fff38eb71dc <+763>: movl   $0x4, %r9d
0x7fff38eb71e2 <+769>: movq   %rbx, %rdi
0x7fff38eb71e5 <+772>: movq   %r14, %rsi
0x7fff38eb71e8 <+775>: movq   %r15, %rdx
0x7fff38eb71eb <+778>: movq   %r12, %rcx
0x7fff38eb71ee <+781>: callq  *0x5570fa44(%rip)         ; (void *)0x00007fff6f73de40: objc_msgSend
0x7fff38eb71f4 <+787>: testb  %al, %al
0x7fff38eb71f6 <+789>: jne    0x7fff2f84123b            ; <+858>
0x7fff38eb71f8 <+791>: movq   -0x40(%rbp), %rax
0x7fff38eb71fc <+795>: movq   -0x38(%rbp), %rcx
0x7fff38eb7200 <+799>: movq   %rcx, 0x10(%rsp)
0x7fff38eb7205 <+804>: movq   %rax, 0x8(%rsp)
0x7fff38eb720a <+809>: movq   $0x0, 0x18(%rsp)
0x7fff38eb7213 <+818>: movq   $0x2, (%rsp)
0x7fff38eb721b <+826>: leaq   -0x48(%rbp), %r8
0x7fff38eb721f <+830>: movl   $0x7, %r9d
0x7fff38eb7225 <+836>: movq   %rbx, %rdi
0x7fff38eb7228 <+839>: movq   %r14, %rsi
0x7fff38eb722b <+842>: movq   %r15, %rdx
0x7fff38eb722e <+845>: movq   %r12, %rcx
0x7fff38eb7231 <+848>: callq  *0x5570fa01(%rip)         ; (void *)0x00007fff6f73de40: objc_msgSend
0x7fff38eb7237 <+854>: testb  %al, %al
0x7fff38eb7239 <+856>: je     0x7fff2f84128b            ; <+938>
0x7fff38eb723b <+858>: movq   -0x48(%rbp), %rax
0x7fff38eb723f <+862>: movb   $0x0, (%r15,%rax)
0x7fff38eb7244 <+867>: movb   $0x1, %bl
0x7fff38eb7246 <+869>: jmp    0x7fff2f84128d            ; <+940>
0x7fff38eb7248 <+871>: callq  0x7fff2fb27a38            ; symbol stub for: objc_end_catch
0x7fff38eb724d <+876>: xorl   %ebx, %ebx
0x7fff38eb724f <+878>: movq   -0x68(%rbp), %rdi
0x7fff38eb7253 <+882>: callq  0x7fff2fb279f6            ; symbol stub for: objc_autoreleasePoolPop
0x7fff38eb7258 <+887>: movq   0x5570f3c9(%rip), %rax    ; (void *)0x00007fff96f46d40: __stack_chk_guard
0x7fff38eb725f <+894>: movq   (%rax), %rax
0x7fff38eb7262 <+897>: cmpq   -0x30(%rbp), %rax
0x7fff38eb7266 <+901>: jne    0x7fff2f841279            ; <+920>
0x7fff38eb7268 <+903>: movl   %ebx, %eax
0x7fff38eb726a <+905>: addq   $0x78, %rsp
0x7fff38eb726e <+909>: popq   %rbx
0x7fff38eb726f <+910>: popq   %r12
0x7fff38eb7271 <+912>: popq   %r13
0x7fff38eb7273 <+914>: popq   %r14
0x7fff38eb7275 <+916>: popq   %r15
0x7fff38eb7277 <+918>: popq   %rbp
0x7fff38eb7278 <+919>: retq   
0x7fff38eb7279 <+920>: callq  0x7fff2fb2724c            ; symbol stub for: __stack_chk_fail
0x7fff38eb727e <+925>: movq   %rax, %rdi
0x7fff38eb7281 <+928>: callq  0x7fff2fb27a02            ; symbol stub for: objc_begin_catch
0x7fff38eb7286 <+933>: callq  0x7fff2fb27a38            ; symbol stub for: objc_end_catch
0x7fff38eb728b <+938>: xorl   %ebx, %ebx
0x7fff38eb728d <+940>: callq  0x7fff2fb27a38            ; symbol stub for: objc_end_catch
0x7fff38eb7292 <+945>: jmp    0x7fff2f84124f            ; <+878>
0x7fff38eb7294 <+947>: movq   %rax, %rbx
0x7fff38eb7297 <+950>: callq  0x7fff2fb27a38            ; symbol stub for: objc_end_catch
0x7fff38eb729c <+955>: movq   %rbx, %rdi
0x7fff38eb729f <+958>: callq  0x7fff2fb27180            ; symbol stub for: _Unwind_Resume
0x7fff38eb72a4 <+963>: ud2    


runCmd: image lookup -s "_NXAccessFile"
output: 1 symbols match '_NXAccessFile' in /System/Library/Frameworks/Foundation.framework/Versions/C/Foundation:
        Address: Foundation[0x00007fff2fab4ae8] (Foundation.__TEXT.__text + 2702456)
        Summary: Foundation`_NXAccessFile


runCmd: disassemble --force -n "_NXAccessFile"
output: Foundation`_NXAccessFile:
0x7fff3912aae8 <+0>:   pushq  %rbp
0x7fff3912aae9 <+1>:   movq   %rsp, %rbp
0x7fff3912aaec <+4>:   pushq  %r15
0x7fff3912aaee <+6>:   pushq  %r14
0x7fff3912aaf0 <+8>:   pushq  %rbx
0x7fff3912aaf1 <+9>:   pushq  %rax
0x7fff3912aaf2 <+10>:  movq   %rsi, %rbx
0x7fff3912aaf5 <+13>:  movq   %rdi, %r14
0x7fff3912aaf8 <+16>:  movq   0x5557ebb9(%rip), %rdi    ; (void *)0x00007fff8e6b91c0: NSFileManager
0x7fff3912aaff <+23>:  movq   0x5557436a(%rip), %rsi    ; "defaultManager"
0x7fff3912ab06 <+30>:  callq  *0x5549c12c(%rip)         ; (void *)0x00007fff6f73de40: objc_msgSend
0x7fff3912ab0c <+36>:  movq   %rax, %r15
0x7fff3912ab0f <+39>:  testq  %rbx, %rbx
0x7fff3912ab12 <+42>:  je     0x7fff2fab4b5c            ; <+116>
0x7fff3912ab14 <+44>:  movb   $0x1, %al
0x7fff3912ab16 <+46>:  testb  $0x4, %bl
0x7fff3912ab19 <+49>:  je     0x7fff2fab4b2e            ; <+70>
0x7fff3912ab1b <+51>:  movq   0x5557b926(%rip), %rsi    ; "isReadableFileAtPath:"
0x7fff3912ab22 <+58>:  movq   %r15, %rdi
0x7fff3912ab25 <+61>:  movq   %r14, %rdx
0x7fff3912ab28 <+64>:  callq  *0x5549c10a(%rip)         ; (void *)0x00007fff6f73de40: objc_msgSend
0x7fff3912ab2e <+70>:  testb  $0x2, %bl
0x7fff3912ab31 <+73>:  je     0x7fff2fab4b4a            ; <+98>
0x7fff3912ab33 <+75>:  testb  %al, %al
0x7fff3912ab35 <+77>:  je     0x7fff2fab4b4a            ; <+98>
0x7fff3912ab37 <+79>:  movq   0x55575ee2(%rip), %rsi    ; "isWritableFileAtPath:"
0x7fff3912ab3e <+86>:  movq   %r15, %rdi
0x7fff3912ab41 <+89>:  movq   %r14, %rdx
0x7fff3912ab44 <+92>:  callq  *0x5549c0ee(%rip)         ; (void *)0x00007fff6f73de40: objc_msgSend
0x7fff3912ab4a <+98>:  testb  $0x1, %bl
0x7fff3912ab4d <+101>: je     0x7fff2fab4b72            ; <+138>
0x7fff3912ab4f <+103>: testb  %al, %al
0x7fff3912ab51 <+105>: je     0x7fff2fab4b72            ; <+138>
0x7fff3912ab53 <+107>: leaq   0x55579abe(%rip), %rax    ; "isExecutableFileAtPath:"
0x7fff3912ab5a <+114>: jmp    0x7fff2fab4b63            ; <+123>
0x7fff3912ab5c <+116>: leaq   0x55575ec5(%rip), %rax    ; "fileExistsAtPath:"
0x7fff3912ab63 <+123>: movq   (%rax), %rsi
0x7fff3912ab66 <+126>: movq   %r15, %rdi
0x7fff3912ab69 <+129>: movq   %r14, %rdx
0x7fff3912ab6c <+132>: callq  *0x5549c0c6(%rip)         ; (void *)0x00007fff6f73de40: objc_msgSend
0x7fff3912ab72 <+138>: cmpb   $0x1, %al
0x7fff3912ab74 <+140>: sbbq   %rax, %rax
0x7fff3912ab77 <+143>: addq   $0x8, %rsp
0x7fff3912ab7b <+147>: popq   %rbx
0x7fff3912ab7c <+148>: popq   %r14
0x7fff3912ab7e <+150>: popq   %r15
0x7fff3912ab80 <+152>: popq   %rbp
0x7fff3912ab81 <+153>: retq   


runCmd: image lookup -s "_NXCurrentWorkingDir"
output: 1 symbols match '_NXCurrentWorkingDir' in /System/Library/Frameworks/Foundation.framework/Versions/C/Foundation:
        Address: Foundation[0x00007fff2fab4a68] (Foundation.__TEXT.__text + 2702328)
        Summary: Foundation`_NXCurrentWorkingDir


runCmd: disassemble --force -n "_NXCurrentWorkingDir"
output: Foundation`_NXCurrentWorkingDir:
0x7fff3912aa68 <+0>:  pushq  %rbp
0x7fff3912aa69 <+1>:  movq   %rsp, %rbp
0x7fff3912aa6c <+4>:  pushq  %rbx
0x7fff3912aa6d <+5>:  pushq  %rax
0x7fff3912aa6e <+6>:  movq   0x5557ec43(%rip), %rdi    ; (void *)0x00007fff8e6b91c0: NSFileManager
0x7fff3912aa75 <+13>: movq   0x555743f4(%rip), %rsi    ; "defaultManager"
0x7fff3912aa7c <+20>: movq   0x5549c1b5(%rip), %rbx    ; (void *)0x00007fff6f73de40: objc_msgSend
0x7fff3912aa83 <+27>: callq  *%rbx
0x7fff3912aa85 <+29>: movq   0x55575f8c(%rip), %rsi    ; "currentDirectoryPath"
0x7fff3912aa8c <+36>: movq   %rax, %rdi
0x7fff3912aa8f <+39>: movq   %rbx, %rax
0x7fff3912aa92 <+42>: addq   $0x8, %rsp
0x7fff3912aa96 <+46>: popq   %rbx
0x7fff3912aa97 <+47>: popq   %rbp
0x7fff3912aa98 <+48>: jmpq   *%rax


runCmd: image lookup -s "_NXMakeDirs"
output: 1 symbols match '_NXMakeDirs' in /System/Library/Frameworks/Foundation.framework/Versions/C/Foundation:
        Address: Foundation[0x00007fff2fab553e] (Foundation.__TEXT.__text + 2705102)
        Summary: Foundation`_NXMakeDirs


runCmd: disassemble --force -n "_NXMakeDirs"
output: Foundation`_NXMakeDirs:
0x7fff3912b53e <+0>:   pushq  %rbp
0x7fff3912b53f <+1>:   movq   %rsp, %rbp
0x7fff3912b542 <+4>:   pushq  %r15
0x7fff3912b544 <+6>:   pushq  %r14
0x7fff3912b546 <+8>:   pushq  %r13
0x7fff3912b548 <+10>:  pushq  %r12
0x7fff3912b54a <+12>:  pushq  %rbx
0x7fff3912b54b <+13>:  pushq  %rax
0x7fff3912b54c <+14>:  movq   %rsi, %r15
0x7fff3912b54f <+17>:  movq   %rdi, %rbx
0x7fff3912b552 <+20>:  movq   0x55572c77(%rip), %rsi    ; "isEqualToString:"
0x7fff3912b559 <+27>:  leaq   0x554ac9b8(%rip), %rdx    ; @""
0x7fff3912b560 <+34>:  callq  *0x5549b6d2(%rip)         ; (void *)0x00007fff6f73de40: objc_msgSend
0x7fff3912b566 <+40>:  testb  %al, %al
0x7fff3912b568 <+42>:  jne    0x7fff2fab5599            ; <+91>
0x7fff3912b56a <+44>:  movq   0x5557e147(%rip), %rdi    ; (void *)0x00007fff8e6b91c0: NSFileManager
0x7fff3912b571 <+51>:  movq   0x555738f8(%rip), %r14    ; "defaultManager"
0x7fff3912b578 <+58>:  movq   0x5549b6b9(%rip), %r13    ; (void *)0x00007fff6f73de40: objc_msgSend
0x7fff3912b57f <+65>:  movq   %r14, %rsi
0x7fff3912b582 <+68>:  callq  *%r13
0x7fff3912b585 <+71>:  movq   0x5557549c(%rip), %rsi    ; "fileExistsAtPath:"
0x7fff3912b58c <+78>:  movq   %rax, %rdi
0x7fff3912b58f <+81>:  movq   %rbx, %rdx
0x7fff3912b592 <+84>:  callq  *%r13
0x7fff3912b595 <+87>:  testb  %al, %al
0x7fff3912b597 <+89>:  je     0x7fff2fab55aa            ; <+108>
0x7fff3912b599 <+91>:  xorl   %eax, %eax
0x7fff3912b59b <+93>:  addq   $0x8, %rsp
0x7fff3912b59f <+97>:  popq   %rbx
0x7fff3912b5a0 <+98>:  popq   %r12
0x7fff3912b5a2 <+100>: popq   %r13
0x7fff3912b5a4 <+102>: popq   %r14
0x7fff3912b5a6 <+104>: popq   %r15
0x7fff3912b5a8 <+106>: popq   %rbp
0x7fff3912b5a9 <+107>: retq   
0x7fff3912b5aa <+108>: movq   0x5557394f(%rip), %rsi    ; "stringByDeletingLastPathComponent"
0x7fff3912b5b1 <+115>: movq   %rbx, %rdi
0x7fff3912b5b4 <+118>: callq  *0x5549b67e(%rip)         ; (void *)0x00007fff6f73de40: objc_msgSend
0x7fff3912b5ba <+124>: movq   %rax, %rdi
0x7fff3912b5bd <+127>: movq   %r15, %rsi
0x7fff3912b5c0 <+130>: callq  0x7fff2fab553e            ; <+0>
0x7fff3912b5c5 <+135>: movq   %rax, %rcx
0x7fff3912b5c8 <+138>: movq   $-0x1, %rax
0x7fff3912b5cf <+145>: testq  %rcx, %rcx
0x7fff3912b5d2 <+148>: jne    0x7fff2fab559b            ; <+93>
0x7fff3912b5d4 <+150>: movq   0x5557df35(%rip), %rdi    ; (void *)0x00007fff8e6b9f08: NSNumber
0x7fff3912b5db <+157>: callq  0x7fff2fb279de            ; symbol stub for: objc_allocWithZone
0x7fff3912b5e0 <+162>: movq   0x55574be9(%rip), %rsi    ; "initWithInt:"
0x7fff3912b5e7 <+169>: movq   %rax, %rdi
0x7fff3912b5ea <+172>: movl   %r15d, %edx
0x7fff3912b5ed <+175>: callq  *%r13
0x7fff3912b5f0 <+178>: movq   %rax, %r15
0x7fff3912b5f3 <+181>: movq   0x5557df8e(%rip), %rdi    ; (void *)0x00007fff8e143288: NSDictionary
0x7fff3912b5fa <+188>: callq  0x7fff2fb279de            ; symbol stub for: objc_allocWithZone
0x7fff3912b5ff <+193>: leaq   0x5549faba(%rip), %rcx    ; NSFilePosixPermissions
0x7fff3912b606 <+200>: movq   (%rcx), %rcx
0x7fff3912b609 <+203>: movq   0x55574fc8(%rip), %rsi    ; "initWithObjectsAndKeys:"
0x7fff3912b610 <+210>: movq   %rax, %rdi
0x7fff3912b613 <+213>: movq   %r15, %rdx
0x7fff3912b616 <+216>: xorl   %r8d, %r8d
0x7fff3912b619 <+219>: xorl   %eax, %eax
0x7fff3912b61b <+221>: callq  *%r13
0x7fff3912b61e <+224>: movq   %rax, %r12
0x7fff3912b621 <+227>: movq   0x5557e090(%rip), %rdi    ; (void *)0x00007fff8e6b91c0: NSFileManager
0x7fff3912b628 <+234>: movq   %r14, %rsi
0x7fff3912b62b <+237>: callq  *%r13
0x7fff3912b62e <+240>: movq   0x5557b043(%rip), %rsi    ; "createDirectoryAtPath:attributes:"
0x7fff3912b635 <+247>: movq   %rax, %rdi
0x7fff3912b638 <+250>: movq   %rbx, %rdx
0x7fff3912b63b <+253>: movq   %r12, %rcx
0x7fff3912b63e <+256>: callq  *%r13
0x7fff3912b641 <+259>: movl   %eax, %ebx
0x7fff3912b643 <+261>: movq   0x5549b5f6(%rip), %r14    ; (void *)0x00007fff6f73fca0: objc_release
0x7fff3912b64a <+268>: movq   %r12, %rdi
0x7fff3912b64d <+271>: callq  *%r14
0x7fff3912b650 <+274>: movq   %r15, %rdi
0x7fff3912b653 <+277>: callq  *%r14
0x7fff3912b656 <+280>: cmpb   $0x1, %bl
0x7fff3912b659 <+283>: sbbq   %rax, %rax
0x7fff3912b65c <+286>: jmp    0x7fff2fab559b            ; <+93>


runCmd: image lookup -s "_NXRenameFile"
output: 1 symbols match '_NXRenameFile' in /System/Library/Frameworks/Foundation.framework/Versions/C/Foundation:
        Address: Foundation[0x00007fff2fab4a9a] (Foundation.__TEXT.__text + 2702378)
        Summary: Foundation`_NXRenameFile


runCmd: disassemble --force -n "_NXRenameFile"
output: Foundation`_NXRenameFile:
0x7fff3912aa9a <+0>:  pushq  %rbp
0x7fff3912aa9b <+1>:  movq   %rsp, %rbp
0x7fff3912aa9e <+4>:  pushq  %r15
0x7fff3912aaa0 <+6>:  pushq  %r14
0x7fff3912aaa2 <+8>:  pushq  %rbx
0x7fff3912aaa3 <+9>:  pushq  %rax
0x7fff3912aaa4 <+10>: movq   %rsi, %r14
0x7fff3912aaa7 <+13>: movq   %rdi, %rbx
0x7fff3912aaaa <+16>: movq   0x5557ec07(%rip), %rdi    ; (void *)0x00007fff8e6b91c0: NSFileManager
0x7fff3912aab1 <+23>: movq   0x555743b8(%rip), %rsi    ; "defaultManager"
0x7fff3912aab8 <+30>: movq   0x5549c179(%rip), %r15    ; (void *)0x00007fff6f73de40: objc_msgSend
0x7fff3912aabf <+37>: callq  *%r15
0x7fff3912aac2 <+40>: movq   0x5557bb47(%rip), %rsi    ; "moveItemAtPath:toPath:error:"
0x7fff3912aac9 <+47>: movq   %rax, %rdi
0x7fff3912aacc <+50>: movq   %rbx, %rdx
0x7fff3912aacf <+53>: movq   %r14, %rcx
0x7fff3912aad2 <+56>: xorl   %r8d, %r8d
0x7fff3912aad5 <+59>: callq  *%r15
0x7fff3912aad8 <+62>: cmpb   $0x1, %al
0x7fff3912aada <+64>: sbbq   %rax, %rax
0x7fff3912aadd <+67>: addq   $0x8, %rsp
0x7fff3912aae1 <+71>: popq   %rbx
0x7fff3912aae2 <+72>: popq   %r14
0x7fff3912aae4 <+74>: popq   %r15
0x7fff3912aae6 <+76>: popq   %rbp
0x7fff3912aae7 <+77>: retq   


runCmd: image lookup -s "_NXStatFile"
output: 1 symbols match '_NXStatFile' in /System/Library/Frameworks/Foundation.framework/Versions/C/Foundation:
        Address: Foundation[0x00007fff2f96782c] (Foundation.__TEXT.__text + 1337788)
        Summary: Foundation`_NXStatFile


runCmd: disassemble --force -n "_NXStatFile"
output: Foundation`_NXStatFile:
0x7fff38fdd82c <+0>:  pushq  %rbp
0x7fff38fdd82d <+1>:  movq   %rsp, %rbp
0x7fff38fdd830 <+4>:  pushq  %r15
0x7fff38fdd832 <+6>:  pushq  %r14
0x7fff38fdd834 <+8>:  pushq  %rbx
0x7fff38fdd835 <+9>:  pushq  %rax
0x7fff38fdd836 <+10>: movq   %rsi, %r14
0x7fff38fdd839 <+13>: movq   %rdi, %rbx
0x7fff38fdd83c <+16>: movq   0x556cbe75(%rip), %rdi    ; (void *)0x00007fff8e6b91c0: NSFileManager
0x7fff38fdd843 <+23>: movq   0x556c1626(%rip), %rsi    ; "defaultManager"
0x7fff38fdd84a <+30>: movq   0x555e93e7(%rip), %r15    ; (void *)0x00007fff6f73de40: objc_msgSend
0x7fff38fdd851 <+37>: callq  *%r15
0x7fff38fdd854 <+40>: movq   0x556c31ed(%rip), %rsi    ; "fileSystemRepresentationWithPath:"
0x7fff38fdd85b <+47>: movq   %rax, %rdi
0x7fff38fdd85e <+50>: movq   %rbx, %rdx
0x7fff38fdd861 <+53>: callq  *%r15
0x7fff38fdd864 <+56>: movq   %rax, %rdi
0x7fff38fdd867 <+59>: movq   %r14, %rsi
0x7fff38fdd86a <+62>: callq  0x7fff2fb27e58            ; symbol stub for: stat$INODE64
0x7fff38fdd86f <+67>: cltq   
0x7fff38fdd871 <+69>: addq   $0x8, %rsp
0x7fff38fdd875 <+73>: popq   %rbx
0x7fff38fdd876 <+74>: popq   %r14
0x7fff38fdd878 <+76>: popq   %r15
0x7fff38fdd87a <+78>: popq   %rbp
0x7fff38fdd87b <+79>: retq   


runCmd: image lookup -s "__NSCoderInvalidState"
output: 1 symbols match '__NSCoderInvalidState' in /System/Library/Frameworks/Foundation.framework/Versions/C/Foundation:
        Address: Foundation[0x00007fff2f9a0f57] (Foundation.__TEXT.__text + 1573095)
        Summary: Foundation`__NSCoderInvalidState


runCmd: disassemble --force -n "__NSCoderInvalidState"
output: Foundation`__NSCoderInvalidState:
0x7fff39016f57 <+0>:   pushq  %rbp
0x7fff39016f58 <+1>:   movq   %rsp, %rbp
0x7fff39016f5b <+4>:   pushq  %r14
0x7fff39016f5d <+6>:   pushq  %rbx
0x7fff39016f5e <+7>:   subq   $0xd0, %rsp
0x7fff39016f65 <+14>:  movq   %rdi, %rbx
0x7fff39016f68 <+17>:  testb  %al, %al
0x7fff39016f6a <+19>:  je     0x7fff2f9a0f8f            ; <+56>
0x7fff39016f6c <+21>:  movaps %xmm0, -0x90(%rbp)
0x7fff39016f73 <+28>:  movaps %xmm1, -0x80(%rbp)
0x7fff39016f77 <+32>:  movaps %xmm2, -0x70(%rbp)
0x7fff39016f7b <+36>:  movaps %xmm3, -0x60(%rbp)
0x7fff39016f7f <+40>:  movaps %xmm4, -0x50(%rbp)
0x7fff39016f83 <+44>:  movaps %xmm5, -0x40(%rbp)
0x7fff39016f87 <+48>:  movaps %xmm6, -0x30(%rbp)
0x7fff39016f8b <+52>:  movaps %xmm7, -0x20(%rbp)
0x7fff39016f8f <+56>:  movq   %rsi, -0xb8(%rbp)
0x7fff39016f96 <+63>:  movq   %rdx, -0xb0(%rbp)
0x7fff39016f9d <+70>:  movq   %rcx, -0xa8(%rbp)
0x7fff39016fa4 <+77>:  movq   %r8, -0xa0(%rbp)
0x7fff39016fab <+84>:  movq   %r9, -0x98(%rbp)
0x7fff39016fb2 <+91>:  testq  %rbx, %rbx
0x7fff39016fb5 <+94>:  jne    0x7fff2f9a0fc0            ; <+105>
0x7fff39016fb7 <+96>:  leaq   0x555c0f5a(%rip), %rcx    ; @""
0x7fff39016fbe <+103>: jmp    0x7fff2f9a1014            ; <+189>
0x7fff39016fc0 <+105>: leaq   -0xc0(%rbp), %rax
0x7fff39016fc7 <+112>: leaq   -0xe0(%rbp), %r14
0x7fff39016fce <+119>: movq   %rax, 0x10(%r14)
0x7fff39016fd2 <+123>: leaq   0x10(%rbp), %rax
0x7fff39016fd6 <+127>: movq   %rax, 0x8(%r14)
0x7fff39016fda <+131>: movabsq $0x3000000008, %rax       ; imm = 0x3000000008 
0x7fff39016fe4 <+141>: movq   %rax, (%r14)
0x7fff39016fe7 <+144>: movq   0x55692502(%rip), %rdi    ; (void *)0x00007fff8e6bae08: NSString
0x7fff39016fee <+151>: callq  0x7fff2fb279d8            ; symbol stub for: objc_alloc
0x7fff39016ff3 <+156>: movq   0x55688756(%rip), %rsi    ; "initWithFormat:arguments:"
0x7fff39016ffa <+163>: movq   %rax, %rdi
0x7fff39016ffd <+166>: movq   %rbx, %rdx
0x7fff39017000 <+169>: movq   %r14, %rcx
0x7fff39017003 <+172>: callq  *0x555afc2f(%rip)         ; (void *)0x00007fff6f73de40: objc_msgSend
0x7fff39017009 <+178>: movq   %rax, %rdi
0x7fff3901700c <+181>: callq  0x7fff2fb279f0            ; symbol stub for: objc_autorelease
0x7fff39017011 <+186>: movq   %rax, %rcx
0x7fff39017014 <+189>: movq   0x55692575(%rip), %rdi    ; (void *)0x00007fff8e1432d8: NSException
0x7fff3901701b <+196>: movq   0x555af146(%rip), %rax    ; (void *)0x00007fff8e0474e8: NSInternalInconsistencyException
0x7fff39017022 <+203>: movq   (%rax), %rdx
0x7fff39017025 <+206>: movq   0x556873a4(%rip), %rsi    ; "exceptionWithName:reason:userInfo:"
0x7fff3901702c <+213>: xorl   %r8d, %r8d
0x7fff3901702f <+216>: callq  *0x555afc03(%rip)         ; (void *)0x00007fff6f73de40: objc_msgSend
0x7fff39017035 <+222>: movq   %rax, %rdi
0x7fff39017038 <+225>: callq  0x7fff2fb27a4a            ; symbol stub for: objc_exception_throw


runCmd: image lookup -s "__NSDescribeDelayedPerformCallout"
output: 1 symbols match '__NSDescribeDelayedPerformCallout' in /System/Library/Frameworks/Foundation.framework/Versions/C/Foundation:
        Address: Foundation[0x00007fff2fa2409a] (Foundation.__TEXT.__text + 2109994)
        Summary: Foundation`__NSDescribeDelayedPerformCallout


runCmd: disassemble --force -n "__NSDescribeDelayedPerformCallout"
output: Foundation`__NSDescribeDelayedPerformCallout:
0x7fff3909a09a <+0>:   pushq  %rbp
0x7fff3909a09b <+1>:   movq   %rsp, %rbp
0x7fff3909a09e <+4>:   pushq  %r15
0x7fff3909a0a0 <+6>:   pushq  %r14
0x7fff3909a0a2 <+8>:   pushq  %r13
0x7fff3909a0a4 <+10>:  pushq  %r12
0x7fff3909a0a6 <+12>:  pushq  %rbx
0x7fff3909a0a7 <+13>:  subq   $0x48, %rsp
0x7fff3909a0ab <+17>:  movq   %r9, %r12
0x7fff3909a0ae <+20>:  movq   %r8, %r13
0x7fff3909a0b1 <+23>:  movq   %rcx, -0x60(%rbp)
0x7fff3909a0b5 <+27>:  movq   %rdx, -0x58(%rbp)
0x7fff3909a0b9 <+31>:  movq   %rsi, %rbx
0x7fff3909a0bc <+34>:  movq   0x5552c565(%rip), %rax    ; (void *)0x00007fff96f46d40: __stack_chk_guard
0x7fff3909a0c3 <+41>:  movq   (%rax), %rax
0x7fff3909a0c6 <+44>:  movq   %rax, -0x30(%rbp)
0x7fff3909a0ca <+48>:  movq   (%rsi), %rdi
0x7fff3909a0cd <+51>:  callq  0x7fff2fb27b0a            ; symbol stub for: object_getClassName
0x7fff3909a0d2 <+56>:  movq   %rax, %r14
0x7fff3909a0d5 <+59>:  movq   0x8(%rbx), %rdi
0x7fff3909a0d9 <+63>:  callq  0x7fff2fb27e04            ; symbol stub for: sel_getName
0x7fff3909a0de <+68>:  movq   %rax, %r15
0x7fff3909a0e1 <+71>:  cmpq   $0x0, 0x10(%rbp)
0x7fff3909a0e6 <+76>:  je     0x7fff2fa240fb            ; <+97>
0x7fff3909a0e8 <+78>:  movq   (%rbx), %rdi
0x7fff3909a0eb <+81>:  movq   0x8(%rbx), %rsi
0x7fff3909a0ef <+85>:  callq  0x7fff2fb27b1c            ; symbol stub for: object_getMethodImplementation
0x7fff3909a0f4 <+90>:  movq   0x10(%rbp), %rcx
0x7fff3909a0f8 <+94>:  movq   %rax, (%rcx)
0x7fff3909a0fb <+97>:  testq  %r14, %r14
0x7fff3909a0fe <+100>: leaq   0x12c403(%rip), %r9       ; "<unknown name>"
0x7fff3909a105 <+107>: cmovneq %r14, %r9
0x7fff3909a109 <+111>: testq  %r15, %r15
0x7fff3909a10c <+114>: leaq   0x12f398(%rip), %rax      ; "<unknown selector>"
0x7fff3909a113 <+121>: cmovneq %r15, %rax
0x7fff3909a117 <+125>: movq   %rax, (%rsp)
0x7fff3909a11b <+129>: leaq   0x12f371(%rip), %r8       ; "(Delayed Perform) %s %s"
0x7fff3909a122 <+136>: movq   %r13, %rdi
0x7fff3909a125 <+139>: movq   %r12, %rsi
0x7fff3909a128 <+142>: movl   $0x0, %edx
0x7fff3909a12d <+147>: movq   $-0x1, %rcx
0x7fff3909a134 <+154>: xorl   %eax, %eax
0x7fff3909a136 <+156>: callq  0x7fff2fb27246            ; symbol stub for: __snprintf_chk
0x7fff3909a13b <+161>: movq   (%rbx), %rdi
0x7fff3909a13e <+164>: callq  0x7fff2fb27b04            ; symbol stub for: object_getClass
0x7fff3909a143 <+169>: leaq   -0x50(%rbp), %rsi
0x7fff3909a147 <+173>: movq   %rax, %rdi
0x7fff3909a14a <+176>: callq  0x7fff2fb2763c            ; symbol stub for: dladdr
0x7fff3909a14f <+181>: testl  %eax, %eax
0x7fff3909a151 <+183>: je     0x7fff2fa24187            ; <+237>
0x7fff3909a153 <+185>: movq   -0x50(%rbp), %rax
0x7fff3909a157 <+189>: testq  %rax, %rax
0x7fff3909a15a <+192>: leaq   0x12c3b6(%rip), %r9       ; "<unknown library>"
0x7fff3909a161 <+199>: cmovneq %rax, %r9
0x7fff3909a165 <+203>: leaq   0x121b27(%rip), %r8       ; "%s"
0x7fff3909a16c <+210>: movq   -0x58(%rbp), %rdi
0x7fff3909a170 <+214>: movq   -0x60(%rbp), %rsi
0x7fff3909a174 <+218>: movl   $0x0, %edx
0x7fff3909a179 <+223>: movq   $-0x1, %rcx
0x7fff3909a180 <+230>: xorl   %eax, %eax
0x7fff3909a182 <+232>: callq  0x7fff2fb27246            ; symbol stub for: __snprintf_chk
0x7fff3909a187 <+237>: movq   0x5552c49a(%rip), %rax    ; (void *)0x00007fff96f46d40: __stack_chk_guard
0x7fff3909a18e <+244>: movq   (%rax), %rax
0x7fff3909a191 <+247>: cmpq   -0x30(%rbp), %rax
0x7fff3909a195 <+251>: jne    0x7fff2fa241a6            ; <+268>
0x7fff3909a197 <+253>: addq   $0x48, %rsp
0x7fff3909a19b <+257>: popq   %rbx
0x7fff3909a19c <+258>: popq   %r12
0x7fff3909a19e <+260>: popq   %r13
0x7fff3909a1a0 <+262>: popq   %r14
0x7fff3909a1a2 <+264>: popq   %r15
0x7fff3909a1a4 <+266>: popq   %rbp
0x7fff3909a1a5 <+267>: retq   
0x7fff3909a1a6 <+268>: callq  0x7fff2fb2724c            ; symbol stub for: __stack_chk_fail


runCmd: image lookup -s "__NSDescribeNSMachPortCallout"
output: 1 symbols match '__NSDescribeNSMachPortCallout' in /System/Library/Frameworks/Foundation.framework/Versions/C/Foundation:
        Address: Foundation[0x00007fff2fa0d99d] (Foundation.__TEXT.__text + 2018093)
        Summary: Foundation`__NSDescribeNSMachPortCallout


runCmd: disassemble --force -n "__NSDescribeNSMachPortCallout"
output: Foundation`__NSDescribeNSMachPortCallout:
0x7fff3908399d <+0>:   pushq  %rbp
0x7fff3908399e <+1>:   movq   %rsp, %rbp
0x7fff390839a1 <+4>:   pushq  %r15
0x7fff390839a3 <+6>:   pushq  %r14
0x7fff390839a5 <+8>:   pushq  %r13
0x7fff390839a7 <+10>:  pushq  %r12
0x7fff390839a9 <+12>:  pushq  %rbx
0x7fff390839aa <+13>:  subq   $0x38, %rsp
0x7fff390839ae <+17>:  movq   %r9, %r12
0x7fff390839b1 <+20>:  movq   %r8, %r13
0x7fff390839b4 <+23>:  movq   %rcx, -0x58(%rbp)
0x7fff390839b8 <+27>:  movq   %rdx, %r15
0x7fff390839bb <+30>:  movq   %rsi, %rbx
0x7fff390839be <+33>:  movq   0x55542c63(%rip), %rax    ; (void *)0x00007fff96f46d40: __stack_chk_guard
0x7fff390839c5 <+40>:  movq   (%rax), %rax
0x7fff390839c8 <+43>:  movq   %rax, -0x30(%rbp)
0x7fff390839cc <+47>:  movq   0x8(%rsi), %rdi
0x7fff390839d0 <+51>:  callq  0x7fff2fb27b0a            ; symbol stub for: object_getClassName
0x7fff390839d5 <+56>:  movq   %rax, %r14
0x7fff390839d8 <+59>:  movq   0x8(%rbx), %rdi
0x7fff390839dc <+63>:  callq  0x7fff2fb27b04            ; symbol stub for: object_getClass
0x7fff390839e1 <+68>:  movq   %rax, %rbx
0x7fff390839e4 <+71>:  testq  %r14, %r14
0x7fff390839e7 <+74>:  leaq   0x142b1a(%rip), %r9       ; "<unknown name>"
0x7fff390839ee <+81>:  cmovneq %r14, %r9
0x7fff390839f2 <+85>:  leaq   0x142aff(%rip), %r8       ; "(NSMachPort) %s"
0x7fff390839f9 <+92>:  movq   %r13, %rdi
0x7fff390839fc <+95>:  movq   %r12, %rsi
0x7fff390839ff <+98>:  movl   $0x0, %edx
0x7fff39083a04 <+103>: movq   $-0x1, %rcx
0x7fff39083a0b <+110>: xorl   %eax, %eax
0x7fff39083a0d <+112>: callq  0x7fff2fb27246            ; symbol stub for: __snprintf_chk
0x7fff39083a12 <+117>: leaq   -0x50(%rbp), %rsi
0x7fff39083a16 <+121>: movq   %rbx, %rdi
0x7fff39083a19 <+124>: callq  0x7fff2fb2763c            ; symbol stub for: dladdr
0x7fff39083a1e <+129>: testl  %eax, %eax
0x7fff39083a20 <+131>: je     0x7fff2fa0da55            ; <+184>
0x7fff39083a22 <+133>: movq   -0x50(%rbp), %rax
0x7fff39083a26 <+137>: testq  %rax, %rax
0x7fff39083a29 <+140>: leaq   0x142ae7(%rip), %r9       ; "<unknown library>"
0x7fff39083a30 <+147>: cmovneq %rax, %r9
0x7fff39083a34 <+151>: leaq   0x138258(%rip), %r8       ; "%s"
0x7fff39083a3b <+158>: movq   %r15, %rdi
0x7fff39083a3e <+161>: movq   -0x58(%rbp), %rsi
0x7fff39083a42 <+165>: movl   $0x0, %edx
0x7fff39083a47 <+170>: movq   $-0x1, %rcx
0x7fff39083a4e <+177>: xorl   %eax, %eax
0x7fff39083a50 <+179>: callq  0x7fff2fb27246            ; symbol stub for: __snprintf_chk
0x7fff39083a55 <+184>: movq   0x55542bcc(%rip), %rax    ; (void *)0x00007fff96f46d40: __stack_chk_guard
0x7fff39083a5c <+191>: movq   (%rax), %rax
0x7fff39083a5f <+194>: cmpq   -0x30(%rbp), %rax
0x7fff39083a63 <+198>: jne    0x7fff2fa0da74            ; <+215>
0x7fff39083a65 <+200>: addq   $0x38, %rsp
0x7fff39083a69 <+204>: popq   %rbx
0x7fff39083a6a <+205>: popq   %r12
0x7fff39083a6c <+207>: popq   %r13
0x7fff39083a6e <+209>: popq   %r14
0x7fff39083a70 <+211>: popq   %r15
0x7fff39083a72 <+213>: popq   %rbp
0x7fff39083a73 <+214>: retq   
0x7fff39083a74 <+215>: callq  0x7fff2fb2724c            ; symbol stub for: __stack_chk_fail


runCmd: image lookup -s "__NSDescribeTimerCallout"
output: 1 symbols match '__NSDescribeTimerCallout' in /System/Library/Frameworks/Foundation.framework/Versions/C/Foundation:
        Address: Foundation[0x00007fff2fa5ef92] (Foundation.__TEXT.__text + 2351394)
        Summary: Foundation`__NSDescribeTimerCallout


runCmd: disassemble --force -n "__NSDescribeTimerCallout"
output: Foundation`__NSDescribeTimerCallout:
0x7fff390d4f92 <+0>:   pushq  %rbp
0x7fff390d4f93 <+1>:   movq   %rsp, %rbp
0x7fff390d4f96 <+4>:   pushq  %r15
0x7fff390d4f98 <+6>:   pushq  %r14
0x7fff390d4f9a <+8>:   pushq  %r13
0x7fff390d4f9c <+10>:  pushq  %r12
0x7fff390d4f9e <+12>:  pushq  %rbx
0x7fff390d4f9f <+13>:  subq   $0x48, %rsp
0x7fff390d4fa3 <+17>:  movq   0x554f167e(%rip), %rax    ; (void *)0x00007fff96f46d40: __stack_chk_guard
0x7fff390d4faa <+24>:  movq   (%rax), %rax
0x7fff390d4fad <+27>:  movq   %rax, -0x30(%rbp)
0x7fff390d4fb1 <+31>:  testq  %rsi, %rsi
0x7fff390d4fb4 <+34>:  je     0x7fff2fa5f084            ; <+242>
0x7fff390d4fba <+40>:  movq   %r9, %r12
0x7fff390d4fbd <+43>:  movq   %r8, %r13
0x7fff390d4fc0 <+46>:  movq   %rsi, %rbx
0x7fff390d4fc3 <+49>:  movq   %rdx, -0x58(%rbp)
0x7fff390d4fc7 <+53>:  movq   %rcx, -0x60(%rbp)
0x7fff390d4fcb <+57>:  movq   0x8(%rsi), %rdi
0x7fff390d4fcf <+61>:  callq  0x7fff2fb27b0a            ; symbol stub for: object_getClassName
0x7fff390d4fd4 <+66>:  movq   %rax, %r14
0x7fff390d4fd7 <+69>:  movq   0x10(%rbx), %rdi
0x7fff390d4fdb <+73>:  callq  0x7fff2fb27e04            ; symbol stub for: sel_getName
0x7fff390d4fe0 <+78>:  movq   %rax, %r15
0x7fff390d4fe3 <+81>:  movq   0x8(%rbx), %rdi
0x7fff390d4fe7 <+85>:  movq   0x10(%rbx), %rsi
0x7fff390d4feb <+89>:  callq  0x7fff2fb27b1c            ; symbol stub for: object_getMethodImplementation
0x7fff390d4ff0 <+94>:  movq   0x10(%rbp), %rcx
0x7fff390d4ff4 <+98>:  movq   %rax, (%rcx)
0x7fff390d4ff7 <+101>: testq  %r14, %r14
0x7fff390d4ffa <+104>: leaq   0xfcd3d(%rip), %r9        ; "<unknown class name>"
0x7fff390d5001 <+111>: cmovneq %r14, %r9
0x7fff390d5005 <+115>: testq  %r15, %r15
0x7fff390d5008 <+118>: leaq   0xf449c(%rip), %rax       ; "<unknown selector>"
0x7fff390d500f <+125>: cmovneq %r15, %rax
0x7fff390d5013 <+129>: movq   %rax, (%rsp)
0x7fff390d5017 <+133>: leaq   0xfcd0e(%rip), %r8        ; "(NSTimer) [%s %s]"
0x7fff390d501e <+140>: movq   %r13, %rdi
0x7fff390d5021 <+143>: movq   %r12, %rsi
0x7fff390d5024 <+146>: movl   $0x0, %edx
0x7fff390d5029 <+151>: movq   $-0x1, %rcx
0x7fff390d5030 <+158>: xorl   %eax, %eax
0x7fff390d5032 <+160>: callq  0x7fff2fb27246            ; symbol stub for: __snprintf_chk
0x7fff390d5037 <+165>: movq   0x8(%rbx), %rdi
0x7fff390d503b <+169>: callq  0x7fff2fb27b04            ; symbol stub for: object_getClass
0x7fff390d5040 <+174>: leaq   -0x50(%rbp), %rsi
0x7fff390d5044 <+178>: movq   %rax, %rdi
0x7fff390d5047 <+181>: callq  0x7fff2fb2763c            ; symbol stub for: dladdr
0x7fff390d504c <+186>: testl  %eax, %eax
0x7fff390d504e <+188>: je     0x7fff2fa5f084            ; <+242>
0x7fff390d5050 <+190>: movq   -0x50(%rbp), %rax
0x7fff390d5054 <+194>: testq  %rax, %rax
0x7fff390d5057 <+197>: leaq   0xf14b9(%rip), %r9        ; "<unknown library>"
0x7fff390d505e <+204>: cmovneq %rax, %r9
0x7fff390d5062 <+208>: leaq   0xe6c2a(%rip), %r8        ; "%s"
0x7fff390d5069 <+215>: movq   -0x58(%rbp), %rdi
0x7fff390d506d <+219>: movq   -0x60(%rbp), %rsi
0x7fff390d5071 <+223>: movl   $0x0, %edx
0x7fff390d5076 <+228>: movq   $-0x1, %rcx
0x7fff390d507d <+235>: xorl   %eax, %eax
0x7fff390d507f <+237>: callq  0x7fff2fb27246            ; symbol stub for: __snprintf_chk
0x7fff390d5084 <+242>: movq   0x554f159d(%rip), %rax    ; (void *)0x00007fff96f46d40: __stack_chk_guard
0x7fff390d508b <+249>: movq   (%rax), %rax
0x7fff390d508e <+252>: cmpq   -0x30(%rbp), %rax
0x7fff390d5092 <+256>: jne    0x7fff2fa5f0a3            ; <+273>
0x7fff390d5094 <+258>: addq   $0x48, %rsp
0x7fff390d5098 <+262>: popq   %rbx
0x7fff390d5099 <+263>: popq   %r12
0x7fff390d509b <+265>: popq   %r13
0x7fff390d509d <+267>: popq   %r14
0x7fff390d509f <+269>: popq   %r15
0x7fff390d50a1 <+271>: popq   %rbp
0x7fff390d50a2 <+272>: retq   
0x7fff390d50a3 <+273>: callq  0x7fff2fb2724c            ; symbol stub for: __stack_chk_fail


runCmd: image lookup -s "__NSFireDelayedPerform"
output: 1 symbols match '__NSFireDelayedPerform' in /System/Library/Frameworks/Foundation.framework/Versions/C/Foundation:
        Address: Foundation[0x00007fff2f8ba543] (Foundation.__TEXT.__text + 628435)
        Summary: Foundation`__NSFireDelayedPerform


runCmd: disassemble --force -n "__NSFireDelayedPerform"
output: Foundation`__NSFireDelayedPerform:
0x7fff38f30543 <+0>:   pushq  %rbp
0x7fff38f30544 <+1>:   movq   %rsp, %rbp
0x7fff38f30547 <+4>:   pushq  %r15
0x7fff38f30549 <+6>:   pushq  %r14
0x7fff38f3054b <+8>:   pushq  %r13
0x7fff38f3054d <+10>:  pushq  %r12
0x7fff38f3054f <+12>:  pushq  %rbx
0x7fff38f30550 <+13>:  subq   $0x58, %rsp
0x7fff38f30554 <+17>:  movq   %rdi, -0x38(%rbp)
0x7fff38f30558 <+21>:  movq   (%rsi), %rax
0x7fff38f3055b <+24>:  movq   %rax, -0x58(%rbp)
0x7fff38f3055f <+28>:  movq   0x8(%rsi), %rax
0x7fff38f30563 <+32>:  movq   %rax, -0x50(%rbp)
0x7fff38f30567 <+36>:  movq   0x10(%rsi), %rax
0x7fff38f3056b <+40>:  movq   %rax, -0x48(%rbp)
0x7fff38f3056f <+44>:  movq   0x18(%rsi), %rax
0x7fff38f30573 <+48>:  movq   %rax, -0x40(%rbp)
0x7fff38f30577 <+52>:  movq   0x20(%rsi), %r15
0x7fff38f3057b <+56>:  movq   0x28(%rsi), %rax
0x7fff38f3057f <+60>:  movq   %rax, -0x30(%rbp)
0x7fff38f30583 <+64>:  movq   0x30(%rsi), %rbx
0x7fff38f30587 <+68>:  callq  0x7fff2fb26c3a            ; symbol stub for: _CFAutoreleasePoolPush
0x7fff38f3058c <+73>:  movq   %rax, -0x68(%rbp)
0x7fff38f30590 <+77>:  testq  %rbx, %rbx
0x7fff38f30593 <+80>:  je     0x7fff2f8ba5bd            ; <+122>
0x7fff38f30595 <+82>:  movq   0x557794cc(%rip), %rdi    ; (void *)0x00007fff8e6ba430: NSProcessInfo
0x7fff38f3059c <+89>:  movq   0x557703b5(%rip), %rsi    ; "processInfo"
0x7fff38f305a3 <+96>:  movq   0x5569668e(%rip), %r14    ; (void *)0x00007fff6f73de40: objc_msgSend
0x7fff38f305aa <+103>: callq  *%r14
0x7fff38f305ad <+106>: movq   0x55773034(%rip), %rsi    ; "_reactivateActivity:"
0x7fff38f305b4 <+113>: movq   %rax, %rdi
0x7fff38f305b7 <+116>: movq   %rbx, %rdx
0x7fff38f305ba <+119>: callq  *%r14
0x7fff38f305bd <+122>: movq   %rbx, -0x60(%rbp)
0x7fff38f305c1 <+126>: movq   -0x38(%rbp), %rdi
0x7fff38f305c5 <+130>: callq  0x7fff2fb264f0            ; symbol stub for: CFRetain
0x7fff38f305ca <+135>: movq   -0x30(%rbp), %rbx
0x7fff38f305ce <+139>: movq   %rbx, %rdi
0x7fff38f305d1 <+142>: callq  0x7fff2fb27ae6            ; symbol stub for: objc_sync_enter
0x7fff38f305d6 <+147>: movq   0x55695eb3(%rip), %r14    ; (void *)0x00007fff8e140428: NSRunLoop._dperf
0x7fff38f305dd <+154>: movq   (%r14), %rax
0x7fff38f305e0 <+157>: movq   (%rbx,%rax), %rbx
0x7fff38f305e4 <+161>: movq   0x5576d9bd(%rip), %r12    ; "count"
0x7fff38f305eb <+168>: movq   %rbx, %rdi
0x7fff38f305ee <+171>: movq   %r12, %rsi
0x7fff38f305f1 <+174>: callq  *0x55696641(%rip)         ; (void *)0x00007fff6f73de40: objc_msgSend
0x7fff38f305f7 <+180>: movq   %rbx, %rdi
0x7fff38f305fa <+183>: xorl   %esi, %esi
0x7fff38f305fc <+185>: movq   %rax, %rdx
0x7fff38f305ff <+188>: movq   %r15, %rcx
0x7fff38f30602 <+191>: callq  0x7fff2fb25fb0            ; symbol stub for: CFArrayGetFirstIndexOfValue
0x7fff38f30607 <+196>: shlq   $0x20, %rax
0x7fff38f3060b <+200>: movabsq $-0x100000000, %rcx       ; imm = 0xFFFFFFFF00000000 
0x7fff38f30615 <+210>: cmpq   %rcx, %rax
0x7fff38f30618 <+213>: je     0x7fff2f8ba631            ; <+238>
0x7fff38f3061a <+215>: sarq   $0x20, %rax
0x7fff38f3061e <+219>: movq   (%r14), %rcx
0x7fff38f30621 <+222>: movq   -0x30(%rbp), %rdx
0x7fff38f30625 <+226>: movq   (%rdx,%rcx), %rdi
0x7fff38f30629 <+230>: movq   %rax, %rsi
0x7fff38f3062c <+233>: callq  0x7fff2fb25fc2            ; symbol stub for: CFArrayRemoveValueAtIndex
0x7fff38f30631 <+238>: movq   -0x40(%rbp), %rdi
0x7fff38f30635 <+242>: movq   %r12, %rsi
0x7fff38f30638 <+245>: callq  *0x556965fa(%rip)         ; (void *)0x00007fff6f73de40: objc_msgSend
0x7fff38f3063e <+251>: movq   0x5576e54b(%rip), %rcx    ; "objectAtIndex:"
0x7fff38f30645 <+258>: movq   %rcx, -0x78(%rbp)
0x7fff38f30649 <+262>: movq   0x55695b88(%rip), %rcx    ; (void *)0x00007fff8e012348: NSRunLoopCommonModes
0x7fff38f30650 <+269>: movq   (%rcx), %r15
0x7fff38f30653 <+272>: movq   0x5576dcc6(%rip), %rcx    ; "isEqual:"
0x7fff38f3065a <+279>: movq   %rcx, -0x70(%rbp)
0x7fff38f3065e <+283>: movq   0x5569645b(%rip), %rcx    ; (void *)0x00007fff8e012348: NSRunLoopCommonModes
0x7fff38f30665 <+290>: movq   (%rcx), %r13
0x7fff38f30668 <+293>: movslq %eax, %r12
0x7fff38f3066b <+296>: decq   %r12
0x7fff38f3066e <+299>: cmpq   $-0x1, %r12
0x7fff38f30672 <+303>: je     0x7fff2f8ba6c7            ; <+388>
0x7fff38f30674 <+305>: movq   -0x40(%rbp), %rdi
0x7fff38f30678 <+309>: movq   -0x78(%rbp), %rsi
0x7fff38f3067c <+313>: movq   %r12, %rdx
0x7fff38f3067f <+316>: callq  *0x556965b3(%rip)         ; (void *)0x00007fff6f73de40: objc_msgSend
0x7fff38f30685 <+322>: movq   %rax, %rbx
0x7fff38f30688 <+325>: movq   %r13, %r14
0x7fff38f3068b <+328>: cmpq   %r15, %rax
0x7fff38f3068e <+331>: je     0x7fff2f8ba6ae            ; <+363>
0x7fff38f30690 <+333>: movq   %rbx, %rdi
0x7fff38f30693 <+336>: movq   -0x70(%rbp), %rsi
0x7fff38f30697 <+340>: leaq   0x556ba99a(%rip), %rdx    ; @"kCFRunLoopCommonModes"
0x7fff38f3069e <+347>: callq  *0x55696594(%rip)         ; (void *)0x00007fff6f73de40: objc_msgSend
0x7fff38f306a4 <+353>: movq   %rbx, %r14
0x7fff38f306a7 <+356>: testb  %al, %al
0x7fff38f306a9 <+358>: je     0x7fff2f8ba6ae            ; <+363>
0x7fff38f306ab <+360>: movq   %r13, %r14
0x7fff38f306ae <+363>: callq  0x7fff2fb2651a            ; symbol stub for: CFRunLoopGetCurrent
0x7fff38f306b3 <+368>: decq   %r12
0x7fff38f306b6 <+371>: movq   %rax, %rdi
0x7fff38f306b9 <+374>: movq   -0x38(%rbp), %rsi
0x7fff38f306bd <+378>: movq   %r14, %rdx
0x7fff38f306c0 <+381>: callq  0x7fff2fb26550            ; symbol stub for: CFRunLoopRemoveTimer
0x7fff38f306c5 <+386>: jmp    0x7fff2f8ba66e            ; <+299>
0x7fff38f306c7 <+388>: movq   -0x30(%rbp), %rdi
0x7fff38f306cb <+392>: callq  0x7fff2fb27aec            ; symbol stub for: objc_sync_exit
0x7fff38f306d0 <+397>: movq   -0x58(%rbp), %rdi
0x7fff38f306d4 <+401>: movq   -0x50(%rbp), %rsi
0x7fff38f306d8 <+405>: movq   -0x48(%rbp), %rdx
0x7fff38f306dc <+409>: callq  *0x55696556(%rip)         ; (void *)0x00007fff6f73de40: objc_msgSend
0x7fff38f306e2 <+415>: movq   -0x38(%rbp), %rdi
0x7fff38f306e6 <+419>: callq  0x7fff2fb264ea            ; symbol stub for: CFRelease
0x7fff38f306eb <+424>: movq   -0x60(%rbp), %rbx
0x7fff38f306ef <+428>: testq  %rbx, %rbx
0x7fff38f306f2 <+431>: je     0x7fff2f8ba71e            ; <+475>
0x7fff38f306f4 <+433>: movq   0x5577936d(%rip), %rdi    ; (void *)0x00007fff8e6ba430: NSProcessInfo
0x7fff38f306fb <+440>: movq   0x55770256(%rip), %rsi    ; "processInfo"
0x7fff38f30702 <+447>: movq   0x5569652f(%rip), %rax    ; (void *)0x00007fff6f73de40: objc_msgSend
0x7fff38f30709 <+454>: movq   %rax, %r14
0x7fff38f3070c <+457>: callq  *%rax
0x7fff38f3070e <+459>: movq   0x55772edb(%rip), %rsi    ; "endActivity:"
0x7fff38f30715 <+466>: movq   %rax, %rdi
0x7fff38f30718 <+469>: movq   %rbx, %rdx
0x7fff38f3071b <+472>: callq  *%r14
0x7fff38f3071e <+475>: movq   -0x68(%rbp), %rdi
0x7fff38f30722 <+479>: addq   $0x58, %rsp
0x7fff38f30726 <+483>: popq   %rbx
0x7fff38f30727 <+484>: popq   %r12
0x7fff38f30729 <+486>: popq   %r13
0x7fff38f3072b <+488>: popq   %r14
0x7fff38f3072d <+490>: popq   %r15
0x7fff38f3072f <+492>: popq   %rbp
0x7fff38f30730 <+493>: jmp    0x7fff2fb26c2e            ; symbol stub for: _CFAutoreleasePoolPop
0x7fff38f30735 <+498>: jmp    0x7fff2f8ba737            ; <+500>
0x7fff38f30737 <+500>: movq   %rax, %rbx
0x7fff38f3073a <+503>: movq   -0x30(%rbp), %rdi
0x7fff38f3073e <+507>: callq  0x7fff2fb27aec            ; symbol stub for: objc_sync_exit
0x7fff38f30743 <+512>: movq   %rbx, %rdi
0x7fff38f30746 <+515>: callq  0x7fff2fb27180            ; symbol stub for: _Unwind_Resume
0x7fff38f3074b <+520>: ud2    
0x7fff38f3074d <+522>: nop    
0x7fff38f3074e <+523>: nop    
0x7fff38f3074f <+524>: nop    


runCmd: image lookup -s "__NSFireMachPort"
output: 1 symbols match '__NSFireMachPort' in /System/Library/Frameworks/Foundation.framework/Versions/C/Foundation:
        Address: Foundation[0x00007fff2f8ddb44] (Foundation.__TEXT.__text + 773332)
        Summary: Foundation`__NSFireMachPort


runCmd: disassemble --force -n "__NSFireMachPort"
output: Foundation`__NSFireMachPort:
0x7fff38f53b44 <+0>:   pushq  %rbp
0x7fff38f53b45 <+1>:   movq   %rsp, %rbp
0x7fff38f53b48 <+4>:   pushq  %r15
0x7fff38f53b4a <+6>:   pushq  %r14
0x7fff38f53b4c <+8>:   pushq  %r13
0x7fff38f53b4e <+10>:  pushq  %r12
0x7fff38f53b50 <+12>:  pushq  %rbx
0x7fff38f53b51 <+13>:  subq   $0x38, %rsp
0x7fff38f53b55 <+17>:  movq   %rsi, %r12
0x7fff38f53b58 <+20>:  movq   0x55672ac9(%rip), %rax    ; (void *)0x00007fff96f46d40: __stack_chk_guard
0x7fff38f53b5f <+27>:  movq   (%rax), %rax
0x7fff38f53b62 <+30>:  movq   %rax, -0x30(%rbp)
0x7fff38f53b66 <+34>:  movq   0x8(%rcx), %r15
0x7fff38f53b6a <+38>:  callq  0x7fff2fb26c3a            ; symbol stub for: _CFAutoreleasePoolPush
0x7fff38f53b6f <+43>:  movq   %rax, %r14
0x7fff38f53b72 <+46>:  movq   0x5574f39f(%rip), %rbx    ; "handleMachMessage:"
0x7fff38f53b79 <+53>:  movq   0x5574a728(%rip), %r13    ; "respondsToSelector:"
0x7fff38f53b80 <+60>:  movq   %r15, %rdi
0x7fff38f53b83 <+63>:  movq   %r13, %rsi
0x7fff38f53b86 <+66>:  movq   %rbx, %rdx
0x7fff38f53b89 <+69>:  callq  *0x556730a9(%rip)         ; (void *)0x00007fff6f73de40: objc_msgSend
0x7fff38f53b8f <+75>:  testb  %al, %al
0x7fff38f53b91 <+77>:  je     0x7fff2f8ddba7            ; <+99>
0x7fff38f53b93 <+79>:  movq   %r15, %rdi
0x7fff38f53b96 <+82>:  movq   %rbx, %rsi
0x7fff38f53b99 <+85>:  movq   %r12, %rdx
0x7fff38f53b9c <+88>:  callq  *0x55673096(%rip)         ; (void *)0x00007fff6f73de40: objc_msgSend
0x7fff38f53ba2 <+94>:  jmp    0x7fff2f8ddc6d            ; <+297>
0x7fff38f53ba7 <+99>:  movq   0x5574f372(%rip), %rdx    ; "handlePortMessage:"
0x7fff38f53bae <+106>: movq   %r15, %rdi
0x7fff38f53bb1 <+109>: movq   %r13, %rsi
0x7fff38f53bb4 <+112>: callq  *0x5567307e(%rip)         ; (void *)0x00007fff6f73de40: objc_msgSend
0x7fff38f53bba <+118>: testb  %al, %al
0x7fff38f53bbc <+120>: je     0x7fff2f8ddc6d            ; <+297>
0x7fff38f53bc2 <+126>: movq   0x55755c1f(%rip), %rdi    ; (void *)0x00007fec394060d0
0x7fff38f53bc9 <+133>: movq   0x5574f358(%rip), %rsi    ; "parseMachMessage:localPort:remotePort:msgid:components:"
0x7fff38f53bd0 <+140>: leaq   -0x48(%rbp), %rax
0x7fff38f53bd4 <+144>: movq   %rax, (%rsp)
0x7fff38f53bd8 <+148>: movq   0x55673059(%rip), %r13    ; (void *)0x00007fff6f73de40: objc_msgSend
0x7fff38f53bdf <+155>: leaq   -0x40(%rbp), %rcx
0x7fff38f53be3 <+159>: leaq   -0x38(%rbp), %rbx
0x7fff38f53be7 <+163>: leaq   -0x4c(%rbp), %r9
0x7fff38f53beb <+167>: movq   %r12, %rdx
0x7fff38f53bee <+170>: movq   %rcx, %r12
0x7fff38f53bf1 <+173>: movq   %rbx, %r8
0x7fff38f53bf4 <+176>: callq  *%r13
0x7fff38f53bf7 <+179>: movq   0x557564d2(%rip), %rdi    ; (void *)0x00007fff8e6ba368: NSPortMessage
0x7fff38f53bfe <+186>: callq  0x7fff2fb279de            ; symbol stub for: objc_allocWithZone
0x7fff38f53c03 <+191>: movq   (%rbx), %rdx
0x7fff38f53c06 <+194>: movq   (%r12), %rcx
0x7fff38f53c0a <+198>: leaq   -0x48(%rbp), %r12
0x7fff38f53c0e <+202>: movq   (%r12), %r8
0x7fff38f53c12 <+206>: movq   0x5574f317(%rip), %rsi    ; "initWithSendPort:receivePort:components:"
0x7fff38f53c19 <+213>: movq   %rax, %rdi
0x7fff38f53c1c <+216>: callq  *%r13
0x7fff38f53c1f <+219>: movq   %rax, %rbx
0x7fff38f53c22 <+222>: leaq   -0x4c(%rbp), %rax
0x7fff38f53c26 <+226>: movl   (%rax), %edx
0x7fff38f53c28 <+228>: movq   0x5574f309(%rip), %rsi    ; "setMsgid:"
0x7fff38f53c2f <+235>: movq   %rbx, %rdi
0x7fff38f53c32 <+238>: callq  *%r13
0x7fff38f53c35 <+241>: movq   %r15, %rdi
0x7fff38f53c38 <+244>: movq   0x5574f2e1(%rip), %rsi    ; "handlePortMessage:"
0x7fff38f53c3f <+251>: movq   %rbx, %rdx
0x7fff38f53c42 <+254>: callq  *%r13
0x7fff38f53c45 <+257>: movq   0x55672ff4(%rip), %r15    ; (void *)0x00007fff6f73fca0: objc_release
0x7fff38f53c4c <+264>: movq   %rbx, %rdi
0x7fff38f53c4f <+267>: callq  *%r15
0x7fff38f53c52 <+270>: movq   (%r12), %rdi
0x7fff38f53c56 <+274>: callq  *%r15
0x7fff38f53c59 <+277>: leaq   -0x40(%rbp), %rax
0x7fff38f53c5d <+281>: movq   (%rax), %rdi
0x7fff38f53c60 <+284>: callq  *%r15
0x7fff38f53c63 <+287>: leaq   -0x38(%rbp), %rax
0x7fff38f53c67 <+291>: movq   (%rax), %rdi
0x7fff38f53c6a <+294>: callq  *%r15
0x7fff38f53c6d <+297>: movq   %r14, %rdi
0x7fff38f53c70 <+300>: callq  0x7fff2fb26c2e            ; symbol stub for: _CFAutoreleasePoolPop
0x7fff38f53c75 <+305>: movq   0x556729ac(%rip), %rax    ; (void *)0x00007fff96f46d40: __stack_chk_guard
0x7fff38f53c7c <+312>: movq   (%rax), %rax
0x7fff38f53c7f <+315>: cmpq   -0x30(%rbp), %rax
0x7fff38f53c83 <+319>: jne    0x7fff2f8ddc94            ; <+336>
0x7fff38f53c85 <+321>: addq   $0x38, %rsp
0x7fff38f53c89 <+325>: popq   %rbx
0x7fff38f53c8a <+326>: popq   %r12
0x7fff38f53c8c <+328>: popq   %r13
0x7fff38f53c8e <+330>: popq   %r14
0x7fff38f53c90 <+332>: popq   %r15
0x7fff38f53c92 <+334>: popq   %rbp
0x7fff38f53c93 <+335>: retq   
0x7fff38f53c94 <+336>: callq  0x7fff2fb2724c            ; symbol stub for: __stack_chk_fail
0x7fff38f53c99 <+341>: nop    
0x7fff38f53c9a <+342>: nop    
0x7fff38f53c9b <+343>: nop    


runCmd: image lookup -s "__NSFireTimer"
output: 1 symbols match '__NSFireTimer' in /System/Library/Frameworks/Foundation.framework/Versions/C/Foundation:
        Address: Foundation[0x00007fff2f8de2a7] (Foundation.__TEXT.__text + 775223)
        Summary: Foundation`__NSFireTimer


runCmd: disassemble --force -n "__NSFireTimer"
output: Foundation`__NSFireTimer:
0x7fff38f542a7 <+0>:   pushq  %rbp
0x7fff38f542a8 <+1>:   movq   %rsp, %rbp
0x7fff38f542ab <+4>:   pushq  %r15
0x7fff38f542ad <+6>:   pushq  %r14
0x7fff38f542af <+8>:   pushq  %r13
0x7fff38f542b1 <+10>:  pushq  %r12
0x7fff38f542b3 <+12>:  pushq  %rbx
0x7fff38f542b4 <+13>:  pushq  %rax
0x7fff38f542b5 <+14>:  movq   %rdi, %r14
0x7fff38f542b8 <+17>:  movq   0x8(%rsi), %rbx
0x7fff38f542bc <+21>:  movq   0x10(%rsi), %r15
0x7fff38f542c0 <+25>:  callq  0x7fff2fb26c3a            ; symbol stub for: _CFAutoreleasePoolPush
0x7fff38f542c5 <+30>:  movq   %rax, %r12
0x7fff38f542c8 <+33>:  movq   0x55672979(%rip), %r13    ; (void *)0x00007fff6f73dd10: objc_retain
0x7fff38f542cf <+40>:  movq   %r14, %rdi
0x7fff38f542d2 <+43>:  callq  *%r13
0x7fff38f542d5 <+46>:  movq   %rbx, %rdi
0x7fff38f542d8 <+49>:  callq  *%r13
0x7fff38f542db <+52>:  movq   %rbx, %rdi
0x7fff38f542de <+55>:  movq   %r15, %rsi
0x7fff38f542e1 <+58>:  movq   %r14, %rdx
0x7fff38f542e4 <+61>:  callq  *0x5567294e(%rip)         ; (void *)0x00007fff6f73de40: objc_msgSend
0x7fff38f542ea <+67>:  movq   0x5567294f(%rip), %r15    ; (void *)0x00007fff6f73fca0: objc_release
0x7fff38f542f1 <+74>:  movq   %rbx, %rdi
0x7fff38f542f4 <+77>:  callq  *%r15
0x7fff38f542f7 <+80>:  movq   %r14, %rdi
0x7fff38f542fa <+83>:  callq  *%r15
0x7fff38f542fd <+86>:  movq   %r12, %rdi
0x7fff38f54300 <+89>:  addq   $0x8, %rsp
0x7fff38f54304 <+93>:  popq   %rbx
0x7fff38f54305 <+94>:  popq   %r12
0x7fff38f54307 <+96>:  popq   %r13
0x7fff38f54309 <+98>:  popq   %r14
0x7fff38f5430b <+100>: popq   %r15
0x7fff38f5430d <+102>: popq   %rbp
0x7fff38f5430e <+103>: jmp    0x7fff2fb26c2e            ; symbol stub for: _CFAutoreleasePoolPop


runCmd: image lookup -s "__NSPropertyListClasses_ForArchival_ErrorAndException"
output: 1 symbols match '__NSPropertyListClasses_ForArchival_ErrorAndException' in /System/Library/Frameworks/Foundation.framework/Versions/C/Foundation:
        Address: Foundation[0x00007fff2f87b58d] (Foundation.__TEXT.__text + 370461)
        Summary: Foundation`__NSPropertyListClasses_ForArchival_ErrorAndException


runCmd: disassemble --force -n "__NSPropertyListClasses_ForArchival_ErrorAndException"
output: Foundation`__NSPropertyListClasses_ForArchival_ErrorAndException:
0x7fff38ef158d <+0>:  pushq  %rbp
0x7fff38ef158e <+1>:  movq   %rsp, %rbp
0x7fff38ef1591 <+4>:  cmpq   $-0x1, 0x557d3017(%rip)   ; __NSPropertyListClasses_ForArchival_ErrorAndException.plistClasses + 7
0x7fff38ef1599 <+12>: jne    0x7fff2f87b5a4            ; <+23>
0x7fff38ef159b <+14>: movq   0x557d3006(%rip), %rax    ; __NSPropertyListClasses_ForArchival_ErrorAndException.plistClasses
0x7fff38ef15a2 <+21>: popq   %rbp
0x7fff38ef15a3 <+22>: retq   
0x7fff38ef15a4 <+23>: leaq   0x557d3005(%rip), %rdi    ; __NSPropertyListClasses_ForArchival_ErrorAndException.onceToken
0x7fff38ef15ab <+30>: leaq   0x556ddf96(%rip), %rsi    ; __block_literal_global
0x7fff38ef15b2 <+37>: callq  0x7fff2fb275a0            ; symbol stub for: dispatch_once
0x7fff38ef15b7 <+42>: jmp    0x7fff2f87b59b            ; <+14>


runCmd: image lookup -s "__NSUserScriptTaskServiceStart"
output: 1 symbols match '__NSUserScriptTaskServiceStart' in /System/Library/Frameworks/Foundation.framework/Versions/C/Foundation:
        Address: Foundation[0x00007fff2fb24ceb] (Foundation.__TEXT.__text + 3161723)
        Summary: Foundation`__NSUserScriptTaskServiceStart


runCmd: disassemble --force -n "__NSUserScriptTaskServiceStart"
output: Foundation`__NSUserScriptTaskServiceStart:
0x7fff3919aceb <+0>:   pushq  %rbp
0x7fff3919acec <+1>:   movq   %rsp, %rbp
0x7fff3919acef <+4>:   pushq  %r15
0x7fff3919acf1 <+6>:   pushq  %r14
0x7fff3919acf3 <+8>:   pushq  %rbx
0x7fff3919acf4 <+9>:   pushq  %rax
0x7fff3919acf5 <+10>:  movq   $0x0, (%rsp)
0x7fff3919acfd <+18>:  leaq   0x522d5(%rip), %rdi       ; "com.apple.automation.app_launched"
0x7fff3919ad04 <+25>:  leaq   0x52279(%rip), %rdx       ; "com.apple.message.signature"
0x7fff3919ad0b <+32>:  leaq   0x51f1c(%rip), %rcx       ; "com.apple.foundation.UserScriptService"
0x7fff3919ad12 <+39>:  leaq   0x522a4(%rip), %r8        ; "com.apple.message.summarize"
0x7fff3919ad19 <+46>:  leaq   0x1ad10(%rip), %r9        ; "YES"
0x7fff3919ad20 <+53>:  movl   $0x5, %esi
0x7fff3919ad25 <+58>:  xorl   %eax, %eax
0x7fff3919ad27 <+60>:  callq  0x7fff2fb279ae            ; symbol stub for: msgtracer_log_with_keys
0x7fff3919ad2c <+65>:  movq   0x5550fec5(%rip), %rdi    ; (void *)0x00007fff8e6bb6a0: NSUserScriptTaskServiceDelegate
0x7fff3919ad33 <+72>:  callq  0x7fff2fb279d8            ; symbol stub for: objc_alloc
0x7fff3919ad38 <+77>:  movq   0x55503201(%rip), %rsi    ; "init"
0x7fff3919ad3f <+84>:  movq   0x5542bef2(%rip), %r15    ; (void *)0x00007fff6f73de40: objc_msgSend
0x7fff3919ad46 <+91>:  movq   %rax, %rdi
0x7fff3919ad49 <+94>:  callq  *%r15
0x7fff3919ad4c <+97>:  movq   %rax, %r14
0x7fff3919ad4f <+100>: movq   0x5550ed5a(%rip), %rdi    ; (void *)0x00007fff8e6bb970: NSXPCListener
0x7fff3919ad56 <+107>: movq   0x5550e023(%rip), %rsi    ; "serviceListener"
0x7fff3919ad5d <+114>: callq  *%r15
0x7fff3919ad60 <+117>: movq   %rax, %rbx
0x7fff3919ad63 <+120>: movq   0x55504cfe(%rip), %rsi    ; "setDelegate:"
0x7fff3919ad6a <+127>: movq   %rax, %rdi
0x7fff3919ad6d <+130>: movq   %r14, %rdx
0x7fff3919ad70 <+133>: callq  *%r15
0x7fff3919ad73 <+136>: movq   0x5550335e(%rip), %rsi    ; "resume"
0x7fff3919ad7a <+143>: movq   %rbx, %rdi
0x7fff3919ad7d <+146>: callq  *%r15
0x7fff3919ad80 <+149>: movq   %r14, %rdi
0x7fff3919ad83 <+152>: addq   $0x8, %rsp
0x7fff3919ad87 <+156>: popq   %rbx
0x7fff3919ad88 <+157>: popq   %r14
0x7fff3919ad8a <+159>: popq   %r15
0x7fff3919ad8c <+161>: popq   %rbp
0x7fff3919ad8d <+162>: jmpq   *0x5542bead(%rip)         ; (void *)0x00007fff6f73fca0: objc_release


runCmd: image lookup -s "getStackObservedValueClassAndBoxSize"
output: 1 symbols match 'getStackObservedValueClassAndBoxSize' in /System/Library/Frameworks/Foundation.framework/Versions/C/Foundation:
        Address: Foundation[0x00007fff2f8a4760] (Foundation.__TEXT.__text + 538864)
        Summary: Foundation`getStackObservedValueClassAndBoxSize


runCmd: disassemble --force -n "getStackObservedValueClassAndBoxSize"
output: Foundation`getStackObservedValueClassAndBoxSize:
0x7fff38f1a760 <+0>:  pushq  %rbp
0x7fff38f1a761 <+1>:  movq   %rsp, %rbp
0x7fff38f1a764 <+4>:  pushq  %rbx
0x7fff38f1a765 <+5>:  pushq  %rax
0x7fff38f1a766 <+6>:  movq   %rdi, %rbx
0x7fff38f1a769 <+9>:  cmpq   $-0x1, 0x557a9bc7(%rip)   ; getStackObservedValueClassAndBoxSize.cls + 7
0x7fff38f1a771 <+17>: jne    0x7fff2f8a478b            ; <+43>
0x7fff38f1a773 <+19>: movq   0x557a9bae(%rip), %rax    ; getStackObservedValueClassAndBoxSize.boxSize
0x7fff38f1a77a <+26>: movq   %rax, (%rbx)
0x7fff38f1a77d <+29>: movq   0x557a9bac(%rip), %rax    ; getStackObservedValueClassAndBoxSize.cls
0x7fff38f1a784 <+36>: addq   $0x8, %rsp
0x7fff38f1a788 <+40>: popq   %rbx
0x7fff38f1a789 <+41>: popq   %rbp
0x7fff38f1a78a <+42>: retq   
0x7fff38f1a78b <+43>: leaq   0x557a9ba6(%rip), %rdi    ; getStackObservedValueClassAndBoxSize.onceToken
0x7fff38f1a792 <+50>: leaq   0x556b38f7(%rip), %rsi    ; __block_literal_global
0x7fff38f1a799 <+57>: callq  0x7fff2fb275a0            ; symbol stub for: dispatch_once
0x7fff38f1a79e <+62>: jmp    0x7fff2f8a4773            ; <+19>


<bound method SBProcess.Kill of <lldb.SBProcess; proxy of <Swig Object of type 'lldb::SBProcess *' at 0x110041780> >>: success

PASS: LLDB (/Users/buildslave/jenkins/workspace/lldb-cmake-matrix/lldb-build/bin/clang-x86_64) :: test_foundation_disasm (TestFoundationDisassembly.FoundationDisassembleTestCase)
runCmd: settings clear -all
output: 

runCmd: settings set symbols.enable-external-lookup false
output: 

runCmd: settings set target.inherit-tcc true
output: 

runCmd: settings set target.detach-on-error false
output: 

runCmd: settings set target.auto-apply-fixits false
output: 

runCmd: settings set plugin.process.gdb-remote.packet-timeout 60
output: 

runCmd: settings set symbols.clang-modules-cache-path "/Users/buildslave/jenkins/workspace/lldb-cmake-matrix/lldb-build/lldb-test-build.noindex/module-cache-lldb/lldb-api"
output: 

runCmd: settings set use-color false
output: 

runCmd: setting set target.prefer-dynamic-value no-dynamic-values
output: 

runCmd: _regexp-break +[NSString stringWithFormat:]
output: Breakpoint 1: where = Foundation`+[NSString stringWithFormat:], address = 0x00007fff2f839d87


Expecting pattern: ^Breakpoint (?P<bpno>[0-9]+): (?P<num_locations>[0-9]+) locations\.$
Not matched

Expecting pattern: ^Breakpoint (?P<bpno>[0-9]+): (?P<num_locations>no) locations \(pending\)\.
Not matched

Expecting pattern: ^Breakpoint (?P<bpno>[0-9]+): where = (?P<module>.*)`(?P<symbol>[+\-]{0,1}[^+]+)( \+ (?P<offset>[0-9]+)){0,1}( \[inlined\] (?P<inline_symbol>.*)){0,1} at (?P<file>[^:]+):(?P<line_no>[0-9]+)(?P<column>(:[0-9]+)?), address = (?P<address>0x[0-9a-fA-F]+)$
Not matched

Expecting pattern: ^Breakpoint (?P<bpno>[0-9]+): where = (?P<module>.*)`(?P<symbol>.*)( \+ (?P<offset>[0-9]+)){0,1}, address = (?P<address>0x[0-9a-fA-F]+)$
Matched

runCmd: breakpoint set -n "-[MyString initWithNSString:]"
output: Breakpoint 2: where = a.out`-[MyString descriptionPauses] + 20 at 23:16, address = 0x0000000100001584


Expecting pattern: ^Breakpoint (?P<bpno>[0-9]+): (?P<num_locations>[0-9]+) locations\.$
Not matched

Expecting pattern: ^Breakpoint (?P<bpno>[0-9]+): (?P<num_locations>no) locations \(pending\)\.
Not matched

Expecting pattern: ^Breakpoint (?P<bpno>[0-9]+): where = (?P<module>.*)`(?P<symbol>[+\-]{0,1}[^+]+)( \+ (?P<offset>[0-9]+)){0,1}( \[inlined\] (?P<inline_symbol>.*)){0,1} at (?P<file>[^:]+):(?P<line_no>[0-9]+)(?P<column>(:[0-9]+)?), address = (?P<address>0x[0-9a-fA-F]+)$
Matched

FAIL: LLDB (/Users/buildslave/jenkins/workspace/lldb-cmake-matrix/lldb-build/bin/clang-x86_64) :: test_simple_disasm (TestFoundationDisassembly.FoundationDisassembleTestCase)
Restore dir to: /Users/buildslave/jenkins/workspace/lldb-cmake-matrix/lldb-build/tools/lldb/test
======================================================================
FAIL: test_simple_disasm (TestFoundationDisassembly.FoundationDisassembleTestCase)
   Test the lldb 'disassemble' command
----------------------------------------------------------------------
Traceback (most recent call last):
  File "/Users/buildslave/jenkins/workspace/lldb-cmake-matrix/llvm-project/lldb/packages/Python/lldbsuite/test/decorators.py", line 149, in wrapper
    return func(*args, **kwargs)
  File "/Users/buildslave/jenkins/workspace/lldb-cmake-matrix/llvm-project/lldb/test/API/lang/objc/foundation/TestFoundationDisassembly.py", line 90, in test_simple_disasm
    sym_exact=True)
  File "/Users/buildslave/jenkins/workspace/lldb-cmake-matrix/llvm-project/lldb/packages/Python/lldbsuite/test/lldbutil.py", line 457, in run_break_set_by_symbol
    module_name=module_name)
  File "/Users/buildslave/jenkins/workspace/lldb-cmake-matrix/llvm-project/lldb/packages/Python/lldbsuite/test/lldbutil.py", line 695, in check_breakpoint_result
    out_symbol_name))
AssertionError: False is not True : Symbol name '-[MyString initWithNSString:]' doesn't match resultant symbol '-[MyString descriptionPauses]'.
Config=x86_64-/Users/buildslave/jenkins/workspace/lldb-cmake-matrix/lldb-build/bin/clang
----------------------------------------------------------------------
Ran 2 tests in 66.577s

RESULT: FAILED (1 passes, 1 failures, 0 errors, 0 skipped, 0 expected failures, 0 unexpected successes)

--

********************
FAIL: lldb-api :: lang/objc/hidden-ivars/TestHiddenIvars.py (2258 of 2261)
******************** TEST 'lldb-api :: lang/objc/hidden-ivars/TestHiddenIvars.py' FAILED ********************
Script:
--
/usr/local/Frameworks/Python.framework/Versions/3.7/bin/python3.7 /Users/buildslave/jenkins/workspace/lldb-cmake-matrix/llvm-project/lldb/test/API/dotest.py -u CXXFLAGS -u CFLAGS --codesign-identity lldb_codesign --arch x86_64 --build-dir /Users/buildslave/jenkins/workspace/lldb-cmake-matrix/lldb-build/lldb-test-build.noindex -t --env TERM=vt100 --skip-category gmodules --skip-category watchpoint --arch=x86_64 --dwarf-version=5 --env LLVM_LIBS_DIR=/Users/buildslave/jenkins/workspace/lldb-cmake-matrix/lldb-build/./lib --arch x86_64 --build-dir /Users/buildslave/jenkins/workspace/lldb-cmake-matrix/lldb-build/lldb-test-build.noindex --lldb-module-cache-dir /Users/buildslave/jenkins/workspace/lldb-cmake-matrix/lldb-build/lldb-test-build.noindex/module-cache-lldb/lldb-api --clang-module-cache-dir /Users/buildslave/jenkins/workspace/lldb-cmake-matrix/lldb-build/lldb-test-build.noindex/module-cache-clang/lldb-api --executable /Users/buildslave/jenkins/workspace/lldb-cmake-matrix/lldb-build/./bin/lldb --compiler /Users/buildslave/jenkins/workspace/lldb-cmake-matrix/lldb-build/./bin/clang --dsymutil /Users/buildslave/jenkins/workspace/lldb-cmake-matrix/lldb-build/./bin/dsymutil --llvm-tools-dir /Users/buildslave/jenkins/workspace/lldb-cmake-matrix/lldb-build/./bin --lldb-libs-dir /Users/buildslave/jenkins/workspace/lldb-cmake-matrix/lldb-build/./lib /Users/buildslave/jenkins/workspace/lldb-cmake-matrix/llvm-project/lldb/test/API/lang/objc/hidden-ivars -p TestHiddenIvars.py
--
Exit Code: 1

Command Output (stdout):
--
lldb version 13.0.99 (http://labmaster3.local/git/llvm-project.git revision c88c46080a75467788b4379f49fc664061c2c6d0)
  clang revision c88c46080a75467788b4379f49fc664061c2c6d0
  llvm revision c88c46080a75467788b4379f49fc664061c2c6d0
libstdcxx tests will not be run because: Don't know how to build with libstdcxx on macosx
Skipping following debug info categories: ['dwo']

--
Command Output (stderr):
--
Change dir to: /Users/buildslave/jenkins/workspace/lldb-cmake-matrix/llvm-project/lldb/test/API/lang/objc/hidden-ivars
runCmd: settings clear -all
output: 

runCmd: settings set symbols.enable-external-lookup false
output: 

runCmd: settings set target.inherit-tcc true
output: 

runCmd: settings set target.detach-on-error false
output: 

runCmd: settings set target.auto-apply-fixits false
output: 

runCmd: settings set plugin.process.gdb-remote.packet-timeout 60
output: 

runCmd: settings set symbols.clang-modules-cache-path "/Users/buildslave/jenkins/workspace/lldb-cmake-matrix/lldb-build/lldb-test-build.noindex/module-cache-lldb/lldb-api"
output: 

runCmd: settings set use-color false
output: 

runCmd: setting set target.prefer-dynamic-value no-dynamic-values
output: 

runCmd: file /Users/buildslave/jenkins/workspace/lldb-cmake-matrix/lldb-build/lldb-test-build.noindex/lang/objc/hidden-ivars/TestHiddenIvars.test_expr_dsym/a.out
output: Current executable set to '/Users/buildslave/jenkins/workspace/lldb-cmake-matrix/lldb-build/lldb-test-build.noindex/lang/objc/hidden-ivars/TestHiddenIvars.test_expr_dsym/a.out' (x86_64).


runCmd: breakpoint set -f "main.m" -l 49
output: Breakpoint 1: no locations (pending).
WARNING:  Unable to resolve breakpoint to any actual locations.


Expecting pattern: ^Breakpoint (?P<bpno>[0-9]+): (?P<num_locations>[0-9]+) locations\.$
Not matched

Expecting pattern: ^Breakpoint (?P<bpno>[0-9]+): (?P<num_locations>no) locations \(pending\)\.
Matched

FAIL: LLDB (/Users/buildslave/jenkins/workspace/lldb-cmake-matrix/lldb-build/bin/clang-x86_64) :: test_expr_dsym (TestHiddenIvars.HiddenIvarsTestCase)
<bound method SBProcess.Kill of <lldb.SBProcess; proxy of <Swig Object of type 'lldb::SBProcess *' at 0x10ea20960> >>: success

runCmd: settings clear -all
output: 

runCmd: settings set symbols.enable-external-lookup false
output: 

runCmd: settings set target.inherit-tcc true
output: 

runCmd: settings set target.detach-on-error false
output: 

runCmd: settings set target.auto-apply-fixits false
output: 

runCmd: settings set plugin.process.gdb-remote.packet-timeout 60
output: 

runCmd: settings set symbols.clang-modules-cache-path "/Users/buildslave/jenkins/workspace/lldb-cmake-matrix/lldb-build/lldb-test-build.noindex/module-cache-lldb/lldb-api"
output: 

runCmd: settings set use-color false
output: 

runCmd: setting set target.prefer-dynamic-value no-dynamic-values
output: 

runCmd: file /Users/buildslave/jenkins/workspace/lldb-cmake-matrix/lldb-build/lldb-test-build.noindex/lang/objc/hidden-ivars/TestHiddenIvars.test_expr_dwarf/a.out
output: Current executable set to '/Users/buildslave/jenkins/workspace/lldb-cmake-matrix/lldb-build/lldb-test-build.noindex/lang/objc/hidden-ivars/TestHiddenIvars.test_expr_dwarf/a.out' (x86_64).


runCmd: breakpoint set -f "main.m" -l 49
output: Breakpoint 1: no locations (pending).
WARNING:  Unable to resolve breakpoint to any actual locations.


Expecting pattern: ^Breakpoint (?P<bpno>[0-9]+): (?P<num_locations>[0-9]+) locations\.$
Not matched

Expecting pattern: ^Breakpoint (?P<bpno>[0-9]+): (?P<num_locations>no) locations \(pending\)\.
Matched

FAIL: LLDB (/Users/buildslave/jenkins/workspace/lldb-cmake-matrix/lldb-build/bin/clang-x86_64) :: test_expr_dwarf (TestHiddenIvars.HiddenIvarsTestCase)
<bound method SBProcess.Kill of <lldb.SBProcess; proxy of <Swig Object of type 'lldb::SBProcess *' at 0x10940ec60> >>: success

UNSUPPORTED: LLDB (/Users/buildslave/jenkins/workspace/lldb-cmake-matrix/lldb-build/bin/clang-x86_64) :: test_expr_dwo (TestHiddenIvars.HiddenIvarsTestCase) (test case does not fall in any category of interest for this run) 
UNSUPPORTED: LLDB (/Users/buildslave/jenkins/workspace/lldb-cmake-matrix/lldb-build/bin/clang-x86_64) :: test_expr_gmodules (TestHiddenIvars.HiddenIvarsTestCase) (test case does not fall in any category of interest for this run) 
runCmd: settings clear -all
output: 

runCmd: settings set symbols.enable-external-lookup false
output: 

runCmd: settings set target.inherit-tcc true
output: 

runCmd: settings set target.detach-on-error false
output: 

runCmd: settings set target.auto-apply-fixits false
output: 

runCmd: settings set plugin.process.gdb-remote.packet-timeout 60
output: 

runCmd: settings set symbols.clang-modules-cache-path "/Users/buildslave/jenkins/workspace/lldb-cmake-matrix/lldb-build/lldb-test-build.noindex/module-cache-lldb/lldb-api"
output: 

runCmd: settings set use-color false
output: 

runCmd: setting set target.prefer-dynamic-value no-dynamic-values
output: 

runCmd: file /Users/buildslave/jenkins/workspace/lldb-cmake-matrix/lldb-build/lldb-test-build.noindex/lang/objc/hidden-ivars/TestHiddenIvars.test_expr_stripped_dsym/stripped/a.out
output: Current executable set to '/Users/buildslave/jenkins/workspace/lldb-cmake-matrix/lldb-build/lldb-test-build.noindex/lang/objc/hidden-ivars/TestHiddenIvars.test_expr_stripped_dsym/stripped/a.out' (x86_64).


runCmd: breakpoint set -f "main.m" -l 49
output: Breakpoint 1: no locations (pending).
WARNING:  Unable to resolve breakpoint to any actual locations.


Expecting pattern: ^Breakpoint (?P<bpno>[0-9]+): (?P<num_locations>[0-9]+) locations\.$
Not matched

Expecting pattern: ^Breakpoint (?P<bpno>[0-9]+): (?P<num_locations>no) locations \(pending\)\.
Matched

FAIL: LLDB (/Users/buildslave/jenkins/workspace/lldb-cmake-matrix/lldb-build/bin/clang-x86_64) :: test_expr_stripped_dsym (TestHiddenIvars.HiddenIvarsTestCase)
<bound method SBProcess.Kill of <lldb.SBProcess; proxy of <Swig Object of type 'lldb::SBProcess *' at 0x10ea20ea0> >>: success

runCmd: settings clear -all
output: 

runCmd: settings set symbols.enable-external-lookup false
output: 

runCmd: settings set target.inherit-tcc true
output: 

runCmd: settings set target.detach-on-error false
output: 

runCmd: settings set target.auto-apply-fixits false
output: 

runCmd: settings set plugin.process.gdb-remote.packet-timeout 60
output: 

runCmd: settings set symbols.clang-modules-cache-path "/Users/buildslave/jenkins/workspace/lldb-cmake-matrix/lldb-build/lldb-test-build.noindex/module-cache-lldb/lldb-api"
output: 

runCmd: settings set use-color false
output: 

runCmd: setting set target.prefer-dynamic-value no-dynamic-values
output: 

UNSUPPORTED: LLDB (/Users/buildslave/jenkins/workspace/lldb-cmake-matrix/lldb-build/bin/clang-x86_64) :: test_expr_stripped_dwarf (TestHiddenIvars.HiddenIvarsTestCase) (skipping due to the following parameter(s): debug info format [This test requires a stripped binary and a dSYM]) 
UNSUPPORTED: LLDB (/Users/buildslave/jenkins/workspace/lldb-cmake-matrix/lldb-build/bin/clang-x86_64) :: test_expr_stripped_dwo (TestHiddenIvars.HiddenIvarsTestCase) (test case does not fall in any category of interest for this run) 
UNSUPPORTED: LLDB (/Users/buildslave/jenkins/workspace/lldb-cmake-matrix/lldb-build/bin/clang-x86_64) :: test_expr_stripped_gmodules (TestHiddenIvars.HiddenIvarsTestCase) (test case does not fall in any category of interest for this run) 
runCmd: settings clear -all
output: 

runCmd: settings set symbols.enable-external-lookup false
output: 

runCmd: settings set target.inherit-tcc true
output: 

runCmd: settings set target.detach-on-error false
output: 

runCmd: settings set target.auto-apply-fixits false
output: 

runCmd: settings set plugin.process.gdb-remote.packet-timeout 60
output: 

runCmd: settings set symbols.clang-modules-cache-path "/Users/buildslave/jenkins/workspace/lldb-cmake-matrix/lldb-build/lldb-test-build.noindex/module-cache-lldb/lldb-api"
output: 

runCmd: settings set use-color false
output: 

runCmd: setting set target.prefer-dynamic-value no-dynamic-values
output: 

runCmd: file /Users/buildslave/jenkins/workspace/lldb-cmake-matrix/lldb-build/lldb-test-build.noindex/lang/objc/hidden-ivars/TestHiddenIvars.test_frame_variable_across_modules_dsym/a.out
output: Current executable set to '/Users/buildslave/jenkins/workspace/lldb-cmake-matrix/lldb-build/lldb-test-build.noindex/lang/objc/hidden-ivars/TestHiddenIvars.test_frame_variable_across_modules_dsym/a.out' (x86_64).


runCmd: breakpoint set -f "main.m" -l 49
output: Breakpoint 1: no locations (pending).
WARNING:  Unable to resolve breakpoint to any actual locations.


Expecting pattern: ^Breakpoint (?P<bpno>[0-9]+): (?P<num_locations>[0-9]+) locations\.$
Not matched

Expecting pattern: ^Breakpoint (?P<bpno>[0-9]+): (?P<num_locations>no) locations \(pending\)\.
Matched

XFAIL: LLDB (/Users/buildslave/jenkins/workspace/lldb-cmake-matrix/lldb-build/bin/clang-x86_64) :: test_frame_variable_across_modules_dsym (TestHiddenIvars.HiddenIvarsTestCase)
<bound method SBProcess.Kill of <lldb.SBProcess; proxy of <Swig Object of type 'lldb::SBProcess *' at 0x10e4ec2d0> >>: success

runCmd: settings clear -all
output: 

runCmd: settings set symbols.enable-external-lookup false
output: 

runCmd: settings set target.inherit-tcc true
output: 

runCmd: settings set target.detach-on-error false
output: 

runCmd: settings set target.auto-apply-fixits false
output: 

runCmd: settings set plugin.process.gdb-remote.packet-timeout 60
output: 

runCmd: settings set symbols.clang-modules-cache-path "/Users/buildslave/jenkins/workspace/lldb-cmake-matrix/lldb-build/lldb-test-build.noindex/module-cache-lldb/lldb-api"
output: 

runCmd: settings set use-color false
output: 

runCmd: setting set target.prefer-dynamic-value no-dynamic-values
output: 

runCmd: file /Users/buildslave/jenkins/workspace/lldb-cmake-matrix/lldb-build/lldb-test-build.noindex/lang/objc/hidden-ivars/TestHiddenIvars.test_frame_variable_across_modules_dwarf/a.out
output: Current executable set to '/Users/buildslave/jenkins/workspace/lldb-cmake-matrix/lldb-build/lldb-test-build.noindex/lang/objc/hidden-ivars/TestHiddenIvars.test_frame_variable_across_modules_dwarf/a.out' (x86_64).


runCmd: breakpoint set -f "main.m" -l 49
output: Breakpoint 1: no locations (pending).
WARNING:  Unable to resolve breakpoint to any actual locations.


Expecting pattern: ^Breakpoint (?P<bpno>[0-9]+): (?P<num_locations>[0-9]+) locations\.$
Not matched

Expecting pattern: ^Breakpoint (?P<bpno>[0-9]+): (?P<num_locations>no) locations \(pending\)\.
Matched

XFAIL: LLDB (/Users/buildslave/jenkins/workspace/lldb-cmake-matrix/lldb-build/bin/clang-x86_64) :: test_frame_variable_across_modules_dwarf (TestHiddenIvars.HiddenIvarsTestCase)
<bound method SBProcess.Kill of <lldb.SBProcess; proxy of <Swig Object of type 'lldb::SBProcess *' at 0x10ea20ea0> >>: success

UNSUPPORTED: LLDB (/Users/buildslave/jenkins/workspace/lldb-cmake-matrix/lldb-build/bin/clang-x86_64) :: test_frame_variable_across_modules_dwo (TestHiddenIvars.HiddenIvarsTestCase) (test case does not fall in any category of interest for this run) 
UNSUPPORTED: LLDB (/Users/buildslave/jenkins/workspace/lldb-cmake-matrix/lldb-build/bin/clang-x86_64) :: test_frame_variable_across_modules_gmodules (TestHiddenIvars.HiddenIvarsTestCase) (test case does not fall in any category of interest for this run) 
runCmd: settings clear -all
output: 

runCmd: settings set symbols.enable-external-lookup false
output: 

runCmd: settings set target.inherit-tcc true
output: 

runCmd: settings set target.detach-on-error false
output: 

runCmd: settings set target.auto-apply-fixits false
output: 

runCmd: settings set plugin.process.gdb-remote.packet-timeout 60
output: 

runCmd: settings set symbols.clang-modules-cache-path "/Users/buildslave/jenkins/workspace/lldb-cmake-matrix/lldb-build/lldb-test-build.noindex/module-cache-lldb/lldb-api"
output: 

runCmd: settings set use-color false
output: 

runCmd: setting set target.prefer-dynamic-value no-dynamic-values
output: 

runCmd: file /Users/buildslave/jenkins/workspace/lldb-cmake-matrix/lldb-build/lldb-test-build.noindex/lang/objc/hidden-ivars/TestHiddenIvars.test_frame_variable_dsym/a.out
output: Current executable set to '/Users/buildslave/jenkins/workspace/lldb-cmake-matrix/lldb-build/lldb-test-build.noindex/lang/objc/hidden-ivars/TestHiddenIvars.test_frame_variable_dsym/a.out' (x86_64).


runCmd: breakpoint set -f "main.m" -l 49
output: Breakpoint 1: no locations (pending).
WARNING:  Unable to resolve breakpoint to any actual locations.


Expecting pattern: ^Breakpoint (?P<bpno>[0-9]+): (?P<num_locations>[0-9]+) locations\.$
Not matched

Expecting pattern: ^Breakpoint (?P<bpno>[0-9]+): (?P<num_locations>no) locations \(pending\)\.
Matched

FAIL: LLDB (/Users/buildslave/jenkins/workspace/lldb-cmake-matrix/lldb-build/bin/clang-x86_64) :: test_frame_variable_dsym (TestHiddenIvars.HiddenIvarsTestCase)
<bound method SBProcess.Kill of <lldb.SBProcess; proxy of <Swig Object of type 'lldb::SBProcess *' at 0x10e448cc0> >>: success

runCmd: settings clear -all
output: 

runCmd: settings set symbols.enable-external-lookup false
output: 

runCmd: settings set target.inherit-tcc true
output: 

runCmd: settings set target.detach-on-error false
output: 

runCmd: settings set target.auto-apply-fixits false
output: 

runCmd: settings set plugin.process.gdb-remote.packet-timeout 60
output: 

runCmd: settings set symbols.clang-modules-cache-path "/Users/buildslave/jenkins/workspace/lldb-cmake-matrix/lldb-build/lldb-test-build.noindex/module-cache-lldb/lldb-api"
output: 

runCmd: settings set use-color false
output: 

runCmd: setting set target.prefer-dynamic-value no-dynamic-values
output: 

runCmd: file /Users/buildslave/jenkins/workspace/lldb-cmake-matrix/lldb-build/lldb-test-build.noindex/lang/objc/hidden-ivars/TestHiddenIvars.test_frame_variable_dwarf/a.out
output: Current executable set to '/Users/buildslave/jenkins/workspace/lldb-cmake-matrix/lldb-build/lldb-test-build.noindex/lang/objc/hidden-ivars/TestHiddenIvars.test_frame_variable_dwarf/a.out' (x86_64).


runCmd: breakpoint set -f "main.m" -l 49
output: Breakpoint 1: no locations (pending).
WARNING:  Unable to resolve breakpoint to any actual locations.


Expecting pattern: ^Breakpoint (?P<bpno>[0-9]+): (?P<num_locations>[0-9]+) locations\.$
Not matched

Expecting pattern: ^Breakpoint (?P<bpno>[0-9]+): (?P<num_locations>no) locations \(pending\)\.
Matched

FAIL: LLDB (/Users/buildslave/jenkins/workspace/lldb-cmake-matrix/lldb-build/bin/clang-x86_64) :: test_frame_variable_dwarf (TestHiddenIvars.HiddenIvarsTestCase)
<bound method SBProcess.Kill of <lldb.SBProcess; proxy of <Swig Object of type 'lldb::SBProcess *' at 0x10940ec60> >>: success

UNSUPPORTED: LLDB (/Users/buildslave/jenkins/workspace/lldb-cmake-matrix/lldb-build/bin/clang-x86_64) :: test_frame_variable_dwo (TestHiddenIvars.HiddenIvarsTestCase) (test case does not fall in any category of interest for this run) 
UNSUPPORTED: LLDB (/Users/buildslave/jenkins/workspace/lldb-cmake-matrix/lldb-build/bin/clang-x86_64) :: test_frame_variable_gmodules (TestHiddenIvars.HiddenIvarsTestCase) (test case does not fall in any category of interest for this run) 
runCmd: settings clear -all
output: 

runCmd: settings set symbols.enable-external-lookup false
output: 

runCmd: settings set target.inherit-tcc true
output: 

runCmd: settings set target.detach-on-error false
output: 

runCmd: settings set target.auto-apply-fixits false
output: 

runCmd: settings set plugin.process.gdb-remote.packet-timeout 60
output: 

runCmd: settings set symbols.clang-modules-cache-path "/Users/buildslave/jenkins/workspace/lldb-cmake-matrix/lldb-build/lldb-test-build.noindex/module-cache-lldb/lldb-api"
output: 

runCmd: settings set use-color false
output: 

runCmd: setting set target.prefer-dynamic-value no-dynamic-values
output: 

runCmd: file /Users/buildslave/jenkins/workspace/lldb-cmake-matrix/lldb-build/lldb-test-build.noindex/lang/objc/hidden-ivars/TestHiddenIvars.test_frame_variable_stripped_dsym/stripped/a.out
output: Current executable set to '/Users/buildslave/jenkins/workspace/lldb-cmake-matrix/lldb-build/lldb-test-build.noindex/lang/objc/hidden-ivars/TestHiddenIvars.test_frame_variable_stripped_dsym/stripped/a.out' (x86_64).


runCmd: breakpoint set -f "main.m" -l 49
output: Breakpoint 1: no locations (pending).
WARNING:  Unable to resolve breakpoint to any actual locations.


Expecting pattern: ^Breakpoint (?P<bpno>[0-9]+): (?P<num_locations>[0-9]+) locations\.$
Not matched

Expecting pattern: ^Breakpoint (?P<bpno>[0-9]+): (?P<num_locations>no) locations \(pending\)\.
Matched

FAIL: LLDB (/Users/buildslave/jenkins/workspace/lldb-cmake-matrix/lldb-build/bin/clang-x86_64) :: test_frame_variable_stripped_dsym (TestHiddenIvars.HiddenIvarsTestCase)
<bound method SBProcess.Kill of <lldb.SBProcess; proxy of <Swig Object of type 'lldb::SBProcess *' at 0x1093d45a0> >>: success

runCmd: settings clear -all
output: 

runCmd: settings set symbols.enable-external-lookup false
output: 

runCmd: settings set target.inherit-tcc true
output: 

runCmd: settings set target.detach-on-error false
output: 

runCmd: settings set target.auto-apply-fixits false
output: 

runCmd: settings set plugin.process.gdb-remote.packet-timeout 60
output: 

runCmd: settings set symbols.clang-modules-cache-path "/Users/buildslave/jenkins/workspace/lldb-cmake-matrix/lldb-build/lldb-test-build.noindex/module-cache-lldb/lldb-api"
output: 

runCmd: settings set use-color false
output: 

runCmd: setting set target.prefer-dynamic-value no-dynamic-values
output: 

UNSUPPORTED: LLDB (/Users/buildslave/jenkins/workspace/lldb-cmake-matrix/lldb-build/bin/clang-x86_64) :: test_frame_variable_stripped_dwarf (TestHiddenIvars.HiddenIvarsTestCase) (skipping due to the following parameter(s): debug info format [This test requires a stripped binary and a dSYM]) 
UNSUPPORTED: LLDB (/Users/buildslave/jenkins/workspace/lldb-cmake-matrix/lldb-build/bin/clang-x86_64) :: test_frame_variable_stripped_dwo (TestHiddenIvars.HiddenIvarsTestCase) (test case does not fall in any category of interest for this run) 
UNSUPPORTED: LLDB (/Users/buildslave/jenkins/workspace/lldb-cmake-matrix/lldb-build/bin/clang-x86_64) :: test_frame_variable_stripped_gmodules (TestHiddenIvars.HiddenIvarsTestCase) (test case does not fall in any category of interest for this run) 
Restore dir to: /Users/buildslave/jenkins/workspace/lldb-cmake-matrix/lldb-build/tools/lldb/test
======================================================================
FAIL: test_expr_dsym (TestHiddenIvars.HiddenIvarsTestCase)
----------------------------------------------------------------------
Traceback (most recent call last):
  File "/Users/buildslave/jenkins/workspace/lldb-cmake-matrix/llvm-project/lldb/packages/Python/lldbsuite/test/lldbtest.py", line 1846, in test_method
    return attrvalue(self)
  File "/Users/buildslave/jenkins/workspace/lldb-cmake-matrix/llvm-project/lldb/test/API/lang/objc/hidden-ivars/TestHiddenIvars.py", line 46, in test_expr
    self.expr(False)
  File "/Users/buildslave/jenkins/workspace/lldb-cmake-matrix/llvm-project/lldb/test/API/lang/objc/hidden-ivars/TestHiddenIvars.py", line 119, in expr
    self.common_setup(strip)
  File "/Users/buildslave/jenkins/workspace/lldb-cmake-matrix/llvm-project/lldb/test/API/lang/objc/hidden-ivars/TestHiddenIvars.py", line 105, in common_setup
    self, "main.m", self.line, num_expected_locations=1, loc_exact=True)
  File "/Users/buildslave/jenkins/workspace/lldb-cmake-matrix/llvm-project/lldb/packages/Python/lldbsuite/test/lldbutil.py", line 421, in run_break_set_by_file_and_line
    module_name=module_name)
  File "/Users/buildslave/jenkins/workspace/lldb-cmake-matrix/llvm-project/lldb/packages/Python/lldbsuite/test/lldbutil.py", line 647, in check_breakpoint_result
    out_num_locations))
AssertionError: False is not True : Expecting 1 locations, got 0.
Config=x86_64-/Users/buildslave/jenkins/workspace/lldb-cmake-matrix/lldb-build/bin/clang
======================================================================
FAIL: test_expr_dwarf (TestHiddenIvars.HiddenIvarsTestCase)
----------------------------------------------------------------------
Traceback (most recent call last):
  File "/Users/buildslave/jenkins/workspace/lldb-cmake-matrix/llvm-project/lldb/packages/Python/lldbsuite/test/lldbtest.py", line 1846, in test_method
    return attrvalue(self)
  File "/Users/buildslave/jenkins/workspace/lldb-cmake-matrix/llvm-project/lldb/test/API/lang/objc/hidden-ivars/TestHiddenIvars.py", line 46, in test_expr
    self.expr(False)
  File "/Users/buildslave/jenkins/workspace/lldb-cmake-matrix/llvm-project/lldb/test/API/lang/objc/hidden-ivars/TestHiddenIvars.py", line 119, in expr
    self.common_setup(strip)
  File "/Users/buildslave/jenkins/workspace/lldb-cmake-matrix/llvm-project/lldb/test/API/lang/objc/hidden-ivars/TestHiddenIvars.py", line 105, in common_setup
    self, "main.m", self.line, num_expected_locations=1, loc_exact=True)
  File "/Users/buildslave/jenkins/workspace/lldb-cmake-matrix/llvm-project/lldb/packages/Python/lldbsuite/test/lldbutil.py", line 421, in run_break_set_by_file_and_line
    module_name=module_name)
  File "/Users/buildslave/jenkins/workspace/lldb-cmake-matrix/llvm-project/lldb/packages/Python/lldbsuite/test/lldbutil.py", line 647, in check_breakpoint_result
    out_num_locations))
AssertionError: False is not True : Expecting 1 locations, got 0.
Config=x86_64-/Users/buildslave/jenkins/workspace/lldb-cmake-matrix/lldb-build/bin/clang
======================================================================
FAIL: test_expr_stripped_dsym (TestHiddenIvars.HiddenIvarsTestCase)
----------------------------------------------------------------------
Traceback (most recent call last):
  File "/Users/buildslave/jenkins/workspace/lldb-cmake-matrix/llvm-project/lldb/packages/Python/lldbsuite/test/lldbtest.py", line 1846, in test_method
    return attrvalue(self)
  File "/Users/buildslave/jenkins/workspace/lldb-cmake-matrix/llvm-project/lldb/packages/Python/lldbsuite/test/decorators.py", line 149, in wrapper
    return func(*args, **kwargs)
  File "/Users/buildslave/jenkins/workspace/lldb-cmake-matrix/llvm-project/lldb/test/API/lang/objc/hidden-ivars/TestHiddenIvars.py", line 38, in test_expr_stripped
    self.expr(True)
  File "/Users/buildslave/jenkins/workspace/lldb-cmake-matrix/llvm-project/lldb/test/API/lang/objc/hidden-ivars/TestHiddenIvars.py", line 119, in expr
    self.common_setup(strip)
  File "/Users/buildslave/jenkins/workspace/lldb-cmake-matrix/llvm-project/lldb/test/API/lang/objc/hidden-ivars/TestHiddenIvars.py", line 105, in common_setup
    self, "main.m", self.line, num_expected_locations=1, loc_exact=True)
  File "/Users/buildslave/jenkins/workspace/lldb-cmake-matrix/llvm-project/lldb/packages/Python/lldbsuite/test/lldbutil.py", line 421, in run_break_set_by_file_and_line
    module_name=module_name)
  File "/Users/buildslave/jenkins/workspace/lldb-cmake-matrix/llvm-project/lldb/packages/Python/lldbsuite/test/lldbutil.py", line 647, in check_breakpoint_result
    out_num_locations))
AssertionError: False is not True : Expecting 1 locations, got 0.
Config=x86_64-/Users/buildslave/jenkins/workspace/lldb-cmake-matrix/lldb-build/bin/clang
======================================================================
FAIL: test_frame_variable_dsym (TestHiddenIvars.HiddenIvarsTestCase)
----------------------------------------------------------------------
Traceback (most recent call last):
  File "/Users/buildslave/jenkins/workspace/lldb-cmake-matrix/llvm-project/lldb/packages/Python/lldbsuite/test/lldbtest.py", line 1846, in test_method
    return attrvalue(self)
  File "/Users/buildslave/jenkins/workspace/lldb-cmake-matrix/llvm-project/lldb/test/API/lang/objc/hidden-ivars/TestHiddenIvars.py", line 63, in test_frame_variable
    self.frame_var(False)
  File "/Users/buildslave/jenkins/workspace/lldb-cmake-matrix/llvm-project/lldb/test/API/lang/objc/hidden-ivars/TestHiddenIvars.py", line 172, in frame_var
    self.common_setup(strip)
  File "/Users/buildslave/jenkins/workspace/lldb-cmake-matrix/llvm-project/lldb/test/API/lang/objc/hidden-ivars/TestHiddenIvars.py", line 105, in common_setup
    self, "main.m", self.line, num_expected_locations=1, loc_exact=True)
  File "/Users/buildslave/jenkins/workspace/lldb-cmake-matrix/llvm-project/lldb/packages/Python/lldbsuite/test/lldbutil.py", line 421, in run_break_set_by_file_and_line
    module_name=module_name)
  File "/Users/buildslave/jenkins/workspace/lldb-cmake-matrix/llvm-project/lldb/packages/Python/lldbsuite/test/lldbutil.py", line 647, in check_breakpoint_result
    out_num_locations))
AssertionError: False is not True : Expecting 1 locations, got 0.
Config=x86_64-/Users/buildslave/jenkins/workspace/lldb-cmake-matrix/lldb-build/bin/clang
======================================================================
FAIL: test_frame_variable_dwarf (TestHiddenIvars.HiddenIvarsTestCase)
----------------------------------------------------------------------
Traceback (most recent call last):
  File "/Users/buildslave/jenkins/workspace/lldb-cmake-matrix/llvm-project/lldb/packages/Python/lldbsuite/test/lldbtest.py", line 1846, in test_method
    return attrvalue(self)
  File "/Users/buildslave/jenkins/workspace/lldb-cmake-matrix/llvm-project/lldb/test/API/lang/objc/hidden-ivars/TestHiddenIvars.py", line 63, in test_frame_variable
    self.frame_var(False)
  File "/Users/buildslave/jenkins/workspace/lldb-cmake-matrix/llvm-project/lldb/test/API/lang/objc/hidden-ivars/TestHiddenIvars.py", line 172, in frame_var
    self.common_setup(strip)
  File "/Users/buildslave/jenkins/workspace/lldb-cmake-matrix/llvm-project/lldb/test/API/lang/objc/hidden-ivars/TestHiddenIvars.py", line 105, in common_setup
    self, "main.m", self.line, num_expected_locations=1, loc_exact=True)
  File "/Users/buildslave/jenkins/workspace/lldb-cmake-matrix/llvm-project/lldb/packages/Python/lldbsuite/test/lldbutil.py", line 421, in run_break_set_by_file_and_line
    module_name=module_name)
  File "/Users/buildslave/jenkins/workspace/lldb-cmake-matrix/llvm-project/lldb/packages/Python/lldbsuite/test/lldbutil.py", line 647, in check_breakpoint_result
    out_num_locations))
AssertionError: False is not True : Expecting 1 locations, got 0.
Config=x86_64-/Users/buildslave/jenkins/workspace/lldb-cmake-matrix/lldb-build/bin/clang
======================================================================
FAIL: test_frame_variable_stripped_dsym (TestHiddenIvars.HiddenIvarsTestCase)
----------------------------------------------------------------------
Traceback (most recent call last):
  File "/Users/buildslave/jenkins/workspace/lldb-cmake-matrix/llvm-project/lldb/packages/Python/lldbsuite/test/lldbtest.py", line 1846, in test_method
    return attrvalue(self)
  File "/Users/buildslave/jenkins/workspace/lldb-cmake-matrix/llvm-project/lldb/packages/Python/lldbsuite/test/decorators.py", line 149, in wrapper
    return func(*args, **kwargs)
  File "/Users/buildslave/jenkins/workspace/lldb-cmake-matrix/llvm-project/lldb/test/API/lang/objc/hidden-ivars/TestHiddenIvars.py", line 56, in test_frame_variable_stripped
    self.frame_var(True)
  File "/Users/buildslave/jenkins/workspace/lldb-cmake-matrix/llvm-project/lldb/test/API/lang/objc/hidden-ivars/TestHiddenIvars.py", line 172, in frame_var
    self.common_setup(strip)
  File "/Users/buildslave/jenkins/workspace/lldb-cmake-matrix/llvm-project/lldb/test/API/lang/objc/hidden-ivars/TestHiddenIvars.py", line 105, in common_setup
    self, "main.m", self.line, num_expected_locations=1, loc_exact=True)
  File "/Users/buildslave/jenkins/workspace/lldb-cmake-matrix/llvm-project/lldb/packages/Python/lldbsuite/test/lldbutil.py", line 421, in run_break_set_by_file_and_line
    module_name=module_name)
  File "/Users/buildslave/jenkins/workspace/lldb-cmake-matrix/llvm-project/lldb/packages/Python/lldbsuite/test/lldbutil.py", line 647, in check_breakpoint_result
    out_num_locations))
AssertionError: False is not True : Expecting 1 locations, got 0.
Config=x86_64-/Users/buildslave/jenkins/workspace/lldb-cmake-matrix/lldb-build/bin/clang
----------------------------------------------------------------------
Ran 20 tests in 26.292s

RESULT: FAILED (0 passes, 6 failures, 0 errors, 12 skipped, 2 expected failures, 0 unexpected successes)

--

********************
TIMEOUT: lldb-api :: commands/expression/persistent_ptr_update/TestPersistentPtrUpdate.py (2259 of 2261)
******************** TEST 'lldb-api :: commands/expression/persistent_ptr_update/TestPersistentPtrUpdate.py' FAILED ********************
Script:
--
/usr/local/Frameworks/Python.framework/Versions/3.7/bin/python3.7 /Users/buildslave/jenkins/workspace/lldb-cmake-matrix/llvm-project/lldb/test/API/dotest.py -u CXXFLAGS -u CFLAGS --codesign-identity lldb_codesign --arch x86_64 --build-dir /Users/buildslave/jenkins/workspace/lldb-cmake-matrix/lldb-build/lldb-test-build.noindex -t --env TERM=vt100 --skip-category gmodules --skip-category watchpoint --arch=x86_64 --dwarf-version=5 --env LLVM_LIBS_DIR=/Users/buildslave/jenkins/workspace/lldb-cmake-matrix/lldb-build/./lib --arch x86_64 --build-dir /Users/buildslave/jenkins/workspace/lldb-cmake-matrix/lldb-build/lldb-test-build.noindex --lldb-module-cache-dir /Users/buildslave/jenkins/workspace/lldb-cmake-matrix/lldb-build/lldb-test-build.noindex/module-cache-lldb/lldb-api --clang-module-cache-dir /Users/buildslave/jenkins/workspace/lldb-cmake-matrix/lldb-build/lldb-test-build.noindex/module-cache-clang/lldb-api --executable /Users/buildslave/jenkins/workspace/lldb-cmake-matrix/lldb-build/./bin/lldb --compiler /Users/buildslave/jenkins/workspace/lldb-cmake-matrix/lldb-build/./bin/clang --dsymutil /Users/buildslave/jenkins/workspace/lldb-cmake-matrix/lldb-build/./bin/dsymutil --llvm-tools-dir /Users/buildslave/jenkins/workspace/lldb-cmake-matrix/lldb-build/./bin --lldb-libs-dir /Users/buildslave/jenkins/workspace/lldb-cmake-matrix/lldb-build/./lib /Users/buildslave/jenkins/workspace/lldb-cmake-matrix/llvm-project/lldb/test/API/commands/expression/persistent_ptr_update -p TestPersistentPtrUpdate.py
--
Exit Code: -9
Timeout: Reached timeout of 600 seconds

Command Output (stdout):
--
lldb version 13.0.99 (http://labmaster3.local/git/llvm-project.git revision c88c46080a75467788b4379f49fc664061c2c6d0)
  clang revision c88c46080a75467788b4379f49fc664061c2c6d0
  llvm revision c88c46080a75467788b4379f49fc664061c2c6d0

--

********************
TIMEOUT: lldb-api :: python_api/lldbutil/iter/TestRegistersIterator.py (2260 of 2261)
******************** TEST 'lldb-api :: python_api/lldbutil/iter/TestRegistersIterator.py' FAILED ********************
Script:
--
/usr/local/Frameworks/Python.framework/Versions/3.7/bin/python3.7 /Users/buildslave/jenkins/workspace/lldb-cmake-matrix/llvm-project/lldb/test/API/dotest.py -u CXXFLAGS -u CFLAGS --codesign-identity lldb_codesign --arch x86_64 --build-dir /Users/buildslave/jenkins/workspace/lldb-cmake-matrix/lldb-build/lldb-test-build.noindex -t --env TERM=vt100 --skip-category gmodules --skip-category watchpoint --arch=x86_64 --dwarf-version=5 --env LLVM_LIBS_DIR=/Users/buildslave/jenkins/workspace/lldb-cmake-matrix/lldb-build/./lib --arch x86_64 --build-dir /Users/buildslave/jenkins/workspace/lldb-cmake-matrix/lldb-build/lldb-test-build.noindex --lldb-module-cache-dir /Users/buildslave/jenkins/workspace/lldb-cmake-matrix/lldb-build/lldb-test-build.noindex/module-cache-lldb/lldb-api --clang-module-cache-dir /Users/buildslave/jenkins/workspace/lldb-cmake-matrix/lldb-build/lldb-test-build.noindex/module-cache-clang/lldb-api --executable /Users/buildslave/jenkins/workspace/lldb-cmake-matrix/lldb-build/./bin/lldb --compiler /Users/buildslave/jenkins/workspace/lldb-cmake-matrix/lldb-build/./bin/clang --dsymutil /Users/buildslave/jenkins/workspace/lldb-cmake-matrix/lldb-build/./bin/dsymutil --llvm-tools-dir /Users/buildslave/jenkins/workspace/lldb-cmake-matrix/lldb-build/./bin --lldb-libs-dir /Users/buildslave/jenkins/workspace/lldb-cmake-matrix/lldb-build/./lib /Users/buildslave/jenkins/workspace/lldb-cmake-matrix/llvm-project/lldb/test/API/python_api/lldbutil/iter -p TestRegistersIterator.py
--
Exit Code: -9
Timeout: Reached timeout of 600 seconds

Command Output (stdout):
--
lldb version 13.0.99 (http://labmaster3.local/git/llvm-project.git revision c88c46080a75467788b4379f49fc664061c2c6d0)
  clang revision c88c46080a75467788b4379f49fc664061c2c6d0
  llvm revision c88c46080a75467788b4379f49fc664061c2c6d0

--
Command Output (stderr):
--
error: a.out Failed to extract range list table at offset 0xc: parsing .debug_rnglists table at offset 0x0: unexpected end of data at offset 0x0 while reading [0x0, 0x4)

--

********************
TIMEOUT: lldb-api :: python_api/lldbutil/iter/TestLLDBIterator.py (2261 of 2261)
******************** TEST 'lldb-api :: python_api/lldbutil/iter/TestLLDBIterator.py' FAILED ********************
Script:
--
/usr/local/Frameworks/Python.framework/Versions/3.7/bin/python3.7 /Users/buildslave/jenkins/workspace/lldb-cmake-matrix/llvm-project/lldb/test/API/dotest.py -u CXXFLAGS -u CFLAGS --codesign-identity lldb_codesign --arch x86_64 --build-dir /Users/buildslave/jenkins/workspace/lldb-cmake-matrix/lldb-build/lldb-test-build.noindex -t --env TERM=vt100 --skip-category gmodules --skip-category watchpoint --arch=x86_64 --dwarf-version=5 --env LLVM_LIBS_DIR=/Users/buildslave/jenkins/workspace/lldb-cmake-matrix/lldb-build/./lib --arch x86_64 --build-dir /Users/buildslave/jenkins/workspace/lldb-cmake-matrix/lldb-build/lldb-test-build.noindex --lldb-module-cache-dir /Users/buildslave/jenkins/workspace/lldb-cmake-matrix/lldb-build/lldb-test-build.noindex/module-cache-lldb/lldb-api --clang-module-cache-dir /Users/buildslave/jenkins/workspace/lldb-cmake-matrix/lldb-build/lldb-test-build.noindex/module-cache-clang/lldb-api --executable /Users/buildslave/jenkins/workspace/lldb-cmake-matrix/lldb-build/./bin/lldb --compiler /Users/buildslave/jenkins/workspace/lldb-cmake-matrix/lldb-build/./bin/clang --dsymutil /Users/buildslave/jenkins/workspace/lldb-cmake-matrix/lldb-build/./bin/dsymutil --llvm-tools-dir /Users/buildslave/jenkins/workspace/lldb-cmake-matrix/lldb-build/./bin --lldb-libs-dir /Users/buildslave/jenkins/workspace/lldb-cmake-matrix/lldb-build/./lib /Users/buildslave/jenkins/workspace/lldb-cmake-matrix/llvm-project/lldb/test/API/python_api/lldbutil/iter -p TestLLDBIterator.py
--
Exit Code: -9
Timeout: Reached timeout of 600 seconds

Command Output (stdout):
--
lldb version 13.0.99 (http://labmaster3.local/git/llvm-project.git revision c88c46080a75467788b4379f49fc664061c2c6d0)
  clang revision c88c46080a75467788b4379f49fc664061c2c6d0
  llvm revision c88c46080a75467788b4379f49fc664061c2c6d0

--
Command Output (stderr):
--
error: a.out Failed to extract range list table at offset 0xc: parsing .debug_rnglists table at offset 0x0: unexpected end of data at offset 0x0 while reading [0x0, 0x4)
error: main.o Failed to extract range list table at offset 0xc: parsing .debug_rnglists table at offset 0x0: unexpected end of data at offset 0x0 while reading [0x0, 0x4)
error: a.out Failed to extract range list table at offset 0xc: parsing .debug_rnglists table at offset 0x0: unexpected end of data at offset 0x0 while reading [0x0, 0x4)

--

********************
Slowest Tests:
--------------------------------------------------------------------------
599.99s: lldb-api :: python_api/lldbutil/iter/TestRegistersIterator.py
599.99s: lldb-api :: python_api/lldbutil/iter/TestLLDBIterator.py
599.99s: lldb-api :: commands/expression/persistent_ptr_update/TestPersistentPtrUpdate.py
96.32s: lldb-api :: driver/batch_mode/TestBatchMode.py
81.74s: lldb-api :: tools/lldb-server/TestLldbGdbServer.py
67.18s: lldb-api :: lang/objc/foundation/TestFoundationDisassembly.py
67.03s: lldb-api :: macosx/nslog/TestDarwinNSLogOutput.py
66.56s: lldb-api :: api/multithreaded/TestMultithreaded.py
33.15s: lldb-api :: python_api/target/TestTargetAPI.py
32.43s: lldb-api :: commands/process/attach-resume/TestAttachResume.py
32.38s: lldb-api :: commands/expression/multiline-completion/TestMultilineCompletion.py
32.14s: lldb-api :: tools/lldb-server/TestGdbRemoteThreadsInStopReply.py
31.30s: lldb-api :: commands/gui/viewlarge/TestGuiViewLarge.py
31.28s: lldb-api :: commands/gui/breakpoints/TestGuiBreakpoints.py
31.28s: lldb-api :: commands/gui/basic/TestGuiBasic.py
31.22s: lldb-api :: commands/gui/basicdebug/TestGuiBasicDebug.py
30.83s: lldb-api :: lang/objc/foundation/TestObjCMethods.py
30.33s: lldb-api :: functionalities/completion/TestCompletion.py
26.73s: lldb-api :: lang/objc/hidden-ivars/TestHiddenIvars.py
25.20s: lldb-api :: lang/objc/real-definition/TestRealDefinition.py

Tests Times:
--------------------------------------------------------------------------
[   Range   ] :: [               Percentage               ] :: [  Count  ]
--------------------------------------------------------------------------
[550s,600s) :: [                                        ] :: [   3/2261]
[500s,550s) :: [                                        ] :: [   0/2261]
[450s,500s) :: [                                        ] :: [   0/2261]
[400s,450s) :: [                                        ] :: [   0/2261]
[350s,400s) :: [                                        ] :: [   0/2261]
[300s,350s) :: [                                        ] :: [   0/2261]
[250s,300s) :: [                                        ] :: [   0/2261]
[200s,250s) :: [                                        ] :: [   0/2261]
[150s,200s) :: [                                        ] :: [   0/2261]
[100s,150s) :: [                                        ] :: [   0/2261]
[ 50s,100s) :: [                                        ] :: [   5/2261]
[  0s, 50s) :: [*************************************** ] :: [2253/2261]
--------------------------------------------------------------------------
********************
Timed Out Tests (3):
  lldb-api :: commands/expression/persistent_ptr_update/TestPersistentPtrUpdate.py
  lldb-api :: python_api/lldbutil/iter/TestRegistersIterator.py
  lldb-api :: python_api/lldbutil/iter/TestLLDBIterator.py

********************
Failed Tests (572):
  lldb-api :: lang/objc/modules-inline-functions/TestModulesInlineFunctions.py
  lldb-api :: functionalities/thread/concurrent_events/TestConcurrentBreakpointOneDelayBreakpointThreads.py
  lldb-api :: lang/cpp/operators/TestCppOperators.py
  lldb-api :: lang/cpp/bitfields/TestCppBitfields.py
  lldb-api :: macosx/add-dsym/TestAddDsymMidExecutionCommand.py
  lldb-api :: functionalities/thread/num_threads/TestNumThreads.py
  lldb-api :: lang/c/unions/TestUnionMembers.py
  lldb-api :: commands/expression/import-std-module/shared_ptr/TestSharedPtrFromStdModule.py
  lldb-api :: lang/cpp/exceptions/TestCPPExceptionBreakpoints.py
  lldb-api :: functionalities/data-formatter/data-formatter-globals/TestDataFormatterGlobals.py
  lldb-api :: functionalities/tail_call_frames/ambiguous_tail_call_seq2/TestAmbiguousTailCallSeq2.py
  lldb-api :: commands/expression/pr35310/TestExprsBug35310.py
  lldb-api :: lang/cpp/namespace/TestNamespace.py
  lldb-api :: functionalities/data-formatter/data-formatter-categories/TestDataFormatterCategories.py
  lldb-api :: lang/objc/rdar-10967107/TestRdar10967107.py
  lldb-api :: functionalities/memory/cache/TestMemoryCache.py
  lldb-api :: commands/expression/import-std-module/queue/TestQueueFromStdModule.py
  lldb-api :: python_api/frame/get-variables/TestGetVariables.py
  lldb-api :: functionalities/data-formatter/data-formatter-caching/TestDataFormatterCaching.py
  lldb-api :: commands/expression/function_template_specialization_temp_args/TestFunctionTemplateSpecializationTempArgs.py
  lldb-api :: lang/objc/foundation/TestObjCMethodsNSError.py
  lldb-api :: functionalities/tail_call_frames/cross_object/TestCrossObjectTailCalls.py
  lldb-api :: functionalities/data-formatter/data-formatter-stl/libcxx/iterator/TestDataFormatterLibccIterator.py
  lldb-api :: lang/objc/global_ptrs/TestGlobalObjects.py
  lldb-api :: functionalities/inferior-crashing/TestInferiorCrashingStep.py
  lldb-api :: tools/lldb-vscode/attach/TestVSCode_attach.py
  lldb-api :: commands/gui/breakpoints/TestGuiBreakpoints.py
  lldb-api :: types/TestShortTypeExpr.py
  lldb-api :: functionalities/data-formatter/synthcapping/TestSyntheticCapping.py
  lldb-api :: python_api/value/empty_class/TestValueAPIEmptyClass.py
  lldb-api :: functionalities/tail_call_frames/disambiguate_call_site/TestDisambiguateCallSite.py
  lldb-api :: commands/expression/import-std-module/forward_decl_from_module/TestForwardDeclFromStdModule.py
  lldb-api :: commands/frame/select/TestFrameSelect.py
  lldb-api :: commands/disassemble/basic/TestDisassembleBreakpoint.py
  lldb-api :: commands/expression/radar_8638051/Test8638051.py
  lldb-api :: functionalities/breakpoint/address_breakpoints/TestAddressBreakpoints.py
  lldb-api :: commands/expression/import-std-module/no-std-module/TestMissingStdModule.py
  lldb-api :: lang/objcxx/objc-builtin-types/TestObjCBuiltinTypes.py
  lldb-api :: commands/expression/no-deadlock/TestExprDoesntBlock.py
  lldb-api :: sample_test/TestSampleTest.py
  lldb-api :: functionalities/plugins/python_os_plugin/TestPythonOSPlugin.py
  lldb-api :: commands/expression/radar_9531204/TestPrintfAfterUp.py
  lldb-api :: lang/c/stepping/TestStepAndBreakpoints.py
  lldb-api :: lang/cpp/symbols/TestSymbols.py
  lldb-api :: lang/cpp/non-type-template-param/TestCppNonTypeTemplateParam.py
  lldb-api :: lang/objc/objc-baseclass-sbtype/TestObjCBaseClassSBType.py
  lldb-api :: lang/c/anonymous/TestAnonymous.py
  lldb-api :: functionalities/data-formatter/data-formatter-objc/TestDataFormatterObjNSException.py
  lldb-api :: lang/c/cpp_keyword_identifiers/TestCppKeywordsAsCIdentifiers.py
  lldb-api :: commands/expression/import-std-module/list-dbg-info-content/TestDbgInfoContentListFromStdModule.py
  lldb-api :: functionalities/plugins/python_os_plugin/stepping_plugin_threads/TestOSPluginStepping.py
  lldb-api :: functionalities/data-formatter/data-formatter-objc/cmtime/TestDataFormatterCMTime.py
  lldb-api :: functionalities/data-formatter/data-formatter-synthval/TestDataFormatterSynthVal.py
  lldb-api :: lang/cpp/limit-debug-info/TestWithLimitDebugInfo.py
  lldb-api :: lang/objc/modules/TestObjCModules.py
  lldb-api :: tools/lldb-vscode/breakpoint-events/TestVSCode_breakpointEvents.py
  lldb-api :: lang/cpp/scope/TestCppScope.py
  lldb-api :: lang/c/tls_globals/TestTlsGlobals.py
  lldb-api :: functionalities/data-formatter/dump_dynamic/TestDumpDynamic.py
  lldb-api :: commands/expression/result_numbering/TestResultNumbering.py
  lldb-api :: lang/objc/conflicting-definition/TestConflictingDefinition.py
  lldb-api :: api/check_public_api_headers/TestPublicAPIHeaders.py
  lldb-api :: functionalities/data-formatter/data-formatter-stl/libcxx/queue/TestDataFormatterLibcxxQueue.py
  lldb-api :: commands/expression/import-std-module/sysroot/TestStdModuleSysroot.py
  lldb-api :: lang/cpp/global_variables/TestCPPGlobalVariables.py
  lldb-api :: functionalities/data-formatter/data-formatter-stl/libstdcpp/unique_ptr/invalid/TestDataFormatterInvalidStdUniquePtr.py
  lldb-api :: functionalities/breakpoint/breakpoint_by_file_colon_line/TestBreakpointByFileColonLine.py
  lldb-api :: macosx/find-dsym/deep-bundle/TestDeepBundle.py
  lldb-api :: lang/c/offsetof/TestOffsetof.py
  lldb-api :: functionalities/data-formatter/data-formatter-stl/libcxx/multiset/TestDataFormatterLibcxxMultiSet.py
  lldb-api :: lang/cpp/char8_t/TestCxxChar8_t.py
  lldb-api :: functionalities/breakpoint/breakpoint_set_restart/TestBreakpointSetRestart.py
  lldb-api :: functionalities/value_md5_crash/TestValueMD5Crash.py
  lldb-api :: lang/cpp/extern_c/TestExternCSymbols.py
  lldb-api :: functionalities/non-overlapping-index-variable-i/TestIndexVariable.py
  lldb-api :: lang/cpp/rvalue-references/TestRvalueReferences.py
  lldb-api :: lang/cpp/thread_local/TestThreadLocal.py
  lldb-api :: lang/objcxx/cxx-bridged-po/TestObjCXXBridgedPO.py
  lldb-api :: lang/cpp/alignas_base_class/TestAlignAsBaseClass.py
  lldb-api :: lang/cpp/this_class_type_mixing/TestThisClassTypeMixing.py
  lldb-api :: functionalities/step-avoids-no-debug/TestStepNoDebug.py
  lldb-api :: commands/frame/diagnose/complicated-expression/TestComplicatedExpression.py
  lldb-api :: functionalities/float-display/TestFloatDisplay.py
  lldb-api :: functionalities/inferior-assert/TestInferiorAssert.py
  lldb-api :: commands/expression/persist_objc_pointeetype/TestPersistObjCPointeeType.py
  lldb-api :: functionalities/breakpoint/breakpoint_locations/TestBreakpointLocations.py
  lldb-api :: functionalities/breakpoint/breakpoint_options/TestBreakpointOptions.py
  lldb-api :: types/TestFloatTypes.py
  lldb-api :: commands/expression/import-std-module/deque-dbg-info-content/TestDbgInfoContentDequeFromStdModule.py
  lldb-api :: types/TestLongTypesExpr.py
  lldb-api :: functionalities/data-formatter/data-formatter-stl/libcxx/deque/TestDataFormatterLibcxxDeque.py
  lldb-api :: commands/target/stop-hooks/TestStopHookScripted.py
  lldb-api :: functionalities/thread_plan/TestThreadPlanCommands.py
  lldb-api :: lang/objc/objc-class-method/TestObjCClassMethod.py
  lldb-api :: lang/objc/objc-ivar-stripped/TestObjCIvarStripped.py
  lldb-api :: commands/expression/import-std-module/empty-module/TestEmptyStdModule.py
  lldb-api :: functionalities/ptr_refs/TestPtrRefs.py
  lldb-api :: functionalities/unwind/zeroth_frame/TestZerothFrame.py
  lldb-api :: lang/c/const_variables/TestConstVariables.py
  lldb-api :: functionalities/data-formatter/data-formatter-python-synth/TestDataFormatterPythonSynth.py
  lldb-api :: functionalities/data-formatter/data-formatter-stl/libcxx/list/loop/TestDataFormatterLibcxxListLoop.py
  lldb-api :: functionalities/thread/concurrent_events/TestConcurrentCrashWithSignal.py
  lldb-api :: lang/mixed/TestMixedLanguages.py
  lldb-api :: lang/cpp/break-on-initializers/TestBreakOnCPP11Initializers.py
  lldb-api :: commands/expression/completion-crash-incomplete-record/TestCompletionCrashIncompleteRecord.py
  lldb-api :: lang/objc/real-definition/TestRealDefinition.py
  lldb-api :: functionalities/thread/crash_during_step/TestCrashDuringStep.py
  lldb-api :: commands/expression/import-std-module/vector-dbg-info-content/TestDbgInfoContentVectorFromStdModule.py
  lldb-api :: functionalities/type_completion/TestTypeCompletion.py
  lldb-api :: lang/objc/objc-new-syntax/TestObjCNewSyntaxLiteral.py
  lldb-api :: lang/objcxx/class-name-clash/TestNameClash.py
  lldb-api :: functionalities/data-formatter/builtin-formats/TestBuiltinFormats.py
  lldb-api :: functionalities/thread/backtrace_limit/TestBacktraceLimit.py
  lldb-api :: commands/expression/import-std-module/vector/TestVectorFromStdModule.py
  lldb-api :: commands/frame/language/TestGuessLanguage.py
  lldb-api :: functionalities/data-formatter/data-formatter-stl/libcxx/string/TestDataFormatterLibcxxString.py
  lldb-api :: lang/cpp/this/TestCPPThis.py
  lldb-api :: lang/cpp/struct_with_keyword_name/TestStructWithKeywordName.py
  lldb-api :: functionalities/data-formatter/data-formatter-advanced/TestDataFormatterAdv.py
  lldb-api :: functionalities/thread/concurrent_events/TestConcurrentCrashWithBreak.py
  lldb-api :: lang/cpp/diamond/TestDiamond.py
  lldb-api :: lang/objc/rdar-11355592/TestRdar11355592.py
  lldb-api :: macosx/find-dsym/bundle-with-dot-in-filename/TestBundleWithDotInFilename.py
  lldb-api :: commands/gui/viewlarge/TestGuiViewLarge.py
  lldb-api :: lang/cpp/namespace/TestNamespaceLookup.py
  lldb-api :: functionalities/unwind/noreturn/TestNoreturnUnwind.py
  lldb-api :: commands/process/launch-with-shellexpand/TestLaunchWithShellExpand.py
  lldb-api :: commands/expression/import-std-module/list/TestListFromStdModule.py
  lldb-api :: python_api/frame/inlines/TestInlinedFrame.py
  lldb-api :: functionalities/breakpoint/address_breakpoints/TestBadAddressBreakpoints.py
  lldb-api :: commands/frame/diagnose/array/TestArray.py
  lldb-api :: lang/cpp/class-template-type-parameter-pack/TestClassTemplateTypeParameterPack.py
  lldb-api :: functionalities/tail_call_frames/disambiguate_paths_to_common_sink/TestDisambiguatePathsToCommonSink.py
  lldb-api :: functionalities/data-formatter/data-formatter-proper-plurals/TestFormattersOneIsSingular.py
  lldb-api :: lang/cpp/nested-class-other-compilation-unit/TestNestedClassWithParentInAnotherCU.py
  lldb-api :: commands/expression/two-files/TestObjCTypeQueryFromOtherCompileUnit.py
  lldb-api :: functionalities/data-formatter/data-formatter-objc/TestDataFormatterObjCCF.py
  lldb-api :: commands/expression/deleting-implicit-copy-constructor/TestDeletingImplicitCopyConstructor.py
  lldb-api :: functionalities/thread/step_until/TestStepUntil.py
  lldb-api :: functionalities/data-formatter/refpointer-recursion/TestDataFormatterRefPtrRecursion.py
  lldb-api :: python_api/target/TestTargetAPI.py
  lldb-api :: commands/disassemble/basic/TestFrameDisassemble.py
  lldb-api :: lang/cpp/class-template-non-type-parameter-pack/TestClassTemplateNonTypeParameterPack.py
  lldb-api :: functionalities/breakpoint/dummy_target_breakpoints/TestBreakpointsWithNoTargets.py
  lldb-api :: lang/c/complex_int/TestComplexInt.py
  lldb-api :: functionalities/thread/concurrent_events/TestConcurrentTwoBreakpointThreads.py
  lldb-api :: python_api/get-value-32bit-int/TestGetValue32BitInt.py
  lldb-api :: lang/c/forward/TestForwardDeclaration.py
  lldb-api :: commands/expression/call-function/TestCallStdStringFunction.py
  lldb-api :: tools/lldb-vscode/variables/TestVSCode_variables.py
  lldb-api :: lang/cpp/multiple-inheritance/TestCppMultipleInheritance.py
  lldb-api :: lang/cpp/trivial_abi/TestTrivialABI.py
  lldb-api :: lang/cpp/auto/TestCPPAuto.py
  lldb-api :: commands/expression/radar_9673664/TestExprHelpExamples.py
  lldb-api :: lang/cpp/function-qualifiers/TestCppFunctionQualifiers.py
  lldb-api :: lang/cpp/nsimport/TestCppNsImport.py
  lldb-api :: functionalities/data-formatter/poarray/TestPrintObjectArray.py
  lldb-api :: functionalities/breakpoint/breakpoint_command/TestBreakpointCommand.py
  lldb-api :: functionalities/thread/concurrent_events/TestConcurrentTwoBreakpointsOneSignal.py
  lldb-api :: commands/expression/import-std-module/pair/TestPairFromStdModule.py
  lldb-api :: commands/expression/regression-access-function-template-in-record/TestRegressionAccessFunctionTemplateInRecord.py
  lldb-api :: functionalities/thread/ignore_suspended/TestIgnoreSuspendedThread.py
  lldb-api :: functionalities/thread/concurrent_events/TestConcurrentSignalBreak.py
  lldb-api :: lang/objc/objc++/TestObjCXX.py
  lldb-api :: commands/command/script/TestCommandScript.py
  lldb-api :: lang/c/stepping/TestThreadStepping.py
  lldb-api :: tools/lldb-vscode/module/TestVSCode_module.py
  lldb-api :: tools/lldb-vscode/breakpoint/TestVSCode_setBreakpoints.py
  lldb-api :: lang/c/unicode/TestUnicodeSymbols.py
  lldb-api :: commands/expression/import-std-module/stack/TestStackFromStdModule.py
  lldb-api :: functionalities/archives/TestBSDArchives.py
  lldb-api :: commands/expression/import-std-module/non-module-type-separation/TestNonModuleTypeSeparation.py
  lldb-api :: functionalities/data-formatter/data-formatter-enum-format/TestDataFormatterEnumFormat.py
  lldb-api :: functionalities/thread/step_out/TestThreadStepOut.py
  lldb-api :: functionalities/data-formatter/data-formatter-ptr-to-array/TestPtrToArrayFormatting.py
  lldb-api :: functionalities/target_var/TestTargetVar.py
  lldb-api :: lang/cpp/virtual-overload/TestVirtualOverload.py
  lldb-api :: commands/expression/save_jit_objects/TestSaveJITObjects.py
  lldb-api :: lang/cpp/lambdas/TestLambdas.py
  lldb-api :: lang/objc/objc-struct-argument/TestObjCStructArgument.py
  lldb-api :: lang/cpp/accelerator-table/TestCPPAccelerator.py
  lldb-api :: lang/cpp/modules-import/TestCXXModulesImport.py
  lldb-api :: functionalities/var_path/TestVarPath.py
  lldb-api :: functionalities/breakpoint/move_nearest/TestMoveNearest.py
  lldb-api :: lang/objc/objc-ivar-protocols/TestIvarProtocols.py
  lldb-api :: lang/objc/print-obj/TestPrintObj.py
  lldb-api :: lang/objc/orderedset/TestOrderedSet.py
  lldb-api :: lang/c/struct_types/TestStructTypes.py
  lldb-api :: lang/c/inlines/TestRedefinitionsInInlines.py
  lldb-api :: lang/objc/unicode-string/TestUnicodeString.py
  lldb-api :: functionalities/data-formatter/data-formatter-synth/TestDataFormatterSynth.py
  lldb-api :: commands/expression/fixits/TestFixIts.py
  lldb-api :: commands/source/info/TestSourceInfo.py
  lldb-api :: lang/objc/objc-checker/TestObjCCheckers.py
  lldb-api :: functionalities/thread/exit_during_break/TestExitDuringBreak.py
  lldb-api :: functionalities/thread/backtrace_all/TestBacktraceAll.py
  lldb-api :: python_api/sbtype_typeclass/TestSBTypeTypeClass.py
  lldb-api :: functionalities/data-formatter/data-formatter-smart-array/TestDataFormatterSmartArray.py
  lldb-api :: functionalities/tail_call_frames/disambiguate_tail_call_seq/TestDisambiguateTailCallSeq.py
  lldb-api :: python_api/value/linked_list/TestValueAPILinkedList.py
  lldb-api :: lang/objc/objc-new-syntax/TestObjCNewSyntaxDictionary.py
  lldb-api :: functionalities/set-data/TestSetData.py
  lldb-api :: python_api/frame/TestFrames.py
  lldb-api :: source-manager/TestSourceManager.py
  lldb-api :: commands/expression/vector_of_enums/TestVectorOfEnums.py
  lldb-api :: python_api/process/io/TestProcessIO.py
  lldb-api :: lang/objc/foundation/TestConstStrings.py
  lldb-api :: lang/c/shared_lib_stripped_symbols/TestSharedLibStrippedSymbols.py
  lldb-api :: types/TestDoubleTypesExpr.py
  lldb-api :: lang/cpp/class-template-parameter-pack/TestClassTemplateParameterPack.py
  lldb-api :: commands/process/launch/TestProcessLaunch.py
  lldb-api :: python_api/type/TestTypeList.py
  lldb-api :: python_api/value/TestValueAPI.py
  lldb-api :: commands/expression/anonymous-struct/TestCallUserAnonTypedef.py
  lldb-api :: functionalities/exec/TestExec.py
  lldb-api :: functionalities/data-formatter/boolreference/TestFormattersBoolRefPtr.py
  lldb-api :: lang/objc/self/TestObjCSelf.py
  lldb-api :: macosx/indirect_symbol/TestIndirectSymbols.py
  lldb-api :: commands/expression/char/TestExprsChar.py
  lldb-api :: commands/expression/import-std-module/unique_ptr/TestUniquePtrFromStdModule.py
  lldb-api :: functionalities/param_entry_vals/basic_entry_values/TestBasicEntryValues.py
  lldb-api :: macosx/DBGSourcePathRemapping/TestDSYMSourcePathRemapping.py
  lldb-api :: functionalities/breakpoint/breakpoint_language/TestBreakpointLanguage.py
  lldb-api :: commands/gui/basic/TestGuiBasic.py
  lldb-api :: functionalities/thread/concurrent_events/TestConcurrentBreakpointDelayBreakpointOneSignal.py
  lldb-api :: lang/c/local_variables/TestLocalVariables.py
  lldb-api :: commands/frame/diagnose/dereference-argument/TestDiagnoseDereferenceArgument.py
  lldb-api :: commands/expression/entry-bp/TestExprEntryBP.py
  lldb-api :: functionalities/data-formatter/compactvectors/TestCompactVectors.py
  lldb-api :: functionalities/breakpoint/global_constructor/TestBreakpointInGlobalConstructor.py
  lldb-api :: functionalities/tail_call_frames/sbapi_support/TestTailCallFrameSBAPI.py
  lldb-api :: lang/objcxx/hide-runtime-values/TestObjCXXHideRuntimeValues.py
  lldb-api :: types/TestDoubleTypes.py
  lldb-api :: functionalities/data-formatter/array_typedef/TestArrayTypedef.py
  lldb-api :: commands/frame/diagnose/dereference-this/TestDiagnoseDereferenceThis.py
  lldb-api :: lang/cpp/class_static/TestStaticVariables.py
  lldb-api :: functionalities/inferior-crashing/TestInferiorCrashing.py
  lldb-api :: commands/expression/unicode-in-variable/TestUnicodeInVariable.py
  lldb-api :: lang/objc/objc-dyn-sbtype/TestObjCDynamicSBType.py
  lldb-api :: functionalities/data-formatter/format-propagation/TestFormatPropagation.py
  lldb-api :: lang/objc/objc-new-syntax/TestObjCNewSyntaxArray.py
  lldb-api :: lang/objc/modules-non-objc-target/TestObjCModulesNonObjCTarget.py
  lldb-api :: commands/settings/TestSettings.py
  lldb-api :: functionalities/breakpoint/inlined_breakpoints/TestInlinedBreakpoints.py
  lldb-api :: lang/c/register_variables/TestRegisterVariables.py
  lldb-api :: functionalities/thread/state_after_expression/TestStateAfterExpression.py
  lldb-api :: commands/expression/inline-namespace/TestInlineNamespace.py
  lldb-api :: functionalities/data-formatter/summary-string-onfail/Test-rdar-9974002.py
  lldb-api :: lang/cpp/inlines/TestInlines.py
  lldb-api :: lang/objc/variadic_methods/TestVariadicMethods.py
  lldb-api :: lang/cpp/static_methods/TestCPPStaticMethods.py
  lldb-api :: python_api/formatters/TestFormattersSBAPI.py
  lldb-api :: functionalities/data-formatter/data-formatter-stl/libcxx/vbool/TestDataFormatterLibcxxVBool.py
  lldb-api :: functionalities/data-formatter/nssetsynth/TestNSSetSynthetic.py
  lldb-api :: lang/objc/direct-dispatch-step/TestObjCDirectDispatchStepping.py
  lldb-api :: lang/cpp/unsigned_types/TestUnsignedTypes.py
  lldb-api :: python_api/lldbutil/process/TestPrintStackTraces.py
  lldb-api :: commands/expression/import-std-module/retry-with-std-module/TestRetryWithStdModule.py
  lldb-api :: functionalities/data-formatter/data-formatter-stl/libcxx/list/TestDataFormatterLibcxxList.py
  lldb-api :: functionalities/tail_call_frames/ambiguous_tail_call_seq1/TestAmbiguousTailCallSeq1.py
  lldb-api :: commands/expression/ir-interpreter-phi-nodes/TestIRInterpreterPHINodes.py
  lldb-api :: macosx/nslog/TestDarwinNSLogOutput.py
  lldb-api :: functionalities/data-formatter/nsarraysynth/TestNSArraySynthetic.py
  lldb-api :: python_api/process/TestProcessAPI.py
  lldb-api :: lang/objc/foundation/TestObjCMethodsNSArray.py
  lldb-api :: lang/objc/modules-auto-import/TestModulesAutoImport.py
  lldb-api :: functionalities/thread/exit_during_step/TestExitDuringStep.py
  lldb-api :: commands/expression/top-level/TestTopLevelExprs.py
  lldb-api :: commands/command/nested_alias/TestNestedAlias.py
  lldb-api :: lang/objc/objc-struct-return/TestObjCStructReturn.py
  lldb-api :: lang/cpp/llvm-style/TestLLVMStyle.py
  lldb-api :: commands/expression/rdar44436068/Test128BitsInteger.py
  lldb-api :: functionalities/data-formatter/hexcaps/TestDataFormatterHexCaps.py
  lldb-api :: commands/expression/unwind_expression/TestUnwindExpression.py
  lldb-api :: functionalities/inferior-crashing/recursive-inferior/TestRecursiveInferior.py
  lldb-api :: functionalities/data-formatter/user-format-vs-summary/TestUserFormatVsSummary.py
  lldb-api :: commands/expression/po_verbosity/TestPoVerbosity.py
  lldb-api :: functionalities/avoids-fd-leak/TestFdLeak.py
  lldb-api :: functionalities/breakpoint/step_over_breakpoint/TestStepOverBreakpoint.py
  lldb-api :: functionalities/data-formatter/data-formatter-stl/libcxx/set/TestDataFormatterLibcxxSet.py
  lldb-api :: lang/cpp/breakpoint-commands/TestCPPBreakpointCommands.py
  lldb-api :: types/TestRecursiveTypes.py
  lldb-api :: functionalities/breakpoint/breakpoint_ignore_count/TestBreakpointIgnoreCount.py
  lldb-api :: python_api/sbvalue_const_addrof/TestSBValueConstAddrOf.py
  lldb-api :: functionalities/data-formatter/cstring-utf8-summary/TestCstringUnicode.py
  lldb-api :: lang/cpp/chained-calls/TestCppChainedCalls.py
  lldb-api :: commands/expression/import-std-module/weak_ptr/TestWeakPtrFromStdModule.py
  lldb-api :: commands/apropos/with-process/TestAproposWithProcess.py
  lldb-api :: lang/objc/objc-stepping/TestObjCStepping.py
  lldb-api :: lang/objc/objc-property/TestObjCProperty.py
  lldb-api :: commands/expression/diagnostics/TestExprDiagnostics.py
  lldb-api :: commands/frame/var-scope/TestFrameVariableScope.py
  lldb-api :: lang/objc/ivar-IMP/TestObjCiVarIMP.py
  lldb-api :: functionalities/conditional_break/TestConditionalBreak.py
  lldb-api :: lang/c/function_types/TestFunctionTypes.py
  lldb-api :: lang/objc/foundation/TestObjCMethodsString.py
  lldb-api :: functionalities/dynamic_value_child_count/TestDynamicValueChildCount.py
  lldb-api :: commands/expression/ir-interpreter/TestIRInterpreter.py
  lldb-api :: functionalities/data-formatter/stringprinter/TestStringPrinter.py
  lldb-api :: commands/expression/import-std-module/unique_ptr-dbg-info-content/TestUniquePtrDbgInfoContent.py
  lldb-api :: types/TestIntegerTypeExpr.py
  lldb-api :: functionalities/thread/concurrent_events/TestConcurrentTwoBreakpointsOneDelaySignal.py
  lldb-api :: functionalities/inferior-changed/TestInferiorChanged.py
  lldb-api :: commands/frame/diagnose/inheritance/TestDiagnoseInheritance.py
  lldb-api :: functionalities/data-formatter/type_summary_list_script/TestTypeSummaryListScript.py
  lldb-api :: commands/expression/dollar-in-variable/TestDollarInVariable.py
  lldb-api :: lang/objc/objc-optimized/TestObjcOptimized.py
  lldb-api :: lang/objc/modules-compile-error/TestModulesCompileError.py
  lldb-api :: commands/expression/import-std-module/basic/TestImportStdModule.py
  lldb-api :: functionalities/signal/handle-abrt/TestHandleAbort.py
  lldb-api :: functionalities/limit-debug-info/TestLimitDebugInfo.py
  lldb-api :: functionalities/breakpoint/comp_dir_symlink/TestCompDirSymLink.py
  lldb-api :: macosx/queues/TestQueues.py
  lldb-api :: functionalities/breakpoint/source_regexp/TestSourceRegexBreakpoints.py
  lldb-api :: functionalities/thread/jump/TestThreadJump.py
  lldb-api :: functionalities/memory/find/TestMemoryFind.py
  lldb-api :: functionalities/thread/concurrent_events/TestConcurrentDelaySignalBreak.py
  lldb-api :: functionalities/tail_call_frames/cross_dso/TestCrossDSOTailCalls.py
  lldb-api :: functionalities/memory/read/TestMemoryRead.py
  lldb-api :: functionalities/type_get_module/TestTypeGetModule.py
  lldb-api :: functionalities/tail_call_frames/unambiguous_sequence/TestUnambiguousTailCalls.py
  lldb-api :: lang/c/stepping/TestThreadStepInAvoidRegexp.py
  lldb-api :: lang/cpp/unique-types/TestUniqueTypes.py
  lldb-api :: functionalities/data-formatter/data-formatter-stl/libcxx/optional/TestDataFormatterLibcxxOptional.py
  lldb-api :: lang/objc/exceptions/TestObjCExceptions.py
  lldb-api :: functionalities/return-value/TestReturnValue.py
  lldb-api :: lang/cpp/signed_types/TestSignedTypes.py
  lldb-api :: python_api/symbol-context/two-files/TestSymbolContextTwoFiles.py
  lldb-api :: commands/expression/scoped_enums/TestScopedEnumType.py
  lldb-api :: functionalities/thread/concurrent_events/TestConcurrentDelayedCrashWithBreakpointSignal.py
  lldb-api :: functionalities/process_group/TestChangeProcessGroup.py
  lldb-api :: functionalities/data-formatter/typedef_array/TestTypedefArray.py
  lldb-api :: functionalities/data-formatter/ptr_ref_typedef/TestPtrRef2Typedef.py
  lldb-api :: lang/objc/foundation/TestObjCMethods.py
  lldb-api :: functionalities/thread/thread_exit/TestThreadExit.py
  lldb-api :: python_api/signals/TestSignalsAPI.py
  lldb-api :: commands/target/basic/TestTargetCommand.py
  lldb-api :: functionalities/data-formatter/data-formatter-stl/libcxx/map/TestDataFormatterLibccMap.py
  lldb-api :: functionalities/thread/concurrent_events/TestConcurrentSignalDelayBreak.py
  lldb-api :: macosx/simulator/TestSimulatorPlatform.py
  lldb-api :: lang/objc/objc-static-method/TestObjCStaticMethod.py
  lldb-api :: tools/lldb-vscode/step/TestVSCode_step.py
  lldb-api :: functionalities/data-formatter/parray/TestPrintArray.py
  lldb-api :: functionalities/data-formatter/data-formatter-stl/libcxx/vector/TestDataFormatterLibcxxVector.py
  lldb-api :: functionalities/inline-stepping/TestInlineStepping.py
  lldb-api :: functionalities/breakpoint/breakpoint_command/TestRegexpBreakCommand.py
  lldb-api :: python_api/interpreter/TestCommandInterpreterAPI.py
  lldb-api :: commands/expression/import-std-module/forward_list-dbg-info-content/TestDbgInfoContentForwardListFromStdModule.py
  lldb-api :: functionalities/data-formatter/data-formatter-objc/TestDataFormatterObjCKVO.py
  lldb-api :: commands/expression/persistent_variables/TestPersistentVariables.py
  lldb-api :: lang/cpp/covariant-return-types/TestCovariantReturnTypes.py
  lldb-api :: python_api/sbdata/TestSBData.py
  lldb-api :: commands/gui/basicdebug/TestGuiBasicDebug.py
  lldb-api :: lang/c/step-target/TestStepTarget.py
  lldb-api :: commands/expression/context-object-objc/TestContextObjectObjc.py
  lldb-api :: functionalities/data-formatter/data-formatter-objc/TestDataFormatterObjCNSBundle.py
  lldb-api :: lang/c/enum_types/TestEnumTypes.py
  lldb-api :: lang/cpp/default-template-args/TestDefaultTemplateArgs.py
  lldb-api :: commands/expression/import-std-module/vector-of-vectors/TestVectorOfVectorsFromStdModule.py
  lldb-api :: lang/objc/objc-static-method-stripped/TestObjCStaticMethodStripped.py
  lldb-api :: commands/expression/dont_allow_jit/TestAllowJIT.py
  lldb-api :: functionalities/data-formatter/varscript_formatting/TestDataFormatterVarScriptFormatting.py
  lldb-api :: functionalities/optimized_code/TestNoASanExceptionAfterEvalOP_piece.py
  lldb-api :: lang/c/bitfields/TestBitfields.py
  lldb-api :: commands/expression/import-std-module/array/TestArrayFromStdModule.py
  lldb-api :: functionalities/thread/thread_specific_break/TestThreadSpecificBreakpoint.py
  lldb-api :: lang/cpp/global_operators/TestCppGlobalOperators.py
  lldb-api :: functionalities/data-formatter/frameformat_smallstruct/TestFrameFormatSmallStruct.py
  lldb-api :: tools/lldb-vscode/launch/TestVSCode_launch.py
  lldb-api :: python_api/value_var_update/TestValueVarUpdate.py
  lldb-api :: functionalities/data-formatter/data-formatter-disabling/TestDataFormatterDisabling.py
  lldb-api :: commands/frame/var/TestFrameVar.py
  lldb-api :: functionalities/unwind/sigtramp/TestSigtrampUnwind.py
  lldb-api :: lang/cpp/dynamic-value-same-basename/TestDynamicValueSameBase.py
  lldb-api :: commands/expression/class_template_specialization_empty_pack/TestClassTemplateSpecializationParametersHandling.py
  lldb-api :: functionalities/data-formatter/data-formatter-stl/libcxx/bitset/TestDataFormatterLibcxxBitset.py
  lldb-api :: functionalities/lazy-loading/TestLazyLoading.py
  lldb-api :: commands/expression/xvalue/TestXValuePrinting.py
  lldb-api :: macosx/save_crashlog/TestSaveCrashlog.py
  lldb-api :: functionalities/completion/TestCompletion.py
  lldb-api :: macosx/profile_vrs_detach/TestDetachVrsProfile.py
  lldb-api :: lang/objc/foundation/TestObjCMethods2.py
  lldb-api :: commands/expression/import-std-module/deque-basic/TestDequeFromStdModule.py
  lldb-api :: lang/c/shared_lib/TestSharedLib.py
  lldb-api :: commands/expression/import-std-module/forward_list/TestForwardListFromStdModule.py
  lldb-api :: lang/cpp/dynamic-value/TestDynamicValue.py
  lldb-api :: commands/process/attach-resume/TestAttachResume.py
  lldb-api :: lang/cpp/gmodules-templates/TestGModules.py
  lldb-api :: lang/objc/forward-decl/TestForwardDecl.py
  lldb-api :: macosx/thread_suspend/TestInternalThreadSuspension.py
  lldb-api :: functionalities/step_scripted/TestStepScripted.py
  lldb-api :: functionalities/thread/exit_during_expression/TestExitDuringExpression.py
  lldb-api :: functionalities/data-formatter/data-formatter-stl/libcxx/unordered/TestDataFormatterUnordered.py
  lldb-api :: driver/batch_mode/TestBatchMode.py
  lldb-api :: python_api/process/read-mem-cstring/TestReadMemCString.py
  lldb-api :: functionalities/data-formatter/data-formatter-objc/TestDataFormatterObjCNSContainer.py
  lldb-api :: types/TestCharTypeExpr.py
  lldb-api :: functionalities/data-formatter/data-formatter-objc/nsindexpath/TestDataFormatterNSIndexPath.py
  lldb-api :: types/TestLongTypes.py
  lldb-api :: commands/expression/import-std-module/missing-module-sources/TestStdModuleSourcesMissing.py
  lldb-api :: lang/cpp/const_this/TestConstThis.py
  lldb-api :: macosx/find-app-in-bundle/TestFindAppInBundle.py
  lldb-api :: commands/expression/completion-in-lambda-and-unnamed-class/TestCompletionInLambdaAndUnnamedClass.py
  lldb-api :: functionalities/data-formatter/data-formatter-stl/libcxx/shared_ptr/TestDataFormatterLibcxxSharedPtr.py
  lldb-api :: functionalities/breakpoint/cpp/TestCPPBreakpointLocations.py
  lldb-api :: lang/cpp/offsetof/TestOffsetofCpp.py
  lldb-api :: functionalities/data-formatter/data-formatter-objc/TestDataFormatterObjCNSURL.py
  lldb-api :: lang/objc/objc-ivar-offsets/TestObjCIvarOffsets.py
  lldb-api :: lang/cpp/template-function/TestTemplateFunctions.py
  lldb-api :: lang/cpp/typedef/TestCppTypedef.py
  lldb-api :: lang/cpp/namespace_conflicts/TestNamespaceConflicts.py
  lldb-api :: functionalities/pointer_num_children/TestPointerNumChildren.py
  lldb-api :: commands/expression/cast_int_to_anonymous_enum/TestCastIntToAnonymousEnum.py
  lldb-api :: lang/objcxx/objcxx-ivar-vector/TestIvarVector.py
  lldb-api :: functionalities/inferior-crashing/recursive-inferior/TestRecursiveInferiorStep.py
  lldb-api :: commands/frame/diagnose/dereference-function-return/TestDiagnoseDereferenceFunctionReturn.py
  lldb-api :: functionalities/data-formatter/data-formatter-objc/nsstring/TestDataFormatterNSString.py
  lldb-api :: functionalities/dlopen_other_executable/TestDlopenOtherExecutable.py
  lldb-api :: commands/expression/completion/TestExprCompletion.py
  lldb-api :: functionalities/data-formatter/data-formatter-objc/TestDataFormatterObjCPlain.py
  lldb-api :: lang/c/strings/TestCStrings.py
  lldb-api :: functionalities/breakpoint/consecutive_breakpoints/TestConsecutiveBreakpoints.py
  lldb-api :: lang/objc/foundation/TestRuntimeTypes.py
  lldb-api :: lang/objc/objc-foundation-dictionary-empty/TestNSDictionary0.py
  lldb-api :: functionalities/load_unload/TestLoadUnload.py
  lldb-api :: commands/expression/argument_passing_restrictions/TestArgumentPassingRestrictions.py
  lldb-api :: lang/c/blocks/TestBlocks.py
  lldb-api :: functionalities/breakpoint/breakpoint_command/TestBreakpointCommandsFromPython.py
  lldb-api :: commands/statistics/basic/TestStats.py
  lldb-api :: lang/cpp/operator-overload/TestOperatorOverload.py
  lldb-api :: lang/cpp/frame-var-anon-unions/TestFrameVariableAnonymousUnions.py
  lldb-api :: lang/cpp/std-function-step-into-callable/TestStdFunctionStepIntoCallable.py
  lldb-api :: functionalities/data-formatter/data-formatter-stl/libcxx/atomic/TestLibCxxAtomic.py
  lldb-api :: lang/cpp/call-function/TestCallCPPFunction.py
  lldb-api :: lang/cpp/bool/TestCPPBool.py
  lldb-api :: linux/builtin_trap/TestBuiltinTrap.py
  lldb-api :: lang/objc/objc_direct-methods/TestObjCDirectMethods.py
  lldb-api :: commands/expression/persistent_types/TestPersistentTypes.py
  lldb-api :: commands/expression/call-function/TestCallStopAndContinue.py
  lldb-api :: functionalities/data-formatter/data-formatter-stl/libcxx/multimap/TestDataFormatterLibccMultiMap.py
  lldb-api :: lang/c/step_over_no_deadlock/TestStepOverDoesntBlock.py
  lldb-api :: commands/expression/codegen-crash-typedefdecl-not-in_declcontext/TestCodegenCrashTypedefDeclNotInDeclContext.py
  lldb-api :: functionalities/type_lookup/TestTypeLookup.py
  lldb-api :: commands/expression/rdar42038760/TestScalarURem.py
  lldb-api :: functionalities/breakpoint/scripted_bkpt/TestScriptedResolver.py
  lldb-api :: commands/expression/weak_symbols/TestWeakSymbols.py
  lldb-api :: functionalities/dead-strip/TestDeadStrip.py
  lldb-api :: lang/objc/blocks/TestObjCIvarsInBlocks.py
  lldb-api :: functionalities/data-formatter/data-formatter-skip-summary/TestDataFormatterSkipSummary.py
  lldb-api :: lang/cpp/template-arguments/TestCppTemplateArguments.py
  lldb-api :: lang/c/global_variables/TestGlobalVariables.py
  lldb-api :: types/TestCharType.py
  lldb-api :: lang/objc/single-entry-dictionary/TestObjCSingleEntryDictionary.py
  lldb-api :: functionalities/thread/create_after_attach/TestCreateAfterAttach.py
  lldb-api :: lang/cpp/type_lookup/TestCppTypeLookup.py
  lldb-api :: commands/target/stop-hooks/TestStopHooks.py
  lldb-api :: commands/expression/import-std-module/vector-bool/TestVectorBoolFromStdModule.py
  lldb-api :: functionalities/data-formatter/data-formatter-cpp/TestDataFormatterCpp.py
  lldb-api :: macosx/builtin-debugtrap/TestBuiltinDebugTrap.py
  lldb-api :: types/TestShortType.py
  lldb-api :: functionalities/data-formatter/data-formatter-objc/TestDataFormatterObjCExpr.py
  lldb-api :: sample_test/TestSampleInlineTest.py
  lldb-api :: functionalities/load_using_paths/TestLoadUsingPaths.py
  lldb-api :: functionalities/data-formatter/setvaluefromcstring/TestSetValueFromCString.py
  lldb-api :: lang/c/complex/TestComplexC99.py
  lldb-api :: commands/frame/diagnose/local-variable/TestLocalVariable.py
  lldb-api :: python_api/lldbutil/frame/TestFrameUtils.py
  lldb-api :: functionalities/data-formatter/data-formatter-stl/libcxx/function/TestLibCxxFunction.py
  lldb-api :: functionalities/memory-region/TestMemoryRegion.py
  lldb-api :: functionalities/breakpoint/breakpoint_conditions/TestBreakpointConditions.py
  lldb-api :: lang/objc/foundation/TestFoundationDisassembly.py
  lldb-api :: lang/objc/modules-cache/TestClangModulesCache.py
  lldb-api :: lang/cpp/incomplete-types/TestCppIncompleteTypes.py
  lldb-api :: python_api/symbol-context/TestSymbolContext.py
  lldb-api :: lang/cpp/enum_types/TestCPP11EnumTypes.py
  lldb-api :: lang/objc/objc-runtime-ivars/TestRuntimeIvars.py
  lldb-api :: functionalities/data-formatter/vector-types/TestVectorTypesFormatting.py
  lldb-api :: commands/process/signal/TestProcessSignal.py
  lldb-api :: commands/expression/context-object/TestContextObject.py
  lldb-api :: python_api/thread/TestThreadAPI.py
  lldb-api :: functionalities/data-formatter/language_category_updates/TestDataFormatterLanguageCategoryUpdates.py
  lldb-api :: functionalities/breakpoint/auto_continue/TestBreakpointAutoContinue.py
  lldb-api :: lang/objc/warnings-in-expr-parser/TestObjCWarningsInExprParser.py
  lldb-api :: commands/frame/diagnose/bad-reference/TestBadReference.py
  lldb-api :: commands/expression/import_base_class_when_class_has_derived_member/TestImportBaseClassWhenClassHasDerivedMember.py
  lldb-api :: python_api/findvalue_duplist/TestSBFrameFindValue.py
  lldb-api :: lang/objc/radar-9691614/TestObjCMethodReturningBOOL.py
  lldb-api :: functionalities/data-formatter/var-in-aggregate-misuse/TestVarInAggregateMisuse.py
  lldb-api :: lang/cpp/constructors/TestCppConstructors.py
  lldb-api :: tools/lldb-vscode/runInTerminal/TestVSCode_runInTerminal.py
  lldb-api :: functionalities/data-formatter/data-formatter-stl/libcxx/initializerlist/TestInitializerList.py
  lldb-api :: lang/cpp/function_refs/TestFunctionRefs.py
  lldb-api :: types/TestFloatTypesExpr.py
  lldb-api :: python_api/objc_type/TestObjCType.py
  lldb-api :: types/TestIntegerType.py
  lldb-api :: lang/objc/bitfield_ivars/TestBitfieldIvars.py
  lldb-api :: functionalities/tail_call_frames/thread_step_out_or_return/TestSteppingOutWithArtificialFrames.py
  lldb-api :: macosx/duplicate-archive-members/TestDuplicateMembers.py
  lldb-api :: commands/expression/multiline-completion/TestMultilineCompletion.py
  lldb-api :: functionalities/data-formatter/data-formatter-stl/libcxx/unique_ptr/TestDataFormatterLibcxxUniquePtr.py
  lldb-api :: python_api/function_symbol/TestDisasmAPI.py
  lldb-api :: lang/objc/objc-super/TestObjCSuper.py
  lldb-api :: functionalities/data-formatter/ostypeformatting/TestFormattersOsType.py
  lldb-api :: commands/expression/formatters/TestFormatters.py
  lldb-api :: functionalities/data-formatter/data-formatter-stl/libcxx/forward_list/TestDataFormatterLibcxxForwardList.py
  lldb-api :: commands/expression/test/TestExprs.py
  lldb-api :: commands/frame/diagnose/virtual-method-call/TestDiagnoseDereferenceVirtualMethodCall.py
  lldb-api :: python_api/exprpath_synthetic/TestExprPathSynthetic.py
  lldb-api :: commands/expression/import-std-module/conflicts/TestStdModuleWithConflicts.py
  lldb-api :: tools/lldb-vscode/console/TestVSCode_console.py
  lldb-api :: functionalities/tail_call_frames/inlining_and_tail_calls/TestInliningAndTailCalls.py
  lldb-api :: python_api/name_lookup/TestNameLookup.py
  lldb-api :: python_api/class_members/TestSBTypeClassMembers.py
  lldb-api :: functionalities/data-formatter/data-formatter-stl/libcxx/tuple/TestDataFormatterLibcxxTuple.py
  lldb-api :: functionalities/thread/concurrent_events/TestConcurrentManyCrash.py
  lldb-api :: lang/c/vla/TestVLA.py
  lldb-api :: lang/cpp/namespace_definitions/TestNamespaceDefinitions.py
  lldb-api :: functionalities/breakpoint/breakpoint_ids/TestBreakpointIDs.py
  lldb-api :: functionalities/data-formatter/pyobjsynthprovider/TestPyObjSynthProvider.py
  lldb-api :: lang/c/array_types/TestArrayTypes.py
  lldb-api :: functionalities/data-formatter/data-formatter-objc/TestDataFormatterObjCNSDate.py
  lldb-api :: lang/cpp/template-specialization-type/TestTemplateSpecializationType.py
  lldb-api :: functionalities/data-formatter/data-formatter-script/TestDataFormatterScript.py
  lldb-api :: functionalities/signal/TestSendSignal.py
  lldb-api :: python_api/hello_world/TestHelloWorld.py
  lldb-api :: commands/expression/call-function/TestCallUserDefinedFunction.py
  lldb-api :: commands/expression/static-initializers/TestStaticInitializers.py
  lldb-api :: lang/cpp/template/TestTemplateArgs.py
  lldb-api :: functionalities/data-formatter/data-formatter-named-summaries/TestDataFormatterNamedSummaries.py
  lldb-api :: commands/expression/issue_11588/Test11588.py
  lldb-api :: commands/expression/options/TestExprOptions.py
  lldb-api :: commands/expression/expr-in-syscall/TestExpressionInSyscall.py
  lldb-api :: tools/lldb-vscode/stackTrace/TestVSCode_stackTrace.py
  lldb-api :: lang/cpp/member-and-local-vars-with-same-name/TestMembersAndLocalsWithSameName.py
  lldb-api :: lang/cpp/virtual-functions/TestCppVirtualFunctions.py
  lldb-api :: functionalities/breakpoint/breakpoint_by_line_and_column/TestBreakpointByLineAndColumn.py
  lldb-api :: lang/cpp/overloaded-functions/TestOverloadedFunctions.py
  lldb-api :: functionalities/process_crash_info/TestProcessCrashInfo.py
  lldb-api :: functionalities/thread/concurrent_events/TestConcurrentManyBreakpoints.py
  lldb-api :: commands/expression/ignore-artificial-constructors/TestIgnoreArtificialConstructors.py
  lldb-api :: functionalities/data-formatter/data-formatter-stl/libcxx/variant/TestDataFormatterLibcxxVariant.py
  lldb-api :: commands/process/attach/TestProcessAttach.py
  lldb-api :: commands/expression/test/TestExprs2.py
  lldb-api :: python_api/value/change_values/TestChangeValueAPI.py
  lldb-api :: lang/c/modules/TestCModules.py
  lldb-api :: python_api/sbvalue_persist/TestSBValuePersist.py
  lldb-api :: functionalities/data-formatter/data-formatter-objc/TestDataFormatterObjCNSData.py
  lldb-api :: lang/c/set_values/TestSetValues.py
  lldb-api :: lang/cpp/dynamic-value/TestCppValueCast.py
  lldb-api :: functionalities/recursion/TestValueObjectRecursion.py
  lldb-api :: lang/cpp/class_types/TestClassTypes.py
  lldb-api :: lang/cpp/class_types/TestClassTypesDisassembly.py
  lldb-api :: commands/thread/select/TestThreadSelect.py
  lldb-api :: lang/objc/ptr_refs/TestPtrRefsObjC.py
  lldb-api :: functionalities/data-formatter/data-formatter-objc/TestDataFormatterObjCNSError.py
  lldb-api :: commands/expression/import-std-module/shared_ptr-dbg-info-content/TestSharedPtrDbgInfoContentFromStdModule.py
  lldb-api :: commands/expression/timeout/TestCallWithTimeout.py
  lldb-api :: functionalities/rerun/TestRerun.py
  lldb-api :: functionalities/data-formatter/nsdictionarysynth/TestNSDictionarySynthetic.py
  lldb-api :: commands/expression/codegen-crash-import-def-arraytype-element/TestImportDefinitionArrayType.py
  lldb-api :: functionalities/data-formatter/synthupdate/TestSyntheticFilterRecompute.py
  lldb-api :: commands/expression/import-std-module/iterator/TestIteratorFromStdModule.py
  lldb-api :: lang/objc/foundation/TestObjectDescriptionAPI.py
  lldb-api :: commands/expression/import-std-module/weak_ptr-dbg-info-content/TestDbgInfoContentWeakPtrFromStdModule.py
  lldb-api :: python_api/function_symbol/TestSymbolAPI.py
  lldb-api :: commands/expression/call-throws/TestCallThatThrows.py
  lldb-api :: lang/objc/cpp_keyword_identifiers/TestCppKeywordsAsObjCIdentifiers.py
  lldb-api :: lang/c/conflicting-symbol/TestConflictingSymbol.py
  lldb-api :: functionalities/data-formatter/data-formatter-synthtype/TestDataFormatterSynthType.py
  lldb-api :: functionalities/tail_call_frames/thread_step_out_message/TestArtificialFrameStepOutMessage.py
  lldb-api :: lang/objc/hidden-ivars/TestHiddenIvars.py
  lldb-api :: macosx/macCatalyst/TestMacCatalyst.py


Testing Time: 678.43s
  Unsupported      :  287
  Passed           : 1390
  Expectedly Failed:    9
  Timed Out        :    3
  Failed           :  572
FAILED: tools/lldb/test/CMakeFiles/check-lldb-lit 
cd /Users/buildslave/jenkins/workspace/lldb-cmake-matrix/lldb-build/tools/lldb/test && /usr/local/Frameworks/Python.framework/Versions/3.7/bin/python3.7 /Users/buildslave/jenkins/workspace/lldb-cmake-matrix/lldb-build/./bin/llvm-lit -v --time-tests --shuffle --xunit-xml-output=/Users/buildslave/jenkins/workspace/lldb-cmake-matrix/test/results.xml -v /Users/buildslave/jenkins/workspace/lldb-cmake-matrix/lldb-build/tools/lldb/test
ninja: build stopped: subcommand failed.
Command failed: Command '['/usr/bin/env', 'TERM=vt100', '/usr/local/bin/ninja', '-v', 'check-lldb']' returned non-zero exit status 1.
Command: ['/usr/bin/env', 'TERM=vt100', '/usr/local/bin/ninja', '-v', 'check-lldb']
+ set -e