SuccessConsole Output

Skipping 20,251 KB.. Full Log
g=x86_64-/Users/buildslave/jenkins/workspace/lldb-cmake-matrix/clang_701_build/bin/clang-7
======================================================================
FAIL: test_unsigned_char_type_dsym (TestIntegerTypesExpr.IntegerTypesExprTestCase)
    Test that 'unsigned_char'-type variable expressions are evaluated correctly.
----------------------------------------------------------------------
Traceback (most recent call last):
  File "/Users/buildslave/jenkins/workspace/lldb-cmake-matrix/llvm-project/lldb/packages/Python/lldbsuite/test/lldbtest.py", line 1748, in test_method
    return attrvalue(self)
  File "/Users/buildslave/jenkins/workspace/lldb-cmake-matrix/llvm-project/lldb/packages/Python/lldbsuite/test/types/TestIntegerTypesExpr.py", line 25, in test_unsigned_char_type
    ['unsigned', 'char']), qd=True)
  File "/Users/buildslave/jenkins/workspace/lldb-cmake-matrix/llvm-project/lldb/packages/Python/lldbsuite/test/types/AbstractBase.py", line 69, in build_and_run_expr
    source, atoms, expr=True, bc=bc, qd=qd)
  File "/Users/buildslave/jenkins/workspace/lldb-cmake-matrix/llvm-project/lldb/packages/Python/lldbsuite/test/types/AbstractBase.py", line 83, in build_and_run_with_source_atoms_expr
    self.exe_name, atoms, blockCaptured=bc, quotedDisplay=qd)
  File "/Users/buildslave/jenkins/workspace/lldb-cmake-matrix/llvm-project/lldb/packages/Python/lldbsuite/test/types/AbstractBase.py", line 262, in generic_type_expr_tester
    loc_exact=True)
  File "/Users/buildslave/jenkins/workspace/lldb-cmake-matrix/llvm-project/lldb/packages/Python/lldbsuite/test/lldbutil.py", line 383, in run_break_set_by_file_and_line
    module_name=module_name)
  File "/Users/buildslave/jenkins/workspace/lldb-cmake-matrix/llvm-project/lldb/packages/Python/lldbsuite/test/lldbutil.py", line 584, in check_breakpoint_result
    out_num_locations))
AssertionError: False is not True : Expecting 1 locations, got 0.
Config=x86_64-/Users/buildslave/jenkins/workspace/lldb-cmake-matrix/clang_701_build/bin/clang-7
======================================================================
FAIL: test_unsigned_char_type_dwarf (TestIntegerTypesExpr.IntegerTypesExprTestCase)
    Test that 'unsigned_char'-type variable expressions are evaluated correctly.
----------------------------------------------------------------------
Traceback (most recent call last):
  File "/Users/buildslave/jenkins/workspace/lldb-cmake-matrix/llvm-project/lldb/packages/Python/lldbsuite/test/lldbtest.py", line 1748, in test_method
    return attrvalue(self)
  File "/Users/buildslave/jenkins/workspace/lldb-cmake-matrix/llvm-project/lldb/packages/Python/lldbsuite/test/types/TestIntegerTypesExpr.py", line 25, in test_unsigned_char_type
    ['unsigned', 'char']), qd=True)
  File "/Users/buildslave/jenkins/workspace/lldb-cmake-matrix/llvm-project/lldb/packages/Python/lldbsuite/test/types/AbstractBase.py", line 69, in build_and_run_expr
    source, atoms, expr=True, bc=bc, qd=qd)
  File "/Users/buildslave/jenkins/workspace/lldb-cmake-matrix/llvm-project/lldb/packages/Python/lldbsuite/test/types/AbstractBase.py", line 83, in build_and_run_with_source_atoms_expr
    self.exe_name, atoms, blockCaptured=bc, quotedDisplay=qd)
  File "/Users/buildslave/jenkins/workspace/lldb-cmake-matrix/llvm-project/lldb/packages/Python/lldbsuite/test/types/AbstractBase.py", line 262, in generic_type_expr_tester
    loc_exact=True)
  File "/Users/buildslave/jenkins/workspace/lldb-cmake-matrix/llvm-project/lldb/packages/Python/lldbsuite/test/lldbutil.py", line 383, in run_break_set_by_file_and_line
    module_name=module_name)
  File "/Users/buildslave/jenkins/workspace/lldb-cmake-matrix/llvm-project/lldb/packages/Python/lldbsuite/test/lldbutil.py", line 584, in check_breakpoint_result
    out_num_locations))
AssertionError: False is not True : Expecting 1 locations, got 0.
Config=x86_64-/Users/buildslave/jenkins/workspace/lldb-cmake-matrix/clang_701_build/bin/clang-7
======================================================================
FAIL: test_unsigned_char_type_from_block_dsym (TestIntegerTypesExpr.IntegerTypesExprTestCase)
    Test that 'unsigned char'-type variables are displayed correctly from a block.
----------------------------------------------------------------------
Traceback (most recent call last):
  File "/Users/buildslave/jenkins/workspace/lldb-cmake-matrix/llvm-project/lldb/packages/Python/lldbsuite/test/lldbtest.py", line 1748, in test_method
    return attrvalue(self)
  File "/Users/buildslave/jenkins/workspace/lldb-cmake-matrix/llvm-project/lldb/packages/Python/lldbsuite/test/types/TestIntegerTypesExpr.py", line 31, in test_unsigned_char_type_from_block
    ['unsigned', 'char']), bc=True, qd=True)
  File "/Users/buildslave/jenkins/workspace/lldb-cmake-matrix/llvm-project/lldb/packages/Python/lldbsuite/test/types/AbstractBase.py", line 69, in build_and_run_expr
    source, atoms, expr=True, bc=bc, qd=qd)
  File "/Users/buildslave/jenkins/workspace/lldb-cmake-matrix/llvm-project/lldb/packages/Python/lldbsuite/test/types/AbstractBase.py", line 83, in build_and_run_with_source_atoms_expr
    self.exe_name, atoms, blockCaptured=bc, quotedDisplay=qd)
  File "/Users/buildslave/jenkins/workspace/lldb-cmake-matrix/llvm-project/lldb/packages/Python/lldbsuite/test/types/AbstractBase.py", line 262, in generic_type_expr_tester
    loc_exact=True)
  File "/Users/buildslave/jenkins/workspace/lldb-cmake-matrix/llvm-project/lldb/packages/Python/lldbsuite/test/lldbutil.py", line 383, in run_break_set_by_file_and_line
    module_name=module_name)
  File "/Users/buildslave/jenkins/workspace/lldb-cmake-matrix/llvm-project/lldb/packages/Python/lldbsuite/test/lldbutil.py", line 584, in check_breakpoint_result
    out_num_locations))
AssertionError: False is not True : Expecting 1 locations, got 0.
Config=x86_64-/Users/buildslave/jenkins/workspace/lldb-cmake-matrix/clang_701_build/bin/clang-7
======================================================================
FAIL: test_unsigned_char_type_from_block_dwarf (TestIntegerTypesExpr.IntegerTypesExprTestCase)
    Test that 'unsigned char'-type variables are displayed correctly from a block.
----------------------------------------------------------------------
Traceback (most recent call last):
  File "/Users/buildslave/jenkins/workspace/lldb-cmake-matrix/llvm-project/lldb/packages/Python/lldbsuite/test/lldbtest.py", line 1748, in test_method
    return attrvalue(self)
  File "/Users/buildslave/jenkins/workspace/lldb-cmake-matrix/llvm-project/lldb/packages/Python/lldbsuite/test/types/TestIntegerTypesExpr.py", line 31, in test_unsigned_char_type_from_block
    ['unsigned', 'char']), bc=True, qd=True)
  File "/Users/buildslave/jenkins/workspace/lldb-cmake-matrix/llvm-project/lldb/packages/Python/lldbsuite/test/types/AbstractBase.py", line 69, in build_and_run_expr
    source, atoms, expr=True, bc=bc, qd=qd)
  File "/Users/buildslave/jenkins/workspace/lldb-cmake-matrix/llvm-project/lldb/packages/Python/lldbsuite/test/types/AbstractBase.py", line 83, in build_and_run_with_source_atoms_expr
    self.exe_name, atoms, blockCaptured=bc, quotedDisplay=qd)
  File "/Users/buildslave/jenkins/workspace/lldb-cmake-matrix/llvm-project/lldb/packages/Python/lldbsuite/test/types/AbstractBase.py", line 262, in generic_type_expr_tester
    loc_exact=True)
  File "/Users/buildslave/jenkins/workspace/lldb-cmake-matrix/llvm-project/lldb/packages/Python/lldbsuite/test/lldbutil.py", line 383, in run_break_set_by_file_and_line
    module_name=module_name)
  File "/Users/buildslave/jenkins/workspace/lldb-cmake-matrix/llvm-project/lldb/packages/Python/lldbsuite/test/lldbutil.py", line 584, in check_breakpoint_result
    out_num_locations))
AssertionError: False is not True : Expecting 1 locations, got 0.
Config=x86_64-/Users/buildslave/jenkins/workspace/lldb-cmake-matrix/clang_701_build/bin/clang-7
======================================================================
FAIL: test_unsigned_int_type_dsym (TestIntegerTypesExpr.IntegerTypesExprTestCase)
    Test that 'unsigned_int'-type variable expressions are evaluated correctly.
----------------------------------------------------------------------
Traceback (most recent call last):
  File "/Users/buildslave/jenkins/workspace/lldb-cmake-matrix/llvm-project/lldb/packages/Python/lldbsuite/test/lldbtest.py", line 1748, in test_method
    return attrvalue(self)
  File "/Users/buildslave/jenkins/workspace/lldb-cmake-matrix/llvm-project/lldb/packages/Python/lldbsuite/test/types/TestIntegerTypesExpr.py", line 64, in test_unsigned_int_type
    self.build_and_run_expr('unsigned_int.cpp', set(['unsigned', 'int']))
  File "/Users/buildslave/jenkins/workspace/lldb-cmake-matrix/llvm-project/lldb/packages/Python/lldbsuite/test/types/AbstractBase.py", line 69, in build_and_run_expr
    source, atoms, expr=True, bc=bc, qd=qd)
  File "/Users/buildslave/jenkins/workspace/lldb-cmake-matrix/llvm-project/lldb/packages/Python/lldbsuite/test/types/AbstractBase.py", line 83, in build_and_run_with_source_atoms_expr
    self.exe_name, atoms, blockCaptured=bc, quotedDisplay=qd)
  File "/Users/buildslave/jenkins/workspace/lldb-cmake-matrix/llvm-project/lldb/packages/Python/lldbsuite/test/types/AbstractBase.py", line 262, in generic_type_expr_tester
    loc_exact=True)
  File "/Users/buildslave/jenkins/workspace/lldb-cmake-matrix/llvm-project/lldb/packages/Python/lldbsuite/test/lldbutil.py", line 383, in run_break_set_by_file_and_line
    module_name=module_name)
  File "/Users/buildslave/jenkins/workspace/lldb-cmake-matrix/llvm-project/lldb/packages/Python/lldbsuite/test/lldbutil.py", line 584, in check_breakpoint_result
    out_num_locations))
AssertionError: False is not True : Expecting 1 locations, got 0.
Config=x86_64-/Users/buildslave/jenkins/workspace/lldb-cmake-matrix/clang_701_build/bin/clang-7
======================================================================
FAIL: test_unsigned_int_type_dwarf (TestIntegerTypesExpr.IntegerTypesExprTestCase)
    Test that 'unsigned_int'-type variable expressions are evaluated correctly.
----------------------------------------------------------------------
Traceback (most recent call last):
  File "/Users/buildslave/jenkins/workspace/lldb-cmake-matrix/llvm-project/lldb/packages/Python/lldbsuite/test/lldbtest.py", line 1748, in test_method
    return attrvalue(self)
  File "/Users/buildslave/jenkins/workspace/lldb-cmake-matrix/llvm-project/lldb/packages/Python/lldbsuite/test/types/TestIntegerTypesExpr.py", line 64, in test_unsigned_int_type
    self.build_and_run_expr('unsigned_int.cpp', set(['unsigned', 'int']))
  File "/Users/buildslave/jenkins/workspace/lldb-cmake-matrix/llvm-project/lldb/packages/Python/lldbsuite/test/types/AbstractBase.py", line 69, in build_and_run_expr
    source, atoms, expr=True, bc=bc, qd=qd)
  File "/Users/buildslave/jenkins/workspace/lldb-cmake-matrix/llvm-project/lldb/packages/Python/lldbsuite/test/types/AbstractBase.py", line 83, in build_and_run_with_source_atoms_expr
    self.exe_name, atoms, blockCaptured=bc, quotedDisplay=qd)
  File "/Users/buildslave/jenkins/workspace/lldb-cmake-matrix/llvm-project/lldb/packages/Python/lldbsuite/test/types/AbstractBase.py", line 262, in generic_type_expr_tester
    loc_exact=True)
  File "/Users/buildslave/jenkins/workspace/lldb-cmake-matrix/llvm-project/lldb/packages/Python/lldbsuite/test/lldbutil.py", line 383, in run_break_set_by_file_and_line
    module_name=module_name)
  File "/Users/buildslave/jenkins/workspace/lldb-cmake-matrix/llvm-project/lldb/packages/Python/lldbsuite/test/lldbutil.py", line 584, in check_breakpoint_result
    out_num_locations))
AssertionError: False is not True : Expecting 1 locations, got 0.
Config=x86_64-/Users/buildslave/jenkins/workspace/lldb-cmake-matrix/clang_701_build/bin/clang-7
======================================================================
FAIL: test_unsigned_int_type_from_block_dsym (TestIntegerTypesExpr.IntegerTypesExprTestCase)
    Test that 'unsigned int'-type variables are displayed correctly from a block.
----------------------------------------------------------------------
Traceback (most recent call last):
  File "/Users/buildslave/jenkins/workspace/lldb-cmake-matrix/llvm-project/lldb/packages/Python/lldbsuite/test/lldbtest.py", line 1748, in test_method
    return attrvalue(self)
  File "/Users/buildslave/jenkins/workspace/lldb-cmake-matrix/llvm-project/lldb/packages/Python/lldbsuite/test/types/TestIntegerTypesExpr.py", line 70, in test_unsigned_int_type_from_block
    'unsigned_int.cpp', set(['unsigned', 'int']), bc=True)
  File "/Users/buildslave/jenkins/workspace/lldb-cmake-matrix/llvm-project/lldb/packages/Python/lldbsuite/test/types/AbstractBase.py", line 69, in build_and_run_expr
    source, atoms, expr=True, bc=bc, qd=qd)
  File "/Users/buildslave/jenkins/workspace/lldb-cmake-matrix/llvm-project/lldb/packages/Python/lldbsuite/test/types/AbstractBase.py", line 83, in build_and_run_with_source_atoms_expr
    self.exe_name, atoms, blockCaptured=bc, quotedDisplay=qd)
  File "/Users/buildslave/jenkins/workspace/lldb-cmake-matrix/llvm-project/lldb/packages/Python/lldbsuite/test/types/AbstractBase.py", line 262, in generic_type_expr_tester
    loc_exact=True)
  File "/Users/buildslave/jenkins/workspace/lldb-cmake-matrix/llvm-project/lldb/packages/Python/lldbsuite/test/lldbutil.py", line 383, in run_break_set_by_file_and_line
    module_name=module_name)
  File "/Users/buildslave/jenkins/workspace/lldb-cmake-matrix/llvm-project/lldb/packages/Python/lldbsuite/test/lldbutil.py", line 584, in check_breakpoint_result
    out_num_locations))
AssertionError: False is not True : Expecting 1 locations, got 0.
Config=x86_64-/Users/buildslave/jenkins/workspace/lldb-cmake-matrix/clang_701_build/bin/clang-7
======================================================================
FAIL: test_unsigned_int_type_from_block_dwarf (TestIntegerTypesExpr.IntegerTypesExprTestCase)
    Test that 'unsigned int'-type variables are displayed correctly from a block.
----------------------------------------------------------------------
Traceback (most recent call last):
  File "/Users/buildslave/jenkins/workspace/lldb-cmake-matrix/llvm-project/lldb/packages/Python/lldbsuite/test/lldbtest.py", line 1748, in test_method
    return attrvalue(self)
  File "/Users/buildslave/jenkins/workspace/lldb-cmake-matrix/llvm-project/lldb/packages/Python/lldbsuite/test/types/TestIntegerTypesExpr.py", line 70, in test_unsigned_int_type_from_block
    'unsigned_int.cpp', set(['unsigned', 'int']), bc=True)
  File "/Users/buildslave/jenkins/workspace/lldb-cmake-matrix/llvm-project/lldb/packages/Python/lldbsuite/test/types/AbstractBase.py", line 69, in build_and_run_expr
    source, atoms, expr=True, bc=bc, qd=qd)
  File "/Users/buildslave/jenkins/workspace/lldb-cmake-matrix/llvm-project/lldb/packages/Python/lldbsuite/test/types/AbstractBase.py", line 83, in build_and_run_with_source_atoms_expr
    self.exe_name, atoms, blockCaptured=bc, quotedDisplay=qd)
  File "/Users/buildslave/jenkins/workspace/lldb-cmake-matrix/llvm-project/lldb/packages/Python/lldbsuite/test/types/AbstractBase.py", line 262, in generic_type_expr_tester
    loc_exact=True)
  File "/Users/buildslave/jenkins/workspace/lldb-cmake-matrix/llvm-project/lldb/packages/Python/lldbsuite/test/lldbutil.py", line 383, in run_break_set_by_file_and_line
    module_name=module_name)
  File "/Users/buildslave/jenkins/workspace/lldb-cmake-matrix/llvm-project/lldb/packages/Python/lldbsuite/test/lldbutil.py", line 584, in check_breakpoint_result
    out_num_locations))
AssertionError: False is not True : Expecting 1 locations, got 0.
Config=x86_64-/Users/buildslave/jenkins/workspace/lldb-cmake-matrix/clang_701_build/bin/clang-7
======================================================================
FAIL: test_unsigned_long_long_type_dsym (TestIntegerTypesExpr.IntegerTypesExprTestCase)
    Test that 'unsigned long long'-type variable expressions are evaluated correctly.
----------------------------------------------------------------------
Traceback (most recent call last):
  File "/Users/buildslave/jenkins/workspace/lldb-cmake-matrix/llvm-project/lldb/packages/Python/lldbsuite/test/lldbtest.py", line 1748, in test_method
    return attrvalue(self)
  File "/Users/buildslave/jenkins/workspace/lldb-cmake-matrix/llvm-project/lldb/packages/Python/lldbsuite/test/types/TestIntegerTypesExpr.py", line 103, in test_unsigned_long_long_type
    set(['unsigned', 'long long']))
  File "/Users/buildslave/jenkins/workspace/lldb-cmake-matrix/llvm-project/lldb/packages/Python/lldbsuite/test/types/AbstractBase.py", line 69, in build_and_run_expr
    source, atoms, expr=True, bc=bc, qd=qd)
  File "/Users/buildslave/jenkins/workspace/lldb-cmake-matrix/llvm-project/lldb/packages/Python/lldbsuite/test/types/AbstractBase.py", line 83, in build_and_run_with_source_atoms_expr
    self.exe_name, atoms, blockCaptured=bc, quotedDisplay=qd)
  File "/Users/buildslave/jenkins/workspace/lldb-cmake-matrix/llvm-project/lldb/packages/Python/lldbsuite/test/types/AbstractBase.py", line 262, in generic_type_expr_tester
    loc_exact=True)
  File "/Users/buildslave/jenkins/workspace/lldb-cmake-matrix/llvm-project/lldb/packages/Python/lldbsuite/test/lldbutil.py", line 383, in run_break_set_by_file_and_line
    module_name=module_name)
  File "/Users/buildslave/jenkins/workspace/lldb-cmake-matrix/llvm-project/lldb/packages/Python/lldbsuite/test/lldbutil.py", line 584, in check_breakpoint_result
    out_num_locations))
AssertionError: False is not True : Expecting 1 locations, got 0.
Config=x86_64-/Users/buildslave/jenkins/workspace/lldb-cmake-matrix/clang_701_build/bin/clang-7
======================================================================
FAIL: test_unsigned_long_long_type_dwarf (TestIntegerTypesExpr.IntegerTypesExprTestCase)
    Test that 'unsigned long long'-type variable expressions are evaluated correctly.
----------------------------------------------------------------------
Traceback (most recent call last):
  File "/Users/buildslave/jenkins/workspace/lldb-cmake-matrix/llvm-project/lldb/packages/Python/lldbsuite/test/lldbtest.py", line 1748, in test_method
    return attrvalue(self)
  File "/Users/buildslave/jenkins/workspace/lldb-cmake-matrix/llvm-project/lldb/packages/Python/lldbsuite/test/types/TestIntegerTypesExpr.py", line 103, in test_unsigned_long_long_type
    set(['unsigned', 'long long']))
  File "/Users/buildslave/jenkins/workspace/lldb-cmake-matrix/llvm-project/lldb/packages/Python/lldbsuite/test/types/AbstractBase.py", line 69, in build_and_run_expr
    source, atoms, expr=True, bc=bc, qd=qd)
  File "/Users/buildslave/jenkins/workspace/lldb-cmake-matrix/llvm-project/lldb/packages/Python/lldbsuite/test/types/AbstractBase.py", line 83, in build_and_run_with_source_atoms_expr
    self.exe_name, atoms, blockCaptured=bc, quotedDisplay=qd)
  File "/Users/buildslave/jenkins/workspace/lldb-cmake-matrix/llvm-project/lldb/packages/Python/lldbsuite/test/types/AbstractBase.py", line 262, in generic_type_expr_tester
    loc_exact=True)
  File "/Users/buildslave/jenkins/workspace/lldb-cmake-matrix/llvm-project/lldb/packages/Python/lldbsuite/test/lldbutil.py", line 383, in run_break_set_by_file_and_line
    module_name=module_name)
  File "/Users/buildslave/jenkins/workspace/lldb-cmake-matrix/llvm-project/lldb/packages/Python/lldbsuite/test/lldbutil.py", line 584, in check_breakpoint_result
    out_num_locations))
AssertionError: False is not True : Expecting 1 locations, got 0.
Config=x86_64-/Users/buildslave/jenkins/workspace/lldb-cmake-matrix/clang_701_build/bin/clang-7
======================================================================
FAIL: test_unsigned_long_long_type_from_block_dsym (TestIntegerTypesExpr.IntegerTypesExprTestCase)
    Test that 'unsigned_long_long'-type variables are displayed correctly from a block.
----------------------------------------------------------------------
Traceback (most recent call last):
  File "/Users/buildslave/jenkins/workspace/lldb-cmake-matrix/llvm-project/lldb/packages/Python/lldbsuite/test/lldbtest.py", line 1748, in test_method
    return attrvalue(self)
  File "/Users/buildslave/jenkins/workspace/lldb-cmake-matrix/llvm-project/lldb/packages/Python/lldbsuite/test/types/TestIntegerTypesExpr.py", line 109, in test_unsigned_long_long_type_from_block
    ['unsigned', 'long long']), bc=True)
  File "/Users/buildslave/jenkins/workspace/lldb-cmake-matrix/llvm-project/lldb/packages/Python/lldbsuite/test/types/AbstractBase.py", line 69, in build_and_run_expr
    source, atoms, expr=True, bc=bc, qd=qd)
  File "/Users/buildslave/jenkins/workspace/lldb-cmake-matrix/llvm-project/lldb/packages/Python/lldbsuite/test/types/AbstractBase.py", line 83, in build_and_run_with_source_atoms_expr
    self.exe_name, atoms, blockCaptured=bc, quotedDisplay=qd)
  File "/Users/buildslave/jenkins/workspace/lldb-cmake-matrix/llvm-project/lldb/packages/Python/lldbsuite/test/types/AbstractBase.py", line 262, in generic_type_expr_tester
    loc_exact=True)
  File "/Users/buildslave/jenkins/workspace/lldb-cmake-matrix/llvm-project/lldb/packages/Python/lldbsuite/test/lldbutil.py", line 383, in run_break_set_by_file_and_line
    module_name=module_name)
  File "/Users/buildslave/jenkins/workspace/lldb-cmake-matrix/llvm-project/lldb/packages/Python/lldbsuite/test/lldbutil.py", line 584, in check_breakpoint_result
    out_num_locations))
AssertionError: False is not True : Expecting 1 locations, got 0.
Config=x86_64-/Users/buildslave/jenkins/workspace/lldb-cmake-matrix/clang_701_build/bin/clang-7
======================================================================
FAIL: test_unsigned_long_long_type_from_block_dwarf (TestIntegerTypesExpr.IntegerTypesExprTestCase)
    Test that 'unsigned_long_long'-type variables are displayed correctly from a block.
----------------------------------------------------------------------
Traceback (most recent call last):
  File "/Users/buildslave/jenkins/workspace/lldb-cmake-matrix/llvm-project/lldb/packages/Python/lldbsuite/test/lldbtest.py", line 1748, in test_method
    return attrvalue(self)
  File "/Users/buildslave/jenkins/workspace/lldb-cmake-matrix/llvm-project/lldb/packages/Python/lldbsuite/test/types/TestIntegerTypesExpr.py", line 109, in test_unsigned_long_long_type_from_block
    ['unsigned', 'long long']), bc=True)
  File "/Users/buildslave/jenkins/workspace/lldb-cmake-matrix/llvm-project/lldb/packages/Python/lldbsuite/test/types/AbstractBase.py", line 69, in build_and_run_expr
    source, atoms, expr=True, bc=bc, qd=qd)
  File "/Users/buildslave/jenkins/workspace/lldb-cmake-matrix/llvm-project/lldb/packages/Python/lldbsuite/test/types/AbstractBase.py", line 83, in build_and_run_with_source_atoms_expr
    self.exe_name, atoms, blockCaptured=bc, quotedDisplay=qd)
  File "/Users/buildslave/jenkins/workspace/lldb-cmake-matrix/llvm-project/lldb/packages/Python/lldbsuite/test/types/AbstractBase.py", line 262, in generic_type_expr_tester
    loc_exact=True)
  File "/Users/buildslave/jenkins/workspace/lldb-cmake-matrix/llvm-project/lldb/packages/Python/lldbsuite/test/lldbutil.py", line 383, in run_break_set_by_file_and_line
    module_name=module_name)
  File "/Users/buildslave/jenkins/workspace/lldb-cmake-matrix/llvm-project/lldb/packages/Python/lldbsuite/test/lldbutil.py", line 584, in check_breakpoint_result
    out_num_locations))
AssertionError: False is not True : Expecting 1 locations, got 0.
Config=x86_64-/Users/buildslave/jenkins/workspace/lldb-cmake-matrix/clang_701_build/bin/clang-7
======================================================================
FAIL: test_unsigned_long_type_dsym (TestIntegerTypesExpr.IntegerTypesExprTestCase)
    Test that 'unsigned long'-type variable expressions are evaluated correctly.
----------------------------------------------------------------------
Traceback (most recent call last):
  File "/Users/buildslave/jenkins/workspace/lldb-cmake-matrix/llvm-project/lldb/packages/Python/lldbsuite/test/lldbtest.py", line 1748, in test_method
    return attrvalue(self)
  File "/Users/buildslave/jenkins/workspace/lldb-cmake-matrix/llvm-project/lldb/packages/Python/lldbsuite/test/types/TestIntegerTypesExpr.py", line 83, in test_unsigned_long_type
    self.build_and_run_expr('unsigned_long.cpp', set(['unsigned', 'long']))
  File "/Users/buildslave/jenkins/workspace/lldb-cmake-matrix/llvm-project/lldb/packages/Python/lldbsuite/test/types/AbstractBase.py", line 69, in build_and_run_expr
    source, atoms, expr=True, bc=bc, qd=qd)
  File "/Users/buildslave/jenkins/workspace/lldb-cmake-matrix/llvm-project/lldb/packages/Python/lldbsuite/test/types/AbstractBase.py", line 83, in build_and_run_with_source_atoms_expr
    self.exe_name, atoms, blockCaptured=bc, quotedDisplay=qd)
  File "/Users/buildslave/jenkins/workspace/lldb-cmake-matrix/llvm-project/lldb/packages/Python/lldbsuite/test/types/AbstractBase.py", line 262, in generic_type_expr_tester
    loc_exact=True)
  File "/Users/buildslave/jenkins/workspace/lldb-cmake-matrix/llvm-project/lldb/packages/Python/lldbsuite/test/lldbutil.py", line 383, in run_break_set_by_file_and_line
    module_name=module_name)
  File "/Users/buildslave/jenkins/workspace/lldb-cmake-matrix/llvm-project/lldb/packages/Python/lldbsuite/test/lldbutil.py", line 584, in check_breakpoint_result
    out_num_locations))
AssertionError: False is not True : Expecting 1 locations, got 0.
Config=x86_64-/Users/buildslave/jenkins/workspace/lldb-cmake-matrix/clang_701_build/bin/clang-7
======================================================================
FAIL: test_unsigned_long_type_dwarf (TestIntegerTypesExpr.IntegerTypesExprTestCase)
    Test that 'unsigned long'-type variable expressions are evaluated correctly.
----------------------------------------------------------------------
Traceback (most recent call last):
  File "/Users/buildslave/jenkins/workspace/lldb-cmake-matrix/llvm-project/lldb/packages/Python/lldbsuite/test/lldbtest.py", line 1748, in test_method
    return attrvalue(self)
  File "/Users/buildslave/jenkins/workspace/lldb-cmake-matrix/llvm-project/lldb/packages/Python/lldbsuite/test/types/TestIntegerTypesExpr.py", line 83, in test_unsigned_long_type
    self.build_and_run_expr('unsigned_long.cpp', set(['unsigned', 'long']))
  File "/Users/buildslave/jenkins/workspace/lldb-cmake-matrix/llvm-project/lldb/packages/Python/lldbsuite/test/types/AbstractBase.py", line 69, in build_and_run_expr
    source, atoms, expr=True, bc=bc, qd=qd)
  File "/Users/buildslave/jenkins/workspace/lldb-cmake-matrix/llvm-project/lldb/packages/Python/lldbsuite/test/types/AbstractBase.py", line 83, in build_and_run_with_source_atoms_expr
    self.exe_name, atoms, blockCaptured=bc, quotedDisplay=qd)
  File "/Users/buildslave/jenkins/workspace/lldb-cmake-matrix/llvm-project/lldb/packages/Python/lldbsuite/test/types/AbstractBase.py", line 262, in generic_type_expr_tester
    loc_exact=True)
  File "/Users/buildslave/jenkins/workspace/lldb-cmake-matrix/llvm-project/lldb/packages/Python/lldbsuite/test/lldbutil.py", line 383, in run_break_set_by_file_and_line
    module_name=module_name)
  File "/Users/buildslave/jenkins/workspace/lldb-cmake-matrix/llvm-project/lldb/packages/Python/lldbsuite/test/lldbutil.py", line 584, in check_breakpoint_result
    out_num_locations))
AssertionError: False is not True : Expecting 1 locations, got 0.
Config=x86_64-/Users/buildslave/jenkins/workspace/lldb-cmake-matrix/clang_701_build/bin/clang-7
======================================================================
FAIL: test_unsigned_long_type_from_block_dsym (TestIntegerTypesExpr.IntegerTypesExprTestCase)
    Test that 'unsigned_long'-type variables are displayed correctly from a block.
----------------------------------------------------------------------
Traceback (most recent call last):
  File "/Users/buildslave/jenkins/workspace/lldb-cmake-matrix/llvm-project/lldb/packages/Python/lldbsuite/test/lldbtest.py", line 1748, in test_method
    return attrvalue(self)
  File "/Users/buildslave/jenkins/workspace/lldb-cmake-matrix/llvm-project/lldb/packages/Python/lldbsuite/test/types/TestIntegerTypesExpr.py", line 89, in test_unsigned_long_type_from_block
    ['unsigned', 'long']), bc=True)
  File "/Users/buildslave/jenkins/workspace/lldb-cmake-matrix/llvm-project/lldb/packages/Python/lldbsuite/test/types/AbstractBase.py", line 69, in build_and_run_expr
    source, atoms, expr=True, bc=bc, qd=qd)
  File "/Users/buildslave/jenkins/workspace/lldb-cmake-matrix/llvm-project/lldb/packages/Python/lldbsuite/test/types/AbstractBase.py", line 83, in build_and_run_with_source_atoms_expr
    self.exe_name, atoms, blockCaptured=bc, quotedDisplay=qd)
  File "/Users/buildslave/jenkins/workspace/lldb-cmake-matrix/llvm-project/lldb/packages/Python/lldbsuite/test/types/AbstractBase.py", line 262, in generic_type_expr_tester
    loc_exact=True)
  File "/Users/buildslave/jenkins/workspace/lldb-cmake-matrix/llvm-project/lldb/packages/Python/lldbsuite/test/lldbutil.py", line 383, in run_break_set_by_file_and_line
    module_name=module_name)
  File "/Users/buildslave/jenkins/workspace/lldb-cmake-matrix/llvm-project/lldb/packages/Python/lldbsuite/test/lldbutil.py", line 584, in check_breakpoint_result
    out_num_locations))
AssertionError: False is not True : Expecting 1 locations, got 0.
Config=x86_64-/Users/buildslave/jenkins/workspace/lldb-cmake-matrix/clang_701_build/bin/clang-7
======================================================================
FAIL: test_unsigned_long_type_from_block_dwarf (TestIntegerTypesExpr.IntegerTypesExprTestCase)
    Test that 'unsigned_long'-type variables are displayed correctly from a block.
----------------------------------------------------------------------
Traceback (most recent call last):
  File "/Users/buildslave/jenkins/workspace/lldb-cmake-matrix/llvm-project/lldb/packages/Python/lldbsuite/test/lldbtest.py", line 1748, in test_method
    return attrvalue(self)
  File "/Users/buildslave/jenkins/workspace/lldb-cmake-matrix/llvm-project/lldb/packages/Python/lldbsuite/test/types/TestIntegerTypesExpr.py", line 89, in test_unsigned_long_type_from_block
    ['unsigned', 'long']), bc=True)
  File "/Users/buildslave/jenkins/workspace/lldb-cmake-matrix/llvm-project/lldb/packages/Python/lldbsuite/test/types/AbstractBase.py", line 69, in build_and_run_expr
    source, atoms, expr=True, bc=bc, qd=qd)
  File "/Users/buildslave/jenkins/workspace/lldb-cmake-matrix/llvm-project/lldb/packages/Python/lldbsuite/test/types/AbstractBase.py", line 83, in build_and_run_with_source_atoms_expr
    self.exe_name, atoms, blockCaptured=bc, quotedDisplay=qd)
  File "/Users/buildslave/jenkins/workspace/lldb-cmake-matrix/llvm-project/lldb/packages/Python/lldbsuite/test/types/AbstractBase.py", line 262, in generic_type_expr_tester
    loc_exact=True)
  File "/Users/buildslave/jenkins/workspace/lldb-cmake-matrix/llvm-project/lldb/packages/Python/lldbsuite/test/lldbutil.py", line 383, in run_break_set_by_file_and_line
    module_name=module_name)
  File "/Users/buildslave/jenkins/workspace/lldb-cmake-matrix/llvm-project/lldb/packages/Python/lldbsuite/test/lldbutil.py", line 584, in check_breakpoint_result
    out_num_locations))
AssertionError: False is not True : Expecting 1 locations, got 0.
Config=x86_64-/Users/buildslave/jenkins/workspace/lldb-cmake-matrix/clang_701_build/bin/clang-7
======================================================================
FAIL: test_unsigned_short_type_dsym (TestIntegerTypesExpr.IntegerTypesExprTestCase)
    Test that 'unsigned_short'-type variable expressions are evaluated correctly.
----------------------------------------------------------------------
Traceback (most recent call last):
  File "/Users/buildslave/jenkins/workspace/lldb-cmake-matrix/llvm-project/lldb/packages/Python/lldbsuite/test/lldbtest.py", line 1748, in test_method
    return attrvalue(self)
  File "/Users/buildslave/jenkins/workspace/lldb-cmake-matrix/llvm-project/lldb/packages/Python/lldbsuite/test/types/TestIntegerTypesExpr.py", line 45, in test_unsigned_short_type
    set(['unsigned', 'short']))
  File "/Users/buildslave/jenkins/workspace/lldb-cmake-matrix/llvm-project/lldb/packages/Python/lldbsuite/test/types/AbstractBase.py", line 69, in build_and_run_expr
    source, atoms, expr=True, bc=bc, qd=qd)
  File "/Users/buildslave/jenkins/workspace/lldb-cmake-matrix/llvm-project/lldb/packages/Python/lldbsuite/test/types/AbstractBase.py", line 83, in build_and_run_with_source_atoms_expr
    self.exe_name, atoms, blockCaptured=bc, quotedDisplay=qd)
  File "/Users/buildslave/jenkins/workspace/lldb-cmake-matrix/llvm-project/lldb/packages/Python/lldbsuite/test/types/AbstractBase.py", line 262, in generic_type_expr_tester
    loc_exact=True)
  File "/Users/buildslave/jenkins/workspace/lldb-cmake-matrix/llvm-project/lldb/packages/Python/lldbsuite/test/lldbutil.py", line 383, in run_break_set_by_file_and_line
    module_name=module_name)
  File "/Users/buildslave/jenkins/workspace/lldb-cmake-matrix/llvm-project/lldb/packages/Python/lldbsuite/test/lldbutil.py", line 584, in check_breakpoint_result
    out_num_locations))
AssertionError: False is not True : Expecting 1 locations, got 0.
Config=x86_64-/Users/buildslave/jenkins/workspace/lldb-cmake-matrix/clang_701_build/bin/clang-7
======================================================================
FAIL: test_unsigned_short_type_dwarf (TestIntegerTypesExpr.IntegerTypesExprTestCase)
    Test that 'unsigned_short'-type variable expressions are evaluated correctly.
----------------------------------------------------------------------
Traceback (most recent call last):
  File "/Users/buildslave/jenkins/workspace/lldb-cmake-matrix/llvm-project/lldb/packages/Python/lldbsuite/test/lldbtest.py", line 1748, in test_method
    return attrvalue(self)
  File "/Users/buildslave/jenkins/workspace/lldb-cmake-matrix/llvm-project/lldb/packages/Python/lldbsuite/test/types/TestIntegerTypesExpr.py", line 45, in test_unsigned_short_type
    set(['unsigned', 'short']))
  File "/Users/buildslave/jenkins/workspace/lldb-cmake-matrix/llvm-project/lldb/packages/Python/lldbsuite/test/types/AbstractBase.py", line 69, in build_and_run_expr
    source, atoms, expr=True, bc=bc, qd=qd)
  File "/Users/buildslave/jenkins/workspace/lldb-cmake-matrix/llvm-project/lldb/packages/Python/lldbsuite/test/types/AbstractBase.py", line 83, in build_and_run_with_source_atoms_expr
    self.exe_name, atoms, blockCaptured=bc, quotedDisplay=qd)
  File "/Users/buildslave/jenkins/workspace/lldb-cmake-matrix/llvm-project/lldb/packages/Python/lldbsuite/test/types/AbstractBase.py", line 262, in generic_type_expr_tester
    loc_exact=True)
  File "/Users/buildslave/jenkins/workspace/lldb-cmake-matrix/llvm-project/lldb/packages/Python/lldbsuite/test/lldbutil.py", line 383, in run_break_set_by_file_and_line
    module_name=module_name)
  File "/Users/buildslave/jenkins/workspace/lldb-cmake-matrix/llvm-project/lldb/packages/Python/lldbsuite/test/lldbutil.py", line 584, in check_breakpoint_result
    out_num_locations))
AssertionError: False is not True : Expecting 1 locations, got 0.
Config=x86_64-/Users/buildslave/jenkins/workspace/lldb-cmake-matrix/clang_701_build/bin/clang-7
======================================================================
FAIL: test_unsigned_short_type_from_block_dsym (TestIntegerTypesExpr.IntegerTypesExprTestCase)
    Test that 'unsigned short'-type variables are displayed correctly from a block.
----------------------------------------------------------------------
Traceback (most recent call last):
  File "/Users/buildslave/jenkins/workspace/lldb-cmake-matrix/llvm-project/lldb/packages/Python/lldbsuite/test/lldbtest.py", line 1748, in test_method
    return attrvalue(self)
  File "/Users/buildslave/jenkins/workspace/lldb-cmake-matrix/llvm-project/lldb/packages/Python/lldbsuite/test/types/TestIntegerTypesExpr.py", line 51, in test_unsigned_short_type_from_block
    ['unsigned', 'short']), bc=True)
  File "/Users/buildslave/jenkins/workspace/lldb-cmake-matrix/llvm-project/lldb/packages/Python/lldbsuite/test/types/AbstractBase.py", line 69, in build_and_run_expr
    source, atoms, expr=True, bc=bc, qd=qd)
  File "/Users/buildslave/jenkins/workspace/lldb-cmake-matrix/llvm-project/lldb/packages/Python/lldbsuite/test/types/AbstractBase.py", line 83, in build_and_run_with_source_atoms_expr
    self.exe_name, atoms, blockCaptured=bc, quotedDisplay=qd)
  File "/Users/buildslave/jenkins/workspace/lldb-cmake-matrix/llvm-project/lldb/packages/Python/lldbsuite/test/types/AbstractBase.py", line 262, in generic_type_expr_tester
    loc_exact=True)
  File "/Users/buildslave/jenkins/workspace/lldb-cmake-matrix/llvm-project/lldb/packages/Python/lldbsuite/test/lldbutil.py", line 383, in run_break_set_by_file_and_line
    module_name=module_name)
  File "/Users/buildslave/jenkins/workspace/lldb-cmake-matrix/llvm-project/lldb/packages/Python/lldbsuite/test/lldbutil.py", line 584, in check_breakpoint_result
    out_num_locations))
AssertionError: False is not True : Expecting 1 locations, got 0.
Config=x86_64-/Users/buildslave/jenkins/workspace/lldb-cmake-matrix/clang_701_build/bin/clang-7
======================================================================
FAIL: test_unsigned_short_type_from_block_dwarf (TestIntegerTypesExpr.IntegerTypesExprTestCase)
    Test that 'unsigned short'-type variables are displayed correctly from a block.
----------------------------------------------------------------------
Traceback (most recent call last):
  File "/Users/buildslave/jenkins/workspace/lldb-cmake-matrix/llvm-project/lldb/packages/Python/lldbsuite/test/lldbtest.py", line 1748, in test_method
    return attrvalue(self)
  File "/Users/buildslave/jenkins/workspace/lldb-cmake-matrix/llvm-project/lldb/packages/Python/lldbsuite/test/types/TestIntegerTypesExpr.py", line 51, in test_unsigned_short_type_from_block
    ['unsigned', 'short']), bc=True)
  File "/Users/buildslave/jenkins/workspace/lldb-cmake-matrix/llvm-project/lldb/packages/Python/lldbsuite/test/types/AbstractBase.py", line 69, in build_and_run_expr
    source, atoms, expr=True, bc=bc, qd=qd)
  File "/Users/buildslave/jenkins/workspace/lldb-cmake-matrix/llvm-project/lldb/packages/Python/lldbsuite/test/types/AbstractBase.py", line 83, in build_and_run_with_source_atoms_expr
    self.exe_name, atoms, blockCaptured=bc, quotedDisplay=qd)
  File "/Users/buildslave/jenkins/workspace/lldb-cmake-matrix/llvm-project/lldb/packages/Python/lldbsuite/test/types/AbstractBase.py", line 262, in generic_type_expr_tester
    loc_exact=True)
  File "/Users/buildslave/jenkins/workspace/lldb-cmake-matrix/llvm-project/lldb/packages/Python/lldbsuite/test/lldbutil.py", line 383, in run_break_set_by_file_and_line
    module_name=module_name)
  File "/Users/buildslave/jenkins/workspace/lldb-cmake-matrix/llvm-project/lldb/packages/Python/lldbsuite/test/lldbutil.py", line 584, in check_breakpoint_result
    out_num_locations))
AssertionError: False is not True : Expecting 1 locations, got 0.
Config=x86_64-/Users/buildslave/jenkins/workspace/lldb-cmake-matrix/clang_701_build/bin/clang-7
----------------------------------------------------------------------
Ran 80 tests in 34.783s

RESULT: FAILED (0 passes, 40 failures, 0 errors, 40 skipped, 0 expected failures, 0 unexpected successes)

********************
PASS: lldb-Suite :: commands/process/attach/TestProcessAttach.py (1694 of 1705)
FAIL: lldb-Suite :: lang/objc/objc-foundation-dictionary-empty/TestNSDictionary0.py (1695 of 1705)
******************** TEST 'lldb-Suite :: lang/objc/objc-foundation-dictionary-empty/TestNSDictionary0.py' FAILED ********************
lldb version 10.0.99 (http://labmaster3.local/git/llvm-project.git revision 1a3dd638c4a9173e53628b497a1aadc31c32eb50)
  clang revision 9e86561878dc470c4023cd627dd39cafc13fdc4d
  llvm revision 9e86561878dc470c4023cd627dd39cafc13fdc4d
LLDB library dir: /Users/buildslave/jenkins/workspace/lldb-cmake-matrix/lldb-build/bin
LLDB import library dir: /Users/buildslave/jenkins/workspace/lldb-cmake-matrix/lldb-build/bin
libstdcxx tests will not be run because: Don't know how to build with libstdcxx on macosx
Skipping following debug info categories: ['dwo']

Session logs for test failures/errors/unexpected successes will go into directory '/Users/buildslave/jenkins/workspace/lldb-cmake-matrix/test/logs'
Command invoked: /Users/buildslave/jenkins/workspace/lldb-cmake-matrix/llvm-project/lldb/test/dotest.py --arch=x86_64 -s /Users/buildslave/jenkins/workspace/lldb-cmake-matrix/lldb-build/lldb-test-traces -S nm -u CXXFLAGS -u CFLAGS --executable /Users/buildslave/jenkins/workspace/lldb-cmake-matrix/lldb-build/./bin/lldb --dsymutil /Users/buildslave/jenkins/workspace/lldb-cmake-matrix/lldb-build/./bin/dsymutil --filecheck /Users/buildslave/jenkins/workspace/lldb-cmake-matrix/lldb-build/./bin/FileCheck -C /Users/buildslave/jenkins/workspace/lldb-cmake-matrix/clang_701_build/bin/clang --codesign-identity lldb_codesign --server /Users/buildslave/jenkins/workspace/lldb-cmake-matrix/lldb-build/./bin/debugserver --arch x86_64 --build-dir /Users/buildslave/jenkins/workspace/lldb-cmake-matrix/lldb-build/lldb-test-build.noindex -s=/Users/buildslave/jenkins/workspace/lldb-cmake-matrix/test/logs -t --env TERM=vt100 --skip-category gmodules --skip-category watchpoint --arch=x86_64 --dwarf-version=5 --env LLVM_LIBS_DIR=/Users/buildslave/jenkins/workspace/lldb-cmake-matrix/lldb-build/./lib --build-dir /Users/buildslave/jenkins/workspace/lldb-cmake-matrix/lldb-build/tools/lldb/lldb-test-build.noindex --module-cache-dir /Users/buildslave/jenkins/workspace/lldb-cmake-matrix/lldb-build/tools/lldb/lldb-test-build.noindex/module-cache-lldb /Users/buildslave/jenkins/workspace/lldb-cmake-matrix/llvm-project/lldb/packages/Python/lldbsuite/test/lang/objc/objc-foundation-dictionary-empty -p TestNSDictionary0.py
Change dir to: /Users/buildslave/jenkins/workspace/lldb-cmake-matrix/llvm-project/lldb/packages/Python/lldbsuite/test/lang/objc/objc-foundation-dictionary-empty
runCmd: settings set symbols.enable-external-lookup false
output: 

runCmd: settings set plugin.process.gdb-remote.packet-timeout 60
output: 

runCmd: settings set symbols.clang-modules-cache-path "/Users/buildslave/jenkins/workspace/lldb-cmake-matrix/lldb-build/tools/lldb/lldb-test-build.noindex/module-cache-lldb"
output: 

runCmd: settings set use-color false
output: 

warning: (x86_64) /Users/buildslave/jenkins/workspace/lldb-cmake-matrix/lldb-build/tools/lldb/lldb-test-build.noindex/lang/objc/objc-foundation-dictionary-empty/lldbsuite.test.lldbtest.test_dsym/a.out empty dSYM file detected, dSYM was created with an executable with no debug info.
FAIL: LLDB (/Users/buildslave/jenkins/workspace/lldb-cmake-matrix/clang_701_build/bin/clang-7-x86_64) :: test_dsym (lldbsuite.test.lldbtest.TestNSDictionary0)
<bound method SBProcess.Kill of <lldb.SBProcess; proxy of <Swig Object of type 'lldb::SBProcess *' at 0x108a30270> >>: success

runCmd: settings set symbols.enable-external-lookup false
output: 

runCmd: settings set plugin.process.gdb-remote.packet-timeout 60
output: 

runCmd: settings set symbols.clang-modules-cache-path "/Users/buildslave/jenkins/workspace/lldb-cmake-matrix/lldb-build/tools/lldb/lldb-test-build.noindex/module-cache-lldb"
output: 

runCmd: settings set use-color false
output: 

FAIL: LLDB (/Users/buildslave/jenkins/workspace/lldb-cmake-matrix/clang_701_build/bin/clang-7-x86_64) :: test_dwarf (lldbsuite.test.lldbtest.TestNSDictionary0)
<bound method SBProcess.Kill of <lldb.SBProcess; proxy of <Swig Object of type 'lldb::SBProcess *' at 0x108831660> >>: success

UNSUPPORTED: LLDB (/Users/buildslave/jenkins/workspace/lldb-cmake-matrix/clang_701_build/bin/clang-7-x86_64) :: test_dwo (lldbsuite.test.lldbtest.TestNSDictionary0) (test case does not fall in any category of interest for this run) 
UNSUPPORTED: LLDB (/Users/buildslave/jenkins/workspace/lldb-cmake-matrix/clang_701_build/bin/clang-7-x86_64) :: test_gmodules (lldbsuite.test.lldbtest.TestNSDictionary0) (test case does not fall in any category of interest for this run) 
Restore dir to: /Users/buildslave/jenkins/workspace/lldb-cmake-matrix/lldb-build/tools/lldb/lit
======================================================================
FAIL: test_dsym (lldbsuite.test.lldbtest.TestNSDictionary0)
----------------------------------------------------------------------
Traceback (most recent call last):
  File "/Users/buildslave/jenkins/workspace/lldb-cmake-matrix/llvm-project/lldb/packages/Python/lldbsuite/test/lldbtest.py", line 1748, in test_method
    return attrvalue(self)
  File "/Users/buildslave/jenkins/workspace/lldb-cmake-matrix/llvm-project/lldb/packages/Python/lldbsuite/test/lldbinline.py", line 124, in _test
    self.do_test()
  File "/Users/buildslave/jenkins/workspace/lldb-cmake-matrix/llvm-project/lldb/packages/Python/lldbsuite/test/lldbinline.py", line 151, in do_test
    "inline test did not hit a single breakpoint")
AssertionError: False is not True : inline test did not hit a single breakpoint
Config=x86_64-/Users/buildslave/jenkins/workspace/lldb-cmake-matrix/clang_701_build/bin/clang-7
======================================================================
FAIL: test_dwarf (lldbsuite.test.lldbtest.TestNSDictionary0)
----------------------------------------------------------------------
Traceback (most recent call last):
  File "/Users/buildslave/jenkins/workspace/lldb-cmake-matrix/llvm-project/lldb/packages/Python/lldbsuite/test/lldbtest.py", line 1748, in test_method
    return attrvalue(self)
  File "/Users/buildslave/jenkins/workspace/lldb-cmake-matrix/llvm-project/lldb/packages/Python/lldbsuite/test/lldbinline.py", line 124, in _test
    self.do_test()
  File "/Users/buildslave/jenkins/workspace/lldb-cmake-matrix/llvm-project/lldb/packages/Python/lldbsuite/test/lldbinline.py", line 151, in do_test
    "inline test did not hit a single breakpoint")
AssertionError: False is not True : inline test did not hit a single breakpoint
Config=x86_64-/Users/buildslave/jenkins/workspace/lldb-cmake-matrix/clang_701_build/bin/clang-7
----------------------------------------------------------------------
Ran 4 tests in 5.492s

RESULT: FAILED (0 passes, 2 failures, 0 errors, 2 skipped, 0 expected failures, 0 unexpected successes)

********************
FAIL: lldb-Suite :: lang/objc/global_ptrs/TestGlobalObjects.py (1696 of 1705)
******************** TEST 'lldb-Suite :: lang/objc/global_ptrs/TestGlobalObjects.py' FAILED ********************
lldb version 10.0.99 (http://labmaster3.local/git/llvm-project.git revision 1a3dd638c4a9173e53628b497a1aadc31c32eb50)
  clang revision 9e86561878dc470c4023cd627dd39cafc13fdc4d
  llvm revision 9e86561878dc470c4023cd627dd39cafc13fdc4d
LLDB library dir: /Users/buildslave/jenkins/workspace/lldb-cmake-matrix/lldb-build/bin
LLDB import library dir: /Users/buildslave/jenkins/workspace/lldb-cmake-matrix/lldb-build/bin
libstdcxx tests will not be run because: Don't know how to build with libstdcxx on macosx
Skipping following debug info categories: ['dwo']

Session logs for test failures/errors/unexpected successes will go into directory '/Users/buildslave/jenkins/workspace/lldb-cmake-matrix/test/logs'
Command invoked: /Users/buildslave/jenkins/workspace/lldb-cmake-matrix/llvm-project/lldb/test/dotest.py --arch=x86_64 -s /Users/buildslave/jenkins/workspace/lldb-cmake-matrix/lldb-build/lldb-test-traces -S nm -u CXXFLAGS -u CFLAGS --executable /Users/buildslave/jenkins/workspace/lldb-cmake-matrix/lldb-build/./bin/lldb --dsymutil /Users/buildslave/jenkins/workspace/lldb-cmake-matrix/lldb-build/./bin/dsymutil --filecheck /Users/buildslave/jenkins/workspace/lldb-cmake-matrix/lldb-build/./bin/FileCheck -C /Users/buildslave/jenkins/workspace/lldb-cmake-matrix/clang_701_build/bin/clang --codesign-identity lldb_codesign --server /Users/buildslave/jenkins/workspace/lldb-cmake-matrix/lldb-build/./bin/debugserver --arch x86_64 --build-dir /Users/buildslave/jenkins/workspace/lldb-cmake-matrix/lldb-build/lldb-test-build.noindex -s=/Users/buildslave/jenkins/workspace/lldb-cmake-matrix/test/logs -t --env TERM=vt100 --skip-category gmodules --skip-category watchpoint --arch=x86_64 --dwarf-version=5 --env LLVM_LIBS_DIR=/Users/buildslave/jenkins/workspace/lldb-cmake-matrix/lldb-build/./lib --build-dir /Users/buildslave/jenkins/workspace/lldb-cmake-matrix/lldb-build/tools/lldb/lldb-test-build.noindex --module-cache-dir /Users/buildslave/jenkins/workspace/lldb-cmake-matrix/lldb-build/tools/lldb/lldb-test-build.noindex/module-cache-lldb /Users/buildslave/jenkins/workspace/lldb-cmake-matrix/llvm-project/lldb/packages/Python/lldbsuite/test/lang/objc/global_ptrs -p TestGlobalObjects.py
Change dir to: /Users/buildslave/jenkins/workspace/lldb-cmake-matrix/llvm-project/lldb/packages/Python/lldbsuite/test/lang/objc/global_ptrs
runCmd: settings set symbols.enable-external-lookup false
output: 

runCmd: settings set plugin.process.gdb-remote.packet-timeout 60
output: 

runCmd: settings set symbols.clang-modules-cache-path "/Users/buildslave/jenkins/workspace/lldb-cmake-matrix/lldb-build/tools/lldb/lldb-test-build.noindex/module-cache-lldb"
output: 

runCmd: settings set use-color false
output: 

warning: (x86_64) /Users/buildslave/jenkins/workspace/lldb-cmake-matrix/lldb-build/tools/lldb/lldb-test-build.noindex/lang/objc/global_ptrs/TestGlobalObjects.test_with_python_api_dsym/a.out empty dSYM file detected, dSYM was created with an executable with no debug info.
FAIL: LLDB (/Users/buildslave/jenkins/workspace/lldb-cmake-matrix/clang_701_build/bin/clang-7-x86_64) :: test_with_python_api_dsym (TestGlobalObjects.TestObjCGlobalVar)
runCmd: settings set symbols.enable-external-lookup false
output: 

runCmd: settings set plugin.process.gdb-remote.packet-timeout 60
output: 

runCmd: settings set symbols.clang-modules-cache-path "/Users/buildslave/jenkins/workspace/lldb-cmake-matrix/lldb-build/tools/lldb/lldb-test-build.noindex/module-cache-lldb"
output: 

runCmd: settings set use-color false
output: 

FAIL: LLDB (/Users/buildslave/jenkins/workspace/lldb-cmake-matrix/clang_701_build/bin/clang-7-x86_64) :: test_with_python_api_dwarf (TestGlobalObjects.TestObjCGlobalVar)
UNSUPPORTED: LLDB (/Users/buildslave/jenkins/workspace/lldb-cmake-matrix/clang_701_build/bin/clang-7-x86_64) :: test_with_python_api_dwo (TestGlobalObjects.TestObjCGlobalVar) (test case does not fall in any category of interest for this run) 
UNSUPPORTED: LLDB (/Users/buildslave/jenkins/workspace/lldb-cmake-matrix/clang_701_build/bin/clang-7-x86_64) :: test_with_python_api_gmodules (TestGlobalObjects.TestObjCGlobalVar) (test case does not fall in any category of interest for this run) 
Restore dir to: /Users/buildslave/jenkins/workspace/lldb-cmake-matrix/lldb-build/tools/lldb/lit
======================================================================
FAIL: test_with_python_api_dsym (TestGlobalObjects.TestObjCGlobalVar)
   Test that a global ObjC object found before the process is started updates correctly.
----------------------------------------------------------------------
Traceback (most recent call last):
  File "/Users/buildslave/jenkins/workspace/lldb-cmake-matrix/llvm-project/lldb/packages/Python/lldbsuite/test/lldbtest.py", line 1748, in test_method
    return attrvalue(self)
  File "/Users/buildslave/jenkins/workspace/lldb-cmake-matrix/llvm-project/lldb/packages/Python/lldbsuite/test/lang/objc/global_ptrs/TestGlobalObjects.py", line 36, in test_with_python_api
    self.assertTrue(g_obj_ptr.GetError().Success(), "Made the g_obj_ptr")
AssertionError: False is not True : Made the g_obj_ptr
Config=x86_64-/Users/buildslave/jenkins/workspace/lldb-cmake-matrix/clang_701_build/bin/clang-7
======================================================================
FAIL: test_with_python_api_dwarf (TestGlobalObjects.TestObjCGlobalVar)
   Test that a global ObjC object found before the process is started updates correctly.
----------------------------------------------------------------------
Traceback (most recent call last):
  File "/Users/buildslave/jenkins/workspace/lldb-cmake-matrix/llvm-project/lldb/packages/Python/lldbsuite/test/lldbtest.py", line 1748, in test_method
    return attrvalue(self)
  File "/Users/buildslave/jenkins/workspace/lldb-cmake-matrix/llvm-project/lldb/packages/Python/lldbsuite/test/lang/objc/global_ptrs/TestGlobalObjects.py", line 36, in test_with_python_api
    self.assertTrue(g_obj_ptr.GetError().Success(), "Made the g_obj_ptr")
AssertionError: False is not True : Made the g_obj_ptr
Config=x86_64-/Users/buildslave/jenkins/workspace/lldb-cmake-matrix/clang_701_build/bin/clang-7
----------------------------------------------------------------------
Ran 4 tests in 4.371s

RESULT: FAILED (0 passes, 2 failures, 0 errors, 2 skipped, 0 expected failures, 0 unexpected successes)

********************
PASS: lldb-Suite :: api/multithreaded/TestMultithreaded.py (1697 of 1705)
PASS: lldb-Suite :: lang/objc/foundation/TestSymbolTable.py (1698 of 1705)
FAIL: lldb-Suite :: commands/expression/multiline-completion/TestMultilineCompletion.py (1699 of 1705)
******************** TEST 'lldb-Suite :: commands/expression/multiline-completion/TestMultilineCompletion.py' FAILED ********************
lldb version 10.0.99 (http://labmaster3.local/git/llvm-project.git revision 1a3dd638c4a9173e53628b497a1aadc31c32eb50)
  clang revision 9e86561878dc470c4023cd627dd39cafc13fdc4d
  llvm revision 9e86561878dc470c4023cd627dd39cafc13fdc4d
LLDB library dir: /Users/buildslave/jenkins/workspace/lldb-cmake-matrix/lldb-build/bin
LLDB import library dir: /Users/buildslave/jenkins/workspace/lldb-cmake-matrix/lldb-build/bin
libstdcxx tests will not be run because: Don't know how to build with libstdcxx on macosx
Skipping following debug info categories: ['dwo']
(lldb) settings set symbols.enable-external-lookup false
(lldb) settings set plugin.process.gdb-remote.packet-timeout 60
(lldb) settings set symbols.clang-modules-cache-path "/Users/buildslave/jenkins/workspace/lldb-cmake-matrix/lldb-build/tools/lldb/lldb-test-build.noindex/module-cache-lldb"
(lldb) settings set use-color false
(lldb) target create "/Users/buildslave/jenkins/workspace/lldb-cmake-matrix/lldb-build/tools/lldb/lldb-test-build.noindex/commands/expression/multiline-completion/TestMultilineCompletion.test_basic_completion/a.out"
warning: (x86_64) /Users/buildslave/jenkins/workspace/lldb-cmake-matrix/lldb-build/tools/lldb/lldb-test-build.noindex/commands/expression/multiline-completion/TestMultilineCompletion.test_basic_completion/a.out empty dSYM file detected, dSYM was created with an executable with no debug info.
Current executable set to '/Users/buildslave/jenkins/workspace/lldb-cmake-matrix/lldb-build/tools/lldb/lldb-test-build.noindex/commands/expression/multiline-completion/TestMultilineCompletion.test_basic_completion/a.out' (x86_64).
(lldb) b main
b main
Breakpoint 1: where = a.out`main, address = 0x0000000100000f90
(lldb) run
run
Process 70406 launched: '/Users/buildslave/jenkins/workspace/lldb-cmake-matrix/lldb-build/tools/lldb/lldb-test-build.noindex/commands/expression/multiline-completion/TestMultilineCompletion.test_basic_completion/a.out' (x86_64)
Process 70406 stopped
* thread #1, queue = 'com.apple.main-thread', stop reason = breakpoint 1.1
    frame #0: 0x0000000100000f90 a.out`main
a.out`main:
->  0x100000f90 <+0>:  pushq  %rbp
    0x100000f91 <+1>:  movq   %rsp, %rbp
    0x100000f94 <+4>:  movl   $0x0, -0x4(%rbp)
    0x100000f9b <+11>: movl   %edi, -0x8(%rbp)
(lldb) expr
expr
Enter expressions, then terminate with an empty line to evaluate:
to_	  1:    1: to_	to_settings set interpreter.prompt-on-quit false
quit
settings set interpreter.prompt-on-quit false  1: to_settings set interpreter.prompt-on-quit false 
  2:    2: quit  2: quit 
  3:    3: 
Session logs for test failures/errors/unexpected successes will go into directory '/Users/buildslave/jenkins/workspace/lldb-cmake-matrix/test/logs'
Command invoked: /Users/buildslave/jenkins/workspace/lldb-cmake-matrix/llvm-project/lldb/test/dotest.py --arch=x86_64 -s /Users/buildslave/jenkins/workspace/lldb-cmake-matrix/lldb-build/lldb-test-traces -S nm -u CXXFLAGS -u CFLAGS --executable /Users/buildslave/jenkins/workspace/lldb-cmake-matrix/lldb-build/./bin/lldb --dsymutil /Users/buildslave/jenkins/workspace/lldb-cmake-matrix/lldb-build/./bin/dsymutil --filecheck /Users/buildslave/jenkins/workspace/lldb-cmake-matrix/lldb-build/./bin/FileCheck -C /Users/buildslave/jenkins/workspace/lldb-cmake-matrix/clang_701_build/bin/clang --codesign-identity lldb_codesign --server /Users/buildslave/jenkins/workspace/lldb-cmake-matrix/lldb-build/./bin/debugserver --arch x86_64 --build-dir /Users/buildslave/jenkins/workspace/lldb-cmake-matrix/lldb-build/lldb-test-build.noindex -s=/Users/buildslave/jenkins/workspace/lldb-cmake-matrix/test/logs -t --env TERM=vt100 --skip-category gmodules --skip-category watchpoint --arch=x86_64 --dwarf-version=5 --env LLVM_LIBS_DIR=/Users/buildslave/jenkins/workspace/lldb-cmake-matrix/lldb-build/./lib --build-dir /Users/buildslave/jenkins/workspace/lldb-cmake-matrix/lldb-build/tools/lldb/lldb-test-build.noindex --module-cache-dir /Users/buildslave/jenkins/workspace/lldb-cmake-matrix/lldb-build/tools/lldb/lldb-test-build.noindex/module-cache-lldb /Users/buildslave/jenkins/workspace/lldb-cmake-matrix/llvm-project/lldb/packages/Python/lldbsuite/test/commands/expression/multiline-completion -p TestMultilineCompletion.py
Change dir to: /Users/buildslave/jenkins/workspace/lldb-cmake-matrix/llvm-project/lldb/packages/Python/lldbsuite/test/commands/expression/multiline-completion
runCmd: settings set symbols.enable-external-lookup false
output: 

runCmd: settings set plugin.process.gdb-remote.packet-timeout 60
output: 

runCmd: settings set symbols.clang-modules-cache-path "/Users/buildslave/jenkins/workspace/lldb-cmake-matrix/lldb-build/tools/lldb/lldb-test-build.noindex/module-cache-lldb"
output: 

runCmd: settings set use-color false
output: 

FAIL: LLDB (/Users/buildslave/jenkins/workspace/lldb-cmake-matrix/clang_701_build/bin/clang-7-x86_64) :: test_basic_completion (TestMultilineCompletion.MultilineCompletionTest)
tearing down the child process....

Restore dir to: /Users/buildslave/jenkins/workspace/lldb-cmake-matrix/lldb-build/tools/lldb/lit
======================================================================
ERROR: test_basic_completion (TestMultilineCompletion.MultilineCompletionTest)
   Test that we can complete a simple multiline expression
----------------------------------------------------------------------
Traceback (most recent call last):
  File "/Users/buildslave/jenkins/workspace/lldb-cmake-matrix/llvm-project/lldb/packages/Python/lldbsuite/test/commands/expression/multiline-completion/TestMultilineCompletion.py", line 25, in test_basic_completion
    self.child.expect_exact("to_complete")
  File "/Users/buildslave/jenkins/workspace/lldb-cmake-matrix/llvm-project/lldb/third_party/Python/module/pexpect-4.6/pexpect/spawnbase.py", line 418, in expect_exact
    return exp.expect_loop(timeout)
  File "/Users/buildslave/jenkins/workspace/lldb-cmake-matrix/llvm-project/lldb/third_party/Python/module/pexpect-4.6/pexpect/expect.py", line 119, in expect_loop
    return self.timeout(e)
  File "/Users/buildslave/jenkins/workspace/lldb-cmake-matrix/llvm-project/lldb/third_party/Python/module/pexpect-4.6/pexpect/expect.py", line 82, in timeout
    raise TIMEOUT(msg)
TIMEOUT: Timeout exceeded.
<pexpect.pty_spawn.spawn object at 0x110fd8f90>
command: /Users/buildslave/jenkins/workspace/lldb-cmake-matrix/lldb-build/bin/lldb
args: ['/Users/buildslave/jenkins/workspace/lldb-cmake-matrix/lldb-build/bin/lldb', '--no-lldbinit', '--no-use-colors', '-O', 'settings set symbols.enable-external-lookup false', '-O', 'settings set plugin.process.gdb-remote.packet-timeout 60', '-O', 'settings set symbols.clang-modules-cache-path "/Users/buildslave/jenkins/workspace/lldb-cmake-matrix/lldb-build/tools/lldb/lldb-test-build.noindex/module-cache-lldb"', '-O', 'settings set use-color false', '--file', '/Users/buildslave/jenkins/workspace/lldb-cmake-matrix/lldb-build/tools/lldb/lldb-test-build.noindex/commands/expression/multiline-completion/TestMultilineCompletion.test_basic_completion/a.out']
buffer (last 100 chars): ':\r\n\x1b[1G\x1b[J  1:  \x1b[1G  1: to_\tto_\x07'
before (last 100 chars): ':\r\n\x1b[1G\x1b[J  1:  \x1b[1G  1: to_\tto_\x07'
after: <class 'pexpect.exceptions.TIMEOUT'>
match: None
match_index: None
exitstatus: None
flag_eof: False
pid: 70141
child_fd: 6
closed: False
timeout: 30
delimiter: <class 'pexpect.exceptions.EOF'>
logfile: <open file '<stdout>', mode 'w' at 0x109f42150>
logfile_read: None
logfile_send: None
maxread: 2000
ignorecase: False
searchwindowsize: None
delaybeforesend: 0.05
delayafterclose: 0.1
delayafterterminate: 0.1
searcher: searcher_string:
    0: 'to_complete'
Config=x86_64-/Users/buildslave/jenkins/workspace/lldb-cmake-matrix/clang_701_build/bin/clang-7
----------------------------------------------------------------------
Ran 1 test in 61.485s

RESULT: FAILED (0 passes, 0 failures, 1 errors, 0 skipped, 0 expected failures, 0 unexpected successes)

********************
FAIL: lldb-Suite :: functionalities/inferior-crashing/TestInferiorCrashingStep.py (1700 of 1705)
******************** TEST 'lldb-Suite :: functionalities/inferior-crashing/TestInferiorCrashingStep.py' FAILED ********************
lldb version 10.0.99 (http://labmaster3.local/git/llvm-project.git revision 1a3dd638c4a9173e53628b497a1aadc31c32eb50)
  clang revision 9e86561878dc470c4023cd627dd39cafc13fdc4d
  llvm revision 9e86561878dc470c4023cd627dd39cafc13fdc4d
LLDB library dir: /Users/buildslave/jenkins/workspace/lldb-cmake-matrix/lldb-build/bin
LLDB import library dir: /Users/buildslave/jenkins/workspace/lldb-cmake-matrix/lldb-build/bin
libstdcxx tests will not be run because: Don't know how to build with libstdcxx on macosx
Skipping following debug info categories: ['dwo']
Stack trace for thread id=0x25aa721 name=None queue=com.apple.main-thread stop reason=exception
  frame #0: 0x00000108dbbf50 a.out`main + 48
  frame #1: 0x007fff726a0085 libdyld.dylib`start + 1
  frame #2: 0x007fff726a0085 libdyld.dylib`start + 1
Stack trace for thread id=0x25aa7d8 name=None queue=com.apple.main-thread stop reason=exception
  frame #0: 0x0000010a9e4f50 a.out`main + 48
  frame #1: 0x007fff726a0085 libdyld.dylib`start + 1

Session logs for test failures/errors/unexpected successes will go into directory '/Users/buildslave/jenkins/workspace/lldb-cmake-matrix/test/logs'
Command invoked: /Users/buildslave/jenkins/workspace/lldb-cmake-matrix/llvm-project/lldb/test/dotest.py --arch=x86_64 -s /Users/buildslave/jenkins/workspace/lldb-cmake-matrix/lldb-build/lldb-test-traces -S nm -u CXXFLAGS -u CFLAGS --executable /Users/buildslave/jenkins/workspace/lldb-cmake-matrix/lldb-build/./bin/lldb --dsymutil /Users/buildslave/jenkins/workspace/lldb-cmake-matrix/lldb-build/./bin/dsymutil --filecheck /Users/buildslave/jenkins/workspace/lldb-cmake-matrix/lldb-build/./bin/FileCheck -C /Users/buildslave/jenkins/workspace/lldb-cmake-matrix/clang_701_build/bin/clang --codesign-identity lldb_codesign --server /Users/buildslave/jenkins/workspace/lldb-cmake-matrix/lldb-build/./bin/debugserver --arch x86_64 --build-dir /Users/buildslave/jenkins/workspace/lldb-cmake-matrix/lldb-build/lldb-test-build.noindex -s=/Users/buildslave/jenkins/workspace/lldb-cmake-matrix/test/logs -t --env TERM=vt100 --skip-category gmodules --skip-category watchpoint --arch=x86_64 --dwarf-version=5 --env LLVM_LIBS_DIR=/Users/buildslave/jenkins/workspace/lldb-cmake-matrix/lldb-build/./lib --build-dir /Users/buildslave/jenkins/workspace/lldb-cmake-matrix/lldb-build/tools/lldb/lldb-test-build.noindex --module-cache-dir /Users/buildslave/jenkins/workspace/lldb-cmake-matrix/lldb-build/tools/lldb/lldb-test-build.noindex/module-cache-lldb /Users/buildslave/jenkins/workspace/lldb-cmake-matrix/llvm-project/lldb/packages/Python/lldbsuite/test/functionalities/inferior-crashing -p TestInferiorCrashingStep.py
Change dir to: /Users/buildslave/jenkins/workspace/lldb-cmake-matrix/llvm-project/lldb/packages/Python/lldbsuite/test/functionalities/inferior-crashing
runCmd: settings set symbols.enable-external-lookup false
output: 

runCmd: settings set plugin.process.gdb-remote.packet-timeout 60
output: 

runCmd: settings set symbols.clang-modules-cache-path "/Users/buildslave/jenkins/workspace/lldb-cmake-matrix/lldb-build/tools/lldb/lldb-test-build.noindex/module-cache-lldb"
output: 

runCmd: settings set use-color false
output: 

warning: (x86_64) /Users/buildslave/jenkins/workspace/lldb-cmake-matrix/lldb-build/tools/lldb/lldb-test-build.noindex/functionalities/inferior-crashing/TestInferiorCrashingStep.test_inferior_crashing_dsym/a.out empty dSYM file detected, dSYM was created with an executable with no debug info.
runCmd: file /Users/buildslave/jenkins/workspace/lldb-cmake-matrix/lldb-build/tools/lldb/lldb-test-build.noindex/functionalities/inferior-crashing/TestInferiorCrashingStep.test_inferior_crashing_dsym/a.out
output: Current executable set to '/Users/buildslave/jenkins/workspace/lldb-cmake-matrix/lldb-build/tools/lldb/lldb-test-build.noindex/functionalities/inferior-crashing/TestInferiorCrashingStep.test_inferior_crashing_dsym/a.out' (x86_64).


runCmd: run
output: Process 94397 stopped
* thread #1, queue = 'com.apple.main-thread', stop reason = EXC_BAD_ACCESS (code=1, address=0x0)
    frame #0: 0x0000000100000f50 a.out`main + 48
a.out`main:
->  0x100000f50 <+48>: movl   (%rsi), %esi
    0x100000f52 <+50>: leaq   0x4e(%rip), %rdi          ; "Now crash %d\n"
    0x100000f59 <+57>: movl   %eax, -0x1c(%rbp)
    0x100000f5c <+60>: movb   $0x0, %al

Process 94397 launched: '/Users/buildslave/jenkins/workspace/lldb-cmake-matrix/lldb-build/tools/lldb/lldb-test-build.noindex/functionalities/inferior-crashing/TestInferiorCrashingStep.test_inferior_crashing_dsym/a.out' (x86_64)


runCmd: thread list
output: Process 94397 stopped
* thread #1: tid = 0x25aa1c4, 0x0000000100000f50 a.out`main + 48, queue = 'com.apple.main-thread', stop reason = EXC_BAD_ACCESS (code=1, address=0x0)


Expecting sub string: stopped
Matched

Expecting sub string: stop reason = EXC_BAD_ACCESS
Matched

runCmd: thread backtrace all
output: * thread #1, queue = 'com.apple.main-thread', stop reason = EXC_BAD_ACCESS (code=1, address=0x0)
  * frame #0: 0x0000000100000f50 a.out`main + 48
    frame #1: 0x00007fff726a0085 libdyld.dylib`start + 1
    frame #2: 0x00007fff726a0085 libdyld.dylib`start + 1


Expecting sub string: stop reason = EXC_BAD_ACCESS
Matched

Expecting sub string: main.c:16
Not matched

FAIL: LLDB (/Users/buildslave/jenkins/workspace/lldb-cmake-matrix/clang_701_build/bin/clang-7-x86_64) :: test_inferior_crashing_dsym (TestInferiorCrashingStep.CrashingInferiorStepTestCase)
<bound method SBProcess.Kill of <lldb.SBProcess; proxy of <Swig Object of type 'lldb::SBProcess *' at 0x10e1cb4e0> >>: success

runCmd: settings set symbols.enable-external-lookup false
output: 

runCmd: settings set plugin.process.gdb-remote.packet-timeout 60
output: 

runCmd: settings set symbols.clang-modules-cache-path "/Users/buildslave/jenkins/workspace/lldb-cmake-matrix/lldb-build/tools/lldb/lldb-test-build.noindex/module-cache-lldb"
output: 

runCmd: settings set use-color false
output: 

runCmd: file /Users/buildslave/jenkins/workspace/lldb-cmake-matrix/lldb-build/tools/lldb/lldb-test-build.noindex/functionalities/inferior-crashing/TestInferiorCrashingStep.test_inferior_crashing_dwarf/a.out
output: Current executable set to '/Users/buildslave/jenkins/workspace/lldb-cmake-matrix/lldb-build/tools/lldb/lldb-test-build.noindex/functionalities/inferior-crashing/TestInferiorCrashingStep.test_inferior_crashing_dwarf/a.out' (x86_64).


runCmd: run
output: Process 94608 stopped
* thread #1, queue = 'com.apple.main-thread', stop reason = EXC_BAD_ACCESS (code=1, address=0x0)
    frame #0: 0x0000000100000f50 a.out`main + 48
a.out`main:
->  0x100000f50 <+48>: movl   (%rsi), %esi
    0x100000f52 <+50>: leaq   0x4e(%rip), %rdi          ; "Now crash %d\n"
    0x100000f59 <+57>: movl   %eax, -0x1c(%rbp)
    0x100000f5c <+60>: movb   $0x0, %al

Process 94608 launched: '/Users/buildslave/jenkins/workspace/lldb-cmake-matrix/lldb-build/tools/lldb/lldb-test-build.noindex/functionalities/inferior-crashing/TestInferiorCrashingStep.test_inferior_crashing_dwarf/a.out' (x86_64)


runCmd: thread list
output: Process 94608 stopped
* thread #1: tid = 0x25aa302, 0x0000000100000f50 a.out`main + 48, queue = 'com.apple.main-thread', stop reason = EXC_BAD_ACCESS (code=1, address=0x0)


Expecting sub string: stopped
Matched

Expecting sub string: stop reason = EXC_BAD_ACCESS
Matched

runCmd: thread backtrace all
output: * thread #1, queue = 'com.apple.main-thread', stop reason = EXC_BAD_ACCESS (code=1, address=0x0)
  * frame #0: 0x0000000100000f50 a.out`main + 48
    frame #1: 0x00007fff726a0085 libdyld.dylib`start + 1


Expecting sub string: stop reason = EXC_BAD_ACCESS
Matched

Expecting sub string: main.c:16
Not matched

FAIL: LLDB (/Users/buildslave/jenkins/workspace/lldb-cmake-matrix/clang_701_build/bin/clang-7-x86_64) :: test_inferior_crashing_dwarf (TestInferiorCrashingStep.CrashingInferiorStepTestCase)
<bound method SBProcess.Kill of <lldb.SBProcess; proxy of <Swig Object of type 'lldb::SBProcess *' at 0x10e1cb510> >>: success

UNSUPPORTED: LLDB (/Users/buildslave/jenkins/workspace/lldb-cmake-matrix/clang_701_build/bin/clang-7-x86_64) :: test_inferior_crashing_dwo (TestInferiorCrashingStep.CrashingInferiorStepTestCase) (test case does not fall in any category of interest for this run) 
runCmd: settings set symbols.enable-external-lookup false
output: 

runCmd: settings set plugin.process.gdb-remote.packet-timeout 60
output: 

runCmd: settings set symbols.clang-modules-cache-path "/Users/buildslave/jenkins/workspace/lldb-cmake-matrix/lldb-build/tools/lldb/lldb-test-build.noindex/module-cache-lldb"
output: 

runCmd: settings set use-color false
output: 

warning: (x86_64) /Users/buildslave/jenkins/workspace/lldb-cmake-matrix/lldb-build/tools/lldb/lldb-test-build.noindex/functionalities/inferior-crashing/TestInferiorCrashingStep.test_inferior_crashing_expr_dsym/a.out empty dSYM file detected, dSYM was created with an executable with no debug info.
runCmd: file /Users/buildslave/jenkins/workspace/lldb-cmake-matrix/lldb-build/tools/lldb/lldb-test-build.noindex/functionalities/inferior-crashing/TestInferiorCrashingStep.test_inferior_crashing_expr_dsym/a.out
output: Current executable set to '/Users/buildslave/jenkins/workspace/lldb-cmake-matrix/lldb-build/tools/lldb/lldb-test-build.noindex/functionalities/inferior-crashing/TestInferiorCrashingStep.test_inferior_crashing_expr_dsym/a.out' (x86_64).


runCmd: run
output: Process 94898 stopped
* thread #1, queue = 'com.apple.main-thread', stop reason = EXC_BAD_ACCESS (code=1, address=0x0)
    frame #0: 0x0000000100000f50 a.out`main + 48
a.out`main:
->  0x100000f50 <+48>: movl   (%rsi), %esi
    0x100000f52 <+50>: leaq   0x4e(%rip), %rdi          ; "Now crash %d\n"
    0x100000f59 <+57>: movl   %eax, -0x1c(%rbp)
    0x100000f5c <+60>: movb   $0x0, %al

Process 94898 launched: '/Users/buildslave/jenkins/workspace/lldb-cmake-matrix/lldb-build/tools/lldb/lldb-test-build.noindex/functionalities/inferior-crashing/TestInferiorCrashingStep.test_inferior_crashing_expr_dsym/a.out' (x86_64)


runCmd: p argc
runCmd failed!
error: use of undeclared identifier 'argc'


FAIL: LLDB (/Users/buildslave/jenkins/workspace/lldb-cmake-matrix/clang_701_build/bin/clang-7-x86_64) :: test_inferior_crashing_expr_dsym (TestInferiorCrashingStep.CrashingInferiorStepTestCase)
<bound method SBProcess.Kill of <lldb.SBProcess; proxy of <Swig Object of type 'lldb::SBProcess *' at 0x10e1cb4b0> >>: success

runCmd: settings set symbols.enable-external-lookup false
output: 

runCmd: settings set plugin.process.gdb-remote.packet-timeout 60
output: 

runCmd: settings set symbols.clang-modules-cache-path "/Users/buildslave/jenkins/workspace/lldb-cmake-matrix/lldb-build/tools/lldb/lldb-test-build.noindex/module-cache-lldb"
output: 

runCmd: settings set use-color false
output: 

runCmd: file /Users/buildslave/jenkins/workspace/lldb-cmake-matrix/lldb-build/tools/lldb/lldb-test-build.noindex/functionalities/inferior-crashing/TestInferiorCrashingStep.test_inferior_crashing_expr_dwarf/a.out
output: Current executable set to '/Users/buildslave/jenkins/workspace/lldb-cmake-matrix/lldb-build/tools/lldb/lldb-test-build.noindex/functionalities/inferior-crashing/TestInferiorCrashingStep.test_inferior_crashing_expr_dwarf/a.out' (x86_64).


runCmd: run
output: Process 95039 stopped
* thread #1, queue = 'com.apple.main-thread', stop reason = EXC_BAD_ACCESS (code=1, address=0x0)
    frame #0: 0x0000000100000f50 a.out`main + 48
a.out`main:
->  0x100000f50 <+48>: movl   (%rsi), %esi
    0x100000f52 <+50>: leaq   0x4e(%rip), %rdi          ; "Now crash %d\n"
    0x100000f59 <+57>: movl   %eax, -0x1c(%rbp)
    0x100000f5c <+60>: movb   $0x0, %al

Process 95039 launched: '/Users/buildslave/jenkins/workspace/lldb-cmake-matrix/lldb-build/tools/lldb/lldb-test-build.noindex/functionalities/inferior-crashing/TestInferiorCrashingStep.test_inferior_crashing_expr_dwarf/a.out' (x86_64)


runCmd: p argc
runCmd failed!
error: use of undeclared identifier 'argc'


FAIL: LLDB (/Users/buildslave/jenkins/workspace/lldb-cmake-matrix/clang_701_build/bin/clang-7-x86_64) :: test_inferior_crashing_expr_dwarf (TestInferiorCrashingStep.CrashingInferiorStepTestCase)
<bound method SBProcess.Kill of <lldb.SBProcess; proxy of <Swig Object of type 'lldb::SBProcess *' at 0x10e1cb360> >>: success

UNSUPPORTED: LLDB (/Users/buildslave/jenkins/workspace/lldb-cmake-matrix/clang_701_build/bin/clang-7-x86_64) :: test_inferior_crashing_expr_dwo (TestInferiorCrashingStep.CrashingInferiorStepTestCase) (test case does not fall in any category of interest for this run) 
UNSUPPORTED: LLDB (/Users/buildslave/jenkins/workspace/lldb-cmake-matrix/clang_701_build/bin/clang-7-x86_64) :: test_inferior_crashing_expr_gmodules (TestInferiorCrashingStep.CrashingInferiorStepTestCase) (test case does not fall in any category of interest for this run) 
runCmd: settings set symbols.enable-external-lookup false
output: 

runCmd: settings set plugin.process.gdb-remote.packet-timeout 60
output: 

runCmd: settings set symbols.clang-modules-cache-path "/Users/buildslave/jenkins/workspace/lldb-cmake-matrix/lldb-build/tools/lldb/lldb-test-build.noindex/module-cache-lldb"
output: 

runCmd: settings set use-color false
output: 

warning: (x86_64) /Users/buildslave/jenkins/workspace/lldb-cmake-matrix/lldb-build/tools/lldb/lldb-test-build.noindex/functionalities/inferior-crashing/TestInferiorCrashingStep.test_inferior_crashing_expr_step_and_expr_dsym/a.out empty dSYM file detected, dSYM was created with an executable with no debug info.
runCmd: file /Users/buildslave/jenkins/workspace/lldb-cmake-matrix/lldb-build/tools/lldb/lldb-test-build.noindex/functionalities/inferior-crashing/TestInferiorCrashingStep.test_inferior_crashing_expr_step_and_expr_dsym/a.out
output: Current executable set to '/Users/buildslave/jenkins/workspace/lldb-cmake-matrix/lldb-build/tools/lldb/lldb-test-build.noindex/functionalities/inferior-crashing/TestInferiorCrashingStep.test_inferior_crashing_expr_step_and_expr_dsym/a.out' (x86_64).


runCmd: run
output: Process 95176 stopped
* thread #1, queue = 'com.apple.main-thread', stop reason = EXC_BAD_ACCESS (code=1, address=0x0)
    frame #0: 0x0000000100000f50 a.out`main + 48
a.out`main:
->  0x100000f50 <+48>: movl   (%rsi), %esi
    0x100000f52 <+50>: leaq   0x4e(%rip), %rdi          ; "Now crash %d\n"
    0x100000f59 <+57>: movl   %eax, -0x1c(%rbp)
    0x100000f5c <+60>: movb   $0x0, %al

Process 95176 launched: '/Users/buildslave/jenkins/workspace/lldb-cmake-matrix/lldb-build/tools/lldb/lldb-test-build.noindex/functionalities/inferior-crashing/TestInferiorCrashingStep.test_inferior_crashing_expr_step_and_expr_dsym/a.out' (x86_64)


runCmd: p argv[0]
runCmd failed!
error: use of undeclared identifier 'argv'


FAIL: LLDB (/Users/buildslave/jenkins/workspace/lldb-cmake-matrix/clang_701_build/bin/clang-7-x86_64) :: test_inferior_crashing_expr_step_and_expr_dsym (TestInferiorCrashingStep.CrashingInferiorStepTestCase)
<bound method SBProcess.Kill of <lldb.SBProcess; proxy of <Swig Object of type 'lldb::SBProcess *' at 0x10e1cb4e0> >>: success

runCmd: settings set symbols.enable-external-lookup false
output: 

runCmd: settings set plugin.process.gdb-remote.packet-timeout 60
output: 

runCmd: settings set symbols.clang-modules-cache-path "/Users/buildslave/jenkins/workspace/lldb-cmake-matrix/lldb-build/tools/lldb/lldb-test-build.noindex/module-cache-lldb"
output: 

runCmd: settings set use-color false
output: 

runCmd: file /Users/buildslave/jenkins/workspace/lldb-cmake-matrix/lldb-build/tools/lldb/lldb-test-build.noindex/functionalities/inferior-crashing/TestInferiorCrashingStep.test_inferior_crashing_expr_step_and_expr_dwarf/a.out
output: Current executable set to '/Users/buildslave/jenkins/workspace/lldb-cmake-matrix/lldb-build/tools/lldb/lldb-test-build.noindex/functionalities/inferior-crashing/TestInferiorCrashingStep.test_inferior_crashing_expr_step_and_expr_dwarf/a.out' (x86_64).


runCmd: run
output: Process 95246 stopped
* thread #1, queue = 'com.apple.main-thread', stop reason = EXC_BAD_ACCESS (code=1, address=0x0)
    frame #0: 0x0000000100000f50 a.out`main + 48
a.out`main:
->  0x100000f50 <+48>: movl   (%rsi), %esi
    0x100000f52 <+50>: leaq   0x4e(%rip), %rdi          ; "Now crash %d\n"
    0x100000f59 <+57>: movl   %eax, -0x1c(%rbp)
    0x100000f5c <+60>: movb   $0x0, %al

Process 95246 launched: '/Users/buildslave/jenkins/workspace/lldb-cmake-matrix/lldb-build/tools/lldb/lldb-test-build.noindex/functionalities/inferior-crashing/TestInferiorCrashingStep.test_inferior_crashing_expr_step_and_expr_dwarf/a.out' (x86_64)


runCmd: p argv[0]
runCmd failed!
error: use of undeclared identifier 'argv'


FAIL: LLDB (/Users/buildslave/jenkins/workspace/lldb-cmake-matrix/clang_701_build/bin/clang-7-x86_64) :: test_inferior_crashing_expr_step_and_expr_dwarf (TestInferiorCrashingStep.CrashingInferiorStepTestCase)
<bound method SBProcess.Kill of <lldb.SBProcess; proxy of <Swig Object of type 'lldb::SBProcess *' at 0x10e1cb510> >>: success

UNSUPPORTED: LLDB (/Users/buildslave/jenkins/workspace/lldb-cmake-matrix/clang_701_build/bin/clang-7-x86_64) :: test_inferior_crashing_expr_step_and_expr_dwo (TestInferiorCrashingStep.CrashingInferiorStepTestCase) (test case does not fall in any category of interest for this run) 
UNSUPPORTED: LLDB (/Users/buildslave/jenkins/workspace/lldb-cmake-matrix/clang_701_build/bin/clang-7-x86_64) :: test_inferior_crashing_expr_step_and_expr_gmodules (TestInferiorCrashingStep.CrashingInferiorStepTestCase) (test case does not fall in any category of interest for this run) 
UNSUPPORTED: LLDB (/Users/buildslave/jenkins/workspace/lldb-cmake-matrix/clang_701_build/bin/clang-7-x86_64) :: test_inferior_crashing_gmodules (TestInferiorCrashingStep.CrashingInferiorStepTestCase) (test case does not fall in any category of interest for this run) 
runCmd: settings set symbols.enable-external-lookup false
output: 

runCmd: settings set plugin.process.gdb-remote.packet-timeout 60
output: 

runCmd: settings set symbols.clang-modules-cache-path "/Users/buildslave/jenkins/workspace/lldb-cmake-matrix/lldb-build/tools/lldb/lldb-test-build.noindex/module-cache-lldb"
output: 

runCmd: settings set use-color false
output: 

warning: (x86_64) /Users/buildslave/jenkins/workspace/lldb-cmake-matrix/lldb-build/tools/lldb/lldb-test-build.noindex/functionalities/inferior-crashing/TestInferiorCrashingStep.test_inferior_crashing_python_dsym/a.out empty dSYM file detected, dSYM was created with an executable with no debug info.
<bound method SBProcess.Kill of <lldb.SBProcess; proxy of <Swig Object of type 'lldb::SBProcess *' at 0x10e1cb4e0> >>: success

PASS: LLDB (/Users/buildslave/jenkins/workspace/lldb-cmake-matrix/clang_701_build/bin/clang-7-x86_64) :: test_inferior_crashing_python_dsym (TestInferiorCrashingStep.CrashingInferiorStepTestCase)
runCmd: settings set symbols.enable-external-lookup false
output: 

runCmd: settings set plugin.process.gdb-remote.packet-timeout 60
output: 

runCmd: settings set symbols.clang-modules-cache-path "/Users/buildslave/jenkins/workspace/lldb-cmake-matrix/lldb-build/tools/lldb/lldb-test-build.noindex/module-cache-lldb"
output: 

runCmd: settings set use-color false
output: 

<bound method SBProcess.Kill of <lldb.SBProcess; proxy of <Swig Object of type 'lldb::SBProcess *' at 0x110b97660> >>: success

PASS: LLDB (/Users/buildslave/jenkins/workspace/lldb-cmake-matrix/clang_701_build/bin/clang-7-x86_64) :: test_inferior_crashing_python_dwarf (TestInferiorCrashingStep.CrashingInferiorStepTestCase)
UNSUPPORTED: LLDB (/Users/buildslave/jenkins/workspace/lldb-cmake-matrix/clang_701_build/bin/clang-7-x86_64) :: test_inferior_crashing_python_dwo (TestInferiorCrashingStep.CrashingInferiorStepTestCase) (test case does not fall in any category of interest for this run) 
UNSUPPORTED: LLDB (/Users/buildslave/jenkins/workspace/lldb-cmake-matrix/clang_701_build/bin/clang-7-x86_64) :: test_inferior_crashing_python_gmodules (TestInferiorCrashingStep.CrashingInferiorStepTestCase) (test case does not fall in any category of interest for this run) 
runCmd: settings set symbols.enable-external-lookup false
output: 

runCmd: settings set plugin.process.gdb-remote.packet-timeout 60
output: 

runCmd: settings set symbols.clang-modules-cache-path "/Users/buildslave/jenkins/workspace/lldb-cmake-matrix/lldb-build/tools/lldb/lldb-test-build.noindex/module-cache-lldb"
output: 

runCmd: settings set use-color false
output: 

warning: (x86_64) /Users/buildslave/jenkins/workspace/lldb-cmake-matrix/lldb-build/tools/lldb/lldb-test-build.noindex/functionalities/inferior-crashing/TestInferiorCrashingStep.test_inferior_crashing_register_dsym/a.out empty dSYM file detected, dSYM was created with an executable with no debug info.
runCmd: file /Users/buildslave/jenkins/workspace/lldb-cmake-matrix/lldb-build/tools/lldb/lldb-test-build.noindex/functionalities/inferior-crashing/TestInferiorCrashingStep.test_inferior_crashing_register_dsym/a.out
output: Current executable set to '/Users/buildslave/jenkins/workspace/lldb-cmake-matrix/lldb-build/tools/lldb/lldb-test-build.noindex/functionalities/inferior-crashing/TestInferiorCrashingStep.test_inferior_crashing_register_dsym/a.out' (x86_64).


runCmd: run
output: Process 95526 stopped
* thread #1, queue = 'com.apple.main-thread', stop reason = EXC_BAD_ACCESS (code=1, address=0x0)
    frame #0: 0x0000000100000f50 a.out`main + 48
a.out`main:
->  0x100000f50 <+48>: movl   (%rsi), %esi
    0x100000f52 <+50>: leaq   0x4e(%rip), %rdi          ; "Now crash %d\n"
    0x100000f59 <+57>: movl   %eax, -0x1c(%rbp)
    0x100000f5c <+60>: movb   $0x0, %al

Process 95526 launched: '/Users/buildslave/jenkins/workspace/lldb-cmake-matrix/lldb-build/tools/lldb/lldb-test-build.noindex/functionalities/inferior-crashing/TestInferiorCrashingStep.test_inferior_crashing_register_dsym/a.out' (x86_64)


runCmd: register read eax
output:      eax = 0x00000011


Expecting sub string: eax = 0x
Matched

<bound method SBProcess.Kill of <lldb.SBProcess; proxy of <Swig Object of type 'lldb::SBProcess *' at 0x110b97330> >>: success

PASS: LLDB (/Users/buildslave/jenkins/workspace/lldb-cmake-matrix/clang_701_build/bin/clang-7-x86_64) :: test_inferior_crashing_register_dsym (TestInferiorCrashingStep.CrashingInferiorStepTestCase)
runCmd: settings set symbols.enable-external-lookup false
output: 

runCmd: settings set plugin.process.gdb-remote.packet-timeout 60
output: 

runCmd: settings set symbols.clang-modules-cache-path "/Users/buildslave/jenkins/workspace/lldb-cmake-matrix/lldb-build/tools/lldb/lldb-test-build.noindex/module-cache-lldb"
output: 

runCmd: settings set use-color false
output: 

runCmd: file /Users/buildslave/jenkins/workspace/lldb-cmake-matrix/lldb-build/tools/lldb/lldb-test-build.noindex/functionalities/inferior-crashing/TestInferiorCrashingStep.test_inferior_crashing_register_dwarf/a.out
output: Current executable set to '/Users/buildslave/jenkins/workspace/lldb-cmake-matrix/lldb-build/tools/lldb/lldb-test-build.noindex/functionalities/inferior-crashing/TestInferiorCrashingStep.test_inferior_crashing_register_dwarf/a.out' (x86_64).


runCmd: run
output: Process 95593 stopped
* thread #1, queue = 'com.apple.main-thread', stop reason = EXC_BAD_ACCESS (code=1, address=0x0)
    frame #0: 0x0000000100000f50 a.out`main + 48
a.out`main:
->  0x100000f50 <+48>: movl   (%rsi), %esi
    0x100000f52 <+50>: leaq   0x4e(%rip), %rdi          ; "Now crash %d\n"
    0x100000f59 <+57>: movl   %eax, -0x1c(%rbp)
    0x100000f5c <+60>: movb   $0x0, %al

Process 95593 launched: '/Users/buildslave/jenkins/workspace/lldb-cmake-matrix/lldb-build/tools/lldb/lldb-test-build.noindex/functionalities/inferior-crashing/TestInferiorCrashingStep.test_inferior_crashing_register_dwarf/a.out' (x86_64)


runCmd: register read eax
output:      eax = 0x00000011


Expecting sub string: eax = 0x
Matched

<bound method SBProcess.Kill of <lldb.SBProcess; proxy of <Swig Object of type 'lldb::SBProcess *' at 0x110b97480> >>: success

PASS: LLDB (/Users/buildslave/jenkins/workspace/lldb-cmake-matrix/clang_701_build/bin/clang-7-x86_64) :: test_inferior_crashing_register_dwarf (TestInferiorCrashingStep.CrashingInferiorStepTestCase)
UNSUPPORTED: LLDB (/Users/buildslave/jenkins/workspace/lldb-cmake-matrix/clang_701_build/bin/clang-7-x86_64) :: test_inferior_crashing_register_dwo (TestInferiorCrashingStep.CrashingInferiorStepTestCase) (test case does not fall in any category of interest for this run) 
UNSUPPORTED: LLDB (/Users/buildslave/jenkins/workspace/lldb-cmake-matrix/clang_701_build/bin/clang-7-x86_64) :: test_inferior_crashing_register_gmodules (TestInferiorCrashingStep.CrashingInferiorStepTestCase) (test case does not fall in any category of interest for this run) 
runCmd: settings set symbols.enable-external-lookup false
output: 

runCmd: settings set plugin.process.gdb-remote.packet-timeout 60
output: 

runCmd: settings set symbols.clang-modules-cache-path "/Users/buildslave/jenkins/workspace/lldb-cmake-matrix/lldb-build/tools/lldb/lldb-test-build.noindex/module-cache-lldb"
output: 

runCmd: settings set use-color false
output: 

warning: (x86_64) /Users/buildslave/jenkins/workspace/lldb-cmake-matrix/lldb-build/tools/lldb/lldb-test-build.noindex/functionalities/inferior-crashing/TestInferiorCrashingStep.test_inferior_crashing_step_after_break_dsym/a.out empty dSYM file detected, dSYM was created with an executable with no debug info.
runCmd: file /Users/buildslave/jenkins/workspace/lldb-cmake-matrix/lldb-build/tools/lldb/lldb-test-build.noindex/functionalities/inferior-crashing/TestInferiorCrashingStep.test_inferior_crashing_step_after_break_dsym/a.out
output: Current executable set to '/Users/buildslave/jenkins/workspace/lldb-cmake-matrix/lldb-build/tools/lldb/lldb-test-build.noindex/functionalities/inferior-crashing/TestInferiorCrashingStep.test_inferior_crashing_step_after_break_dsym/a.out' (x86_64).


runCmd: run
output: Process 95664 stopped
* thread #1, queue = 'com.apple.main-thread', stop reason = EXC_BAD_ACCESS (code=1, address=0x0)
    frame #0: 0x0000000100000f50 a.out`main + 48
a.out`main:
->  0x100000f50 <+48>: movl   (%rsi), %esi
    0x100000f52 <+50>: leaq   0x4e(%rip), %rdi          ; "Now crash %d\n"
    0x100000f59 <+57>: movl   %eax, -0x1c(%rbp)
    0x100000f5c <+60>: movb   $0x0, %al

Process 95664 launched: '/Users/buildslave/jenkins/workspace/lldb-cmake-matrix/lldb-build/tools/lldb/lldb-test-build.noindex/functionalities/inferior-crashing/TestInferiorCrashingStep.test_inferior_crashing_step_after_break_dsym/a.out' (x86_64)


runCmd: next
output: Process 95664 stopped
* thread #1, queue = 'com.apple.main-thread', stop reason = EXC_BAD_ACCESS (code=1, address=0x0)
    frame #0: 0x0000000100000f50 a.out`main + 48
a.out`main:
->  0x100000f50 <+48>: movl   (%rsi), %esi
    0x100000f52 <+50>: leaq   0x4e(%rip), %rdi          ; "Now crash %d\n"
    0x100000f59 <+57>: movl   %eax, -0x1c(%rbp)
    0x100000f5c <+60>: movb   $0x0, %al



Expecting sub string: Process
Matched

Expecting sub string: stopped
Matched

<bound method SBProcess.Kill of <lldb.SBProcess; proxy of <Swig Object of type 'lldb::SBProcess *' at 0x110b97660> >>: success

PASS: LLDB (/Users/buildslave/jenkins/workspace/lldb-cmake-matrix/clang_701_build/bin/clang-7-x86_64) :: test_inferior_crashing_step_after_break_dsym (TestInferiorCrashingStep.CrashingInferiorStepTestCase)
runCmd: settings set symbols.enable-external-lookup false
output: 

runCmd: settings set plugin.process.gdb-remote.packet-timeout 60
output: 

runCmd: settings set symbols.clang-modules-cache-path "/Users/buildslave/jenkins/workspace/lldb-cmake-matrix/lldb-build/tools/lldb/lldb-test-build.noindex/module-cache-lldb"
output: 

runCmd: settings set use-color false
output: 

runCmd: file /Users/buildslave/jenkins/workspace/lldb-cmake-matrix/lldb-build/tools/lldb/lldb-test-build.noindex/functionalities/inferior-crashing/TestInferiorCrashingStep.test_inferior_crashing_step_after_break_dwarf/a.out
output: Current executable set to '/Users/buildslave/jenkins/workspace/lldb-cmake-matrix/lldb-build/tools/lldb/lldb-test-build.noindex/functionalities/inferior-crashing/TestInferiorCrashingStep.test_inferior_crashing_step_after_break_dwarf/a.out' (x86_64).


runCmd: run
output: Process 95730 stopped
* thread #1, queue = 'com.apple.main-thread', stop reason = EXC_BAD_ACCESS (code=1, address=0x0)
    frame #0: 0x0000000100000f50 a.out`main + 48
a.out`main:
->  0x100000f50 <+48>: movl   (%rsi), %esi
    0x100000f52 <+50>: leaq   0x4e(%rip), %rdi          ; "Now crash %d\n"
    0x100000f59 <+57>: movl   %eax, -0x1c(%rbp)
    0x100000f5c <+60>: movb   $0x0, %al

Process 95730 launched: '/Users/buildslave/jenkins/workspace/lldb-cmake-matrix/lldb-build/tools/lldb/lldb-test-build.noindex/functionalities/inferior-crashing/TestInferiorCrashingStep.test_inferior_crashing_step_after_break_dwarf/a.out' (x86_64)


runCmd: next
output: Process 95730 stopped
* thread #1, queue = 'com.apple.main-thread', stop reason = EXC_BAD_ACCESS (code=1, address=0x0)
    frame #0: 0x0000000100000f50 a.out`main + 48
a.out`main:
->  0x100000f50 <+48>: movl   (%rsi), %esi
    0x100000f52 <+50>: leaq   0x4e(%rip), %rdi          ; "Now crash %d\n"
    0x100000f59 <+57>: movl   %eax, -0x1c(%rbp)
    0x100000f5c <+60>: movb   $0x0, %al



Expecting sub string: Process
Matched

Expecting sub string: stopped
Matched

<bound method SBProcess.Kill of <lldb.SBProcess; proxy of <Swig Object of type 'lldb::SBProcess *' at 0x110b97330> >>: success

PASS: LLDB (/Users/buildslave/jenkins/workspace/lldb-cmake-matrix/clang_701_build/bin/clang-7-x86_64) :: test_inferior_crashing_step_after_break_dwarf (TestInferiorCrashingStep.CrashingInferiorStepTestCase)
UNSUPPORTED: LLDB (/Users/buildslave/jenkins/workspace/lldb-cmake-matrix/clang_701_build/bin/clang-7-x86_64) :: test_inferior_crashing_step_after_break_dwo (TestInferiorCrashingStep.CrashingInferiorStepTestCase) (test case does not fall in any category of interest for this run) 
UNSUPPORTED: LLDB (/Users/buildslave/jenkins/workspace/lldb-cmake-matrix/clang_701_build/bin/clang-7-x86_64) :: test_inferior_crashing_step_after_break_gmodules (TestInferiorCrashingStep.CrashingInferiorStepTestCase) (test case does not fall in any category of interest for this run) 
runCmd: settings set symbols.enable-external-lookup false
output: 

runCmd: settings set plugin.process.gdb-remote.packet-timeout 60
output: 

runCmd: settings set symbols.clang-modules-cache-path "/Users/buildslave/jenkins/workspace/lldb-cmake-matrix/lldb-build/tools/lldb/lldb-test-build.noindex/module-cache-lldb"
output: 

runCmd: settings set use-color false
output: 

warning: (x86_64) /Users/buildslave/jenkins/workspace/lldb-cmake-matrix/lldb-build/tools/lldb/lldb-test-build.noindex/functionalities/inferior-crashing/TestInferiorCrashingStep.test_inferior_crashing_step_dsym/a.out empty dSYM file detected, dSYM was created with an executable with no debug info.
runCmd: file /Users/buildslave/jenkins/workspace/lldb-cmake-matrix/lldb-build/tools/lldb/lldb-test-build.noindex/functionalities/inferior-crashing/TestInferiorCrashingStep.test_inferior_crashing_step_dsym/a.out
output: Current executable set to '/Users/buildslave/jenkins/workspace/lldb-cmake-matrix/lldb-build/tools/lldb/lldb-test-build.noindex/functionalities/inferior-crashing/TestInferiorCrashingStep.test_inferior_crashing_step_dsym/a.out' (x86_64).


runCmd: breakpoint set -f "main.c" -l 16
output: Breakpoint 1: no locations (pending).
WARNING:  Unable to resolve breakpoint to any actual locations.


Expecting pattern: ^Breakpoint (?P<bpno>[0-9]+): (?P<num_locations>[0-9]+) locations\.$
Not matched

Expecting pattern: ^Breakpoint (?P<bpno>[0-9]+): (?P<num_locations>no) locations \(pending\)\.
Matched

FAIL: LLDB (/Users/buildslave/jenkins/workspace/lldb-cmake-matrix/clang_701_build/bin/clang-7-x86_64) :: test_inferior_crashing_step_dsym (TestInferiorCrashingStep.CrashingInferiorStepTestCase)
runCmd: settings set symbols.enable-external-lookup false
output: 

runCmd: settings set plugin.process.gdb-remote.packet-timeout 60
output: 

runCmd: settings set symbols.clang-modules-cache-path "/Users/buildslave/jenkins/workspace/lldb-cmake-matrix/lldb-build/tools/lldb/lldb-test-build.noindex/module-cache-lldb"
output: 

runCmd: settings set use-color false
output: 

runCmd: file /Users/buildslave/jenkins/workspace/lldb-cmake-matrix/lldb-build/tools/lldb/lldb-test-build.noindex/functionalities/inferior-crashing/TestInferiorCrashingStep.test_inferior_crashing_step_dwarf/a.out
output: Current executable set to '/Users/buildslave/jenkins/workspace/lldb-cmake-matrix/lldb-build/tools/lldb/lldb-test-build.noindex/functionalities/inferior-crashing/TestInferiorCrashingStep.test_inferior_crashing_step_dwarf/a.out' (x86_64).


runCmd: breakpoint set -f "main.c" -l 16
output: Breakpoint 1: no locations (pending).
WARNING:  Unable to resolve breakpoint to any actual locations.


Expecting pattern: ^Breakpoint (?P<bpno>[0-9]+): (?P<num_locations>[0-9]+) locations\.$
Not matched

Expecting pattern: ^Breakpoint (?P<bpno>[0-9]+): (?P<num_locations>no) locations \(pending\)\.
Matched

FAIL: LLDB (/Users/buildslave/jenkins/workspace/lldb-cmake-matrix/clang_701_build/bin/clang-7-x86_64) :: test_inferior_crashing_step_dwarf (TestInferiorCrashingStep.CrashingInferiorStepTestCase)
UNSUPPORTED: LLDB (/Users/buildslave/jenkins/workspace/lldb-cmake-matrix/clang_701_build/bin/clang-7-x86_64) :: test_inferior_crashing_step_dwo (TestInferiorCrashingStep.CrashingInferiorStepTestCase) (test case does not fall in any category of interest for this run) 
UNSUPPORTED: LLDB (/Users/buildslave/jenkins/workspace/lldb-cmake-matrix/clang_701_build/bin/clang-7-x86_64) :: test_inferior_crashing_step_gmodules (TestInferiorCrashingStep.CrashingInferiorStepTestCase) (test case does not fall in any category of interest for this run) 
Restore dir to: /Users/buildslave/jenkins/workspace/lldb-cmake-matrix/lldb-build/tools/lldb/lit
======================================================================
FAIL: test_inferior_crashing_dsym (TestInferiorCrashingStep.CrashingInferiorStepTestCase)
    Test that lldb reliably catches the inferior crashing (command).
----------------------------------------------------------------------
Traceback (most recent call last):
  File "/Users/buildslave/jenkins/workspace/lldb-cmake-matrix/llvm-project/lldb/packages/Python/lldbsuite/test/lldbtest.py", line 1748, in test_method
    return attrvalue(self)
  File "/Users/buildslave/jenkins/workspace/lldb-cmake-matrix/llvm-project/lldb/packages/Python/lldbsuite/test/decorators.py", line 111, in wrapper
    func(*args, **kwargs)
  File "/Users/buildslave/jenkins/workspace/lldb-cmake-matrix/llvm-project/lldb/packages/Python/lldbsuite/test/decorators.py", line 111, in wrapper
    func(*args, **kwargs)
  File "/Users/buildslave/jenkins/workspace/lldb-cmake-matrix/llvm-project/lldb/packages/Python/lldbsuite/test/functionalities/inferior-crashing/TestInferiorCrashingStep.py", line 21, in test_inferior_crashing
    self.inferior_crashing()
  File "/Users/buildslave/jenkins/workspace/lldb-cmake-matrix/llvm-project/lldb/packages/Python/lldbsuite/test/functionalities/inferior-crashing/TestInferiorCrashingStep.py", line 106, in inferior_crashing
    substrs=[stop_reason, 'main.c:%d' % self.line])
  File "/Users/buildslave/jenkins/workspace/lldb-cmake-matrix/llvm-project/lldb/packages/Python/lldbsuite/test/lldbtest.py", line 2370, in expect
    msg if msg else EXP_MSG(str, output, exe))
AssertionError: False is not True : 'thread backtrace all' returns expected result, got '* thread #1, queue = 'com.apple.main-thread', stop reason = EXC_BAD_ACCESS (code=1, address=0x0)
  * frame #0: 0x0000000100000f50 a.out`main + 48
    frame #1: 0x00007fff726a0085 libdyld.dylib`start + 1
    frame #2: 0x00007fff726a0085 libdyld.dylib`start + 1'
Config=x86_64-/Users/buildslave/jenkins/workspace/lldb-cmake-matrix/clang_701_build/bin/clang-7
======================================================================
FAIL: test_inferior_crashing_dwarf (TestInferiorCrashingStep.CrashingInferiorStepTestCase)
    Test that lldb reliably catches the inferior crashing (command).
----------------------------------------------------------------------
Traceback (most recent call last):
  File "/Users/buildslave/jenkins/workspace/lldb-cmake-matrix/llvm-project/lldb/packages/Python/lldbsuite/test/lldbtest.py", line 1748, in test_method
    return attrvalue(self)
  File "/Users/buildslave/jenkins/workspace/lldb-cmake-matrix/llvm-project/lldb/packages/Python/lldbsuite/test/decorators.py", line 111, in wrapper
    func(*args, **kwargs)
  File "/Users/buildslave/jenkins/workspace/lldb-cmake-matrix/llvm-project/lldb/packages/Python/lldbsuite/test/decorators.py", line 111, in wrapper
    func(*args, **kwargs)
  File "/Users/buildslave/jenkins/workspace/lldb-cmake-matrix/llvm-project/lldb/packages/Python/lldbsuite/test/functionalities/inferior-crashing/TestInferiorCrashingStep.py", line 21, in test_inferior_crashing
    self.inferior_crashing()
  File "/Users/buildslave/jenkins/workspace/lldb-cmake-matrix/llvm-project/lldb/packages/Python/lldbsuite/test/functionalities/inferior-crashing/TestInferiorCrashingStep.py", line 106, in inferior_crashing
    substrs=[stop_reason, 'main.c:%d' % self.line])
  File "/Users/buildslave/jenkins/workspace/lldb-cmake-matrix/llvm-project/lldb/packages/Python/lldbsuite/test/lldbtest.py", line 2370, in expect
    msg if msg else EXP_MSG(str, output, exe))
AssertionError: False is not True : 'thread backtrace all' returns expected result, got '* thread #1, queue = 'com.apple.main-thread', stop reason = EXC_BAD_ACCESS (code=1, address=0x0)
  * frame #0: 0x0000000100000f50 a.out`main + 48
    frame #1: 0x00007fff726a0085 libdyld.dylib`start + 1'
Config=x86_64-/Users/buildslave/jenkins/workspace/lldb-cmake-matrix/clang_701_build/bin/clang-7
======================================================================
FAIL: test_inferior_crashing_expr_dsym (TestInferiorCrashingStep.CrashingInferiorStepTestCase)
    Test that the lldb expression interpreter can read from the inferior after crashing (command).
----------------------------------------------------------------------
Traceback (most recent call last):
  File "/Users/buildslave/jenkins/workspace/lldb-cmake-matrix/llvm-project/lldb/packages/Python/lldbsuite/test/lldbtest.py", line 1748, in test_method
    return attrvalue(self)
  File "/Users/buildslave/jenkins/workspace/lldb-cmake-matrix/llvm-project/lldb/packages/Python/lldbsuite/test/functionalities/inferior-crashing/TestInferiorCrashingStep.py", line 38, in test_inferior_crashing_expr
    self.inferior_crashing_expr()
  File "/Users/buildslave/jenkins/workspace/lldb-cmake-matrix/llvm-project/lldb/packages/Python/lldbsuite/test/functionalities/inferior-crashing/TestInferiorCrashingStep.py", line 155, in inferior_crashing_expr
    self.expect("p argc", startstr='(int) $0 = 1')
  File "/Users/buildslave/jenkins/workspace/lldb-cmake-matrix/llvm-project/lldb/packages/Python/lldbsuite/test/lldbtest.py", line 2305, in expect
    inHistory=inHistory)
  File "/Users/buildslave/jenkins/workspace/lldb-cmake-matrix/llvm-project/lldb/packages/Python/lldbsuite/test/lldbtest.py", line 2068, in runCmd
    msg if (msg) else CMD_MSG(cmd))
AssertionError: False is not True : Command 'p argc
Error output:
error: use of undeclared identifier 'argc'
' returns successfully
Config=x86_64-/Users/buildslave/jenkins/workspace/lldb-cmake-matrix/clang_701_build/bin/clang-7
======================================================================
FAIL: test_inferior_crashing_expr_dwarf (TestInferiorCrashingStep.CrashingInferiorStepTestCase)
    Test that the lldb expression interpreter can read from the inferior after crashing (command).
----------------------------------------------------------------------
Traceback (most recent call last):
  File "/Users/buildslave/jenkins/workspace/lldb-cmake-matrix/llvm-project/lldb/packages/Python/lldbsuite/test/lldbtest.py", line 1748, in test_method
    return attrvalue(self)
  File "/Users/buildslave/jenkins/workspace/lldb-cmake-matrix/llvm-project/lldb/packages/Python/lldbsuite/test/functionalities/inferior-crashing/TestInferiorCrashingStep.py", line 38, in test_inferior_crashing_expr
    self.inferior_crashing_expr()
  File "/Users/buildslave/jenkins/workspace/lldb-cmake-matrix/llvm-project/lldb/packages/Python/lldbsuite/test/functionalities/inferior-crashing/TestInferiorCrashingStep.py", line 155, in inferior_crashing_expr
    self.expect("p argc", startstr='(int) $0 = 1')
  File "/Users/buildslave/jenkins/workspace/lldb-cmake-matrix/llvm-project/lldb/packages/Python/lldbsuite/test/lldbtest.py", line 2305, in expect
    inHistory=inHistory)
  File "/Users/buildslave/jenkins/workspace/lldb-cmake-matrix/llvm-project/lldb/packages/Python/lldbsuite/test/lldbtest.py", line 2068, in runCmd
    msg if (msg) else CMD_MSG(cmd))
AssertionError: False is not True : Command 'p argc
Error output:
error: use of undeclared identifier 'argc'
' returns successfully
Config=x86_64-/Users/buildslave/jenkins/workspace/lldb-cmake-matrix/clang_701_build/bin/clang-7
======================================================================
FAIL: test_inferior_crashing_expr_step_and_expr_dsym (TestInferiorCrashingStep.CrashingInferiorStepTestCase)
    Test that lldb expressions work before and after stepping after a crash.
----------------------------------------------------------------------
Traceback (most recent call last):
  File "/Users/buildslave/jenkins/workspace/lldb-cmake-matrix/llvm-project/lldb/packages/Python/lldbsuite/test/lldbtest.py", line 1748, in test_method
    return attrvalue(self)
  File "/Users/buildslave/jenkins/workspace/lldb-cmake-matrix/llvm-project/lldb/packages/Python/lldbsuite/test/decorators.py", line 111, in wrapper
    func(*args, **kwargs)
  File "/Users/buildslave/jenkins/workspace/lldb-cmake-matrix/llvm-project/lldb/packages/Python/lldbsuite/test/functionalities/inferior-crashing/TestInferiorCrashingStep.py", line 61, in test_inferior_crashing_expr_step_and_expr
    self.inferior_crashing_expr_step_expr()
  File "/Users/buildslave/jenkins/workspace/lldb-cmake-matrix/llvm-project/lldb/packages/Python/lldbsuite/test/functionalities/inferior-crashing/TestInferiorCrashingStep.py", line 221, in inferior_crashing_expr_step_expr
    self.expect("p argv[0]", substrs=['a.out'])
  File "/Users/buildslave/jenkins/workspace/lldb-cmake-matrix/llvm-project/lldb/packages/Python/lldbsuite/test/lldbtest.py", line 2305, in expect
    inHistory=inHistory)
  File "/Users/buildslave/jenkins/workspace/lldb-cmake-matrix/llvm-project/lldb/packages/Python/lldbsuite/test/lldbtest.py", line 2068, in runCmd
    msg if (msg) else CMD_MSG(cmd))
AssertionError: False is not True : Command 'p argv[0]
Error output:
error: use of undeclared identifier 'argv'
' returns successfully
Config=x86_64-/Users/buildslave/jenkins/workspace/lldb-cmake-matrix/clang_701_build/bin/clang-7
======================================================================
FAIL: test_inferior_crashing_expr_step_and_expr_dwarf (TestInferiorCrashingStep.CrashingInferiorStepTestCase)
    Test that lldb expressions work before and after stepping after a crash.
----------------------------------------------------------------------
Traceback (most recent call last):
  File "/Users/buildslave/jenkins/workspace/lldb-cmake-matrix/llvm-project/lldb/packages/Python/lldbsuite/test/lldbtest.py", line 1748, in test_method
    return attrvalue(self)
  File "/Users/buildslave/jenkins/workspace/lldb-cmake-matrix/llvm-project/lldb/packages/Python/lldbsuite/test/decorators.py", line 111, in wrapper
    func(*args, **kwargs)
  File "/Users/buildslave/jenkins/workspace/lldb-cmake-matrix/llvm-project/lldb/packages/Python/lldbsuite/test/functionalities/inferior-crashing/TestInferiorCrashingStep.py", line 61, in test_inferior_crashing_expr_step_and_expr
    self.inferior_crashing_expr_step_expr()
  File "/Users/buildslave/jenkins/workspace/lldb-cmake-matrix/llvm-project/lldb/packages/Python/lldbsuite/test/functionalities/inferior-crashing/TestInferiorCrashingStep.py", line 221, in inferior_crashing_expr_step_expr
    self.expect("p argv[0]", substrs=['a.out'])
  File "/Users/buildslave/jenkins/workspace/lldb-cmake-matrix/llvm-project/lldb/packages/Python/lldbsuite/test/lldbtest.py", line 2305, in expect
    inHistory=inHistory)
  File "/Users/buildslave/jenkins/workspace/lldb-cmake-matrix/llvm-project/lldb/packages/Python/lldbsuite/test/lldbtest.py", line 2068, in runCmd
    msg if (msg) else CMD_MSG(cmd))
AssertionError: False is not True : Command 'p argv[0]
Error output:
error: use of undeclared identifier 'argv'
' returns successfully
Config=x86_64-/Users/buildslave/jenkins/workspace/lldb-cmake-matrix/clang_701_build/bin/clang-7
======================================================================
FAIL: test_inferior_crashing_step_dsym (TestInferiorCrashingStep.CrashingInferiorStepTestCase)
    Test that stepping after a crash behaves correctly.
----------------------------------------------------------------------
Traceback (most recent call last):
  File "/Users/buildslave/jenkins/workspace/lldb-cmake-matrix/llvm-project/lldb/packages/Python/lldbsuite/test/lldbtest.py", line 1748, in test_method
    return attrvalue(self)
  File "/Users/buildslave/jenkins/workspace/lldb-cmake-matrix/llvm-project/lldb/packages/Python/lldbsuite/test/decorators.py", line 111, in wrapper
    func(*args, **kwargs)
  File "/Users/buildslave/jenkins/workspace/lldb-cmake-matrix/llvm-project/lldb/packages/Python/lldbsuite/test/functionalities/inferior-crashing/TestInferiorCrashingStep.py", line 44, in test_inferior_crashing_step
    self.inferior_crashing_step()
  File "/Users/buildslave/jenkins/workspace/lldb-cmake-matrix/llvm-project/lldb/packages/Python/lldbsuite/test/functionalities/inferior-crashing/TestInferiorCrashingStep.py", line 164, in inferior_crashing_step
    self.set_breakpoint(self.line)
  File "/Users/buildslave/jenkins/workspace/lldb-cmake-matrix/llvm-project/lldb/packages/Python/lldbsuite/test/functionalities/inferior-crashing/TestInferiorCrashingStep.py", line 65, in set_breakpoint
    self, "main.c", line, num_expected_locations=1, loc_exact=True)
  File "/Users/buildslave/jenkins/workspace/lldb-cmake-matrix/llvm-project/lldb/packages/Python/lldbsuite/test/lldbutil.py", line 383, in run_break_set_by_file_and_line
    module_name=module_name)
  File "/Users/buildslave/jenkins/workspace/lldb-cmake-matrix/llvm-project/lldb/packages/Python/lldbsuite/test/lldbutil.py", line 584, in check_breakpoint_result
    out_num_locations))
AssertionError: False is not True : Expecting 1 locations, got 0.
Config=x86_64-/Users/buildslave/jenkins/workspace/lldb-cmake-matrix/clang_701_build/bin/clang-7
======================================================================
FAIL: test_inferior_crashing_step_dwarf (TestInferiorCrashingStep.CrashingInferiorStepTestCase)
    Test that stepping after a crash behaves correctly.
----------------------------------------------------------------------
Traceback (most recent call last):
  File "/Users/buildslave/jenkins/workspace/lldb-cmake-matrix/llvm-project/lldb/packages/Python/lldbsuite/test/lldbtest.py", line 1748, in test_method
    return attrvalue(self)
  File "/Users/buildslave/jenkins/workspace/lldb-cmake-matrix/llvm-project/lldb/packages/Python/lldbsuite/test/decorators.py", line 111, in wrapper
    func(*args, **kwargs)
  File "/Users/buildslave/jenkins/workspace/lldb-cmake-matrix/llvm-project/lldb/packages/Python/lldbsuite/test/functionalities/inferior-crashing/TestInferiorCrashingStep.py", line 44, in test_inferior_crashing_step
    self.inferior_crashing_step()
  File "/Users/buildslave/jenkins/workspace/lldb-cmake-matrix/llvm-project/lldb/packages/Python/lldbsuite/test/functionalities/inferior-crashing/TestInferiorCrashingStep.py", line 164, in inferior_crashing_step
    self.set_breakpoint(self.line)
  File "/Users/buildslave/jenkins/workspace/lldb-cmake-matrix/llvm-project/lldb/packages/Python/lldbsuite/test/functionalities/inferior-crashing/TestInferiorCrashingStep.py", line 65, in set_breakpoint
    self, "main.c", line, num_expected_locations=1, loc_exact=True)
  File "/Users/buildslave/jenkins/workspace/lldb-cmake-matrix/llvm-project/lldb/packages/Python/lldbsuite/test/lldbutil.py", line 383, in run_break_set_by_file_and_line
    module_name=module_name)
  File "/Users/buildslave/jenkins/workspace/lldb-cmake-matrix/llvm-project/lldb/packages/Python/lldbsuite/test/lldbutil.py", line 584, in check_breakpoint_result
    out_num_locations))
AssertionError: False is not True : Expecting 1 locations, got 0.
Config=x86_64-/Users/buildslave/jenkins/workspace/lldb-cmake-matrix/clang_701_build/bin/clang-7
----------------------------------------------------------------------
Ran 28 tests in 10.158s

RESULT: FAILED (6 passes, 8 failures, 0 errors, 14 skipped, 0 expected failures, 0 unexpected successes)

********************
FAIL: lldb-Suite :: commands/gui/basic/TestGuiBasic.py (1701 of 1705)
******************** TEST 'lldb-Suite :: commands/gui/basic/TestGuiBasic.py' FAILED ********************
lldb version 10.0.99 (http://labmaster3.local/git/llvm-project.git revision 1a3dd638c4a9173e53628b497a1aadc31c32eb50)
  clang revision 9e86561878dc470c4023cd627dd39cafc13fdc4d
  llvm revision 9e86561878dc470c4023cd627dd39cafc13fdc4d
LLDB library dir: /Users/buildslave/jenkins/workspace/lldb-cmake-matrix/lldb-build/bin
LLDB import library dir: /Users/buildslave/jenkins/workspace/lldb-cmake-matrix/lldb-build/bin
libstdcxx tests will not be run because: Don't know how to build with libstdcxx on macosx
Skipping following debug info categories: ['dwo']
(lldb) settings set symbols.enable-external-lookup false
(lldb) settings set plugin.process.gdb-remote.packet-timeout 60
(lldb) settings set symbols.clang-modules-cache-path "/Users/buildslave/jenkins/workspace/lldb-cmake-matrix/lldb-build/tools/lldb/lldb-test-build.noindex/module-cache-lldb"
(lldb) settings set use-color false
(lldb) target create "/Users/buildslave/jenkins/workspace/lldb-cmake-matrix/lldb-build/tools/lldb/lldb-test-build.noindex/commands/gui/basic/TestGuiBasic.test_gui/a.out"
warning: (x86_64) /Users/buildslave/jenkins/workspace/lldb-cmake-matrix/lldb-build/tools/lldb/lldb-test-build.noindex/commands/gui/basic/TestGuiBasic.test_gui/a.out empty dSYM file detected, dSYM was created with an executable with no debug info.
Current executable set to '/Users/buildslave/jenkins/workspace/lldb-cmake-matrix/lldb-build/tools/lldb/lldb-test-build.noindex/commands/gui/basic/TestGuiBasic.test_gui/a.out' (x86_64).
(lldb) br set -f main.c -p "// Break here"
br set -f main.c -p "// Break here"
Breakpoint 1: no locations (pending).
WARNING:  Unable to resolve breakpoint to any actual locations.
(lldb) settings set interpreter.prompt-on-quit false
quit
settings set interpreter.prompt-on-quit false
(lldb) quit

Session logs for test failures/errors/unexpected successes will go into directory '/Users/buildslave/jenkins/workspace/lldb-cmake-matrix/test/logs'
Command invoked: /Users/buildslave/jenkins/workspace/lldb-cmake-matrix/llvm-project/lldb/test/dotest.py --arch=x86_64 -s /Users/buildslave/jenkins/workspace/lldb-cmake-matrix/lldb-build/lldb-test-traces -S nm -u CXXFLAGS -u CFLAGS --executable /Users/buildslave/jenkins/workspace/lldb-cmake-matrix/lldb-build/./bin/lldb --dsymutil /Users/buildslave/jenkins/workspace/lldb-cmake-matrix/lldb-build/./bin/dsymutil --filecheck /Users/buildslave/jenkins/workspace/lldb-cmake-matrix/lldb-build/./bin/FileCheck -C /Users/buildslave/jenkins/workspace/lldb-cmake-matrix/clang_701_build/bin/clang --codesign-identity lldb_codesign --server /Users/buildslave/jenkins/workspace/lldb-cmake-matrix/lldb-build/./bin/debugserver --arch x86_64 --build-dir /Users/buildslave/jenkins/workspace/lldb-cmake-matrix/lldb-build/lldb-test-build.noindex -s=/Users/buildslave/jenkins/workspace/lldb-cmake-matrix/test/logs -t --env TERM=vt100 --skip-category gmodules --skip-category watchpoint --arch=x86_64 --dwarf-version=5 --env LLVM_LIBS_DIR=/Users/buildslave/jenkins/workspace/lldb-cmake-matrix/lldb-build/./lib --build-dir /Users/buildslave/jenkins/workspace/lldb-cmake-matrix/lldb-build/tools/lldb/lldb-test-build.noindex --module-cache-dir /Users/buildslave/jenkins/workspace/lldb-cmake-matrix/lldb-build/tools/lldb/lldb-test-build.noindex/module-cache-lldb /Users/buildslave/jenkins/workspace/lldb-cmake-matrix/llvm-project/lldb/packages/Python/lldbsuite/test/commands/gui/basic -p TestGuiBasic.py
Change dir to: /Users/buildslave/jenkins/workspace/lldb-cmake-matrix/llvm-project/lldb/packages/Python/lldbsuite/test/commands/gui/basic
runCmd: settings set symbols.enable-external-lookup false
output: 

runCmd: settings set plugin.process.gdb-remote.packet-timeout 60
output: 

runCmd: settings set symbols.clang-modules-cache-path "/Users/buildslave/jenkins/workspace/lldb-cmake-matrix/lldb-build/tools/lldb/lldb-test-build.noindex/module-cache-lldb"
output: 

runCmd: settings set use-color false
output: 

FAIL: LLDB (/Users/buildslave/jenkins/workspace/lldb-cmake-matrix/clang_701_build/bin/clang-7-x86_64) :: test_gui (TestGuiBasic.BasicGuiCommandTest)
tearing down the child process....

Restore dir to: /Users/buildslave/jenkins/workspace/lldb-cmake-matrix/lldb-build/tools/lldb/lit
======================================================================
ERROR: test_gui (TestGuiBasic.BasicGuiCommandTest)
----------------------------------------------------------------------
Traceback (most recent call last):
  File "/Users/buildslave/jenkins/workspace/lldb-cmake-matrix/llvm-project/lldb/packages/Python/lldbsuite/test/commands/gui/basic/TestGuiBasic.py", line 19, in test_gui
    self.expect('br set -f main.c -p "// Break here"', substrs=["Breakpoint 1", "address ="])
  File "/Users/buildslave/jenkins/workspace/lldb-cmake-matrix/llvm-project/lldb/packages/Python/lldbsuite/test/lldbpexpect.py", line 56, in expect
    self.child.expect_exact(s)
  File "/Users/buildslave/jenkins/workspace/lldb-cmake-matrix/llvm-project/lldb/third_party/Python/module/pexpect-4.6/pexpect/spawnbase.py", line 418, in expect_exact
    return exp.expect_loop(timeout)
  File "/Users/buildslave/jenkins/workspace/lldb-cmake-matrix/llvm-project/lldb/third_party/Python/module/pexpect-4.6/pexpect/expect.py", line 119, in expect_loop
    return self.timeout(e)
  File "/Users/buildslave/jenkins/workspace/lldb-cmake-matrix/llvm-project/lldb/third_party/Python/module/pexpect-4.6/pexpect/expect.py", line 82, in timeout
    raise TIMEOUT(msg)
TIMEOUT: Timeout exceeded.
<pexpect.pty_spawn.spawn object at 0x107b1cd50>
command: /Users/buildslave/jenkins/workspace/lldb-cmake-matrix/lldb-build/bin/lldb
args: ['/Users/buildslave/jenkins/workspace/lldb-cmake-matrix/lldb-build/bin/lldb', '--no-lldbinit', '--no-use-colors', '-O', 'settings set symbols.enable-external-lookup false', '-O', 'settings set plugin.process.gdb-remote.packet-timeout 60', '-O', 'settings set symbols.clang-modules-cache-path "/Users/buildslave/jenkins/workspace/lldb-cmake-matrix/lldb-build/tools/lldb/lldb-test-build.noindex/module-cache-lldb"', '-O', 'settings set use-color false', '--file', '/Users/buildslave/jenkins/workspace/lldb-cmake-matrix/lldb-build/tools/lldb/lldb-test-build.noindex/commands/gui/basic/TestGuiBasic.test_gui/a.out']
buffer (last 100 chars): ': no locations (pending).\r\nWARNING:  Unable to resolve breakpoint to any actual locations.\r\n(lldb) '
before (last 100 chars): ': no locations (pending).\r\nWARNING:  Unable to resolve breakpoint to any actual locations.\r\n(lldb) '
after: <class 'pexpect.exceptions.TIMEOUT'>
match: None
match_index: None
exitstatus: None
flag_eof: False
pid: 86134
child_fd: 6
closed: False
timeout: 30
delimiter: <class 'pexpect.exceptions.EOF'>
logfile: <open file '<stdout>', mode 'w' at 0x1070ff150>
logfile_read: None
logfile_send: None
maxread: 2000
ignorecase: False
searchwindowsize: None
delaybeforesend: 0.05
delayafterclose: 0.1
delayafterterminate: 0.1
searcher: searcher_string:
    0: 'address ='
Config=x86_64-/Users/buildslave/jenkins/workspace/lldb-cmake-matrix/clang_701_build/bin/clang-7
----------------------------------------------------------------------
Ran 1 test in 30.888s

RESULT: FAILED (0 passes, 0 failures, 1 errors, 0 skipped, 0 expected failures, 0 unexpected successes)

********************
PASS: lldb-Suite :: lang/objc/foundation/TestFoundationDisassembly.py (1702 of 1705)
TIMEOUT: lldb-Suite :: lang/objc/foundation/TestObjCMethods.py (1703 of 1705)
******************** TEST 'lldb-Suite :: lang/objc/foundation/TestObjCMethods.py' FAILED ********************
Reached timeout of 600 seconds
********************
TIMEOUT: lldb-Suite :: python_api/lldbutil/iter/TestRegistersIterator.py (1704 of 1705)
******************** TEST 'lldb-Suite :: python_api/lldbutil/iter/TestRegistersIterator.py' FAILED ********************
Reached timeout of 600 seconds
********************
TIMEOUT: lldb-Suite :: python_api/lldbutil/iter/TestLLDBIterator.py (1705 of 1705)
******************** TEST 'lldb-Suite :: python_api/lldbutil/iter/TestLLDBIterator.py' FAILED ********************
Reached timeout of 600 seconds
********************
Testing Time: 767.53s
********************
Failing Tests (412):
    lldb-Suite :: lang/cpp/operators/TestCppOperators.py
    lldb-Suite :: commands/expression/timeout/TestCallWithTimeout.py
    lldb-Suite :: commands/expression/radar_9531204/TestPrintfAfterUp.py
    lldb-Suite :: functionalities/thread/concurrent_events/TestConcurrentManyCrash.py
    lldb-Suite :: functionalities/data-formatter/data-formatter-ptr-to-array/TestPtrToArrayFormatting.py
    lldb-Suite :: commands/expression/call-function/TestCallUserDefinedFunction.py
    lldb-Suite :: lang/cpp/extern_c/TestExternCSymbols.py
    lldb-Suite :: functionalities/thread/concurrent_events/TestConcurrentCrashWithSignal.py
    lldb-Suite :: functionalities/dynamic_value_child_count/TestDynamicValueChildCount.py
    lldb-Suite :: functionalities/thread/concurrent_events/TestConcurrentCrashWithBreak.py
    lldb-Suite :: commands/expression/entry-bp/TestExprEntryBP.py
    lldb-Suite :: functionalities/data-formatter/data-formatter-stl/libcxx/vector/TestDataFormatterLibcxxVector.py
    lldb-Suite :: commands/process/attach-resume/TestAttachResume.py
    lldb-Suite :: functionalities/step-avoids-no-debug/TestStepNoDebug.py
    lldb-Suite :: lang/cpp/trivial_abi/TestTrivialABI.py
    lldb-Suite :: lang/cpp/class_static/TestStaticVariables.py
    lldb-Suite :: commands/frame/language/TestGuessLanguage.py
    lldb-Suite :: macosx/nslog/TestDarwinNSLogOutput.py
    lldb-Suite :: commands/expression/function_template_specialization_temp_args/TestFunctionTemplateSpecializationTempArgs.py
    lldb-Suite :: lang/cpp/class-template-parameter-pack/TestClassTemplateParameterPack.py
    lldb-Suite :: functionalities/data-formatter/data-formatter-script/TestDataFormatterScript.py
    lldb-Suite :: commands/expression/call-function/TestCallBuiltinFunction.py
    lldb-Suite :: commands/expression/weak_symbols/TestWeakSymbols.py
    lldb-Suite :: commands/settings/TestSettings.py
    lldb-Suite :: commands/apropos/with-process/TestAproposWithProcess.py
    lldb-Suite :: macosx/find-dsym/deep-bundle/TestDeepBundle.py
    lldb-Suite :: functionalities/ptr_refs/TestPtrRefs.py
    lldb-Suite :: lang/objc/objc-stepping/TestObjCStepping.py
    lldb-Suite :: functionalities/data-formatter/data-formatter-stl/libcxx/queue/TestDataFormatterLibcxxQueue.py
    lldb-Suite :: functionalities/step_scripted/TestStepScripted.py
    lldb-Suite :: functionalities/thread/thread_specific_break/TestThreadSpecificBreakpoint.py
    lldb-Suite :: types/TestIntegerTypes.py
    lldb-Suite :: functionalities/conditional_break/TestConditionalBreak.py
    lldb-Suite :: commands/expression/char/TestExprsChar.py
    lldb-Suite :: python_api/sbvalue_persist/TestSBValuePersist.py
    lldb-Suite :: python_api/value/TestValueAPI.py
    lldb-Suite :: python_api/objc_type/TestObjCType.py
    lldb-Suite :: functionalities/thread/num_threads/TestNumThreads.py
    lldb-Suite :: functionalities/var_path/TestVarPath.py
    lldb-Suite :: functionalities/data-formatter/setvaluefromcstring/TestSetValueFromCString.py
    lldb-Suite :: lang/cpp/dynamic-value/TestDynamicValue.py
    lldb-Suite :: lang/cpp/virtual/TestVirtual.py
    lldb-Suite :: functionalities/completion/TestCompletion.py
    lldb-Suite :: commands/breakpoint/basic/TestBreakpointCommandsFromPython.py
    lldb-Suite :: python_api/type/TestTypeList.py
    lldb-Suite :: lang/cpp/namespace/TestNamespaceLookup.py
    lldb-Suite :: lang/cpp/llvm-style/TestLLVMStyle.py
    lldb-Suite :: functionalities/inferior-crashing/recursive-inferior/TestRecursiveInferiorStep.py
    lldb-Suite :: commands/expression/inline-namespace/TestInlineNamespace.py
    lldb-Suite :: lang/cpp/overloaded-functions/TestOverloadedFunctions.py
    lldb-Suite :: lang/c/conflicting-symbol/TestConflictingSymbol.py
    lldb-Suite :: commands/expression/vector_of_enums/TestVectorOfEnums.py
    lldb-Suite :: functionalities/data-formatter/frameformat_smallstruct/TestFrameFormatSmallStruct.py
    lldb-Suite :: lang/cpp/char8_t/TestCxxChar8_t.py
    lldb-Suite :: commands/expression/test/TestExprs.py
    lldb-Suite :: lang/cpp/enum_types/TestCPP11EnumTypes.py
    lldb-Suite :: python_api/sbtype_typeclass/TestSBTypeTypeClass.py
    lldb-Suite :: lang/objc/print-obj/TestPrintObj.py
    lldb-Suite :: functionalities/data-formatter/synthupdate/TestSyntheticFilterRecompute.py
    lldb-Suite :: functionalities/thread/concurrent_events/TestConcurrentTwoBreakpointsOneSignal.py
    lldb-Suite :: commands/process/launch-with-shellexpand/TestLaunchWithShellExpand.py
    lldb-Suite :: functionalities/data-formatter/ostypeformatting/TestFormattersOsType.py
    lldb-Suite :: functionalities/thread/backtrace_limit/TestBacktraceLimit.py
    lldb-Suite :: lang/objc/modules-auto-import/TestModulesAutoImport.py
    lldb-Suite :: lang/objc/orderedset/TestOrderedSet.py
    lldb-Suite :: commands/frame/diagnose/bad-reference/TestBadReference.py
    lldb-Suite :: lang/cpp/modules-import/TestCXXModulesImport.py
    lldb-Suite :: commands/frame/diagnose/virtual-method-call/TestDiagnoseDereferenceVirtualMethodCall.py
    lldb-Suite :: lang/cpp/nsimport/TestCppNsImport.py
    lldb-Suite :: functionalities/signal/handle-abrt/TestHandleAbort.py
    lldb-Suite :: commands/frame/select/TestFrameSelect.py
    lldb-Suite :: lang/objc/objc-new-syntax/TestObjCNewSyntaxLiteral.py
    lldb-Suite :: types/TestFloatTypesExpr.py
    lldb-Suite :: lang/objc/modules/TestObjCModules.py
    lldb-Suite :: lang/objc/objc-new-syntax/TestObjCNewSyntaxArray.py
    lldb-Suite :: lang/cpp/global_variables/TestCPPGlobalVariables.py
    lldb-Suite :: functionalities/data-formatter/data-formatter-objc/TestDataFormatterObjCNSError.py
    lldb-Suite :: functionalities/unwind/sigtramp/TestSigtrampUnwind.py
    lldb-Suite :: functionalities/plugins/python_os_plugin/TestPythonOSPlugin.py
    lldb-Suite :: functionalities/thread/exit_during_step/TestExitDuringStep.py
    lldb-Suite :: lang/cpp/unsigned_types/TestUnsignedTypes.py
    lldb-Suite :: commands/expression/issue_11588/Test11588.py
    lldb-Suite :: lang/objc/objc-static-method-stripped/TestObjCStaticMethodStripped.py
    lldb-Suite :: lang/objc/objc-runtime-ivars/TestRuntimeIvars.py
    lldb-Suite :: functionalities/data-formatter/data-formatter-objc/TestDataFormatterObjCNSData.py
    lldb-Suite :: commands/source/info/TestSourceInfo.py
    lldb-Suite :: commands/expression/cast_int_to_anonymous_enum/TestCastIntToAnonymousEnum.py
    lldb-Suite :: types/TestFloatTypes.py
    lldb-Suite :: functionalities/data-formatter/data-formatter-stl/libcxx/tuple/TestDataFormatterLibcxxTuple.py
    lldb-Suite :: functionalities/data-formatter/data-formatter-stl/libcxx/initializerlist/TestInitializerList.py
    lldb-Suite :: lang/c/enum_types/TestEnumTypes.py
    lldb-Suite :: python_api/symbol-context/two-files/TestSymbolContextTwoFiles.py
    lldb-Suite :: lang/objc/objc-struct-return/TestObjCStructReturn.py
    lldb-Suite :: lang/cpp/type_lookup/TestCppTypeLookup.py
    lldb-Suite :: functionalities/thread/concurrent_events/TestConcurrentBreakpointDelayBreakpointOneSignal.py
    lldb-Suite :: functionalities/data-formatter/stringprinter/TestStringPrinter.py
    lldb-Suite :: lang/c/offsetof/TestOffsetof.py
    lldb-Suite :: lang/c/shared_lib_stripped_symbols/TestSharedLibStrippedSymbols.py
    lldb-Suite :: lang/cpp/diamond/TestDiamond.py
    lldb-Suite :: commands/frame/diagnose/local-variable/TestLocalVariable.py
    lldb-Suite :: lang/objc/forward-decl/TestForwardDecl.py
    lldb-Suite :: functionalities/data-formatter/typedef_array/TestTypedefArray.py
    lldb-Suite :: lang/cpp/thread_local/TestThreadLocal.py
    lldb-Suite :: functionalities/signal/TestSendSignal.py
    lldb-Suite :: commands/expression/call-throws/TestCallThatThrows.py
    lldb-Suite :: types/TestDoubleTypes.py
    lldb-Suite :: commands/expression/expr-in-syscall/TestExpressionInSyscall.py
    lldb-Suite :: python_api/interpreter/TestCommandInterpreterAPI.py
    lldb-Suite :: commands/expression/argument_passing_restrictions/TestArgumentPassingRestrictions.py
    lldb-Suite :: functionalities/data-formatter/data-formatter-stl/libcxx/multimap/TestDataFormatterLibccMultiMap.py
    lldb-Suite :: commands/breakpoint/basic/TestBreakpointCommand.py
    lldb-Suite :: functionalities/data-formatter/dump_dynamic/TestDumpDynamic.py
    lldb-Suite :: python_api/name_lookup/TestNameLookup.py
    lldb-Suite :: python_api/target/TestTargetAPI.py
    lldb-Suite :: commands/expression/unicode-in-variable/TestUnicodeInVariable.py
    lldb-Suite :: functionalities/thread/step_until/TestStepUntil.py
    lldb-Suite :: functionalities/avoids-fd-leak/TestFdLeak.py
    lldb-Suite :: commands/expression/save_jit_objects/TestSaveJITObjects.py
    lldb-Suite :: python_api/sbdata/TestSBData.py
    lldb-Suite :: lang/c/local_variables/TestLocalVariables.py
    lldb-Suite :: functionalities/rerun/TestRerun.py
    lldb-Suite :: macosx/duplicate-archive-members/TestDuplicateMembers.py
    lldb-Suite :: lang/objc/foundation/TestConstStrings.py
    lldb-Suite :: functionalities/thread/concurrent_events/TestConcurrentSignalBreak.py
    lldb-Suite :: functionalities/thread/concurrent_events/TestConcurrentDelayedCrashWithBreakpointSignal.py
    lldb-Suite :: commands/expression/persistent_types/TestPersistentTypes.py
    lldb-Suite :: functionalities/data-formatter/data-formatter-stl/libstdcpp/unique_ptr/invalid/TestDataFormatterInvalidStdUniquePtr.py
    lldb-Suite :: python_api/symbol-context/TestSymbolContext.py
    lldb-Suite :: functionalities/data-formatter/data-formatter-objc/TestDataFormatterObjCNSDate.py
    lldb-Suite :: functionalities/data-formatter/user-format-vs-summary/TestUserFormatVsSummary.py
    lldb-Suite :: lang/c/inlines/TestRedefinitionsInInlines.py
    lldb-Suite :: lang/cpp/dynamic-value-same-basename/TestDynamicValueSameBase.py
    lldb-Suite :: lang/cpp/signed_types/TestSignedTypes.py
    lldb-Suite :: lang/objcxx/hide-runtime-values/TestObjCXXHideRuntimeValues.py
    lldb-Suite :: commands/expression/radar_9673664/TestExprHelpExamples.py
    lldb-Suite :: python_api/process/io/TestProcessIO.py
    lldb-Suite :: lang/objc/ptr_refs/TestPtrRefsObjC.py
    lldb-Suite :: lang/cpp/breakpoint-commands/TestCPPBreakpointCommands.py
    lldb-Suite :: python_api/class_members/TestSBTypeClassMembers.py
    lldb-Suite :: lang/objc/objc-ivar-stripped/TestObjCIvarStripped.py
    lldb-Suite :: lang/c/find_struct_type/TestFindStructTypes.py
    lldb-Suite :: functionalities/data-formatter/refpointer-recursion/TestDataFormatterRefPtrRecursion.py
    lldb-Suite :: functionalities/process_group/TestChangeProcessGroup.py
    lldb-Suite :: functionalities/exec/TestExec.py
    lldb-Suite :: lang/cpp/class_types/TestClassTypesDisassembly.py
    lldb-Suite :: functionalities/data-formatter/data-formatter-stl/libcxx/variant/TestDataFormatterLibcxxVariant.py
    lldb-Suite :: lang/objc/objc-class-method/TestObjCClassMethod.py
    lldb-Suite :: functionalities/data-formatter/data-formatter-objc/TestDataFormatterObjCPlain.py
    lldb-Suite :: functionalities/data-formatter/data-formatter-objc/TestDataFormatterObjCNSContainer.py
    lldb-Suite :: functionalities/data-formatter/data-formatter-objc/nsstring/TestDataFormatterNSString.py
    lldb-Suite :: commands/expression/persistent_ptr_update/TestPersistentPtrUpdate.py
    lldb-Suite :: functionalities/data-formatter/data-formatter-stl/libcxx/optional/TestDataFormatterLibcxxOptional.py
    lldb-Suite :: functionalities/data-formatter/format-propagation/TestFormatPropagation.py
    lldb-Suite :: lang/cpp/gmodules-templates/TestGModules.py
    lldb-Suite :: commands/expression/class_template_specialization_empty_pack/TestClassTemplateSpecializationParametersHandling.py
    lldb-Suite :: python_api/value/change_values/TestChangeValueAPI.py
    lldb-Suite :: lang/cpp/dynamic-value/TestCppValueCast.py
    lldb-Suite :: lang/c/stepping/TestStepAndBreakpoints.py
    lldb-Suite :: commands/frame/diagnose/dereference-this/TestDiagnoseDereferenceThis.py
    lldb-Suite :: commands/disassemble/basic/TestFrameDisassemble.py
    lldb-Suite :: lang/objc/foundation/TestObjCMethods2.py
    lldb-Suite :: lang/objc/objc++/TestObjCXX.py
    lldb-Suite :: functionalities/non-overlapping-index-variable-i/TestIndexVariable.py
    lldb-Suite :: functionalities/data-formatter/data-formatter-categories/TestDataFormatterCategories.py
    lldb-Suite :: lang/objcxx/class-name-clash/TestNameClash.py
    lldb-Suite :: commands/expression/radar_8638051/Test8638051.py
    lldb-Suite :: lang/cpp/this/TestCPPThis.py
    lldb-Suite :: commands/expression/persist_objc_pointeetype/TestPersistObjCPointeeType.py
    lldb-Suite :: commands/statistics/basic/TestStats.py
    lldb-Suite :: functionalities/data-formatter/data-formatter-stl/libcxx/atomic/TestLibCxxAtomic.py
    lldb-Suite :: lang/cpp/static_methods/TestCPPStaticMethods.py
    lldb-Suite :: lang/cpp/rvalue-references/TestRvalueReferences.py
    lldb-Suite :: python_api/lldbutil/process/TestPrintStackTraces.py
    lldb-Suite :: functionalities/thread/concurrent_events/TestConcurrentManyBreakpoints.py
    lldb-Suite :: functionalities/tail_call_frames/thread_step_out_or_return/TestSteppingOutWithArtificialFrames.py
    lldb-Suite :: python_api/hello_world/TestHelloWorld.py
    lldb-Suite :: python_api/exprpath_synthetic/TestExprPathSynthetic.py
    lldb-Suite :: lang/objc/foundation/TestObjCMethodsNSError.py
    lldb-Suite :: lang/cpp/namespace_conflicts/TestNamespaceConflicts.py
    lldb-Suite :: functionalities/archives/TestBSDArchives.py
    lldb-Suite :: functionalities/thread/thread_exit/TestThreadExit.py
    lldb-Suite :: lang/objc/rdar-11355592/TestRdar11355592.py
    lldb-Suite :: lang/c/blocks/TestBlocks.py
    lldb-Suite :: lang/c/strings/TestCStrings.py
    lldb-Suite :: lang/c/anonymous/TestAnonymous.py
    lldb-Suite :: commands/expression/ir-interpreter/TestIRInterpreter.py
    lldb-Suite :: functionalities/thread/concurrent_events/TestConcurrentSignalDelayBreak.py
    lldb-Suite :: lang/c/struct_types/TestStructTypes.py
    lldb-Suite :: commands/command/script/TestCommandScript.py
    lldb-Suite :: functionalities/thread/concurrent_events/TestConcurrentTwoBreakpointsOneDelaySignal.py
    lldb-Suite :: functionalities/thread/jump/TestThreadJump.py
    lldb-Suite :: functionalities/data-formatter/data-formatter-globals/TestDataFormatterGlobals.py
    lldb-Suite :: commands/expression/context-object-objc/TestContextObjectObjc.py
    lldb-Suite :: commands/process/launch/TestProcessLaunch.py
    lldb-Suite :: functionalities/data-formatter/nssetsynth/TestNSSetSynthetic.py
    lldb-Suite :: lang/mixed/TestMixedLanguages.py
    lldb-Suite :: lang/objc/variadic_methods/TestVariadicMethods.py
    lldb-Suite :: functionalities/memory-region/TestMemoryRegion.py
    lldb-Suite :: python_api/lldbutil/frame/TestFrameUtils.py
    lldb-Suite :: commands/target/basic/TestTargetCommand.py
    lldb-Suite :: functionalities/data-formatter/data-formatter-synth/TestDataFormatterSynth.py
    lldb-Suite :: lang/cpp/chained-calls/TestCppChainedCalls.py
    lldb-Suite :: lang/c/const_variables/TestConstVariables.py
    lldb-Suite :: functionalities/float-display/TestFloatDisplay.py
    lldb-Suite :: lang/c/stepping/TestThreadStepping.py
    lldb-Suite :: functionalities/data-formatter/language_category_updates/TestDataFormatterLanguageCategoryUpdates.py
    lldb-Suite :: lang/cpp/std-function-step-into-callable/TestStdFunctionStepIntoCallable.py
    lldb-Suite :: functionalities/data-formatter/data-formatter-objc/TestDataFormatterObjCNSBundle.py
    lldb-Suite :: python_api/function_symbol/TestDisasmAPI.py
    lldb-Suite :: lang/objc/exceptions/TestObjCExceptions.py
    lldb-Suite :: commands/frame/var/TestFrameVar.py
    lldb-Suite :: functionalities/data-formatter/data-formatter-stl/libcxx/list/loop/TestDataFormatterLibcxxListLoop.py
    lldb-Suite :: commands/expression/fixits/TestFixIts.py
    lldb-Suite :: functionalities/data-formatter/synthcapping/TestSyntheticCapping.py
    lldb-Suite :: lang/objc/blocks/TestObjCIvarsInBlocks.py
    lldb-Suite :: sample_test/TestSampleInlineTest.py
    lldb-Suite :: driver/batch_mode/TestBatchMode.py
    lldb-Suite :: commands/expression/completion-in-lambda-and-unnnamed-class/TestCompletionInLambdaAndUnnamedClass.py
    lldb-Suite :: python_api/rdar-12481949/Test-rdar-12481949.py
    lldb-Suite :: commands/frame/diagnose/dereference-argument/TestDiagnoseDereferenceArgument.py
    lldb-Suite :: functionalities/data-formatter/data-formatter-objc/nsindexpath/TestDataFormatterNSIndexPath.py
    lldb-Suite :: functionalities/type_lookup/TestTypeLookup.py
    lldb-Suite :: lang/objc/hidden-ivars/TestHiddenIvars.py
    lldb-Suite :: commands/frame/diagnose/array/TestArray.py
    lldb-Suite :: functionalities/memory/read/TestMemoryRead.py
    lldb-Suite :: commands/frame/diagnose/complicated-expression/TestComplicatedExpression.py
    lldb-Suite :: functionalities/data-formatter/var-in-aggregate-misuse/TestVarInAggregateMisuse.py
    lldb-Suite :: functionalities/data-formatter/data-formatter-objc/TestDataFormatterObjCKVO.py
    lldb-Suite :: lang/objc/foundation/TestObjCMethodsNSArray.py
    lldb-Suite :: functionalities/data-formatter/data-formatter-objc/TestDataFormatterObjCExpr.py
    lldb-Suite :: functionalities/set-data/TestSetData.py
    lldb-Suite :: lang/objc/objc-builtin-types/TestObjCBuiltinTypes.py
    lldb-Suite :: lang/cpp/inlines/TestInlines.py
    lldb-Suite :: linux/builtin_trap/TestBuiltinTrap.py
    lldb-Suite :: functionalities/memory/find/TestMemoryFind.py
    lldb-Suite :: lang/cpp/call-function/TestCallCPPFunction.py
    lldb-Suite :: lang/objc/objc-baseclass-sbtype/TestObjCBaseClassSBType.py
    lldb-Suite :: functionalities/inferior-changed/TestInferiorChanged.py
    lldb-Suite :: functionalities/data-formatter/data-formatter-stl/libcxx/vbool/TestDataFormatterLibcxxVBool.py
    lldb-Suite :: lang/objc/foundation/TestObjCMethodsString.py
    lldb-Suite :: functionalities/data-formatter/nsarraysynth/TestNSArraySynthetic.py
    lldb-Suite :: commands/disassemble/basic/TestDisassembleBreakpoint.py
    lldb-Suite :: lang/c/step-target/TestStepTarget.py
    lldb-Suite :: commands/expression/persistent_variables/TestPersistentVariables.py
    lldb-Suite :: lang/objc/unicode-string/TestUnicodeString.py
    lldb-Suite :: commands/expression/call-function/TestCallStdStringFunction.py
    lldb-Suite :: functionalities/data-formatter/data-formatter-stl/libcxx/list/TestDataFormatterLibcxxList.py
    lldb-Suite :: functionalities/thread/crash_during_step/TestCrashDuringStep.py
    lldb-Suite :: lang/objc/single-entry-dictionary/TestObjCSingleEntryDictionary.py
    lldb-Suite :: commands/expression/xvalue/TestXValuePrinting.py
    lldb-Suite :: types/TestDoubleTypesExpr.py
    lldb-Suite :: functionalities/data-formatter/summary-string-onfail/Test-rdar-9974002.py
    lldb-Suite :: commands/expression/top-level/TestTopLevelExprs.py
    lldb-Suite :: lang/cpp/offsetof/TestOffsetofCpp.py
    lldb-Suite :: lang/cpp/unique-types/TestUniqueTypes.py
    lldb-Suite :: functionalities/type_completion/TestTypeCompletion.py
    lldb-Suite :: functionalities/data-formatter/data-formatter-stl/libcxx/multiset/TestDataFormatterLibcxxMultiSet.py
    lldb-Suite :: lang/cpp/const_this/TestConstThis.py
    lldb-Suite :: lang/c/modules/TestCModules.py
    lldb-Suite :: lang/cpp/operator-overload/TestOperatorOverload.py
    lldb-Suite :: lang/c/bitfields/TestBitfields.py
    lldb-Suite :: functionalities/data-formatter/data-formatter-objc/TestDataFormatterObjCNSURL.py
    lldb-Suite :: functionalities/data-formatter/data-formatter-stl/libcxx/iterator/TestDataFormatterLibccIterator.py
    lldb-Suite :: lang/cpp/template/TestTemplateArgs.py
    lldb-Suite :: functionalities/data-formatter/data-formatter-skip-summary/TestDataFormatterSkipSummary.py
    lldb-Suite :: functionalities/load_unload/TestLoadUnload.py
    lldb-Suite :: lang/c/set_values/TestSetValues.py
    lldb-Suite :: source-manager/TestSourceManager.py
    lldb-Suite :: functionalities/data-formatter/vector-types/TestVectorTypesFormatting.py
    lldb-Suite :: commands/expression/test/TestExprs2.py
    lldb-Suite :: commands/expression/pr35310/TestExprsBug35310.py
    lldb-Suite :: functionalities/data-formatter/boolreference/TestFormattersBoolRefPtr.py
    lldb-Suite :: python_api/frame/get-variables/TestGetVariables.py
    lldb-Suite :: lang/objc/objc-super/TestObjCSuper.py
    lldb-Suite :: lang/objcxx/objcxx-ivar-vector/TestIvarVector.py
    lldb-Suite :: functionalities/data-formatter/data-formatter-disabling/TestDataFormatterDisabling.py
    lldb-Suite :: functionalities/data-formatter/data-formatter-stl/libcxx/map/TestDataFormatterLibccMap.py
    lldb-Suite :: lang/c/unicode/TestUnicodeSymbols.py
    lldb-Suite :: functionalities/data-formatter/data-formatter-synthtype/TestDataFormatterSynthType.py
    lldb-Suite :: functionalities/data-formatter/data-formatter-smart-array/TestDataFormatterSmartArray.py
    lldb-Suite :: commands/expression/two-files/TestObjCTypeQueryFromOtherCompileUnit.py
    lldb-Suite :: functionalities/data-formatter/data-formatter-stl/libcxx/bitset/TestDataFormatterLibcxxBitset.py
    lldb-Suite :: functionalities/thread/step_out/TestThreadStepOut.py
    lldb-Suite :: functionalities/data-formatter/varscript_formatting/TestDataFormatterVarScriptFormatting.py
    lldb-Suite :: functionalities/thread/create_after_attach/TestCreateAfterAttach.py
    lldb-Suite :: commands/expression/completion/TestExprCompletion.py
    lldb-Suite :: lang/cpp/class_types/TestClassTypes.py
    lldb-Suite :: macosx/add-dsym/TestAddDsymMidExecutionCommand.py
    lldb-Suite :: commands/expression/dont_allow_jit/TestAllowJIT.py
    lldb-Suite :: functionalities/data-formatter/data-formatter-stl/libcxx/string/TestDataFormatterLibcxxString.py
    lldb-Suite :: functionalities/data-formatter/data-formatter-stl/libcxx/unordered/TestDataFormatterUnordered.py
    lldb-Suite :: lang/cpp/function_refs/TestFunctionRefs.py
    lldb-Suite :: lang/objc/objc-struct-argument/TestObjCStructArgument.py
    lldb-Suite :: commands/expression/formatters/TestFormatters.py
    lldb-Suite :: commands/expression/dollar-in-variable/TestDollarInVariable.py
    lldb-Suite :: commands/expression/scoped_enums/TestScopedEnumType.py
    lldb-Suite :: lang/cpp/scope/TestCppScope.py
    lldb-Suite :: python_api/frame/inlines/TestInlinedFrame.py
    lldb-Suite :: lang/objc/objc-ivar-protocols/TestIvarProtocols.py
    lldb-Suite :: lang/cpp/incomplete-types/TestCppIncompleteTypes.py
    lldb-Suite :: commands/expression/no-deadlock/TestExprDoesntBlock.py
    lldb-Suite :: python_api/process/TestProcessAPI.py
    lldb-Suite :: commands/expression/context-object/TestContextObject.py
    lldb-Suite :: functionalities/recursion/TestValueObjectRecursion.py
    lldb-Suite :: lang/objc/radar-9691614/TestObjCMethodReturningBOOL.py
    lldb-Suite :: functionalities/data-formatter/data-formatter-stl/libcxx/set/TestDataFormatterLibcxxSet.py
    lldb-Suite :: lang/objc/objc-new-syntax/TestObjCNewSyntaxDictionary.py
    lldb-Suite :: functionalities/data-formatter/data-formatter-synthval/TestDataFormatterSynthVal.py
    lldb-Suite :: functionalities/value_md5_crash/TestValueMD5Crash.py
    lldb-Suite :: lang/cpp/virtual-overload/TestVirtualOverload.py
    lldb-Suite :: sample_test/TestSampleTest.py
    lldb-Suite :: functionalities/data-formatter/type_summary_list_script/TestTypeSummaryListScript.py
    lldb-Suite :: functionalities/data-formatter/data-formatter-enum-format/TestDataFormatterEnumFormat.py
    lldb-Suite :: api/check_public_api_headers/TestPublicAPIHeaders.py
    lldb-Suite :: lang/c/shared_lib/TestSharedLib.py
    lldb-Suite :: lang/objc/objc-static-method/TestObjCStaticMethod.py
    lldb-Suite :: lang/c/global_variables/TestGlobalVariables.py
    lldb-Suite :: commands/breakpoint/basic/TestRegexpBreakCommand.py
    lldb-Suite :: functionalities/data-formatter/data-formatter-proper-plurals/TestFormattersOneIsSingular.py
    lldb-Suite :: functionalities/thread/concurrent_events/TestConcurrentTwoBreakpointThreads.py
    lldb-Suite :: functionalities/data-formatter/data-formatter-named-summaries/TestDataFormatterNamedSummaries.py
    lldb-Suite :: commands/expression/multiline-completion/TestMultilineCompletion.py
    lldb-Suite :: lang/c/array_types/TestArrayTypes.py
    lldb-Suite :: functionalities/thread/exit_during_break/TestExitDuringBreak.py
    lldb-Suite :: macosx/find-dsym/bundle-with-dot-in-filename/TestBundleWithDotInFilename.py
    lldb-Suite :: lang/objc/ivar-IMP/TestObjCiVarIMP.py
    lldb-Suite :: lang/objc/real-definition/TestRealDefinition.py
    lldb-Suite :: functionalities/thread/backtrace_all/TestBacktraceAll.py
    lldb-Suite :: lang/objc/modules-cache/TestClangModulesCache.py
    lldb-Suite :: lang/cpp/bool/TestCPPBool.py
    lldb-Suite :: functionalities/load_using_paths/TestLoadUsingPaths.py
    lldb-Suite :: python_api/value_var_update/TestValueVarUpdate.py
    lldb-Suite :: commands/frame/diagnose/dereference-function-return/TestDiagnoseDereferenceFunctionReturn.py
    lldb-Suite :: functionalities/memory/cache/TestMemoryCache.py
    lldb-Suite :: functionalities/thread/concurrent_events/TestConcurrentBreakpointOneDelayBreakpointThreads.py
    lldb-Suite :: functionalities/data-formatter/ptr_ref_typedef/TestPtrRef2Typedef.py
    lldb-Suite :: functionalities/data-formatter/data-formatter-cpp/TestDataFormatterCpp.py
    lldb-Suite :: commands/frame/var-scope/TestFrameVariableScope.py
    lldb-Suite :: lang/cpp/frame-var-anon-unions/TestFrameVariableAnonymousUnions.py
    lldb-Suite :: functionalities/inferior-crashing/TestInferiorCrashing.py
    lldb-Suite :: lang/cpp/template-function/TestTemplateFunctions.py
    lldb-Suite :: commands/expression/unwind_expression/TestUnwindExpression.py
    lldb-Suite :: python_api/signals/TestSignalsAPI.py
    lldb-Suite :: lang/cpp/global_operators/TestCppGlobalOperators.py
    lldb-Suite :: commands/expression/call-overridden-method/TestCallOverriddenMethod.py
    lldb-Suite :: functionalities/data-formatter/hexcaps/TestDataFormatterHexCaps.py
    lldb-Suite :: functionalities/data-formatter/data-formatter-stl/libcxx/forward_list/TestDataFormatterLibcxxForwardList.py
    lldb-Suite :: lang/cpp/lambdas/TestLambdas.py
    lldb-Suite :: functionalities/data-formatter/nsdictionarysynth/TestNSDictionarySynthetic.py
    lldb-Suite :: python_api/thread/TestThreadAPI.py
    lldb-Suite :: lang/objc/conflicting-definition/TestConflictingDefinition.py
    lldb-Suite :: lang/objc/foundation/TestObjectDescriptionAPI.py
    lldb-Suite :: functionalities/data-formatter/poarray/TestPrintObjectArray.py
    lldb-Suite :: lang/cpp/namespace/TestNamespace.py
    lldb-Suite :: lang/c/register_variables/TestRegisterVariables.py
    lldb-Suite :: macosx/indirect_symbol/TestIndirectSymbols.py
    lldb-Suite :: python_api/formatters/TestFormattersSBAPI.py
    lldb-Suite :: python_api/frame/TestFrames.py
    lldb-Suite :: types/TestIntegerTypesExpr.py
    lldb-Suite :: lang/objcxx/cxx-bridged-po/TestObjCXXBridgedPO.py
    lldb-Suite :: functionalities/data-formatter/compactvectors/TestCompactVectors.py
    lldb-Suite :: commands/expression/po_verbosity/TestPoVerbosity.py
    lldb-Suite :: lang/cpp/namespace_definitions/TestNamespaceDefinitions.py
    lldb-Suite :: commands/expression/anonymous-struct/TestCallUserAnonTypedef.py
    lldb-Suite :: functionalities/data-formatter/parray/TestPrintArray.py
    lldb-Suite :: commands/expression/ir-interpreter-phi-nodes/TestIRInterpreterPHINodes.py
    lldb-Suite :: lang/objc/objc-ivar-offsets/TestObjCIvarOffsets.py
    lldb-Suite :: functionalities/inferior-assert/TestInferiorAssert.py
    lldb-Suite :: lang/c/forward/TestForwardDeclaration.py
    lldb-Suite :: lang/cpp/auto/TestCPPAuto.py
    lldb-Suite :: python_api/function_symbol/TestSymbolAPI.py
    lldb-Suite :: commands/expression/rdar42038760/TestScalarURem.py
    lldb-Suite :: lang/c/unions/TestUnionMembers.py
    lldb-Suite :: functionalities/return-value/TestReturnValue.py
    lldb-Suite :: functionalities/inferior-crashing/recursive-inferior/TestRecursiveInferior.py
    lldb-Suite :: lang/objc/rdar-10967107/TestRdar10967107.py
    lldb-Suite :: functionalities/data-formatter/pyobjsynthprovider/TestPyObjSynthProvider.py
    lldb-Suite :: lang/objc/objc-optimized/TestObjcOptimized.py
    lldb-Suite :: commands/gui/basic/TestGuiBasic.py
    lldb-Suite :: python_api/process/read-mem-cstring/TestReadMemCString.py
    lldb-Suite :: commands/frame/diagnose/inheritance/TestDiagnoseInheritance.py
    lldb-Suite :: commands/target/stop-hooks/TestStopHooks.py
    lldb-Suite :: lang/objc/objc-checker/TestObjCCheckers.py
    lldb-Suite :: types/TestRecursiveTypes.py
    lldb-Suite :: lang/objc/objc-dyn-sbtype/TestObjCDynamicSBType.py
    lldb-Suite :: functionalities/inline-stepping/TestInlineStepping.py
    lldb-Suite :: python_api/findvalue_duplist/TestSBFrameFindValue.py
    lldb-Suite :: commands/expression/rdar44436068/Test128BitsInteger.py
    lldb-Suite :: commands/expression/call-function/TestCallStopAndContinue.py
    lldb-Suite :: lang/cpp/member-and-local-vars-with-same-name/TestMembersAndLocalsWithSameName.py
    lldb-Suite :: lang/objc/modules-inline-functions/TestModulesInlineFunctions.py
    lldb-Suite :: lang/objc/foundation/TestRuntimeTypes.py
    lldb-Suite :: lang/objc/objc-property/TestObjCProperty.py
    lldb-Suite :: functionalities/data-formatter/data-formatter-objc/TestDataFormatterObjCCF.py
    lldb-Suite :: functionalities/thread/concurrent_events/TestConcurrentDelaySignalBreak.py
    lldb-Suite :: functionalities/data-formatter/data-formatter-objc/TestDataFormatterObjNSException.py
    lldb-Suite :: commands/command/nested_alias/TestNestedAlias.py
    lldb-Suite :: python_api/sbvalue_const_addrof/TestSBValueConstAddrOf.py
    lldb-Suite :: lang/objc/self/TestObjCSelf.py
    lldb-Suite :: lang/c/function_types/TestFunctionTypes.py
    lldb-Suite :: commands/expression/options/TestExprOptions.py
    lldb-Suite :: functionalities/data-formatter/data-formatter-advanced/TestDataFormatterAdv.py
    lldb-Suite :: lang/c/tls_globals/TestTlsGlobals.py
    lldb-Suite :: lang/cpp/symbols/TestSymbols.py
    lldb-Suite :: python_api/value/linked_list/TestValueAPILinkedList.py
    lldb-Suite :: python_api/value/empty_class/TestValueAPIEmptyClass.py
    lldb-Suite :: functionalities/data-formatter/data-formatter-python-synth/TestDataFormatterPythonSynth.py
    lldb-Suite :: lang/objc/objc-foundation-dictionary-empty/TestNSDictionary0.py
    lldb-Suite :: lang/cpp/limit-debug-info/TestWithLimitDebugInfo.py
    lldb-Suite :: lang/objc/global_ptrs/TestGlobalObjects.py
    lldb-Suite :: functionalities/inferior-crashing/TestInferiorCrashingStep.py
    lldb-Suite :: macosx/find-app-in-bundle/TestFindAppInBundle.py

********************
Timed Out Tests (3):
    lldb-Suite :: lang/objc/foundation/TestObjCMethods.py
    lldb-Suite :: python_api/lldbutil/iter/TestRegistersIterator.py
    lldb-Suite :: python_api/lldbutil/iter/TestLLDBIterator.py


Slowest Tests:
--------------------------------------------------------------------------
19.23s: lldb-Suite :: lang/objc/foundation/TestObjCMethodsString.py
20.59s: lldb-Suite :: lang/objc/objc-new-syntax/TestObjCNewSyntaxArray.py
20.98s: lldb-Suite :: python_api/module_section/TestModuleAndSection.py
22.66s: lldb-Suite :: lang/objc/real-definition/TestRealDefinition.py
26.73s: lldb-Suite :: lang/objc/objc-new-syntax/TestObjCNewSyntaxLiteral.py
26.88s: lldb-Suite :: lang/objc/foundation/TestObjCMethodsNSError.py
27.29s: lldb-Suite :: lang/objc/exceptions/TestObjCExceptions.py
31.37s: lldb-Suite :: commands/gui/basic/TestGuiBasic.py
35.26s: lldb-Suite :: types/TestIntegerTypesExpr.py
40.54s: lldb-Suite :: types/TestIntegerTypes.py
42.06s: lldb-Suite :: lang/objc/hidden-ivars/TestHiddenIvars.py
42.67s: lldb-Suite :: api/multithreaded/TestMultithreaded.py
62.04s: lldb-Suite :: commands/expression/multiline-completion/TestMultilineCompletion.py
70.18s: lldb-Suite :: macosx/nslog/TestDarwinNSLogOutput.py
72.68s: lldb-Suite :: tools/lldb-server/TestLldbGdbServer.py
94.48s: lldb-Suite :: driver/batch_mode/TestBatchMode.py
229.12s: lldb-Suite :: lang/objc/foundation/TestFoundationDisassembly.py
600.04s: lldb-Suite :: python_api/lldbutil/iter/TestRegistersIterator.py
600.04s: lldb-Suite :: python_api/lldbutil/iter/TestLLDBIterator.py
600.05s: lldb-Suite :: lang/objc/foundation/TestObjCMethods.py

Tests Times:
--------------------------------------------------------------------------
[   Range   ] :: [               Percentage               ] :: [  Count  ]
--------------------------------------------------------------------------
[  0s, 50s) :: [*************************************** ] :: [1697/1705]
[ 50s,100s) :: [                                        ] :: [   3/1705]
[100s,150s) :: [                                        ] :: [   1/1705]
[150s,200s) :: [                                        ] :: [   0/1705]
[200s,250s) :: [                                        ] :: [   1/1705]
[250s,300s) :: [                                        ] :: [   0/1705]
[300s,350s) :: [                                        ] :: [   0/1705]
[350s,400s) :: [                                        ] :: [   0/1705]
[400s,450s) :: [                                        ] :: [   0/1705]
[450s,500s) :: [                                        ] :: [   0/1705]
[500s,550s) :: [                                        ] :: [   0/1705]
[550s,600s) :: [                                        ] :: [   0/1705]
[600s,650s) :: [                                        ] :: [   3/1705]
  Expected Passes    : 1196
  Expected Failures  : 5
  Unsupported Tests  : 89
  Unexpected Failures: 412
  Individual Timeouts: 3
FAILED: tools/lldb/lit/CMakeFiles/check-lldb-lit 
cd /Users/buildslave/jenkins/workspace/lldb-cmake-matrix/lldb-build/tools/lldb/lit && /usr/bin/python /Users/buildslave/jenkins/workspace/lldb-cmake-matrix/lldb-build/./bin/llvm-lit -v --time-tests --shuffle --xunit-xml-output=/Users/buildslave/jenkins/workspace/lldb-cmake-matrix/test/results.xml -v /Users/buildslave/jenkins/workspace/lldb-cmake-matrix/lldb-build/tools/lldb/lit
ninja: build stopped: subcommand failed.
Command failed 
Command: ['/usr/bin/env', 'TERM=vt100', '/usr/local/bin/ninja', '-v', 'check-lldb']
+ set -e