Regression

Test Clang 5.0.2 / lldb-api.functionalities/mtc/simple.TestMTCSimple.py (from lldb-api)

Failing for the past 1 build (Since #3643 )
Took 4.3 sec.

Stacktrace

Script:
--
/usr/local/Frameworks/Python.framework/Versions/3.7/bin/python3.7 /Users/buildslave/jenkins/workspace/lldb-cmake-matrix/llvm-project/lldb/test/API/dotest.py -u CXXFLAGS -u CFLAGS --codesign-identity lldb_codesign --arch x86_64 --build-dir /Users/buildslave/jenkins/workspace/lldb-cmake-matrix/lldb-build/lldb-test-build.noindex -t --env TERM=vt100 --skip-category gmodules --skip-category watchpoint --arch=x86_64 --env LLVM_LIBS_DIR=/Users/buildslave/jenkins/workspace/lldb-cmake-matrix/lldb-build/./lib --arch x86_64 --build-dir /Users/buildslave/jenkins/workspace/lldb-cmake-matrix/lldb-build/lldb-test-build.noindex --lldb-module-cache-dir /Users/buildslave/jenkins/workspace/lldb-cmake-matrix/lldb-build/lldb-test-build.noindex/module-cache-lldb/lldb-api --clang-module-cache-dir /Users/buildslave/jenkins/workspace/lldb-cmake-matrix/lldb-build/lldb-test-build.noindex/module-cache-clang/lldb-api --executable /Users/buildslave/jenkins/workspace/lldb-cmake-matrix/lldb-build/./bin/lldb --compiler /Users/buildslave/jenkins/workspace/lldb-cmake-matrix/clang_502_build/bin/clang --dsymutil /Users/buildslave/jenkins/workspace/lldb-cmake-matrix/lldb-build/./bin/dsymutil --llvm-tools-dir /Users/buildslave/jenkins/workspace/lldb-cmake-matrix/lldb-build/./bin --lldb-libs-dir /Users/buildslave/jenkins/workspace/lldb-cmake-matrix/lldb-build/./lib /Users/buildslave/jenkins/workspace/lldb-cmake-matrix/llvm-project/lldb/test/API/functionalities/mtc/simple -p TestMTCSimple.py
--
Exit Code: 1

Command Output (stdout):
--
lldb version 13.0.99 (http://labmaster3.local/git/llvm-project.git revision e484e1ae03325823c469684d7d1532f2aadbe98d)
  clang revision e484e1ae03325823c469684d7d1532f2aadbe98d
  llvm revision e484e1ae03325823c469684d7d1532f2aadbe98d
Skipping the following test categories: ['gmodules', 'watchpoint', 'libstdcxx', 'dwo', 'llgs', 'fork']

--
Command Output (stderr):
--
Change dir to: /Users/buildslave/jenkins/workspace/lldb-cmake-matrix/llvm-project/lldb/test/API/functionalities/mtc/simple
runCmd: settings clear -all
output: 

runCmd: settings set symbols.enable-external-lookup false
output: 

runCmd: settings set target.inherit-tcc true
output: 

runCmd: settings set target.detach-on-error false
output: 

runCmd: settings set target.auto-apply-fixits false
output: 

runCmd: settings set plugin.process.gdb-remote.packet-timeout 60
output: 

runCmd: settings set symbols.clang-modules-cache-path "/Users/buildslave/jenkins/workspace/lldb-cmake-matrix/lldb-build/lldb-test-build.noindex/module-cache-lldb/lldb-api"
output: 

runCmd: settings set use-color false
output: 

runCmd: setting set target.prefer-dynamic-value no-dynamic-values
output: 

FAIL: LLDB (/Users/buildslave/jenkins/workspace/lldb-cmake-matrix/clang_502_build/bin/clang-x86_64) :: test_dsym (TestMTCSimple.MTCSimpleTestCase)
runCmd: settings clear -all
output: 

runCmd: settings set symbols.enable-external-lookup false
output: 

runCmd: settings set target.inherit-tcc true
output: 

runCmd: settings set target.detach-on-error false
output: 

runCmd: settings set target.auto-apply-fixits false
output: 

runCmd: settings set plugin.process.gdb-remote.packet-timeout 60
output: 

runCmd: settings set symbols.clang-modules-cache-path "/Users/buildslave/jenkins/workspace/lldb-cmake-matrix/lldb-build/lldb-test-build.noindex/module-cache-lldb/lldb-api"
output: 

runCmd: settings set use-color false
output: 

runCmd: setting set target.prefer-dynamic-value no-dynamic-values
output: 

FAIL: LLDB (/Users/buildslave/jenkins/workspace/lldb-cmake-matrix/clang_502_build/bin/clang-x86_64) :: test_dwarf (TestMTCSimple.MTCSimpleTestCase)
UNSUPPORTED: LLDB (/Users/buildslave/jenkins/workspace/lldb-cmake-matrix/clang_502_build/bin/clang-x86_64) :: test_dwo (TestMTCSimple.MTCSimpleTestCase) (test case does not fall in any category of interest for this run) 
UNSUPPORTED: LLDB (/Users/buildslave/jenkins/workspace/lldb-cmake-matrix/clang_502_build/bin/clang-x86_64) :: test_gmodules (TestMTCSimple.MTCSimpleTestCase) (test case does not fall in any category of interest for this run) 
Restore dir to: /Users/buildslave/jenkins/workspace/lldb-cmake-matrix/lldb-build/tools/lldb/test
======================================================================
ERROR: test_dsym (TestMTCSimple.MTCSimpleTestCase)
----------------------------------------------------------------------
Error when building test subject.

Build Command:
make VPATH=/Users/buildslave/jenkins/workspace/lldb-cmake-matrix/llvm-project/lldb/test/API/functionalities/mtc/simple -C /Users/buildslave/jenkins/workspace/lldb-cmake-matrix/lldb-build/lldb-test-build.noindex/functionalities/mtc/simple/TestMTCSimple.test_dsym -I /Users/buildslave/jenkins/workspace/lldb-cmake-matrix/llvm-project/lldb/test/API/functionalities/mtc/simple -I /Users/buildslave/jenkins/workspace/lldb-cmake-matrix/llvm-project/lldb/packages/Python/lldbsuite/test/make -f /Users/buildslave/jenkins/workspace/lldb-cmake-matrix/llvm-project/lldb/test/API/functionalities/mtc/simple/Makefile MAKE_DSYM=YES  ARCH=x86_64 CC="/Users/buildslave/jenkins/workspace/lldb-cmake-matrix/clang_502_build/bin/clang" DSYMUTIL="/Users/buildslave/jenkins/workspace/lldb-cmake-matrix/lldb-build/./bin/dsymutil"  CLANG_MODULE_CACHE_DIR=/Users/buildslave/jenkins/workspace/lldb-cmake-matrix/lldb-build/lldb-test-build.noindex/module-cache-clang/lldb-api all 

Build Command Output:
/Users/buildslave/jenkins/workspace/lldb-cmake-matrix/clang_502_build/bin/clang -g -O0 -fno-builtin -isysroot "/Applications/Xcode.app/Contents/Developer/Platforms/MacOSX.platform/Developer/SDKs/MacOSX10.15.sdk" -arch x86_64  -I/Users/buildslave/jenkins/workspace/lldb-cmake-matrix/llvm-project/lldb/packages/Python/lldbsuite/test/make/../../../../../include -I/Users/buildslave/jenkins/workspace/lldb-cmake-matrix/llvm-project/lldb/test/API/functionalities/mtc/simple -I/Users/buildslave/jenkins/workspace/lldb-cmake-matrix/llvm-project/lldb/packages/Python/lldbsuite/test/make -include /Users/buildslave/jenkins/workspace/lldb-cmake-matrix/llvm-project/lldb/packages/Python/lldbsuite/test/make/test_common.h  -fno-limit-debug-info   -MT main.o -MD -MP -MF main.d -c -o main.o /Users/buildslave/jenkins/workspace/lldb-cmake-matrix/llvm-project/lldb/test/API/functionalities/mtc/simple/main.m
In file included from /Users/buildslave/jenkins/workspace/lldb-cmake-matrix/llvm-project/lldb/test/API/functionalities/mtc/simple/main.m:3:
In file included from /Applications/Xcode.app/Contents/Developer/Platforms/MacOSX.platform/Developer/SDKs/MacOSX10.15.sdk/System/Library/Frameworks/AppKit.framework/Headers/AppKit.h:12:
/Applications/Xcode.app/Contents/Developer/Platforms/MacOSX.platform/Developer/SDKs/MacOSX10.15.sdk/System/Library/Frameworks/AppKit.framework/Headers/AppKitErrors.h:10:1: error: expected '('
API_UNAVAILABLE_BEGIN(ios)
^
/Applications/Xcode.app/Contents/Developer/Platforms/MacOSX.platform/Developer/SDKs/MacOSX10.15.sdk/usr/include/os/availability.h:104:40: note: expanded from macro 'API_UNAVAILABLE_BEGIN'
    #define API_UNAVAILABLE_BEGIN(...) _Pragma("clang attribute push") __API_UNAVAILABLE_BEGIN_GET_MACRO(__VA_ARGS__,__API_UNAVAILABLE_BEGIN7,__API_UNAVAILABLE_BEGIN6, __API_UNAVAILABLE_BEGIN5, __API_UNAVAILABLE_BEGIN4, __API_UNAVAILABLE_BEGIN3, __API_UNAVAILABLE_BEGIN2, __API_UNAVAILABLE_BEGIN1, 0)(__VA_ARGS__)
                                       ^
<scratch space>:29:22: note: expanded from here
 clang attribute push
                     ^
In file included from /Users/buildslave/jenkins/workspace/lldb-cmake-matrix/llvm-project/lldb/test/API/functionalities/mtc/simple/main.m:3:
In file included from /Applications/Xcode.app/Contents/Developer/Platforms/MacOSX.platform/Developer/SDKs/MacOSX10.15.sdk/System/Library/Frameworks/AppKit.framework/Headers/AppKit.h:12:
/Applications/Xcode.app/Contents/Developer/Platforms/MacOSX.platform/Developer/SDKs/MacOSX10.15.sdk/System/Library/Frameworks/AppKit.framework/Headers/AppKitErrors.h:10:1: error: expected 'push' or 'pop' after '#pragma clang attribute'
/Applications/Xcode.app/Contents/Developer/Platforms/MacOSX.platform/Developer/SDKs/MacOSX10.15.sdk/usr/include/os/availability.h:104:273: note: expanded from macro 'API_UNAVAILABLE_BEGIN'
    #define API_UNAVAILABLE_BEGIN(...) _Pragma("clang attribute push") __API_UNAVAILABLE_BEGIN_GET_MACRO(__VA_ARGS__,__API_UNAVAILABLE_BEGIN7,__API_UNAVAILABLE_BEGIN6, __API_UNAVAILABLE_BEGIN5, __API_UNAVAILABLE_BEGIN4, __API_UNAVAILABLE_BEGIN3, __API_UNAVAILABLE_BEGIN2, __API_UNAVAILABLE_BEGIN1, 0)(__VA_ARGS__)
                                                                                                                                                                                                                                                                                ^
In file included from /Users/buildslave/jenkins/workspace/lldb-cmake-matrix/llvm-project/lldb/test/API/functionalities/mtc/simple/main.m:3:
In file included from /Applications/Xcode.app/Contents/Developer/Platforms/MacOSX.platform/Developer/SDKs/MacOSX10.15.sdk/System/Library/Frameworks/AppKit.framework/Headers/AppKit.h:13:
In file included from /Applications/Xcode.app/Contents/Developer/Platforms/MacOSX.platform/Developer/SDKs/MacOSX10.15.sdk/System/Library/Frameworks/AppKit.framework/Headers/NSGraphicsContext.h:9:
/Applications/Xcode.app/Contents/Developer/Platforms/MacOSX.platform/Developer/SDKs/MacOSX10.15.sdk/System/Library/Frameworks/AppKit.framework/Headers/NSGraphics.h:12:1: error: expected '('
API_UNAVAILABLE_BEGIN(ios)
^
/Applications/Xcode.app/Contents/Developer/Platforms/MacOSX.platform/Developer/SDKs/MacOSX10.15.sdk/usr/include/os/availability.h:104:40: note: expanded from macro 'API_UNAVAILABLE_BEGIN'
    #define API_UNAVAILABLE_BEGIN(...) _Pragma("clang attribute push") __API_UNAVAILABLE_BEGIN_GET_MACRO(__VA_ARGS__,__API_UNAVAILABLE_BEGIN7,__API_UNAVAILABLE_BEGIN6, __API_UNAVAILABLE_BEGIN5, __API_UNAVAILABLE_BEGIN4, __API_UNAVAILABLE_BEGIN3, __API_UNAVAILABLE_BEGIN2, __API_UNAVAILABLE_BEGIN1, 0)(__VA_ARGS__)
                                       ^
<scratch space>:45:22: note: expanded from here
 clang attribute push
                     ^
In file included from /Users/buildslave/jenkins/workspace/lldb-cmake-matrix/llvm-project/lldb/test/API/functionalities/mtc/simple/main.m:3:
In file included from /Applications/Xcode.app/Contents/Developer/Platforms/MacOSX.platform/Developer/SDKs/MacOSX10.15.sdk/System/Library/Frameworks/AppKit.framework/Headers/AppKit.h:13:
In file included from /Applications/Xcode.app/Contents/Developer/Platforms/MacOSX.platform/Developer/SDKs/MacOSX10.15.sdk/System/Library/Frameworks/AppKit.framework/Headers/NSGraphicsContext.h:9:
/Applications/Xcode.app/Contents/Developer/Platforms/MacOSX.platform/Developer/SDKs/MacOSX10.15.sdk/System/Library/Frameworks/AppKit.framework/Headers/NSGraphics.h:12:1: error: expected 'push' or 'pop' after '#pragma clang attribute'
/Applications/Xcode.app/Contents/Developer/Platforms/MacOSX.platform/Developer/SDKs/MacOSX10.15.sdk/usr/include/os/availability.h:104:273: note: expanded from macro 'API_UNAVAILABLE_BEGIN'
    #define API_UNAVAILABLE_BEGIN(...) _Pragma("clang attribute push") __API_UNAVAILABLE_BEGIN_GET_MACRO(__VA_ARGS__,__API_UNAVAILABLE_BEGIN7,__API_UNAVAILABLE_BEGIN6, __API_UNAVAILABLE_BEGIN5, __API_UNAVAILABLE_BEGIN4, __API_UNAVAILABLE_BEGIN3, __API_UNAVAILABLE_BEGIN2, __API_UNAVAILABLE_BEGIN1, 0)(__VA_ARGS__)
                                                                                                                                                                                                                                                                                ^
In file included from /Users/buildslave/jenkins/workspace/lldb-cmake-matrix/llvm-project/lldb/test/API/functionalities/mtc/simple/main.m:3:
In file included from /Applications/Xcode.app/Contents/Developer/Platforms/MacOSX.platform/Developer/SDKs/MacOSX10.15.sdk/System/Library/Frameworks/AppKit.framework/Headers/AppKit.h:12:
/Applications/Xcode.app/Contents/Developer/Platforms/MacOSX.platform/Developer/SDKs/MacOSX10.15.sdk/System/Library/Frameworks/AppKit.framework/Headers/AppKitErrors.h:53:1: error: '#pragma clang attribute pop' with no matching '#pragma clang attribute push'
API_UNAVAILABLE_END
^
/Applications/Xcode.app/Contents/Developer/Platforms/MacOSX.platform/Developer/SDKs/MacOSX10.15.sdk/usr/include/os/availability.h:105:33: note: expanded from macro 'API_UNAVAILABLE_END'
    #define API_UNAVAILABLE_END _Pragma("clang attribute pop")
                                ^
<scratch space>:41:8: note: expanded from here
 clang attribute pop
       ^
In file included from /Users/buildslave/jenkins/workspace/lldb-cmake-matrix/llvm-project/lldb/test/API/functionalities/mtc/simple/main.m:3:
In file included from /Applications/Xcode.app/Contents/Developer/Platforms/MacOSX.platform/Developer/SDKs/MacOSX10.15.sdk/System/Library/Frameworks/AppKit.framework/Headers/AppKit.h:13:
/Applications/Xcode.app/Contents/Developer/Platforms/MacOSX.platform/Developer/SDKs/MacOSX10.15.sdk/System/Library/Frameworks/AppKit.framework/Headers/NSGraphicsContext.h:17:1: error: expected '('
API_UNAVAILABLE_BEGIN(ios)
^
/Applications/Xcode.app/Contents/Developer/Platforms/MacOSX.platform/Developer/SDKs/MacOSX10.15.sdk/usr/include/os/availability.h:104:40: note: expanded from macro 'API_UNAVAILABLE_BEGIN'
    #define API_UNAVAILABLE_BEGIN(...) _Pragma("clang attribute push") __API_UNAVAILABLE_BEGIN_GET_MACRO(__VA_ARGS__,__API_UNAVAILABLE_BEGIN7,__API_UNAVAILABLE_BEGIN6, __API_UNAVAILABLE_BEGIN5, __API_UNAVAILABLE_BEGIN4, __API_UNAVAILABLE_BEGIN3, __API_UNAVAILABLE_BEGIN2, __API_UNAVAILABLE_BEGIN1, 0)(__VA_ARGS__)
                                       ^
<scratch space>:8:22: note: expanded from here
 clang attribute push
                     ^
In file included from /Users/buildslave/jenkins/workspace/lldb-cmake-matrix/llvm-project/lldb/test/API/functionalities/mtc/simple/main.m:3:
In file included from /Applications/Xcode.app/Contents/Developer/Platforms/MacOSX.platform/Developer/SDKs/MacOSX10.15.sdk/System/Library/Frameworks/AppKit.framework/Headers/AppKit.h:13:
/Applications/Xcode.app/Contents/Developer/Platforms/MacOSX.platform/Developer/SDKs/MacOSX10.15.sdk/System/Library/Frameworks/AppKit.framework/Headers/NSGraphicsContext.h:17:1: error: expected 'push' or 'pop' after '#pragma clang attribute'
/Applications/Xcode.app/Contents/Developer/Platforms/MacOSX.platform/Developer/SDKs/MacOSX10.15.sdk/usr/include/os/availability.h:104:273: note: expanded from macro 'API_UNAVAILABLE_BEGIN'
    #define API_UNAVAILABLE_BEGIN(...) _Pragma("clang attribute push") __API_UNAVAILABLE_BEGIN_GET_MACRO(__VA_ARGS__,__API_UNAVAILABLE_BEGIN7,__API_UNAVAILABLE_BEGIN6, __API_UNAVAILABLE_BEGIN5, __API_UNAVAILABLE_BEGIN4, __API_UNAVAILABLE_BEGIN3, __API_UNAVAILABLE_BEGIN2, __API_UNAVAILABLE_BEGIN1, 0)(__VA_ARGS__)
                                                                                                                                                                                                                                                                                ^
In file included from /Users/buildslave/jenkins/workspace/lldb-cmake-matrix/llvm-project/lldb/test/API/functionalities/mtc/simple/main.m:3:
In file included from /Applications/Xcode.app/Contents/Developer/Platforms/MacOSX.platform/Developer/SDKs/MacOSX10.15.sdk/System/Library/Frameworks/AppKit.framework/Headers/AppKit.h:13:
In file included from /Applications/Xcode.app/Contents/Developer/Platforms/MacOSX.platform/Developer/SDKs/MacOSX10.15.sdk/System/Library/Frameworks/AppKit.framework/Headers/NSGraphicsContext.h:9:
/Applications/Xcode.app/Contents/Developer/Platforms/MacOSX.platform/Developer/SDKs/MacOSX10.15.sdk/System/Library/Frameworks/AppKit.framework/Headers/NSGraphics.h:266:1: error: '#pragma clang attribute pop' with no matching '#pragma clang attribute push'
API_UNAVAILABLE_END
^
/Applications/Xcode.app/Contents/Developer/Platforms/MacOSX.platform/Developer/SDKs/MacOSX10.15.sdk/usr/include/os/availability.h:105:33: note: expanded from macro 'API_UNAVAILABLE_END'
    #define API_UNAVAILABLE_END _Pragma("clang attribute pop")
                                ^
<scratch space>:2:8: note: expanded from here
 clang attribute pop
       ^
In file included from /Users/buildslave/jenkins/workspace/lldb-cmake-matrix/llvm-project/lldb/test/API/functionalities/mtc/simple/main.m:3:
In file included from /Applications/Xcode.app/Contents/Developer/Platforms/MacOSX.platform/Developer/SDKs/MacOSX10.15.sdk/System/Library/Frameworks/AppKit.framework/Headers/AppKit.h:13:
/Applications/Xcode.app/Contents/Developer/Platforms/MacOSX.platform/Developer/SDKs/MacOSX10.15.sdk/System/Library/Frameworks/AppKit.framework/Headers/NSGraphicsContext.h:115:1: error: '#pragma clang attribute pop' with no matching '#pragma clang attribute push'
API_UNAVAILABLE_END
^
/Applications/Xcode.app/Contents/Developer/Platforms/MacOSX.platform/Developer/SDKs/MacOSX10.15.sdk/usr/include/os/availability.h:105:33: note: expanded from macro 'API_UNAVAILABLE_END'
    #define API_UNAVAILABLE_END _Pragma("clang attribute pop")
                                ^
<scratch space>:23:8: note: expanded from here
 clang attribute pop
       ^
In file included from /Users/buildslave/jenkins/workspace/lldb-cmake-matrix/llvm-project/lldb/test/API/functionalities/mtc/simple/main.m:3:
In file included from /Applications/Xcode.app/Contents/Developer/Platforms/MacOSX.platform/Developer/SDKs/MacOSX10.15.sdk/System/Library/Frameworks/AppKit.framework/Headers/AppKit.h:14:
In file included from /Applications/Xcode.app/Contents/Developer/Platforms/MacOSX.platform/Developer/SDKs/MacOSX10.15.sdk/System/Library/Frameworks/AppKit.framework/Headers/NSAccessibility.h:9:
/Applications/Xcode.app/Contents/Developer/Platforms/MacOSX.platform/Developer/SDKs/MacOSX10.15.sdk/System/Library/Frameworks/AppKit.framework/Headers/NSErrors.h:13:1: error: expected '('
API_UNAVAILABLE_BEGIN(ios)
^
/Applications/Xcode.app/Contents/Developer/Platforms/MacOSX.platform/Developer/SDKs/MacOSX10.15.sdk/usr/include/os/availability.h:104:40: note: expanded from macro 'API_UNAVAILABLE_BEGIN'
    #define API_UNAVAILABLE_BEGIN(...) _Pragma("clang attribute push") __API_UNAVAILABLE_BEGIN_GET_MACRO(__VA_ARGS__,__API_UNAVAILABLE_BEGIN7,__API_UNAVAILABLE_BEGIN6, __API_UNAVAILABLE_BEGIN5, __API_UNAVAILABLE_BEGIN4, __API_UNAVAILABLE_BEGIN3, __API_UNAVAILABLE_BEGIN2, __API_UNAVAILABLE_BEGIN1, 0)(__VA_ARGS__)
                                       ^
<scratch space>:29:22: note: expanded from here
 clang attribute push
                     ^
In file included from /Users/buildslave/jenkins/workspace/lldb-cmake-matrix/llvm-project/lldb/test/API/functionalities/mtc/simple/main.m:3:
In file included from /Applications/Xcode.app/Contents/Developer/Platforms/MacOSX.platform/Developer/SDKs/MacOSX10.15.sdk/System/Library/Frameworks/AppKit.framework/Headers/AppKit.h:14:
In file included from /Applications/Xcode.app/Contents/Developer/Platforms/MacOSX.platform/Developer/SDKs/MacOSX10.15.sdk/System/Library/Frameworks/AppKit.framework/Headers/NSAccessibility.h:9:
/Applications/Xcode.app/Contents/Developer/Platforms/MacOSX.platform/Developer/SDKs/MacOSX10.15.sdk/System/Library/Frameworks/AppKit.framework/Headers/NSErrors.h:13:1: error: expected 'push' or 'pop' after '#pragma clang attribute'
/Applications/Xcode.app/Contents/Developer/Platforms/MacOSX.platform/Developer/SDKs/MacOSX10.15.sdk/usr/include/os/availability.h:104:273: note: expanded from macro 'API_UNAVAILABLE_BEGIN'
    #define API_UNAVAILABLE_BEGIN(...) _Pragma("clang attribute push") __API_UNAVAILABLE_BEGIN_GET_MACRO(__VA_ARGS__,__API_UNAVAILABLE_BEGIN7,__API_UNAVAILABLE_BEGIN6, __API_UNAVAILABLE_BEGIN5, __API_UNAVAILABLE_BEGIN4, __API_UNAVAILABLE_BEGIN3, __API_UNAVAILABLE_BEGIN2, __API_UNAVAILABLE_BEGIN1, 0)(__VA_ARGS__)
                                                                                                                                                                                                                                                                                ^
In file included from /Users/buildslave/jenkins/workspace/lldb-cmake-matrix/llvm-project/lldb/test/API/functionalities/mtc/simple/main.m:3:
In file included from /Applications/Xcode.app/Contents/Developer/Platforms/MacOSX.platform/Developer/SDKs/MacOSX10.15.sdk/System/Library/Frameworks/AppKit.framework/Headers/AppKit.h:14:
In file included from /Applications/Xcode.app/Contents/Developer/Platforms/MacOSX.platform/Developer/SDKs/MacOSX10.15.sdk/System/Library/Frameworks/AppKit.framework/Headers/NSAccessibility.h:12:
/Applications/Xcode.app/Contents/Developer/Platforms/MacOSX.platform/Developer/SDKs/MacOSX10.15.sdk/System/Library/Frameworks/AppKit.framework/Headers/NSAccessibilityConstants.h:11:1: error: expected '('
API_UNAVAILABLE_BEGIN(ios)
^
/Applications/Xcode.app/Contents/Developer/Platforms/MacOSX.platform/Developer/SDKs/MacOSX10.15.sdk/usr/include/os/availability.h:104:40: note: expanded from macro 'API_UNAVAILABLE_BEGIN'
    #define API_UNAVAILABLE_BEGIN(...) _Pragma("clang attribute push") __API_UNAVAILABLE_BEGIN_GET_MACRO(__VA_ARGS__,__API_UNAVAILABLE_BEGIN7,__API_UNAVAILABLE_BEGIN6, __API_UNAVAILABLE_BEGIN5, __API_UNAVAILABLE_BEGIN4, __API_UNAVAILABLE_BEGIN3, __API_UNAVAILABLE_BEGIN2, __API_UNAVAILABLE_BEGIN1, 0)(__VA_ARGS__)
                                       ^
<scratch space>:42:22: note: expanded from here
 clang attribute push
                     ^
In file included from /Users/buildslave/jenkins/workspace/lldb-cmake-matrix/llvm-project/lldb/test/API/functionalities/mtc/simple/main.m:3:
In file included from /Applications/Xcode.app/Contents/Developer/Platforms/MacOSX.platform/Developer/SDKs/MacOSX10.15.sdk/System/Library/Frameworks/AppKit.framework/Headers/AppKit.h:14:
In file included from /Applications/Xcode.app/Contents/Developer/Platforms/MacOSX.platform/Developer/SDKs/MacOSX10.15.sdk/System/Library/Frameworks/AppKit.framework/Headers/NSAccessibility.h:12:
/Applications/Xcode.app/Contents/Developer/Platforms/MacOSX.platform/Developer/SDKs/MacOSX10.15.sdk/System/Library/Frameworks/AppKit.framework/Headers/NSAccessibilityConstants.h:11:1: error: expected 'push' or 'pop' after '#pragma clang attribute'
/Applications/Xcode.app/Contents/Developer/Platforms/MacOSX.platform/Developer/SDKs/MacOSX10.15.sdk/usr/include/os/availability.h:104:273: note: expanded from macro 'API_UNAVAILABLE_BEGIN'
    #define API_UNAVAILABLE_BEGIN(...) _Pragma("clang attribute push") __API_UNAVAILABLE_BEGIN_GET_MACRO(__VA_ARGS__,__API_UNAVAILABLE_BEGIN7,__API_UNAVAILABLE_BEGIN6, __API_UNAVAILABLE_BEGIN5, __API_UNAVAILABLE_BEGIN4, __API_UNAVAILABLE_BEGIN3, __API_UNAVAILABLE_BEGIN2, __API_UNAVAILABLE_BEGIN1, 0)(__VA_ARGS__)
                                                                                                                                                                                                                                                                                ^
In file included from /Users/buildslave/jenkins/workspace/lldb-cmake-matrix/llvm-project/lldb/test/API/functionalities/mtc/simple/main.m:3:
In file included from /Applications/Xcode.app/Contents/Developer/Platforms/MacOSX.platform/Developer/SDKs/MacOSX10.15.sdk/System/Library/Frameworks/AppKit.framework/Headers/AppKit.h:14:
In file included from /Applications/Xcode.app/Contents/Developer/Platforms/MacOSX.platform/Developer/SDKs/MacOSX10.15.sdk/System/Library/Frameworks/AppKit.framework/Headers/NSAccessibility.h:9:
/Applications/Xcode.app/Contents/Developer/Platforms/MacOSX.platform/Developer/SDKs/MacOSX10.15.sdk/System/Library/Frameworks/AppKit.framework/Headers/NSErrors.h:54:1: error: '#pragma clang attribute pop' with no matching '#pragma clang attribute push'
API_UNAVAILABLE_END
^
/Applications/Xcode.app/Contents/Developer/Platforms/MacOSX.platform/Developer/SDKs/MacOSX10.15.sdk/usr/include/os/availability.h:105:33: note: expanded from macro 'API_UNAVAILABLE_END'
    #define API_UNAVAILABLE_END _Pragma("clang attribute pop")
                                ^
<scratch space>:36:8: note: expanded from here
 clang attribute pop
       ^
In file included from /Users/buildslave/jenkins/workspace/lldb-cmake-matrix/llvm-project/lldb/test/API/functionalities/mtc/simple/main.m:3:
In file included from /Applications/Xcode.app/Contents/Developer/Platforms/MacOSX.platform/Developer/SDKs/MacOSX10.15.sdk/System/Library/Frameworks/AppKit.framework/Headers/AppKit.h:14:
In file included from /Applications/Xcode.app/Contents/Developer/Platforms/MacOSX.platform/Developer/SDKs/MacOSX10.15.sdk/System/Library/Frameworks/AppKit.framework/Headers/NSAccessibility.h:13:
In file included from /Applications/Xcode.app/Contents/Developer/Platforms/MacOSX.platform/Developer/SDKs/MacOSX10.15.sdk/System/Library/Frameworks/AppKit.framework/Headers/NSAccessibilityProtocols.h:10:
/Applications/Xcode.app/Contents/Developer/Platforms/MacOSX.platform/Developer/SDKs/MacOSX10.15.sdk/System/Library/Frameworks/AppKit.framework/Headers/NSAccessibilityCustomAction.h:11:1: error: expected '('
API_UNAVAILABLE_BEGIN(ios)
^
/Applications/Xcode.app/Contents/Developer/Platforms/MacOSX.platform/Developer/SDKs/MacOSX10.15.sdk/usr/include/os/availability.h:104:40: note: expanded from macro 'API_UNAVAILABLE_BEGIN'
    #define API_UNAVAILABLE_BEGIN(...) _Pragma("clang attribute push") __API_UNAVAILABLE_BEGIN_GET_MACRO(__VA_ARGS__,__API_UNAVAILABLE_BEGIN7,__API_UNAVAILABLE_BEGIN6, __API_UNAVAILABLE_BEGIN5, __API_UNAVAILABLE_BEGIN4, __API_UNAVAILABLE_BEGIN3, __API_UNAVAILABLE_BEGIN2, __API_UNAVAILABLE_BEGIN1, 0)(__VA_ARGS__)
                                       ^
<scratch space>:34:22: note: expanded from here
 clang attribute push
                     ^
In file included from /Users/buildslave/jenkins/workspace/lldb-cmake-matrix/llvm-project/lldb/test/API/functionalities/mtc/simple/main.m:3:
In file included from /Applications/Xcode.app/Contents/Developer/Platforms/MacOSX.platform/Developer/SDKs/MacOSX10.15.sdk/System/Library/Frameworks/AppKit.framework/Headers/AppKit.h:14:
In file included from /Applications/Xcode.app/Contents/Developer/Platforms/MacOSX.platform/Developer/SDKs/MacOSX10.15.sdk/System/Library/Frameworks/AppKit.framework/Headers/NSAccessibility.h:13:
In file included from /Applications/Xcode.app/Contents/Developer/Platforms/MacOSX.platform/Developer/SDKs/MacOSX10.15.sdk/System/Library/Frameworks/AppKit.framework/Headers/NSAccessibilityProtocols.h:10:
/Applications/Xcode.app/Contents/Developer/Platforms/MacOSX.platform/Developer/SDKs/MacOSX10.15.sdk/System/Library/Frameworks/AppKit.framework/Headers/NSAccessibilityCustomAction.h:11:1: error: expected 'push' or 'pop' after '#pragma clang attribute'
/Applications/Xcode.app/Contents/Developer/Platforms/MacOSX.platform/Developer/SDKs/MacOSX10.15.sdk/usr/include/os/availability.h:104:273: note: expanded from macro 'API_UNAVAILABLE_BEGIN'
    #define API_UNAVAILABLE_BEGIN(...) _Pragma("clang attribute push") __API_UNAVAILABLE_BEGIN_GET_MACRO(__VA_ARGS__,__API_UNAVAILABLE_BEGIN7,__API_UNAVAILABLE_BEGIN6, __API_UNAVAILABLE_BEGIN5, __API_UNAVAILABLE_BEGIN4, __API_UNAVAILABLE_BEGIN3, __API_UNAVAILABLE_BEGIN2, __API_UNAVAILABLE_BEGIN1, 0)(__VA_ARGS__)
                                                                                                                                                                                                                                                                                ^
In file included from /Users/buildslave/jenkins/workspace/lldb-cmake-matrix/llvm-project/lldb/test/API/functionalities/mtc/simple/main.m:3:
In file included from /Applications/Xcode.app/Contents/Developer/Platforms/MacOSX.platform/Developer/SDKs/MacOSX10.15.sdk/System/Library/Frameworks/AppKit.framework/Headers/AppKit.h:14:
In file included from /Applications/Xcode.app/Contents/Developer/Platforms/MacOSX.platform/Developer/SDKs/MacOSX10.15.sdk/System/Library/Frameworks/AppKit.framework/Headers/NSAccessibility.h:12:
/Applications/Xcode.app/Contents/Developer/Platforms/MacOSX.platform/Developer/SDKs/MacOSX10.15.sdk/System/Library/Frameworks/AppKit.framework/Headers/NSAccessibilityConstants.h:593:1: error: '#pragma clang attribute pop' with no matching '#pragma clang attribute push'
API_UNAVAILABLE_END
^
/Applications/Xcode.app/Contents/Developer/Platforms/MacOSX.platform/Developer/SDKs/MacOSX10.15.sdk/usr/include/os/availability.h:105:33: note: expanded from macro 'API_UNAVAILABLE_END'
    #define API_UNAVAILABLE_END _Pragma("clang attribute pop")
                                ^
<scratch space>:28:8: note: expanded from here
 clang attribute pop
       ^
In file included from /Users/buildslave/jenkins/workspace/lldb-cmake-matrix/llvm-project/lldb/test/API/functionalities/mtc/simple/main.m:3:
In file included from /Applications/Xcode.app/Contents/Developer/Platforms/MacOSX.platform/Developer/SDKs/MacOSX10.15.sdk/System/Library/Frameworks/AppKit.framework/Headers/AppKit.h:14:
In file included from /Applications/Xcode.app/Contents/Developer/Platforms/MacOSX.platform/Developer/SDKs/MacOSX10.15.sdk/System/Library/Frameworks/AppKit.framework/Headers/NSAccessibility.h:13:
In file included from /Applications/Xcode.app/Contents/Developer/Platforms/MacOSX.platform/Developer/SDKs/MacOSX10.15.sdk/System/Library/Frameworks/AppKit.framework/Headers/NSAccessibilityProtocols.h:10:
/Applications/Xcode.app/Contents/Developer/Platforms/MacOSX.platform/Developer/SDKs/MacOSX10.15.sdk/System/Library/Frameworks/AppKit.framework/Headers/NSAccessibilityCustomAction.h:45:1: error: '#pragma clang attribute pop' with no matching '#pragma clang attribute push'
API_UNAVAILABLE_END
^
/Applications/Xcode.app/Contents/Developer/Platforms/MacOSX.platform/Developer/SDKs/MacOSX10.15.sdk/usr/include/os/availability.h:105:33: note: expanded from macro 'API_UNAVAILABLE_END'
    #define API_UNAVAILABLE_END _Pragma("clang attribute pop")
                                ^
<scratch space>:41:8: note: expanded from here
 clang attribute pop
       ^
In file included from /Users/buildslave/jenkins/workspace/lldb-cmake-matrix/llvm-project/lldb/test/API/functionalities/mtc/simple/main.m:3:
In file included from /Applications/Xcode.app/Contents/Developer/Platforms/MacOSX.platform/Developer/SDKs/MacOSX10.15.sdk/System/Library/Frameworks/AppKit.framework/Headers/AppKit.h:14:
In file included from /Applications/Xcode.app/Contents/Developer/Platforms/MacOSX.platform/Developer/SDKs/MacOSX10.15.sdk/System/Library/Frameworks/AppKit.framework/Headers/NSAccessibility.h:13:
/Applications/Xcode.app/Contents/Developer/Platforms/MacOSX.platform/Developer/SDKs/MacOSX10.15.sdk/System/Library/Frameworks/AppKit.framework/Headers/NSAccessibilityProtocols.h:15:1: error: expected '('
API_UNAVAILABLE_BEGIN(ios)
^
/Applications/Xcode.app/Contents/Developer/Platforms/MacOSX.platform/Developer/SDKs/MacOSX10.15.sdk/usr/include/os/availability.h:104:40: note: expanded from macro 'API_UNAVAILABLE_BEGIN'
    #define API_UNAVAILABLE_BEGIN(...) _Pragma("clang attribute push") __API_UNAVAILABLE_BEGIN_GET_MACRO(__VA_ARGS__,__API_UNAVAILABLE_BEGIN7,__API_UNAVAILABLE_BEGIN6, __API_UNAVAILABLE_BEGIN5, __API_UNAVAILABLE_BEGIN4, __API_UNAVAILABLE_BEGIN3, __API_UNAVAILABLE_BEGIN2, __API_UNAVAILABLE_BEGIN1, 0)(__VA_ARGS__)
                                       ^
<scratch space>:47:22: note: expanded from here
 clang attribute push
                     ^
fatal error: too many errors emitted, stopping now [-ferror-limit=]
20 errors generated.
make: *** [main.o] Error 1

Test Directory:
/Users/buildslave/jenkins/workspace/lldb-cmake-matrix/llvm-project/lldb/test/API/functionalities/mtc/simple
======================================================================
ERROR: test_dwarf (TestMTCSimple.MTCSimpleTestCase)
----------------------------------------------------------------------
Error when building test subject.

Build Command:
make VPATH=/Users/buildslave/jenkins/workspace/lldb-cmake-matrix/llvm-project/lldb/test/API/functionalities/mtc/simple -C /Users/buildslave/jenkins/workspace/lldb-cmake-matrix/lldb-build/lldb-test-build.noindex/functionalities/mtc/simple/TestMTCSimple.test_dwarf -I /Users/buildslave/jenkins/workspace/lldb-cmake-matrix/llvm-project/lldb/test/API/functionalities/mtc/simple -I /Users/buildslave/jenkins/workspace/lldb-cmake-matrix/llvm-project/lldb/packages/Python/lldbsuite/test/make -f /Users/buildslave/jenkins/workspace/lldb-cmake-matrix/llvm-project/lldb/test/API/functionalities/mtc/simple/Makefile MAKE_DSYM=NO  ARCH=x86_64 CC="/Users/buildslave/jenkins/workspace/lldb-cmake-matrix/clang_502_build/bin/clang" DSYMUTIL="/Users/buildslave/jenkins/workspace/lldb-cmake-matrix/lldb-build/./bin/dsymutil"  CLANG_MODULE_CACHE_DIR=/Users/buildslave/jenkins/workspace/lldb-cmake-matrix/lldb-build/lldb-test-build.noindex/module-cache-clang/lldb-api 

Build Command Output:
/Users/buildslave/jenkins/workspace/lldb-cmake-matrix/clang_502_build/bin/clang -g -O0 -fno-builtin -isysroot "/Applications/Xcode.app/Contents/Developer/Platforms/MacOSX.platform/Developer/SDKs/MacOSX10.15.sdk" -arch x86_64  -I/Users/buildslave/jenkins/workspace/lldb-cmake-matrix/llvm-project/lldb/packages/Python/lldbsuite/test/make/../../../../../include -I/Users/buildslave/jenkins/workspace/lldb-cmake-matrix/llvm-project/lldb/test/API/functionalities/mtc/simple -I/Users/buildslave/jenkins/workspace/lldb-cmake-matrix/llvm-project/lldb/packages/Python/lldbsuite/test/make -include /Users/buildslave/jenkins/workspace/lldb-cmake-matrix/llvm-project/lldb/packages/Python/lldbsuite/test/make/test_common.h  -fno-limit-debug-info   -MT main.o -MD -MP -MF main.d -c -o main.o /Users/buildslave/jenkins/workspace/lldb-cmake-matrix/llvm-project/lldb/test/API/functionalities/mtc/simple/main.m
In file included from /Users/buildslave/jenkins/workspace/lldb-cmake-matrix/llvm-project/lldb/test/API/functionalities/mtc/simple/main.m:3:
In file included from /Applications/Xcode.app/Contents/Developer/Platforms/MacOSX.platform/Developer/SDKs/MacOSX10.15.sdk/System/Library/Frameworks/AppKit.framework/Headers/AppKit.h:12:
/Applications/Xcode.app/Contents/Developer/Platforms/MacOSX.platform/Developer/SDKs/MacOSX10.15.sdk/System/Library/Frameworks/AppKit.framework/Headers/AppKitErrors.h:10:1: error: expected '('
API_UNAVAILABLE_BEGIN(ios)
^
/Applications/Xcode.app/Contents/Developer/Platforms/MacOSX.platform/Developer/SDKs/MacOSX10.15.sdk/usr/include/os/availability.h:104:40: note: expanded from macro 'API_UNAVAILABLE_BEGIN'
    #define API_UNAVAILABLE_BEGIN(...) _Pragma("clang attribute push") __API_UNAVAILABLE_BEGIN_GET_MACRO(__VA_ARGS__,__API_UNAVAILABLE_BEGIN7,__API_UNAVAILABLE_BEGIN6, __API_UNAVAILABLE_BEGIN5, __API_UNAVAILABLE_BEGIN4, __API_UNAVAILABLE_BEGIN3, __API_UNAVAILABLE_BEGIN2, __API_UNAVAILABLE_BEGIN1, 0)(__VA_ARGS__)
                                       ^
<scratch space>:29:22: note: expanded from here
 clang attribute push
                     ^
In file included from /Users/buildslave/jenkins/workspace/lldb-cmake-matrix/llvm-project/lldb/test/API/functionalities/mtc/simple/main.m:3:
In file included from /Applications/Xcode.app/Contents/Developer/Platforms/MacOSX.platform/Developer/SDKs/MacOSX10.15.sdk/System/Library/Frameworks/AppKit.framework/Headers/AppKit.h:12:
/Applications/Xcode.app/Contents/Developer/Platforms/MacOSX.platform/Developer/SDKs/MacOSX10.15.sdk/System/Library/Frameworks/AppKit.framework/Headers/AppKitErrors.h:10:1: error: expected 'push' or 'pop' after '#pragma clang attribute'
/Applications/Xcode.app/Contents/Developer/Platforms/MacOSX.platform/Developer/SDKs/MacOSX10.15.sdk/usr/include/os/availability.h:104:273: note: expanded from macro 'API_UNAVAILABLE_BEGIN'
    #define API_UNAVAILABLE_BEGIN(...) _Pragma("clang attribute push") __API_UNAVAILABLE_BEGIN_GET_MACRO(__VA_ARGS__,__API_UNAVAILABLE_BEGIN7,__API_UNAVAILABLE_BEGIN6, __API_UNAVAILABLE_BEGIN5, __API_UNAVAILABLE_BEGIN4, __API_UNAVAILABLE_BEGIN3, __API_UNAVAILABLE_BEGIN2, __API_UNAVAILABLE_BEGIN1, 0)(__VA_ARGS__)
                                                                                                                                                                                                                                                                                ^
In file included from /Users/buildslave/jenkins/workspace/lldb-cmake-matrix/llvm-project/lldb/test/API/functionalities/mtc/simple/main.m:3:
In file included from /Applications/Xcode.app/Contents/Developer/Platforms/MacOSX.platform/Developer/SDKs/MacOSX10.15.sdk/System/Library/Frameworks/AppKit.framework/Headers/AppKit.h:13:
In file included from /Applications/Xcode.app/Contents/Developer/Platforms/MacOSX.platform/Developer/SDKs/MacOSX10.15.sdk/System/Library/Frameworks/AppKit.framework/Headers/NSGraphicsContext.h:9:
/Applications/Xcode.app/Contents/Developer/Platforms/MacOSX.platform/Developer/SDKs/MacOSX10.15.sdk/System/Library/Frameworks/AppKit.framework/Headers/NSGraphics.h:12:1: error: expected '('
API_UNAVAILABLE_BEGIN(ios)
^
/Applications/Xcode.app/Contents/Developer/Platforms/MacOSX.platform/Developer/SDKs/MacOSX10.15.sdk/usr/include/os/availability.h:104:40: note: expanded from macro 'API_UNAVAILABLE_BEGIN'
    #define API_UNAVAILABLE_BEGIN(...) _Pragma("clang attribute push") __API_UNAVAILABLE_BEGIN_GET_MACRO(__VA_ARGS__,__API_UNAVAILABLE_BEGIN7,__API_UNAVAILABLE_BEGIN6, __API_UNAVAILABLE_BEGIN5, __API_UNAVAILABLE_BEGIN4, __API_UNAVAILABLE_BEGIN3, __API_UNAVAILABLE_BEGIN2, __API_UNAVAILABLE_BEGIN1, 0)(__VA_ARGS__)
                                       ^
<scratch space>:45:22: note: expanded from here
 clang attribute push
                     ^
In file included from /Users/buildslave/jenkins/workspace/lldb-cmake-matrix/llvm-project/lldb/test/API/functionalities/mtc/simple/main.m:3:
In file included from /Applications/Xcode.app/Contents/Developer/Platforms/MacOSX.platform/Developer/SDKs/MacOSX10.15.sdk/System/Library/Frameworks/AppKit.framework/Headers/AppKit.h:13:
In file included from /Applications/Xcode.app/Contents/Developer/Platforms/MacOSX.platform/Developer/SDKs/MacOSX10.15.sdk/System/Library/Frameworks/AppKit.framework/Headers/NSGraphicsContext.h:9:
/Applications/Xcode.app/Contents/Developer/Platforms/MacOSX.platform/Developer/SDKs/MacOSX10.15.sdk/System/Library/Frameworks/AppKit.framework/Headers/NSGraphics.h:12:1: error: expected 'push' or 'pop' after '#pragma clang attribute'
/Applications/Xcode.app/Contents/Developer/Platforms/MacOSX.platform/Developer/SDKs/MacOSX10.15.sdk/usr/include/os/availability.h:104:273: note: expanded from macro 'API_UNAVAILABLE_BEGIN'
    #define API_UNAVAILABLE_BEGIN(...) _Pragma("clang attribute push") __API_UNAVAILABLE_BEGIN_GET_MACRO(__VA_ARGS__,__API_UNAVAILABLE_BEGIN7,__API_UNAVAILABLE_BEGIN6, __API_UNAVAILABLE_BEGIN5, __API_UNAVAILABLE_BEGIN4, __API_UNAVAILABLE_BEGIN3, __API_UNAVAILABLE_BEGIN2, __API_UNAVAILABLE_BEGIN1, 0)(__VA_ARGS__)
                                                                                                                                                                                                                                                                                ^
In file included from /Users/buildslave/jenkins/workspace/lldb-cmake-matrix/llvm-project/lldb/test/API/functionalities/mtc/simple/main.m:3:
In file included from /Applications/Xcode.app/Contents/Developer/Platforms/MacOSX.platform/Developer/SDKs/MacOSX10.15.sdk/System/Library/Frameworks/AppKit.framework/Headers/AppKit.h:12:
/Applications/Xcode.app/Contents/Developer/Platforms/MacOSX.platform/Developer/SDKs/MacOSX10.15.sdk/System/Library/Frameworks/AppKit.framework/Headers/AppKitErrors.h:53:1: error: '#pragma clang attribute pop' with no matching '#pragma clang attribute push'
API_UNAVAILABLE_END
^
/Applications/Xcode.app/Contents/Developer/Platforms/MacOSX.platform/Developer/SDKs/MacOSX10.15.sdk/usr/include/os/availability.h:105:33: note: expanded from macro 'API_UNAVAILABLE_END'
    #define API_UNAVAILABLE_END _Pragma("clang attribute pop")
                                ^
<scratch space>:41:8: note: expanded from here
 clang attribute pop
       ^
In file included from /Users/buildslave/jenkins/workspace/lldb-cmake-matrix/llvm-project/lldb/test/API/functionalities/mtc/simple/main.m:3:
In file included from /Applications/Xcode.app/Contents/Developer/Platforms/MacOSX.platform/Developer/SDKs/MacOSX10.15.sdk/System/Library/Frameworks/AppKit.framework/Headers/AppKit.h:13:
/Applications/Xcode.app/Contents/Developer/Platforms/MacOSX.platform/Developer/SDKs/MacOSX10.15.sdk/System/Library/Frameworks/AppKit.framework/Headers/NSGraphicsContext.h:17:1: error: expected '('
API_UNAVAILABLE_BEGIN(ios)
^
/Applications/Xcode.app/Contents/Developer/Platforms/MacOSX.platform/Developer/SDKs/MacOSX10.15.sdk/usr/include/os/availability.h:104:40: note: expanded from macro 'API_UNAVAILABLE_BEGIN'
    #define API_UNAVAILABLE_BEGIN(...) _Pragma("clang attribute push") __API_UNAVAILABLE_BEGIN_GET_MACRO(__VA_ARGS__,__API_UNAVAILABLE_BEGIN7,__API_UNAVAILABLE_BEGIN6, __API_UNAVAILABLE_BEGIN5, __API_UNAVAILABLE_BEGIN4, __API_UNAVAILABLE_BEGIN3, __API_UNAVAILABLE_BEGIN2, __API_UNAVAILABLE_BEGIN1, 0)(__VA_ARGS__)
                                       ^
<scratch space>:8:22: note: expanded from here
 clang attribute push
                     ^
In file included from /Users/buildslave/jenkins/workspace/lldb-cmake-matrix/llvm-project/lldb/test/API/functionalities/mtc/simple/main.m:3:
In file included from /Applications/Xcode.app/Contents/Developer/Platforms/MacOSX.platform/Developer/SDKs/MacOSX10.15.sdk/System/Library/Frameworks/AppKit.framework/Headers/AppKit.h:13:
/Applications/Xcode.app/Contents/Developer/Platforms/MacOSX.platform/Developer/SDKs/MacOSX10.15.sdk/System/Library/Frameworks/AppKit.framework/Headers/NSGraphicsContext.h:17:1: error: expected 'push' or 'pop' after '#pragma clang attribute'
/Applications/Xcode.app/Contents/Developer/Platforms/MacOSX.platform/Developer/SDKs/MacOSX10.15.sdk/usr/include/os/availability.h:104:273: note: expanded from macro 'API_UNAVAILABLE_BEGIN'
    #define API_UNAVAILABLE_BEGIN(...) _Pragma("clang attribute push") __API_UNAVAILABLE_BEGIN_GET_MACRO(__VA_ARGS__,__API_UNAVAILABLE_BEGIN7,__API_UNAVAILABLE_BEGIN6, __API_UNAVAILABLE_BEGIN5, __API_UNAVAILABLE_BEGIN4, __API_UNAVAILABLE_BEGIN3, __API_UNAVAILABLE_BEGIN2, __API_UNAVAILABLE_BEGIN1, 0)(__VA_ARGS__)
                                                                                                                                                                                                                                                                                ^
In file included from /Users/buildslave/jenkins/workspace/lldb-cmake-matrix/llvm-project/lldb/test/API/functionalities/mtc/simple/main.m:3:
In file included from /Applications/Xcode.app/Contents/Developer/Platforms/MacOSX.platform/Developer/SDKs/MacOSX10.15.sdk/System/Library/Frameworks/AppKit.framework/Headers/AppKit.h:13:
In file included from /Applications/Xcode.app/Contents/Developer/Platforms/MacOSX.platform/Developer/SDKs/MacOSX10.15.sdk/System/Library/Frameworks/AppKit.framework/Headers/NSGraphicsContext.h:9:
/Applications/Xcode.app/Contents/Developer/Platforms/MacOSX.platform/Developer/SDKs/MacOSX10.15.sdk/System/Library/Frameworks/AppKit.framework/Headers/NSGraphics.h:266:1: error: '#pragma clang attribute pop' with no matching '#pragma clang attribute push'
API_UNAVAILABLE_END
^
/Applications/Xcode.app/Contents/Developer/Platforms/MacOSX.platform/Developer/SDKs/MacOSX10.15.sdk/usr/include/os/availability.h:105:33: note: expanded from macro 'API_UNAVAILABLE_END'
    #define API_UNAVAILABLE_END _Pragma("clang attribute pop")
                                ^
<scratch space>:2:8: note: expanded from here
 clang attribute pop
       ^
In file included from /Users/buildslave/jenkins/workspace/lldb-cmake-matrix/llvm-project/lldb/test/API/functionalities/mtc/simple/main.m:3:
In file included from /Applications/Xcode.app/Contents/Developer/Platforms/MacOSX.platform/Developer/SDKs/MacOSX10.15.sdk/System/Library/Frameworks/AppKit.framework/Headers/AppKit.h:13:
/Applications/Xcode.app/Contents/Developer/Platforms/MacOSX.platform/Developer/SDKs/MacOSX10.15.sdk/System/Library/Frameworks/AppKit.framework/Headers/NSGraphicsContext.h:115:1: error: '#pragma clang attribute pop' with no matching '#pragma clang attribute push'
API_UNAVAILABLE_END
^
/Applications/Xcode.app/Contents/Developer/Platforms/MacOSX.platform/Developer/SDKs/MacOSX10.15.sdk/usr/include/os/availability.h:105:33: note: expanded from macro 'API_UNAVAILABLE_END'
    #define API_UNAVAILABLE_END _Pragma("clang attribute pop")
                                ^
<scratch space>:23:8: note: expanded from here
 clang attribute pop
       ^
In file included from /Users/buildslave/jenkins/workspace/lldb-cmake-matrix/llvm-project/lldb/test/API/functionalities/mtc/simple/main.m:3:
In file included from /Applications/Xcode.app/Contents/Developer/Platforms/MacOSX.platform/Developer/SDKs/MacOSX10.15.sdk/System/Library/Frameworks/AppKit.framework/Headers/AppKit.h:14:
In file included from /Applications/Xcode.app/Contents/Developer/Platforms/MacOSX.platform/Developer/SDKs/MacOSX10.15.sdk/System/Library/Frameworks/AppKit.framework/Headers/NSAccessibility.h:9:
/Applications/Xcode.app/Contents/Developer/Platforms/MacOSX.platform/Developer/SDKs/MacOSX10.15.sdk/System/Library/Frameworks/AppKit.framework/Headers/NSErrors.h:13:1: error: expected '('
API_UNAVAILABLE_BEGIN(ios)
^
/Applications/Xcode.app/Contents/Developer/Platforms/MacOSX.platform/Developer/SDKs/MacOSX10.15.sdk/usr/include/os/availability.h:104:40: note: expanded from macro 'API_UNAVAILABLE_BEGIN'
    #define API_UNAVAILABLE_BEGIN(...) _Pragma("clang attribute push") __API_UNAVAILABLE_BEGIN_GET_MACRO(__VA_ARGS__,__API_UNAVAILABLE_BEGIN7,__API_UNAVAILABLE_BEGIN6, __API_UNAVAILABLE_BEGIN5, __API_UNAVAILABLE_BEGIN4, __API_UNAVAILABLE_BEGIN3, __API_UNAVAILABLE_BEGIN2, __API_UNAVAILABLE_BEGIN1, 0)(__VA_ARGS__)
                                       ^
<scratch space>:29:22: note: expanded from here
 clang attribute push
                     ^
In file included from /Users/buildslave/jenkins/workspace/lldb-cmake-matrix/llvm-project/lldb/test/API/functionalities/mtc/simple/main.m:3:
In file included from /Applications/Xcode.app/Contents/Developer/Platforms/MacOSX.platform/Developer/SDKs/MacOSX10.15.sdk/System/Library/Frameworks/AppKit.framework/Headers/AppKit.h:14:
In file included from /Applications/Xcode.app/Contents/Developer/Platforms/MacOSX.platform/Developer/SDKs/MacOSX10.15.sdk/System/Library/Frameworks/AppKit.framework/Headers/NSAccessibility.h:9:
/Applications/Xcode.app/Contents/Developer/Platforms/MacOSX.platform/Developer/SDKs/MacOSX10.15.sdk/System/Library/Frameworks/AppKit.framework/Headers/NSErrors.h:13:1: error: expected 'push' or 'pop' after '#pragma clang attribute'
/Applications/Xcode.app/Contents/Developer/Platforms/MacOSX.platform/Developer/SDKs/MacOSX10.15.sdk/usr/include/os/availability.h:104:273: note: expanded from macro 'API_UNAVAILABLE_BEGIN'
    #define API_UNAVAILABLE_BEGIN(...) _Pragma("clang attribute push") __API_UNAVAILABLE_BEGIN_GET_MACRO(__VA_ARGS__,__API_UNAVAILABLE_BEGIN7,__API_UNAVAILABLE_BEGIN6, __API_UNAVAILABLE_BEGIN5, __API_UNAVAILABLE_BEGIN4, __API_UNAVAILABLE_BEGIN3, __API_UNAVAILABLE_BEGIN2, __API_UNAVAILABLE_BEGIN1, 0)(__VA_ARGS__)
                                                                                                                                                                                                                                                                                ^
In file included from /Users/buildslave/jenkins/workspace/lldb-cmake-matrix/llvm-project/lldb/test/API/functionalities/mtc/simple/main.m:3:
In file included from /Applications/Xcode.app/Contents/Developer/Platforms/MacOSX.platform/Developer/SDKs/MacOSX10.15.sdk/System/Library/Frameworks/AppKit.framework/Headers/AppKit.h:14:
In file included from /Applications/Xcode.app/Contents/Developer/Platforms/MacOSX.platform/Developer/SDKs/MacOSX10.15.sdk/System/Library/Frameworks/AppKit.framework/Headers/NSAccessibility.h:12:
/Applications/Xcode.app/Contents/Developer/Platforms/MacOSX.platform/Developer/SDKs/MacOSX10.15.sdk/System/Library/Frameworks/AppKit.framework/Headers/NSAccessibilityConstants.h:11:1: error: expected '('
API_UNAVAILABLE_BEGIN(ios)
^
/Applications/Xcode.app/Contents/Developer/Platforms/MacOSX.platform/Developer/SDKs/MacOSX10.15.sdk/usr/include/os/availability.h:104:40: note: expanded from macro 'API_UNAVAILABLE_BEGIN'
    #define API_UNAVAILABLE_BEGIN(...) _Pragma("clang attribute push") __API_UNAVAILABLE_BEGIN_GET_MACRO(__VA_ARGS__,__API_UNAVAILABLE_BEGIN7,__API_UNAVAILABLE_BEGIN6, __API_UNAVAILABLE_BEGIN5, __API_UNAVAILABLE_BEGIN4, __API_UNAVAILABLE_BEGIN3, __API_UNAVAILABLE_BEGIN2, __API_UNAVAILABLE_BEGIN1, 0)(__VA_ARGS__)
                                       ^
<scratch space>:42:22: note: expanded from here
 clang attribute push
                     ^
In file included from /Users/buildslave/jenkins/workspace/lldb-cmake-matrix/llvm-project/lldb/test/API/functionalities/mtc/simple/main.m:3:
In file included from /Applications/Xcode.app/Contents/Developer/Platforms/MacOSX.platform/Developer/SDKs/MacOSX10.15.sdk/System/Library/Frameworks/AppKit.framework/Headers/AppKit.h:14:
In file included from /Applications/Xcode.app/Contents/Developer/Platforms/MacOSX.platform/Developer/SDKs/MacOSX10.15.sdk/System/Library/Frameworks/AppKit.framework/Headers/NSAccessibility.h:12:
/Applications/Xcode.app/Contents/Developer/Platforms/MacOSX.platform/Developer/SDKs/MacOSX10.15.sdk/System/Library/Frameworks/AppKit.framework/Headers/NSAccessibilityConstants.h:11:1: error: expected 'push' or 'pop' after '#pragma clang attribute'
/Applications/Xcode.app/Contents/Developer/Platforms/MacOSX.platform/Developer/SDKs/MacOSX10.15.sdk/usr/include/os/availability.h:104:273: note: expanded from macro 'API_UNAVAILABLE_BEGIN'
    #define API_UNAVAILABLE_BEGIN(...) _Pragma("clang attribute push") __API_UNAVAILABLE_BEGIN_GET_MACRO(__VA_ARGS__,__API_UNAVAILABLE_BEGIN7,__API_UNAVAILABLE_BEGIN6, __API_UNAVAILABLE_BEGIN5, __API_UNAVAILABLE_BEGIN4, __API_UNAVAILABLE_BEGIN3, __API_UNAVAILABLE_BEGIN2, __API_UNAVAILABLE_BEGIN1, 0)(__VA_ARGS__)
                                                                                                                                                                                                                                                                                ^
In file included from /Users/buildslave/jenkins/workspace/lldb-cmake-matrix/llvm-project/lldb/test/API/functionalities/mtc/simple/main.m:3:
In file included from /Applications/Xcode.app/Contents/Developer/Platforms/MacOSX.platform/Developer/SDKs/MacOSX10.15.sdk/System/Library/Frameworks/AppKit.framework/Headers/AppKit.h:14:
In file included from /Applications/Xcode.app/Contents/Developer/Platforms/MacOSX.platform/Developer/SDKs/MacOSX10.15.sdk/System/Library/Frameworks/AppKit.framework/Headers/NSAccessibility.h:9:
/Applications/Xcode.app/Contents/Developer/Platforms/MacOSX.platform/Developer/SDKs/MacOSX10.15.sdk/System/Library/Frameworks/AppKit.framework/Headers/NSErrors.h:54:1: error: '#pragma clang attribute pop' with no matching '#pragma clang attribute push'
API_UNAVAILABLE_END
^
/Applications/Xcode.app/Contents/Developer/Platforms/MacOSX.platform/Developer/SDKs/MacOSX10.15.sdk/usr/include/os/availability.h:105:33: note: expanded from macro 'API_UNAVAILABLE_END'
    #define API_UNAVAILABLE_END _Pragma("clang attribute pop")
                                ^
<scratch space>:36:8: note: expanded from here
 clang attribute pop
       ^
In file included from /Users/buildslave/jenkins/workspace/lldb-cmake-matrix/llvm-project/lldb/test/API/functionalities/mtc/simple/main.m:3:
In file included from /Applications/Xcode.app/Contents/Developer/Platforms/MacOSX.platform/Developer/SDKs/MacOSX10.15.sdk/System/Library/Frameworks/AppKit.framework/Headers/AppKit.h:14:
In file included from /Applications/Xcode.app/Contents/Developer/Platforms/MacOSX.platform/Developer/SDKs/MacOSX10.15.sdk/System/Library/Frameworks/AppKit.framework/Headers/NSAccessibility.h:13:
In file included from /Applications/Xcode.app/Contents/Developer/Platforms/MacOSX.platform/Developer/SDKs/MacOSX10.15.sdk/System/Library/Frameworks/AppKit.framework/Headers/NSAccessibilityProtocols.h:10:
/Applications/Xcode.app/Contents/Developer/Platforms/MacOSX.platform/Developer/SDKs/MacOSX10.15.sdk/System/Library/Frameworks/AppKit.framework/Headers/NSAccessibilityCustomAction.h:11:1: error: expected '('
API_UNAVAILABLE_BEGIN(ios)
^
/Applications/Xcode.app/Contents/Developer/Platforms/MacOSX.platform/Developer/SDKs/MacOSX10.15.sdk/usr/include/os/availability.h:104:40: note: expanded from macro 'API_UNAVAILABLE_BEGIN'
    #define API_UNAVAILABLE_BEGIN(...) _Pragma("clang attribute push") __API_UNAVAILABLE_BEGIN_GET_MACRO(__VA_ARGS__,__API_UNAVAILABLE_BEGIN7,__API_UNAVAILABLE_BEGIN6, __API_UNAVAILABLE_BEGIN5, __API_UNAVAILABLE_BEGIN4, __API_UNAVAILABLE_BEGIN3, __API_UNAVAILABLE_BEGIN2, __API_UNAVAILABLE_BEGIN1, 0)(__VA_ARGS__)
                                       ^
<scratch space>:34:22: note: expanded from here
 clang attribute push
                     ^
In file included from /Users/buildslave/jenkins/workspace/lldb-cmake-matrix/llvm-project/lldb/test/API/functionalities/mtc/simple/main.m:3:
In file included from /Applications/Xcode.app/Contents/Developer/Platforms/MacOSX.platform/Developer/SDKs/MacOSX10.15.sdk/System/Library/Frameworks/AppKit.framework/Headers/AppKit.h:14:
In file included from /Applications/Xcode.app/Contents/Developer/Platforms/MacOSX.platform/Developer/SDKs/MacOSX10.15.sdk/System/Library/Frameworks/AppKit.framework/Headers/NSAccessibility.h:13:
In file included from /Applications/Xcode.app/Contents/Developer/Platforms/MacOSX.platform/Developer/SDKs/MacOSX10.15.sdk/System/Library/Frameworks/AppKit.framework/Headers/NSAccessibilityProtocols.h:10:
/Applications/Xcode.app/Contents/Developer/Platforms/MacOSX.platform/Developer/SDKs/MacOSX10.15.sdk/System/Library/Frameworks/AppKit.framework/Headers/NSAccessibilityCustomAction.h:11:1: error: expected 'push' or 'pop' after '#pragma clang attribute'
/Applications/Xcode.app/Contents/Developer/Platforms/MacOSX.platform/Developer/SDKs/MacOSX10.15.sdk/usr/include/os/availability.h:104:273: note: expanded from macro 'API_UNAVAILABLE_BEGIN'
    #define API_UNAVAILABLE_BEGIN(...) _Pragma("clang attribute push") __API_UNAVAILABLE_BEGIN_GET_MACRO(__VA_ARGS__,__API_UNAVAILABLE_BEGIN7,__API_UNAVAILABLE_BEGIN6, __API_UNAVAILABLE_BEGIN5, __API_UNAVAILABLE_BEGIN4, __API_UNAVAILABLE_BEGIN3, __API_UNAVAILABLE_BEGIN2, __API_UNAVAILABLE_BEGIN1, 0)(__VA_ARGS__)
                                                                                                                                                                                                                                                                                ^
In file included from /Users/buildslave/jenkins/workspace/lldb-cmake-matrix/llvm-project/lldb/test/API/functionalities/mtc/simple/main.m:3:
In file included from /Applications/Xcode.app/Contents/Developer/Platforms/MacOSX.platform/Developer/SDKs/MacOSX10.15.sdk/System/Library/Frameworks/AppKit.framework/Headers/AppKit.h:14:
In file included from /Applications/Xcode.app/Contents/Developer/Platforms/MacOSX.platform/Developer/SDKs/MacOSX10.15.sdk/System/Library/Frameworks/AppKit.framework/Headers/NSAccessibility.h:12:
/Applications/Xcode.app/Contents/Developer/Platforms/MacOSX.platform/Developer/SDKs/MacOSX10.15.sdk/System/Library/Frameworks/AppKit.framework/Headers/NSAccessibilityConstants.h:593:1: error: '#pragma clang attribute pop' with no matching '#pragma clang attribute push'
API_UNAVAILABLE_END
^
/Applications/Xcode.app/Contents/Developer/Platforms/MacOSX.platform/Developer/SDKs/MacOSX10.15.sdk/usr/include/os/availability.h:105:33: note: expanded from macro 'API_UNAVAILABLE_END'
    #define API_UNAVAILABLE_END _Pragma("clang attribute pop")
                                ^
<scratch space>:28:8: note: expanded from here
 clang attribute pop
       ^
In file included from /Users/buildslave/jenkins/workspace/lldb-cmake-matrix/llvm-project/lldb/test/API/functionalities/mtc/simple/main.m:3:
In file included from /Applications/Xcode.app/Contents/Developer/Platforms/MacOSX.platform/Developer/SDKs/MacOSX10.15.sdk/System/Library/Frameworks/AppKit.framework/Headers/AppKit.h:14:
In file included from /Applications/Xcode.app/Contents/Developer/Platforms/MacOSX.platform/Developer/SDKs/MacOSX10.15.sdk/System/Library/Frameworks/AppKit.framework/Headers/NSAccessibility.h:13:
In file included from /Applications/Xcode.app/Contents/Developer/Platforms/MacOSX.platform/Developer/SDKs/MacOSX10.15.sdk/System/Library/Frameworks/AppKit.framework/Headers/NSAccessibilityProtocols.h:10:
/Applications/Xcode.app/Contents/Developer/Platforms/MacOSX.platform/Developer/SDKs/MacOSX10.15.sdk/System/Library/Frameworks/AppKit.framework/Headers/NSAccessibilityCustomAction.h:45:1: error: '#pragma clang attribute pop' with no matching '#pragma clang attribute push'
API_UNAVAILABLE_END
^
/Applications/Xcode.app/Contents/Developer/Platforms/MacOSX.platform/Developer/SDKs/MacOSX10.15.sdk/usr/include/os/availability.h:105:33: note: expanded from macro 'API_UNAVAILABLE_END'
    #define API_UNAVAILABLE_END _Pragma("clang attribute pop")
                                ^
<scratch space>:41:8: note: expanded from here
 clang attribute pop
       ^
In file included from /Users/buildslave/jenkins/workspace/lldb-cmake-matrix/llvm-project/lldb/test/API/functionalities/mtc/simple/main.m:3:
In file included from /Applications/Xcode.app/Contents/Developer/Platforms/MacOSX.platform/Developer/SDKs/MacOSX10.15.sdk/System/Library/Frameworks/AppKit.framework/Headers/AppKit.h:14:
In file included from /Applications/Xcode.app/Contents/Developer/Platforms/MacOSX.platform/Developer/SDKs/MacOSX10.15.sdk/System/Library/Frameworks/AppKit.framework/Headers/NSAccessibility.h:13:
/Applications/Xcode.app/Contents/Developer/Platforms/MacOSX.platform/Developer/SDKs/MacOSX10.15.sdk/System/Library/Frameworks/AppKit.framework/Headers/NSAccessibilityProtocols.h:15:1: error: expected '('
API_UNAVAILABLE_BEGIN(ios)
^
/Applications/Xcode.app/Contents/Developer/Platforms/MacOSX.platform/Developer/SDKs/MacOSX10.15.sdk/usr/include/os/availability.h:104:40: note: expanded from macro 'API_UNAVAILABLE_BEGIN'
    #define API_UNAVAILABLE_BEGIN(...) _Pragma("clang attribute push") __API_UNAVAILABLE_BEGIN_GET_MACRO(__VA_ARGS__,__API_UNAVAILABLE_BEGIN7,__API_UNAVAILABLE_BEGIN6, __API_UNAVAILABLE_BEGIN5, __API_UNAVAILABLE_BEGIN4, __API_UNAVAILABLE_BEGIN3, __API_UNAVAILABLE_BEGIN2, __API_UNAVAILABLE_BEGIN1, 0)(__VA_ARGS__)
                                       ^
<scratch space>:47:22: note: expanded from here
 clang attribute push
                     ^
fatal error: too many errors emitted, stopping now [-ferror-limit=]
20 errors generated.
make: *** [main.o] Error 1

Test Directory:
/Users/buildslave/jenkins/workspace/lldb-cmake-matrix/llvm-project/lldb/test/API/functionalities/mtc/simple
----------------------------------------------------------------------
Ran 4 tests in 3.779s

RESULT: FAILED (0 passes, 0 failures, 2 errors, 2 skipped, 0 expected failures, 0 unexpected successes)

--