Console Output

Skipping 106,754 KB.. Full Log
188.41s: lldb-api :: driver/batch_mode/TestBatchMode.py
97.10s: lldb-api :: tools/lldb-server/TestLldbGdbServer.py
68.28s: lldb-api :: api/multithreaded/TestMultithreaded.py
66.94s: lldb-api :: macosx/nslog/TestDarwinNSLogOutput.py
62.46s: lldb-api :: lang/objc/foundation/TestFoundationDisassembly.py
62.27s: lldb-api :: commands/expression/multiline-completion/TestMultilineCompletion.py
61.73s: lldb-api :: commands/gui/basic/TestGuiBasic.py
61.39s: lldb-api :: commands/gui/breakpoints/TestGuiBreakpoints.py
61.37s: lldb-api :: commands/gui/basicdebug/TestGuiBasicDebug.py
61.22s: lldb-api :: commands/gui/viewlarge/TestGuiViewLarge.py
35.46s: lldb-api :: python_api/target/TestTargetAPI.py
32.78s: lldb-api :: commands/process/attach-resume/TestAttachResume.py
32.36s: lldb-api :: functionalities/completion/TestCompletion.py
30.12s: lldb-api :: tools/lldb-server/TestGdbRemoteThreadsInStopReply.py
29.41s: lldb-api :: lang/objc/hidden-ivars/TestHiddenIvars.py
23.32s: lldb-api :: lang/objc/exceptions/TestObjCExceptions.py
22.28s: lldb-api :: lang/objc/real-definition/TestRealDefinition.py

Hide Details

Tests Times: -------------------------------------------------------------------------- [ Range ] :: [ Percentage ] :: [ Count ] -------------------------------------------------------------------------- [600s,650s) :: [ ] :: [ 3/2359] [550s,600s) :: [ ] :: [ 0/2359] [500s,550s) :: [ ] :: [ 0/2359] [450s,500s) :: [ ] :: [ 0/2359] [400s,450s) :: [ ] :: [ 0/2359] [350s,400s) :: [ ] :: [ 0/2359] [300s,350s) :: [ ] :: [ 0/2359] [250s,300s) :: [ ] :: [ 0/2359] [200s,250s) :: [ ] :: [ 1/2359] [150s,200s) :: [ ] :: [ 0/2359] [100s,150s) :: [ ] :: [ 1/2359] [ 50s,100s) :: [ ] :: [ 8/2359] [ 0s, 50s) :: [*************************************** ] :: [2346/2359] -------------------------------------------------------------------------- ******************** Timed Out Tests (3): lldb-api :: commands/expression/persistent_ptr_update/TestPersistentPtrUpdate.py lldb-api :: python_api/lldbutil/iter/TestLLDBIterator.py lldb-api :: python_api/lldbutil/iter/TestRegistersIterator.py

Hide Details

******************** Failed Tests (577): lldb-api :: api/check_public_api_headers/TestPublicAPIHeaders.py lldb-api :: commands/apropos/with-process/TestAproposWithProcess.py lldb-api :: commands/command/nested_alias/TestNestedAlias.py lldb-api :: commands/command/script/TestCommandScript.py lldb-api :: commands/disassemble/basic/TestDisassembleBreakpoint.py lldb-api :: commands/disassemble/basic/TestFrameDisassemble.py lldb-api :: commands/expression/anonymous-struct/TestCallUserAnonTypedef.py lldb-api :: commands/expression/argument_passing_restrictions/TestArgumentPassingRestrictions.py lldb-api :: commands/expression/call-function/TestCallStdStringFunction.py lldb-api :: commands/expression/call-function/TestCallStopAndContinue.py lldb-api :: commands/expression/call-function/TestCallUserDefinedFunction.py lldb-api :: commands/expression/call-throws/TestCallThatThrows.py lldb-api :: commands/expression/cast_int_to_anonymous_enum/TestCastIntToAnonymousEnum.py lldb-api :: commands/expression/char/TestExprsChar.py lldb-api :: commands/expression/class_template_specialization_empty_pack/TestClassTemplateSpecializationParametersHandling.py lldb-api :: commands/expression/codegen-crash-import-def-arraytype-element/TestImportDefinitionArrayType.py lldb-api :: commands/expression/codegen-crash-typedefdecl-not-in_declcontext/TestCodegenCrashTypedefDeclNotInDeclContext.py lldb-api :: commands/expression/completion-crash-incomplete-record/TestCompletionCrashIncompleteRecord.py lldb-api :: commands/expression/completion-in-lambda-and-unnamed-class/TestCompletionInLambdaAndUnnamedClass.py lldb-api :: commands/expression/completion/TestExprCompletion.py lldb-api :: commands/expression/context-object-objc/TestContextObjectObjc.py lldb-api :: commands/expression/context-object/TestContextObject.py lldb-api :: commands/expression/deleting-implicit-copy-constructor/TestDeletingImplicitCopyConstructor.py lldb-api :: commands/expression/diagnostics/TestExprDiagnostics.py lldb-api :: commands/expression/dollar-in-variable/TestDollarInVariable.py lldb-api :: commands/expression/dont_allow_jit/TestAllowJIT.py lldb-api :: commands/expression/entry-bp/TestExprEntryBP.py lldb-api :: commands/expression/expr-in-syscall/TestExpressionInSyscall.py lldb-api :: commands/expression/fixits/TestFixIts.py lldb-api :: commands/expression/formatters/TestFormatters.py lldb-api :: commands/expression/function_template_specialization_temp_args/TestFunctionTemplateSpecializationTempArgs.py lldb-api :: commands/expression/ignore-artificial-constructors/TestIgnoreArtificialConstructors.py lldb-api :: commands/expression/import-std-module/array/TestArrayFromStdModule.py lldb-api :: commands/expression/import-std-module/basic/TestImportStdModule.py lldb-api :: commands/expression/import-std-module/conflicts/TestStdModuleWithConflicts.py lldb-api :: commands/expression/import-std-module/deque-basic/TestDequeFromStdModule.py lldb-api :: commands/expression/import-std-module/deque-dbg-info-content/TestDbgInfoContentDequeFromStdModule.py lldb-api :: commands/expression/import-std-module/empty-module/TestEmptyStdModule.py lldb-api :: commands/expression/import-std-module/forward_decl_from_module/TestForwardDeclFromStdModule.py lldb-api :: commands/expression/import-std-module/forward_list-dbg-info-content/TestDbgInfoContentForwardListFromStdModule.py lldb-api :: commands/expression/import-std-module/forward_list/TestForwardListFromStdModule.py lldb-api :: commands/expression/import-std-module/iterator/TestIteratorFromStdModule.py lldb-api :: commands/expression/import-std-module/list-dbg-info-content/TestDbgInfoContentListFromStdModule.py lldb-api :: commands/expression/import-std-module/list/TestListFromStdModule.py lldb-api :: commands/expression/import-std-module/missing-module-sources/TestStdModuleSourcesMissing.py lldb-api :: commands/expression/import-std-module/no-std-module/TestMissingStdModule.py lldb-api :: commands/expression/import-std-module/non-module-type-separation/TestNonModuleTypeSeparation.py lldb-api :: commands/expression/import-std-module/queue/TestQueueFromStdModule.py lldb-api :: commands/expression/import-std-module/retry-with-std-module/TestRetryWithStdModule.py lldb-api :: commands/expression/import-std-module/shared_ptr-dbg-info-content/TestSharedPtrDbgInfoContentFromStdModule.py lldb-api :: commands/expression/import-std-module/shared_ptr/TestSharedPtrFromStdModule.py lldb-api :: commands/expression/import-std-module/stack/TestStackFromStdModule.py lldb-api :: commands/expression/import-std-module/sysroot/TestStdModuleSysroot.py lldb-api :: commands/expression/import-std-module/unique_ptr-dbg-info-content/TestUniquePtrDbgInfoContent.py lldb-api :: commands/expression/import-std-module/unique_ptr/TestUniquePtrFromStdModule.py lldb-api :: commands/expression/import-std-module/vector-bool/TestVectorBoolFromStdModule.py lldb-api :: commands/expression/import-std-module/vector-dbg-info-content/TestDbgInfoContentVectorFromStdModule.py lldb-api :: commands/expression/import-std-module/vector-of-vectors/TestVectorOfVectorsFromStdModule.py lldb-api :: commands/expression/import-std-module/vector/TestVectorFromStdModule.py lldb-api :: commands/expression/import-std-module/weak_ptr-dbg-info-content/TestDbgInfoContentWeakPtrFromStdModule.py lldb-api :: commands/expression/import-std-module/weak_ptr/TestWeakPtrFromStdModule.py lldb-api :: commands/expression/import_base_class_when_class_has_derived_member/TestImportBaseClassWhenClassHasDerivedMember.py lldb-api :: commands/expression/inline-namespace/TestInlineNamespace.py lldb-api :: commands/expression/ir-interpreter-phi-nodes/TestIRInterpreterPHINodes.py lldb-api :: commands/expression/ir-interpreter/TestIRInterpreter.py lldb-api :: commands/expression/issue_11588/Test11588.py lldb-api :: commands/expression/multiline-completion/TestMultilineCompletion.py lldb-api :: commands/expression/no-deadlock/TestExprDoesntBlock.py lldb-api :: commands/expression/options/TestExprOptions.py lldb-api :: commands/expression/persist_objc_pointeetype/TestPersistObjCPointeeType.py lldb-api :: commands/expression/persistent_types/TestPersistentTypes.py lldb-api :: commands/expression/persistent_variables/TestPersistentVariables.py lldb-api :: commands/expression/po_verbosity/TestPoVerbosity.py lldb-api :: commands/expression/pr35310/TestExprsBug35310.py lldb-api :: commands/expression/radar_8638051/Test8638051.py lldb-api :: commands/expression/radar_9531204/TestPrintfAfterUp.py lldb-api :: commands/expression/radar_9673664/TestExprHelpExamples.py lldb-api :: commands/expression/rdar42038760/TestScalarURem.py lldb-api :: commands/expression/rdar44436068/Test128BitsInteger.py lldb-api :: commands/expression/regression-access-function-template-in-record/TestRegressionAccessFunctionTemplateInRecord.py lldb-api :: commands/expression/result_numbering/TestResultNumbering.py lldb-api :: commands/expression/save_jit_objects/TestSaveJITObjects.py lldb-api :: commands/expression/scoped_enums/TestScopedEnumType.py lldb-api :: commands/expression/static-initializers/TestStaticInitializers.py lldb-api :: commands/expression/test/TestExprs.py lldb-api :: commands/expression/test/TestExprs2.py lldb-api :: commands/expression/timeout/TestCallWithTimeout.py lldb-api :: commands/expression/top-level/TestTopLevelExprs.py lldb-api :: commands/expression/two-files/TestObjCTypeQueryFromOtherCompileUnit.py lldb-api :: commands/expression/unicode-in-variable/TestUnicodeInVariable.py lldb-api :: commands/expression/unwind_expression/TestUnwindExpression.py lldb-api :: commands/expression/vector_of_enums/TestVectorOfEnums.py lldb-api :: commands/expression/weak_symbols/TestWeakSymbols.py lldb-api :: commands/expression/xvalue/TestXValuePrinting.py lldb-api :: commands/frame/diagnose/array/TestArray.py lldb-api :: commands/frame/diagnose/bad-reference/TestBadReference.py lldb-api :: commands/frame/diagnose/complicated-expression/TestComplicatedExpression.py lldb-api :: commands/frame/diagnose/dereference-argument/TestDiagnoseDereferenceArgument.py lldb-api :: commands/frame/diagnose/dereference-function-return/TestDiagnoseDereferenceFunctionReturn.py lldb-api :: commands/frame/diagnose/dereference-this/TestDiagnoseDereferenceThis.py lldb-api :: commands/frame/diagnose/inheritance/TestDiagnoseInheritance.py lldb-api :: commands/frame/diagnose/local-variable/TestLocalVariable.py lldb-api :: commands/frame/diagnose/virtual-method-call/TestDiagnoseDereferenceVirtualMethodCall.py lldb-api :: commands/frame/select/TestFrameSelect.py lldb-api :: commands/frame/var-scope/TestFrameVariableScope.py lldb-api :: commands/frame/var/TestFrameVar.py lldb-api :: commands/gui/basic/TestGuiBasic.py lldb-api :: commands/gui/basicdebug/TestGuiBasicDebug.py lldb-api :: commands/gui/breakpoints/TestGuiBreakpoints.py lldb-api :: commands/gui/viewlarge/TestGuiViewLarge.py lldb-api :: commands/process/attach-resume/TestAttachResume.py lldb-api :: commands/process/attach/TestProcessAttach.py lldb-api :: commands/process/launch-with-shellexpand/TestLaunchWithShellExpand.py lldb-api :: commands/process/launch/TestProcessLaunch.py lldb-api :: commands/process/signal/TestProcessSignal.py lldb-api :: commands/settings/TestSettings.py lldb-api :: commands/source/info/TestSourceInfo.py lldb-api :: commands/statistics/basic/TestStats.py lldb-api :: commands/target/basic/TestTargetCommand.py lldb-api :: commands/target/stop-hooks/TestStopHookScripted.py lldb-api :: commands/target/stop-hooks/TestStopHooks.py lldb-api :: commands/thread/select/TestThreadSelect.py lldb-api :: driver/batch_mode/TestBatchMode.py lldb-api :: functionalities/archives/TestBSDArchives.py lldb-api :: functionalities/avoids-fd-leak/TestFdLeak.py lldb-api :: functionalities/breakpoint/address_breakpoints/TestAddressBreakpoints.py lldb-api :: functionalities/breakpoint/address_breakpoints/TestBadAddressBreakpoints.py lldb-api :: functionalities/breakpoint/auto_continue/TestBreakpointAutoContinue.py lldb-api :: functionalities/breakpoint/breakpoint_by_file_colon_line/TestBreakpointByFileColonLine.py lldb-api :: functionalities/breakpoint/breakpoint_by_line_and_column/TestBreakpointByLineAndColumn.py lldb-api :: functionalities/breakpoint/breakpoint_command/TestBreakpointCommand.py lldb-api :: functionalities/breakpoint/breakpoint_command/TestBreakpointCommandsFromPython.py lldb-api :: functionalities/breakpoint/breakpoint_command/TestRegexpBreakCommand.py lldb-api :: functionalities/breakpoint/breakpoint_conditions/TestBreakpointConditions.py lldb-api :: functionalities/breakpoint/breakpoint_ids/TestBreakpointIDs.py lldb-api :: functionalities/breakpoint/breakpoint_ignore_count/TestBreakpointIgnoreCount.py lldb-api :: functionalities/breakpoint/breakpoint_language/TestBreakpointLanguage.py lldb-api :: functionalities/breakpoint/breakpoint_locations/TestBreakpointLocations.py lldb-api :: functionalities/breakpoint/breakpoint_options/TestBreakpointOptions.py lldb-api :: functionalities/breakpoint/breakpoint_set_restart/TestBreakpointSetRestart.py lldb-api :: functionalities/breakpoint/comp_dir_symlink/TestCompDirSymLink.py lldb-api :: functionalities/breakpoint/consecutive_breakpoints/TestConsecutiveBreakpoints.py lldb-api :: functionalities/breakpoint/cpp/TestCPPBreakpointLocations.py lldb-api :: functionalities/breakpoint/dummy_target_breakpoints/TestBreakpointsWithNoTargets.py lldb-api :: functionalities/breakpoint/global_constructor/TestBreakpointInGlobalConstructor.py lldb-api :: functionalities/breakpoint/inlined_breakpoints/TestInlinedBreakpoints.py lldb-api :: functionalities/breakpoint/move_nearest/TestMoveNearest.py lldb-api :: functionalities/breakpoint/scripted_bkpt/TestScriptedResolver.py lldb-api :: functionalities/breakpoint/source_regexp/TestSourceRegexBreakpoints.py lldb-api :: functionalities/breakpoint/step_over_breakpoint/TestStepOverBreakpoint.py lldb-api :: functionalities/completion/TestCompletion.py lldb-api :: functionalities/conditional_break/TestConditionalBreak.py lldb-api :: functionalities/data-formatter/array_typedef/TestArrayTypedef.py lldb-api :: functionalities/data-formatter/boolreference/TestFormattersBoolRefPtr.py lldb-api :: functionalities/data-formatter/builtin-formats/TestBuiltinFormats.py lldb-api :: functionalities/data-formatter/compactvectors/TestCompactVectors.py lldb-api :: functionalities/data-formatter/cstring-utf8-summary/TestCstringUnicode.py lldb-api :: functionalities/data-formatter/data-formatter-advanced/TestDataFormatterAdv.py lldb-api :: functionalities/data-formatter/data-formatter-caching/TestDataFormatterCaching.py lldb-api :: functionalities/data-formatter/data-formatter-categories/TestDataFormatterCategories.py lldb-api :: functionalities/data-formatter/data-formatter-cpp/TestDataFormatterCpp.py lldb-api :: functionalities/data-formatter/data-formatter-disabling/TestDataFormatterDisabling.py lldb-api :: functionalities/data-formatter/data-formatter-enum-format/TestDataFormatterEnumFormat.py lldb-api :: functionalities/data-formatter/data-formatter-globals/TestDataFormatterGlobals.py lldb-api :: functionalities/data-formatter/data-formatter-named-summaries/TestDataFormatterNamedSummaries.py lldb-api :: functionalities/data-formatter/data-formatter-objc/TestDataFormatterObjCCF.py lldb-api :: functionalities/data-formatter/data-formatter-objc/TestDataFormatterObjCExpr.py lldb-api :: functionalities/data-formatter/data-formatter-objc/TestDataFormatterObjCKVO.py lldb-api :: functionalities/data-formatter/data-formatter-objc/TestDataFormatterObjCNSBundle.py lldb-api :: functionalities/data-formatter/data-formatter-objc/TestDataFormatterObjCNSContainer.py lldb-api :: functionalities/data-formatter/data-formatter-objc/TestDataFormatterObjCNSData.py lldb-api :: functionalities/data-formatter/data-formatter-objc/TestDataFormatterObjCNSDate.py lldb-api :: functionalities/data-formatter/data-formatter-objc/TestDataFormatterObjCNSError.py lldb-api :: functionalities/data-formatter/data-formatter-objc/TestDataFormatterObjCNSURL.py lldb-api :: functionalities/data-formatter/data-formatter-objc/TestDataFormatterObjCPlain.py lldb-api :: functionalities/data-formatter/data-formatter-objc/TestDataFormatterObjNSException.py lldb-api :: functionalities/data-formatter/data-formatter-objc/cmtime/TestDataFormatterCMTime.py lldb-api :: functionalities/data-formatter/data-formatter-objc/nsindexpath/TestDataFormatterNSIndexPath.py lldb-api :: functionalities/data-formatter/data-formatter-objc/nsstring/TestDataFormatterNSString.py lldb-api :: functionalities/data-formatter/data-formatter-proper-plurals/TestFormattersOneIsSingular.py lldb-api :: functionalities/data-formatter/data-formatter-ptr-to-array/TestPtrToArrayFormatting.py lldb-api :: functionalities/data-formatter/data-formatter-python-synth/TestDataFormatterPythonSynth.py lldb-api :: functionalities/data-formatter/data-formatter-script/TestDataFormatterScript.py lldb-api :: functionalities/data-formatter/data-formatter-skip-summary/TestDataFormatterSkipSummary.py lldb-api :: functionalities/data-formatter/data-formatter-smart-array/TestDataFormatterSmartArray.py lldb-api :: functionalities/data-formatter/data-formatter-stl/libcxx/atomic/TestLibCxxAtomic.py lldb-api :: functionalities/data-formatter/data-formatter-stl/libcxx/bitset/TestDataFormatterLibcxxBitset.py lldb-api :: functionalities/data-formatter/data-formatter-stl/libcxx/deque/TestDataFormatterLibcxxDeque.py lldb-api :: functionalities/data-formatter/data-formatter-stl/libcxx/forward_list/TestDataFormatterLibcxxForwardList.py lldb-api :: functionalities/data-formatter/data-formatter-stl/libcxx/function/TestLibCxxFunction.py lldb-api :: functionalities/data-formatter/data-formatter-stl/libcxx/initializerlist/TestInitializerList.py lldb-api :: functionalities/data-formatter/data-formatter-stl/libcxx/iterator/TestDataFormatterLibccIterator.py lldb-api :: functionalities/data-formatter/data-formatter-stl/libcxx/list/TestDataFormatterLibcxxList.py lldb-api :: functionalities/data-formatter/data-formatter-stl/libcxx/list/loop/TestDataFormatterLibcxxListLoop.py lldb-api :: functionalities/data-formatter/data-formatter-stl/libcxx/map/TestDataFormatterLibccMap.py lldb-api :: functionalities/data-formatter/data-formatter-stl/libcxx/multimap/TestDataFormatterLibccMultiMap.py lldb-api :: functionalities/data-formatter/data-formatter-stl/libcxx/multiset/TestDataFormatterLibcxxMultiSet.py lldb-api :: functionalities/data-formatter/data-formatter-stl/libcxx/optional/TestDataFormatterLibcxxOptional.py lldb-api :: functionalities/data-formatter/data-formatter-stl/libcxx/queue/TestDataFormatterLibcxxQueue.py lldb-api :: functionalities/data-formatter/data-formatter-stl/libcxx/set/TestDataFormatterLibcxxSet.py lldb-api :: functionalities/data-formatter/data-formatter-stl/libcxx/shared_ptr/TestDataFormatterLibcxxSharedPtr.py lldb-api :: functionalities/data-formatter/data-formatter-stl/libcxx/string/TestDataFormatterLibcxxString.py lldb-api :: functionalities/data-formatter/data-formatter-stl/libcxx/tuple/TestDataFormatterLibcxxTuple.py lldb-api :: functionalities/data-formatter/data-formatter-stl/libcxx/unique_ptr/TestDataFormatterLibcxxUniquePtr.py lldb-api :: functionalities/data-formatter/data-formatter-stl/libcxx/unordered/TestDataFormatterUnordered.py lldb-api :: functionalities/data-formatter/data-formatter-stl/libcxx/variant/TestDataFormatterLibcxxVariant.py lldb-api :: functionalities/data-formatter/data-formatter-stl/libcxx/vbool/TestDataFormatterLibcxxVBool.py lldb-api :: functionalities/data-formatter/data-formatter-stl/libcxx/vector/TestDataFormatterLibcxxVector.py lldb-api :: functionalities/data-formatter/data-formatter-stl/libstdcpp/unique_ptr/invalid/TestDataFormatterInvalidStdUniquePtr.py lldb-api :: functionalities/data-formatter/data-formatter-synth/TestDataFormatterSynth.py lldb-api :: functionalities/data-formatter/data-formatter-synthtype/TestDataFormatterSynthType.py lldb-api :: functionalities/data-formatter/data-formatter-synthval/TestDataFormatterSynthVal.py lldb-api :: functionalities/data-formatter/dump_dynamic/TestDumpDynamic.py lldb-api :: functionalities/data-formatter/format-propagation/TestFormatPropagation.py lldb-api :: functionalities/data-formatter/frameformat_smallstruct/TestFrameFormatSmallStruct.py lldb-api :: functionalities/data-formatter/hexcaps/TestDataFormatterHexCaps.py lldb-api :: functionalities/data-formatter/language_category_updates/TestDataFormatterLanguageCategoryUpdates.py lldb-api :: functionalities/data-formatter/nsarraysynth/TestNSArraySynthetic.py lldb-api :: functionalities/data-formatter/nsdictionarysynth/TestNSDictionarySynthetic.py lldb-api :: functionalities/data-formatter/nssetsynth/TestNSSetSynthetic.py lldb-api :: functionalities/data-formatter/ostypeformatting/TestFormattersOsType.py lldb-api :: functionalities/data-formatter/parray/TestPrintArray.py lldb-api :: functionalities/data-formatter/poarray/TestPrintObjectArray.py lldb-api :: functionalities/data-formatter/ptr_ref_typedef/TestPtrRef2Typedef.py lldb-api :: functionalities/data-formatter/pyobjsynthprovider/TestPyObjSynthProvider.py lldb-api :: functionalities/data-formatter/refpointer-recursion/TestDataFormatterRefPtrRecursion.py lldb-api :: functionalities/data-formatter/setvaluefromcstring/TestSetValueFromCString.py lldb-api :: functionalities/data-formatter/stringprinter/TestStringPrinter.py lldb-api :: functionalities/data-formatter/summary-string-onfail/Test-rdar-9974002.py lldb-api :: functionalities/data-formatter/synthcapping/TestSyntheticCapping.py lldb-api :: functionalities/data-formatter/synthupdate/TestSyntheticFilterRecompute.py lldb-api :: functionalities/data-formatter/type_summary_list_script/TestTypeSummaryListScript.py lldb-api :: functionalities/data-formatter/typedef_array/TestTypedefArray.py lldb-api :: functionalities/data-formatter/user-format-vs-summary/TestUserFormatVsSummary.py lldb-api :: functionalities/data-formatter/var-in-aggregate-misuse/TestVarInAggregateMisuse.py lldb-api :: functionalities/data-formatter/varscript_formatting/TestDataFormatterVarScriptFormatting.py lldb-api :: functionalities/data-formatter/vector-types/TestVectorTypesFormatting.py lldb-api :: functionalities/dead-strip/TestDeadStrip.py lldb-api :: functionalities/dlopen_other_executable/TestDlopenOtherExecutable.py lldb-api :: functionalities/dynamic_value_child_count/TestDynamicValueChildCount.py lldb-api :: functionalities/exec/TestExec.py lldb-api :: functionalities/find-line-entry/TestFindLineEntry.py lldb-api :: functionalities/float-display/TestFloatDisplay.py lldb-api :: functionalities/inferior-assert/TestInferiorAssert.py lldb-api :: functionalities/inferior-changed/TestInferiorChanged.py lldb-api :: functionalities/inferior-crashing/TestInferiorCrashing.py lldb-api :: functionalities/inferior-crashing/TestInferiorCrashingStep.py lldb-api :: functionalities/inferior-crashing/recursive-inferior/TestRecursiveInferior.py lldb-api :: functionalities/inferior-crashing/recursive-inferior/TestRecursiveInferiorStep.py lldb-api :: functionalities/inline-stepping/TestInlineStepping.py lldb-api :: functionalities/lazy-loading/TestLazyLoading.py lldb-api :: functionalities/limit-debug-info/TestLimitDebugInfo.py lldb-api :: functionalities/load_lazy/TestLoadUsingLazyBind.py lldb-api :: functionalities/load_unload/TestLoadUnload.py lldb-api :: functionalities/load_using_paths/TestLoadUsingPaths.py lldb-api :: functionalities/memory-region/TestMemoryRegion.py lldb-api :: functionalities/memory/cache/TestMemoryCache.py lldb-api :: functionalities/memory/find/TestMemoryFind.py lldb-api :: functionalities/memory/read/TestMemoryRead.py lldb-api :: functionalities/memory/tag/TestMemoryTag.py lldb-api :: functionalities/non-overlapping-index-variable-i/TestIndexVariable.py lldb-api :: functionalities/optimized_code/TestNoASanExceptionAfterEvalOP_piece.py lldb-api :: functionalities/plugins/python_os_plugin/TestPythonOSPlugin.py lldb-api :: functionalities/plugins/python_os_plugin/stepping_plugin_threads/TestOSPluginStepping.py lldb-api :: functionalities/pointer_num_children/TestPointerNumChildren.py lldb-api :: functionalities/process_crash_info/TestProcessCrashInfo.py lldb-api :: functionalities/process_group/TestChangeProcessGroup.py lldb-api :: functionalities/ptr_refs/TestPtrRefs.py lldb-api :: functionalities/recursion/TestValueObjectRecursion.py lldb-api :: functionalities/rerun/TestRerun.py lldb-api :: functionalities/return-value/TestReturnValue.py lldb-api :: functionalities/set-data/TestSetData.py lldb-api :: functionalities/signal/TestSendSignal.py lldb-api :: functionalities/signal/handle-abrt/TestHandleAbort.py lldb-api :: functionalities/step-avoids-no-debug/TestStepNoDebug.py lldb-api :: functionalities/step-vrs-interrupt/TestStepVrsInterruptTimeout.py lldb-api :: functionalities/step_scripted/TestStepScripted.py lldb-api :: functionalities/stop-on-sharedlibrary-load/TestStopOnSharedlibraryEvents.py lldb-api :: functionalities/tail_call_frames/ambiguous_tail_call_seq1/TestAmbiguousTailCallSeq1.py lldb-api :: functionalities/tail_call_frames/ambiguous_tail_call_seq2/TestAmbiguousTailCallSeq2.py lldb-api :: functionalities/tail_call_frames/thread_step_out_or_return/TestSteppingOutWithArtificialFrames.py lldb-api :: functionalities/target_var/TestTargetVar.py lldb-api :: functionalities/thread/backtrace_all/TestBacktraceAll.py lldb-api :: functionalities/thread/backtrace_limit/TestBacktraceLimit.py lldb-api :: functionalities/thread/concurrent_events/TestConcurrentBreakpointDelayBreakpointOneSignal.py lldb-api :: functionalities/thread/concurrent_events/TestConcurrentBreakpointOneDelayBreakpointThreads.py lldb-api :: functionalities/thread/concurrent_events/TestConcurrentCrashWithBreak.py lldb-api :: functionalities/thread/concurrent_events/TestConcurrentCrashWithSignal.py lldb-api :: functionalities/thread/concurrent_events/TestConcurrentDelaySignalBreak.py lldb-api :: functionalities/thread/concurrent_events/TestConcurrentDelayedCrashWithBreakpointSignal.py lldb-api :: functionalities/thread/concurrent_events/TestConcurrentManyBreakpoints.py lldb-api :: functionalities/thread/concurrent_events/TestConcurrentManyCrash.py lldb-api :: functionalities/thread/concurrent_events/TestConcurrentSignalBreak.py lldb-api :: functionalities/thread/concurrent_events/TestConcurrentSignalDelayBreak.py lldb-api :: functionalities/thread/concurrent_events/TestConcurrentTwoBreakpointThreads.py lldb-api :: functionalities/thread/concurrent_events/TestConcurrentTwoBreakpointsOneDelaySignal.py lldb-api :: functionalities/thread/concurrent_events/TestConcurrentTwoBreakpointsOneSignal.py lldb-api :: functionalities/thread/crash_during_step/TestCrashDuringStep.py lldb-api :: functionalities/thread/create_after_attach/TestCreateAfterAttach.py lldb-api :: functionalities/thread/exit_during_break/TestExitDuringBreak.py lldb-api :: functionalities/thread/exit_during_expression/TestExitDuringExpression.py lldb-api :: functionalities/thread/exit_during_step/TestExitDuringStep.py lldb-api :: functionalities/thread/ignore_suspended/TestIgnoreSuspendedThread.py lldb-api :: functionalities/thread/jump/TestThreadJump.py lldb-api :: functionalities/thread/num_threads/TestNumThreads.py lldb-api :: functionalities/thread/state_after_expression/TestStateAfterExpression.py lldb-api :: functionalities/thread/step_out/TestThreadStepOut.py lldb-api :: functionalities/thread/step_until/TestStepUntil.py lldb-api :: functionalities/thread/thread_exit/TestThreadExit.py lldb-api :: functionalities/thread/thread_specific_break/TestThreadSpecificBreakpoint.py lldb-api :: functionalities/thread_plan/TestThreadPlanCommands.py lldb-api :: functionalities/type_completion/TestTypeCompletion.py lldb-api :: functionalities/type_get_module/TestTypeGetModule.py lldb-api :: functionalities/type_lookup/TestTypeLookup.py lldb-api :: functionalities/unwind/noreturn/TestNoreturnUnwind.py lldb-api :: functionalities/unwind/sigtramp/TestSigtrampUnwind.py lldb-api :: functionalities/unwind/zeroth_frame/TestZerothFrame.py lldb-api :: functionalities/value_md5_crash/TestValueMD5Crash.py lldb-api :: functionalities/var_path/TestVarPath.py lldb-api :: lang/c/anonymous/TestAnonymous.py lldb-api :: lang/c/array_types/TestArrayTypes.py lldb-api :: lang/c/bitfields/TestBitfields.py lldb-api :: lang/c/blocks/TestBlocks.py lldb-api :: lang/c/complex/TestComplexC99.py lldb-api :: lang/c/complex_int/TestComplexInt.py lldb-api :: lang/c/conflicting-symbol/TestConflictingSymbol.py lldb-api :: lang/c/const_variables/TestConstVariables.py lldb-api :: lang/c/cpp_keyword_identifiers/TestCppKeywordsAsCIdentifiers.py lldb-api :: lang/c/enum_types/TestEnumTypes.py lldb-api :: lang/c/forward/TestForwardDeclaration.py lldb-api :: lang/c/function_types/TestFunctionTypes.py lldb-api :: lang/c/global_variables/TestGlobalVariables.py lldb-api :: lang/c/inlines/TestRedefinitionsInInlines.py lldb-api :: lang/c/local_variables/TestLocalVariables.py lldb-api :: lang/c/modules/TestCModules.py lldb-api :: lang/c/offsetof/TestOffsetof.py lldb-api :: lang/c/register_variables/TestRegisterVariables.py lldb-api :: lang/c/set_values/TestSetValues.py lldb-api :: lang/c/shared_lib/TestSharedLib.py lldb-api :: lang/c/shared_lib_stripped_symbols/TestSharedLibStrippedSymbols.py lldb-api :: lang/c/sizeof/TestCSizeof.py lldb-api :: lang/c/step-target/TestStepTarget.py lldb-api :: lang/c/step_over_no_deadlock/TestStepOverDoesntBlock.py lldb-api :: lang/c/stepping/TestStepAndBreakpoints.py lldb-api :: lang/c/stepping/TestThreadStepInAvoidRegexp.py lldb-api :: lang/c/stepping/TestThreadStepping.py lldb-api :: lang/c/strings/TestCStrings.py lldb-api :: lang/c/struct_types/TestStructTypes.py lldb-api :: lang/c/tls_globals/TestTlsGlobals.py lldb-api :: lang/c/unicode/TestUnicodeSymbols.py lldb-api :: lang/c/unions/TestUnionMembers.py lldb-api :: lang/c/vla/TestVLA.py lldb-api :: lang/cpp/accelerator-table/TestCPPAccelerator.py lldb-api :: lang/cpp/alignas_base_class/TestAlignAsBaseClass.py lldb-api :: lang/cpp/auto/TestCPPAuto.py lldb-api :: lang/cpp/bitfields/TestCppBitfields.py lldb-api :: lang/cpp/bool/TestCPPBool.py lldb-api :: lang/cpp/break-on-initializers/TestBreakOnCPP11Initializers.py lldb-api :: lang/cpp/breakpoint-commands/TestCPPBreakpointCommands.py lldb-api :: lang/cpp/call-function/TestCallCPPFunction.py lldb-api :: lang/cpp/chained-calls/TestCppChainedCalls.py lldb-api :: lang/cpp/char8_t/TestCxxChar8_t.py lldb-api :: lang/cpp/class-template-non-type-parameter-pack/TestClassTemplateNonTypeParameterPack.py lldb-api :: lang/cpp/class-template-parameter-pack/TestClassTemplateParameterPack.py lldb-api :: lang/cpp/class-template-type-parameter-pack/TestClassTemplateTypeParameterPack.py lldb-api :: lang/cpp/class_static/TestStaticVariables.py lldb-api :: lang/cpp/class_types/TestClassTypes.py lldb-api :: lang/cpp/class_types/TestClassTypesDisassembly.py lldb-api :: lang/cpp/const_this/TestConstThis.py lldb-api :: lang/cpp/constructors/TestCppConstructors.py lldb-api :: lang/cpp/covariant-return-types/TestCovariantReturnTypes.py lldb-api :: lang/cpp/default-template-args/TestDefaultTemplateArgs.py lldb-api :: lang/cpp/dereferencing_references/TestCPPDereferencingReferences.py lldb-api :: lang/cpp/diamond/TestDiamond.py lldb-api :: lang/cpp/dynamic-value-same-basename/TestDynamicValueSameBase.py lldb-api :: lang/cpp/dynamic-value/TestCppValueCast.py lldb-api :: lang/cpp/dynamic-value/TestDynamicValue.py lldb-api :: lang/cpp/enum_types/TestCPP11EnumTypes.py lldb-api :: lang/cpp/exceptions/TestCPPExceptionBreakpoints.py lldb-api :: lang/cpp/extern_c/TestExternCSymbols.py lldb-api :: lang/cpp/forward-declared-template-specialization/TestCppForwardDeclaredTemplateSpecialization.py lldb-api :: lang/cpp/frame-var-anon-unions/TestFrameVariableAnonymousUnions.py lldb-api :: lang/cpp/function-qualifiers/TestCppFunctionQualifiers.py lldb-api :: lang/cpp/function_refs/TestFunctionRefs.py lldb-api :: lang/cpp/global_operators/TestCppGlobalOperators.py lldb-api :: lang/cpp/global_variables/TestCPPGlobalVariables.py lldb-api :: lang/cpp/gmodules-templates/TestGModules.py lldb-api :: lang/cpp/incompatible-class-templates/TestCppIncompatibleClassTemplates.py lldb-api :: lang/cpp/incomplete-types/TestCppIncompleteTypes.py lldb-api :: lang/cpp/inlines/TestInlines.py lldb-api :: lang/cpp/lambdas/TestLambdas.py lldb-api :: lang/cpp/limit-debug-info/TestWithLimitDebugInfo.py lldb-api :: lang/cpp/llvm-style/TestLLVMStyle.py lldb-api :: lang/cpp/member-and-local-vars-with-same-name/TestMembersAndLocalsWithSameName.py lldb-api :: lang/cpp/modules-import/TestCXXModulesImport.py lldb-api :: lang/cpp/multiple-inheritance/TestCppMultipleInheritance.py lldb-api :: lang/cpp/namespace/TestNamespace.py lldb-api :: lang/cpp/namespace/TestNamespaceLookup.py lldb-api :: lang/cpp/namespace_conflicts/TestNamespaceConflicts.py lldb-api :: lang/cpp/namespace_definitions/TestNamespaceDefinitions.py lldb-api :: lang/cpp/nested-class-other-compilation-unit/TestNestedClassWithParentInAnotherCU.py lldb-api :: lang/cpp/non-type-template-param/TestCppNonTypeTemplateParam.py lldb-api :: lang/cpp/nsimport/TestCppNsImport.py lldb-api :: lang/cpp/offsetof/TestOffsetofCpp.py lldb-api :: lang/cpp/operator-overload/TestOperatorOverload.py lldb-api :: lang/cpp/operators/TestCppOperators.py lldb-api :: lang/cpp/overloaded-functions/TestOverloadedFunctions.py lldb-api :: lang/cpp/pointer_to_member_type_depending_on_parent_size/TestPointerToMemberTypeDependingOnParentSize.py lldb-api :: lang/cpp/reference-to-outer-type/TestCppReferenceToOuterClass.py lldb-api :: lang/cpp/rvalue-references/TestRvalueReferences.py lldb-api :: lang/cpp/scope/TestCppScope.py lldb-api :: lang/cpp/signed_types/TestSignedTypes.py lldb-api :: lang/cpp/sizeof/TestCPPSizeof.py lldb-api :: lang/cpp/static_member_type_depending_on_parent_size/TestStaticMemberTypeDependingOnParentSize.py lldb-api :: lang/cpp/static_members/TestCPPStaticMembers.py lldb-api :: lang/cpp/static_methods/TestCPPStaticMethods.py lldb-api :: lang/cpp/std-function-step-into-callable/TestStdFunctionStepIntoCallable.py lldb-api :: lang/cpp/struct_with_keyword_name/TestStructWithKeywordName.py lldb-api :: lang/cpp/symbols/TestSymbols.py lldb-api :: lang/cpp/template-arguments/TestCppTemplateArguments.py lldb-api :: lang/cpp/template-function/TestTemplateFunctions.py lldb-api :: lang/cpp/template-specialization-type/TestTemplateSpecializationType.py lldb-api :: lang/cpp/template/TestTemplateArgs.py lldb-api :: lang/cpp/this/TestCPPThis.py lldb-api :: lang/cpp/this_class_type_mixing/TestThisClassTypeMixing.py lldb-api :: lang/cpp/thread_local/TestThreadLocal.py lldb-api :: lang/cpp/trivial_abi/TestTrivialABI.py lldb-api :: lang/cpp/type_lookup/TestCppTypeLookup.py lldb-api :: lang/cpp/typedef/TestCppTypedef.py lldb-api :: lang/cpp/unique-types/TestUniqueTypes.py lldb-api :: lang/cpp/unsigned_types/TestUnsignedTypes.py lldb-api :: lang/cpp/virtual-functions/TestCppVirtualFunctions.py lldb-api :: lang/cpp/virtual-overload/TestVirtualOverload.py lldb-api :: lang/mixed/TestMixedLanguages.py lldb-api :: lang/objc/bitfield_ivars/TestBitfieldIvars.py lldb-api :: lang/objc/blocks/TestObjCIvarsInBlocks.py lldb-api :: lang/objc/conflicting-definition/TestConflictingDefinition.py lldb-api :: lang/objc/cpp_keyword_identifiers/TestCppKeywordsAsObjCIdentifiers.py lldb-api :: lang/objc/direct-dispatch-step/TestObjCDirectDispatchStepping.py lldb-api :: lang/objc/exceptions/TestObjCExceptions.py lldb-api :: lang/objc/forward-decl/TestForwardDecl.py lldb-api :: lang/objc/foundation/TestConstStrings.py lldb-api :: lang/objc/foundation/TestFoundationDisassembly.py lldb-api :: lang/objc/foundation/TestObjCMethods.py lldb-api :: lang/objc/foundation/TestObjCMethods2.py lldb-api :: lang/objc/foundation/TestObjCMethodsNSArray.py lldb-api :: lang/objc/foundation/TestObjCMethodsNSError.py lldb-api :: lang/objc/foundation/TestObjCMethodsString.py lldb-api :: lang/objc/foundation/TestObjectDescriptionAPI.py lldb-api :: lang/objc/foundation/TestRuntimeTypes.py lldb-api :: lang/objc/global_ptrs/TestGlobalObjects.py lldb-api :: lang/objc/hidden-ivars/TestHiddenIvars.py lldb-api :: lang/objc/ivar-IMP/TestObjCiVarIMP.py lldb-api :: lang/objc/modules-auto-import/TestModulesAutoImport.py lldb-api :: lang/objc/modules-cache/TestClangModulesCache.py lldb-api :: lang/objc/modules-compile-error/TestModulesCompileError.py lldb-api :: lang/objc/modules-inline-functions/TestModulesInlineFunctions.py lldb-api :: lang/objc/modules-non-objc-target/TestObjCModulesNonObjCTarget.py lldb-api :: lang/objc/modules-objc-property/TestModulesObjCProperty.py lldb-api :: lang/objc/modules/TestObjCModules.py lldb-api :: lang/objc/objc++/TestObjCXX.py lldb-api :: lang/objc/objc-baseclass-sbtype/TestObjCBaseClassSBType.py lldb-api :: lang/objc/objc-checker/TestObjCCheckers.py lldb-api :: lang/objc/objc-class-method/TestObjCClassMethod.py lldb-api :: lang/objc/objc-dyn-sbtype/TestObjCDynamicSBType.py lldb-api :: lang/objc/objc-foundation-dictionary-empty/TestNSDictionary0.py lldb-api :: lang/objc/objc-ivar-offsets/TestObjCIvarOffsets.py lldb-api :: lang/objc/objc-ivar-protocols/TestIvarProtocols.py lldb-api :: lang/objc/objc-ivar-stripped/TestObjCIvarStripped.py lldb-api :: lang/objc/objc-new-syntax/TestObjCNewSyntaxArray.py lldb-api :: lang/objc/objc-new-syntax/TestObjCNewSyntaxDictionary.py lldb-api :: lang/objc/objc-new-syntax/TestObjCNewSyntaxLiteral.py lldb-api :: lang/objc/objc-optimized/TestObjcOptimized.py lldb-api :: lang/objc/objc-property/TestObjCProperty.py lldb-api :: lang/objc/objc-runtime-ivars/TestRuntimeIvars.py lldb-api :: lang/objc/objc-static-method-stripped/TestObjCStaticMethodStripped.py lldb-api :: lang/objc/objc-static-method/TestObjCStaticMethod.py lldb-api :: lang/objc/objc-stepping/TestObjCStepping.py lldb-api :: lang/objc/objc-struct-argument/TestObjCStructArgument.py lldb-api :: lang/objc/objc-struct-return/TestObjCStructReturn.py lldb-api :: lang/objc/objc-super/TestObjCSuper.py lldb-api :: lang/objc/objc_direct-methods/TestObjCDirectMethods.py lldb-api :: lang/objc/orderedset/TestOrderedSet.py lldb-api :: lang/objc/print-obj/TestPrintObj.py lldb-api :: lang/objc/ptr_refs/TestPtrRefsObjC.py lldb-api :: lang/objc/radar-9691614/TestObjCMethodReturningBOOL.py lldb-api :: lang/objc/rdar-10967107/TestRdar10967107.py lldb-api :: lang/objc/rdar-11355592/TestRdar11355592.py lldb-api :: lang/objc/real-definition/TestRealDefinition.py lldb-api :: lang/objc/self/TestObjCSelf.py lldb-api :: lang/objc/single-entry-dictionary/TestObjCSingleEntryDictionary.py lldb-api :: lang/objc/unicode-string/TestUnicodeString.py lldb-api :: lang/objc/variadic_methods/TestVariadicMethods.py lldb-api :: lang/objc/warnings-in-expr-parser/TestObjCWarningsInExprParser.py lldb-api :: lang/objcxx/class-name-clash/TestNameClash.py lldb-api :: lang/objcxx/cxx-bridged-po/TestObjCXXBridgedPO.py lldb-api :: lang/objcxx/hide-runtime-values/TestObjCXXHideRuntimeValues.py lldb-api :: lang/objcxx/objc-builtin-types/TestObjCBuiltinTypes.py lldb-api :: lang/objcxx/objcxx-ivar-vector/TestIvarVector.py lldb-api :: linux/builtin_trap/TestBuiltinTrap.py lldb-api :: macosx/DBGSourcePathRemapping/TestDSYMSourcePathRemapping.py lldb-api :: macosx/add-dsym/TestAddDsymMidExecutionCommand.py lldb-api :: macosx/builtin-debugtrap/TestBuiltinDebugTrap.py lldb-api :: macosx/duplicate-archive-members/TestDuplicateMembers.py lldb-api :: macosx/find-app-in-bundle/TestFindAppInBundle.py lldb-api :: macosx/find-dsym/bundle-with-dot-in-filename/TestBundleWithDotInFilename.py lldb-api :: macosx/find-dsym/deep-bundle/TestDeepBundle.py lldb-api :: macosx/indirect_symbol/TestIndirectSymbols.py lldb-api :: macosx/macCatalyst/TestMacCatalyst.py lldb-api :: macosx/nslog/TestDarwinNSLogOutput.py lldb-api :: macosx/profile_vrs_detach/TestDetachVrsProfile.py lldb-api :: macosx/queues/TestQueues.py lldb-api :: macosx/save_crashlog/TestSaveCrashlog.py lldb-api :: macosx/skinny-corefile/TestSkinnyCorefile.py lldb-api :: macosx/thread_suspend/TestInternalThreadSuspension.py lldb-api :: python_api/class_members/TestSBTypeClassMembers.py lldb-api :: python_api/exprpath_synthetic/TestExprPathSynthetic.py lldb-api :: python_api/findvalue_duplist/TestSBFrameFindValue.py lldb-api :: python_api/formatters/TestFormattersSBAPI.py lldb-api :: python_api/frame/TestFrames.py lldb-api :: python_api/frame/get-variables/TestGetVariables.py lldb-api :: python_api/frame/inlines/TestInlinedFrame.py lldb-api :: python_api/function_symbol/TestDisasmAPI.py lldb-api :: python_api/function_symbol/TestSymbolAPI.py lldb-api :: python_api/get-value-32bit-int/TestGetValue32BitInt.py lldb-api :: python_api/hello_world/TestHelloWorld.py lldb-api :: python_api/interpreter/TestCommandInterpreterAPI.py lldb-api :: python_api/lldbutil/frame/TestFrameUtils.py lldb-api :: python_api/lldbutil/process/TestPrintStackTraces.py lldb-api :: python_api/name_lookup/TestNameLookup.py lldb-api :: python_api/objc_type/TestObjCType.py lldb-api :: python_api/process/TestProcessAPI.py lldb-api :: python_api/process/io/TestProcessIO.py lldb-api :: python_api/process/read-mem-cstring/TestReadMemCString.py lldb-api :: python_api/sbdata/TestSBData.py lldb-api :: python_api/sbtype_typeclass/TestSBTypeTypeClass.py lldb-api :: python_api/sbvalue_const_addrof/TestSBValueConstAddrOf.py lldb-api :: python_api/sbvalue_persist/TestSBValuePersist.py lldb-api :: python_api/signals/TestSignalsAPI.py lldb-api :: python_api/symbol-context/TestSymbolContext.py lldb-api :: python_api/symbol-context/two-files/TestSymbolContextTwoFiles.py lldb-api :: python_api/target/TestTargetAPI.py lldb-api :: python_api/thread/TestThreadAPI.py lldb-api :: python_api/type/TestTypeList.py lldb-api :: python_api/value/TestValueAPI.py lldb-api :: python_api/value/change_values/TestChangeValueAPI.py lldb-api :: python_api/value/empty_class/TestValueAPIEmptyClass.py lldb-api :: python_api/value/linked_list/TestValueAPILinkedList.py lldb-api :: python_api/value_var_update/TestValueVarUpdate.py lldb-api :: sample_test/TestSampleInlineTest.py lldb-api :: sample_test/TestSampleTest.py lldb-api :: source-manager/TestSourceManager.py lldb-api :: tools/lldb-vscode/attach/TestVSCode_attach.py lldb-api :: tools/lldb-vscode/breakpoint-events/TestVSCode_breakpointEvents.py lldb-api :: tools/lldb-vscode/breakpoint/TestVSCode_setBreakpoints.py lldb-api :: tools/lldb-vscode/console/TestVSCode_console.py lldb-api :: tools/lldb-vscode/console/TestVSCode_redirection_to_console.py lldb-api :: tools/lldb-vscode/evaluate/TestVSCode_evaluate.py lldb-api :: tools/lldb-vscode/launch/TestVSCode_launch.py lldb-api :: tools/lldb-vscode/module/TestVSCode_module.py lldb-api :: tools/lldb-vscode/runInTerminal/TestVSCode_runInTerminal.py lldb-api :: tools/lldb-vscode/stackTrace/TestVSCode_stackTrace.py lldb-api :: tools/lldb-vscode/step/TestVSCode_step.py lldb-api :: tools/lldb-vscode/variables/TestVSCode_variables.py lldb-api :: types/TestCharType.py lldb-api :: types/TestCharTypeExpr.py lldb-api :: types/TestDoubleTypes.py lldb-api :: types/TestDoubleTypesExpr.py lldb-api :: types/TestFloatTypes.py lldb-api :: types/TestFloatTypesExpr.py lldb-api :: types/TestIntegerType.py lldb-api :: types/TestIntegerTypeExpr.py lldb-api :: types/TestLongTypes.py lldb-api :: types/TestLongTypesExpr.py lldb-api :: types/TestRecursiveTypes.py lldb-api :: types/TestShortType.py lldb-api :: types/TestShortTypeExpr.py

Hide Details

Hide Details

Testing Time: 819.42s Unsupported : 303 Passed : 1467 Expectedly Failed: 9 Timed Out : 3 Failed : 577 FAILED: tools/lldb/test/CMakeFiles/check-lldb cd /Users/buildslave/jenkins/workspace/lldb-cmake-matrix/lldb-build/tools/lldb/test && /usr/local/Frameworks/Python.framework/Versions/3.7/bin/python3.7 /Users/buildslave/jenkins/workspace/lldb-cmake-matrix/lldb-build/./bin/llvm-lit -v --time-tests --shuffle --xunit-xml-output=/Users/buildslave/jenkins/workspace/lldb-cmake-matrix/test/results.xml -v /Users/buildslave/jenkins/workspace/lldb-cmake-matrix/lldb-build/tools/lldb/test ninja: build stopped: subcommand failed. Command failed: Command '['/usr/bin/env', 'TERM=vt100', '/usr/local/bin/ninja', '-v', 'check-lldb']' returned non-zero exit status 1. Command: ['/usr/bin/env', 'TERM=vt100', '/usr/local/bin/ninja', '-v', 'check-lldb'] + set -e [Pipeline] } [Pipeline] // timeout [Pipeline] } [Pipeline] // stage [Pipeline] stage [Pipeline] { (Build Clang 5.0.2) [Pipeline] timeout Timeout set to expire in 30 min [Pipeline] { [Pipeline] dir Running in /Users/buildslave/jenkins/workspace/lldb-cmake-matrix/clang_502 [Pipeline] { [Pipeline] checkout The recommended git tool is: NONE No credentials specified Fetching changes from the remote Git repository > git rev-parse --is-inside-work-tree # timeout=10 > git config remote.origin.url http://labmaster3.local/git/llvm-project.git # timeout=10 Fetching upstream changes from http://labmaster3.local/git/llvm-project.git > git --version # timeout=10 > git --version # 'git version 2.24.3 (Apple Git-128)' > git fetch --tags --force --progress -- http://labmaster3.local/git/llvm-project.git +refs/heads/*:refs/remotes/origin/* # timeout=10 > git rev-parse origin/llvmorg-5.0.2^{commit} # timeout=10 > git rev-parse llvmorg-5.0.2^{commit} # timeout=10 Checking out Revision 6a075b6de4cafebec9ca1ff9eec7229a617c93f6 (llvmorg-5.0.2) Commit message: "Bump version to 5.0.2" First time build. Skipping changelog. [Pipeline] } [Pipeline] // dir [Pipeline] } [Pipeline] // timeout [Pipeline] timeout Timeout set to expire in 1 hr 30 min [Pipeline] { [Pipeline] sh > git config core.sparsecheckout # timeout=10 > git checkout -f 6a075b6de4cafebec9ca1ff9eec7229a617c93f6 # timeout=10 + export PATH=/usr/local/bin:/usr/local/sbin:/usr/bin:/bin:/usr/sbin:/sbin:/usr/bin:/usr/local/bin + PATH=/usr/local/bin:/usr/local/sbin:/usr/bin:/bin:/usr/sbin:/sbin:/usr/bin:/usr/local/bin + export SRC_DIR=clang_502 + SRC_DIR=clang_502 + export BUILD_DIR=clang_502_build + BUILD_DIR=clang_502_build + python llvm-zorg/zorg/jenkins/monorepo_build.py cmake build --assertions --noupload --noinstall '--projects=clang;libcxx;libcxxabi' Dependency met os_version v10.15.5 Dependency met brew cmake v3.17.2 Dependency met brew ninja v1.8.2 Dependency met pip psutil v5.4.5 Dependency met pip six v1.11.0 Dependency met xcode v11.5
Cmake

Hide Details

@@@ Cmake @@@ cd /Users/buildslave/jenkins/workspace/lldb-cmake-matrix/clang_502_build '/usr/local/bin/cmake' '-G' 'Ninja' '-DCMAKE_MAKE_PROGRAM=/usr/local/bin/ninja' '-DCMAKE_INSTALL_PREFIX=/Users/buildslave/jenkins/workspace/lldb-cmake-matrix/clang-install' '-DLLVM_ENABLE_PROJECTS=clang;libcxx;libcxxabi' '/Users/buildslave/jenkins/workspace/lldb-cmake-matrix/clang_502/llvm' '-DLLVM_ENABLE_LTO=Off' '-DLLVM_BUILD_EXAMPLES=On' '-DCMAKE_MACOSX_RPATH=On' '-DCMAKE_LIBTOOL=/Applications/Xcode.app/Contents/Developer/Toolchains/XcodeDefault.xctoolchain/usr/bin/libtool' '-DCMAKE_C_COMPILER=/Users/buildslave/jenkins/workspace/lldb-cmake-matrix/host-compiler/bin/clang' '-DCMAKE_CXX_COMPILER=/Users/buildslave/jenkins/workspace/lldb-cmake-matrix/host-compiler/bin/clang++' '-DCMAKE_BUILD_TYPE=Release' '-DLLVM_BUILD_EXTERNAL_COMPILER_RT=On' '-DLLVM_ENABLE_ASSERTIONS=On' '-DLLVM_LIT_ARGS=--xunit-xml-output=testresults.xunit.xml -v -vv --timeout=600' CMake Deprecation Warning at CMakeLists.txt:15 (cmake_policy): The OLD behavior for policy CMP0051 will be removed from a future version of CMake.

Hide Details

The cmake-policies(7) manual explains that the OLD behaviors of all policies are deprecated and that a policy should be set to OLD only under specific short-term circumstances. Projects should be ported to the NEW behavior and not rely on setting a policy to OLD.

Hide Details

Hide Details

-- Found libtool - /Applications/Xcode.app/Contents/Developer/Toolchains/XcodeDefault.xctoolchain/usr/bin/libtool -- Native target architecture is X86 -- Threads enabled. -- Doxygen disabled. -- Go bindings disabled. -- Found ld64 - /Applications/Xcode.app/Contents/Developer/Toolchains/XcodeDefault.xctoolchain/usr/bin/ld -- Could NOT find OCaml (missing: OCAMLFIND OCAML_VERSION OCAML_STDLIB_PATH) -- Could NOT find OCaml (missing: OCAMLFIND OCAML_VERSION OCAML_STDLIB_PATH) -- OCaml bindings disabled. -- LLVM host triple: x86_64-apple-darwin19.5.0 -- LLVM default target triple: x86_64-apple-darwin19.5.0 -- Building with -fPIC -- Constructing LLVMBuild project information -- Targeting AArch64 -- Targeting AMDGPU -- Targeting ARM -- Targeting BPF -- Targeting Hexagon -- Targeting Lanai -- Targeting Mips -- Targeting MSP430 -- Targeting NVPTX -- Targeting PowerPC -- Targeting Sparc -- Targeting SystemZ -- Targeting X86 -- Targeting XCore -- Found SDK version 10.15.4 -- Could NOT find Z3 (missing: Z3_LIBRARIES Z3_INCLUDE_DIR) (Required is at least version "4.5") -- Clang version: 5.0.2 -- Configuring done CMake Warning (dev): Policy CMP0068 is not set: RPATH settings on macOS do not affect install_name. Run "cmake --help-policy CMP0068" for policy details. Use the cmake_policy command to set the policy and suppress this warning.

Hide Details

For compatibility with older versions of CMake, the install_name fields for the following targets are still affected by RPATH settings:

Hide Details

LTO libclang

Hide Details

This warning is for project developers. Use -Wno-dev to suppress it.

Hide Details

-- Generating done -- Build files have been written to: /Users/buildslave/jenkins/workspace/lldb-cmake-matrix/clang_502_build Completed at: 2021-08-03T19:17:25 @@@@@@
Ninja build

Hide Details

@@@ Ninja build @@@ cd /Users/buildslave/jenkins/workspace/lldb-cmake-matrix/clang_502_build '/usr/local/bin/ninja' '-v' 'all' ninja: no work to do. Completed at: 2021-08-03T19:17:26 @@@@@@
Skip install

Hide Details

@@@ Skip install @@@ Completed at: 2021-08-03T19:17:26 @@@@@@
[Pipeline] } [Pipeline] // timeout [Pipeline] } [Pipeline] // stage [Pipeline] stage [Pipeline] { (Test Clang 5.0.2) [Pipeline] timeout Timeout set to expire in 1 hr 0 min [Pipeline] { [Pipeline] sh + export PATH=/usr/local/bin:/usr/local/sbin:/usr/bin:/bin:/usr/sbin:/sbin:/usr/bin:/usr/local/bin + PATH=/usr/local/bin:/usr/local/sbin:/usr/bin:/bin:/usr/sbin:/sbin:/usr/bin:/usr/local/bin + export LLDB_TEST_COMPILER=/Users/buildslave/jenkins/workspace/lldb-cmake-matrix/clang_502_build/bin/clang + LLDB_TEST_COMPILER=/Users/buildslave/jenkins/workspace/lldb-cmake-matrix/clang_502_build/bin/clang + python llvm-zorg/zorg/jenkins/monorepo_build.py lldb-cmake-matrix configure --assertions '--projects=clang;libcxx;libcxxabi;lldb' --cmake-type=Release --dotest-flag=--skip-category --dotest-flag=gmodules --dotest-flag=--skip-category --dotest-flag=watchpoint --dotest-flag=--arch=x86_64 Dependency met os_version v10.15.5 Dependency met brew cmake v3.17.2 Dependency met brew ninja v1.8.2 Dependency met pip psutil v5.4.5 Dependency met pip six v1.11.0 Dependency met xcode v11.5
Clean

Hide Details

@@@ Clean @@@ Removing module cache: /Users/buildslave/jenkins/workspace/lldb-cmake-matrix/lldb-build/module.cache Completed at: 2021-08-03T19:17:40 @@@@@@
Cmake

Hide Details

@@@ Cmake @@@ cd /Users/buildslave/jenkins/workspace/lldb-cmake-matrix/lldb-build '/usr/local/bin/cmake' '-G' 'Ninja' '/Users/buildslave/jenkins/workspace/lldb-cmake-matrix/llvm-project/llvm' '-DCMAKE_BUILD_TYPE=Release' '-DCMAKE_EXPORT_COMPILE_COMMANDS=ON' '-DCMAKE_INSTALL_PREFIX=/Users/buildslave/jenkins/workspace/lldb-cmake-matrix/lldb-install' '-DCMAKE_MAKE_PROGRAM=/usr/local/bin/ninja' '-DLLDB_TEST_USER_ARGS=--arch;x86_64;--build-dir;/Users/buildslave/jenkins/workspace/lldb-cmake-matrix/lldb-build/lldb-test-build.noindex;-t;--env;TERM=vt100;--skip-category;gmodules;--skip-category;watchpoint;--arch=x86_64' '-DLLDB_ENABLE_PYTHON=On' '-DLLVM_ENABLE_ASSERTIONS:BOOL=TRUE' '-DLLVM_ENABLE_MODULES=On' '-DLLVM_ENABLE_PROJECTS=clang;libcxx;libcxxabi;lldb' '-DLLVM_LIT_ARGS=-v --time-tests --shuffle --xunit-xml-output=/Users/buildslave/jenkins/workspace/lldb-cmake-matrix/test/results.xml -v' '-DLLVM_VERSION_PATCH=99' '-DLLDB_TEST_COMPILER=/Users/buildslave/jenkins/workspace/lldb-cmake-matrix/clang_502_build/bin/clang' '-DCMAKE_C_COMPILER=/Users/buildslave/jenkins/workspace/lldb-cmake-matrix/host-compiler/bin/clang' '-DCMAKE_CXX_COMPILER=/Users/buildslave/jenkins/workspace/lldb-cmake-matrix/host-compiler/bin/clang++' -- clang project is enabled -- clang-tools-extra project is disabled -- compiler-rt project is disabled -- cross-project-tests project is disabled -- libc project is disabled -- libclc project is disabled -- libcxx project is enabled -- libcxxabi project is enabled -- libunwind project is disabled -- lld project is disabled -- lldb project is enabled -- mlir project is disabled -- openmp project is disabled -- parallel-libs project is disabled -- polly project is disabled -- pstl project is disabled -- flang project is disabled -- Found libtool - /Applications/Xcode.app/Contents/Developer/Toolchains/XcodeDefault.xctoolchain/usr/bin/libtool -- Found LibXml2: /usr/lib/libxml2.dylib (found version "2.9.4") -- Native target architecture is X86 -- Threads enabled. -- Doxygen disabled. -- Go bindings disabled. -- Ninja version: 1.8.2 -- Found ld64 - /Applications/Xcode.app/Contents/Developer/Toolchains/XcodeDefault.xctoolchain/usr/bin/ld -- Could NOT find OCaml (missing: OCAMLFIND OCAML_VERSION OCAML_STDLIB_PATH) -- Could NOT find OCaml (missing: OCAMLFIND OCAML_VERSION OCAML_STDLIB_PATH) -- OCaml bindings disabled. -- LLVM host triple: x86_64-apple-darwin19.5.0 -- LLVM default target triple: x86_64-apple-darwin19.5.0 -- Building with -fPIC -- Found Python3: /usr/local/Frameworks/Python.framework/Versions/3.7/bin/python3.7 (found suitable version "3.7.0", minimum required is "3.6") found components: Interpreter -- Targeting X86 -- Could not find CrashReporterClient, not linking against it -- Could not find ParallelSTL, libc++abi will not attempt to use it but the build may fail if the libc++ in use needs it to be available. -- Looking for cxxabi.h in /Users/buildslave/jenkins/workspace/lldb-cmake-matrix/llvm-project/libcxx/../libcxxabi/include -- Looking for cxxabi.h in /Users/buildslave/jenkins/workspace/lldb-cmake-matrix/llvm-project/libcxx/../libcxxabi/include - found -- Looking for __cxxabi_config.h in /Users/buildslave/jenkins/workspace/lldb-cmake-matrix/llvm-project/libcxx/../libcxxabi/include -- Looking for __cxxabi_config.h in /Users/buildslave/jenkins/workspace/lldb-cmake-matrix/llvm-project/libcxx/../libcxxabi/include - found -- Clang version: 14.0.99 -- Host linker version: 556.6 -- Not building amdgpu-arch: hsa-runtime64 not found -- Enable editline support in LLDB: TRUE -- Enable curses support in LLDB: TRUE -- Enable LZMA compression support in LLDB: TRUE -- Could NOT find Lua (missing: LUA_LIBRARIES LUA_INCLUDE_DIR) (Required is at least version "5.3") -- Could NOT find LuaAndSwig (missing: LUA_LIBRARIES LUA_INCLUDE_DIR) -- Enable Lua scripting support in LLDB: FALSE -- Found Python3: /usr/local/Frameworks/Python.framework/Versions/3.7/bin/python3.7 (found version "3.7.0") found components: Interpreter Development -- Enable Python scripting support in LLDB: TRUE -- Found LibXml2: /usr/lib/libxml2.dylib (found suitable version "2.9.4", minimum required is "2.8") -- Enable Libxml 2 support in LLDB: TRUE -- LLDB version: 14.0.99git -- Symbols (liblldb): exporting all symbols from the lldb namespace -- LLDB debugserver energy support is disabled -- Could NOT find Doxygen (missing: DOXYGEN_EXECUTABLE) -- LLDB tests use just-built debug server -- Registering Bye as a pass plugin (static build: OFF) -- LLVM FileCheck Found: /usr/local/bin/FileCheck -- Version: 0.0.0 -- Performing Test HAVE_THREAD_SAFETY_ATTRIBUTES -- failed to compile -- Performing Test HAVE_GNU_POSIX_REGEX -- failed to compile -- Performing Test HAVE_POSIX_REGEX -- success -- Performing Test HAVE_STEADY_CLOCK -- success -- Configuring done -- Generating done -- Build files have been written to: /Users/buildslave/jenkins/workspace/lldb-cmake-matrix/lldb-build Completed at: 2021-08-03T19:18:05 @@@@@@
+ set +e + python llvm-zorg/zorg/jenkins/monorepo_build.py lldb-cmake-matrix test Dependency met os_version v10.15.5 Dependency met brew cmake v3.17.2 Dependency met brew ninja v1.8.2 Dependency met pip psutil v5.4.5 Dependency met pip six v1.11.0 Dependency met xcode v11.5
Clean

Hide Details

@@@ Clean @@@ Removing module cache: /Users/buildslave/jenkins/workspace/lldb-cmake-matrix/lldb-build/module.cache Completed at: 2021-08-03T19:18:15 @@@@@@
Run Tests

Hide Details

@@@ Run Tests @@@ cd /Users/buildslave/jenkins/workspace/lldb-cmake-matrix/lldb-build '/usr/bin/env' 'TERM=vt100' '/usr/local/bin/ninja' '-v' 'check-lldb' [1/5] cd /Users/buildslave/jenkins/workspace/lldb-cmake-matrix/lldb-build/tools/lldb && /usr/local/Cellar/cmake/3.17.2/bin/cmake -E make_directory /Users/buildslave/jenkins/workspace/lldb-cmake-matrix/lldb-build/./lib/python3.7/site-packages/lldb [2/5] cd /Users/buildslave/jenkins/workspace/lldb-cmake-matrix/lldb-build/tools/lldb && /usr/local/Cellar/cmake/3.17.2/bin/cmake -E copy /Users/buildslave/jenkins/workspace/lldb-cmake-matrix/llvm-project/lldb/third_party/Python/module/six/six.py /Users/buildslave/jenkins/workspace/lldb-cmake-matrix/lldb-build/./lib/python3.7/site-packages/lldb/../six.py && cd /Users/buildslave/jenkins/workspace/lldb-cmake-matrix/lldb-build/tools/lldb && /usr/local/Cellar/cmake/3.17.2/bin/cmake -E copy /Users/buildslave/jenkins/workspace/lldb-cmake-matrix/lldb-build/tools/lldb/bindings/python/lldb.py /Users/buildslave/jenkins/workspace/lldb-cmake-matrix/lldb-build/./lib/python3.7/site-packages/lldb/__init__.py && cd /Users/buildslave/jenkins/workspace/lldb-cmake-matrix/lldb-build/tools/lldb && /usr/local/Cellar/cmake/3.17.2/bin/cmake -E copy /Users/buildslave/jenkins/workspace/lldb-cmake-matrix/llvm-project/lldb/source/Interpreter/embedded_interpreter.py /Users/buildslave/jenkins/workspace/lldb-cmake-matrix/lldb-build/./lib/python3.7/site-packages/lldb && cd /Users/buildslave/jenkins/workspace/lldb-cmake-matrix/lldb-build/lib/python3.7/site-packages/lldb && /usr/local/Cellar/cmake/3.17.2/bin/cmake -E make_directory formatters/cpp && /usr/local/Cellar/cmake/3.17.2/bin/cmake -E copy /Users/buildslave/jenkins/workspace/lldb-cmake-matrix/llvm-project/lldb/examples/synthetic/gnu_libstdcpp.py /Users/buildslave/jenkins/workspace/lldb-cmake-matrix/llvm-project/lldb/examples/synthetic/libcxx.py formatters/cpp && /usr/local/Frameworks/Python.framework/Versions/3.7/bin/python3.7 /Users/buildslave/jenkins/workspace/lldb-cmake-matrix/llvm-project/lldb/bindings/python/createPythonInit.py formatters/cpp /Users/buildslave/jenkins/workspace/lldb-cmake-matrix/llvm-project/lldb/examples/synthetic/gnu_libstdcpp.py /Users/buildslave/jenkins/workspace/lldb-cmake-matrix/llvm-project/lldb/examples/synthetic/libcxx.py && cd /Users/buildslave/jenkins/workspace/lldb-cmake-matrix/lldb-build/lib/python3.7/site-packages/lldb && /usr/local/Cellar/cmake/3.17.2/bin/cmake -E make_directory formatters && /usr/local/Cellar/cmake/3.17.2/bin/cmake -E copy /Users/buildslave/jenkins/workspace/lldb-cmake-matrix/llvm-project/lldb/examples/summaries/cocoa/cache.py /Users/buildslave/jenkins/workspace/lldb-cmake-matrix/llvm-project/lldb/examples/summaries/synth.py /Users/buildslave/jenkins/workspace/lldb-cmake-matrix/llvm-project/lldb/examples/summaries/cocoa/metrics.py /Users/buildslave/jenkins/workspace/lldb-cmake-matrix/llvm-project/lldb/examples/summaries/cocoa/attrib_fromdict.py /Users/buildslave/jenkins/workspace/lldb-cmake-matrix/llvm-project/lldb/examples/summaries/cocoa/Logger.py formatters && /usr/local/Frameworks/Python.framework/Versions/3.7/bin/python3.7 /Users/buildslave/jenkins/workspace/lldb-cmake-matrix/llvm-project/lldb/bindings/python/createPythonInit.py formatters /Users/buildslave/jenkins/workspace/lldb-cmake-matrix/llvm-project/lldb/examples/summaries/cocoa/cache.py /Users/buildslave/jenkins/workspace/lldb-cmake-matrix/llvm-project/lldb/examples/summaries/synth.py /Users/buildslave/jenkins/workspace/lldb-cmake-matrix/llvm-project/lldb/examples/summaries/cocoa/metrics.py /Users/buildslave/jenkins/workspace/lldb-cmake-matrix/llvm-project/lldb/examples/summaries/cocoa/attrib_fromdict.py /Users/buildslave/jenkins/workspace/lldb-cmake-matrix/llvm-project/lldb/examples/summaries/cocoa/Logger.py && cd /Users/buildslave/jenkins/workspace/lldb-cmake-matrix/lldb-build/lib/python3.7/site-packages/lldb && /usr/local/Cellar/cmake/3.17.2/bin/cmake -E make_directory utils && /usr/local/Cellar/cmake/3.17.2/bin/cmake -E copy /Users/buildslave/jenkins/workspace/lldb-cmake-matrix/llvm-project/lldb/examples/python/in_call_stack.py /Users/buildslave/jenkins/workspace/lldb-cmake-matrix/llvm-project/lldb/examples/python/symbolication.py utils && /usr/local/Frameworks/Python.framework/Versions/3.7/bin/python3.7 /Users/buildslave/jenkins/workspace/lldb-cmake-matrix/llvm-project/lldb/bindings/python/createPythonInit.py utils /Users/buildslave/jenkins/workspace/lldb-cmake-matrix/llvm-project/lldb/examples/python/in_call_stack.py /Users/buildslave/jenkins/workspace/lldb-cmake-matrix/llvm-project/lldb/examples/python/symbolication.py && cd /Users/buildslave/jenkins/workspace/lldb-cmake-matrix/lldb-build/lib/python3.7/site-packages/lldb && /usr/local/Cellar/cmake/3.17.2/bin/cmake -E make_directory plugins && /usr/local/Cellar/cmake/3.17.2/bin/cmake -E copy /Users/buildslave/jenkins/workspace/lldb-cmake-matrix/llvm-project/lldb/examples/python/scripted_process/scripted_process.py plugins && /usr/local/Frameworks/Python.framework/Versions/3.7/bin/python3.7 /Users/buildslave/jenkins/workspace/lldb-cmake-matrix/llvm-project/lldb/bindings/python/createPythonInit.py plugins /Users/buildslave/jenkins/workspace/lldb-cmake-matrix/llvm-project/lldb/examples/python/scripted_process/scripted_process.py && cd /Users/buildslave/jenkins/workspace/lldb-cmake-matrix/lldb-build/lib/python3.7/site-packages/lldb && /usr/local/Cellar/cmake/3.17.2/bin/cmake -E make_directory macosx && /usr/local/Cellar/cmake/3.17.2/bin/cmake -E copy /Users/buildslave/jenkins/workspace/lldb-cmake-matrix/llvm-project/lldb/examples/python/crashlog.py /Users/buildslave/jenkins/workspace/lldb-cmake-matrix/llvm-project/lldb/examples/darwin/heap_find/heap.py macosx && /usr/local/Frameworks/Python.framework/Versions/3.7/bin/python3.7 /Users/buildslave/jenkins/workspace/lldb-cmake-matrix/llvm-project/lldb/bindings/python/createPythonInit.py macosx /Users/buildslave/jenkins/workspace/lldb-cmake-matrix/llvm-project/lldb/examples/python/crashlog.py /Users/buildslave/jenkins/workspace/lldb-cmake-matrix/llvm-project/lldb/examples/darwin/heap_find/heap.py && cd /Users/buildslave/jenkins/workspace/lldb-cmake-matrix/lldb-build/lib/python3.7/site-packages/lldb && /usr/local/Cellar/cmake/3.17.2/bin/cmake -E make_directory macosx/heap && /usr/local/Cellar/cmake/3.17.2/bin/cmake -E copy /Users/buildslave/jenkins/workspace/lldb-cmake-matrix/llvm-project/lldb/examples/darwin/heap_find/heap/heap_find.cpp /Users/buildslave/jenkins/workspace/lldb-cmake-matrix/llvm-project/lldb/examples/darwin/heap_find/heap/Makefile macosx/heap && cd /Users/buildslave/jenkins/workspace/lldb-cmake-matrix/lldb-build/lib/python3.7/site-packages/lldb && /usr/local/Cellar/cmake/3.17.2/bin/cmake -E make_directory diagnose && /usr/local/Cellar/cmake/3.17.2/bin/cmake -E copy /Users/buildslave/jenkins/workspace/lldb-cmake-matrix/llvm-project/lldb/examples/python/diagnose_unwind.py /Users/buildslave/jenkins/workspace/lldb-cmake-matrix/llvm-project/lldb/examples/python/diagnose_nsstring.py diagnose && /usr/local/Frameworks/Python.framework/Versions/3.7/bin/python3.7 /Users/buildslave/jenkins/workspace/lldb-cmake-matrix/llvm-project/lldb/bindings/python/createPythonInit.py diagnose /Users/buildslave/jenkins/workspace/lldb-cmake-matrix/llvm-project/lldb/examples/python/diagnose_unwind.py /Users/buildslave/jenkins/workspace/lldb-cmake-matrix/llvm-project/lldb/examples/python/diagnose_nsstring.py && cd /Users/buildslave/jenkins/workspace/lldb-cmake-matrix/lldb-build/lib/python3.7/site-packages/lldb && /usr/local/Cellar/cmake/3.17.2/bin/cmake -E create_symlink ../../../liblldb.dylib _lldb.so && cd /Users/buildslave/jenkins/workspace/lldb-cmake-matrix/lldb-build/lib/python3.7/site-packages/lldb && /usr/local/Cellar/cmake/3.17.2/bin/cmake -E create_symlink ../../../../bin/lldb-argdumper lldb-argdumper [3/5] /Users/buildslave/jenkins/workspace/lldb-cmake-matrix/host-compiler/bin/clang++ -DCMAKE_CFG_INTDIR=\".\" -DGTEST_HAS_RTTI=0 -D_DEBUG -D__STDC_CONSTANT_MACROS -D__STDC_FORMAT_MACROS -D__STDC_LIMIT_MACROS -Itools/llvm-config -I/Users/buildslave/jenkins/workspace/lldb-cmake-matrix/llvm-project/llvm/tools/llvm-config -Iinclude -I/Users/buildslave/jenkins/workspace/lldb-cmake-matrix/llvm-project/llvm/include -fPIC -fvisibility-inlines-hidden -Werror=date-time -Werror=unguarded-availability-new -fmodules -fmodules-cache-path=/Users/buildslave/jenkins/workspace/lldb-cmake-matrix/lldb-build/module.cache -fcxx-modules -Xclang -fmodules-local-submodule-visibility -Wall -Wextra -Wno-unused-parameter -Wwrite-strings -Wcast-qual -Wmissing-field-initializers -pedantic -Wno-long-long -Wc++98-compat-extra-semi -Wimplicit-fallthrough -Wcovered-switch-default -Wno-noexcept-type -Wnon-virtual-dtor -Wdelete-non-virtual-dtor -Wsuggest-override -Wstring-conversion -Wmisleading-indentation -fdiagnostics-color -O3 -DNDEBUG -isysroot /Applications/Xcode.app/Contents/Developer/Platforms/MacOSX.platform/Developer/SDKs/MacOSX10.15.sdk -fno-exceptions -fno-rtti -UNDEBUG -fmodules-ignore-macro=CMAKE_CFG_INTDIR -std=c++14 -MD -MT tools/llvm-config/CMakeFiles/llvm-config.dir/llvm-config.cpp.o -MF tools/llvm-config/CMakeFiles/llvm-config.dir/llvm-config.cpp.o.d -o tools/llvm-config/CMakeFiles/llvm-config.dir/llvm-config.cpp.o -c /Users/buildslave/jenkins/workspace/lldb-cmake-matrix/llvm-project/llvm/tools/llvm-config/llvm-config.cpp [4/5] : && /Users/buildslave/jenkins/workspace/lldb-cmake-matrix/host-compiler/bin/clang++ -fPIC -fvisibility-inlines-hidden -Werror=date-time -Werror=unguarded-availability-new -fmodules -fmodules-cache-path=/Users/buildslave/jenkins/workspace/lldb-cmake-matrix/lldb-build/module.cache -fcxx-modules -Xclang -fmodules-local-submodule-visibility -Wall -Wextra -Wno-unused-parameter -Wwrite-strings -Wcast-qual -Wmissing-field-initializers -pedantic -Wno-long-long -Wc++98-compat-extra-semi -Wimplicit-fallthrough -Wcovered-switch-default -Wno-noexcept-type -Wnon-virtual-dtor -Wdelete-non-virtual-dtor -Wsuggest-override -Wstring-conversion -Wmisleading-indentation -fdiagnostics-color -O3 -DNDEBUG -isysroot /Applications/Xcode.app/Contents/Developer/Platforms/MacOSX.platform/Developer/SDKs/MacOSX10.15.sdk -Wl,-search_paths_first -Wl,-headerpad_max_install_names -Wl,-dead_strip tools/llvm-config/CMakeFiles/llvm-config.dir/llvm-config.cpp.o -o bin/llvm-config -Wl,-rpath,@loader_path/../lib lib/libLLVMSupport.a -lm /usr/lib/libz.dylib /usr/lib/libcurses.dylib lib/libLLVMDemangle.a && : [4/5] cd /Users/buildslave/jenkins/workspace/lldb-cmake-matrix/lldb-build/tools/lldb/test && /usr/local/Frameworks/Python.framework/Versions/3.7/bin/python3.7 /Users/buildslave/jenkins/workspace/lldb-cmake-matrix/lldb-build/./bin/llvm-lit -v --time-tests --shuffle --xunit-xml-output=/Users/buildslave/jenkins/workspace/lldb-cmake-matrix/test/results.xml -v /Users/buildslave/jenkins/workspace/lldb-cmake-matrix/lldb-build/tools/lldb/test Deleting module cache at /Users/buildslave/jenkins/workspace/lldb-cmake-matrix/lldb-build/lldb-test-build.noindex/module-cache-clang/lldb-api. -- Testing: 2359 tests, 16 workers -- llvm-lit: /Users/buildslave/jenkins/workspace/lldb-cmake-matrix/llvm-project/lldb/test/Shell/helper/toolchain.py:126: note: using SDKROOT: '/Applications/Xcode.app/Contents/Developer/Platforms/MacOSX.platform/Developer/SDKs/MacOSX.sdk' llvm-lit: /Users/buildslave/jenkins/workspace/lldb-cmake-matrix/llvm-project/llvm/utils/lit/lit/llvm/config.py:436: note: using clang: /Users/buildslave/jenkins/workspace/lldb-cmake-matrix/lldb-build/bin/clang PASS: lldb-unit :: Utility/./UtilityTests/RangeTest.LessThan (1 of 2359) PASS: lldb-unit :: Utility/./UtilityTests/ArgsTest.TestMultipleArgs (2 of 2359) PASS: lldb-unit :: Interpreter/./InterpreterTests/CompletionTest.DirCompletionUsername (3 of 2359) PASS: lldb-unit :: Utility/./UtilityTests/SerializationRountripTest.SerializeDeserializePodPointers (4 of 2359) PASS: lldb-unit :: Host/./HostTests/NativeProcessProtocolTest.SetBreakpointFailVerify (5 of 2359) PASS: lldb-unit :: Process/gdb-remote/./ProcessGdbRemoteTests/GDBRemoteCommunicationServerTest.SendErrorResponse_StringError (6 of 2359) PASS: lldb-unit :: Process/minidump/./LLDBMinidumpTests/MinidumpParserTest.GetFilteredModuleList (7 of 2359) PASS: lldb-unit :: Host/./HostTests/SocketTests/SocketTest.TCPGetConnectURI/ipv4 (8 of 2359) PASS: lldb-unit :: Symbol/./SymbolTests/TestTypeSystemClang.TestRecordHasFields (9 of 2359) PASS: lldb-unit :: Utility/./UtilityTests/StreamTest.AddressRangeSize (10 of 2359) PASS: lldb-unit :: Utility/./UtilityTests/StringListTest.LongestCommonPrefixDuplicateElement (11 of 2359) PASS: lldb-unit :: Utility/./UtilityTests/Flags.AnyClear (12 of 2359) UNSUPPORTED: lldb-shell :: SymbolFile/NativePDB/global-classes.cpp (13 of 2359) PASS: lldb-unit :: Utility/./UtilityTests/BroadcasterTest.BroadcastEvent (14 of 2359) PASS: lldb-unit :: ScriptInterpreter/Python/./ScriptInterpreterPythonTests/PythonDataObjectsTest.TestPythonString (15 of 2359) PASS: lldb-shell :: SymbolFile/DWARF/x86/DW_AT_loclists_base.s (16 of 2359) PASS: lldb-shell :: SymbolFile/DWARF/x86/DW_TAG_variable-DW_AT_const_value.s (17 of 2359) PASS: lldb-shell :: SymbolFile/Breakpad/line-table-missing-file.test (18 of 2359) PASS: lldb-unit :: Utility/./UtilityTests/ArgsTest.ReplaceArgumentAtIndexFarOutOfRange (19 of 2359) PASS: lldb-unit :: ScriptInterpreter/Python/./ScriptInterpreterPythonTests/PythonDataObjectsTest.TestPythonByteArray (20 of 2359) PASS: lldb-shell :: Register/Core/x86-32-netbsd-gp.test (21 of 2359) PASS: lldb-unit :: Interpreter/./InterpreterTests/OptionValueString.DeepCopy (22 of 2359) PASS: lldb-unit :: Utility/./UtilityTests/StringLexerTest.PutBack (23 of 2359) PASS: lldb-shell :: Register/Core/x86-32-freebsd-gp.test (24 of 2359) PASS: lldb-unit :: Utility/./UtilityTests/OptionsWithRawTest.MultiWordSuffix (25 of 2359) PASS: lldb-unit :: Utility/./UtilityTests/RegisterValueTest.GetScalarValue (26 of 2359) PASS: lldb-unit :: ScriptInterpreter/Python/./ScriptInterpreterPythonTests/PythonDataObjectsTest.TestPythonTupleValues (27 of 2359) PASS: lldb-unit :: Expression/./ExpressionTests/CppModuleConfigurationTest.Linux (28 of 2359) UNSUPPORTED: lldb-api :: functionalities/thread/concurrent_events/TestConcurrentDelayWatchBreak.py (29 of 2359) UNSUPPORTED: lldb-api :: android/platform/TestDefaultCacheLineSize.py (30 of 2359) UNSUPPORTED: lldb-api :: tools/lldb-server/memory-tagging/TestGdbRemoteMemoryTagging.py (31 of 2359) PASS: lldb-unit :: Utility/./UtilityTests/DataExtractorTest.GetCStrEmpty (32 of 2359) UNSUPPORTED: lldb-api :: commands/expression/completion-crash-invalid-iterator/TestInvalidIteratorCompletionCrash.py (33 of 2359) PASS: lldb-api :: macosx/version_zero/TestGetVersionZeroVersion.py (34 of 2359) PASS: lldb-shell :: ObjectFile/ELF/null-jmprel.yaml (35 of 2359) UNSUPPORTED: lldb-api :: functionalities/tail_call_frames/sbapi_support/TestTailCallFrameSBAPI.py (36 of 2359) UNSUPPORTED: lldb-api :: functionalities/unwind/aarch64_unwind_pac/TestAArch64UnwindPAC.py (37 of 2359) PASS: lldb-api :: commands/expression/error-limit/TestExprErrorLimit.py (38 of 2359) PASS: lldb-unit :: Utility/./UtilityTests/StringExtractorTest.GetNameColonValueContainsColon (39 of 2359) UNSUPPORTED: lldb-api :: commands/watchpoints/watchpoint_events/TestWatchpointEvents.py (40 of 2359) PASS: lldb-unit :: Utility/./UtilityTests/ArgsTest.GetArgumentArrayRef (41 of 2359) PASS: lldb-unit :: Utility/./UtilityTests/LogChannelEnabledTest.LLDB_LOG_ERROR (42 of 2359) PASS: lldb-api :: lang/cpp/static_member_type_depending_on_parent_size/TestStaticMemberTypeDependingOnParentSize.py (43 of 2359) UNSUPPORTED: lldb-shell :: SymbolFile/NativePDB/typedefs.cpp (44 of 2359) PASS: lldb-unit :: Utility/./UtilityTests/FileSpecTest.GuessPathStyle (45 of 2359) PASS: lldb-unit :: Process/./ProcessEventDataTests/ProcessEventDataTest.DoOnRemoval (46 of 2359) PASS: lldb-shell :: SymbolFile/DWARF/x86/module-ownership.mm (47 of 2359) PASS: lldb-shell :: Driver/TestPositionalArgs.test (48 of 2359) PASS: lldb-api :: macosx/builtin-debugtrap/TestBuiltinDebugTrap.py (49 of 2359) PASS: lldb-unit :: Process/minidump/./LLDBMinidumpTests/MinidumpParserTest.GetArchitectureWindows (50 of 2359) PASS: lldb-api :: iohandler/resize/TestIOHandlerResizeNoEditline.py (51 of 2359) PASS: lldb-unit :: DataFormatter/./LLDBFormatterTests/TypeMatcherTests.GetMatchStringRegex (52 of 2359) UNSUPPORTED: lldb-shell :: SymbolFile/DWARF/x86/dir-separator-windows.s (53 of 2359) PASS: lldb-unit :: DataFormatter/./LLDBFormatterTests/TypeMatcherTests.ExactName (54 of 2359) PASS: lldb-api :: python_api/frame/inlines/TestInlinedFrame.py (55 of 2359) PASS: lldb-unit :: Utility/./UtilityTests/StreamTest.AddressRangeEmptyRange (56 of 2359) PASS: lldb-unit :: Utility/./UtilityTests/StreamTest.PutPtr (57 of 2359) PASS: lldb-unit :: Utility/./UtilityTests/RangeTest.ContainsAddrInvalid (58 of 2359) PASS: lldb-api :: python_api/sbdata/TestSBData.py (59 of 2359) PASS: lldb-shell :: ObjectFile/ELF/eh_frame-symbols.yaml (60 of 2359) UNSUPPORTED: lldb-api :: commands/register/register/intel_xtended_registers/mpx_bound_violation/TestBoundViolation.py (61 of 2359) UNSUPPORTED: lldb-shell :: Process/Windows/exception_access_violation.cpp (62 of 2359) PASS: lldb-unit :: SymbolFile/NativePDB/./SymbolFileNativePDBTests/PDBFPOProgramToDWARFExpressionTests.InvalidAssignmentMultiple (63 of 2359) PASS: lldb-api :: lang/cpp/std-function-step-into-callable/TestStdFunctionStepIntoCallable.py (64 of 2359) PASS: lldb-unit :: Language/Highlighting/./HighlighterTests/HighlighterTest.ClangOperators (65 of 2359) PASS: lldb-api :: commands/expression/radar_9531204/TestPrintfAfterUp.py (66 of 2359) PASS: lldb-unit :: Process/Utility/./ProcessUtilityTests/MemoryTagManagerAArch64MTETest.RemoveNonAddressBits (67 of 2359) PASS: lldb-unit :: Utility/./UtilityTests/NameMatchesTest.Ignore (68 of 2359) PASS: lldb-unit :: Utility/./UtilityTests/DataExtractorTest.GetMaxU64 (69 of 2359) PASS: lldb-unit :: Utility/./UtilityTests/UriParserTest.MinimalPortPath (70 of 2359) PASS: lldb-api :: commands/expression/context-object-objc/TestContextObjectObjc.py (71 of 2359) PASS: lldb-api :: api/multiple-targets/TestMultipleTargets.py (72 of 2359) PASS: lldb-unit :: Utility/./UtilityTests/StreamTeeTest.SetStreamAtIndexOutOfBounds (73 of 2359) UNSUPPORTED: lldb-api :: lang/c/unicode/TestUnicodeSymbols.py (74 of 2359) PASS: lldb-api :: commands/target/stop-hook/disable/TestTargetStopHookDisable.py (75 of 2359) PASS: lldb-unit :: Utility/./UtilityTests/XcodeSDKTest.GetCanonicalNameAndConstruct (76 of 2359) PASS: lldb-unit :: ScriptInterpreter/Python/./ScriptInterpreterPythonTests/PythonDataObjectsTest.TestPythonListManipulation (77 of 2359) PASS: lldb-shell :: Driver/TestUseColor.test (78 of 2359) PASS: lldb-api :: commands/frame/select/TestFrameSelect.py (79 of 2359) UNSUPPORTED: lldb-shell :: ScriptInterpreter/Lua/nested_sessions.test (80 of 2359) PASS: lldb-unit :: Core/./LLDBCoreTests/DumpDataExtractorTest.StartOffset (81 of 2359) PASS: lldb-api :: functionalities/thread/concurrent_events/TestConcurrentManyCrash.py (82 of 2359) PASS: lldb-api :: functionalities/dlopen_other_executable/TestDlopenOtherExecutable.py (83 of 2359) PASS: lldb-api :: functionalities/data-formatter/data-formatter-objc/TestDataFormatterObjCNSError.py (84 of 2359) PASS: lldb-unit :: Process/gdb-remote/./ProcessGdbRemoteTests/GDBRemoteCommunicationClientTest.TestPacketSpeedJSON (85 of 2359) PASS: lldb-unit :: Utility/./UtilityTests/StringListTest.InsertStringAtIndexEnd (86 of 2359) PASS: lldb-unit :: Process/Utility/./ProcessUtilityTests/ProcMapTests/LinuxProcMapsTestFixture.ParseMapRegions/5 (87 of 2359) PASS: lldb-unit :: Symbol/./SymbolTests/TestTypeSystemClang.TestConvertAccessTypeToAccessSpecifier (88 of 2359) PASS: lldb-api :: functionalities/data-formatter/data-formatter-python-synth/TestDataFormatterPythonSynth.py (89 of 2359) PASS: lldb-unit :: Signals/./SignalsTests/UnixSignalsTest.GetInfo (90 of 2359) UNSUPPORTED: lldb-shell :: SymbolFile/DWARF/x86/dir-separator-no-comp-dir-relative-name.s (91 of 2359) PASS: lldb-api :: functionalities/gdb_remote_client/TestWasm.py (92 of 2359) PASS: lldb-api :: lang/cpp/frame-var-anon-unions/TestFrameVariableAnonymousUnions.py (93 of 2359) PASS: lldb-unit :: Expression/./ExpressionTests/DWARFExpression.DW_OP_unknown (94 of 2359) PASS: lldb-unit :: Process/Utility/./ProcessUtilityTests/ProcMapTests/LinuxProcMapsTestFixture.ParseMapRegions/7 (95 of 2359) PASS: lldb-api :: commands/expression/import-std-module/conflicts/TestStdModuleWithConflicts.py (96 of 2359) PASS: lldb-api :: python_api/file_handle/TestFileHandle.py (97 of 2359) PASS: lldb-api :: commands/expression/persistent_ptr_update/TestPersistentPtrUpdate.py (98 of 2359) PASS: lldb-shell :: ObjectFile/Breakpad/uuid-matching-mac.test (99 of 2359) PASS: lldb-api :: lang/objc/modules-non-objc-target/TestObjCModulesNonObjCTarget.py (100 of 2359) PASS: lldb-shell :: BuildScript/compiler-full-path.test (101 of 2359) PASS: lldb-unit :: Utility/./UtilityTests/BinaryStreamTest.PutULEB128FourBytes (102 of 2359) PASS: lldb-api :: python_api/objc_type/TestObjCType.py (103 of 2359) UNSUPPORTED: lldb-api :: tools/intel-features/intel-pt/test/TestIntelPTSimpleBinary.py (104 of 2359) PASS: lldb-api :: functionalities/thread/concurrent_events/TestConcurrentCrashWithBreak.py (105 of 2359) UNSUPPORTED: lldb-shell :: Register/aarch64-fp-read.test (106 of 2359) PASS: lldb-api :: lang/objc/conflicting-definition/TestConflictingDefinition.py (107 of 2359) UNSUPPORTED: lldb-api :: benchmarks/startup/TestStartupDelays.py (108 of 2359) PASS: lldb-shell :: Register/x86-multithread-write.test (109 of 2359) FAIL: lldb-api :: commands/expression/import-std-module/unique_ptr/TestUniquePtrFromStdModule.py (110 of 2359) ******************** TEST 'lldb-api :: commands/expression/import-std-module/unique_ptr/TestUniquePtrFromStdModule.py' FAILED ******************** Script: -- /usr/local/Frameworks/Python.framework/Versions/3.7/bin/python3.7 /Users/buildslave/jenkins/workspace/lldb-cmake-matrix/llvm-project/lldb/test/API/dotest.py -u CXXFLAGS -u CFLAGS --codesign-identity lldb_codesign --arch x86_64 --build-dir /Users/buildslave/jenkins/workspace/lldb-cmake-matrix/lldb-build/lldb-test-build.noindex -t --env TERM=vt100 --skip-category gmodules --skip-category watchpoint --arch=x86_64 --env LLVM_LIBS_DIR=/Users/buildslave/jenkins/workspace/lldb-cmake-matrix/lldb-build/./lib --arch x86_64 --build-dir /Users/buildslave/jenkins/workspace/lldb-cmake-matrix/lldb-build/lldb-test-build.noindex --lldb-module-cache-dir /Users/buildslave/jenkins/workspace/lldb-cmake-matrix/lldb-build/lldb-test-build.noindex/module-cache-lldb/lldb-api --clang-module-cache-dir /Users/buildslave/jenkins/workspace/lldb-cmake-matrix/lldb-build/lldb-test-build.noindex/module-cache-clang/lldb-api --executable /Users/buildslave/jenkins/workspace/lldb-cmake-matrix/lldb-build/./bin/lldb --compiler /Users/buildslave/jenkins/workspace/lldb-cmake-matrix/clang_502_build/bin/clang --dsymutil /Users/buildslave/jenkins/workspace/lldb-cmake-matrix/lldb-build/./bin/dsymutil --llvm-tools-dir /Users/buildslave/jenkins/workspace/lldb-cmake-matrix/lldb-build/./bin --lldb-libs-dir /Users/buildslave/jenkins/workspace/lldb-cmake-matrix/lldb-build/./lib /Users/buildslave/jenkins/workspace/lldb-cmake-matrix/llvm-project/lldb/test/API/commands/expression/import-std-module/unique_ptr -p TestUniquePtrFromStdModule.py -- Exit Code: 1

Hide Details

Command Output (stdout): -- lldb version 14.0.99 (http://labmaster3.local/git/llvm-project.git revision 3fc92948734ab606e3afa68bc2c083fd3d48102a) clang revision 3fc92948734ab606e3afa68bc2c083fd3d48102a llvm revision 3fc92948734ab606e3afa68bc2c083fd3d48102a Skipping the following test categories: ['gmodules', 'watchpoint', 'libstdcxx', 'dwo', 'llgs', 'fork']

Hide Details

-- Command Output (stderr): -- Change dir to: /Users/buildslave/jenkins/workspace/lldb-cmake-matrix/llvm-project/lldb/test/API/commands/expression/import-std-module/unique_ptr runCmd: settings clear -all output:

Hide Details

runCmd: settings set symbols.enable-external-lookup false output:

Hide Details

runCmd: settings set target.inherit-tcc true output:

Hide Details

runCmd: settings set target.detach-on-error false output:

Hide Details

runCmd: settings set target.auto-apply-fixits false output:

Hide Details

runCmd: settings set plugin.process.gdb-remote.packet-timeout 60 output:

Hide Details

runCmd: settings set symbols.clang-modules-cache-path "/Users/buildslave/jenkins/workspace/lldb-cmake-matrix/lldb-build/lldb-test-build.noindex/module-cache-lldb/lldb-api" output:

Hide Details

runCmd: settings set use-color false output:

Hide Details

runCmd: setting set target.prefer-dynamic-value no-dynamic-values output:

Hide Details

runCmd: settings set target.import-std-module true output:

Hide Details

runCmd: expr s.reset() runCmd failed! error: expression failed to parse: error: Couldn't lookup symbols: __ZNKSt3__114default_deleteIiEclEPi

Hide Details

Hide Details

FAIL: LLDB (/Users/buildslave/jenkins/workspace/lldb-cmake-matrix/clang_502_build/bin/clang-x86_64) :: test_dsym (TestUniquePtrFromStdModule.TestUniquePtr) <bound method SBProcess.Kill of <lldb.SBProcess; proxy of <Swig Object of type 'lldb::SBProcess *' at 0x1070fa8d0> >>: success

Hide Details

runCmd: settings clear -all output:

Hide Details

runCmd: settings set symbols.enable-external-lookup false output:

Hide Details

runCmd: settings set target.inherit-tcc true output:

Hide Details

runCmd: settings set target.detach-on-error false output:

Hide Details

runCmd: settings set target.auto-apply-fixits false output:

Hide Details

runCmd: settings set plugin.process.gdb-remote.packet-timeout 60 output:

Hide Details

runCmd: settings set symbols.clang-modules-cache-path "/Users/buildslave/jenkins/workspace/lldb-cmake-matrix/lldb-build/lldb-test-build.noindex/module-cache-lldb/lldb-api" output:

Hide Details

runCmd: settings set use-color false output:

Hide Details

runCmd: setting set target.prefer-dynamic-value no-dynamic-values output:

Hide Details

runCmd: settings set target.import-std-module true output:

Hide Details

runCmd: expr s.reset() runCmd failed! error: expression failed to parse: error: Couldn't lookup symbols: __ZNKSt3__114default_deleteIiEclEPi

Hide Details

Hide Details

FAIL: LLDB (/Users/buildslave/jenkins/workspace/lldb-cmake-matrix/clang_502_build/bin/clang-x86_64) :: test_dwarf (TestUniquePtrFromStdModule.TestUniquePtr) <bound method SBProcess.Kill of <lldb.SBProcess; proxy of <Swig Object of type 'lldb::SBProcess *' at 0x10160aae0> >>: success

Hide Details

UNSUPPORTED: LLDB (/Users/buildslave/jenkins/workspace/lldb-cmake-matrix/clang_502_build/bin/clang-x86_64) :: test_dwo (TestUniquePtrFromStdModule.TestUniquePtr) (test case does not fall in any category of interest for this run) UNSUPPORTED: LLDB (/Users/buildslave/jenkins/workspace/lldb-cmake-matrix/clang_502_build/bin/clang-x86_64) :: test_gmodules (TestUniquePtrFromStdModule.TestUniquePtr) (test case does not fall in any category of interest for this run) Restore dir to: /Users/buildslave/jenkins/workspace/lldb-cmake-matrix/lldb-build/tools/lldb/test ====================================================================== FAIL: test_dsym (TestUniquePtrFromStdModule.TestUniquePtr) ---------------------------------------------------------------------- Traceback (most recent call last): File "/Users/buildslave/jenkins/workspace/lldb-cmake-matrix/llvm-project/lldb/packages/Python/lldbsuite/test/lldbtest.py", line 1834, in test_method return attrvalue(self) File "/Users/buildslave/jenkins/workspace/lldb-cmake-matrix/llvm-project/lldb/packages/Python/lldbsuite/test/decorators.py", line 149, in wrapper return func(*args, **kwargs) File "/Users/buildslave/jenkins/workspace/lldb-cmake-matrix/llvm-project/lldb/test/API/commands/expression/import-std-module/unique_ptr/TestUniquePtrFromStdModule.py", line 35, in test self.expect("expr s.reset()") File "/Users/buildslave/jenkins/workspace/lldb-cmake-matrix/llvm-project/lldb/packages/Python/lldbsuite/test/lldbtest.py", line 2467, in expect inHistory=inHistory) File "/Users/buildslave/jenkins/workspace/lldb-cmake-matrix/llvm-project/lldb/packages/Python/lldbsuite/test/lldbtest.py", line 2165, in runCmd msg if (msg) else CMD_MSG(cmd)) AssertionError: False is not True : Command 'expr s.reset() Error output: error: expression failed to parse: error: Couldn't lookup symbols: __ZNKSt3__114default_deleteIiEclEPi ' did not return successfully Config=x86_64-/Users/buildslave/jenkins/workspace/lldb-cmake-matrix/clang_502_build/bin/clang ====================================================================== FAIL: test_dwarf (TestUniquePtrFromStdModule.TestUniquePtr) ---------------------------------------------------------------------- Traceback (most recent call last): File "/Users/buildslave/jenkins/workspace/lldb-cmake-matrix/llvm-project/lldb/packages/Python/lldbsuite/test/lldbtest.py", line 1834, in test_method return attrvalue(self) File "/Users/buildslave/jenkins/workspace/lldb-cmake-matrix/llvm-project/lldb/packages/Python/lldbsuite/test/decorators.py", line 149, in wrapper return func(*args, **kwargs) File "/Users/buildslave/jenkins/workspace/lldb-cmake-matrix/llvm-project/lldb/test/API/commands/expression/import-std-module/unique_ptr/TestUniquePtrFromStdModule.py", line 35, in test self.expect("expr s.reset()") File "/Users/buildslave/jenkins/workspace/lldb-cmake-matrix/llvm-project/lldb/packages/Python/lldbsuite/test/lldbtest.py", line 2467, in expect inHistory=inHistory) File "/Users/buildslave/jenkins/workspace/lldb-cmake-matrix/llvm-project/lldb/packages/Python/lldbsuite/test/lldbtest.py", line 2165, in runCmd msg if (msg) else CMD_MSG(cmd)) AssertionError: False is not True : Command 'expr s.reset() Error output: error: expression failed to parse: error: Couldn't lookup symbols: __ZNKSt3__114default_deleteIiEclEPi ' did not return successfully Config=x86_64-/Users/buildslave/jenkins/workspace/lldb-cmake-matrix/clang_502_build/bin/clang ---------------------------------------------------------------------- Ran 4 tests in 9.941s

Hide Details

RESULT: FAILED (0 passes, 2 failures, 0 errors, 2 skipped, 0 expected failures, 0 unexpected successes)

Hide Details

--

Hide Details

******************** PASS: lldb-unit :: Utility/./UtilityTests/StringLexerTest.AdvanceIf (111 of 2359) PASS: lldb-unit :: Utility/./UtilityTests/UriParserTest.SchemeHostSeparator3 (112 of 2359) PASS: lldb-api :: functionalities/data-formatter/data-formatter-stl/libcxx/vbool/TestDataFormatterLibcxxVBool.py (113 of 2359) UNSUPPORTED: lldb-shell :: SymbolFile/DWARF/x86/dwarf5-index-is-used.cpp (114 of 2359) UNSUPPORTED: lldb-api :: commands/watchpoints/hello_watchpoint/TestMyFirstWatchpoint.py (115 of 2359) PASS: lldb-unit :: SymbolFile/DWARF/./SymbolFileDWARFTests/DWARFUnitTest.MissingSentinel (116 of 2359) PASS: lldb-shell :: ObjectFile/ELF/short-build-id.yaml (117 of 2359) PASS: lldb-unit :: Utility/./UtilityTests/RangeTest.ContainsRangeStartingFromZero (118 of 2359) UNSUPPORTED: lldb-shell :: ScriptInterpreter/Lua/breakpoint_callback.test (119 of 2359) PASS: lldb-unit :: Utility/./UtilityTests/XcodeSDKTest.GetSDKTypeForTriple (120 of 2359) PASS: lldb-api :: python_api/disassemble-raw-data/TestDisassembleRawData.py (121 of 2359) PASS: lldb-api :: tools/lldb-server/inferior-crash/TestGdbRemoteAbort.py (122 of 2359) PASS: lldb-api :: commands/source/info/TestSourceInfo.py (123 of 2359) PASS: lldb-unit :: Utility/./UtilityTests/BinaryStreamTest.PutULEB128FiveBytes (124 of 2359) PASS: lldb-unit :: Utility/./UtilityTests/ProcessInstanceInfoMatch.Name (125 of 2359) UNSUPPORTED: lldb-shell :: SymbolFile/NativePDB/break-by-line.cpp (126 of 2359) PASS: lldb-api :: lang/cpp/typedef/TestCppTypedef.py (127 of 2359) PASS: lldb-shell :: ObjectFile/wasm/unified-debug-sections.yaml (128 of 2359) PASS: lldb-unit :: Utility/./UtilityTests/BinaryStreamTest.PutULEB128NineBytes (129 of 2359) PASS: lldb-unit :: Expression/./ExpressionTests/DWARFExpression.DW_OP_stack_value (130 of 2359) PASS: lldb-api :: lang/objc/objc++/TestObjCXX.py (131 of 2359) PASS: lldb-unit :: Symbol/./SymbolTests/TestTypeSystemClang.TestGetBasicTypeFromName (132 of 2359) PASS: lldb-api :: commands/expression/test/TestExprs.py (133 of 2359) PASS: lldb-unit :: UnwindAssembly/x86/./UnwindAssemblyx86Tests/Testx86AssemblyInspectionEngine.TestPushEAX (134 of 2359) PASS: lldb-api :: macosx/debugserver-exit-code/TestDebugServerExitCode.py (135 of 2359) PASS: lldb-unit :: Symbol/./SymbolTests/TestTypeSystemClang.TestDisplayNameEmpty (136 of 2359) PASS: lldb-unit :: Core/./LLDBCoreTests/ModuleSpecTest.TestELFFile (137 of 2359) UNSUPPORTED: lldb-shell :: Register/x86-fp-read.test (138 of 2359) PASS: lldb-shell :: ObjectFile/ELF/section-permissions.yaml (139 of 2359) PASS: lldb-unit :: UnwindAssembly/x86/./UnwindAssemblyx86Tests/Testx86AssemblyInspectionEngine.TestStackRealignMSVC_i386 (140 of 2359) PASS: lldb-unit :: Expression/./ExpressionTests/CppModuleConfigurationTest.AmbiguousLibCpp (141 of 2359) PASS: lldb-api :: commands/expression/save_jit_objects/TestSaveJITObjects.py (142 of 2359) PASS: lldb-unit :: Utility/./UtilityTests/OptionsWithRawTest.ArgsButNoLeadingDash (143 of 2359) PASS: lldb-unit :: Process/gdb-remote/./ProcessGdbRemoteTests/PortMapTest.AllowPort (144 of 2359) PASS: lldb-unit :: Expression/./ExpressionTests/DiagnosticManagerTest.AppendMessageSubsequentDiags (145 of 2359) UNSUPPORTED: lldb-shell :: SymbolFile/DWARF/x86/find-variable-file.cpp (146 of 2359) PASS: lldb-unit :: Host/./HostTests/PipeTest.OpenAsReader (147 of 2359) PASS: lldb-unit :: Core/./LLDBCoreTests/DumpDataExtractorTest.Formats (148 of 2359) PASS: lldb-api :: lang/c/offsetof/TestOffsetof.py (149 of 2359) XFAIL: lldb-shell :: Register/x86-64-fp-write.test (150 of 2359) PASS: lldb-api :: commands/gui/expand-threads-tree/TestGuiExpandThreadsTree.py (151 of 2359) PASS: lldb-unit :: Host/./HostTests/MainLoopTest.DetectsEOF (152 of 2359) PASS: lldb-unit :: Language/Highlighting/./HighlighterTests/HighlighterTest.Keywords (153 of 2359) PASS: lldb-shell :: Reproducer/TestDebugSymbols.test (154 of 2359) PASS: lldb-unit :: Process/gdb-remote/./ProcessGdbRemoteTests/GDBRemoteCommunicationClientTest.GetMemoryRegionInfoInvalidResponse (155 of 2359) PASS: lldb-unit :: Utility/./UtilityTests/UriParserTest.BracketedHostname (156 of 2359) UNSUPPORTED: lldb-api :: functionalities/thread/concurrent_events/TestConcurrentManySignals.py (157 of 2359) UNSUPPORTED: lldb-api :: functionalities/data-formatter/data-formatter-stl/libstdcpp/map/TestDataFormatterStdMap.py (158 of 2359) UNSUPPORTED: lldb-api :: commands/watchpoints/multiple_hits/TestMultipleHits.py (159 of 2359) PASS: lldb-shell :: Commands/command-backtrace-parser-2.test (160 of 2359) PASS: lldb-unit :: UnwindAssembly/x86/./UnwindAssemblyx86Tests/Testx86AssemblyInspectionEngine.TestPopR15 (161 of 2359) PASS: lldb-shell :: Register/x86-64-gp-read.test (162 of 2359) PASS: lldb-unit :: Utility/./UtilityTests/DataExtractorTest.GetBitfield (163 of 2359) PASS: lldb-api :: tools/lldb-server/TestGdbRemoteExpeditedRegisters.py (164 of 2359) PASS: lldb-unit :: UnwindAssembly/x86/./UnwindAssemblyx86Tests/Testx86AssemblyInspectionEngine.TestPushECX (165 of 2359) PASS: lldb-unit :: Utility/./UtilityTests/BinaryStreamTest.PutSLEB128TwoBytes (166 of 2359) PASS: lldb-unit :: Language/Highlighting/./HighlighterTests/HighlighterTest.ClangStringLiterals (167 of 2359) PASS: lldb-shell :: Breakpoint/jit-loader_jitlink_elf.test (168 of 2359) PASS: lldb-api :: functionalities/data-formatter/ptr_ref_typedef/TestPtrRef2Typedef.py (169 of 2359) UNSUPPORTED: lldb-api :: commands/expression/call-restarts/TestCallThatRestarts.py (170 of 2359) PASS: lldb-unit :: Utility/./UtilityTests/CompletionRequest.DuplicateFiltering (171 of 2359) UNSUPPORTED: lldb-api :: functionalities/tail_call_frames/disambiguate_call_site/TestDisambiguateCallSite.py (172 of 2359) UNSUPPORTED: lldb-shell :: SymbolFile/PDB/calling-conventions.test (173 of 2359) PASS: lldb-api :: functionalities/breakpoint/debugbreak/TestDebugBreak.py (174 of 2359) PASS: lldb-unit :: Utility/./UtilityTests/CompletionRequest.ShiftArguments (175 of 2359) PASS: lldb-unit :: ScriptInterpreter/Python/./ScriptInterpreterPythonTests/PythonDataObjectsTest.TestPythonCallableInvoke (176 of 2359) PASS: lldb-api :: functionalities/gdb_remote_client/TestMultiprocess.py (177 of 2359) PASS: lldb-shell :: SymbolFile/DWARF/x86/parallel-indexing-stress.s (178 of 2359) PASS: lldb-unit :: Symbol/./SymbolTests/TestTypeSystemClang.TestGetTypeClassDeclType (179 of 2359) UNSUPPORTED: lldb-api :: functionalities/data-formatter/data-formatter-stl/libstdcpp/vector/TestDataFormatterStdVector.py (180 of 2359) PASS: lldb-shell :: Reproducer/TestGDBRemoteRepro.test (181 of 2359) UNSUPPORTED: lldb-api :: commands/register/register/aarch64_dynamic_regset/TestArm64DynamicRegsets.py (182 of 2359) PASS: lldb-api :: functionalities/breakpoint/inlined_breakpoints/TestInlinedBreakpoints.py (183 of 2359) UNSUPPORTED: lldb-shell :: SymbolFile/NativePDB/function-types-builtins.cpp (184 of 2359) PASS: lldb-unit :: ScriptInterpreter/Python/./ScriptInterpreterPythonTests/PythonDataObjectsTest.TestPythonInteger (185 of 2359) PASS: lldb-unit :: Utility/./UtilityTests/ArchSpecTest.TestParseMachCPUDashSubtypeTripleExtra (186 of 2359) UNSUPPORTED: lldb-api :: benchmarks/libcxxmap/TestBenchmarkLibcxxMap.py (187 of 2359) PASS: lldb-shell :: SymbolFile/DWARF/clang-ast-from-dwarf-unamed-and-anon-structs.cpp (188 of 2359) UNSUPPORTED: lldb-api :: functionalities/tail_call_frames/disambiguate_tail_call_seq/TestDisambiguateTailCallSeq.py (189 of 2359) PASS: lldb-api :: commands/apropos/with-process/TestAproposWithProcess.py (190 of 2359) PASS: lldb-unit :: SymbolFile/DWARF/./SymbolFileDWARFTests/XcodeSDKModuleTests.TestModuleGetXcodeSDK (191 of 2359) PASS: lldb-shell :: Breakpoint/split-dwarf-5-addrbase.test (192 of 2359) PASS: lldb-api :: functionalities/optimized_code/TestNoASanExceptionAfterEvalOP_piece.py (193 of 2359) PASS: lldb-unit :: SymbolFile/DWARF/./SymbolFileDWARFTests/SymbolFileDWARFTests.TestAbbrevInvalidNULLTag (194 of 2359) PASS: lldb-shell :: ObjectFile/ELF/avr-basic-info.yaml (195 of 2359) PASS: lldb-unit :: Language/CPlusPlus/./LanguageCPlusPlusTests/CPlusPlusLanguage.ExtractContextAndIdentifier (196 of 2359) UNSUPPORTED: lldb-shell :: SymbolFile/dissassemble-entry-point.s (197 of 2359) PASS: lldb-api :: lang/cpp/covariant-return-types/TestCovariantReturnTypes.py (198 of 2359) PASS: lldb-shell :: SymbolFile/DWARF/x86/find-qualified-variable.cpp (199 of 2359) UNSUPPORTED: lldb-api :: benchmarks/expression/TestRepeatedExprs.py (200 of 2359) PASS: lldb-unit :: Utility/./UtilityTests/RangeTest.ContainsAddr (201 of 2359) PASS: lldb-api :: commands/target/modules/search-paths/insert/TestTargetModulesSearchpathsInsert.py (202 of 2359) PASS: lldb-unit :: Utility/./UtilityTests/Flags.GetBitSize (203 of 2359) PASS: lldb-unit :: Host/./HostTests/NativeProcessProtocolTest.SetBreakpointFailWrite (204 of 2359) UNSUPPORTED: lldb-api :: functionalities/tail_call_frames/cross_object/TestCrossObjectTailCalls.py (205 of 2359) PASS: lldb-api :: lang/cpp/stl/TestStdCXXDisassembly.py (206 of 2359) PASS: lldb-api :: commands/platform/file/read/TestPlatformFileRead.py (207 of 2359) PASS: lldb-unit :: Utility/./UtilityTests/StringExtractorTest.GetHexBytesAvail_OddPair (208 of 2359) UNSUPPORTED: lldb-api :: python_api/watchpoint/condition/TestWatchpointConditionAPI.py (209 of 2359) PASS: lldb-unit :: Host/./HostTests/MainLoopTest.TerminatesImmediately (210 of 2359) PASS: lldb-unit :: Utility/./UtilityTests/StreamTest.ShiftOperatorStrings (211 of 2359) PASS: lldb-shell :: ObjectFile/ELF/section-overlap.yaml (212 of 2359) PASS: lldb-api :: functionalities/breakpoint/breakpoint_conditions/TestBreakpointConditions.py (213 of 2359) PASS: lldb-unit :: Symbol/./SymbolTests/TestTypeSystemClang.AddMethodToObjCObjectType (214 of 2359) PASS: lldb-unit :: Utility/./UtilityTests/OptionsWithRawTest.EmptySuffix (215 of 2359) PASS: lldb-api :: commands/frame/diagnose/virtual-method-call/TestDiagnoseDereferenceVirtualMethodCall.py (216 of 2359) PASS: lldb-unit :: Utility/./UtilityTests/RangeTest.LessThanInvalid (217 of 2359) PASS: lldb-unit :: Utility/./UtilityTests/UriParserTest.LongPath (218 of 2359) PASS: lldb-unit :: Utility/./UtilityTests/StringListTest.ShiftStdString (219 of 2359) PASS: lldb-unit :: Interpreter/./InterpreterTests/OptionArgParserTest.toChar (220 of 2359) PASS: lldb-api :: functionalities/gdb_remote_client/TestGDBRemoteDiskFileCompletion.py (221 of 2359) PASS: lldb-api :: lang/objc/variadic_methods/TestVariadicMethods.py (222 of 2359) UNSUPPORTED: lldb-api :: lang/objc/modules-update/TestClangModulesUpdate.py (223 of 2359) PASS: lldb-api :: functionalities/data-formatter/data-formatter-ptr-to-array/TestPtrToArrayFormatting.py (224 of 2359) PASS: lldb-unit :: UnwindAssembly/x86/./UnwindAssemblyx86Tests/Testx86AssemblyInspectionEngine.TestStackRealign8BitDisp_i386 (225 of 2359) PASS: lldb-unit :: Utility/./UtilityTests/StringListTest.ShiftCString (226 of 2359) PASS: lldb-unit :: Utility/./UtilityTests/OptionsWithRawTest.SingleWordSuffix (227 of 2359) PASS: lldb-unit :: Symbol/./SymbolTests/TestTypeSystemClang.GetExeModuleWhenMissingSymbolFile (228 of 2359) PASS: lldb-api :: functionalities/data-formatter/data-formatter-stl/libcxx/atomic/TestLibCxxAtomic.py (229 of 2359) PASS: lldb-unit :: Expression/./ExpressionTests/CppModuleConfigurationTest.UnknownLibCppFile (230 of 2359) UNSUPPORTED: lldb-api :: functionalities/unwind/standard/TestStandardUnwind.py (231 of 2359) PASS: lldb-unit :: Process/gdb-remote/./ProcessGdbRemoteTests/GDBRemoteCommunicationClientTest.WriteRegister (232 of 2359) PASS: lldb-api :: functionalities/breakpoint/objc/TestObjCBreakpoints.py (233 of 2359) PASS: lldb-api :: commands/target/auto-install-main-executable/TestAutoInstallMainExecutable.py (234 of 2359) PASS: lldb-shell :: ObjectFile/ELF/gnu-debuglink.yaml (235 of 2359) PASS: lldb-api :: functionalities/unwind/noreturn/module-end/TestNoReturnModuleEnd.py (236 of 2359) PASS: lldb-unit :: Language/Highlighting/./HighlighterTests/HighlighterTest.DefaultHighlighterWithCursor (237 of 2359) PASS: lldb-shell :: Settings/TestFrameFormatColor.test (238 of 2359) PASS: lldb-unit :: Utility/./UtilityTests/TimerTest.CategoryTimesStats (239 of 2359) PASS: lldb-api :: lang/cpp/symbols/TestSymbols.py (240 of 2359) PASS: lldb-api :: commands/gui/breakpoints/TestGuiBreakpoints.py (241 of 2359) PASS: lldb-unit :: Utility/./UtilityTests/NameMatchesTest.Contains (242 of 2359) PASS: lldb-unit :: UnwindAssembly/x86/./UnwindAssemblyx86Tests/Testx86AssemblyInspectionEngine.TestStackRealign32BitDisp_x86_64 (243 of 2359) PASS: lldb-api :: commands/expression/diagnostics/TestExprDiagnostics.py (244 of 2359) PASS: lldb-unit :: Utility/./UtilityTests/GeneratorTest.Get (245 of 2359) PASS: lldb-unit :: Utility/./UtilityTests/StringListTest.CopyList (246 of 2359) UNSUPPORTED: lldb-api :: lang/objc/rdar-12408181/TestRdar12408181.py (247 of 2359) PASS: lldb-api :: commands/expression/regression-access-function-template-in-record/TestRegressionAccessFunctionTemplateInRecord.py (248 of 2359) PASS: lldb-unit :: Utility/./UtilityTests/StringListTest.RemoveBlankLines (249 of 2359) UNSUPPORTED: lldb-shell :: ScriptInterpreter/Lua/print.test (250 of 2359) PASS: lldb-unit :: Core/./LLDBCoreTests/DumpDataExtractorTest.BaseAddress (251 of 2359) PASS: lldb-unit :: Utility/./UtilityTests/ArgsTest.TestSingleArgWithQuotedSpace (252 of 2359) PASS: lldb-unit :: Core/./LLDBCoreTests/FormatEntityTest.DefinitionConstructionNameAndString (253 of 2359) PASS: lldb-api :: functionalities/data-formatter/data-formatter-cpp/TestDataFormatterCpp.py (254 of 2359) PASS: lldb-api :: functionalities/data-formatter/data-formatter-synth/TestDataFormatterSynth.py (255 of 2359) PASS: lldb-shell :: ScriptInterpreter/Python/Crashlog/parser_text.test (256 of 2359) PASS: lldb-unit :: Utility/./UtilityTests/ConstStringTest.format_provider (257 of 2359) PASS: lldb-unit :: Host/./HostTests/FileSystemTest.GetByteSize (258 of 2359) UNSUPPORTED: lldb-shell :: ScriptInterpreter/Lua/persistent_state.test (259 of 2359) PASS: lldb-unit :: Host/./HostTests/NativeProcessProtocolTest.ReadCStringFromMemory_CrossPageBoundary (260 of 2359) PASS: lldb-api :: functionalities/breakpoint/breakpoint_names/TestBreakpointNames.py (261 of 2359) PASS: lldb-api :: lang/c/set_values/TestSetValues.py (262 of 2359) PASS: lldb-unit :: DataFormatter/./LLDBFormatterTests/TypeMatcherTests.RegexName (263 of 2359) PASS: lldb-unit :: Process/Utility/./ProcessUtilityTests/MemoryTagManagerAArch64MTETest.UnpackTagsData (264 of 2359) PASS: lldb-unit :: SymbolFile/DWARF/./SymbolFileDWARFTests/SymbolFileDWARFTests.ParseArangesSkipErrors (265 of 2359) PASS: lldb-api :: lang/objc/objc-runtime-ivars/TestRuntimeIvars.py (266 of 2359) PASS: lldb-unit :: Process/gdb-remote/./ProcessGdbRemoteTests/GDBRemoteCommunicationClientTest.GetModulesInfoInvalidResponse (267 of 2359) PASS: lldb-unit :: Utility/./UtilityTests/LogTest.Register (268 of 2359) UNSUPPORTED: lldb-api :: lang/cpp/trivial_abi/TestTrivialABI.py (269 of 2359) UNSUPPORTED: lldb-api :: functionalities/ubsan/user-expression/TestUbsanUserExpression.py (270 of 2359) PASS: lldb-api :: commands/help/TestHelp.py (271 of 2359) PASS: lldb-shell :: ObjectFile/ELF/netbsd-core-amd64.test (272 of 2359) PASS: lldb-api :: lang/objc/blocks/TestObjCIvarsInBlocks.py (273 of 2359) PASS: lldb-shell :: SymbolFile/DWARF/x86/debug_loc_and_loclists.s (274 of 2359) PASS: lldb-api :: lang/objc/objc-new-syntax/TestObjCNewSyntaxArray.py (275 of 2359) PASS: lldb-unit :: ScriptInterpreter/Python/./ScriptInterpreterPythonTests/PythonDataObjectsTest.TestPythonDictionaryToStructuredDictionary (276 of 2359) PASS: lldb-api :: commands/expression/context-object/TestContextObject.py (277 of 2359) PASS: lldb-unit :: Target/./TargetTests/ExecutionContextTest.GetByteOrderTarget (278 of 2359) PASS: lldb-shell :: ObjectFile/PECOFF/basic-info-arm64.yaml (279 of 2359) PASS: lldb-api :: lang/objc/objc-optimized/TestObjcOptimized.py (280 of 2359) PASS: lldb-api :: functionalities/data-formatter/data-formatter-stl/libcxx/optional/TestDataFormatterLibcxxOptional.py (281 of 2359) PASS: lldb-unit :: Utility/./UtilityTests/UriParserTest.SchemeHostSeparator2 (282 of 2359) PASS: lldb-unit :: Utility/./UtilityTests/UUIDTest.RelationalOperators (283 of 2359) PASS: lldb-api :: commands/expression/static-initializers/TestStaticInitializers.py (284 of 2359) PASS: lldb-api :: lang/objc/objc-super/TestObjCSuper.py (285 of 2359) PASS: lldb-unit :: Process/gdb-remote/./ProcessGdbRemoteTests/GDBRemoteCommunicationServerTest.SendErrorResponse_Status (286 of 2359) UNSUPPORTED: lldb-api :: functionalities/tsan/multiple/TestTsanMultiple.py (287 of 2359) PASS: lldb-api :: lang/c/global_variables/TestGlobalVariables.py (288 of 2359) PASS: lldb-api :: lang/objc/foundation/TestObjCMethodsNSArray.py (289 of 2359) PASS: lldb-api :: functionalities/data-formatter/data-formatter-synthval/TestDataFormatterSynthVal.py (290 of 2359) PASS: lldb-unit :: Utility/./UtilityTests/ScalarTest.Scalar_512 (291 of 2359) PASS: lldb-unit :: Utility/./UtilityTests/VMRange.ContainsRange (292 of 2359) PASS: lldb-api :: functionalities/thread/thread_exit/TestThreadExit.py (293 of 2359) PASS: lldb-api :: functionalities/dynamic_value_child_count/TestDynamicValueChildCount.py (294 of 2359) PASS: lldb-shell :: SymbolFile/DWARF/x86/apple-index-is-used.cpp (295 of 2359) UNSUPPORTED: lldb-api :: commands/watchpoints/step_over_watchpoint/TestStepOverWatchpoint.py (296 of 2359) PASS: lldb-api :: macosx/skinny-corefile/TestSkinnyCorefile.py (297 of 2359) PASS: lldb-unit :: Utility/./UtilityTests/BinaryStreamTest.PutULEB128SevenBytes (298 of 2359) PASS: lldb-api :: python_api/formatters/TestFormattersSBAPI.py (299 of 2359) PASS: lldb-unit :: Utility/./UtilityTests/ListenerTest.GetEventImmediate (300 of 2359) UNSUPPORTED: lldb-api :: functionalities/thread/concurrent_events/TestConcurrentManyWatchpoints.py (301 of 2359) PASS: lldb-unit :: tools/lldb-server/tests/./LLDBServerTests/TestBase.DebugserverEnv (302 of 2359) PASS: lldb-unit :: ObjectFile/Breakpad/./ObjectFileBreakpadTests/Record.classify (303 of 2359) PASS: lldb-unit :: Host/./HostTests/FileSystemTest.EmptyTest (304 of 2359) PASS: lldb-unit :: Expression/./ExpressionTests/DWARFExpression.DW_OP_convert (305 of 2359) PASS: lldb-unit :: ScriptInterpreter/Python/./ScriptInterpreterPythonTests/PythonDataObjectsTest.TestPythonTupleSize (306 of 2359) PASS: lldb-unit :: Host/./HostTests/SocketAddressTest.Set (307 of 2359) UNSUPPORTED: lldb-shell :: Breakpoint/case-insensitive.test (308 of 2359) UNSUPPORTED: lldb-api :: functionalities/tsan/global_location/TestTsanGlobalLocation.py (309 of 2359) PASS: lldb-unit :: ScriptInterpreter/Python/./ScriptInterpreterPythonTests/PythonDataObjectsTest.TestPythonFile (310 of 2359) PASS: lldb-api :: commands/settings/quoting/TestQuoting.py (311 of 2359) PASS: lldb-api :: functionalities/data-formatter/data-formatter-objc/cmtime/TestDataFormatterCMTime.py (312 of 2359) PASS: lldb-unit :: Host/./HostTests/SocketTests/SocketTest.DecodeHostAndPort/ipv4 (313 of 2359) PASS: lldb-unit :: Utility/./UtilityTests/DataExtractorTest.GetCStrUnterminated (314 of 2359) PASS: lldb-api :: functionalities/breakpoint/breakpoint_command/TestRegexpBreakCommand.py (315 of 2359) PASS: lldb-unit :: Utility/./UtilityTests/SerializationRountripTest.SerializeDeserializePodReferences (316 of 2359) UNSUPPORTED: lldb-api :: functionalities/breakpoint/hardware_breakpoints/write_memory_with_hw_breakpoint/TestWriteMemoryWithHWBreakpoint.py (317 of 2359) PASS: lldb-api :: commands/breakpoint/set/func-regex/TestBreakpointRegexError.py (318 of 2359) PASS: lldb-api :: commands/expression/codegen-crash-import-def-arraytype-element/TestImportDefinitionArrayType.py (319 of 2359) UNSUPPORTED: lldb-api :: functionalities/tail_call_frames/ambiguous_tail_call_seq1/TestAmbiguousTailCallSeq1.py (320 of 2359) PASS: lldb-shell :: SymbolFile/DWARF/x86/DW_AT_low_pc-addrx.s (321 of 2359) PASS: lldb-shell :: Breakpoint/split-dwarf5-debug-stroffsets.test (322 of 2359) PASS: lldb-api :: commands/register/register/register_command/TestRegisters.py (323 of 2359) UNSUPPORTED: lldb-shell :: Unwind/eh-frame-augment-noop.test (324 of 2359) PASS: lldb-api :: lang/objc/objc-stepping/TestObjCStepping.py (325 of 2359) PASS: lldb-unit :: Utility/./UtilityTests/DataExtractorTest.GetCStrAtEnd (326 of 2359) PASS: lldb-api :: functionalities/thread/concurrent_events/TestConcurrentTwoBreakpointThreads.py (327 of 2359) PASS: lldb-api :: lang/cpp/scope/TestCppScope.py (328 of 2359) PASS: lldb-api :: functionalities/unwind/sigtramp/TestSigtrampUnwind.py (329 of 2359) PASS: lldb-shell :: SymbolFile/DWARF/x86/static_scope.s (330 of 2359) PASS: lldb-unit :: Utility/./UtilityTests/RangeTest.SizeTypes (331 of 2359) PASS: lldb-api :: functionalities/breakpoint/breakpoint_hit_count/TestBreakpointHitCount.py (332 of 2359) PASS: lldb-api :: functionalities/lazy-loading/TestLazyLoading.py (333 of 2359) PASS: lldb-unit :: Process/minidump/./LLDBMinidumpTests/RegisterContextMinidump.CheckRegisterContextMinidump_ARM (334 of 2359) PASS: lldb-unit :: Utility/./UtilityTests/StringExtractorTest.GetHexBytes (335 of 2359) PASS: lldb-shell :: Register/Core/x86-32-freebsd-addr.test (336 of 2359) PASS: lldb-unit :: Utility/./UtilityTests/ArgsTest.EscapeLLDBCommandArgument (337 of 2359) PASS: lldb-api :: functionalities/data-formatter/nssetsynth/TestNSSetSynthetic.py (338 of 2359) PASS: lldb-api :: functionalities/data-formatter/data-formatter-stl/libstdcpp/unique_ptr/invalid/TestDataFormatterInvalidStdUniquePtr.py (339 of 2359) PASS: lldb-unit :: Utility/./UtilityTests/ScalarTest.Getters (340 of 2359) PASS: lldb-unit :: Utility/./UtilityTests/StringExtractorTest.DecodeHexU8_Extra (341 of 2359) UNSUPPORTED: lldb-shell :: Register/x86-64-zmm-write.test (342 of 2359) PASS: lldb-shell :: SymbolFile/DWARF/DW_AT_range-DW_FORM_sec_offset.s (343 of 2359) PASS: lldb-shell :: Commands/command-image-lookup.yaml (344 of 2359) PASS: lldb-api :: commands/expression/timeout/TestCallWithTimeout.py (345 of 2359) UNSUPPORTED: lldb-shell :: ObjectFile/PECOFF/disassemble-thumb.yaml (346 of 2359) UNSUPPORTED: lldb-shell :: SymbolFile/DWARF/x86/find-method.cpp (347 of 2359) PASS: lldb-unit :: Host/./HostTests/SocketTests/SocketTest.UDPGetConnectURI/ipv4 (348 of 2359) PASS: lldb-unit :: Utility/./UtilityTests/BinaryStreamTest.PutULEB128OneByte (349 of 2359) PASS: lldb-unit :: Editline/./EditlineTests/EditlineTestFixture.EditlineReceivesMultiLineText (350 of 2359) PASS: lldb-shell :: SymbolFile/DWARF/deterministic-build.cpp (351 of 2359) PASS: lldb-api :: lang/objc/global_ptrs/TestGlobalObjects.py (352 of 2359) PASS: lldb-api :: commands/expression/import-std-module/non-module-type-separation/TestNonModuleTypeSeparation.py (353 of 2359) PASS: lldb-shell :: Minidump/no-process-id.yaml (354 of 2359) PASS: lldb-unit :: ObjectFile/Breakpad/./ObjectFileBreakpadTests/InfoRecord.parse (355 of 2359) PASS: lldb-api :: lang/cpp/enum_types/TestCPP11EnumTypes.py (356 of 2359) PASS: lldb-api :: tools/lldb-vscode/step/TestVSCode_step.py (357 of 2359) PASS: lldb-shell :: ScriptInterpreter/Python/fail_breakpoint_oneline.test (358 of 2359) PASS: lldb-unit :: Host/./HostTests/SocketTests/SocketTest.TCPListen0ConnectAccept/ipv6 (359 of 2359) PASS: lldb-api :: lang/objc/objc-new-syntax/TestObjCNewSyntaxLiteral.py (360 of 2359) PASS: lldb-unit :: Symbol/./SymbolTests/TestTypeSystemClang.TestIsClangType (361 of 2359) PASS: lldb-shell :: SymbolFile/DWARF/x86/gnu-style-compression.cpp (362 of 2359) PASS: lldb-api :: functionalities/data-formatter/data-formatter-enum-format/TestDataFormatterEnumFormat.py (363 of 2359) UNSUPPORTED: lldb-shell :: Register/x86-64-zmm-read.test (364 of 2359) PASS: lldb-api :: types/TestCharTypeExpr.py (365 of 2359) UNSUPPORTED: lldb-shell :: ScriptInterpreter/Lua/convenience_variables.test (366 of 2359) PASS: lldb-unit :: Expression/./ExpressionTests/DiagnosticManagerTest.GetStringNoDiags (367 of 2359) PASS: lldb-shell :: Quit/TestQuitExitCode30.test (368 of 2359) PASS: lldb-api :: functionalities/target_var/no_vars/TestTargetVarNoVars.py (369 of 2359) PASS: lldb-unit :: SymbolFile/DWARF/./SymbolFileDWARFTests/SymbolFileDWARFTests.TestAbilitiesForDWARF (370 of 2359) PASS: lldb-unit :: Utility/./UtilityTests/RecordReplayTest.InvalidSequence (371 of 2359) PASS: lldb-api :: lang/cpp/dynamic-value-same-basename/TestDynamicValueSameBase.py (372 of 2359) UNSUPPORTED: lldb-api :: linux/aarch64/mte_tag_access/TestAArch64LinuxMTEMemoryTagAccess.py (373 of 2359) UNSUPPORTED: lldb-api :: functionalities/thread/break_after_join/TestBreakAfterJoin.py (374 of 2359) PASS: lldb-unit :: Utility/./UtilityTests/EnvironmentTest.EnvpConversion (375 of 2359) PASS: lldb-shell :: Register/Core/x86-64-freebsd-addr.test (376 of 2359) PASS: lldb-unit :: Utility/./UtilityTests/RecordReplayTest.InstrumentedBarRef (377 of 2359) PASS: lldb-unit :: Utility/./UtilityTests/ConstStringTest.CompareStringRef (378 of 2359) PASS: lldb-api :: functionalities/stop-on-sharedlibrary-load/TestStopOnSharedlibraryEvents.py (379 of 2359) PASS: lldb-api :: lang/objc/ivar-IMP/TestObjCiVarIMP.py (380 of 2359) PASS: lldb-api :: commands/command/script/TestCommandScript.py (381 of 2359) PASS: lldb-unit :: Host/./HostTests/HostInfoTest.GetAugmentedArchSpec (382 of 2359) UNSUPPORTED: lldb-shell :: Register/x86-64-ymm16-write.test (383 of 2359) PASS: lldb-api :: functionalities/gdb_remote_client/TestqOffsets.py (384 of 2359) PASS: lldb-shell :: Commands/command-stop-hook-output.test (385 of 2359) UNSUPPORTED: lldb-api :: functionalities/thread/concurrent_events/TestConcurrentDelaySignalWatch.py (386 of 2359) PASS: lldb-api :: commands/expression/anonymous-struct/TestCallUserAnonTypedef.py (387 of 2359) PASS: lldb-shell :: ObjectFile/PECOFF/basic-info-arm.yaml (388 of 2359) PASS: lldb-api :: functionalities/data-formatter/frameformat_smallstruct/TestFrameFormatSmallStruct.py (389 of 2359) PASS: lldb-unit :: Symbol/./SymbolTests/PostfixExpression.ToDWARF (390 of 2359) PASS: lldb-api :: functionalities/memory-region/TestMemoryRegion.py (391 of 2359) PASS: lldb-shell :: Commands/command-backtrace-parser-1.test (392 of 2359) UNSUPPORTED: lldb-api :: commands/expression/namespace_local_var_same_name_obj_c/TestNamespaceLocalVarSameNameObjC.py (393 of 2359) PASS: lldb-api :: functionalities/data-formatter/data-formatter-stl/libcxx/vector/TestDataFormatterLibcxxVector.py (394 of 2359) PASS: lldb-api :: functionalities/inline-stepping/TestInlineStepping.py (395 of 2359) PASS: lldb-unit :: Utility/./UtilityTests/CompletionRequest.TestCompletionOwnership (396 of 2359) UNSUPPORTED: lldb-api :: tools/lldb-vscode/disconnect/TestVSCode_disconnect.py (397 of 2359) UNSUPPORTED: lldb-shell :: ExecControl/StopHook/stop-hook-threads.test (398 of 2359) UNSUPPORTED: lldb-api :: tools/lldb-server/libraries-svr4/TestGdbRemoteLibrariesSvr4Support.py (399 of 2359) PASS: lldb-unit :: Utility/./UtilityTests/PassiveReplayTest.InstrumentedBar (400 of 2359) PASS: lldb-unit :: Platform/./LLDBPlatformTests/PlatformDarwinTest.TestParseVersionBuildDir (401 of 2359) PASS: lldb-api :: commands/expression/top-level/TestTopLevelExprs.py (402 of 2359) PASS: lldb-shell :: SymbolFile/DWARF/x86/split-dwarf-multiple-cu.ll (403 of 2359) PASS: lldb-api :: lang/objc/warnings-in-expr-parser/TestObjCWarningsInExprParser.py (404 of 2359) PASS: lldb-unit :: Utility/./UtilityTests/StringExtractorTest.GetNameColonValueSuccess (405 of 2359) UNSUPPORTED: lldb-api :: functionalities/data-formatter/data-formatter-stl/libstdcpp/string/TestDataFormatterStdString.py (406 of 2359) PASS: lldb-unit :: Utility/./UtilityTests/StringExtractorTest.GetHexBytes_FullString (407 of 2359) PASS: lldb-unit :: Utility/./UtilityTests/ArgsTest.ReplaceArgumentAtIndexLonger (408 of 2359) PASS: lldb-api :: lang/objc/objc-class-method/TestObjCClassMethod.py (409 of 2359) PASS: lldb-api :: commands/expression/import-std-module/iterator/TestIteratorFromStdModule.py (410 of 2359) PASS: lldb-unit :: Symbol/./SymbolTests/Type.GetTypeScopeAndBasename (411 of 2359) PASS: lldb-unit :: Utility/./UtilityTests/StreamTeeTest.DefaultConstructor (412 of 2359) PASS: lldb-api :: commands/command/nested_alias/TestNestedAlias.py (413 of 2359) PASS: lldb-api :: lang/cpp/diamond/TestDiamond.py (414 of 2359) PASS: lldb-unit :: Signals/./SignalsTests/UnixSignalsTest.VersionChange (415 of 2359) UNSUPPORTED: lldb-shell :: SymbolFile/PDB/func-symbols.test (416 of 2359) PASS: lldb-api :: commands/expression/scoped_enums/TestScopedEnumType.py (417 of 2359) UNSUPPORTED: lldb-shell :: SymbolFile/DWARF/x86/dir-separator-posix.s (418 of 2359) PASS: lldb-api :: functionalities/breakpoint/breakpoint_language/TestBreakpointLanguage.py (419 of 2359) PASS: lldb-unit :: Utility/./UtilityTests/TimerTest.CategoryTimes (420 of 2359) PASS: lldb-unit :: Target/./TargetTests/ExecutionContextTest.GetByteOrder (421 of 2359) PASS: lldb-api :: lang/objc/modules-cache/TestClangModulesCache.py (422 of 2359) PASS: lldb-api :: macosx/function-starts/TestFunctionStarts.py (423 of 2359) PASS: lldb-shell :: Commands/command-thread-select.test (424 of 2359) PASS: lldb-unit :: Utility/./UtilityTests/StringListTest.ForRangeEmpty (425 of 2359) PASS: lldb-api :: sanity/TestSettingSkipping.py (426 of 2359) PASS: lldb-unit :: Utility/./UtilityTests/BinaryStreamTest.PutSLEB128EightBytes (427 of 2359) PASS: lldb-unit :: Symbol/./SymbolTests/TestTypeSystemClang.TestOwningModule (428 of 2359) PASS: lldb-api :: commands/expression/import-std-module/array/TestArrayFromStdModule.py (429 of 2359) PASS: lldb-unit :: ScriptInterpreter/Python/./ScriptInterpreterPythonTests/PythonDataObjectsTest.TestGlobalNameResolutionWithDot (430 of 2359) PASS: lldb-unit :: Utility/./UtilityTests/SharedCluster.ClusterManager (431 of 2359) PASS: lldb-api :: commands/expression/completion-in-lambda-and-unnamed-class/TestCompletionInLambdaAndUnnamedClass.py (432 of 2359) PASS: lldb-api :: linux/builtin_trap/TestBuiltinTrap.py (433 of 2359) UNSUPPORTED: lldb-api :: lang/c/vla/TestVLA.py (434 of 2359) PASS: lldb-unit :: ObjectFile/Breakpad/./ObjectFileBreakpadTests/FileRecord.parse (435 of 2359) PASS: lldb-shell :: SymbolFile/DWARF/x86/dwarf5-debug_line-file-index.s (436 of 2359) PASS: lldb-unit :: Utility/./UtilityTests/NameMatchesTest.StartsWith (437 of 2359) PASS: lldb-shell :: ScriptInterpreter/Python/Crashlog/json.test (438 of 2359) PASS: lldb-unit :: Language/Highlighting/./HighlighterTests/HighlighterTest.ClangPreserveNewLine (439 of 2359) UNSUPPORTED: lldb-shell :: ObjectFile/ELF/basic-info.yaml (440 of 2359) UNSUPPORTED: lldb-api :: functionalities/thread/concurrent_events/TestConcurrentTwoWatchpointsOneDelayBreakpoint.py (441 of 2359) PASS: lldb-shell :: ObjectFile/ELF/section-types-edgecases.yaml (442 of 2359) PASS: lldb-unit :: Utility/./UtilityTests/RangeTest.Equal (443 of 2359) UNSUPPORTED: lldb-api :: commands/watchpoints/watchpoint_commands/condition/TestWatchpointConditionCmd.py (444 of 2359) PASS: lldb-api :: python_api/exprpath_synthetic/TestExprPathSynthetic.py (445 of 2359) PASS: lldb-api :: functionalities/data-formatter/data-formatter-stl/libcxx/shared_ptr/TestDataFormatterLibcxxSharedPtr.py (446 of 2359) UNSUPPORTED: lldb-api :: benchmarks/frame_variable/TestFrameVariableResponse.py (447 of 2359) PASS: lldb-unit :: ScriptInterpreter/Python/./ScriptInterpreterPythonTests/PythonDataObjectsTest.TestGlobalNameResolutionNoDot (448 of 2359) UNSUPPORTED: lldb-api :: tools/lldb-vscode/completions/TestVSCode_completions.py (449 of 2359) PASS: lldb-unit :: Utility/./UtilityTests/FileSpecTest.FileAndDirectoryComponents (450 of 2359) PASS: lldb-unit :: Utility/./UtilityTests/StringListTest.ForRange (451 of 2359) PASS: lldb-shell :: SymbolFile/Breakpad/stack-cfi-parsing.test (452 of 2359) PASS: lldb-unit :: UnwindAssembly/x86/./UnwindAssemblyx86Tests/Testx86AssemblyInspectionEngine.TestPushRBX (453 of 2359) PASS: lldb-unit :: Utility/./UtilityTests/UriParserTest.MinimalPort (454 of 2359) PASS: lldb-shell :: Settings/TestDisableColor.test (455 of 2359) PASS: lldb-unit :: Utility/./UtilityTests/Flags.IsClear (456 of 2359) PASS: lldb-unit :: Utility/./UtilityTests/StringExtractorTest.GetU32LittleEndian (457 of 2359) UNSUPPORTED: lldb-shell :: ScriptInterpreter/Lua/fail_breakpoint_oneline.test (458 of 2359) PASS: lldb-api :: lang/c/shared_lib/TestSharedLib.py (459 of 2359) PASS: lldb-shell :: Commands/CommandScriptImmediateOutput/CommandScriptImmediateOutputConsole.test (460 of 2359) PASS: lldb-api :: functionalities/data-formatter/data-formatter-named-summaries/TestDataFormatterNamedSummaries.py (461 of 2359) PASS: lldb-unit :: Utility/./UtilityTests/NameMatchesTest.EndsWith (462 of 2359) PASS: lldb-api :: commands/expression/import-std-module/forward_list/TestForwardListFromStdModule.py (463 of 2359) PASS: lldb-unit :: Expression/./ExpressionTests/DWARFExpression.DW_OP_piece (464 of 2359) PASS: lldb-unit :: ScriptInterpreter/Python/./ScriptInterpreterPythonTests/PythonDataObjectsTest.TestModuleNameResolutionNoDot (465 of 2359) UNSUPPORTED: lldb-api :: linux/mix-dwo-and-regular-objects/TestMixedDwarfBinary.py (466 of 2359) PASS: lldb-unit :: ScriptInterpreter/Python/./ScriptInterpreterPythonTests/PythonDataObjectsTest.TestRun (467 of 2359) PASS: lldb-shell :: Reproducer/Functionalities/TestDataFormatter.test (468 of 2359) UNSUPPORTED: lldb-api :: commands/expression/import_builtin_fileid/TestImportBuiltinFileID.py (469 of 2359) UNSUPPORTED: lldb-shell :: SymbolFile/NativePDB/nested-types.cpp (470 of 2359) UNSUPPORTED: lldb-shell :: SymbolFile/target-symbols-add-unwind.test (471 of 2359) PASS: lldb-unit :: Utility/./UtilityTests/ProcessInstanceInfo.DumpTable (472 of 2359) PASS: lldb-api :: tools/lldb-server/TestGdbRemoteKill.py (473 of 2359) PASS: lldb-unit :: Utility/./UtilityTests/RangeVector.CombineConsecutiveRanges (474 of 2359) PASS: lldb-api :: lang/cpp/nsimport/TestCppNsImport.py (475 of 2359) PASS: lldb-api :: python_api/default-constructor/TestDefaultConstructorForAPIObjects.py (476 of 2359) PASS: lldb-unit :: Utility/./UtilityTests/FileSpecTest.EqualSeparator (477 of 2359) UNSUPPORTED: lldb-api :: commands/trace/multiple-threads/TestTraceStartStopMultipleThreads.py (478 of 2359) PASS: lldb-api :: functionalities/data-formatter/data-formatter-objc/TestDataFormatterObjCNSBundle.py (479 of 2359) PASS: lldb-api :: commands/command/script/import/rdar-12586188/TestRdar12586188.py (480 of 2359) PASS: lldb-api :: types/TestFloatTypesExpr.py (481 of 2359) UNSUPPORTED: lldb-shell :: SymbolFile/NativePDB/local-variables.cpp (482 of 2359) PASS: lldb-api :: functionalities/step-vrs-interrupt/TestStepVrsInterruptTimeout.py (483 of 2359) PASS: lldb-api :: functionalities/inferior-crashing/TestInferiorCrashingStep.py (484 of 2359) PASS: lldb-unit :: UnwindAssembly/x86/./UnwindAssemblyx86Tests/Testx86AssemblyInspectionEngine.TestSpillRegToStackViaMOVx86_64 (485 of 2359) PASS: lldb-unit :: Language/Highlighting/./HighlighterTests/HighlighterTest.ClangIdentifiers (486 of 2359) PASS: lldb-unit :: Utility/./UtilityTests/StringListTest.CopyListSingle (487 of 2359) PASS: lldb-shell :: SymbolFile/DWARF/x86/debug_ranges.s (488 of 2359) PASS: lldb-unit :: Utility/./UtilityTests/CompletionRequest.Constructor (489 of 2359) PASS: lldb-shell :: Driver/TestFile.test (490 of 2359) PASS: lldb-unit :: Target/./TargetTests/ModuleCacheTest.GetAndPut (491 of 2359) PASS: lldb-api :: functionalities/load_lazy/TestLoadUsingLazyBind.py (492 of 2359) PASS: lldb-api :: commands/statistics/basic/TestStats.py (493 of 2359) PASS: lldb-api :: commands/expression/dollar-in-variable/TestDollarInVariable.py (494 of 2359) PASS: lldb-api :: functionalities/data-formatter/data-formatter-stl/libcxx/iterator/TestDataFormatterLibccIterator.py (495 of 2359) PASS: lldb-api :: lang/cpp/member-and-local-vars-with-same-name/TestMembersAndLocalsWithSameName.py (496 of 2359) PASS: lldb-api :: commands/expression/import-std-module/forward_decl_from_module/TestForwardDeclFromStdModule.py (497 of 2359) UNSUPPORTED: lldb-shell :: SymbolFile/PDB/compilands.test (498 of 2359) PASS: lldb-shell :: SymbolFile/DWARF/x86/DW_AT_location-DW_AT_const_value.s (499 of 2359) PASS: lldb-api :: functionalities/data-formatter/data-formatter-objc/TestDataFormatterObjCPlain.py (500 of 2359) PASS: lldb-unit :: Utility/./UtilityTests/UUIDTest.StringConverion (501 of 2359) PASS: lldb-api :: python_api/function_symbol/TestSymbolAPI.py (502 of 2359) PASS: lldb-api :: python_api/type/TestTypeList.py (503 of 2359) PASS: lldb-api :: tools/lldb-vscode/variables/TestVSCode_variables.py (504 of 2359) PASS: lldb-api :: commands/expression/calculator_mode/TestCalculatorMode.py (505 of 2359) PASS: lldb-unit :: Host/./HostTests/SocketTests/SocketTest.TCPGetConnectURI/ipv6 (506 of 2359) PASS: lldb-unit :: Utility/./UtilityTests/ArchSpecTest.OperatorBool (507 of 2359) PASS: lldb-unit :: Process/minidump/./LLDBMinidumpTests/MinidumpParserTest.GetMiscInfo_no_stream (508 of 2359) PASS: lldb-unit :: Utility/./UtilityTests/LogChannelTest.List (509 of 2359) PASS: lldb-unit :: Language/Highlighting/./HighlighterTests/HighlighterTest.ClangCursorPosInOtherToken (510 of 2359) UNSUPPORTED: lldb-api :: functionalities/thread/concurrent_events/TestConcurrentCrashWithWatchpoint.py (511 of 2359) PASS: lldb-api :: lang/objc/modules-auto-import/TestModulesAutoImport.py (512 of 2359) PASS: lldb-shell :: Settings/TestStopCommandSourceOnError.test (513 of 2359) PASS: lldb-unit :: Utility/./UtilityTests/OptionsWithRawTest.WhitespaceInput (514 of 2359) PASS: lldb-unit :: Utility/./UtilityTests/ScalarTest.ExtractBitfield (515 of 2359) PASS: lldb-unit :: Symbol/./SymbolTests/TestTypeSystemClang.TestGetEnumIntegerTypeUnexpectedType (516 of 2359) PASS: lldb-shell :: Driver/TestSingleQuote.test (517 of 2359) PASS: lldb-unit :: Symbol/./SymbolTests/SymbolsTest.TerminateLocateExecutableSymbolFileForUnknownExecutableAndUnknownSymbolFile (518 of 2359) PASS: lldb-unit :: Language/Highlighting/./HighlighterTests/HighlighterTest.FallbackHighlighter (519 of 2359) PASS: lldb-unit :: Host/./HostTests/FileActionTest.Open (520 of 2359) PASS: lldb-unit :: Expression/./ExpressionTests/DiagnosticManagerTest.PutStringSeverities (521 of 2359) UNSUPPORTED: lldb-shell :: Register/x86-ymm-write.test (522 of 2359) PASS: lldb-unit :: Process/gdb-remote/./ProcessGdbRemoteTests/GDBRemoteClientBaseTest.SendContinueAndWait (523 of 2359) PASS: lldb-shell :: BuildScript/toolchain-clang.test (524 of 2359) PASS: lldb-unit :: Target/./TargetTests/PathMappingListTest.CrossPlatformTests (525 of 2359) PASS: lldb-unit :: Utility/./UtilityTests/StreamTest.AddressSuffix (526 of 2359) PASS: lldb-shell :: ObjectFile/ELF/compressed-sections.yaml (527 of 2359) PASS: lldb-unit :: UnwindAssembly/x86/./UnwindAssemblyx86Tests/Testx86AssemblyInspectionEngine.TestSimplex86_64Augmented (528 of 2359) PASS: lldb-api :: macosx/lc-note/kern-ver-str/TestKernVerStrLCNOTE.py (529 of 2359) PASS: lldb-unit :: Utility/./UtilityTests/StreamTest.AddressPrefix (530 of 2359) PASS: lldb-unit :: Utility/./UtilityTests/ArchSpecTest.MergeFrom (531 of 2359) PASS: lldb-unit :: Utility/./UtilityTests/StringListTest.InsertStringAtIndexMove (532 of 2359) PASS: lldb-api :: commands/expression/ir-interpreter-phi-nodes/TestIRInterpreterPHINodes.py (533 of 2359) PASS: lldb-unit :: Utility/./UtilityTests/SerializationRountripTest.SerializeDeserializeCStringArray (534 of 2359) PASS: lldb-unit :: Symbol/./SymbolTests/TestTypeSystemClang.TestBuiltinTypeForEncodingAndBitSize (535 of 2359) PASS: lldb-unit :: ObjectFile/ELF/./ObjectFileELFTests/ObjectFileELFTest.GetModuleSpecifications_EarlySectionHeaders (536 of 2359) PASS: lldb-api :: lang/cpp/class-template-parameter-pack/TestClassTemplateParameterPack.py (537 of 2359) PASS: lldb-unit :: Utility/./UtilityTests/StringLexerTest.Peek (538 of 2359) PASS: lldb-unit :: Platform/./LLDBPlatformTests/PlatformAppleSimulatorTest.TestSimHasSimEnvionament (539 of 2359) PASS: lldb-api :: functionalities/rerun/TestRerun.py (540 of 2359) PASS: lldb-unit :: Process/minidump/./LLDBMinidumpTests/MinidumpParserTest.GetThreadsAndGetThreadContext (541 of 2359) PASS: lldb-shell :: SymbolFile/DWARF/x86/debug-types-missing-signature.test (542 of 2359) PASS: lldb-api :: lang/c/step-target/TestStepTarget.py (543 of 2359) PASS: lldb-api :: api/listeners/TestListener.py (544 of 2359) PASS: lldb-unit :: UnwindAssembly/x86/./UnwindAssemblyx86Tests/Testx86AssemblyInspectionEngine.Test32bitFramelessSmallStackFrame (545 of 2359) UNSUPPORTED: lldb-api :: tools/lldb-server/registers-target-xml-reading/TestGdbRemoteTargetXmlPacket.py (546 of 2359) PASS: lldb-api :: functionalities/thread/jump/TestThreadJump.py (547 of 2359) PASS: lldb-unit :: ObjectFile/Breakpad/./ObjectFileBreakpadTests/FuncRecord.parse (548 of 2359) PASS: lldb-api :: functionalities/thread/exit_during_step/TestExitDuringStep.py (549 of 2359) PASS: lldb-shell :: Reproducer/TestFileRepro.test (550 of 2359) UNSUPPORTED: lldb-api :: functionalities/tsan/thread_numbers/TestTsanThreadNumbers.py (551 of 2359) UNSUPPORTED: lldb-api :: functionalities/tsan/thread_leak/TestTsanThreadLeak.py (552 of 2359) UNSUPPORTED: lldb-shell :: BuildScript/toolchain-clang-cl.test (553 of 2359) PASS: lldb-unit :: Utility/./UtilityTests/StreamTeeTest.SetStreamAtIndexOverwrite (554 of 2359) PASS: lldb-api :: commands/expression/call-function/TestCallUserDefinedFunction.py (555 of 2359) PASS: lldb-unit :: Utility/./UtilityTests/CompletionRequest.TryCompleteCurrentArgGood (556 of 2359) PASS: lldb-api :: functionalities/thread/backtrace_limit/TestBacktraceLimit.py (557 of 2359) UNSUPPORTED: lldb-api :: commands/register/register/aarch64_sve_registers/rw_access_static_config/TestSVERegisters.py (558 of 2359) PASS: lldb-unit :: Utility/./UtilityTests/LogChannelEnabledTest.LogThread (559 of 2359) PASS: lldb-api :: lang/objc/hidden-ivars/TestHiddenIvars.py (560 of 2359) PASS: lldb-api :: lang/objc/real-definition/TestRealDefinition.py (561 of 2359) PASS: lldb-unit :: Utility/./UtilityTests/StringListTest.JoinMultiCharSeparator (562 of 2359) PASS: lldb-unit :: Utility/./UtilityTests/StreamTest.ShiftOperatorChars (563 of 2359) PASS: lldb-unit :: Utility/./UtilityTests/StringExtractorTest.GetHexBytesAvail_Partial (564 of 2359) PASS: lldb-unit :: Process/Utility/./ProcessUtilityTests/ProcSMapTests/LinuxProcSMapsTestFixture.ParseSMapRegions/3 (565 of 2359) PASS: lldb-unit :: Process/gdb-remote/./ProcessGdbRemoteTests/GDBRemoteCommunicationServerTest.SendErrorResponse_ErrorNumber (566 of 2359) PASS: lldb-api :: lang/objc/foundation/TestObjectDescriptionAPI.py (567 of 2359) PASS: lldb-unit :: Symbol/./SymbolTests/TestTypeSystemClang.TestNotDeletingUserCopyCstrDueToMoveCStr (568 of 2359) PASS: lldb-unit :: UnwindAssembly/x86/./UnwindAssemblyx86Tests/Testx86AssemblyInspectionEngine.TestPush0 (569 of 2359) PASS: lldb-api :: functionalities/show_location/TestShowLocationDwarf5.py (570 of 2359) PASS: lldb-unit :: Expression/./ExpressionTests/CppModuleConfigurationTest.MissingLibCpp (571 of 2359) PASS: lldb-api :: functionalities/breakpoint/source_regexp/TestSourceRegexBreakpoints.py (572 of 2359) PASS: lldb-api :: functionalities/load_using_paths/TestLoadUsingPaths.py (573 of 2359) PASS: lldb-unit :: Language/Highlighting/./HighlighterTests/HighlighterTest.Colons (574 of 2359) UNSUPPORTED: lldb-api :: linux/thread/create_during_instruction_step/TestCreateDuringInstructionStep.py (575 of 2359) PASS: lldb-unit :: Core/./LLDBCoreTests/FormatEntityTest.DefinitionConstructionNameTypeChildren (576 of 2359) PASS: lldb-unit :: Process/minidump/./LLDBMinidumpTests/MinidumpParserTest.MinidumpDuplicateModuleMappedSecondHigh (577 of 2359) PASS: lldb-shell :: SymbolFile/DWARF/x86/debug_loc-aslr.s (578 of 2359) PASS: lldb-api :: functionalities/multidebugger_commands/TestMultipleDebuggersCommands.py (579 of 2359) UNSUPPORTED: lldb-shell :: SymbolFile/DWARF/x86/subprogram_ranges.test (580 of 2359) PASS: lldb-unit :: DataFormatter/./LLDBFormatterTests/StringPrinterTests.CxxASCII (581 of 2359) UNSUPPORTED: lldb-shell :: ScriptInterpreter/Lua/bindings.test (582 of 2359) PASS: lldb-api :: lang/objc/objc_direct-methods/TestObjCDirectMethods.py (583 of 2359) PASS: lldb-unit :: Utility/./UtilityTests/SerializationRountripTest.SerializeDeserializeCStringNull (584 of 2359) PASS: lldb-unit :: Process/minidump/./LLDBMinidumpTests/MinidumpParserTest.GetThreadContext_x86_32 (585 of 2359) UNSUPPORTED: lldb-shell :: SymbolFile/NativePDB/source-list.cpp (586 of 2359) PASS: lldb-shell :: Driver/TestError.test (587 of 2359) PASS: lldb-unit :: debugserver/./debugserverTests/JSON.Parse (588 of 2359) PASS: lldb-api :: functionalities/breakpoint/breakpoint_ignore_count/TestBreakpointIgnoreCount.py (589 of 2359) PASS: lldb-unit :: Utility/./UtilityTests/StringListTest.SplitIntoLinesEmpty (590 of 2359) PASS: lldb-shell :: ObjectFile/wasm/basic.yaml (591 of 2359) PASS: lldb-unit :: Utility/./UtilityTests/BinaryStreamTest.PutSLEB128SixBytes (592 of 2359) PASS: lldb-api :: macosx/thread-names/TestInterruptThreadNames.py (593 of 2359) PASS: lldb-shell :: SymbolFile/Breakpad/line-table.test (594 of 2359) PASS: lldb-shell :: ScriptInterpreter/None/none.test (595 of 2359) PASS: lldb-api :: lang/objcxx/cpp_keywords_enabled/TestObjCppKeywordsEnabled.py (596 of 2359) PASS: lldb-unit :: Utility/./UtilityTests/StreamTest.PutRawBytesToLittleEndian (597 of 2359) PASS: lldb-api :: api/multithreaded/TestMultithreaded.py (598 of 2359) PASS: lldb-api :: functionalities/ptr_refs/TestPtrRefs.py (599 of 2359) PASS: lldb-api :: lang/c/stepping/TestThreadStepInAvoidRegexp.py (600 of 2359) PASS: lldb-unit :: Language/Highlighting/./HighlighterTests/HighlighterTest.ClangSquareBrackets (601 of 2359) PASS: lldb-api :: python_api/interpreter/TestCommandInterpreterAPI.py (602 of 2359) PASS: lldb-unit :: Utility/./UtilityTests/StringExtractorTest.GetHexU8_Underflow (603 of 2359) PASS: lldb-unit :: Utility/./UtilityTests/UriParserTest.SchemeHostSeparator (604 of 2359) PASS: lldb-shell :: ScriptInterpreter/Python/sb_address_exception.test (605 of 2359) PASS: lldb-shell :: SymbolFile/DWARF/x86/find-method-local-struct.cpp (606 of 2359) PASS: lldb-unit :: Utility/./UtilityTests/BroadcasterTest.EventTypeHasListeners (607 of 2359) PASS: lldb-unit :: Process/gdb-remote/./ProcessGdbRemoteTests/GDBRemoteCommunicationClientTest.GetModulesInfo_UUID20 (608 of 2359) PASS: lldb-unit :: Host/./HostTests/NativeProcessProtocolTest.SetBreakpoint (609 of 2359) PASS: lldb-api :: functionalities/data-formatter/nsdictionarysynth/TestNSDictionarySynthetic.py (610 of 2359) UNSUPPORTED: lldb-shell :: SymbolFile/NativePDB/break-by-function.cpp (611 of 2359) PASS: lldb-api :: commands/thread/select/TestThreadSelect.py (612 of 2359) PASS: lldb-api :: commands/frame/diagnose/inheritance/TestDiagnoseInheritance.py (613 of 2359) PASS: lldb-unit :: Process/gdb-remote/./ProcessGdbRemoteTests/GDBRemoteCommunicationClientTest.GetMemoryRegionInfo (614 of 2359) PASS: lldb-api :: functionalities/gdb_remote_client/TestNoWatchpointSupportInfo.py (615 of 2359) PASS: lldb-api :: functionalities/thread/ignore_suspended/TestIgnoreSuspendedThread.py (616 of 2359) PASS: lldb-api :: commands/frame/diagnose/local-variable/TestLocalVariable.py (617 of 2359) PASS: lldb-api :: sanity/TestModuleCacheSanity.py (618 of 2359) PASS: lldb-shell :: SymbolFile/DWARF/x86/dwarf5-implicit-const.s (619 of 2359) PASS: lldb-unit :: Utility/./UtilityTests/StringLexerTest.HasAtLeast (620 of 2359) PASS: lldb-unit :: Utility/./UtilityTests/StateTest.Formatv (621 of 2359) PASS: lldb-unit :: ScriptInterpreter/Python/./ScriptInterpreterPythonTests/PythonDataObjectsTest.TestPythonStringToStr (622 of 2359) PASS: lldb-unit :: Language/Highlighting/./HighlighterTests/HighlighterTest.ClangTrailingBackslashBeforeNewline (623 of 2359) Cannot contact green-dragon-23: java.lang.InterruptedException wrapper script does not seem to be touching the log file in /Users/buildslave/jenkins/workspace/lldb-cmake-matrix@tmp/durable-8ab15a11 (JENKINS-48300: if on an extremely laggy filesystem, consider -Dorg.jenkinsci.plugins.durabletask.BourneShellScript.HEARTBEAT_CHECK_INTERVAL=86400) [Pipeline] } [Pipeline] // timeout [Pipeline] } [Pipeline] // stage [Pipeline] stage [Pipeline] { (Build Clang 7.0.1) Stage "Build Clang 7.0.1" skipped due to earlier failure(s) [Pipeline] } [Pipeline] // stage [Pipeline] stage [Pipeline] { (Test Clang 7.0.1) Stage "Test Clang 7.0.1" skipped due to earlier failure(s) [Pipeline] } [Pipeline] // stage [Pipeline] stage [Pipeline] { (Build Clang 9.0.0) Stage "Build Clang 9.0.0" skipped due to earlier failure(s) [Pipeline] } [Pipeline] // stage [Pipeline] stage [Pipeline] { (Test Clang 9.0.0) Stage "Test Clang 9.0.0" skipped due to earlier failure(s) [Pipeline] } [Pipeline] // stage [Pipeline] stage [Pipeline] { (Test Reproducers) Stage "Test Reproducers" skipped due to earlier failure(s) [Pipeline] } [Pipeline] // stage [Pipeline] } [Pipeline] // withEnv [Pipeline] } [Pipeline] // node [Pipeline] End of Pipeline ERROR: script returned exit code -1 Finished: FAILURE