Console Output

Skipping 3,455 KB.. Full Log
UNSUPPORTED: lldb-api :: benchmarks/turnaround/TestCompileRunToBreakpointTurnaround.py (1175 of 2474)
PASS: lldb-api :: commands/expression/import-std-module/vector-dbg-info-content/TestDbgInfoContentVectorFromStdModule.py (1176 of 2474)
PASS: lldb-unit :: Utility/./UtilityTests/StatusTest.ErrorConversion (1177 of 2474)
PASS: lldb-shell :: Register/Core/x86-64-freebsd-multithread.test (1178 of 2474)
PASS: lldb-api :: functionalities/data-formatter/summary-string-onfail/Test-rdar-9974002.py (1179 of 2474)
PASS: lldb-unit :: Utility/./UtilityTests/Predicate.WaitForValueNotEqualTo (1180 of 2474)
PASS: lldb-unit :: Utility/./UtilityTests/ScalarTest.ComparisonFloat (1181 of 2474)
PASS: lldb-api :: lang/objc/exceptions/TestObjCExceptions.py (1182 of 2474)
PASS: lldb-api :: functionalities/data-formatter/data-formatter-stl/libcxx/vbool/TestDataFormatterLibcxxVBool.py (1183 of 2474)
PASS: lldb-api :: commands/watchpoints/watchpoint_commands/command/TestWatchpointCommandLLDB.py (1184 of 2474)
PASS: lldb-unit :: Expression/./ExpressionTests/DiagnosticManagerTest.GetStringMultipleDiags (1185 of 2474)
PASS: lldb-unit :: Utility/./UtilityTests/ConstStringTest.format_provider (1186 of 2474)
PASS: lldb-api :: commands/target/stop-hooks/TestStopHookScripted.py (1187 of 2474)
PASS: lldb-shell :: ObjectFile/wasm/embedded-debug-sections.yaml (1188 of 2474)
PASS: lldb-shell :: ObjectFile/ELF/short-build-id.yaml (1189 of 2474)
PASS: lldb-unit :: Utility/./UtilityTests/ArgsTest.BareSingleQuote (1190 of 2474)
PASS: lldb-unit :: Utility/./UtilityTests/StringLexerTest.Peek (1191 of 2474)
UNSUPPORTED: lldb-shell :: Subprocess/clone-follow-child.test (1192 of 2474)
PASS: lldb-unit :: Utility/./UtilityTests/BinaryStreamTest.PutULEB128EightBytes (1193 of 2474)
PASS: lldb-shell :: SymbolFile/DWARF/x86/module-ownership.mm (1194 of 2474)
PASS: lldb-unit :: Core/./LLDBCoreTests/StreamCallbackTest.Callback (1195 of 2474)
PASS: lldb-api :: functionalities/thread/concurrent_events/TestConcurrentTwoBreakpointThreads.py (1196 of 2474)
PASS: lldb-unit :: Utility/./UtilityTests/StreamTest.AddressSize (1197 of 2474)
PASS: lldb-unit :: Core/./LLDBCoreTests/ModuleSpecTest.TestMachOFile (1198 of 2474)
PASS: lldb-unit :: Utility/./UtilityTests/LogTest.Unregister (1199 of 2474)
PASS: lldb-unit :: Host/./HostTests/MainLoopTest.TerminatesImmediately (1200 of 2474)
PASS: lldb-unit :: Utility/./UtilityTests/XcodeSDKTest.MergeTest (1201 of 2474)
PASS: lldb-api :: functionalities/data-formatter/data-formatter-ptr-to-array/TestPtrToArrayFormatting.py (1202 of 2474)
PASS: lldb-unit :: Expression/./ExpressionTests/CppModuleConfigurationTest.LibCppV2 (1203 of 2474)
PASS: lldb-unit :: Utility/./UtilityTests/BinaryStreamTest.PutULEB128MaxValue (1204 of 2474)
PASS: lldb-api :: commands/disassemble/basic/TestDisassembleBreakpoint.py (1205 of 2474)
UNSUPPORTED: lldb-api :: functionalities/gdb_remote_client/TestQemuAArch64TargetXml.py (1206 of 2474)
PASS: lldb-unit :: Utility/./UtilityTests/StringExtractorTest.GetNameColonValueContainsColon (1207 of 2474)
PASS: lldb-unit :: UnwindAssembly/x86/./UnwindAssemblyx86Tests/Testx86AssemblyInspectionEngine.TestCALLNextInsn (1208 of 2474)
PASS: lldb-shell :: ScriptInterpreter/Python/Crashlog/json.test (1209 of 2474)
PASS: lldb-api :: functionalities/data-formatter/data-formatter-stl/libcxx/variant/TestDataFormatterLibcxxVariant.py (1210 of 2474)
PASS: lldb-unit :: Utility/./UtilityTests/StringListTest.ShiftMove (1211 of 2474)
PASS: lldb-unit :: Utility/./UtilityTests/VMRange.ContainsAddr (1212 of 2474)
PASS: lldb-shell :: ObjectFile/ELF/minidebuginfo-find-symbols.yaml (1213 of 2474)
PASS: lldb-shell :: SymbolFile/DWARF/anon_class_w_and_wo_export_symbols.ll (1214 of 2474)
PASS: lldb-unit :: Utility/./UtilityTests/FileSpecTest.AppendPathComponent (1215 of 2474)
PASS: lldb-api :: lang/c/anonymous/TestAnonymous.py (1216 of 2474)
PASS: lldb-unit :: ScriptInterpreter/Python/./ScriptInterpreterPythonTests/PythonDataObjectsTest.TestPythonDictionaryManipulation (1217 of 2474)
PASS: lldb-unit :: Expression/./ExpressionTests/DWARFExpression.DW_OP_stack_value (1218 of 2474)
UNSUPPORTED: lldb-api :: arm/breakpoint-thumb-codesection/TestBreakpointThumbCodesection.py (1219 of 2474)
PASS: lldb-api :: macosx/add-dsym/TestAddDsymMidExecutionCommand.py (1220 of 2474)
PASS: lldb-shell :: Commands/command-disassemble.s (1221 of 2474)
PASS: lldb-unit :: Process/Utility/./ProcessUtilityTests/ProcMapTests/LinuxProcMapsTestFixture.ParseMapRegions/0 (1222 of 2474)
PASS: lldb-api :: commands/target/stop-hook/delete/TestTargetStopHookDelete.py (1223 of 2474)
PASS: lldb-unit :: Utility/./UtilityTests/BinaryStreamTest.PutSLEB128MaxValue (1224 of 2474)
PASS: lldb-api :: lang/cpp/wchar_t/TestCxxWCharT.py (1225 of 2474)
PASS: lldb-unit :: Symbol/./SymbolTests/LineEntryTest.GetSameLineContiguousAddressRangeNoInlines (1226 of 2474)
PASS: lldb-shell :: Register/Core/x86-32-freebsd-fp.test (1227 of 2474)
PASS: lldb-unit :: Process/Utility/./ProcessUtilityTests/MemoryTagManagerAArch64MTETest.RemoveNonAddressBits (1228 of 2474)
PASS: lldb-api :: python_api/debugger/TestDebuggerAPI.py (1229 of 2474)
PASS: lldb-api :: commands/expression/completion-in-lambda-and-unnamed-class/TestCompletionInLambdaAndUnnamedClass.py (1230 of 2474)
PASS: lldb-api :: functionalities/data-formatter/ptr_ref_typedef/TestPtrRef2Typedef.py (1231 of 2474)
PASS: lldb-api :: lang/objc/ivar-IMP/TestObjCiVarIMP.py (1232 of 2474)
PASS: lldb-api :: commands/expression/import-std-module/retry-with-std-module/TestRetryWithStdModule.py (1233 of 2474)
PASS: lldb-unit :: Process/./ProcessEventDataTests/ProcessEventDataTest.DoOnRemoval (1234 of 2474)
PASS: lldb-api :: functionalities/thread/num_threads/TestNumThreads.py (1235 of 2474)
PASS: lldb-unit :: Utility/./UtilityTests/PassiveReplayTest.InstrumentedFoo (1236 of 2474)
PASS: lldb-unit :: Host/./HostTests/SocketAddressTest.GetAddressInfo (1237 of 2474)
PASS: lldb-api :: functionalities/data-formatter/data-formatter-smart-array/TestDataFormatterSmartArray.py (1238 of 2474)
PASS: lldb-api :: functionalities/data-formatter/data-formatter-objc/nsstring/TestDataFormatterNSString.py (1239 of 2474)
UNSUPPORTED: lldb-api :: functionalities/ptrauth_diagnostics/brkC47x_code/TestPtrauthBRKc47xDiagnostic.py (1240 of 2474)
PASS: lldb-unit :: Language/Highlighting/./HighlighterTests/HighlighterTest.DefaultHighlighterWithCursor (1241 of 2474)
PASS: lldb-shell :: Reproducer/TestFinalize.test (1242 of 2474)
PASS: lldb-api :: functionalities/data-formatter/data-formatter-script/TestDataFormatterScript.py (1243 of 2474)
PASS: lldb-unit :: Process/Utility/./ProcessUtilityTests/ProcMapTests/LinuxProcMapsTestFixture.ParseMapRegions/3 (1244 of 2474)
PASS: lldb-unit :: Process/gdb-remote/./ProcessGdbRemoteTests/GDBRemoteCommunicationServerTest.SendErrorResponse_StringError (1245 of 2474)
PASS: lldb-api :: lang/cpp/const_this/TestConstThis.py (1246 of 2474)
PASS: lldb-unit :: Utility/./UtilityTests/FileSpecTest.EqualSeparator (1247 of 2474)
PASS: lldb-api :: lang/objc/foundation/TestObjCMethods.py (1248 of 2474)
PASS: lldb-api :: functionalities/data-formatter/data-formatter-skip-summary/TestDataFormatterSkipSummary.py (1249 of 2474)
PASS: lldb-shell :: SymbolFile/DWARF/DW_AT_range-DW_FORM_sec_offset.s (1250 of 2474)
PASS: lldb-unit :: Host/./HostTests/TerminalTest.SetStopBits (1251 of 2474)
PASS: lldb-unit :: Utility/./UtilityTests/StringExtractorTest.GetHexU8_Underflow_NoEof (1252 of 2474)
PASS: lldb-shell :: ObjectFile/ELF/PT_LOAD-overlap-PT_TLS.yaml (1253 of 2474)
PASS: lldb-unit :: Host/./HostTests/FileSystemTest.FileAndDirectoryComponents (1254 of 2474)
PASS: lldb-api :: functionalities/data-formatter/boolreference/TestFormattersBoolRefPtr.py (1255 of 2474)
PASS: lldb-unit :: Process/minidump/./LLDBMinidumpTests/MinidumpParserTest.FindMemoryRange (1256 of 2474)
PASS: lldb-unit :: Host/./HostTests/NativeProcessProtocolTest.SetBreakpointFailWrite (1257 of 2474)
PASS: lldb-shell :: Minidump/fb-dump.test (1258 of 2474)
UNSUPPORTED: lldb-api :: functionalities/data-formatter/data-formatter-stl/libstdcpp/vbool/TestDataFormatterStdVBool.py (1259 of 2474)
PASS: lldb-unit :: Utility/./UtilityTests/StreamTest.PutCString (1260 of 2474)
UNSUPPORTED: lldb-shell :: SymbolFile/PDB/vbases.test (1261 of 2474)
PASS: lldb-shell :: SymbolFile/NativePDB/function-types-calling-conv.cpp (1262 of 2474)
PASS: lldb-unit :: Utility/./UtilityTests/StreamTest.PutRawBytesToBigEndian (1263 of 2474)
PASS: lldb-unit :: ScriptInterpreter/Python/./ScriptInterpreterPythonTests/PythonDataObjectsTest.TestCallable (1264 of 2474)
PASS: lldb-api :: arm/emulation/TestEmulations.py (1265 of 2474)
UNSUPPORTED: lldb-shell :: Register/arm-gp-read.test (1266 of 2474)
PASS: lldb-api :: functionalities/data-formatter/data-formatter-synthval/TestDataFormatterSynthVal.py (1267 of 2474)
UNSUPPORTED: lldb-api :: lang/cpp/reference-to-outer-type/TestCppReferenceToOuterClass.py (1268 of 2474)
PASS: lldb-api :: types/TestDoubleTypesExpr.py (1269 of 2474)
PASS: lldb-unit :: Signals/./SignalsTests/UnixSignalsTest.Iteration (1270 of 2474)
PASS: lldb-unit :: Symbol/./SymbolTests/TestScratchTypeSystemClang.InferSubASTFromLangOpts (1271 of 2474)
PASS: lldb-api :: functionalities/thread/concurrent_events/TestConcurrentManyCrash.py (1272 of 2474)
PASS: lldb-unit :: Utility/./UtilityTests/StringListTest.SplitIntoLines (1273 of 2474)
PASS: lldb-api :: lang/objc/radar-9691614/TestObjCMethodReturningBOOL.py (1274 of 2474)
PASS: lldb-api :: macosx/thread-names/TestInterruptThreadNames.py (1275 of 2474)
PASS: lldb-api :: functionalities/data-formatter/data-formatter-stl/generic/bitset/TestDataFormatterGenericBitset.py (1276 of 2474)
PASS: lldb-unit :: Utility/./UtilityTests/StringExtractorTest.GetU32LittleEndian (1277 of 2474)
PASS: lldb-api :: functionalities/memory/tag/TestMemoryTag.py (1278 of 2474)
PASS: lldb-api :: commands/quit/TestQuit.py (1279 of 2474)
PASS: lldb-unit :: ScriptInterpreter/Python/./ScriptInterpreterPythonTests/PythonDataObjectsTest.TestPythonFile (1280 of 2474)
PASS: lldb-unit :: Expression/./ExpressionTests/DWARFExpression.DW_OP_implicit_value (1281 of 2474)
PASS: lldb-unit :: ScriptInterpreter/Python/./ScriptInterpreterPythonTests/PythonDataObjectsTest.TestTypeNameResolutionNoDot (1282 of 2474)
PASS: lldb-unit :: SymbolFile/NativePDB/./SymbolFileNativePDBTests/PDBFPOProgramToDWARFExpressionTests.MissingTargetRegister (1283 of 2474)
PASS: lldb-unit :: Utility/./UtilityTests/StreamTeeTest.SetStreamAtIndexOutOfBounds (1284 of 2474)
PASS: lldb-unit :: Utility/./UtilityTests/StringListTest.LongestCommonPrefixDuplicateElement (1285 of 2474)
PASS: lldb-unit :: Utility/./UtilityTests/StringListTest.GetMaxStringLengthDecreasingSize (1286 of 2474)
PASS: lldb-api :: lang/cpp/keywords_enabled/TestCppKeywordsEnabled.py (1287 of 2474)
PASS: lldb-shell :: ObjectFile/ELF/aarch64-relocations.yaml (1288 of 2474)
PASS: lldb-api :: functionalities/data-formatter/data-formatter-objc/TestDataFormatterObjCNSNumber.py (1289 of 2474)
PASS: lldb-unit :: SymbolFile/DWARF/./SymbolFileDWARFTests/SymbolFileDWARFTests.TestAbbrevValidAttrNullForm (1290 of 2474)
UNSUPPORTED: lldb-shell :: SymbolFile/dissassemble-entry-point.s (1291 of 2474)
PASS: lldb-api :: commands/watchpoints/watchpoint_events/TestWatchpointEvents.py (1292 of 2474)
PASS: lldb-unit :: API/./APITests/SBCommandInterpreterTest.SingleWordCommand (1293 of 2474)
PASS: lldb-api :: lang/cpp/overloaded-functions/TestOverloadedFunctions.py (1294 of 2474)
PASS: lldb-unit :: Utility/./UtilityTests/UriParserTest.BracketedHostnamePort (1295 of 2474)
PASS: lldb-api :: commands/expression/static-initializers/TestStaticInitializers.py (1296 of 2474)
PASS: lldb-api :: functionalities/reproducers/attach/TestReproducerAttach.py (1297 of 2474)
PASS: lldb-unit :: Symbol/./SymbolTests/TestTypeSystemClang.TestFunctionTemplateInRecordConstruction (1298 of 2474)
PASS: lldb-unit :: Process/gdb-remote/./ProcessGdbRemoteTests/GDBRemoteClientBaseTest.SendContinueAndInterrupt (1299 of 2474)
PASS: lldb-unit :: Utility/./UtilityTests/LogChannelTest.Disable (1300 of 2474)
PASS: lldb-unit :: Process/gdb-remote/./ProcessGdbRemoteTests/GDBRemoteCommunicationServerTest.SendErrorResponse_UnimplementedError (1301 of 2474)
PASS: lldb-shell :: Driver/TestQuiet.test (1302 of 2474)
XFAIL: lldb-shell :: Expr/nodefaultlib.cpp (1303 of 2474)
PASS: lldb-unit :: Platform/./LLDBPlatformTests/PlatformDarwinTest.GetCompatibleArchARMv7em (1304 of 2474)
PASS: lldb-api :: tools/lldb-vscode/attach/TestVSCode_attach.py (1305 of 2474)
PASS: lldb-api :: functionalities/data-formatter/setvaluefromcstring/TestSetValueFromCString.py (1306 of 2474)
PASS: lldb-api :: lang/c/global_variables/TestGlobalVariables.py (1307 of 2474)
PASS: lldb-api :: lang/objc/objc++/TestObjCXX.py (1308 of 2474)
UNSUPPORTED: lldb-api :: commands/trace/TestTraceTimestampCounters.py (1309 of 2474)
PASS: lldb-unit :: Utility/./UtilityTests/StreamTest.PutBytesAsRawHex8ToBigEndian (1310 of 2474)
PASS: lldb-unit :: DataFormatter/./LLDBFormatterTests/TypeMatcherTests.CreatedBySameMatchString (1311 of 2474)
PASS: lldb-api :: lang/objc/objc-class-method/TestObjCClassMethod.py (1312 of 2474)
PASS: lldb-unit :: Utility/./UtilityTests/FileSpecTest.FormatFileSpec (1313 of 2474)
PASS: lldb-unit :: Process/minidump/./LLDBMinidumpTests/MinidumpParserTest.FindMemoryRangeWithFullMemoryMinidump (1314 of 2474)
PASS: lldb-unit :: Utility/./UtilityTests/StringLexerTest.HasAtLeast (1315 of 2474)
PASS: lldb-unit :: SymbolFile/NativePDB/./SymbolFileNativePDBTests/PDBFPOProgramToDWARFExpressionTests.UnresolvedRegisterAssignmentReference (1316 of 2474)
PASS: lldb-shell :: SymbolFile/DWARF/x86/debug_loclists-dwo.s (1317 of 2474)
PASS: lldb-api :: commands/expression/test/TestExprs2.py (1318 of 2474)
PASS: lldb-api :: lang/cpp/function-local-class/TestCppFunctionLocalClass.py (1319 of 2474)
PASS: lldb-api :: commands/expression/import-std-module/empty-module/TestEmptyStdModule.py (1320 of 2474)
PASS: lldb-api :: driver/batch_mode/TestBatchMode.py (1321 of 2474)
PASS: lldb-unit :: UnwindAssembly/x86/./UnwindAssemblyx86Tests/Testx86AssemblyInspectionEngine.TestPushRBP (1322 of 2474)
PASS: lldb-shell :: SymbolFile/Breakpad/line-table-mixed-path-styles.test (1323 of 2474)
PASS: lldb-api :: functionalities/unused-inlined-parameters/TestUnusedInlinedParameters.py (1324 of 2474)
PASS: lldb-api :: lang/cpp/operators/TestCppOperators.py (1325 of 2474)
PASS: lldb-unit :: ScriptInterpreter/Python/./ScriptInterpreterPythonTests/PythonDataObjectsTest.TestPythonIntegerToStr (1326 of 2474)
PASS: lldb-unit :: Utility/./UtilityTests/UriParserTest.TypicalPortPathIPv6 (1327 of 2474)
PASS: lldb-api :: functionalities/breakpoint/cpp_exception/TestCPPExceptionBreakpoint.py (1328 of 2474)
PASS: lldb-unit :: Utility/./UtilityTests/StreamTeeTest.Flush (1329 of 2474)
PASS: lldb-shell :: Process/UnsupportedLanguage.test (1330 of 2474)
PASS: lldb-unit :: Host/./HostTests/SocketTests/SocketTest.UDPGetConnectURI/ipv6 (1331 of 2474)
PASS: lldb-shell :: ObjectFile/ELF/netbsd-core-amd64.test (1332 of 2474)
PASS: lldb-unit :: Utility/./UtilityTests/TildeExpressionResolver.ResolveFullPath (1333 of 2474)
PASS: lldb-unit :: Utility/./UtilityTests/XcodeSDKTest.ParseTest (1334 of 2474)
PASS: lldb-api :: functionalities/data-formatter/data-formatter-objc/TestDataFormatterObjCExpr.py (1335 of 2474)
PASS: lldb-api :: commands/frame/var/TestFrameVar.py (1336 of 2474)
UNSUPPORTED: lldb-api :: benchmarks/expression/TestRepeatedExprs.py (1337 of 2474)
PASS: lldb-api :: macosx/safe-to-func-call/TestSafeFuncCalls.py (1338 of 2474)
PASS: lldb-unit :: Expression/./ExpressionTests/DWARFExpression.DW_OP_pick (1339 of 2474)
PASS: lldb-unit :: Utility/./UtilityTests/RangeTest.ContainsEndInclusive (1340 of 2474)
PASS: lldb-api :: lang/objc/objc-new-syntax/TestObjCNewSyntaxLiteral.py (1341 of 2474)
UNSUPPORTED: lldb-api :: functionalities/data-formatter/data-formatter-stl/libstdcpp/unique_ptr/TestDataFormatterStdUniquePtr.py (1342 of 2474)
PASS: lldb-api :: tools/lldb-vscode/module/TestVSCode_module.py (1343 of 2474)
PASS: lldb-unit :: Utility/./UtilityTests/RegularExpression.Valid (1344 of 2474)
PASS: lldb-unit :: UnwindAssembly/x86/./UnwindAssemblyx86Tests/Testx86AssemblyInspectionEngine.TestPushExtended (1345 of 2474)
PASS: lldb-api :: functionalities/thread/concurrent_events/TestConcurrentTwoWatchpointsOneDelayBreakpoint.py (1346 of 2474)
PASS: lldb-unit :: Utility/./UtilityTests/ProcessInstanceInfo.Dump (1347 of 2474)
PASS: lldb-unit :: Host/./HostTests/SocketAddressTest.Set (1348 of 2474)
PASS: lldb-unit :: Core/./LLDBCoreTests/MangledTest.EmptyForInvalidDLangName (1349 of 2474)
PASS: lldb-unit :: ScriptInterpreter/Python/./ScriptInterpreterPythonTests/PythonDataObjectsTest.TestInstanceNameResolutionNoDot (1350 of 2474)
PASS: lldb-unit :: Utility/./UtilityTests/ArgsTest.GetShellSafeArgument (1351 of 2474)
PASS: lldb-unit :: Host/./HostTests/FileSystemTest.Readable (1352 of 2474)
PASS: lldb-unit :: Process/minidump/./LLDBMinidumpTests/MinidumpParserTest.GetArchitecture (1353 of 2474)
UNSUPPORTED: lldb-api :: functionalities/ubsan/user-expression/TestUbsanUserExpression.py (1354 of 2474)
PASS: lldb-shell :: Driver/TestTarget.test (1355 of 2474)
PASS: lldb-api :: commands/register/register/register_command/TestRegisters.py (1356 of 2474)
PASS: lldb-unit :: Process/Utility/./ProcessUtilityTests/ProcSMapTests/LinuxProcSMapsTestFixture.ParseSMapRegions/6 (1357 of 2474)
PASS: lldb-unit :: Utility/./UtilityTests/StringExtractorTest.GetNameColonValueSuccess (1358 of 2474)
PASS: lldb-unit :: Platform/./LLDBPlatformTests/PlatformDarwinTest.GetCompatibleArchARMv4 (1359 of 2474)
PASS: lldb-unit :: Expression/./ExpressionTests/CppModuleConfigurationTest.IgnoreLibStdCpp (1360 of 2474)
PASS: lldb-shell :: ObjectFile/MachO/subsections.yaml (1361 of 2474)
PASS: lldb-api :: tools/lldb-vscode/coreFile/TestVSCode_coreFile.py (1362 of 2474)
PASS: lldb-api :: functionalities/data-formatter/data-formatter-objc/TestDataFormatterObjCPlain.py (1363 of 2474)
PASS: lldb-api :: commands/expression/import-std-module/vector/TestVectorFromStdModule.py (1364 of 2474)
PASS: lldb-unit :: Utility/./UtilityTests/RegularExpression.CopyAssignment (1365 of 2474)
PASS: lldb-api :: commands/settings/TestSettings.py (1366 of 2474)
PASS: lldb-api :: functionalities/data-formatter/data-formatter-stl/libcxx/vector/TestDataFormatterLibcxxVector.py (1367 of 2474)
UNSUPPORTED: lldb-api :: commands/expression/multiline-completion/TestMultilineCompletion.py (1368 of 2474)
PASS: lldb-api :: commands/expression/import-std-module/basic/TestImportStdModule.py (1369 of 2474)
UNSUPPORTED: lldb-shell :: ScriptInterpreter/Lua/fail_breakpoint_oneline.test (1370 of 2474)
UNSUPPORTED: lldb-api :: functionalities/dyld-launch-linux/TestDyldLaunchLinux.py (1371 of 2474)
PASS: lldb-unit :: Symbol/./SymbolTests/Type.CompilerContextPattern (1372 of 2474)
UNSUPPORTED: lldb-shell :: ScriptInterpreter/Lua/quit.test (1373 of 2474)
PASS: lldb-shell :: Commands/command-stop-hook-output.test (1374 of 2474)
PASS: lldb-api :: functionalities/data-formatter/refpointer-recursion/TestDataFormatterRefPtrRecursion.py (1375 of 2474)
PASS: lldb-unit :: Thread/./ThreadTests/ThreadTest.SetStopInfo (1376 of 2474)
PASS: lldb-unit :: Utility/./UtilityTests/StringListTest.ShiftStdString (1377 of 2474)
PASS: lldb-unit :: Symbol/./SymbolTests/TestTypeSystemClang.AddMethodToObjCObjectType (1378 of 2474)
PASS: lldb-unit :: Utility/./UtilityTests/ProcessInfoTest.Constructor (1379 of 2474)
PASS: lldb-unit :: Language/Highlighting/./HighlighterTests/HighlighterTest.ClangTrailingBackslashBeforeNewline (1380 of 2474)
PASS: lldb-unit :: Utility/./UtilityTests/NameMatchesTest.Ignore (1381 of 2474)
PASS: lldb-shell :: Register/Core/x86-64-linux-gp.test (1382 of 2474)
PASS: lldb-api :: lang/cpp/trivial_abi/TestTrivialABI.py (1383 of 2474)
PASS: lldb-unit :: Utility/./UtilityTests/StreamTest.AddressPrefix (1384 of 2474)
UNSUPPORTED: lldb-api :: functionalities/thread/create_during_step/TestCreateDuringStep.py (1385 of 2474)
PASS: lldb-unit :: Core/./LLDBCoreTests/SourceFileCache.FindSourceFileNotFound (1386 of 2474)
PASS: lldb-api :: types/TestFloatTypesExpr.py (1387 of 2474)
PASS: lldb-unit :: Core/./LLDBCoreTests/CommunicationTest.SynchronizeWhileClosing (1388 of 2474)
PASS: lldb-unit :: Utility/./UtilityTests/StreamTest.AddressRangeInvalidRange (1389 of 2474)
PASS: lldb-shell :: Process/Optimization.test (1390 of 2474)
PASS: lldb-api :: lang/objc/objc-dyn-sbtype/TestObjCDynamicSBType.py (1391 of 2474)
PASS: lldb-api :: functionalities/mtc/simple/TestMTCSimple.py (1392 of 2474)
PASS: lldb-api :: functionalities/data-formatter/data-formatter-globals/TestDataFormatterGlobals.py (1393 of 2474)
PASS: lldb-api :: commands/expression/dont_allow_jit/TestAllowJIT.py (1394 of 2474)
PASS: lldb-api :: lang/c/stepping/TestThreadStepInAvoidRegexp.py (1395 of 2474)
PASS: lldb-shell :: Register/Core/x86-32-freebsd-addr.test (1396 of 2474)
PASS: lldb-shell :: ObjectFile/PECOFF/symbol.yaml (1397 of 2474)
PASS: lldb-shell :: Reproducer/TestDriverOptions.test (1398 of 2474)
PASS: lldb-unit :: UnwindAssembly/x86/./UnwindAssemblyx86Tests/Testx86AssemblyInspectionEngine.TestPushEBX (1399 of 2474)
UNSUPPORTED: lldb-api :: benchmarks/libcxxlist/TestBenchmarkLibcxxList.py (1400 of 2474)
PASS: lldb-unit :: Utility/./UtilityTests/ArchSpecTest.TestParseMachCPUDashSubtypeTripleExtra (1401 of 2474)
PASS: lldb-api :: functionalities/recursion/TestValueObjectRecursion.py (1402 of 2474)
PASS: lldb-unit :: Utility/./UtilityTests/RecordReplayTest.InstrumentedFoo (1403 of 2474)
PASS: lldb-shell :: BuildScript/toolchain-clang.test (1404 of 2474)
PASS: lldb-api :: commands/add-dsym/uuid/TestAddDsymCommand.py (1405 of 2474)
PASS: lldb-api :: functionalities/data-formatter/type_summary_list_arg/TestTypeSummaryListArg.py (1406 of 2474)
PASS: lldb-api :: commands/expression/scoped_enums/TestScopedEnumType.py (1407 of 2474)
PASS: lldb-shell :: ObjectFile/ELF/many-sections.s (1408 of 2474)
UNSUPPORTED: lldb-api :: linux/aarch64/mte_tag_faults/TestAArch64LinuxMTEMemoryTagFaults.py (1409 of 2474)
PASS: lldb-shell :: SymbolFile/DWARF/x86/dwo-type-in-main-file.s (1410 of 2474)
UNSUPPORTED: lldb-shell :: Subprocess/vfork-follow-child-wp.test (1411 of 2474)
PASS: lldb-api :: functionalities/testid/TestTestId.py (1412 of 2474)
PASS: lldb-api :: commands/expression/no-deadlock/TestExprDoesntBlock.py (1413 of 2474)
PASS: lldb-shell :: SymbolFile/NativePDB/globals-bss.cpp (1414 of 2474)
PASS: lldb-shell :: SymbolFile/DWARF/x86/debug_aranges-empty-section.s (1415 of 2474)
PASS: lldb-shell :: ObjectFile/PECOFF/basic-info.yaml (1416 of 2474)
PASS: lldb-shell :: SymbolFile/Breakpad/symtab.test (1417 of 2474)
PASS: lldb-shell :: ScriptInterpreter/None/none.test (1418 of 2474)
PASS: lldb-api :: functionalities/breakpoint/step_over_breakpoint/TestStepOverBreakpoint.py (1419 of 2474)
PASS: lldb-api :: functionalities/data-formatter/data-formatter-stl/libcxx/list/TestDataFormatterLibcxxList.py (1420 of 2474)
PASS: lldb-unit :: Utility/./UtilityTests/StringListTest.GetMaxStringLengthMixed (1421 of 2474)
PASS: lldb-api :: lang/cpp/limit-debug-info/TestWithLimitDebugInfo.py (1422 of 2474)
PASS: lldb-unit :: Utility/./UtilityTests/StringExtractorTest.GetHexBytes_OddPair (1423 of 2474)
PASS: lldb-api :: functionalities/data-formatter/language_category_updates/TestDataFormatterLanguageCategoryUpdates.py (1424 of 2474)
PASS: lldb-unit :: Utility/./UtilityTests/OptionsWithRawTest.WhitespaceSuffix (1425 of 2474)
PASS: lldb-api :: types/TestLongTypes.py (1426 of 2474)
UNSUPPORTED: lldb-shell :: Breakpoint/case-insensitive.test (1427 of 2474)
PASS: lldb-api :: commands/process/attach/attach_denied/TestAttachDenied.py (1428 of 2474)
PASS: lldb-unit :: Utility/./UtilityTests/RangeDataVector.CustomSort (1429 of 2474)
PASS: lldb-shell :: Quit/TestQuitExitCodeNonInt.test (1430 of 2474)
PASS: lldb-shell :: Minidump/breakpad-symbols.test (1431 of 2474)
UNSUPPORTED: lldb-shell :: SymbolFile/PDB/expressions.test (1432 of 2474)
PASS: lldb-shell :: SymbolFile/DWARF/x86/array-sizes.s (1433 of 2474)
PASS: lldb-unit :: Utility/./UtilityTests/CompletionRequest.TryCompleteCurrentArgGood (1434 of 2474)
UNSUPPORTED: lldb-api :: tools/lldb-server/TestPtyServer.py (1435 of 2474)
UNSUPPORTED: lldb-shell :: Subprocess/vfork-follow-parent-wp.test (1436 of 2474)
UNSUPPORTED: lldb-api :: macosx/posix_spawn/TestLaunchProcessPosixSpawn.py (1437 of 2474)
PASS: lldb-unit :: Utility/./UtilityTests/ScalarTest.GetBytes (1438 of 2474)
PASS: lldb-unit :: ScriptInterpreter/Python/./ScriptInterpreterPythonTests/PythonDataObjectsTest.TestOwnedReferences (1439 of 2474)
PASS: lldb-unit :: Utility/./UtilityTests/StreamTest.Indent (1440 of 2474)
PASS: lldb-api :: commands/expression/persistent_types/TestPersistentTypes.py (1441 of 2474)
PASS: lldb-unit :: Host/./HostTests/FileSystemTest.EmptyTest (1442 of 2474)
PASS: lldb-unit :: Utility/./UtilityTests/RecordReplayTest.InvalidSequence (1443 of 2474)
PASS: lldb-unit :: Utility/./UtilityTests/PassiveReplayTest.InstrumentedFooInvalid (1444 of 2474)
UNSUPPORTED: lldb-shell :: SymbolFile/PDB/type-quals.test (1445 of 2474)
PASS: lldb-shell :: Reproducer/TestFileRepro.test (1446 of 2474)
PASS: lldb-api :: functionalities/tail_call_frames/thread_step_out_or_return/TestSteppingOutWithArtificialFrames.py (1447 of 2474)
PASS: lldb-api :: functionalities/target_var/TestTargetVar.py (1448 of 2474)
PASS: lldb-unit :: API/./APITests/SBCommandInterpreterTest.MultiWordCommand (1449 of 2474)
PASS: lldb-api :: commands/process/attach-resume/TestAttachResume.py (1450 of 2474)
PASS: lldb-unit :: Process/gdb-remote/./ProcessGdbRemoteTests/GDBRemoteCommunicationClientTest.GetMemoryRegionInfoInvalidResponse (1451 of 2474)
PASS: lldb-unit :: Utility/./UtilityTests/TimerTest.CategoryTimes (1452 of 2474)
PASS: lldb-api :: functionalities/thread/concurrent_events/TestConcurrentWatchpointDelayWatchpointOneBreakpoint.py (1453 of 2474)
PASS: lldb-api :: functionalities/step-avoids-no-debug/TestStepNoDebug.py (1454 of 2474)
UNSUPPORTED: lldb-api :: commands/gui/expand-threads-tree/TestGuiExpandThreadsTree.py (1455 of 2474)
PASS: lldb-unit :: Utility/./UtilityTests/RangeTest.Copy (1456 of 2474)
PASS: lldb-unit :: UnwindAssembly/x86/./UnwindAssemblyx86Tests/Testx86AssemblyInspectionEngine.Testi386IgnoredRegisters (1457 of 2474)
PASS: lldb-shell :: SymbolFile/DWARF/x86/DW_AT_loclists_base.s (1458 of 2474)
PASS: lldb-shell :: Commands/command-breakpoint-col.test (1459 of 2474)
PASS: lldb-unit :: Symbol/./SymbolTests/TestTypeSystemClang.TemplateArguments (1460 of 2474)
UNSUPPORTED: lldb-api :: functionalities/unwind/aarch64_unwind_pac/TestAArch64UnwindPAC.py (1461 of 2474)
PASS: lldb-api :: commands/expression/persistent_variables/TestPersistentVariables.py (1462 of 2474)
PASS: lldb-api :: functionalities/postmortem/wow64_minidump/TestWow64MiniDump.py (1463 of 2474)
PASS: lldb-api :: commands/expression/persist_objc_pointeetype/TestPersistObjCPointeeType.py (1464 of 2474)
PASS: lldb-api :: test_utils/TestInlineTest.py (1465 of 2474)
PASS: lldb-api :: functionalities/conditional_break/TestConditionalBreak.py (1466 of 2474)
PASS: lldb-api :: commands/frame/diagnose/bad-reference/TestBadReference.py (1467 of 2474)
UNSUPPORTED: lldb-shell :: SymbolFile/PDB/udt-layout.test (1468 of 2474)
PASS: lldb-api :: commands/process/attach/TestProcessAttach.py (1469 of 2474)
UNSUPPORTED: lldb-api :: commands/register/register/aarch64_sve_registers/rw_access_dynamic_resize/TestSVEThreadedDynamic.py (1470 of 2474)
PASS: lldb-unit :: Process/gdb-remote/./ProcessGdbRemoteTests/GDBRemoteClientBaseTest.SendContinueDelegateInterface (1471 of 2474)
PASS: lldb-api :: lang/objc/objc-struct-return/TestObjCStructReturn.py (1472 of 2474)
PASS: lldb-unit :: Utility/./UtilityTests/StreamTest.PutMaxHex64ByteOrderLittle (1473 of 2474)
PASS: lldb-api :: functionalities/pointer_num_children/TestPointerNumChildren.py (1474 of 2474)
PASS: lldb-api :: functionalities/postmortem/elf-core/TestLinuxCore.py (1475 of 2474)
PASS: lldb-shell :: SymbolFile/DWARF/x86/gnu-style-compression.cpp (1476 of 2474)
PASS: lldb-unit :: Process/Utility/./ProcessUtilityTests/ProcSMapTests/LinuxProcSMapsTestFixture.ParseSMapRegions/3 (1477 of 2474)
PASS: lldb-api :: commands/expression/import_builtin_fileid/TestImportBuiltinFileID.py (1478 of 2474)
PASS: lldb-unit :: UnwindAssembly/x86/./UnwindAssemblyx86Tests/Testx86AssemblyInspectionEngine.TestPushEAX (1479 of 2474)
PASS: lldb-api :: lang/objc/objc-ivar-stripped/TestObjCIvarStripped.py (1480 of 2474)
PASS: lldb-api :: lang/cpp/lambdas/TestLambdas.py (1481 of 2474)
PASS: lldb-unit :: Core/./LLDBCoreTests/RichManglingContextTest.Basic (1482 of 2474)
UNSUPPORTED: lldb-api :: tools/lldb-vscode/completions/TestVSCode_completions.py (1483 of 2474)
PASS: lldb-api :: lang/c/complex_int/TestComplexInt.py (1484 of 2474)
PASS: lldb-unit :: Utility/./UtilityTests/RangeDataVector.FindEntryIndexesThatContain_Overlap (1485 of 2474)
PASS: lldb-unit :: Utility/./UtilityTests/StreamTest.AddressRangeSize (1486 of 2474)
PASS: lldb-unit :: Utility/./UtilityTests/BinaryStreamTest.PutSLEB128FiveBytes (1487 of 2474)
UNSUPPORTED: lldb-api :: functionalities/ptr_refs/TestPtrRefs.py (1488 of 2474)
PASS: lldb-unit :: Utility/./UtilityTests/RangeTest.SlideZero (1489 of 2474)
PASS: lldb-unit :: Host/./HostTests/TerminalTest.PipeIsNotATerminal (1490 of 2474)
PASS: lldb-api :: lang/cpp/call-function/TestCallCPPFunction.py (1491 of 2474)
PASS: lldb-api :: lang/objc/warnings-in-expr-parser/TestObjCWarningsInExprParser.py (1492 of 2474)
PASS: lldb-unit :: Symbol/./SymbolTests/DWARFCallFrameInfoTest.Basic_dwarf4 (1493 of 2474)
PASS: lldb-api :: lang/objc/modules-app-update/TestClangModulesAppUpdate.py (1494 of 2474)
PASS: lldb-unit :: Utility/./UtilityTests/RangeTest.LessThan (1495 of 2474)
PASS: lldb-unit :: Core/./LLDBCoreTests/FormatEntityTest.DefinitionConstructionNameTypeData (1496 of 2474)
PASS: lldb-unit :: Core/./LLDBCoreTests/UniqueCStringMap.NoDefaultConstructor (1497 of 2474)
PASS: lldb-unit :: Utility/./UtilityTests/FileSpecTest.FileAndDirectoryComponents (1498 of 2474)
PASS: lldb-unit :: Utility/./UtilityTests/RangeTest.ContainsRangeStartingFromZero (1499 of 2474)
PASS: lldb-api :: commands/expression/context-object/TestContextObject.py (1500 of 2474)
PASS: lldb-unit :: Utility/./UtilityTests/StringExtractorTest.GetHexU8_Underflow (1501 of 2474)
PASS: lldb-unit :: Utility/./UtilityTests/StreamTest.PutMaxHex64ByteOrderBig (1502 of 2474)
PASS: lldb-unit :: Host/./HostTests/TerminalTest.SetRaw (1503 of 2474)
PASS: lldb-shell :: SymbolFile/Breakpad/symtab-macho.test (1504 of 2474)
PASS: lldb-unit :: Utility/./UtilityTests/UriParserTest.SchemeHostSeparator2 (1505 of 2474)
PASS: lldb-api :: lang/cpp/static_member_type_depending_on_parent_size/TestStaticMemberTypeDependingOnParentSize.py (1506 of 2474)
PASS: lldb-unit :: Utility/./UtilityTests/BinaryStreamTest.PutULEB128SixBytes (1507 of 2474)
PASS: lldb-unit :: Process/minidump/./LLDBMinidumpTests/MinidumpParserTest.GetMemory (1508 of 2474)
PASS: lldb-api :: functionalities/thread/concurrent_events/TestConcurrentSignalDelayBreak.py (1509 of 2474)
PASS: lldb-unit :: Utility/./UtilityTests/StreamTest.AddressRangeEmptyRange (1510 of 2474)
PASS: lldb-unit :: Utility/./UtilityTests/StringListTest.JoinThree (1511 of 2474)
PASS: lldb-unit :: SymbolFile/DWARF/./SymbolFileDWARFTests/SymbolFileDWARFTests.TestAbilitiesForDWARF (1512 of 2474)
PASS: lldb-api :: tools/lldb-server/register-reading/TestGdbRemoteGPacket.py (1513 of 2474)
PASS: lldb-api :: functionalities/data-formatter/array_typedef/TestArrayTypedef.py (1514 of 2474)
PASS: lldb-api :: lang/cpp/namespace_definitions/TestNamespaceDefinitions.py (1515 of 2474)
PASS: lldb-api :: commands/expression/vector_of_enums/TestVectorOfEnums.py (1516 of 2474)
PASS: lldb-unit :: Host/./HostTests/NativeProcessProtocolTest.SetBreakpointFailVerify (1517 of 2474)
PASS: lldb-api :: functionalities/inferior-crashing/recursive-inferior/TestRecursiveInferiorStep.py (1518 of 2474)
PASS: lldb-api :: functionalities/breakpoint/breakpoint_hit_count/TestBreakpointHitCount.py (1519 of 2474)
UNSUPPORTED: lldb-api :: commands/trace/TestTraceLoad.py (1520 of 2474)
PASS: lldb-api :: commands/expression/import-std-module/sysroot/TestStdModuleSysroot.py (1521 of 2474)
PASS: lldb-api :: functionalities/data-formatter/data-formatter-stl/libcxx/tuple/TestDataFormatterLibcxxTuple.py (1522 of 2474)
PASS: lldb-api :: lang/cpp/namespace/TestNamespace.py (1523 of 2474)
PASS: lldb-api :: functionalities/tail_call_frames/unambiguous_sequence/TestUnambiguousTailCalls.py (1524 of 2474)
PASS: lldb-unit :: Utility/./UtilityTests/ArchSpecTest.TestParseMachCPUDashSubtypeTripleSimple (1525 of 2474)
PASS: lldb-unit :: Host/./HostTests/FileSystemTest.OpenErrno (1526 of 2474)
PASS: lldb-api :: sample_test/TestSampleInlineTest.py (1527 of 2474)
PASS: lldb-shell :: SymbolFile/DWARF/x86/debug_rnglists.s (1528 of 2474)
UNSUPPORTED: lldb-shell :: SymbolFile/NativePDB/ast-functions-msvc.cpp (1529 of 2474)
UNSUPPORTED: lldb-shell :: Process/Windows/exception_access_violation.cpp (1530 of 2474)
PASS: lldb-unit :: Utility/./UtilityTests/StructuredDataTest.StringDump (1531 of 2474)
PASS: lldb-api :: lang/cpp/class_static/TestStaticVariables.py (1532 of 2474)
PASS: lldb-api :: python_api/process/io/TestProcessIO.py (1533 of 2474)
PASS: lldb-unit :: SymbolFile/DWARF/./SymbolFileDWARFTests/SymbolFileDWARFTests.TestAbbrevNullAttrValidForm (1534 of 2474)
UNSUPPORTED: lldb-api :: commands/trace/TestTraceExport.py (1535 of 2474)
PASS: lldb-unit :: Utility/./UtilityTests/Flags.Test (1536 of 2474)
PASS: lldb-shell :: Reproducer/TestDump.test (1537 of 2474)
PASS: lldb-unit :: Utility/./UtilityTests/RangeVector.CombineConsecutiveRanges (1538 of 2474)
PASS: lldb-unit :: Utility/./UtilityTests/SerializationRountripTest.SerializeDeserializeCString (1539 of 2474)
PASS: lldb-unit :: Symbol/./SymbolTests/LineEntryTest.GetAllExactLineColumnMatches (1540 of 2474)
UNSUPPORTED: lldb-shell :: SymbolFile/PDB/calling-conventions.test (1541 of 2474)
PASS: lldb-unit :: Utility/./UtilityTests/FileSpecTest.CopyByAppendingPathComponent (1542 of 2474)
PASS: lldb-unit :: DataFormatter/./LLDBFormatterTests/TypeMatcherTests.GetMatchStringRegex (1543 of 2474)
PASS: lldb-api :: macosx/lc-note/firmware-corefile/TestFirmwareCorefiles.py (1544 of 2474)
PASS: lldb-unit :: Utility/./UtilityTests/StreamTest.AddressPrefixAndSuffix (1545 of 2474)
PASS: lldb-unit :: Utility/./UtilityTests/VASprintfTest.BufferResize (1546 of 2474)
PASS: lldb-shell :: Reproducer/TestGDBRemoteRepro.test (1547 of 2474)
PASS: lldb-unit :: UnwindAssembly/x86/./UnwindAssemblyx86Tests/Testx86AssemblyInspectionEngine.TestPushEDI (1548 of 2474)
PASS: lldb-api :: commands/expression/completion-crash-incomplete-record/TestCompletionCrashIncompleteRecord.py (1549 of 2474)
PASS: lldb-unit :: Utility/./UtilityTests/NameMatchesTest.EndsWith (1550 of 2474)
PASS: lldb-unit :: Utility/./UtilityTests/BinaryStreamTest.PutULEB128SevenBytes (1551 of 2474)
PASS: lldb-api :: commands/expression/unwind_expression/TestUnwindExpression.py (1552 of 2474)
PASS: lldb-api :: commands/platform/process/list/TestProcessList.py (1553 of 2474)
PASS: lldb-unit :: Process/minidump/./LLDBMinidumpTests/MinidumpParserTest.GetMiscInfo_no_stream (1554 of 2474)
PASS: lldb-unit :: Target/./TargetTests/FindFileTest.FindFileTests (1555 of 2474)
PASS: lldb-api :: python_api/lldbutil/frame/TestFrameUtils.py (1556 of 2474)
PASS: lldb-unit :: Utility/./UtilityTests/StringListTest.DefaultConstructor (1557 of 2474)
PASS: lldb-unit :: UnwindAssembly/x86/./UnwindAssemblyx86Tests/Testx86AssemblyInspectionEngine.TestPopR15 (1558 of 2474)
PASS: lldb-api :: commands/expression/import-std-module/shared_ptr-dbg-info-content/TestSharedPtrDbgInfoContentFromStdModule.py (1559 of 2474)
PASS: lldb-api :: functionalities/thread/concurrent_events/TestConcurrentBreakpointsDelayedBreakpointOneWatchpoint.py (1560 of 2474)
PASS: lldb-api :: python_api/value/change_values/TestChangeValueAPI.py (1561 of 2474)
PASS: lldb-unit :: UnwindAssembly/x86/./UnwindAssemblyx86Tests/Testx86AssemblyInspectionEngine.TestSubRSP (1562 of 2474)
PASS: lldb-unit :: Process/gdb-remote/./ProcessGdbRemoteTests/GDBRemoteCommunicationClientTest.GetModulesInfo_UUID20 (1563 of 2474)
PASS: lldb-shell :: SymbolFile/DWARF/x86/limit-debug-info.s (1564 of 2474)
PASS: lldb-unit :: Utility/./UtilityTests/ArchSpecTest.TestSetTriple (1565 of 2474)
PASS: lldb-unit :: Utility/./UtilityTests/DataExtractorTest.GetMaxU64 (1566 of 2474)
PASS: lldb-unit :: Utility/./UtilityTests/ScalarTest.CastOperations (1567 of 2474)
PASS: lldb-shell :: ObjectFile/ELF/build-id-case.yaml (1568 of 2474)
PASS: lldb-unit :: Symbol/./SymbolTests/TestTypeSystemClang.TestIsClangType (1569 of 2474)
PASS: lldb-api :: macosx/thread_suspend/TestInternalThreadSuspension.py (1570 of 2474)
PASS: lldb-unit :: Process/gdb-remote/./ProcessGdbRemoteTests/PortMapTest.Constructors (1571 of 2474)
PASS: lldb-unit :: Utility/./UtilityTests/ConstStringTest.FromMidOfBufferStringRef (1572 of 2474)
PASS: lldb-unit :: Process/Utility/./ProcessUtilityTests/RegisterContext_x86Test.FullToAbridgedTagWord (1573 of 2474)
PASS: lldb-unit :: SymbolFile/NativePDB/./SymbolFileNativePDBTests/PDBFPOProgramToDWARFExpressionTests.UnsupportedRASearch (1574 of 2474)
PASS: lldb-unit :: Host/./HostTests/SocketTests/SocketTest.DecodeHostAndPort/ipv4 (1575 of 2474)
PASS: lldb-unit :: Language/Highlighting/./HighlighterTests/HighlighterTest.ClangComments (1576 of 2474)
PASS: lldb-unit :: Expression/./ExpressionTests/DiagnosticManagerTest.GetStringBasic (1577 of 2474)
PASS: lldb-unit :: Utility/./UtilityTests/StringListTest.LongestCommonPrefixNoPrefix (1578 of 2474)
PASS: lldb-unit :: Process/Utility/./ProcessUtilityTests/ProcMapTests/LinuxProcMapsTestFixture.ParseMapRegions/5 (1579 of 2474)
PASS: lldb-unit :: SymbolFile/DWARF/./SymbolFileDWARFTests/DWARFUnitTest.MissingSentinel (1580 of 2474)
PASS: lldb-unit :: Core/./LLDBCoreTests/SourceLocationSpecTest.FileLineColumnComponents (1581 of 2474)
PASS: lldb-api :: commands/expression/ir-interpreter-phi-nodes/TestIRInterpreterPHINodes.py (1582 of 2474)
PASS: lldb-unit :: Utility/./UtilityTests/StreamTeeTest.Write (1583 of 2474)
PASS: lldb-api :: functionalities/memory/cache/TestMemoryCache.py (1584 of 2474)
PASS: lldb-unit :: Utility/./UtilityTests/ArgsTest.TestQuotedTrailingBackslash (1585 of 2474)
UNSUPPORTED: lldb-shell :: Subprocess/vfork-follow-parent-softbp.test (1586 of 2474)
PASS: lldb-unit :: Utility/./UtilityTests/GeneratorTest.YamlMultiProvider (1587 of 2474)
PASS: lldb-unit :: Target/./TargetTests/DynamicRegisterInfoRegisterTest.SetRegisterInfo (1588 of 2474)
PASS: lldb-shell :: SymbolFile/NativePDB/function-types-classes.cpp (1589 of 2474)
PASS: lldb-api :: commands/expression/codegen-crash-import-def-arraytype-element/TestImportDefinitionArrayType.py (1590 of 2474)
PASS: lldb-unit :: UnwindAssembly/x86/./UnwindAssemblyx86Tests/Testx86AssemblyInspectionEngine.TestPushECX (1591 of 2474)
PASS: lldb-unit :: Utility/./UtilityTests/ListenerTest.GetEventImmediate (1592 of 2474)
PASS: lldb-shell :: SymbolFile/DWARF/x86/find-inline-method.s (1593 of 2474)
PASS: lldb-api :: functionalities/data-formatter/synthcapping/TestSyntheticCapping.py (1594 of 2474)
PASS: lldb-unit :: Utility/./UtilityTests/StringListTest.ForRange (1595 of 2474)
PASS: lldb-unit :: Utility/./UtilityTests/StringListTest.SplitIntoLinesSingleTrailingCR (1596 of 2474)
PASS: lldb-api :: commands/expression/invalid-args/TestInvalidArgsExpression.py (1597 of 2474)
UNSUPPORTED: lldb-shell :: Breakpoint/ppc64-localentry.test (1598 of 2474)
PASS: lldb-api :: python_api/value/linked_list/TestValueAPILinkedList.py (1599 of 2474)
UNSUPPORTED: lldb-shell :: Unwind/basic-block-sections.test (1600 of 2474)
PASS: lldb-unit :: Host/./HostTests/MainLoopTest.DetectsEOF (1601 of 2474)
UNSUPPORTED: lldb-shell :: Expr/TestIRMemoryMapWindows.test (1602 of 2474)
PASS: lldb-unit :: DataFormatter/./LLDBFormatterTests/TypeMatcherTests.ExactName (1603 of 2474)
PASS: lldb-unit :: Utility/./UtilityTests/StreamTest.ShiftOperatorChars (1604 of 2474)
PASS: lldb-unit :: Utility/./UtilityTests/StringLexerTest.GetUnlexed (1605 of 2474)
PASS: lldb-unit :: Utility/./UtilityTests/GeneratorTest.Get (1606 of 2474)
PASS: lldb-api :: lang/cpp/char8_t/TestCxxChar8_t.py (1607 of 2474)
PASS: lldb-api :: functionalities/pre_run_dylibs/TestPreRunDylibs.py (1608 of 2474)
UNSUPPORTED: lldb-api :: commands/platform/connect/TestPlatformConnect.py (1609 of 2474)
PASS: lldb-api :: functionalities/thread/concurrent_events/TestConcurrentSignalNWatchNBreak.py (1610 of 2474)
PASS: lldb-unit :: Utility/./UtilityTests/TimerTest.CategoryTimesNested (1611 of 2474)
PASS: lldb-unit :: ScriptInterpreter/Python/./ScriptInterpreterPythonTests/PythonDataObjectsTest.TestPythonTupleInitializerList2 (1612 of 2474)
PASS: lldb-shell :: Unwind/eh-frame-dwarf-unwind.test (1613 of 2474)
PASS: lldb-api :: functionalities/data-formatter/builtin-formats/TestBuiltinFormats.py (1614 of 2474)
PASS: lldb-unit :: Utility/./UtilityTests/StringExtractorTest.DecodeHexU8_InvalidHex2 (1615 of 2474)
PASS: lldb-unit :: Symbol/./SymbolTests/TestTypeSystemClang.TestGetBasicTypeFromName (1616 of 2474)
PASS: lldb-unit :: Core/./LLDBCoreTests/RichManglingContextTest.IPDRealloc (1617 of 2474)
PASS: lldb-api :: functionalities/breakpoint/breakpoint_language/TestBreakpointLanguage.py (1618 of 2474)
PASS: lldb-unit :: debugserver/./debugserverTests/RNBSocket.LoopBackListenIPv4 (1619 of 2474)
UNSUPPORTED: lldb-shell :: SymbolFile/PDB/function-nested-block.test (1620 of 2474)
PASS: lldb-api :: commands/expression/diagnostics/TestExprDiagnostics.py (1621 of 2474)
PASS: lldb-unit :: SymbolFile/DWARF/./SymbolFileDWARFTests/DWARFUnitTest.LLVMGCCProducer (1622 of 2474)
PASS: lldb-unit :: Core/./LLDBCoreTests/MangledTest.ResultForValidRustV0Name (1623 of 2474)
PASS: lldb-unit :: Utility/./UtilityTests/StreamTest.QuotedCString (1624 of 2474)
PASS: lldb-api :: python_api/sbdata/TestSBData.py (1625 of 2474)
PASS: lldb-api :: tools/lldb-server/TestGdbRemoteExitCode.py (1626 of 2474)
PASS: lldb-unit :: Utility/./UtilityTests/UserIDResolver.GetUserName (1627 of 2474)
PASS: lldb-shell :: SymbolFile/DWARF/x86/DW_AT_data_bit_offset-DW_OP_stack_value.s (1628 of 2474)
PASS: lldb-api :: lang/cpp/template-specialization-type/TestTemplateSpecializationType.py (1629 of 2474)
PASS: lldb-shell :: Quit/TestQuitExitCodeHex0.test (1630 of 2474)
PASS: lldb-api :: commands/frame/select/TestFrameSelect.py (1631 of 2474)
PASS: lldb-unit :: Expression/./ExpressionTests/ClangHostTest.ComputeClangResourceDirectory (1632 of 2474)
UNSUPPORTED: lldb-api :: functionalities/tsan/global_location/TestTsanGlobalLocation.py (1633 of 2474)
PASS: lldb-unit :: ObjectFile/PECOFF/./ObjectFilePECOFFTests/PECallFrameInfoTest.Chained_eh (1634 of 2474)
PASS: lldb-unit :: Host/./HostTests/TerminalTest.SetHardwareFlowControl (1635 of 2474)
PASS: lldb-unit :: Process/Utility/./ProcessUtilityTests/MemoryTagManagerAArch64MTETest.RepeatTagsForRange (1636 of 2474)
PASS: lldb-api :: lang/objc/objc-super/TestObjCSuper.py (1637 of 2474)
PASS: lldb-api :: functionalities/thread_plan/TestThreadPlanCommands.py (1638 of 2474)
PASS: lldb-unit :: Process/gdb-remote/./ProcessGdbRemoteTests/GDBRemoteClientBaseTest.SendContinueAndAsyncPacket (1639 of 2474)
PASS: lldb-api :: lang/c/inlines/TestRedefinitionsInInlines.py (1640 of 2474)
PASS: lldb-api :: commands/process/launch-with-shellexpand/TestLaunchWithShellExpand.py (1641 of 2474)
PASS: lldb-api :: lang/cpp/signed_types/TestSignedTypes.py (1642 of 2474)
PASS: lldb-unit :: Expression/./ExpressionTests/DiagnosticManagerTest.GetStringPreserveOrder (1643 of 2474)
UNSUPPORTED: lldb-shell :: Unwind/unwind-plan-dwarf-dump.test (1644 of 2474)
PASS: lldb-unit :: UnwindAssembly/x86/./UnwindAssemblyx86Tests/Testx86AssemblyInspectionEngine.TestSubESP (1645 of 2474)
PASS: lldb-unit :: Utility/./UtilityTests/AnsiTerminal.Twice (1646 of 2474)
PASS: lldb-shell :: SymbolFile/DWARF/x86/debug_rnglists-dwp.s (1647 of 2474)
UNSUPPORTED: lldb-api :: functionalities/ptrauth_diagnostics/LDRAA_error/TestPtrauthLDRAADiagnostic.py (1648 of 2474)
PASS: lldb-unit :: Utility/./UtilityTests/StringLexerTest.NextIf (1649 of 2474)
PASS: lldb-unit :: Utility/./UtilityTests/StringLexerTest.Next (1650 of 2474)
PASS: lldb-api :: functionalities/thread/concurrent_events/TestConcurrentCrashWithWatchpointBreakpointSignal.py (1651 of 2474)
PASS: lldb-shell :: Settings/TestDefaultModuleCachePath.test (1652 of 2474)
PASS: lldb-unit :: Host/./HostTests/SocketTests/SocketTest.UDPConnect/ipv4 (1653 of 2474)
PASS: lldb-shell :: Breakpoint/dummy-target.test (1654 of 2474)
UNSUPPORTED: lldb-api :: tools/lldb-server/memory-tagging/TestGdbRemoteMemoryTagging.py (1655 of 2474)
PASS: lldb-shell :: Breakpoint/split-dwarf-5-addrbase.test (1656 of 2474)
UNSUPPORTED: lldb-shell :: Subprocess/fork-follow-parent-softbp.test (1657 of 2474)
PASS: lldb-unit :: Utility/./UtilityTests/ArgsTest.TestSingleArgWithQuotedSpace (1658 of 2474)
UNSUPPORTED: lldb-api :: lang/objc/conflicting-class-list-function-from-user/TestObjCClassListFunctionFromUser.py (1659 of 2474)
PASS: lldb-shell :: ObjectFile/ELF/PT_LOAD-overlap-section.yaml (1660 of 2474)
PASS: lldb-api :: lang/cpp/dynamic-value/TestCppValueCast.py (1661 of 2474)
PASS: lldb-api :: sanity/TestModuleCacheSanity.py (1662 of 2474)
PASS: lldb-shell :: ObjectFile/ELF/section-overlap.yaml (1663 of 2474)
PASS: lldb-api :: functionalities/data-formatter/data-formatter-categories/TestDataFormatterCategories.py (1664 of 2474)
PASS: lldb-unit :: Utility/./UtilityTests/TimeoutTest.Construction (1665 of 2474)
PASS: lldb-shell :: Breakpoint/split-dwarf5-debug-stroffsets.test (1666 of 2474)
PASS: lldb-unit :: UnwindAssembly/x86/./UnwindAssemblyx86Tests/Testx86AssemblyInspectionEngine.TestPopEBP (1667 of 2474)
PASS: lldb-api :: lang/objc/conflicting-definition/TestConflictingDefinition.py (1668 of 2474)
PASS: lldb-api :: commands/expression/import_base_class_when_class_has_derived_member/TestImportBaseClassWhenClassHasDerivedMember.py (1669 of 2474)
PASS: lldb-api :: commands/frame/diagnose/dereference-this/TestDiagnoseDereferenceThis.py (1670 of 2474)
PASS: lldb-shell :: Commands/command-image-lookup.yaml (1671 of 2474)
UNSUPPORTED: lldb-api :: tools/lldb-server/TestGdbRemoteModuleInfo.py (1672 of 2474)
PASS: lldb-api :: commands/expression/call-function/TestCallStdStringFunction.py (1673 of 2474)
PASS: lldb-api :: commands/target/stop-hook/enable/TestTargetStopHookEnable.py (1674 of 2474)
PASS: lldb-shell :: Settings/TestSettingsWrite.test (1675 of 2474)
PASS: lldb-api :: functionalities/data-formatter/data-formatter-synthtype/TestDataFormatterSynthType.py (1676 of 2474)
PASS: lldb-api :: commands/log/invalid-args/TestInvalidArgsLog.py (1677 of 2474)
PASS: lldb-api :: commands/command/source/TestCommandSource.py (1678 of 2474)
UNSUPPORTED: lldb-api :: tools/lldb-server/TestGdbRemoteSaveCore.py (1679 of 2474)
PASS: lldb-unit :: Process/Utility/./ProcessUtilityTests/ProcSMapTests/LinuxProcSMapsTestFixture.ParseSMapRegions/8 (1680 of 2474)
PASS: lldb-unit :: Process/Utility/./ProcessUtilityTests/MemoryTagManagerAArch64MTETest.MakeTaggedRange (1681 of 2474)
UNSUPPORTED: lldb-api :: functionalities/thread/concurrent_events/TestConcurrentManySignals.py (1682 of 2474)
PASS: lldb-unit :: Utility/./UtilityTests/StringListTest.SetSize (1683 of 2474)
PASS: lldb-unit :: Core/./LLDBCoreTests/CommunicationTest.WriteAll (1684 of 2474)
PASS: lldb-unit :: ScriptInterpreter/Python/./ScriptInterpreterPythonTests/PythonDataObjectsTest.TestPythonStringToStr (1685 of 2474)
PASS: lldb-unit :: Process/gdb-remote/./ProcessGdbRemoteTests/GDBRemoteCommunicationServerTest.SendErrorResponse_ErrorNumber (1686 of 2474)
PASS: lldb-api :: commands/expression/import-std-module/deque-dbg-info-content/TestDbgInfoContentDequeFromStdModule.py (1687 of 2474)
PASS: lldb-unit :: Utility/./UtilityTests/SubsystemRAIITest.SubsystemWithErrorSuccess (1688 of 2474)
PASS: lldb-api :: types/TestCharType.py (1689 of 2474)
PASS: lldb-unit :: Process/minidump/./LLDBMinidumpTests/MinidumpParserTest.GetThreadContext_x86_32 (1690 of 2474)
PASS: lldb-unit :: Process/minidump/./LLDBMinidumpTests/MinidumpParserTest.MinidumpDuplicateModuleMappedSecond (1691 of 2474)
PASS: lldb-unit :: Process/Utility/./ProcessUtilityTests/ProcSMapTests/LinuxProcSMapsTestFixture.ParseSMapRegions/5 (1692 of 2474)
PASS: lldb-unit :: Utility/./UtilityTests/RangeTest.DoesIntersect (1693 of 2474)
PASS: lldb-shell :: Breakpoint/jit-loader_rtdyld_elf.test (1694 of 2474)
PASS: lldb-api :: python_api/sbtype_typeclass/TestSBTypeTypeClass.py (1695 of 2474)
PASS: lldb-unit :: Process/gdb-remote/./ProcessGdbRemoteTests/GDBRemoteClientBaseTest.InterruptNoResponse (1696 of 2474)
PASS: lldb-api :: lang/cpp/static_methods/TestCPPStaticMethods.py (1697 of 2474)
PASS: lldb-unit :: Expression/./ExpressionTests/ClangExpressionDeclMapTest.TestUnknownIdentifierLookup (1698 of 2474)
PASS: lldb-unit :: Process/gdb-remote/./ProcessGdbRemoteTests/GDBRemoteCommunicationClientTest.ReadMemoryTags (1699 of 2474)
PASS: lldb-unit :: ObjectFile/PECOFF/./ObjectFilePECOFFTests/PECallFrameInfoTest.Frame_reg_eh (1700 of 2474)
PASS: lldb-unit :: SymbolFile/DWARF/./SymbolFileDWARFTests/SymbolFileDWARFTests.TestAbbrevOutOfOrder (1701 of 2474)
PASS: lldb-unit :: Utility/./UtilityTests/StreamTest.AddressNoSuffix (1702 of 2474)
UNSUPPORTED: lldb-api :: android/platform/TestDefaultCacheLineSize.py (1703 of 2474)
UNSUPPORTED: lldb-shell :: Watchpoint/netbsd-nouserdbregs.test (1704 of 2474)
PASS: lldb-shell :: SymbolFile/Breakpad/unwind-via-stack-cfi.test (1705 of 2474)
PASS: lldb-api :: macosx/nslog/TestDarwinNSLogOutput.py (1706 of 2474)
PASS: lldb-unit :: Utility/./UtilityTests/ConstStringTest.MangledCounterpart (1707 of 2474)
PASS: lldb-api :: commands/watchpoints/multiple_threads/TestWatchpointMultipleThreads.py (1708 of 2474)
UNSUPPORTED: lldb-api :: functionalities/exec/TestExec.py (1709 of 2474)
PASS: lldb-api :: python_api/type/TestTypeList.py (1710 of 2474)
PASS: lldb-api :: functionalities/thread/backtrace_all/TestBacktraceAll.py (1711 of 2474)
PASS: lldb-shell :: SymbolFile/DWARF/x86/debug-types-line-tables.s (1712 of 2474)
PASS: lldb-unit :: SymbolFile/DWARF/./SymbolFileDWARFTests/DWARFASTParserClangTests.EnsureAllDIEsInDeclContextHaveBeenParsedParsesOnlyMatchingEntries (1713 of 2474)
PASS: lldb-unit :: Host/./HostTests/SocketTests/SocketTest.TCPListen0GetPort/ipv4 (1714 of 2474)
PASS: lldb-unit :: Utility/./UtilityTests/StringListTest.Assignment (1715 of 2474)
PASS: lldb-shell :: Reproducer/TestPythonImport.test (1716 of 2474)
PASS: lldb-shell :: Error/assert.test (1717 of 2474)
PASS: lldb-api :: lang/c/register_variables/TestRegisterVariables.py (1718 of 2474)
PASS: lldb-shell :: Reproducer/Functionalities/TestStepping.test (1719 of 2474)
PASS: lldb-unit :: Utility/./UtilityTests/TimeoutTest.Format (1720 of 2474)
PASS: lldb-unit :: Utility/./UtilityTests/BinaryStreamTest.PutULEB128Zero (1721 of 2474)
PASS: lldb-api :: commands/expression/import-std-module/unique_ptr/TestUniquePtrFromStdModule.py (1722 of 2474)
PASS: lldb-api :: lang/cpp/virtual-functions/TestCppVirtualFunctions.py (1723 of 2474)
PASS: lldb-unit :: Utility/./UtilityTests/StreamTest.PutHex64ByteOrderBig (1724 of 2474)
PASS: lldb-unit :: UnwindAssembly/x86/./UnwindAssemblyx86Tests/Testx86AssemblyInspectionEngine.TestPush0 (1725 of 2474)
PASS: lldb-unit :: Symbol/./SymbolTests/TestCreateClassTemplateDecl.FindExistingTemplates (1726 of 2474)
PASS: lldb-shell :: Driver/LocalLLDBInit.test (1727 of 2474)
UNSUPPORTED: lldb-api :: commands/gui/viewlarge/TestGuiViewLarge.py (1728 of 2474)
PASS: lldb-shell :: SymbolFile/DWARF/x86/dwarf5-split.s (1729 of 2474)
PASS: lldb-shell :: SymbolFile/DWARF/x86/dwarf5_locations.s (1730 of 2474)
PASS: lldb-api :: lang/cpp/global_operators/TestCppGlobalOperators.py (1731 of 2474)
PASS: lldb-shell :: ObjectFile/ELF/section-addresses.yaml (1732 of 2474)
UNSUPPORTED: lldb-api :: functionalities/breakpoint/hardware_breakpoints/write_memory_with_hw_breakpoint/TestWriteMemoryWithHWBreakpoint.py (1733 of 2474)
PASS: lldb-api :: python_api/lldbutil/iter/TestLLDBIterator.py (1734 of 2474)
PASS: lldb-api :: functionalities/gdb_remote_client/TestGDBRemoteDiskFileCompletion.py (1735 of 2474)
PASS: lldb-shell :: SymbolFile/DWARF/x86/dwarf5-partial-index.cpp (1736 of 2474)
UNSUPPORTED: lldb-shell :: SymbolFile/DWARF/x86/dwarf5-line-strp.s (1737 of 2474)
PASS: lldb-api :: lang/objc/foundation/TestObjCMethodsString.py (1738 of 2474)
PASS: lldb-unit :: Symbol/./SymbolTests/TestCreateClassTemplateDecl.FindExistingTemplatesWithParameterPack (1739 of 2474)
PASS: lldb-api :: functionalities/postmortem/netbsd-core/TestNetBSDCore.py (1740 of 2474)
PASS: lldb-api :: lang/cpp/this/TestCPPThis.py (1741 of 2474)
PASS: lldb-unit :: Host/./HostTests/File.GetStreamFromDescriptor (1742 of 2474)
PASS: lldb-api :: lang/c/record_decl_in_expr/TestRecordDeclInExpr.py (1743 of 2474)
PASS: lldb-shell :: Register/Core/x86-64-linux-fp.test (1744 of 2474)
PASS: lldb-unit :: Utility/./UtilityTests/LogChannelEnabledTest.LogVerboseThread (1745 of 2474)
PASS: lldb-api :: commands/expression/timeout/TestCallWithTimeout.py (1746 of 2474)
PASS: lldb-shell :: Settings/TestModuleCacheSanity.test (1747 of 2474)
PASS: lldb-api :: functionalities/data-formatter/data-formatter-stl/libcxx/list/loop/TestDataFormatterLibcxxListLoop.py (1748 of 2474)
PASS: lldb-unit :: Interpreter/./InterpreterTests/OptionArgParserTest.toScriptLanguage (1749 of 2474)
PASS: lldb-unit :: Host/./HostTests/Host.WaitStatusFormat (1750 of 2474)
PASS: lldb-api :: functionalities/gdb_remote_client/TestqOffsets.py (1751 of 2474)
PASS: lldb-unit :: Symbol/./SymbolTests/TestClangASTImporter.DeportDeclTagDecl (1752 of 2474)
PASS: lldb-unit :: Symbol/./SymbolTests/TestTypeSystemClang.TestOwningModule (1753 of 2474)
PASS: lldb-api :: macosx/find-app-in-bundle/TestFindAppInBundle.py (1754 of 2474)
PASS: lldb-api :: functionalities/signal/raise/TestRaise.py (1755 of 2474)
PASS: lldb-unit :: Symbol/./SymbolTests/TestClangASTImporter.DeportTypeTagDecl (1756 of 2474)
PASS: lldb-unit :: Language/Highlighting/./HighlighterTests/HighlighterTest.ClangEmptyInput (1757 of 2474)
PASS: lldb-unit :: Language/CLanguages/./LanguageCLanguagesTests/CLanguages.LookupCLanguagesByLanguageType (1758 of 2474)
PASS: lldb-unit :: Utility/./UtilityTests/SubsystemRAIITest.SubsystemWithErrorFailure (1759 of 2474)
UNSUPPORTED: lldb-shell :: Register/x86-db-read.test (1760 of 2474)
PASS: lldb-shell :: SymbolFile/NativePDB/globals-fundamental.cpp (1761 of 2474)
PASS: lldb-unit :: Utility/./UtilityTests/ArgsTest.DoubleQuotedItem (1762 of 2474)
PASS: lldb-unit :: Utility/./UtilityTests/VMRange.Clear (1763 of 2474)
PASS: lldb-unit :: Symbol/./SymbolTests/TestClangASTImporter.MetadataPropagation (1764 of 2474)
UNSUPPORTED: lldb-api :: functionalities/asan/TestMemoryHistory.py (1765 of 2474)
PASS: lldb-api :: python_api/hello_world/TestHelloWorld.py (1766 of 2474)
PASS: lldb-api :: lang/cpp/multiple-inheritance/TestCppMultipleInheritance.py (1767 of 2474)
PASS: lldb-unit :: Expression/./ExpressionTests/CppModuleConfigurationTest.Linux (1768 of 2474)
PASS: lldb-api :: lang/cpp/class_types/TestClassTypes.py (1769 of 2474)
PASS: lldb-api :: functionalities/fat_archives/TestFatArchives.py (1770 of 2474)
PASS: lldb-api :: functionalities/type_get_module/TestTypeGetModule.py (1771 of 2474)
UNSUPPORTED: lldb-shell :: Register/x86-zmm-write.test (1772 of 2474)
PASS: lldb-api :: lang/cpp/member-and-local-vars-with-same-name/TestMembersAndLocalsWithSameName.py (1773 of 2474)
PASS: lldb-unit :: Utility/./UtilityTests/CompletionRequest.ShiftArguments (1774 of 2474)
PASS: lldb-api :: macosx/find-dsym/deep-bundle/TestDeepBundle.py (1775 of 2474)
PASS: lldb-unit :: Utility/./UtilityTests/StreamTest.PutCStringWithStringRef (1776 of 2474)
UNSUPPORTED: lldb-shell :: SymbolFile/DWARF/dwarf5-lazy-dwo.c (1777 of 2474)
PASS: lldb-unit :: SymbolFile/NativePDB/./SymbolFileNativePDBTests/PDBFPOProgramToDWARFExpressionTests.DependencyChain (1778 of 2474)
PASS: lldb-api :: functionalities/backticks/TestBackticksWithoutATarget.py (1779 of 2474)
PASS: lldb-api :: lang/objc/foundation/TestRuntimeTypes.py (1780 of 2474)
PASS: lldb-unit :: Utility/./UtilityTests/StringListTest.Join (1781 of 2474)
PASS: lldb-api :: lang/c/modules/TestCModules.py (1782 of 2474)
UNSUPPORTED: lldb-shell :: Register/arm-fp-read.test (1783 of 2474)
PASS: lldb-shell :: SymbolFile/DWARF/x86/find-basic-namespace.cpp (1784 of 2474)
PASS: lldb-shell :: SymbolFile/NativePDB/break-by-function.cpp (1785 of 2474)
PASS: lldb-api :: functionalities/plugins/python_os_plugin/TestPythonOSPlugin.py (1786 of 2474)
PASS: lldb-unit :: Symbol/./SymbolTests/TestTypeSystemMap.GetTypeSystemForLanguageWithNoModule (1787 of 2474)
UNSUPPORTED: lldb-api :: functionalities/unwind/ehframe/TestEhFrameUnwind.py (1788 of 2474)
PASS: lldb-api :: python_api/interpreter/TestRunCommandInterpreterAPI.py (1789 of 2474)
PASS: lldb-api :: functionalities/inferior-crashing/TestInferiorCrashingStep.py (1790 of 2474)
PASS: lldb-unit :: Utility/./UtilityTests/UriParserTest.BracketedHostnameWithPortIPv6 (1791 of 2474)
PASS: lldb-api :: functionalities/gdb_remote_client/TestStopPCs.py (1792 of 2474)
PASS: lldb-shell :: SymbolFile/DWARF/x86/split-dwarf-inlining.cpp (1793 of 2474)
PASS: lldb-shell :: Quit/TestQuitExitCode-30.test (1794 of 2474)
PASS: lldb-unit :: Utility/./UtilityTests/StreamTest.ShiftOperatorPtr (1795 of 2474)
PASS: lldb-api :: commands/expression/calculator_mode/TestCalculatorMode.py (1796 of 2474)
PASS: lldb-unit :: Symbol/./SymbolTests/TestTypeSystemClang.TestGetTypeClassTypeOfExpr (1797 of 2474)
PASS: lldb-api :: lang/objc/tagged-pointer/TestTaggedPointerCmd.py (1798 of 2474)
UNSUPPORTED: lldb-shell :: Register/x86-64-ymm16-read.test (1799 of 2474)
PASS: lldb-api :: tools/lldb-vscode/breakpoint/TestVSCode_setExceptionBreakpoints.py (1800 of 2474)
PASS: lldb-api :: functionalities/signal/TestSendSignal.py (1801 of 2474)
PASS: lldb-unit :: Utility/./UtilityTests/StringExtractorTest.DecodeHexU8_InvalidHex (1802 of 2474)
PASS: lldb-unit :: Utility/./UtilityTests/StreamTeeTest.GetStreamAtIndexOutOfBoundsEmpty (1803 of 2474)
PASS: lldb-unit :: Interpreter/./InterpreterTests/OptionArgParserTest.toChar (1804 of 2474)
PASS: lldb-unit :: Utility/./UtilityTests/Flags.GetBitSize (1805 of 2474)
PASS: lldb-unit :: Process/minidump/./LLDBMinidumpTests/MinidumpParserTest.GetMemoryRegionInfoLinuxMaps (1806 of 2474)
PASS: lldb-api :: functionalities/postmortem/elf-core/thread_crash/TestLinuxCoreThreads.py (1807 of 2474)
PASS: lldb-api :: commands/expression/options/TestExprOptions.py (1808 of 2474)
UNSUPPORTED: lldb-api :: functionalities/tsan/thread_leak/TestTsanThreadLeak.py (1809 of 2474)
PASS: lldb-unit :: Process/Utility/./ProcessUtilityTests/ProcSMapTests/LinuxProcSMapsTestFixture.ParseSMapRegions/2 (1810 of 2474)
PASS: lldb-unit :: Platform/Android/./AdbClientTests/AdbClientTest.CreateByDeviceId (1811 of 2474)
PASS: lldb-api :: tools/lldb-server/signal-filtering/TestGdbRemote_QPassSignals.py (1812 of 2474)
PASS: lldb-api :: lang/objc/foundation/TestConstStrings.py (1813 of 2474)
PASS: lldb-unit :: Language/Highlighting/./HighlighterTests/HighlighterTest.DefaultHighlighterWithCursorOutOfBounds (1814 of 2474)
PASS: lldb-api :: tools/lldb-server/TestGdbRemoteThreadsInStopReply.py (1815 of 2474)
PASS: lldb-unit :: Target/./TargetTests/ModuleCacheTest.GetAndPut (1816 of 2474)
PASS: lldb-api :: tools/lldb-server/TestLldbGdbServer.py (1817 of 2474)
PASS: lldb-shell :: SymbolFile/DWARF/x86/debug-types-signature-loop.s (1818 of 2474)
PASS: lldb-unit :: SymbolFile/DWARF/./SymbolFileDWARFTests/DWARFDIETest.ChildIteration (1819 of 2474)
PASS: lldb-unit :: Target/./TargetTests/ExecutionContextTest.GetByteOrderTarget (1820 of 2474)
UNSUPPORTED: lldb-api :: commands/expression/call-restarts/TestCallThatRestarts.py (1821 of 2474)
PASS: lldb-unit :: Process/gdb-remote/./ProcessGdbRemoteTests/GDBRemoteCommunicationClientTest.SendSignalsToIgnore (1822 of 2474)
PASS: lldb-unit :: Utility/./UtilityTests/StreamTest.PutHex16ByteOrderBig (1823 of 2474)
PASS: lldb-unit :: Utility/./UtilityTests/OptionsWithRawTest.QuotedSuffix (1824 of 2474)
PASS: lldb-unit :: Utility/./UtilityTests/SerializationRountripTest.SerializeDeserializeCStringNull (1825 of 2474)
PASS: lldb-api :: functionalities/gdb_remote_client/TestGDBRemoteClient.py (1826 of 2474)
PASS: lldb-shell :: Reproducer/Functionalities/TestExpressionEvaluation.test (1827 of 2474)
PASS: lldb-api :: functionalities/thread/concurrent_events/TestConcurrentSignalDelayWatch.py (1828 of 2474)
PASS: lldb-unit :: Expression/./ExpressionTests/CppModuleConfigurationTest.Sysroot (1829 of 2474)
PASS: lldb-unit :: Symbol/./SymbolTests/LineEntryTest.GetSameLineContiguousAddressRangeOneInline (1830 of 2474)
PASS: lldb-api :: commands/frame/recognizer/TestFrameRecognizer.py (1831 of 2474)
PASS: lldb-unit :: UnwindAssembly/x86/./UnwindAssemblyx86Tests/Testx86AssemblyInspectionEngine.TestPushRBX (1832 of 2474)
PASS: lldb-unit :: Symbol/./SymbolTests/TestTypeSystemClang.TestGetTypeClassDeclType (1833 of 2474)
PASS: lldb-shell :: Breakpoint/jit-loader_jitlink_elf.test (1834 of 2474)
PASS: lldb-unit :: Symbol/./SymbolTests/TestTypeSystemClang.TestBuiltinTypeForEncodingAndBitSize (1835 of 2474)
PASS: lldb-api :: tools/lldb-server/TestGdbRemoteKill.py (1836 of 2474)
PASS: lldb-unit :: Target/./TargetTests/PathMappingListTest.RelativeTests (1837 of 2474)
PASS: lldb-unit :: Utility/./UtilityTests/RecordReplayTest.ValidSequence (1838 of 2474)
PASS: lldb-api :: functionalities/breakpoint/objc/TestObjCBreakpoints.py (1839 of 2474)
PASS: lldb-api :: functionalities/breakpoint/breakpoint_conditions/TestBreakpointConditions.py (1840 of 2474)
UNSUPPORTED: lldb-shell :: Unwind/eh-frame-augment-noop.test (1841 of 2474)
PASS: lldb-api :: python_api/value_var_update/TestValueVarUpdate.py (1842 of 2474)
PASS: lldb-unit :: Host/./HostTests/NativeProcessProtocolTest.ReadCStringFromMemory (1843 of 2474)
PASS: lldb-unit :: Utility/./UtilityTests/StringListTest.JoinSingle (1844 of 2474)
PASS: lldb-unit :: Utility/./UtilityTests/ArgsTest.TestMultipleArgs (1845 of 2474)
PASS: lldb-api :: functionalities/data-formatter/data-formatter-objc/TestDataFormatterObjNSException.py (1846 of 2474)
PASS: lldb-unit :: Host/./HostTests/FileSystemTest.GetByteSize (1847 of 2474)
PASS: lldb-shell :: Reproducer/TestWorkingDir.test (1848 of 2474)
PASS: lldb-unit :: Host/./HostTests/MainLoopTest.ReadObject (1849 of 2474)
PASS: lldb-api :: functionalities/var_path/TestVarPath.py (1850 of 2474)
PASS: lldb-unit :: Utility/./UtilityTests/ArgsTest.StringListConstructor (1851 of 2474)
PASS: lldb-unit :: Symbol/./SymbolTests/TestTypeSystemClang.GetExeModuleWhenMissingSymbolFile (1852 of 2474)
PASS: lldb-api :: lang/cpp/non-type-template-param/TestCppNonTypeTemplateParam.py (1853 of 2474)
PASS: lldb-unit :: Host/./HostTests/HostInfoTest.GetHostname (1854 of 2474)
PASS: lldb-api :: commands/expression/import-std-module/stack/TestStackFromStdModule.py (1855 of 2474)
PASS: lldb-api :: functionalities/inferior-assert/TestInferiorAssert.py (1856 of 2474)
PASS: lldb-shell :: ObjectFile/ELF/PT_LOAD-empty.yaml (1857 of 2474)
PASS: lldb-api :: tools/lldb-vscode/breakpoint/TestVSCode_setFunctionBreakpoints.py (1858 of 2474)
PASS: lldb-api :: functionalities/plugins/command_plugin/TestPluginCommands.py (1859 of 2474)
PASS: lldb-api :: functionalities/data-formatter/hexcaps/TestDataFormatterHexCaps.py (1860 of 2474)
PASS: lldb-api :: tools/lldb-vscode/console/TestVSCode_redirection_to_console.py (1861 of 2474)
PASS: lldb-unit :: Utility/./UtilityTests/BroadcasterTest.EventTypeHasListeners (1862 of 2474)
PASS: lldb-shell :: Commands/command-disassemble-process.yaml (1863 of 2474)
PASS: lldb-api :: lang/cpp/sizeof/TestCPPSizeof.py (1864 of 2474)
PASS: lldb-unit :: Utility/./UtilityTests/StringExtractorTest.GetHexBytesAvail_Partial (1865 of 2474)
PASS: lldb-api :: macosx/add-dsym/TestAddDsymDownload.py (1866 of 2474)
UNSUPPORTED: lldb-shell :: Subprocess/vfork-follow-child.test (1867 of 2474)
PASS: lldb-api :: functionalities/breakpoint/scripted_bkpt/TestScriptedResolver.py (1868 of 2474)
PASS: lldb-unit :: Expression/./ExpressionTests/DWARFExpression.DW_OP_convert (1869 of 2474)
PASS: lldb-shell :: SymbolFile/DWARF/x86/find-function-regex.cpp (1870 of 2474)
PASS: lldb-api :: lang/cpp/elaborated-types/TestElaboratedTypes.py (1871 of 2474)
PASS: lldb-unit :: Utility/./UtilityTests/StringListTest.LongestCommonPrefixSingleElement (1872 of 2474)
PASS: lldb-api :: commands/expression/import-std-module/list/TestListFromStdModule.py (1873 of 2474)
PASS: lldb-api :: lang/c/bitfields/TestBitfields.py (1874 of 2474)
PASS: lldb-unit :: Utility/./UtilityTests/RangeTest.Clear (1875 of 2474)
PASS: lldb-api :: commands/expression/char/TestExprsChar.py (1876 of 2474)
PASS: lldb-unit :: Utility/./UtilityTests/EnvironmentTest.EnvpConversion (1877 of 2474)
PASS: lldb-shell :: SymbolFile/DWARF/clang-ast-from-dwarf-objc-property.m (1878 of 2474)
PASS: lldb-unit :: Expression/./ExpressionTests/DiagnosticManagerTest.GetStringMultiline (1879 of 2474)
PASS: lldb-unit :: Core/./LLDBCoreTests/FormatEntityTest.DefinitionConstructionNameAndString (1880 of 2474)
PASS: lldb-api :: commands/help/TestHelp.py (1881 of 2474)
PASS: lldb-api :: functionalities/load_using_paths/TestLoadUsingPaths.py (1882 of 2474)
PASS: lldb-api :: commands/expression/call-throws/TestCallThatThrows.py (1883 of 2474)
PASS: lldb-api :: commands/watchpoints/watchpoint_commands/command/TestWatchpointCommandPython.py (1884 of 2474)
PASS: lldb-shell :: Breakpoint/single-file-split-dwarf.test (1885 of 2474)
PASS: lldb-api :: commands/frame/language/TestGuessLanguage.py (1886 of 2474)
PASS: lldb-shell :: Breakpoint/case-sensitive.test (1887 of 2474)
PASS: lldb-api :: functionalities/breakpoint/breakpoint_command/TestBreakpointCommand.py (1888 of 2474)
UNSUPPORTED: lldb-api :: benchmarks/frame_variable/TestFrameVariableResponse.py (1889 of 2474)
PASS: lldb-unit :: Core/./LLDBCoreTests/DumpDataExtractorTest.ItemByteSizeErrors (1890 of 2474)
PASS: lldb-api :: commands/target/stop-hook/disable/TestTargetStopHookDisable.py (1891 of 2474)
PASS: lldb-api :: functionalities/breakpoint/global_constructor/TestBreakpointInGlobalConstructor.py (1892 of 2474)
PASS: lldb-unit :: Utility/./UtilityTests/ReproducerTest.SetReplay (1893 of 2474)
PASS: lldb-shell :: SymbolFile/NativePDB/ast-functions.cpp (1894 of 2474)
PASS: lldb-unit :: Utility/./UtilityTests/RangeTest.NotEqualInvalid (1895 of 2474)
PASS: lldb-api :: python_api/symbol-context/TestSymbolContext.py (1896 of 2474)
PASS: lldb-api :: functionalities/data-formatter/data-formatter-cpp/TestDataFormatterCpp.py (1897 of 2474)
PASS: lldb-unit :: Host/./HostTests/PipeTest.CreateWithUniqueName (1898 of 2474)
PASS: lldb-unit :: Expression/./ExpressionTests/DiagnosticManagerTest.AppendMessageAttachToLastDiag (1899 of 2474)
PASS: lldb-api :: api/multiple-debuggers/TestMultipleDebuggers.py (1900 of 2474)
PASS: lldb-unit :: Language/Highlighting/./HighlighterTests/HighlighterTest.ClangTrailingBackslashWithWhitespace (1901 of 2474)
PASS: lldb-api :: functionalities/gdb_remote_client/TestNoLocalFile.py (1902 of 2474)
UNSUPPORTED: lldb-api :: functionalities/data-formatter/data-formatter-stl/libstdcpp/list/TestDataFormatterStdList.py (1903 of 2474)
PASS: lldb-unit :: Process/minidump/./LLDBMinidumpTests/MinidumpParserTest.MinidumpModuleOrder (1904 of 2474)
PASS: lldb-api :: functionalities/wrong_commands/TestWrongCommands.py (1905 of 2474)
PASS: lldb-unit :: Target/./TargetTests/MemoryRegionInfoTest.Formatv (1906 of 2474)
PASS: lldb-unit :: ScriptInterpreter/Python/./ScriptInterpreterPythonTests/PythonDataObjectsTest.TestExtractingUInt64ThroughStructuredData (1907 of 2474)
UNSUPPORTED: lldb-shell :: ScriptInterpreter/Lua/bindings.test (1908 of 2474)
PASS: lldb-api :: python_api/name_lookup/TestNameLookup.py (1909 of 2474)
PASS: lldb-unit :: Utility/./UtilityTests/ArgsTest.TestTrailingBackslash (1910 of 2474)
PASS: lldb-api :: commands/expression/radar_9531204/TestPrintfAfterUp.py (1911 of 2474)
PASS: lldb-unit :: Utility/./UtilityTests/ScalarTest.LongLongAssigmentOperator (1912 of 2474)
PASS: lldb-api :: lang/cpp/template-arguments/TestCppTemplateArguments.py (1913 of 2474)
PASS: lldb-api :: functionalities/thread/exit_during_expression/TestExitDuringExpression.py (1914 of 2474)
PASS: lldb-api :: functionalities/target_var/no_vars/TestTargetVarNoVars.py (1915 of 2474)
PASS: lldb-unit :: Platform/./LLDBPlatformTests/PlatformDarwinTest.GetCompatibleArchARMv6m (1916 of 2474)
PASS: lldb-unit :: Utility/./UtilityTests/EventTest.DumpEventDataBytes (1917 of 2474)
PASS: lldb-api :: functionalities/show_location/TestShowLocationDwarf5.py (1918 of 2474)
PASS: lldb-shell :: ScriptInterpreter/Python/command_import.test (1919 of 2474)
PASS: lldb-unit :: ScriptInterpreter/Python/./ScriptInterpreterPythonTests/PythonDataObjectsTest.TestPythonListToStructuredList (1920 of 2474)
PASS: lldb-unit :: Utility/./UtilityTests/StatusTest.ErrorCodeConstructor (1921 of 2474)
PASS: lldb-unit :: Utility/./UtilityTests/UriParserTest.BadPort (1922 of 2474)
PASS: lldb-unit :: Utility/./UtilityTests/DataExtractorTest.GetFloatUnaligned (1923 of 2474)
PASS: lldb-api :: python_api/frame/get-variables/TestGetVariables.py (1924 of 2474)
PASS: lldb-api :: api/listeners/TestListener.py (1925 of 2474)
UNSUPPORTED: lldb-shell :: Register/x86-gp-write.test (1926 of 2474)
PASS: lldb-api :: lang/c/function_types/TestFunctionTypes.py (1927 of 2474)
PASS: lldb-api :: functionalities/thread/concurrent_events/TestConcurrentTwoBreakpointsOneWatchpoint.py (1928 of 2474)
PASS: lldb-unit :: Utility/./UtilityTests/ListenerTest.GetEventWait (1929 of 2474)
PASS: lldb-api :: commands/expression/call-function/TestCallStopAndContinue.py (1930 of 2474)
PASS: lldb-api :: lang/cpp/exceptions/TestCPPExceptionBreakpoints.py (1931 of 2474)
PASS: lldb-api :: lang/c/builtin-types/TestCBuiltinTypes.py (1932 of 2474)
PASS: lldb-unit :: ObjectFile/Breakpad/./ObjectFileBreakpadTests/FileRecord.parse (1933 of 2474)
PASS: lldb-unit :: Utility/./UtilityTests/RangeTest.ContainsRange (1934 of 2474)
PASS: lldb-unit :: ScriptInterpreter/Python/./ScriptInterpreterPythonTests/PythonDataObjectsTest.TestPythonStringToStructuredString (1935 of 2474)
PASS: lldb-unit :: Utility/./UtilityTests/StringListTest.AppendStringStdString (1936 of 2474)
PASS: lldb-api :: lang/objc/objc-struct-argument/TestObjCStructArgument.py (1937 of 2474)
PASS: lldb-unit :: Utility/./UtilityTests/BinaryStreamTest.PutSLEB128ThreeBytes (1938 of 2474)
PASS: lldb-unit :: debugserver/./debugserverTests/RNBSocket.LoopBackConnectIPv6 (1939 of 2474)
PASS: lldb-unit :: Utility/./UtilityTests/StringListTest.InsertStringAtIndexStart (1940 of 2474)
UNSUPPORTED: lldb-shell :: SymbolFile/DWARF/split-dwarf-expression-eval-bug.cpp (1941 of 2474)
PASS: lldb-shell :: ObjectFile/ELF/PT_LOAD-overlap.yaml (1942 of 2474)
PASS: lldb-api :: commands/expression/call-function/TestCallBuiltinFunction.py (1943 of 2474)
UNSUPPORTED: lldb-api :: functionalities/asan/TestReportData.py (1944 of 2474)
PASS: lldb-api :: lang/objc/modules-objc-property/TestModulesObjCProperty.py (1945 of 2474)
PASS: lldb-shell :: Register/Core/x86-32-linux-fp.test (1946 of 2474)
PASS: lldb-unit :: Utility/./UtilityTests/AnsiTerminal.Unknown (1947 of 2474)
PASS: lldb-api :: functionalities/multidebugger_commands/TestMultipleDebuggersCommands.py (1948 of 2474)
UNSUPPORTED: lldb-shell :: Register/x86-64-xmm16-read.test (1949 of 2474)
PASS: lldb-unit :: Utility/./UtilityTests/BinaryStreamTest.PutULEB128ThreeBytes (1950 of 2474)
PASS: lldb-unit :: Utility/./UtilityTests/StringListTest.GetSize (1951 of 2474)
PASS: lldb-unit :: SymbolFile/NativePDB/./SymbolFileNativePDBTests/PDBFPOProgramToDWARFExpressionTests.MultipleIndependentAssignments (1952 of 2474)
PASS: lldb-unit :: DataFormatter/./LLDBFormatterTests/StringPrinterTests.CxxUTF8 (1953 of 2474)
PASS: lldb-api :: lang/objc/foundation/TestObjCMethodsNSArray.py (1954 of 2474)
PASS: lldb-unit :: Process/Utility/./ProcessUtilityTests/MemoryTagManagerAArch64MTETest.ExpandToGranule (1955 of 2474)
PASS: lldb-api :: commands/watchpoints/watchpoint_set_command/TestWatchLocationWithWatchSet.py (1956 of 2474)
PASS: lldb-api :: python_api/sbvalue_const_addrof/TestSBValueConstAddrOf.py (1957 of 2474)
PASS: lldb-shell :: SymbolFile/DWARF/x86/DW_AT_const_value.s (1958 of 2474)
UNSUPPORTED: lldb-api :: lang/objc/modules-update/TestClangModulesUpdate.py (1959 of 2474)
PASS: lldb-api :: functionalities/data-formatter/data-formatter-caching/TestDataFormatterCaching.py (1960 of 2474)
PASS: lldb-unit :: Utility/./UtilityTests/StringListTest.InsertStringAtIndexOutOfBounds (1961 of 2474)
PASS: lldb-unit :: Symbol/./SymbolTests/TestClangASTImporter.ImportInvalidType (1962 of 2474)
PASS: lldb-unit :: Utility/./UtilityTests/BinaryStreamTest.PutSLEB128EightBytes (1963 of 2474)
PASS: lldb-unit :: Utility/./UtilityTests/BinaryStreamTest.PutULEB128NineBytes (1964 of 2474)
PASS: lldb-unit :: Host/./HostTests/XML.GetAs (1965 of 2474)
PASS: lldb-api :: lang/cpp/llvm-style/TestLLVMStyle.py (1966 of 2474)
PASS: lldb-unit :: Host/./HostTests/SocketTests/SocketTest.DomainListenConnectAccept/ipv6 (1967 of 2474)
UNSUPPORTED: lldb-api :: benchmarks/libcxxmap/TestBenchmarkLibcxxMap.py (1968 of 2474)
PASS: lldb-shell :: SymbolFile/DWARF/x86/dir-separator-no-comp-dir.s (1969 of 2474)
PASS: lldb-unit :: Utility/./UtilityTests/UUIDTest.RelationalOperators (1970 of 2474)
PASS: lldb-shell :: Commands/command-regex-unalias.test (1971 of 2474)
PASS: lldb-shell :: Host/TestCustomShell.test (1972 of 2474)
PASS: lldb-api :: tools/lldb-server/thread-name/TestGdbRemoteThreadName.py (1973 of 2474)
PASS: lldb-unit :: ObjectFile/MachO/./ObjectFileMachOTests/ObjectFileMachOTest.ModuleFromSharedCacheInfo (1974 of 2474)
PASS: lldb-api :: python_api/value/TestValueAPI.py (1975 of 2474)
PASS: lldb-shell :: Commands/command-regex-delete.test (1976 of 2474)
PASS: lldb-api :: tools/lldb-server/TestGdbRemote_vCont.py (1977 of 2474)
PASS: lldb-api :: lang/objc/objc-runtime-ivars/TestRuntimeIvars.py (1978 of 2474)
PASS: lldb-shell :: Process/TestEnvironment.test (1979 of 2474)
PASS: lldb-api :: lang/objc/complete-type-check/TestObjCIsTypeComplete.py (1980 of 2474)
PASS: lldb-unit :: Platform/./LLDBPlatformTests/PlatformDarwinTest.GetCompatibleArchARMv7 (1981 of 2474)
PASS: lldb-unit :: Host/./HostTests/SocketTests/SocketTest.DomainGetConnectURI/ipv4 (1982 of 2474)
PASS: lldb-api :: commands/expression/namespace_local_var_same_name_obj_c/TestNamespaceLocalVarSameNameObjC.py (1983 of 2474)
PASS: lldb-shell :: Commands/command-source.test (1984 of 2474)
PASS: lldb-api :: functionalities/thread/concurrent_events/TestConcurrentBreakpointDelayBreakpointOneSignal.py (1985 of 2474)
PASS: lldb-shell :: Subprocess/fork-follow-parent-wp.test (1986 of 2474)
PASS: lldb-unit :: tools/lldb-server/tests/./LLDBServerTests/TestBase.LaunchModePreservesEnvironment (1987 of 2474)
PASS: lldb-unit :: Host/./HostTests/FileSystemTest.Resolve (1988 of 2474)
PASS: lldb-shell :: SymbolFile/DWARF/x86/DW_AT_low_pc-addrx.s (1989 of 2474)
PASS: lldb-unit :: Utility/./UtilityTests/Flags.AllSet (1990 of 2474)
PASS: lldb-shell :: Settings/TestLineMarkerColor.test (1991 of 2474)
PASS: lldb-shell :: Register/x86-multithread-write.test (1992 of 2474)
PASS: lldb-shell :: SymbolFile/DWARF/x86/dir-separator-posix.s (1993 of 2474)
PASS: lldb-shell :: Subprocess/fork-follow-parent.test (1994 of 2474)
PASS: lldb-unit :: Process/gdb-remote/./ProcessGdbRemoteTests/GDBRemoteCommunicationClientTest.TestPacketSpeedJSON (1995 of 2474)
PASS: lldb-shell :: Reproducer/TestRelativePath.test (1996 of 2474)
PASS: lldb-shell :: Heap/heap-cstr.test (1997 of 2474)
PASS: lldb-api :: commands/expression/import-std-module/vector-of-vectors/TestVectorOfVectorsFromStdModule.py (1998 of 2474)
PASS: lldb-unit :: Utility/./UtilityTests/AnsiTerminal.Basic (1999 of 2474)
PASS: lldb-shell :: Driver/TestSingleQuote.test (2000 of 2474)
PASS: lldb-unit :: SymbolFile/DWARF/./SymbolFileDWARFTests/SymbolFileDWARFTests.TestAbbrevOrder1Start5 (2001 of 2474)
PASS: lldb-api :: python_api/sbplatform/TestSBPlatform.py (2002 of 2474)
PASS: lldb-shell :: ObjectFile/ELF/PT_LOAD-overlap-PT_INTERP.yaml (2003 of 2474)
PASS: lldb-shell :: Settings/TestFrameFormatColor.test (2004 of 2474)
PASS: lldb-unit :: ScriptInterpreter/Python/./ScriptInterpreterPythonTests/PythonDataObjectsTest.TestGlobalNameResolutionWithDot (2005 of 2474)
PASS: lldb-unit :: Utility/./UtilityTests/OptionsWithRawTest.ArgsButNoDelimiter (2006 of 2474)
PASS: lldb-api :: api/multithreaded/TestMultithreaded.py (2007 of 2474)
PASS: lldb-api :: tools/lldb-server/commandline/TestStubSetSID.py (2008 of 2474)
PASS: lldb-unit :: Utility/./UtilityTests/Flags.AnyClear (2009 of 2474)
PASS: lldb-unit :: Expression/./ExpressionTests/DiagnosticManagerTest.PutStringSeverities (2010 of 2474)
PASS: lldb-unit :: Process/Utility/./ProcessUtilityTests/ProcMapTests/LinuxProcMapsTestFixture.ParseMapRegions/8 (2011 of 2474)
PASS: lldb-api :: functionalities/gdb_remote_client/TestMultiprocess.py (2012 of 2474)
UNSUPPORTED: lldb-shell :: ObjectFile/ELF/minidebuginfo-set-and-hit-breakpoint.test (2013 of 2474)
PASS: lldb-unit :: Utility/./UtilityTests/SerializationRountripTest.SerializeDeserializePod (2014 of 2474)
PASS: lldb-unit :: Process/minidump/./LLDBMinidumpTests/MinidumpParserTest.GetPid (2015 of 2474)
PASS: lldb-api :: lang/cpp/class_types/TestClassTypesDisassembly.py (2016 of 2474)
PASS: lldb-unit :: Core/./LLDBCoreTests/MangledTest.ResultForValidName (2017 of 2474)
PASS: lldb-unit :: Utility/./UtilityTests/RegularExpression.Empty (2018 of 2474)
PASS: lldb-api :: functionalities/data-formatter/data-formatter-stl/libcxx/shared_ptr/TestDataFormatterLibcxxSharedPtr.py (2019 of 2474)
PASS: lldb-unit :: Symbol/./SymbolTests/TestTypeSystemClang.TestGetEnumIntegerTypeUnexpectedType (2020 of 2474)
PASS: lldb-unit :: Utility/./UtilityTests/StringListTest.CopyListEmpty (2021 of 2474)
PASS: lldb-shell :: SymbolFile/DWARF/x86/dead-code-filtering.yaml (2022 of 2474)
PASS: lldb-api :: commands/expression/error-limit/TestExprErrorLimit.py (2023 of 2474)
PASS: lldb-unit :: Utility/./UtilityTests/StreamTeeTest.Assignment (2024 of 2474)
PASS: lldb-api :: python_api/sbstructureddata/TestStructuredDataAPI.py (2025 of 2474)
PASS: lldb-shell :: ObjectFile/Breakpad/uuid-matching-mac.test (2026 of 2474)
UNSUPPORTED: lldb-api :: commands/watchpoints/watch_tagged_addr/TestWatchTaggedAddress.py (2027 of 2474)
PASS: lldb-unit :: Utility/./UtilityTests/DataExtractorTest.PeekData (2028 of 2474)
PASS: lldb-unit :: Symbol/./SymbolTests/TestTypeSystemClang.TestGetEnumIntegerTypeBasicTypes (2029 of 2474)
PASS: lldb-unit :: Language/Highlighting/./HighlighterTests/HighlighterTest.ClangScalarLiterals (2030 of 2474)
PASS: lldb-unit :: Utility/./UtilityTests/FileSpecTest.EqualDotsPosix (2031 of 2474)
PASS: lldb-api :: lang/cpp/dynamic-value/TestDynamicValue.py (2032 of 2474)
PASS: lldb-unit :: Utility/./UtilityTests/StreamTeeTest.DefaultConstructor (2033 of 2474)
PASS: lldb-api :: functionalities/tail_call_frames/inlining_and_tail_calls/TestInliningAndTailCalls.py (2034 of 2474)
PASS: lldb-api :: lang/cpp/incompatible-class-templates/TestCppIncompatibleClassTemplates.py (2035 of 2474)
PASS: lldb-unit :: Utility/./UtilityTests/ProcessInstanceInfo.Yaml (2036 of 2474)
PASS: lldb-api :: functionalities/plugins/python_os_plugin/stepping_plugin_threads/TestOSPluginStepping.py (2037 of 2474)
PASS: lldb-api :: commands/expression/class_template_specialization_empty_pack/TestClassTemplateSpecializationParametersHandling.py (2038 of 2474)
PASS: lldb-api :: commands/expression/regression-access-function-template-in-record/TestRegressionAccessFunctionTemplateInRecord.py (2039 of 2474)
PASS: lldb-unit :: Utility/./UtilityTests/LogChannelEnabledTest.log_options (2040 of 2474)
PASS: lldb-unit :: Interpreter/./InterpreterTests/CompletionTest.DirCompletionAbsolute (2041 of 2474)
PASS: lldb-api :: functionalities/tail_call_frames/cross_object/TestCrossObjectTailCalls.py (2042 of 2474)
PASS: lldb-unit :: Utility/./UtilityTests/ArgsTest.Yaml (2043 of 2474)
PASS: lldb-unit :: Language/Highlighting/./HighlighterTests/HighlighterTest.ClangStringLiterals (2044 of 2474)
PASS: lldb-api :: functionalities/data-formatter/data-formatter-stl/libcxx/iterator/TestDataFormatterLibccIterator.py (2045 of 2474)
PASS: lldb-api :: types/TestDoubleTypes.py (2046 of 2474)
PASS: lldb-api :: commands/source/info/TestSourceInfo.py (2047 of 2474)
UNSUPPORTED: lldb-shell :: Register/x86-ymm-read.test (2048 of 2474)
PASS: lldb-unit :: SymbolFile/NativePDB/./SymbolFileNativePDBTests/PDBFPOProgramToDWARFExpressionTests.InvalidAssignmentSingle (2049 of 2474)
PASS: lldb-api :: functionalities/step-vrs-interrupt/TestStepVrsInterruptTimeout.py (2050 of 2474)
UNSUPPORTED: lldb-api :: functionalities/tsan/basic/TestTsanBasic.py (2051 of 2474)
PASS: lldb-unit :: UnwindAssembly/x86/./UnwindAssemblyx86Tests/Testx86AssemblyInspectionEngine.TestDisassemblyMidFunctionEpilogues (2052 of 2474)
PASS: lldb-unit :: Utility/./UtilityTests/BinaryStreamTest.PutSLEB128Zero (2053 of 2474)
PASS: lldb-api :: commands/target/stop-hooks/TestStopHooks.py (2054 of 2474)
PASS: lldb-unit :: Utility/./UtilityTests/StreamTest.PutSLEB128 (2055 of 2474)
PASS: lldb-unit :: Core/./LLDBCoreTests/RichManglingContextTest.SwitchProvider (2056 of 2474)
PASS: lldb-unit :: UnwindAssembly/x86/./UnwindAssemblyx86Tests/Testx86AssemblyInspectionEngine.Test32BitOnlyInstruction (2057 of 2474)
PASS: lldb-shell :: ObjectFile/ELF/compressed-sections.yaml (2058 of 2474)
PASS: lldb-unit :: Utility/./UtilityTests/ArgsTest.ReplaceArgumentAtIndexShort (2059 of 2474)
PASS: lldb-shell :: Settings/TestDisassemblyFormat.test (2060 of 2474)
PASS: lldb-api :: functionalities/tail_call_frames/ambiguous_tail_call_seq2/TestAmbiguousTailCallSeq2.py (2061 of 2474)
PASS: lldb-api :: tools/lldb-vscode/evaluate/TestVSCode_evaluate.py (2062 of 2474)
PASS: lldb-unit :: Utility/./UtilityTests/StreamTest.PutHex32ByteOrderBig (2063 of 2474)
PASS: lldb-shell :: ObjectFile/ELF/riscv-arch.yaml (2064 of 2474)
UNSUPPORTED: lldb-api :: commands/trace/TestTraceDumpInfo.py (2065 of 2474)
PASS: lldb-api :: functionalities/memory/find/TestMemoryFind.py (2066 of 2474)
PASS: lldb-api :: commands/reproducer/invalid-args/TestInvalidArgsReproducer.py (2067 of 2474)
PASS: lldb-api :: types/TestLongTypesExpr.py (2068 of 2474)
PASS: lldb-shell :: Reproducer/TestVersionCheck.test (2069 of 2474)
PASS: lldb-unit :: Utility/./UtilityTests/ArchSpecTest.YAML (2070 of 2474)
PASS: lldb-unit :: Utility/./UtilityTests/StringExtractorTest.GetU64LittleEndian (2071 of 2474)
PASS: lldb-unit :: Language/Highlighting/./HighlighterTests/HighlighterTest.ClangCursorOutOfBounds (2072 of 2474)
PASS: lldb-shell :: Reproducer/TestDiscard.test (2073 of 2474)
PASS: lldb-unit :: Core/./LLDBCoreTests/MangledTest.ResultForBlockInvocation (2074 of 2474)
PASS: lldb-unit :: debugserver/./debugserverTests/RNBSocket.LoopBackListenIPv6 (2075 of 2474)
PASS: lldb-unit :: Symbol/./SymbolTests/DWARFCallFrameInfoTest.Basic_eh (2076 of 2474)
PASS: lldb-unit :: Process/minidump/./LLDBMinidumpTests/MinidumpParserTest.GetFilteredModuleList (2077 of 2474)
PASS: lldb-unit :: SymbolFile/DWARF/./SymbolFileDWARFTests/SymbolFileDWARFTests.TestAbbrevInvalidNULLTag (2078 of 2474)
PASS: lldb-api :: functionalities/multiword-commands/TestMultiWordCommands.py (2079 of 2474)
UNSUPPORTED: lldb-api :: lang/cpp/function-template-parameter-pack/TestFunctionTemplateParameterPack.py (2080 of 2474)
PASS: lldb-shell :: ScriptInterpreter/Python/Crashlog/parser_text.test (2081 of 2474)
PASS: lldb-unit :: Host/./HostTests/Host.GetEnvironment (2082 of 2474)
PASS: lldb-unit :: Utility/./UtilityTests/RangeTest.ClearWithStarAddress (2083 of 2474)
PASS: lldb-unit :: ScriptInterpreter/Python/./ScriptInterpreterPythonTests/PythonDataObjectsTest.TestPythonDictionaryValueEquality (2084 of 2474)
PASS: lldb-api :: functionalities/dead-strip/TestDeadStrip.py (2085 of 2474)
PASS: lldb-unit :: Target/./TargetTests/ModuleCacheTest.GetAndPutStrangeHostname (2086 of 2474)
PASS: lldb-api :: functionalities/thread/concurrent_events/TestConcurrentNWatchNBreak.py (2087 of 2474)
PASS: lldb-api :: lang/c/offsetof/TestOffsetof.py (2088 of 2474)
PASS: lldb-unit :: Process/gdb-remote/./ProcessGdbRemoteTests/GDBRemoteCommunicationClientTest.GetQOffsets (2089 of 2474)
PASS: lldb-api :: commands/command/regex/TestRegexCommand.py (2090 of 2474)
PASS: lldb-unit :: ScriptInterpreter/Python/./ScriptInterpreterPythonTests/PythonDataObjectsTest.TestScript (2091 of 2474)
UNSUPPORTED: lldb-api :: iohandler/unicode/TestUnicode.py (2092 of 2474)
PASS: lldb-api :: functionalities/gdb_remote_client/TestRemoteRegNums.py (2093 of 2474)
PASS: lldb-unit :: Host/./HostTests/TerminalTest.SetCanonical (2094 of 2474)
PASS: lldb-unit :: Utility/./UtilityTests/CompletionRequest.TryCompleteCurrentArgBad (2095 of 2474)
PASS: lldb-shell :: ObjectFile/ELF/PT_LOAD.yaml (2096 of 2474)
PASS: lldb-shell :: SymbolFile/NativePDB/ast-types.cpp (2097 of 2474)
PASS: lldb-unit :: Utility/./UtilityTests/BinaryStreamTest.PutSLEB128NineBytes (2098 of 2474)
PASS: lldb-unit :: Symbol/./SymbolTests/TestTypeSystemClang.TestDisplayName (2099 of 2474)
PASS: lldb-api :: lang/cpp/class-loading-via-member-typedef/TestClassLoadingViaMemberTypedef.py (2100 of 2474)
PASS: lldb-unit :: Expression/./ExpressionTests/DiagnosticManagerTest.AppendMessageSubsequentDiags (2101 of 2474)
PASS: lldb-shell :: SymbolFile/DWARF/x86/DW_TAG_variable-DW_AT_const_value.s (2102 of 2474)
PASS: lldb-api :: functionalities/data-formatter/stringprinter/TestStringPrinter.py (2103 of 2474)
PASS: lldb-shell :: BuildScript/modes.test (2104 of 2474)
PASS: lldb-api :: iohandler/resize/TestIOHandlerResizeNoEditline.py (2105 of 2474)
PASS: lldb-unit :: Expression/./ExpressionTests/DiagnosticManagerTest.HasFixits (2106 of 2474)
PASS: lldb-shell :: Driver/TestNoUseColor.test (2107 of 2474)
PASS: lldb-unit :: Utility/./UtilityTests/Flags.AnySet (2108 of 2474)
PASS: lldb-unit :: Symbol/./SymbolTests/TestTypeSystemClang.TestUnifyAccessSpecifiers (2109 of 2474)
PASS: lldb-api :: tools/lldb-vscode/correct-thread/TestVSCode_correct_thread.py (2110 of 2474)
PASS: lldb-unit :: Utility/./UtilityTests/BinaryStreamTest.PutSLEB128TwoBytes (2111 of 2474)
UNSUPPORTED: lldb-api :: tools/lldb-vscode/disconnect/TestVSCode_disconnect.py (2112 of 2474)
PASS: lldb-shell :: Quit/TestQuitExitCodeHexA.test (2113 of 2474)
PASS: lldb-api :: lang/objc/modules-compile-error/TestModulesCompileError.py (2114 of 2474)
PASS: lldb-shell :: Minidump/Windows/broken-unwind.test (2115 of 2474)
PASS: lldb-unit :: ScriptInterpreter/Python/./ScriptInterpreterPythonTests/PythonDataObjectsTest.TestPythonByteArray (2116 of 2474)
PASS: lldb-unit :: Utility/./UtilityTests/ReproducerTest.SetCapture (2117 of 2474)
PASS: lldb-unit :: ScriptInterpreter/Python/./ScriptInterpreterPythonTests/PythonDataObjectsTest.TestPythonTupleInitializerList (2118 of 2474)
UNSUPPORTED: lldb-api :: tools/lldb-server/registers-target-xml-reading/TestGdbRemoteTargetXmlPacket.py (2119 of 2474)
PASS: lldb-api :: lang/c/local_variables/TestLocalVariables.py (2120 of 2474)
PASS: lldb-api :: commands/expression/import-std-module/missing-module-sources/TestStdModuleSourcesMissing.py (2121 of 2474)
PASS: lldb-shell :: SymbolFile/DWARF/x86/DW_AT_decl_file-DW_AT_specification-crosscu.s (2122 of 2474)
PASS: lldb-unit :: Utility/./UtilityTests/FileSpecTest.Equal (2123 of 2474)
PASS: lldb-unit :: Core/./LLDBCoreTests/RichManglingContextTest.FromCxxMethodName (2124 of 2474)
PASS: lldb-shell :: Settings/TestEchoCommands.test (2125 of 2474)
PASS: lldb-unit :: Utility/./UtilityTests/FileSpecTest.Yaml (2126 of 2474)
PASS: lldb-api :: macosx/debugserver-exit-code/TestDebugServerExitCode.py (2127 of 2474)
PASS: lldb-unit :: Core/./LLDBCoreTests/MangledTest.NameIndexes_FindFunctionSymbols (2128 of 2474)
PASS: lldb-api :: lang/cpp/stl/TestStdCXXDisassembly.py (2129 of 2474)
PASS: lldb-unit :: Process/minidump/./LLDBMinidumpTests/MinidumpParserTest.GetExceptionStream (2130 of 2474)
PASS: lldb-api :: lang/c/sizeof/TestCSizeof.py (2131 of 2474)
PASS: lldb-unit :: Utility/./UtilityTests/UriParserTest.Empty (2132 of 2474)
PASS: lldb-shell :: SymbolFile/DWARF/x86/find-qualified-variable.cpp (2133 of 2474)
PASS: lldb-shell :: SymbolFile/DWARF/x86/dwp.s (2134 of 2474)
PASS: lldb-api :: functionalities/type_lookup/TestTypeLookup.py (2135 of 2474)
UNSUPPORTED: lldb-shell :: Subprocess/vfork-follow-child-softbp.test (2136 of 2474)
PASS: lldb-unit :: Language/Highlighting/./HighlighterTests/HighlighterTest.ClangOperators (2137 of 2474)
PASS: lldb-unit :: Utility/./UtilityTests/CompletionRequest.DuplicateFiltering (2138 of 2474)
PASS: lldb-unit :: Language/Highlighting/./HighlighterTests/HighlighterTest.HighlighterSelectionType (2139 of 2474)
PASS: lldb-api :: commands/expression/call-function/TestCallUserDefinedFunction.py (2140 of 2474)
PASS: lldb-unit :: Language/Highlighting/./HighlighterTests/HighlighterTest.ClangUnterminatedString (2141 of 2474)
PASS: lldb-api :: functionalities/thread/thread_specific_break/TestThreadSpecificBreakpoint.py (2142 of 2474)
UNSUPPORTED: lldb-shell :: SymbolFile/PDB/function-level-linking.test (2143 of 2474)
PASS: lldb-shell :: SymbolFile/NativePDB/function-types-builtins.cpp (2144 of 2474)
PASS: lldb-api :: lang/objc/objc-new-syntax/TestObjCNewSyntaxDictionary.py (2145 of 2474)
PASS: lldb-api :: lang/c/shared_lib/TestSharedLib.py (2146 of 2474)
PASS: lldb-unit :: Platform/./LLDBPlatformTests/PlatformDarwinTest.GetCompatibleArchARMv7k (2147 of 2474)
PASS: lldb-unit :: Utility/./UtilityTests/ArgsTest.TestUnknownEscape (2148 of 2474)
PASS: lldb-unit :: Utility/./UtilityTests/StreamTeeTest.CopyConstructor (2149 of 2474)
PASS: lldb-api :: python_api/sberror/TestSBError.py (2150 of 2474)
PASS: lldb-shell :: SymbolFile/DWARF/x86/find-method.cpp (2151 of 2474)
PASS: lldb-api :: api/command-return-object/TestSBCommandReturnObject.py (2152 of 2474)
PASS: lldb-api :: functionalities/data-formatter/cstring-utf8-summary/TestCstringUnicode.py (2153 of 2474)
UNSUPPORTED: lldb-api :: iohandler/autosuggestion/TestAutosuggestion.py (2154 of 2474)
PASS: lldb-unit :: debugserver/./debugserverTests/JSON.Parse (2155 of 2474)
PASS: lldb-shell :: Driver/TestUseColor.test (2156 of 2474)
PASS: lldb-unit :: Utility/./UtilityTests/ArgsTest.TestSingleArg (2157 of 2474)
UNSUPPORTED: lldb-api :: commands/register/register/aarch64_sve_registers/rw_access_static_config/TestSVERegisters.py (2158 of 2474)
PASS: lldb-api :: functionalities/breakpoint/move_nearest/TestMoveNearest.py (2159 of 2474)
PASS: lldb-api :: functionalities/deleted-executable/TestDeletedExecutable.py (2160 of 2474)
PASS: lldb-unit :: SymbolFile/DWARF/./SymbolFileDWARFTests/SymbolFileDWARFTests.ParseArangesNonzeroSegmentSize (2161 of 2474)
PASS: lldb-api :: types/TestFloatTypes.py (2162 of 2474)
PASS: lldb-api :: commands/target/auto-install-main-executable/TestAutoInstallMainExecutable.py (2163 of 2474)
PASS: lldb-shell :: SymbolFile/DWARF/x86/split-dwarf-multiple-cu.ll (2164 of 2474)
UNSUPPORTED: lldb-shell :: ScriptInterpreter/Lua/breakpoint_function_callback.test (2165 of 2474)
PASS: lldb-api :: lang/objc/modules-non-objc-target/TestObjCModulesNonObjCTarget.py (2166 of 2474)
PASS: lldb-shell :: Commands/command-script-import.test (2167 of 2474)
PASS: lldb-shell :: ScriptInterpreter/Python/silent_command_script_import.test (2168 of 2474)
PASS: lldb-unit :: Utility/./UtilityTests/VMRange.Reset (2169 of 2474)
PASS: lldb-unit :: Process/Utility/./ProcessUtilityTests/MemoryTagManagerAArch64MTETest.GetLogicalTag (2170 of 2474)
PASS: lldb-api :: functionalities/data-formatter/data-formatter-stl/libstdcpp/unique_ptr/invalid/TestDataFormatterInvalidStdUniquePtr.py (2171 of 2474)
PASS: lldb-api :: commands/expression/radar_9673664/TestExprHelpExamples.py (2172 of 2474)
PASS: lldb-unit :: Utility/./UtilityTests/ScalarTest.TruncOrExtendTo (2173 of 2474)
PASS: lldb-unit :: ScriptInterpreter/Python/./ScriptInterpreterPythonTests/PythonDataObjectsTest.TestObjectAttributes (2174 of 2474)
PASS: lldb-unit :: Utility/./UtilityTests/DataExtractorTest.GetSLEB128_bit63 (2175 of 2474)
PASS: lldb-unit :: Utility/./UtilityTests/AnsiTerminal.AtStart (2176 of 2474)
UNSUPPORTED: lldb-shell :: SymbolFile/PDB/class-layout.test (2177 of 2474)
PASS: lldb-unit :: Symbol/./SymbolTests/TestClangASTImporter.CanImportInvalidType (2178 of 2474)
PASS: lldb-api :: commands/expression/cast_int_to_anonymous_enum/TestCastIntToAnonymousEnum.py (2179 of 2474)
PASS: lldb-unit :: Core/./LLDBCoreTests/SourceLocationSpecTest.Compare (2180 of 2474)
PASS: lldb-unit :: Utility/./UtilityTests/LogChannelTest.List (2181 of 2474)
PASS: lldb-unit :: Utility/./UtilityTests/VASprintfTest.NoBufferResize (2182 of 2474)
PASS: lldb-unit :: UnwindAssembly/x86/./UnwindAssemblyx86Tests/Testx86AssemblyInspectionEngine.TestAddESP (2183 of 2474)
PASS: lldb-shell :: Register/Core/x86-64-freebsd-fp.test (2184 of 2474)
PASS: lldb-unit :: Utility/./UtilityTests/ArgsTest.ReplaceArgumentAtIndexFarOutOfRange (2185 of 2474)
PASS: lldb-unit :: Utility/./UtilityTests/StreamTeeTest.GetStreamAtIndexOutOfBounds (2186 of 2474)
PASS: lldb-api :: lang/c/strings/TestCStrings.py (2187 of 2474)
PASS: lldb-api :: functionalities/gdb_remote_client/TestPlatformClient.py (2188 of 2474)
PASS: lldb-unit :: Host/./HostTests/SocketTests/SocketTest.DomainGetConnectURI/ipv6 (2189 of 2474)
UNSUPPORTED: lldb-shell :: Register/x86-gp-read.test (2190 of 2474)
PASS: lldb-unit :: Process/Utility/./ProcessUtilityTests/MemoryTagManagerAArch64MTETest.UnpackTagsData (2191 of 2474)
PASS: lldb-shell :: ObjectFile/ELF/basic-info.yaml (2192 of 2474)
PASS: lldb-unit :: Utility/./UtilityTests/StreamTest.AddressEmptyPrefix (2193 of 2474)
PASS: lldb-api :: lang/cpp/incomplete-types/TestCppIncompleteTypes.py (2194 of 2474)
PASS: lldb-api :: tools/lldb-server/TestAppleSimulatorOSType.py (2195 of 2474)
PASS: lldb-unit :: Utility/./UtilityTests/StringExtractorGDBRemoteTest.GetPidTid (2196 of 2474)
PASS: lldb-api :: commands/expression/deleting-implicit-copy-constructor/TestDeletingImplicitCopyConstructor.py (2197 of 2474)
PASS: lldb-unit :: debugserver/./debugserverTests/RNBSocket.AnyListen (2198 of 2474)
PASS: lldb-unit :: Utility/./UtilityTests/BinaryStreamTest.PutULEB128TwoBytes (2199 of 2474)
PASS: lldb-unit :: Process/minidump/./LLDBMinidumpTests/RegisterContextMinidump.ConvertMinidumpContext_x86_64 (2200 of 2474)
PASS: lldb-unit :: ObjectFile/Breakpad/./ObjectFileBreakpadTests/PublicRecord.parse (2201 of 2474)
PASS: lldb-unit :: ObjectFile/Breakpad/./ObjectFileBreakpadTests/LineRecord.parse (2202 of 2474)
PASS: lldb-api :: python_api/interpreter/TestCommandInterpreterAPI.py (2203 of 2474)
UNSUPPORTED: lldb-shell :: BuildScript/toolchain-msvc.test (2204 of 2474)
PASS: lldb-api :: commands/process/signal/TestProcessSignal.py (2205 of 2474)
PASS: lldb-unit :: ScriptInterpreter/Python/./ScriptInterpreterPythonTests/PythonDataObjectsTest.TestPythonTupleToStructuredList (2206 of 2474)
PASS: lldb-shell :: ScriptInterpreter/Python/scripted_breakpoint_lua.test (2207 of 2474)
PASS: lldb-unit :: Symbol/./SymbolTests/TestTypeSystemClang.TestGetTypeClassNested (2208 of 2474)
PASS: lldb-api :: functionalities/gdb_remote_client/TestJLink6Armv7RegisterDefinition.py (2209 of 2474)
UNSUPPORTED: lldb-api :: functionalities/data-formatter/data-formatter-stl/libstdcpp/vector/TestDataFormatterStdVector.py (2210 of 2474)
PASS: lldb-unit :: Host/./HostTests/SocketTests/SocketTest.TCPListen0GetPort/ipv6 (2211 of 2474)
PASS: lldb-unit :: Language/Highlighting/./HighlighterTests/HighlighterTest.ClangCommas (2212 of 2474)
PASS: lldb-api :: functionalities/data-formatter/data-formatter-stl/libcxx/unique_ptr/TestDataFormatterLibcxxUniquePtr.py (2213 of 2474)
PASS: lldb-api :: functionalities/signal/handle-abrt/TestHandleAbort.py (2214 of 2474)
PASS: lldb-shell :: SymbolFile/NativePDB/disassembly.cpp (2215 of 2474)
PASS: lldb-unit :: UnwindAssembly/x86/./UnwindAssemblyx86Tests/Testx86AssemblyInspectionEngine.TestPushR15 (2216 of 2474)
PASS: lldb-shell :: Driver/TestCore.test (2217 of 2474)
PASS: lldb-api :: lang/cpp/template-function/TestTemplateFunctions.py (2218 of 2474)
PASS: lldb-api :: commands/frame/var-scope/TestFrameVariableScope.py (2219 of 2474)
PASS: lldb-api :: lang/cpp/diamond/TestCppDiamond.py (2220 of 2474)
PASS: lldb-unit :: UnwindAssembly/x86/./UnwindAssemblyx86Tests/Testx86AssemblyInspectionEngine.TestPopRBX (2221 of 2474)
PASS: lldb-api :: functionalities/data-formatter/parray/TestPrintArray.py (2222 of 2474)
PASS: lldb-api :: lang/objc/single-entry-dictionary/TestObjCSingleEntryDictionary.py (2223 of 2474)
UNSUPPORTED: lldb-api :: lang/objc/foundation/TestFoundationDisassembly.py (2224 of 2474)
PASS: lldb-api :: python_api/sbenvironment/TestSBEnvironment.py (2225 of 2474)
PASS: lldb-api :: functionalities/rerun/TestRerun.py (2226 of 2474)
UNSUPPORTED: lldb-api :: repl/clang/TestClangREPL.py (2227 of 2474)
PASS: lldb-api :: functionalities/breakpoint/breakpoint_by_file_colon_line/TestBreakpointByFileColonLine.py (2228 of 2474)
PASS: lldb-api :: commands/expression/import-std-module/conflicts/TestStdModuleWithConflicts.py (2229 of 2474)
PASS: lldb-shell :: Settings/TestDisableColor.test (2230 of 2474)
PASS: lldb-shell :: Minidump/memory-region-from-module.yaml (2231 of 2474)
PASS: lldb-unit :: Utility/./UtilityTests/StringListTest.SplitIntoLinesEmpty (2232 of 2474)
PASS: lldb-api :: functionalities/gdb_remote_client/TestRecognizeBreakpoint.py (2233 of 2474)
PASS: lldb-shell :: SymbolFile/Breakpad/line-table-missing-file.test (2234 of 2474)
PASS: lldb-api :: lang/cpp/alignas_base_class/TestAlignAsBaseClass.py (2235 of 2474)
PASS: lldb-unit :: Core/./LLDBCoreTests/MangledTest.EmptyForInvalidName (2236 of 2474)
PASS: lldb-unit :: Expression/./ExpressionTests/CppModuleConfigurationTest.UnrelatedLibrary (2237 of 2474)
PASS: lldb-unit :: Process/gdb-remote/./ProcessGdbRemoteTests/PortMapTest.FreePort (2238 of 2474)
PASS: lldb-unit :: Utility/./UtilityTests/StringListTest.JoinMultiCharSeparator (2239 of 2474)
PASS: lldb-unit :: UnwindAssembly/x86/./UnwindAssemblyx86Tests/Testx86AssemblyInspectionEngine.TestPushR12 (2240 of 2474)
PASS: lldb-unit :: Process/gdb-remote/./ProcessGdbRemoteTests/GDBRemoteCommunicationClientTest.ReadRegister (2241 of 2474)
PASS: lldb-api :: commands/settings/quoting/TestQuoting.py (2242 of 2474)
PASS: lldb-api :: macosx/stack-corefile/TestStackCorefile.py (2243 of 2474)
PASS: lldb-api :: tools/lldb-server/memory-allocation/TestGdbRemoteMemoryAllocation.py (2244 of 2474)
PASS: lldb-api :: functionalities/load_after_attach/TestLoadAfterAttach.py (2245 of 2474)
PASS: lldb-unit :: ObjectFile/Breakpad/./ObjectFileBreakpadTests/Record.classify (2246 of 2474)
PASS: lldb-unit :: Utility/./UtilityTests/CompletionRequest.TryCompleteCurrentArgMode (2247 of 2474)
PASS: lldb-unit :: Expression/./ExpressionTests/CppModuleConfigurationTest.UnknownLibCppFile (2248 of 2474)
UNSUPPORTED: lldb-api :: linux/aarch64/mte_memory_region/TestAArch64LinuxMTEMemoryRegion.py (2249 of 2474)
PASS: lldb-unit :: Utility/./UtilityTests/StringListTest.PopBack (2250 of 2474)
PASS: lldb-shell :: SymbolFile/DWARF/x86/find-variable-dwo.cpp (2251 of 2474)
PASS: lldb-api :: functionalities/breakpoint/breakpoint_options/TestBreakpointOptions.py (2252 of 2474)
PASS: lldb-api :: commands/log/basic/TestLogging.py (2253 of 2474)
PASS: lldb-unit :: Expression/./ExpressionTests/CppModuleConfigurationTest.MissingUsrInclude (2254 of 2474)
PASS: lldb-api :: commands/frame/diagnose/array/TestArray.py (2255 of 2474)
PASS: lldb-unit :: Utility/./UtilityTests/OptionsWithRawTest.EmptySuffix (2256 of 2474)
PASS: lldb-unit :: Utility/./UtilityTests/ArgsTest.EscapeLLDBCommandArgument (2257 of 2474)
PASS: lldb-unit :: Host/./HostTests/SocketTests/SocketTest.DecodeHostAndPort/ipv6 (2258 of 2474)
PASS: lldb-unit :: Utility/./UtilityTests/RangeTest.Union (2259 of 2474)
PASS: lldb-api :: python_api/watchpoint/watchlocation/TestTargetWatchAddress.py (2260 of 2474)
PASS: lldb-api :: functionalities/breakpoint/cpp/TestCPPBreakpointLocations.py (2261 of 2474)
PASS: lldb-shell :: ScriptInterpreter/Python/Crashlog/no_threadState.test (2262 of 2474)
PASS: lldb-api :: lang/cpp/pointer_to_member_type_depending_on_parent_size/TestPointerToMemberTypeDependingOnParentSize.py (2263 of 2474)
PASS: lldb-unit :: Utility/./UtilityTests/StringListTest.GetMaxStringLengthIncreasingSize (2264 of 2474)
PASS: lldb-api :: lang/objcxx/conflicting-names-class-update-utility-expr/TestObjCConflictingNamesForClassUpdateExpr.py (2265 of 2474)
PASS: lldb-shell :: Unwind/trap_frame_sym_ctx.test (2266 of 2474)
PASS: lldb-shell :: ObjectFile/MachO/symtab.yaml (2267 of 2474)
PASS: lldb-api :: lang/cpp/inlines/TestInlines.py (2268 of 2474)
PASS: lldb-api :: lang/cpp/accelerator-table/TestCPPAccelerator.py (2269 of 2474)
PASS: lldb-shell :: Register/Core/x86-32-linux-multithread.test (2270 of 2474)
PASS: lldb-api :: functionalities/data-formatter/data-formatter-synth/TestDataFormatterSynth.py (2271 of 2474)
PASS: lldb-unit :: Utility/./UtilityTests/LogTest.Register (2272 of 2474)
PASS: lldb-api :: functionalities/thread/state_after_expression/TestStateAfterExpression.py (2273 of 2474)
UNSUPPORTED: lldb-shell :: ScriptInterpreter/Lua/nested_sessions.test (2274 of 2474)
PASS: lldb-shell :: ObjectFile/Breakpad/sections-trailing-func.test (2275 of 2474)
PASS: lldb-unit :: SymbolFile/NativePDB/./SymbolFileNativePDBTests/PDBFPOProgramToDWARFExpressionTests.UnresolvedRegisterReference (2276 of 2474)
PASS: lldb-api :: commands/target/dump-symtab-demangle/TestDumpSymtabDemangle.py (2277 of 2474)
PASS: lldb-unit :: Utility/./UtilityTests/StringExtractorTest.GetHexBytes_FullString (2278 of 2474)
PASS: lldb-unit :: Utility/./UtilityTests/FileSpecTest.Match (2279 of 2474)
PASS: lldb-api :: functionalities/thread/jump/TestThreadJump.py (2280 of 2474)
PASS: lldb-api :: source-manager/TestSourceManager.py (2281 of 2474)
PASS: lldb-unit :: Utility/./UtilityTests/CompletionRequest.DuplicateFilteringWithComments (2282 of 2474)
UNSUPPORTED: lldb-api :: functionalities/data-formatter/data-formatter-stl/libstdcpp/string/TestDataFormatterStdString.py (2283 of 2474)
PASS: lldb-api :: functionalities/data-formatter/data-formatter-stl/libcxx/atomic/TestLibCxxAtomic.py (2284 of 2474)
UNSUPPORTED: lldb-shell :: Minidump/Windows/arm-fp-unwind.test (2285 of 2474)
PASS: lldb-api :: functionalities/thread/backtrace_limit/TestBacktraceLimit.py (2286 of 2474)
PASS: lldb-shell :: Register/x86-64-read.test (2287 of 2474)
PASS: lldb-unit :: Platform/./LLDBPlatformTests/PlatformDarwinTest.GetCompatibleArchARM64 (2288 of 2474)
PASS: lldb-unit :: Host/./HostTests/HostInfoTestInitialization.InitTwice (2289 of 2474)
PASS: lldb-api :: commands/watchpoints/watchpoint_on_vectors/TestValueOfVectorVariable.py (2290 of 2474)
PASS: lldb-api :: lang/cpp/forward-declared-template-specialization/TestCppForwardDeclaredTemplateSpecialization.py (2291 of 2474)
PASS: lldb-api :: functionalities/thread/concurrent_events/TestConcurrentDelayedCrashWithBreakpointWatchpoint.py (2292 of 2474)
PASS: lldb-api :: functionalities/breakpoint/inlined_breakpoints/TestInlinedBreakpoints.py (2293 of 2474)
PASS: lldb-api :: commands/expression/pr52257/TestExprCrash.py (2294 of 2474)
PASS: lldb-unit :: Process/gdb-remote/./ProcessGdbRemoteTests/GDBRemoteCommunicationClientTest.WriteRegister (2295 of 2474)
PASS: lldb-unit :: Host/./HostTests/SocketTests/SocketTest.UDPConnect/ipv6 (2296 of 2474)
PASS: lldb-api :: lang/c/enum_types/TestEnumTypes.py (2297 of 2474)
PASS: lldb-api :: commands/expression/import-std-module/weak_ptr/TestWeakPtrFromStdModule.py (2298 of 2474)
PASS: lldb-unit :: ScriptInterpreter/Python/./ScriptInterpreterPythonTests/PythonDataObjectsTest.TestGlobalNameResolutionNoDot (2299 of 2474)
PASS: lldb-api :: commands/expression/po_verbosity/TestPoVerbosity.py (2300 of 2474)
PASS: lldb-api :: commands/command/container/TestContainerCommands.py (2301 of 2474)
PASS: lldb-api :: tools/lldb-vscode/stackTrace/TestVSCode_stackTrace.py (2302 of 2474)
PASS: lldb-unit :: Utility/./UtilityTests/DataExtractorTest.GetDoubleUnaligned (2303 of 2474)
PASS: lldb-unit :: Utility/./UtilityTests/ArchSpecTest.MergeFromMachOUnknown (2304 of 2474)
PASS: lldb-unit :: Process/gdb-remote/./ProcessGdbRemoteTests/PortMapTest.AllowPort (2305 of 2474)
PASS: lldb-api :: functionalities/thread/concurrent_events/TestConcurrentCrashWithSignal.py (2306 of 2474)
PASS: lldb-unit :: Utility/./UtilityTests/ScalarTest.APIntConstructor (2307 of 2474)
PASS: lldb-unit :: Utility/./UtilityTests/UriParserTest.MinimalPath (2308 of 2474)
PASS: lldb-api :: functionalities/non-overlapping-index-variable-i/TestIndexVariable.py (2309 of 2474)
PASS: lldb-unit :: Expression/./ExpressionTests/DiagnosticManagerTest.AppendMessageNoDiag (2310 of 2474)
PASS: lldb-api :: functionalities/breakpoint/consecutive_breakpoints/TestConsecutiveBreakpoints.py (2311 of 2474)
FAIL: lldb-api :: functionalities/scripted_process/TestScriptedProcess.py (2312 of 2474)
******************** TEST 'lldb-api :: functionalities/scripted_process/TestScriptedProcess.py' FAILED ********************
Script:
--
/Users/buildslave/jenkins/workspace/lldb-cmake-sanitized/lldb-build/lldb-test-build.noindex/copied-python /Users/buildslave/jenkins/workspace/lldb-cmake-sanitized/llvm-project/lldb/test/API/dotest.py -u CXXFLAGS -u CFLAGS --codesign-identity lldb_codesign --arch x86_64 --build-dir /Users/buildslave/jenkins/workspace/lldb-cmake-sanitized/lldb-build/lldb-test-build.noindex -t --env TERM=vt100 --env LLVM_LIBS_DIR=/Users/buildslave/jenkins/workspace/lldb-cmake-sanitized/lldb-build/./lib --inferior-env ASAN_OPTIONS=detect_stack_use_after_return=1 --inferior-env DYLD_INSERT_LIBRARIES=/Users/buildslave/jenkins/workspace/lldb-cmake-sanitized/host-compiler/lib/clang/14.0.99/lib/darwin/libclang_rt.asan_osx_dynamic.dylib --arch x86_64 --build-dir /Users/buildslave/jenkins/workspace/lldb-cmake-sanitized/lldb-build/lldb-test-build.noindex --lldb-module-cache-dir /Users/buildslave/jenkins/workspace/lldb-cmake-sanitized/lldb-build/lldb-test-build.noindex/module-cache-lldb/lldb-api --clang-module-cache-dir /Users/buildslave/jenkins/workspace/lldb-cmake-sanitized/lldb-build/lldb-test-build.noindex/module-cache-clang/lldb-api --executable /Users/buildslave/jenkins/workspace/lldb-cmake-sanitized/lldb-build/./bin/lldb --compiler /Users/buildslave/jenkins/workspace/lldb-cmake-sanitized/host-compiler/bin/clang --dsymutil /Users/buildslave/jenkins/workspace/lldb-cmake-sanitized/lldb-build/./bin/dsymutil --llvm-tools-dir /Users/buildslave/jenkins/workspace/lldb-cmake-sanitized/lldb-build/./bin --lldb-libs-dir /Users/buildslave/jenkins/workspace/lldb-cmake-sanitized/lldb-build/./lib /Users/buildslave/jenkins/workspace/lldb-cmake-sanitized/llvm-project/lldb/test/API/functionalities/scripted_process -p TestScriptedProcess.py
--
Exit Code: -6

Hide Details

Command Output (stdout): -- lldb version 14.0.99 (http://labmaster3.local/git/llvm-project.git revision 8fb3f84484094230d563c1e4c1088755b7cde15b) clang revision 8fb3f84484094230d563c1e4c1088755b7cde15b llvm revision 8fb3f84484094230d563c1e4c1088755b7cde15b Name of the class that will manage the scripted process: 'stack_core_scripted_process.StackCoreScriptedProcess' Saving 69632 bytes of data for memory region at 0x7ffeefbef000

Hide Details

-- Command Output (stderr): -- ================================================================= ==63138==ERROR: AddressSanitizer: heap-use-after-free on address 0x6160002508a0 at pc 0x00010af22b30 bp 0x70000745ccf0 sp 0x70000745c4b8 READ of size 512 at 0x6160002508a0 thread T6 #0 0x10af22b2f in __asan_memcpy+0x1af (libclang_rt.asan_osx_dynamic.dylib:x86_64+0x44b2f) #1 0x1187df818 in lldb_private::DataExtractor::CopyByteOrderedData(unsigned long long, unsigned long long, void*, unsigned long long, lldb::ByteOrder) const DataExtractor.cpp:742 #2 0x118d6c85b in lldb_private::ScriptedProcess::DoReadMemory(unsigned long long, void*, unsigned long, lldb_private::Status&) ScriptedProcess.cpp:237 #3 0x118604abc in lldb_private::Process::ReadMemoryFromInferior(unsigned long long, void*, unsigned long, lldb_private::Status&) Process.cpp:2047 #4 0x1185bcf2f in lldb_private::MemoryCache::Read(unsigned long long, void*, unsigned long, lldb_private::Status&) Memory.cpp:229 #5 0x118645f11 in lldb_private::RegisterContext::ReadRegisterValueFromMemory(lldb_private::RegisterInfo const*, unsigned long long, unsigned int, lldb_private::RegisterValue&) RegisterContext.cpp:343 #6 0x118657c36 in lldb_private::RegisterContextUnwind::ReadRegisterValueFromRegisterLocation(lldb_private::UnwindLLDB::RegisterLocation, lldb_private::RegisterInfo const*, lldb_private::RegisterValue&) RegisterContextUnwind.cpp:1138 #7 0x1186555c3 in lldb_private::RegisterContextUnwind::ReadGPRValue(lldb::RegisterKind, unsigned int, unsigned long long&) RegisterContextUnwind.cpp:2143 #8 0x118649d45 in lldb_private::RegisterContextUnwind::InitializeNonZerothFrame() RegisterContextUnwind.cpp:343 #9 0x1186470b0 in lldb_private::RegisterContextUnwind::RegisterContextUnwind(lldb_private::Thread&, std::__1::shared_ptr<lldb_private::RegisterContextUnwind> const&, lldb_private::SymbolContext&, unsigned int, lldb_private::UnwindLLDB&) RegisterContextUnwind.cpp:72 #10 0x1187a1c50 in lldb_private::UnwindLLDB::GetOneMoreFrame(lldb_private::ABI*) UnwindLLDB.cpp:128 #11 0x1187a08b9 in lldb_private::UnwindLLDB::AddOneMoreFrame(lldb_private::ABI*) UnwindLLDB.cpp:332 #12 0x1187a1585 in lldb_private::UnwindLLDB::UpdateUnwindPlanForFirstFrameIfInvalid(lldb_private::ABI*) UnwindLLDB.cpp:305 #13 0x1187a041d in lldb_private::UnwindLLDB::AddFirstFrame() UnwindLLDB.cpp:99 #14 0x1187a370d in lldb_private::UnwindLLDB::DoGetFrameInfoAtIndex(unsigned int, unsigned long long&, unsigned long long&, bool&) UnwindLLDB.cpp:395 #15 0x11869239a in lldb_private::Unwind::GetFrameInfoAtIndex(unsigned int, unsigned long long&, unsigned long long&, bool&) Unwind.h:53 #16 0x11868ec5c in lldb_private::StackFrameList::GetFramesUpTo(unsigned int) StackFrameList.cpp:484 #17 0x11868cd57 in lldb_private::StackFrameList::ResetCurrentInlinedDepth() StackFrameList.cpp:86 #18 0x11872cb63 in lldb_private::Thread::ShouldStop(lldb_private::Event*) Thread.cpp:805 #19 0x118746368 in lldb_private::ThreadList::ShouldStop(lldb_private::Event*) ThreadList.cpp:330 #20 0x118612880 in lldb_private::Process::ShouldBroadcastEvent(lldb_private::Event*) Process.cpp:3405 #21 0x1186097a4 in lldb_private::Process::HandlePrivateEvent(std::__1::shared_ptr<lldb_private::Event>&) Process.cpp:3630 #22 0x1186144fa in lldb_private::Process::RunPrivateStateThread(bool) Process.cpp:3824 #23 0x118612ead in lldb_private::Process::PrivateStateThread(void*) Process.cpp:3722 #24 0x118372a10 in lldb_private::HostNativeThreadBase::ThreadCreateTrampoline(void*) HostNativeThreadBase.cpp:65 #25 0x7fff71f9e108 in _pthread_start+0x93 (libsystem_pthread.dylib:x86_64+0x6108) #26 0x7fff71f99b8a in thread_start+0xe (libsystem_pthread.dylib:x86_64+0x1b8a)

Hide Details

0x6160002508a0 is located 32 bytes inside of 545-byte region [0x616000250880,0x616000250aa1) freed by thread T6 here: #0 0x10af24bc9 in wrap_free+0xa9 (libclang_rt.asan_osx_dynamic.dylib:x86_64+0x46bc9) #1 0x10ba26af2 in frame_dealloc+0xa0 (Python:x86_64+0x2aaf2) #2 0x10ba15d2a in function_code_fastcall+0xf8 (Python:x86_64+0x19d2a) #3 0x10ba16624 in _PyObject_Call_Prepend+0x95 (Python:x86_64+0x1a624) #4 0x10ba152d2 in _PyObject_FastCallDict+0x107 (Python:x86_64+0x192d2) #5 0x10ba167d2 in _PyObject_CallFunctionVa+0xd0 (Python:x86_64+0x1a7d2) #6 0x10ba16a00 in PyObject_CallMethod+0xa8 (Python:x86_64+0x1aa00) #7 0x118f03280 in std::__1::shared_ptr<lldb_private::DataExtractor> lldb_private::ScriptedPythonInterface::Dispatch<std::__1::shared_ptr<lldb_private::DataExtractor>, unsigned long long, unsigned long>(llvm::StringRef, lldb_private::Status&, unsigned long long, unsigned long) ScriptedPythonInterface.h:93 #8 0x118f026d4 in lldb_private::ScriptedProcessPythonInterface::ReadMemoryAtAddress(unsigned long long, unsigned long, lldb_private::Status&) ScriptedProcessPythonInterface.cpp:120 #9 0x118d6c635 in lldb_private::ScriptedProcess::DoReadMemory(unsigned long long, void*, unsigned long, lldb_private::Status&) ScriptedProcess.cpp:232 #10 0x118604abc in lldb_private::Process::ReadMemoryFromInferior(unsigned long long, void*, unsigned long, lldb_private::Status&) Process.cpp:2047 #11 0x1185bcf2f in lldb_private::MemoryCache::Read(unsigned long long, void*, unsigned long, lldb_private::Status&) Memory.cpp:229 #12 0x118645f11 in lldb_private::RegisterContext::ReadRegisterValueFromMemory(lldb_private::RegisterInfo const*, unsigned long long, unsigned int, lldb_private::RegisterValue&) RegisterContext.cpp:343 #13 0x118657c36 in lldb_private::RegisterContextUnwind::ReadRegisterValueFromRegisterLocation(lldb_private::UnwindLLDB::RegisterLocation, lldb_private::RegisterInfo const*, lldb_private::RegisterValue&) RegisterContextUnwind.cpp:1138 #14 0x1186555c3 in lldb_private::RegisterContextUnwind::ReadGPRValue(lldb::RegisterKind, unsigned int, unsigned long long&) RegisterContextUnwind.cpp:2143 #15 0x118649d45 in lldb_private::RegisterContextUnwind::InitializeNonZerothFrame() RegisterContextUnwind.cpp:343 #16 0x1186470b0 in lldb_private::RegisterContextUnwind::RegisterContextUnwind(lldb_private::Thread&, std::__1::shared_ptr<lldb_private::RegisterContextUnwind> const&, lldb_private::SymbolContext&, unsigned int, lldb_private::UnwindLLDB&) RegisterContextUnwind.cpp:72 #17 0x1187a1c50 in lldb_private::UnwindLLDB::GetOneMoreFrame(lldb_private::ABI*) UnwindLLDB.cpp:128 #18 0x1187a08b9 in lldb_private::UnwindLLDB::AddOneMoreFrame(lldb_private::ABI*) UnwindLLDB.cpp:332 #19 0x1187a1585 in lldb_private::UnwindLLDB::UpdateUnwindPlanForFirstFrameIfInvalid(lldb_private::ABI*) UnwindLLDB.cpp:305 #20 0x1187a041d in lldb_private::UnwindLLDB::AddFirstFrame() UnwindLLDB.cpp:99 #21 0x1187a370d in lldb_private::UnwindLLDB::DoGetFrameInfoAtIndex(unsigned int, unsigned long long&, unsigned long long&, bool&) UnwindLLDB.cpp:395 #22 0x11869239a in lldb_private::Unwind::GetFrameInfoAtIndex(unsigned int, unsigned long long&, unsigned long long&, bool&) Unwind.h:53 #23 0x11868ec5c in lldb_private::StackFrameList::GetFramesUpTo(unsigned int) StackFrameList.cpp:484 #24 0x11868cd57 in lldb_private::StackFrameList::ResetCurrentInlinedDepth() StackFrameList.cpp:86 #25 0x11872cb63 in lldb_private::Thread::ShouldStop(lldb_private::Event*) Thread.cpp:805 #26 0x118746368 in lldb_private::ThreadList::ShouldStop(lldb_private::Event*) ThreadList.cpp:330 #27 0x118612880 in lldb_private::Process::ShouldBroadcastEvent(lldb_private::Event*) Process.cpp:3405 #28 0x1186097a4 in lldb_private::Process::HandlePrivateEvent(std::__1::shared_ptr<lldb_private::Event>&) Process.cpp:3630 #29 0x1186144fa in lldb_private::Process::RunPrivateStateThread(bool) Process.cpp:3824

Hide Details

previously allocated by thread T6 here: #0 0x10af24a80 in wrap_malloc+0xa0 (libclang_rt.asan_osx_dynamic.dylib:x86_64+0x46a80) #1 0x10ba4428b in _PyObject_Malloc+0x37 (Python:x86_64+0x4828b) #2 0x10ba0decc in _PyBytes_FromSize+0x63 (Python:x86_64+0x11ecc) #3 0x10ba0de09 in PyBytes_FromStringAndSize+0x3d (Python:x86_64+0x11e09) #4 0x118eb4c97 in lldb_private::python::PythonBytes::PythonBytes(unsigned char const*, unsigned long) PythonDataObjects.cpp:290 #5 0x117f3be21 in _wrap_SBProcess_ReadMemory(_object*, _object*) LLDBWrapPython.cpp:45781 #6 0x10ba16226 in _PyMethodDef_RawFastCallKeywords+0xeb (Python:x86_64+0x1a226) #7 0x10ba158c6 in _PyCFunction_FastCallKeywords+0x2b (Python:x86_64+0x198c6) #8 0x10baab905 in call_function+0x1de (Python:x86_64+0xaf905) #9 0x10baa45ee in _PyEval_EvalFrameDefault+0x1b51 (Python:x86_64+0xa85ee) #10 0x10ba15ca1 in function_code_fastcall+0x6f (Python:x86_64+0x19ca1) #11 0x10baab97d in call_function+0x256 (Python:x86_64+0xaf97d) #12 0x10baa45d5 in _PyEval_EvalFrameDefault+0x1b38 (Python:x86_64+0xa85d5) #13 0x10ba15ca1 in function_code_fastcall+0x6f (Python:x86_64+0x19ca1) #14 0x10ba16624 in _PyObject_Call_Prepend+0x95 (Python:x86_64+0x1a624) #15 0x10ba152d2 in _PyObject_FastCallDict+0x107 (Python:x86_64+0x192d2) #16 0x10ba167d2 in _PyObject_CallFunctionVa+0xd0 (Python:x86_64+0x1a7d2) #17 0x10ba16a00 in PyObject_CallMethod+0xa8 (Python:x86_64+0x1aa00) #18 0x118f03280 in std::__1::shared_ptr<lldb_private::DataExtractor> lldb_private::ScriptedPythonInterface::Dispatch<std::__1::shared_ptr<lldb_private::DataExtractor>, unsigned long long, unsigned long>(llvm::StringRef, lldb_private::Status&, unsigned long long, unsigned long) ScriptedPythonInterface.h:93 #19 0x118f026d4 in lldb_private::ScriptedProcessPythonInterface::ReadMemoryAtAddress(unsigned long long, unsigned long, lldb_private::Status&) ScriptedProcessPythonInterface.cpp:120 #20 0x118d6c635 in lldb_private::ScriptedProcess::DoReadMemory(unsigned long long, void*, unsigned long, lldb_private::Status&) ScriptedProcess.cpp:232 #21 0x118604abc in lldb_private::Process::ReadMemoryFromInferior(unsigned long long, void*, unsigned long, lldb_private::Status&) Process.cpp:2047 #22 0x1185bcf2f in lldb_private::MemoryCache::Read(unsigned long long, void*, unsigned long, lldb_private::Status&) Memory.cpp:229 #23 0x118645f11 in lldb_private::RegisterContext::ReadRegisterValueFromMemory(lldb_private::RegisterInfo const*, unsigned long long, unsigned int, lldb_private::RegisterValue&) RegisterContext.cpp:343 #24 0x118657c36 in lldb_private::RegisterContextUnwind::ReadRegisterValueFromRegisterLocation(lldb_private::UnwindLLDB::RegisterLocation, lldb_private::RegisterInfo const*, lldb_private::RegisterValue&) RegisterContextUnwind.cpp:1138 #25 0x1186555c3 in lldb_private::RegisterContextUnwind::ReadGPRValue(lldb::RegisterKind, unsigned int, unsigned long long&) RegisterContextUnwind.cpp:2143 #26 0x118649d45 in lldb_private::RegisterContextUnwind::InitializeNonZerothFrame() RegisterContextUnwind.cpp:343 #27 0x1186470b0 in lldb_private::RegisterContextUnwind::RegisterContextUnwind(lldb_private::Thread&, std::__1::shared_ptr<lldb_private::RegisterContextUnwind> const&, lldb_private::SymbolContext&, unsigned int, lldb_private::UnwindLLDB&) RegisterContextUnwind.cpp:72 #28 0x1187a1c50 in lldb_private::UnwindLLDB::GetOneMoreFrame(lldb_private::ABI*) UnwindLLDB.cpp:128 #29 0x1187a08b9 in lldb_private::UnwindLLDB::AddOneMoreFrame(lldb_private::ABI*) UnwindLLDB.cpp:332

Hide Details

Thread T6 created by T0 here: #0 0x10af1e55c in wrap_pthread_create+0x5c (libclang_rt.asan_osx_dynamic.dylib:x86_64+0x4055c) #1 0x118396441 in lldb_private::ThreadLauncher::LaunchThread(llvm::StringRef, void* (*)(void*), void*, unsigned long) ThreadLauncher.cpp:65 #2 0x11860b72f in lldb_private::Process::StartPrivateStateThread(bool) Process.cpp:3501 #3 0x11860af2a in lldb_private::Process::Launch(lldb_private::ProcessLaunchInfo&) Process.cpp:2547 #4 0x1186eb6cb in lldb_private::Target::Launch(lldb_private::ProcessLaunchInfo&, lldb_private::Stream*) Target.cpp:3063 #5 0x117abfa20 in lldb::SBTarget::Launch(lldb::SBLaunchInfo&, lldb::SBError&) SBTarget.cpp:439 #6 0x117f79c5a in _wrap_SBTarget_Launch(_object*, _object*) LLDBWrapPython.cpp:54084 #7 0x10ba15bda in PyCFunction_Call+0x140 (Python:x86_64+0x19bda) #8 0x10baa49e2 in _PyEval_EvalFrameDefault+0x1f45 (Python:x86_64+0xa89e2) #9 0x10baac2da in _PyEval_EvalCodeWithName+0x72a (Python:x86_64+0xb02da) #10 0x10ba1588b in _PyFunction_FastCallKeywords+0xe0 (Python:x86_64+0x1988b) #11 0x10baab97d in call_function+0x256 (Python:x86_64+0xaf97d) #12 0x10baa45d5 in _PyEval_EvalFrameDefault+0x1b38 (Python:x86_64+0xa85d5) #13 0x10ba15ca1 in function_code_fastcall+0x6f (Python:x86_64+0x19ca1) #14 0x10baa4905 in _PyEval_EvalFrameDefault+0x1e68 (Python:x86_64+0xa8905) #15 0x10baac2da in _PyEval_EvalCodeWithName+0x72a (Python:x86_64+0xb02da) #16 0x10ba154f4 in _PyFunction_FastCallDict+0x1b8 (Python:x86_64+0x194f4) #17 0x10baa4905 in _PyEval_EvalFrameDefault+0x1e68 (Python:x86_64+0xa8905) #18 0x10baac2da in _PyEval_EvalCodeWithName+0x72a (Python:x86_64+0xb02da) #19 0x10ba1588b in _PyFunction_FastCallKeywords+0xe0 (Python:x86_64+0x1988b) #20 0x10baab97d in call_function+0x256 (Python:x86_64+0xaf97d) #21 0x10baa468c in _PyEval_EvalFrameDefault+0x1bef (Python:x86_64+0xa868c) #22 0x10baac2da in _PyEval_EvalCodeWithName+0x72a (Python:x86_64+0xb02da) #23 0x10ba1588b in _PyFunction_FastCallKeywords+0xe0 (Python:x86_64+0x1988b) #24 0x10baab97d in call_function+0x256 (Python:x86_64+0xaf97d) #25 0x10baa468c in _PyEval_EvalFrameDefault+0x1bef (Python:x86_64+0xa868c) #26 0x10ba15ca1 in function_code_fastcall+0x6f (Python:x86_64+0x19ca1) #27 0x10baab97d in call_function+0x256 (Python:x86_64+0xaf97d) #28 0x10baa45d5 in _PyEval_EvalFrameDefault+0x1b38 (Python:x86_64+0xa85d5) #29 0x10baac2da in _PyEval_EvalCodeWithName+0x72a (Python:x86_64+0xb02da) #30 0x10ba154f4 in _PyFunction_FastCallDict+0x1b8 (Python:x86_64+0x194f4) #31 0x10ba16624 in _PyObject_Call_Prepend+0x95 (Python:x86_64+0x1a624) #32 0x10ba159d4 in PyObject_Call+0x87 (Python:x86_64+0x199d4) #33 0x10baa4905 in _PyEval_EvalFrameDefault+0x1e68 (Python:x86_64+0xa8905) #34 0x10baac2da in _PyEval_EvalCodeWithName+0x72a (Python:x86_64+0xb02da) #35 0x10ba154f4 in _PyFunction_FastCallDict+0x1b8 (Python:x86_64+0x194f4) #36 0x10ba16624 in _PyObject_Call_Prepend+0x95 (Python:x86_64+0x1a624) #37 0x10ba534af in slot_tp_call+0x46 (Python:x86_64+0x574af) #38 0x10ba1572c in _PyObject_FastCallKeywords+0x166 (Python:x86_64+0x1972c) #39 0x10baab976 in call_function+0x24f (Python:x86_64+0xaf976) #40 0x10baa468c in _PyEval_EvalFrameDefault+0x1bef (Python:x86_64+0xa868c) #41 0x10baac2da in _PyEval_EvalCodeWithName+0x72a (Python:x86_64+0xb02da) #42 0x10ba1588b in _PyFunction_FastCallKeywords+0xe0 (Python:x86_64+0x1988b) #43 0x10baab97d in call_function+0x256 (Python:x86_64+0xaf97d) #44 0x10baa45d5 in _PyEval_EvalFrameDefault+0x1b38 (Python:x86_64+0xa85d5) #45 0x10baac2da in _PyEval_EvalCodeWithName+0x72a (Python:x86_64+0xb02da) #46 0x10ba1588b in _PyFunction_FastCallKeywords+0xe0 (Python:x86_64+0x1988b) #47 0x10baab97d in call_function+0x256 (Python:x86_64+0xaf97d) #48 0x10baa45d5 in _PyEval_EvalFrameDefault+0x1b38 (Python:x86_64+0xa85d5) #49 0x10ba15ca1 in function_code_fastcall+0x6f (Python:x86_64+0x19ca1) #50 0x10ba16624 in _PyObject_Call_Prepend+0x95 (Python:x86_64+0x1a624) #51 0x10ba159d4 in PyObject_Call+0x87 (Python:x86_64+0x199d4) #52 0x10baa4905 in _PyEval_EvalFrameDefault+0x1e68 (Python:x86_64+0xa8905) #53 0x10baac2da in _PyEval_EvalCodeWithName+0x72a (Python:x86_64+0xb02da) #54 0x10ba154f4 in _PyFunction_FastCallDict+0x1b8 (Python:x86_64+0x194f4) #55 0x10ba16624 in _PyObject_Call_Prepend+0x95 (Python:x86_64+0x1a624) #56 0x10ba534af in slot_tp_call+0x46 (Python:x86_64+0x574af) #57 0x10ba1572c in _PyObject_FastCallKeywords+0x166 (Python:x86_64+0x1972c) #58 0x10baab976 in call_function+0x24f (Python:x86_64+0xaf976) #59 0x10baa468c in _PyEval_EvalFrameDefault+0x1bef (Python:x86_64+0xa868c) #60 0x10ba15ca1 in function_code_fastcall+0x6f (Python:x86_64+0x19ca1) #61 0x10baab97d in call_function+0x256 (Python:x86_64+0xaf97d) #62 0x10baa45d5 in _PyEval_EvalFrameDefault+0x1b38 (Python:x86_64+0xa85d5) #63 0x10ba15ca1 in function_code_fastcall+0x6f (Python:x86_64+0x19ca1) #64 0x10baab97d in call_function+0x256 (Python:x86_64+0xaf97d) #65 0x10baa45ee in _PyEval_EvalFrameDefault+0x1b51 (Python:x86_64+0xa85ee) #66 0x10baac2da in _PyEval_EvalCodeWithName+0x72a (Python:x86_64+0xb02da) #67 0x10baa2a14 in PyEval_EvalCode+0x29 (Python:x86_64+0xa6a14) #68 0x10bad12aa in run_mod+0x35 (Python:x86_64+0xd52aa) #69 0x10bad02c5 in PyRun_FileExFlags+0xa3 (Python:x86_64+0xd42c5) #70 0x10bacf9a4 in PyRun_SimpleFileExFlags+0x114 (Python:x86_64+0xd39a4) #71 0x10bae7010 in pymain_main+0x13de (Python:x86_64+0xeb010) #72 0x10bae77b7 in _Py_UnixMain+0x67 (Python:x86_64+0xeb7b7) #73 0x7fff71d95cc8 in start+0x0 (libdyld.dylib:x86_64+0x1acc8)

Hide Details

SUMMARY: AddressSanitizer: heap-use-after-free (libclang_rt.asan_osx_dynamic.dylib:x86_64+0x44b2f) in __asan_memcpy+0x1af Shadow bytes around the buggy address: 0x1c2c0004a0c0: fd fd fd fd fd fd fd fd fd fd fd fd fd fd fd fd 0x1c2c0004a0d0: fd fd fd fd fd fd fd fd fd fd fd fd fd fd fd fd 0x1c2c0004a0e0: fd fd fd fd fd fd fd fd fd fd fd fd fd fd fd fd 0x1c2c0004a0f0: fd fd fd fd fd fd fd fd fa fa fa fa fa fa fa fa 0x1c2c0004a100: fa fa fa fa fa fa fa fa fa fa fa fa fa fa fa fa =>0x1c2c0004a110: fd fd fd fd[fd]fd fd fd fd fd fd fd fd fd fd fd 0x1c2c0004a120: fd fd fd fd fd fd fd fd fd fd fd fd fd fd fd fd 0x1c2c0004a130: fd fd fd fd fd fd fd fd fd fd fd fd fd fd fd fd 0x1c2c0004a140: fd fd fd fd fd fd fd fd fd fd fd fd fd fd fd fd 0x1c2c0004a150: fd fd fd fd fd fa fa fa fa fa fa fa fa fa fa fa 0x1c2c0004a160: fa fa fa fa fa fa fa fa fa fa fa fa fa fa fa fa Shadow byte legend (one shadow byte represents 8 application bytes): Addressable: 00 Partially addressable: 01 02 03 04 05 06 07 Heap left redzone: fa Freed heap region: fd Stack left redzone: f1 Stack mid redzone: f2 Stack right redzone: f3 Stack after return: f5 Stack use after scope: f8 Global redzone: f9 Global init order: f6 Poisoned by user: f7 Container overflow: fc Array cookie: ac Intra object redzone: bb ASan internal: fe Left alloca redzone: ca Right alloca redzone: cb ==63138==ABORTING Fatal Python error: Aborted

Hide Details

Thread 0x000000011742fdc0 (most recent call first): File "/Users/buildslave/jenkins/workspace/lldb-cmake-sanitized/lldb-build/lib/python3.7/site-packages/lldb/__init__.py", line 10301 in Launch File "/Users/buildslave/jenkins/workspace/lldb-cmake-sanitized/llvm-project/lldb/test/API/functionalities/scripted_process/TestScriptedProcess.py", line 149 in test_launch_scripted_process_stack_frames File "/Users/buildslave/jenkins/workspace/lldb-cmake-sanitized/llvm-project/lldb/packages/Python/lldbsuite/test/decorators.py", line 149 in wrapper File "/Users/buildslave/jenkins/workspace/lldb-cmake-sanitized/llvm-project/lldb/packages/Python/lldbsuite/test/decorators.py", line 149 in wrapper File "/Users/buildslave/jenkins/workspace/lldb-cmake-sanitized/llvm-project/lldb/packages/Python/lldbsuite/test/lldbtest.py", line 1715 in test_method File "/Users/buildslave/jenkins/workspace/lldb-cmake-sanitized/llvm-project/lldb/third_party/Python/module/unittest2/unittest2/case.py", line 413 in runMethod File "/Users/buildslave/jenkins/workspace/lldb-cmake-sanitized/llvm-project/lldb/third_party/Python/module/unittest2/unittest2/case.py", line 383 in run File "/Users/buildslave/jenkins/workspace/lldb-cmake-sanitized/llvm-project/lldb/third_party/Python/module/unittest2/unittest2/case.py", line 458 in __call__ File "/Users/buildslave/jenkins/workspace/lldb-cmake-sanitized/llvm-project/lldb/third_party/Python/module/unittest2/unittest2/suite.py", line 117 in _wrapped_run File "/Users/buildslave/jenkins/workspace/lldb-cmake-sanitized/llvm-project/lldb/third_party/Python/module/unittest2/unittest2/suite.py", line 115 in _wrapped_run File "/Users/buildslave/jenkins/workspace/lldb-cmake-sanitized/llvm-project/lldb/third_party/Python/module/unittest2/unittest2/suite.py", line 85 in run File "/Users/buildslave/jenkins/workspace/lldb-cmake-sanitized/llvm-project/lldb/third_party/Python/module/unittest2/unittest2/suite.py", line 66 in __call__ File "/Users/buildslave/jenkins/workspace/lldb-cmake-sanitized/llvm-project/lldb/third_party/Python/module/unittest2/unittest2/runner.py", line 165 in run File "/Users/buildslave/jenkins/workspace/lldb-cmake-sanitized/llvm-project/lldb/packages/Python/lldbsuite/test/dotest.py", line 996 in run_suite File "/Users/buildslave/jenkins/workspace/lldb-cmake-sanitized/llvm-project/lldb/test/API/dotest.py", line 7 in <module>

Hide Details

--

Hide Details

******************** PASS: lldb-unit :: Host/./HostTests/TerminalTest.SetBaudRate (2313 of 2474) PASS: lldb-unit :: Host/./HostTests/FileSystemTest.GetPermissions (2314 of 2474) UNSUPPORTED: lldb-api :: macosx/corefile-exception-reason/TestCorefileExceptionReason.py (2315 of 2474) UNSUPPORTED: lldb-api :: functionalities/process_save_core/TestProcessSaveCore.py (2316 of 2474) PASS: lldb-unit :: Utility/./UtilityTests/ScalarTest.Equality (2317 of 2474) PASS: lldb-shell :: Settings/TestFrameFormatMangling.test (2318 of 2474) PASS: lldb-unit :: UnwindAssembly/x86/./UnwindAssemblyx86Tests/Testx86AssemblyInspectionEngine.TestStackRealign8BitDisp_i386 (2319 of 2474) PASS: lldb-unit :: Expression/./ExpressionTests/DWARFExpression.DW_OP_const (2320 of 2474) PASS: lldb-api :: functionalities/breakpoint/serialize/TestBreakpointSerialization.py (2321 of 2474) UNSUPPORTED: lldb-shell :: Subprocess/clone-follow-parent-softbp.test (2322 of 2474) PASS: lldb-api :: tools/lldb-server/commandline/TestGdbRemoteConnection.py (2323 of 2474) PASS: lldb-shell :: SymbolFile/DWARF/x86/find-basic-type.cpp (2324 of 2474) PASS: lldb-shell :: ScriptInterpreter/Python/command_relative_import.test (2325 of 2474) PASS: lldb-api :: lang/c/vla/TestVLA.py (2326 of 2474) PASS: lldb-shell :: ObjectFile/PECOFF/basic-info-arm.yaml (2327 of 2474) UNSUPPORTED: lldb-api :: functionalities/tsan/thread_numbers/TestTsanThreadNumbers.py (2328 of 2474) PASS: lldb-api :: lang/cpp/function-qualifiers/TestCppFunctionQualifiers.py (2329 of 2474) PASS: lldb-shell :: SymbolFile/DWARF/x86/dwarf5_tu_index_abbrev_offset.s (2330 of 2474) PASS: lldb-api :: python_api/symbol-context/two-files/TestSymbolContextTwoFiles.py (2331 of 2474) PASS: lldb-unit :: Language/CPlusPlus/./LanguageCPlusPlusTests/CPlusPlusLanguage.CPlusPlusNameParser (2332 of 2474) PASS: lldb-unit :: ObjectFile/Breakpad/./ObjectFileBreakpadTests/FuncRecord.parse (2333 of 2474) PASS: lldb-api :: macosx/order/TestOrderFile.py (2334 of 2474) PASS: lldb-unit :: ScriptInterpreter/Python/./ScriptInterpreterPythonTests/PythonDataObjectsTest.TestPythonCallableInvoke (2335 of 2474) UNSUPPORTED: lldb-api :: functionalities/thread/thread_specific_break_plus_condition/TestThreadSpecificBpPlusCondition.py (2336 of 2474) PASS: lldb-unit :: Symbol/./SymbolTests/TestTypeSystemClang.TestConvertAccessTypeToAccessSpecifier (2337 of 2474) PASS: lldb-api :: functionalities/postmortem/mach-core/TestMachCore.py (2338 of 2474) PASS: lldb-shell :: ScriptInterpreter/Python/Crashlog/text.test (2339 of 2474) PASS: lldb-unit :: Language/Highlighting/./HighlighterTests/HighlighterTest.ClangSquareBrackets (2340 of 2474) PASS: lldb-unit :: Host/./HostTests/TerminalTest.SetEcho (2341 of 2474) PASS: lldb-api :: functionalities/breakpoint/breakpoint_locations/TestBreakpointLocations.py (2342 of 2474) PASS: lldb-api :: commands/platform/basic/TestPlatformPython.py (2343 of 2474) PASS: lldb-api :: lang/objc/modules-auto-import/TestModulesAutoImport.py (2344 of 2474) UNSUPPORTED: lldb-shell :: ScriptInterpreter/Lua/command_script_import.test (2345 of 2474) UNSUPPORTED: lldb-shell :: BuildScript/toolchain-clang-cl.test (2346 of 2474) UNSUPPORTED: lldb-shell :: ScriptInterpreter/Lua/partial_statements.test (2347 of 2474) UNSUPPORTED: lldb-api :: macosx/simulator/TestSimulatorPlatform.py (2348 of 2474) PASS: lldb-api :: functionalities/optimized_code/TestNoASanExceptionAfterEvalOP_piece.py (2349 of 2474) PASS: lldb-api :: python_api/watchpoint/condition/TestWatchpointConditionAPI.py (2350 of 2474) PASS: lldb-api :: types/TestIntegerType.py (2351 of 2474) UNSUPPORTED: lldb-shell :: SymbolFile/PDB/variables-locations.test (2352 of 2474) PASS: lldb-api :: commands/target/create-deps/TestTargetCreateDeps.py (2353 of 2474) PASS: lldb-unit :: Utility/./UtilityTests/OptionsWithRawTest.EmptySuffixSingleWhitespace (2354 of 2474) UNSUPPORTED: lldb-shell :: SymbolFile/PDB/compilands.test (2355 of 2474) PASS: lldb-unit :: UnwindAssembly/x86/./UnwindAssemblyx86Tests/Testx86AssemblyInspectionEngine.TestStackRealignMSVC_i386 (2356 of 2474) PASS: lldb-shell :: ScriptInterpreter/None/import_module.test (2357 of 2474) PASS: lldb-unit :: Utility/./UtilityTests/StreamTest.PutHex32ByteOrderLittle (2358 of 2474) UNSUPPORTED: lldb-api :: commands/watchpoints/hello_watchlocation/TestWatchLocation.py (2359 of 2474) UNSUPPORTED: lldb-shell :: ScriptInterpreter/Lua/watchpoint_callback.test (2360 of 2474) PASS: lldb-shell :: Reproducer/TestHomeDir.test (2361 of 2474) PASS: lldb-unit :: Utility/./UtilityTests/BinaryStreamTest.PutSLEB128SevenBytes (2362 of 2474) PASS: lldb-unit :: Utility/./UtilityTests/AnsiTerminal.Empty (2363 of 2474) PASS: lldb-api :: lang/objcxx/hide-runtime-values/TestObjCXXHideRuntimeValues.py (2364 of 2474) PASS: lldb-unit :: Utility/./UtilityTests/BinaryStreamTest.PutULEB128One (2365 of 2474) PASS: lldb-api :: api/check_public_api_headers/TestPublicAPIHeaders.py (2366 of 2474) XFAIL: lldb-shell :: SymbolFile/DWARF/find-type-in-function.cpp (2367 of 2474) PASS: lldb-unit :: SymbolFile/DWARF/./SymbolFileDWARFTests/DWARFASTParserClangTests.TestCallingConventionParsing (2368 of 2474) PASS: lldb-unit :: UnwindAssembly/x86/./UnwindAssemblyx86Tests/Testx86AssemblyInspectionEngine.TestSpillRegToStackViaMOVi386 (2369 of 2474) PASS: lldb-unit :: Utility/./UtilityTests/UriParserTest.BadPort2 (2370 of 2474) PASS: lldb-api :: functionalities/thread/concurrent_events/TestConcurrentSignalWatch.py (2371 of 2474) PASS: lldb-unit :: SymbolFile/DWARF/./SymbolFileDWARFTests/SymbolFileDWARFTests.TestAbbrevOrder1Start1 (2372 of 2474) PASS: lldb-unit :: Process/Utility/./ProcessUtilityTests/MemoryTagManagerAArch64MTETest.PackTags (2373 of 2474) PASS: lldb-unit :: Utility/./UtilityTests/FileSpecTest.IsRelative (2374 of 2474) PASS: lldb-unit :: Utility/./UtilityTests/StringListTest.AppendList (2375 of 2474) PASS: lldb-api :: commands/watchpoints/watchpoint_size/TestWatchpointSizes.py (2376 of 2474) PASS: lldb-api :: functionalities/data-formatter/nsdictionarysynth/TestNSDictionarySynthetic.py (2377 of 2474) PASS: lldb-api :: functionalities/inferior-crashing/TestInferiorCrashing.py (2378 of 2474) PASS: lldb-api :: commands/expression/ignore-artificial-constructors/TestIgnoreArtificialConstructors.py (2379 of 2474) PASS: lldb-unit :: Host/./HostTests/TerminalTest.SetParity (2380 of 2474) UNSUPPORTED: lldb-api :: benchmarks/expression/TestExpressionCmd.py (2381 of 2474) PASS: lldb-api :: functionalities/data-formatter/data-formatter-objc/TestDataFormatterObjCNSDate.py (2382 of 2474) PASS: lldb-api :: commands/expression/import-std-module/array/TestArrayFromStdModule.py (2383 of 2474) PASS: lldb-unit :: Process/minidump/./LLDBMinidumpTests/MinidumpParserTest.GetMiscInfoWindows (2384 of 2474) UNSUPPORTED: lldb-api :: functionalities/longjmp/TestLongjmp.py (2385 of 2474) PASS: lldb-unit :: Language/Highlighting/./HighlighterTests/HighlighterTest.ClangCursorPosInOtherToken (2386 of 2474) UNSUPPORTED: lldb-shell :: ScriptInterpreter/Lua/independent_state.test (2387 of 2474) UNSUPPORTED: lldb-api :: tools/lldb-server/TestGdbRemoteCompletion.py (2388 of 2474) PASS: lldb-api :: commands/expression/import-std-module/weak_ptr-dbg-info-content/TestDbgInfoContentWeakPtrFromStdModule.py (2389 of 2474) PASS: lldb-unit :: Utility/./UtilityTests/StringExtractorTest.GetHexBytesAvail_OddPair2 (2390 of 2474) PASS: lldb-shell :: Register/Core/x86-64-freebsd-gp.test (2391 of 2474) PASS: lldb-shell :: SymbolFile/NativePDB/load-pdb.cpp (2392 of 2474) PASS: lldb-unit :: Utility/./UtilityTests/XcodeSDKTest.FindXcodeContentsDirectoryInPath (2393 of 2474) PASS: lldb-unit :: ScriptInterpreter/Python/./ScriptInterpreterPythonTests/PythonDataObjectsTest.TestExceptions (2394 of 2474) UNSUPPORTED: lldb-api :: python_api/event/TestEvents.py (2395 of 2474) PASS: lldb-api :: commands/breakpoint/set/func-regex/TestBreakpointRegexError.py (2396 of 2474) PASS: lldb-unit :: Host/./HostTests/MainLoopTest.TwoSignalCallbacks (2397 of 2474) PASS: lldb-api :: lang/c/set_values/TestSetValues.py (2398 of 2474) PASS: lldb-unit :: Utility/./UtilityTests/RangeTest.ContainsEndInclusiveInvalid (2399 of 2474) PASS: lldb-unit :: UnwindAssembly/x86/./UnwindAssemblyx86Tests/Testx86AssemblyInspectionEngine.TestDisassemblyJunkBytes (2400 of 2474) PASS: lldb-api :: lang/cpp/function_refs/TestFunctionRefs.py (2401 of 2474) PASS: lldb-unit :: Expression/./ExpressionTests/DWARFExpression.DW_OP_piece (2402 of 2474) PASS: lldb-unit :: Core/./LLDBCoreTests/ModuleSpecTest.TestCOFFFile (2403 of 2474) PASS: lldb-api :: lang/objc/foundation/TestSymbolTable.py (2404 of 2474) PASS: lldb-shell :: Settings/TestStopCommandSourceOnError.test (2405 of 2474) PASS: lldb-shell :: SymbolFile/DWARF/x86/win-i386-line-table.s (2406 of 2474) PASS: lldb-unit :: Core/./LLDBCoreTests/SourceLocationSpecTest.Equal (2407 of 2474) PASS: lldb-shell :: Breakpoint/debug_rnglist_rlestartend.test (2408 of 2474) PASS: lldb-unit :: Utility/./UtilityTests/OptionsWithRawTest.MultiWordSuffix (2409 of 2474) PASS: lldb-api :: commands/watchpoints/multiple_hits/TestMultipleHits.py (2410 of 2474) PASS: lldb-unit :: ScriptInterpreter/Python/./ScriptInterpreterPythonTests/PythonDataObjectsTest.TestPythonTupleValues (2411 of 2474) PASS: lldb-unit :: Utility/./UtilityTests/StreamTest.PutPtr (2412 of 2474) PASS: lldb-shell :: ObjectFile/ELF/netbsd-exec-8.99.30-amd64.yaml (2413 of 2474) PASS: lldb-shell :: SymbolFile/DWARF/x86/parallel-indexing-stress.s (2414 of 2474) PASS: lldb-api :: commands/target/modules/search-paths/insert/TestTargetModulesSearchpathsInsert.py (2415 of 2474) PASS: lldb-api :: functionalities/thread/concurrent_events/TestConcurrentTwoWatchpointsOneSignal.py (2416 of 2474) PASS: lldb-api :: functionalities/data-formatter/data-formatter-stl/generic/set/TestDataFormatterGenericSet.py (2417 of 2474) PASS: lldb-unit :: Process/gdb-remote/./ProcessGdbRemoteTests/PortMapTest.FreePortForProcess (2418 of 2474) PASS: lldb-api :: commands/expression/anonymous-struct/TestCallUserAnonTypedef.py (2419 of 2474) PASS: lldb-unit :: Language/Highlighting/./HighlighterTests/HighlighterTest.ClangIdentifiers (2420 of 2474) UNSUPPORTED: lldb-shell :: Subprocess/fork-follow-child-wp.test (2421 of 2474) PASS: lldb-api :: lang/objc/modules-incomplete/TestIncompleteModules.py (2422 of 2474) PASS: lldb-unit :: ScriptInterpreter/Python/./ScriptInterpreterPythonTests/PythonDataObjectsTest.TestPythonCallableCheck (2423 of 2474) PASS: lldb-api :: functionalities/breakpoint/debugbreak/TestDebugBreak.py (2424 of 2474) PASS: lldb-api :: commands/expression/xvalue/TestXValuePrinting.py (2425 of 2474) PASS: lldb-shell :: Reproducer/TestVerify.test (2426 of 2474) PASS: lldb-shell :: Driver/TestConvenienceVariables.test (2427 of 2474) PASS: lldb-api :: macosx/macCatalyst/TestMacCatalyst.py (2428 of 2474) PASS: lldb-unit :: SymbolFile/NativePDB/./SymbolFileNativePDBTests/PDBFPOProgramToDWARFExpressionTests.UnresolvedDependentCyclicRegisterAssignmentReference (2429 of 2474) PASS: lldb-shell :: SymbolFile/DWARF/x86/dir-separator-no-comp-dir-relative-name.s (2430 of 2474) PASS: lldb-unit :: Utility/./UtilityTests/SerializationRountripTest.SerializeDeserializeCStringArrayNullptr (2431 of 2474) PASS: lldb-api :: functionalities/archives/TestBSDArchives.py (2432 of 2474) PASS: lldb-api :: functionalities/data-formatter/data-formatter-stl/libcxx/function/TestLibCxxFunction.py (2433 of 2474) PASS: lldb-api :: functionalities/breakpoint/breakpoint_by_line_and_column/TestBreakpointByLineAndColumn.py (2434 of 2474) PASS: lldb-api :: lang/objcxx/objcxx-ivar-vector/TestIvarVector.py (2435 of 2474) PASS: lldb-api :: tools/lldb-vscode/breakpoint/TestVSCode_setBreakpoints.py (2436 of 2474) PASS: lldb-unit :: Utility/./UtilityTests/ArchSpecTest.Compatibility (2437 of 2474) PASS: lldb-unit :: Utility/./UtilityTests/StringExtractorTest.DecodeHexU8_Exact (2438 of 2474) PASS: lldb-api :: commands/disassemble/basic/TestFrameDisassemble.py (2439 of 2474) PASS: lldb-unit :: Utility/./UtilityTests/TimerTest.CategoryTimesStats (2440 of 2474) UNSUPPORTED: lldb-api :: tools/lldb-server/TestGdbRemoteFork.py (2441 of 2474) UNSUPPORTED: lldb-shell :: Subprocess/clone-follow-child-softbp.test (2442 of 2474) PASS: lldb-unit :: Utility/./UtilityTests/UserIDResolver.GetGroupName (2443 of 2474) PASS: lldb-api :: commands/target/dump/TestTargetDumpTypeSystem.py (2444 of 2474) PASS: lldb-api :: functionalities/data-formatter/varscript_formatting/TestDataFormatterVarScriptFormatting.py (2445 of 2474) PASS: lldb-api :: functionalities/postmortem/minidump/TestMiniDump.py (2446 of 2474) PASS: lldb-api :: lang/cpp/symbols/TestSymbols.py (2447 of 2474) PASS: lldb-api :: macosx/lc-note/kern-ver-str/TestKernVerStrLCNOTE.py (2448 of 2474) PASS: lldb-unit :: Utility/./UtilityTests/StatusTest.Formatv (2449 of 2474) PASS: lldb-unit :: Symbol/./SymbolTests/TestClangASTImporter.MetadataPropagationIndirectImport (2450 of 2474) PASS: lldb-unit :: Utility/./UtilityTests/LogChannelEnabledTest.LLDB_LOG_ERROR (2451 of 2474) PASS: lldb-unit :: Utility/./UtilityTests/ArgsTest.ReplaceArgumentAtIndexOutOfRange (2452 of 2474) PASS: lldb-api :: lang/c/conflicting-symbol/TestConflictingSymbol.py (2453 of 2474) PASS: lldb-unit :: ScriptInterpreter/Python/./ScriptInterpreterPythonTests/PythonDataObjectsTest.TestPythonDictionaryToStructuredDictionary (2454 of 2474) PASS: lldb-api :: functionalities/thread/concurrent_events/TestConcurrentWatchBreakDelay.py (2455 of 2474) PASS: lldb-shell :: SymbolFile/DWARF/x86/find-basic-variable.cpp (2456 of 2474) PASS: lldb-unit :: Symbol/./SymbolTests/TestTypeSystemClang.TestNotDeletingUserCopyCstrDueToMoveCStr (2457 of 2474) PASS: lldb-shell :: ObjectFile/PECOFF/dep-modules.yaml (2458 of 2474) PASS: lldb-api :: functionalities/thread/concurrent_events/TestConcurrentBreakpointOneDelayBreakpointThreads.py (2459 of 2474) PASS: lldb-shell :: ObjectFile/MachO/lc_build_version_notools.yaml (2460 of 2474) PASS: lldb-unit :: Target/./TargetTests/ModuleCacheTest.GetAndPutUuidExists (2461 of 2474) PASS: lldb-api :: functionalities/gdb_remote_client/TestArmRegisterDefinition.py (2462 of 2474) PASS: lldb-unit :: DataFormatter/./LLDBFormatterTests/TypeMatcherTests.RegexMatchPart (2463 of 2474) PASS: lldb-unit :: Interpreter/./InterpreterTests/OptionValueFileColonLine.setFromString (2464 of 2474) UNSUPPORTED: lldb-api :: commands/gui/breakpoints/TestGuiBreakpoints.py (2465 of 2474) PASS: lldb-api :: functionalities/tail_call_frames/sbapi_support/TestTailCallFrameSBAPI.py (2466 of 2474) PASS: lldb-api :: functionalities/data-formatter/user-format-vs-summary/TestUserFormatVsSummary.py (2467 of 2474) PASS: lldb-unit :: Utility/./UtilityTests/StringListTest.ForRangeEmpty (2468 of 2474) PASS: lldb-api :: tools/lldb-vscode/launch/TestVSCode_launch.py (2469 of 2474) PASS: lldb-api :: lang/objc/forward-decl/TestForwardDecl.py (2470 of 2474) PASS: lldb-unit :: DataFormatter/./LLDBFormatterTests/FormatManagerTests.CompatibleLangs (2471 of 2474) PASS: lldb-api :: functionalities/inline-stepping/TestInlineStepping.py (2472 of 2474) PASS: lldb-api :: commands/expression/import-std-module/shared_ptr/TestSharedPtrFromStdModule.py (2473 of 2474) PASS: lldb-api :: functionalities/memory-region/TestMemoryRegion.py (2474 of 2474) Slowest Tests: -------------------------------------------------------------------------- 274.01s: lldb-api :: functionalities/scripted_process/TestScriptedProcess.py 267.08s: lldb-api :: tools/lldb-server/TestLldbGdbServer.py 235.72s: lldb-api :: macosx/stack-corefile/TestStackCorefile.py 198.31s: lldb-api :: functionalities/memory-region/TestMemoryRegion.py 154.98s: lldb-api :: macosx/skinny-corefile/TestSkinnyCorefile.py 138.53s: lldb-api :: api/multithreaded/TestMultithreaded.py 91.52s: lldb-api :: functionalities/gdb_remote_client/TestWasm.py 86.88s: lldb-api :: types/TestLongTypesExpr.py 76.55s: lldb-api :: python_api/lldbutil/iter/TestLLDBIterator.py 73.81s: lldb-api :: commands/expression/import-std-module/vector/TestVectorFromStdModule.py 71.95s: lldb-api :: lang/objc/exceptions/TestObjCExceptions.py 70.70s: lldb-api :: commands/process/attach/TestProcessAttach.py 68.88s: lldb-api :: lang/cpp/namespace/TestNamespaceLookup.py 68.62s: lldb-api :: commands/expression/import-std-module/queue/TestQueueFromStdModule.py 67.28s: lldb-api :: lang/objc/hidden-ivars/TestHiddenIvars.py 67.08s: lldb-api :: commands/expression/import-std-module/stack/TestStackFromStdModule.py 61.64s: lldb-api :: lang/objc/objc-new-syntax/TestObjCNewSyntaxLiteral.py 60.02s: lldb-api :: types/TestIntegerTypeExpr.py 59.54s: lldb-api :: lang/objc/foundation/TestObjCMethods.py 50.51s: lldb-api :: tools/lldb-server/TestGdbRemoteThreadsInStopReply.py

Hide Details

Tests Times: -------------------------------------------------------------------------- [ Range ] :: [ Percentage ] :: [ Count ] -------------------------------------------------------------------------- [260s,280s) :: [ ] :: [ 2/2474] [240s,260s) :: [ ] :: [ 1/2474] [220s,240s) :: [ ] :: [ 0/2474] [200s,220s) :: [ ] :: [ 1/2474] [180s,200s) :: [ ] :: [ 0/2474] [160s,180s) :: [ ] :: [ 0/2474] [140s,160s) :: [ ] :: [ 2/2474] [120s,140s) :: [ ] :: [ 0/2474] [100s,120s) :: [ ] :: [ 0/2474] [ 80s,100s) :: [ ] :: [ 2/2474] [ 60s, 80s) :: [ ] :: [ 11/2474] [ 40s, 60s) :: [ ] :: [ 17/2474] [ 20s, 40s) :: [* ] :: [ 71/2474] [ 0s, 20s) :: [************************************** ] :: [2367/2474] -------------------------------------------------------------------------- ******************** Failed Tests (1): lldb-api :: functionalities/scripted_process/TestScriptedProcess.py

Hide Details

Hide Details

Testing Time: 2735.70s Unsupported : 232 Passed : 2231 Expectedly Failed: 10 Failed : 1 FAILED: tools/lldb/test/CMakeFiles/check-lldb cd /Users/buildslave/jenkins/workspace/lldb-cmake-sanitized/lldb-build/tools/lldb/test && /usr/local/Frameworks/Python.framework/Versions/3.7/bin/python3.7 /Users/buildslave/jenkins/workspace/lldb-cmake-sanitized/lldb-build/./bin/llvm-lit -v --time-tests --shuffle --xunit-xml-output=/Users/buildslave/jenkins/workspace/lldb-cmake-sanitized/test/results.xml -v -j 4 --timeout 1200 /Users/buildslave/jenkins/workspace/lldb-cmake-sanitized/lldb-build/tools/lldb/test ninja: build stopped: subcommand failed. Command failed: Command '['/usr/bin/env', 'TERM=vt100', '/usr/local/bin/ninja', '-v', 'check-lldb']' returned non-zero exit status 1. Command: ['/usr/bin/env', 'TERM=vt100', '/usr/local/bin/ninja', '-v', 'check-lldb'] [Pipeline] } [Pipeline] // timeout [Pipeline] } [Pipeline] // stage [Pipeline] stage [Pipeline] { (Declarative: Post Actions) [Pipeline] scanForIssues [Clang] Sleeping for 5 seconds due to JENKINS-32191... [Clang] Parsing console log (workspace: '/Users/buildslave/jenkins/workspace/lldb-cmake-sanitized') [Clang] -> found 0 issues (skipped 0 duplicates) [Clang] Parsing console log (workspace: '/Users/buildslave/jenkins/workspace/lldb-cmake-sanitized') [Clang] -> found 0 issues (skipped 0 duplicates) [Clang] Successfully parsed console log [Clang] -> found 0 issues (skipped 0 duplicates) [Clang] Parsing console log (workspace: '/Users/buildslave/jenkins/workspace/lldb-cmake-sanitized') [Clang] Skipping post processing [Clang] No filter has been set, publishing all 0 issues [Clang] Repository miner is not configured, skipping repository mining [Pipeline] junit Recording test results [Checks API] No suitable checks publisher found. [Pipeline] } [Pipeline] // stage [Pipeline] } [Pipeline] // withEnv [Pipeline] } [Pipeline] // node [Pipeline] End of Pipeline ERROR: script returned exit code 1 Finished: FAILURE