Console Output

Skipping 9,585 KB.. Full Log
PASS: lldb-api :: python_api/sbstructureddata/TestStructuredDataAPI.py (1173 of 2474)
PASS: lldb-unit :: Utility/./UtilityTests/OptionsWithRawTest.QuotedSuffix (1174 of 2474)
PASS: lldb-unit :: Utility/./UtilityTests/FileSpecTest.EqualDotsPosixRoot (1175 of 2474)
PASS: lldb-api :: functionalities/data-formatter/data-formatter-stl/libcxx/atomic/TestLibCxxAtomic.py (1176 of 2474)
PASS: lldb-unit :: Process/gdb-remote/./ProcessGdbRemoteTests/GDBRemoteCommunicationClientTest.ReadRegister (1177 of 2474)
PASS: lldb-api :: test_utils/base/TestBaseTest.py (1178 of 2474)
PASS: lldb-api :: commands/platform/sdk/TestPlatformSDK.py (1179 of 2474)
PASS: lldb-unit :: Utility/./UtilityTests/TimerTest.CategoryTimesNested (1180 of 2474)
PASS: lldb-api :: tools/lldb-vscode/launch/TestVSCode_launch.py (1181 of 2474)
PASS: lldb-unit :: UnwindAssembly/x86/./UnwindAssemblyx86Tests/Testx86AssemblyInspectionEngine.TestPushR12 (1182 of 2474)
PASS: lldb-unit :: Utility/./UtilityTests/BinaryStreamTest.PutSLEB128NineBytes (1183 of 2474)
PASS: lldb-api :: commands/expression/call-function/TestCallBuiltinFunction.py (1184 of 2474)
PASS: lldb-unit :: Utility/./UtilityTests/StringExtractorTest.GetHexU8_Underflow_NoEof (1185 of 2474)
PASS: lldb-unit :: ScriptInterpreter/Python/./ScriptInterpreterPythonTests/PythonDataObjectsTest.TestBorrowedReferences (1186 of 2474)
UNSUPPORTED: lldb-shell :: Register/x86-64-ymm16-read.test (1187 of 2474)
PASS: lldb-unit :: Utility/./UtilityTests/EnvironmentTest.EnvpConstruction (1188 of 2474)
PASS: lldb-unit :: Language/Highlighting/./HighlighterTests/HighlighterTest.DefaultHighlighterWithCursorOutOfBounds (1189 of 2474)
PASS: lldb-shell :: SymbolFile/DWARF/x86/debug-types-signature-loop.s (1190 of 2474)
PASS: lldb-unit :: Utility/./UtilityTests/StringListTest.JoinThree (1191 of 2474)
PASS: lldb-api :: functionalities/data-formatter/data-formatter-objc/TestDataFormatterObjCPlain.py (1192 of 2474)
PASS: lldb-unit :: Interpreter/./InterpreterTests/CompletionTest.FileCompletionAbsolute (1193 of 2474)
PASS: lldb-unit :: UnwindAssembly/x86/./UnwindAssemblyx86Tests/Testx86AssemblyInspectionEngine.TestPopESI (1194 of 2474)
PASS: lldb-unit :: Language/Highlighting/./HighlighterTests/HighlighterTest.ClangCursorPosAfterOtherToken (1195 of 2474)
PASS: lldb-unit :: Symbol/./SymbolTests/TestTypeSystemClang.OnlyPackName (1196 of 2474)
PASS: lldb-unit :: ScriptInterpreter/Python/./ScriptInterpreterPythonTests/PythonDataObjectsTest.TestPythonListToStructuredList (1197 of 2474)
PASS: lldb-unit :: Symbol/./SymbolTests/TestClangASTImporter.RecordLayout (1198 of 2474)
PASS: lldb-unit :: Platform/./LLDBPlatformTests/PlatformDarwinTest.FindComponentInPath (1199 of 2474)
PASS: lldb-shell :: Commands/command-regex-delete.test (1200 of 2474)
PASS: lldb-unit :: Host/./HostTests/TerminalTest.SetBaudRate (1201 of 2474)
PASS: lldb-unit :: Symbol/./SymbolTests/TestCreateClassTemplateDecl.FindExistingTemplatesWithParameterPack (1202 of 2474)
PASS: lldb-api :: python_api/sbplatform/TestSBPlatform.py (1203 of 2474)
PASS: lldb-api :: functionalities/launch_stop_at_entry/TestStopAtEntry.py (1204 of 2474)
PASS: lldb-unit :: Host/./HostTests/NativeProcessProtocolTest.ReadCStringFromMemory_MaxSize (1205 of 2474)
PASS: lldb-unit :: Host/./HostTests/MainLoopTest.TerminatesImmediately (1206 of 2474)
PASS: lldb-api :: lang/cpp/lambdas/TestLambdas.py (1207 of 2474)
PASS: lldb-unit :: Process/Utility/./ProcessUtilityTests/ProcMapTests/LinuxProcMapsTestFixture.ParseMapRegions/1 (1208 of 2474)
PASS: lldb-unit :: Utility/./UtilityTests/ArchSpecTest.Compatibility (1209 of 2474)
PASS: lldb-unit :: Utility/./UtilityTests/Flags.Clear (1210 of 2474)
PASS: lldb-unit :: Symbol/./SymbolTests/TestTypeSystemClang.TestConvertAccessTypeToAccessSpecifier (1211 of 2474)
PASS: lldb-unit :: Host/./HostTests/NativeProcessProtocolTest.SetBreakpointFailVerify (1212 of 2474)
PASS: lldb-unit :: ScriptInterpreter/Python/./ScriptInterpreterPythonTests/PythonDataObjectsTest.TestPythonListValueEquality (1213 of 2474)
PASS: lldb-unit :: Utility/./UtilityTests/BinaryStreamTest.PutULEB128ThreeBytes (1214 of 2474)
PASS: lldb-unit :: Utility/./UtilityTests/AnsiTerminal.KnownPrefix (1215 of 2474)
PASS: lldb-unit :: ScriptInterpreter/Python/./ScriptInterpreterPythonTests/PythonDataObjectsTest.TestOwnedReferences (1216 of 2474)
PASS: lldb-shell :: SymbolFile/DWARF/x86/debug_loclists-dwo.s (1217 of 2474)
PASS: lldb-unit :: Process/minidump/./LLDBMinidumpTests/MinidumpParserTest.GetMemoryRegionInfo (1218 of 2474)
PASS: lldb-api :: functionalities/breakpoint/address_breakpoints/TestAddressBreakpoints.py (1219 of 2474)
PASS: lldb-unit :: Host/./HostTests/MainLoopTest.Signal (1220 of 2474)
PASS: lldb-api :: lang/objcxx/conflicting-names-class-update-utility-expr/TestObjCConflictingNamesForClassUpdateExpr.py (1221 of 2474)
PASS: lldb-api :: functionalities/thread/concurrent_events/TestConcurrentCrashWithBreak.py (1222 of 2474)
PASS: lldb-api :: python_api/watchpoint/watchlocation/TestSetWatchlocation.py (1223 of 2474)
PASS: lldb-api :: lang/cpp/namespace_conflicts/TestNamespaceConflicts.py (1224 of 2474)
PASS: lldb-api :: functionalities/value_md5_crash/TestValueMD5Crash.py (1225 of 2474)
PASS: lldb-shell :: SymbolFile/DWARF/x86/find-basic-namespace.cpp (1226 of 2474)
PASS: lldb-shell :: ObjectFile/MachO/symtab.yaml (1227 of 2474)
PASS: lldb-api :: commands/command/script_alias/TestCommandScriptAlias.py (1228 of 2474)
PASS: lldb-api :: macosx/nslog/TestDarwinNSLogOutput.py (1229 of 2474)
PASS: lldb-unit :: Process/Utility/./ProcessUtilityTests/MemoryTagManagerAArch64MTETest.GetLogicalTag (1230 of 2474)
PASS: lldb-api :: lang/cpp/scope/TestCppScope.py (1231 of 2474)
PASS: lldb-shell :: Register/Core/x86-64-linux-addr.test (1232 of 2474)
PASS: lldb-api :: python_api/default-constructor/TestDefaultConstructorForAPIObjects.py (1233 of 2474)
PASS: lldb-shell :: Expr/TestMultilineExpr.test (1234 of 2474)
PASS: lldb-api :: functionalities/stop-on-sharedlibrary-load/TestStopOnSharedlibraryEvents.py (1235 of 2474)
PASS: lldb-unit :: Utility/./UtilityTests/FileSpecTest.CopyByAppendingPathComponent (1236 of 2474)
PASS: lldb-unit :: ScriptInterpreter/Python/./ScriptInterpreterPythonTests/PythonDataObjectsTest.TestResetting (1237 of 2474)
PASS: lldb-api :: python_api/sbdata/TestSBData.py (1238 of 2474)
PASS: lldb-unit :: Utility/./UtilityTests/ListenerTest.GetEventWait (1239 of 2474)
PASS: lldb-unit :: Utility/./UtilityTests/StringExtractorGDBRemoteTest.GetPidTid (1240 of 2474)
PASS: lldb-unit :: Host/./HostTests/NativeProcessProtocolTest.SetBreakpointFailWrite (1241 of 2474)
PASS: lldb-unit :: ScriptInterpreter/Python/./ScriptInterpreterPythonTests/PythonDataObjectsTest.TestPythonStringToStructuredString (1242 of 2474)
PASS: lldb-api :: functionalities/breakpoint/debugbreak/TestDebugBreak.py (1243 of 2474)
PASS: lldb-unit :: UnwindAssembly/x86/./UnwindAssemblyx86Tests/Testx86AssemblyInspectionEngine.TestDisassemblyMidFunctionEpilogues (1244 of 2474)
UNSUPPORTED: lldb-api :: functionalities/disassemble/aarch64-adrp-add/TestAArch64AdrpAdd.py (1245 of 2474)
PASS: lldb-api :: lang/objc/objc-static-method/TestObjCStaticMethod.py (1246 of 2474)
PASS: lldb-api :: functionalities/data-formatter/data-formatter-synthval/TestDataFormatterSynthVal.py (1247 of 2474)
PASS: lldb-unit :: Symbol/./SymbolTests/DWARFCallFrameInfoTest.Basic_dwarf3 (1248 of 2474)
PASS: lldb-unit :: Utility/./UtilityTests/AnsiTerminal.Empty (1249 of 2474)
PASS: lldb-shell :: SymbolFile/DWARF/x86/DW_AT_const_value-bitfields.s (1250 of 2474)
PASS: lldb-unit :: Utility/./UtilityTests/StringListTest.GetMaxStringLengthEmpty (1251 of 2474)
PASS: lldb-unit :: tools/lldb-server/tests/./LLDBServerTests/TestBase.DebugserverEnv (1252 of 2474)
PASS: lldb-unit :: Utility/./UtilityTests/StreamTest.PutChar (1253 of 2474)
PASS: lldb-api :: python_api/lldbutil/iter/TestRegistersIterator.py (1254 of 2474)
PASS: lldb-unit :: Platform/./LLDBPlatformTests/PlatformDarwinTest.GetCompatibleArchARMv4 (1255 of 2474)
PASS: lldb-unit :: Expression/./ExpressionTests/DWARFExpression.DW_OP_implicit_value (1256 of 2474)
PASS: lldb-api :: functionalities/process_group/TestChangeProcessGroup.py (1257 of 2474)
PASS: lldb-unit :: Utility/./UtilityTests/SerializationRountripTest.SerializeDeserializeCStringArray (1258 of 2474)
PASS: lldb-api :: lang/c/step-target/TestStepTarget.py (1259 of 2474)
PASS: lldb-api :: functionalities/data-formatter/data-formatter-objc/nsindexpath/TestDataFormatterNSIndexPath.py (1260 of 2474)
PASS: lldb-unit :: Process/gdb-remote/./ProcessGdbRemoteTests/GDBRemoteCommunicationServerTest.SendErrorResponse_ErrorNumber (1261 of 2474)
PASS: lldb-unit :: Utility/./UtilityTests/StringExtractorTest.GetHexU8_InvalidHex (1262 of 2474)
PASS: lldb-api :: functionalities/data-formatter/data-formatter-objc/TestDataFormatterObjCNSNumber.py (1263 of 2474)
UNSUPPORTED: lldb-api :: functionalities/signal/handle-segv/TestHandleSegv.py (1264 of 2474)
PASS: lldb-api :: lang/cpp/constructors/TestCppConstructors.py (1265 of 2474)
PASS: lldb-unit :: Utility/./UtilityTests/NameMatchesTest.Contains (1266 of 2474)
PASS: lldb-api :: lang/cpp/incompatible-class-templates/TestCppIncompatibleClassTemplates.py (1267 of 2474)
PASS: lldb-unit :: Utility/./UtilityTests/LogChannelTest.EnableOptions (1268 of 2474)
PASS: lldb-shell :: Breakpoint/single-file-split-dwarf.test (1269 of 2474)
PASS: lldb-unit :: Process/minidump/./LLDBMinidumpTests/MinidumpParserTest.GetLinuxProcStatus (1270 of 2474)
PASS: lldb-unit :: SymbolFile/DWARF/./SymbolFileDWARFTests/SymbolFileDWARFTests.TestAbbrevOrder1Start1 (1271 of 2474)
PASS: lldb-api :: lang/objc/radar-9691614/TestObjCMethodReturningBOOL.py (1272 of 2474)
PASS: lldb-shell :: ScriptInterpreter/Python/Crashlog/text.test (1273 of 2474)
PASS: lldb-api :: tools/lldb-server/TestGdbRemoteHostInfo.py (1274 of 2474)
PASS: lldb-unit :: Utility/./UtilityTests/ProcessInstanceInfo.DumpTable_invalidUID (1275 of 2474)
PASS: lldb-unit :: Host/./HostTests/TerminalTest.SaveRestoreRAII (1276 of 2474)
PASS: lldb-unit :: Symbol/./SymbolTests/TestCreateClassTemplateDecl.FindExistingTemplates (1277 of 2474)
PASS: lldb-api :: commands/command/script/import/TestImport.py (1278 of 2474)
PASS: lldb-shell :: SymbolFile/DWARF/x86/dwarf5-atomic.s (1279 of 2474)
PASS: lldb-unit :: Utility/./UtilityTests/StringListTest.Clear (1280 of 2474)
PASS: lldb-unit :: ScriptInterpreter/Python/./ScriptInterpreterPythonTests/PythonDataObjectsTest.TestScript (1281 of 2474)
PASS: lldb-unit :: Symbol/./SymbolTests/TestScratchTypeSystemClang.InferSubASTFromLangOpts (1282 of 2474)
PASS: lldb-api :: python_api/frame/get-variables/TestGetVariables.py (1283 of 2474)
PASS: lldb-api :: lang/cpp/class-template-non-type-parameter-pack/TestClassTemplateNonTypeParameterPack.py (1284 of 2474)
PASS: lldb-api :: lang/c/array_types/TestArrayTypes.py (1285 of 2474)
PASS: lldb-unit :: ObjectFile/Breakpad/./ObjectFileBreakpadTests/FileRecord.parse (1286 of 2474)
PASS: lldb-unit :: Utility/./UtilityTests/UriParserTest.SchemeHostSeparator2 (1287 of 2474)
PASS: lldb-unit :: Utility/./UtilityTests/ArchSpecTest.MergeFromMachOUnknown (1288 of 2474)
PASS: lldb-unit :: Process/Utility/./ProcessUtilityTests/MemoryTagManagerAArch64MTETest.PackTags (1289 of 2474)
PASS: lldb-unit :: Utility/./UtilityTests/StreamTest.ShiftOperatorStrings (1290 of 2474)
UNSUPPORTED: lldb-shell :: ScriptInterpreter/Lua/io.test (1291 of 2474)
PASS: lldb-api :: functionalities/thread/concurrent_events/TestConcurrentSignalBreak.py (1292 of 2474)
PASS: lldb-unit :: Host/./HostTests/TerminalTest.SetHardwareFlowControl (1293 of 2474)
PASS: lldb-unit :: Utility/./UtilityTests/ProcessInstanceInfo.DumpTable (1294 of 2474)
PASS: lldb-unit :: Process/minidump/./LLDBMinidumpTests/MinidumpParserTest.GetThreadsAndGetThreadContext (1295 of 2474)
PASS: lldb-unit :: Utility/./UtilityTests/LogChannelEnabledTest.LogThread (1296 of 2474)
PASS: lldb-shell :: Minidump/Windows/Sigsegv/sigsegv.test (1297 of 2474)
PASS: lldb-api :: python_api/hello_world/TestHelloWorld.py (1298 of 2474)
PASS: lldb-unit :: Language/Highlighting/./HighlighterTests/HighlighterTest.ClangIdentifiers (1299 of 2474)
UNSUPPORTED: lldb-api :: functionalities/tsan/multiple/TestTsanMultiple.py (1300 of 2474)
PASS: lldb-unit :: Expression/./ExpressionTests/DiagnosticManagerTest.AppendMessageNoDiag (1301 of 2474)
PASS: lldb-unit :: Host/./HostTests/TerminalTest.SetEcho (1302 of 2474)
PASS: lldb-api :: types/TestCharTypeExpr.py (1303 of 2474)
PASS: lldb-shell :: ObjectFile/wasm/basic.yaml (1304 of 2474)
PASS: lldb-unit :: Utility/./UtilityTests/StringLexerTest.Next (1305 of 2474)
PASS: lldb-shell :: Subprocess/fork-follow-parent.test (1306 of 2474)
XFAIL: lldb-shell :: Register/x86-64-ymm-write.test (1307 of 2474)
PASS: lldb-unit :: Expression/./ExpressionTests/ClangHostTest.ComputeClangResourceDirectory (1308 of 2474)
PASS: lldb-api :: commands/expression/call-function/TestCallStdStringFunction.py (1309 of 2474)
UNSUPPORTED: lldb-api :: functionalities/data-formatter/data-formatter-stl/libstdcpp/unique_ptr/TestDataFormatterStdUniquePtr.py (1310 of 2474)
PASS: lldb-api :: types/TestFloatTypes.py (1311 of 2474)
UNSUPPORTED: lldb-api :: functionalities/ubsan/basic/TestUbsanBasic.py (1312 of 2474)
PASS: lldb-api :: lang/cpp/function-local-class/TestCppFunctionLocalClass.py (1313 of 2474)
PASS: lldb-api :: functionalities/data-formatter/data-formatter-stl/generic/multiset/TestDataFormatterGenericMultiSet.py (1314 of 2474)
UNSUPPORTED: lldb-shell :: Register/aarch64-gp-read.test (1315 of 2474)
PASS: lldb-api :: api/command-return-object/TestSBCommandReturnObject.py (1316 of 2474)
PASS: lldb-unit :: ScriptInterpreter/Python/./ScriptInterpreterPythonTests/PythonDataObjectsTest.TestPythonBoolean (1317 of 2474)
PASS: lldb-unit :: Language/Highlighting/./HighlighterTests/HighlighterTest.ClangCursorPosBeforeOtherToken (1318 of 2474)
PASS: lldb-shell :: ObjectFile/PECOFF/basic-info-arm64.yaml (1319 of 2474)
PASS: lldb-unit :: Utility/./UtilityTests/DataExtractorTest.GetDoubleUnaligned (1320 of 2474)
PASS: lldb-unit :: Host/./HostTests/FileSystemTest.Exists (1321 of 2474)
PASS: lldb-unit :: Utility/./UtilityTests/ArgsTest.Yaml (1322 of 2474)
PASS: lldb-api :: commands/expression/import-std-module/list-dbg-info-content/TestDbgInfoContentListFromStdModule.py (1323 of 2474)
PASS: lldb-api :: macosx/duplicate-archive-members/TestDuplicateMembers.py (1324 of 2474)
UNSUPPORTED: lldb-shell :: ScriptInterpreter/Lua/partial_statements.test (1325 of 2474)
PASS: lldb-api :: functionalities/breakpoint/breakpoint_ids/TestBreakpointIDs.py (1326 of 2474)
PASS: lldb-shell :: SymbolFile/Breakpad/unwind-via-stack-cfi.test (1327 of 2474)
PASS: lldb-api :: commands/expression/radar_9673664/TestExprHelpExamples.py (1328 of 2474)
PASS: lldb-shell :: SymbolFile/DWARF/x86/DW_OP_piece-smaller-than-struct.s (1329 of 2474)
PASS: lldb-api :: lang/cpp/pointer_to_member_type_depending_on_parent_size/TestPointerToMemberTypeDependingOnParentSize.py (1330 of 2474)
PASS: lldb-shell :: ObjectFile/ELF/section-types-edgecases.yaml (1331 of 2474)
PASS: lldb-unit :: SymbolFile/DWARF/./SymbolFileDWARFTests/SymbolFileDWARFTests.TestAbilitiesForDWARF (1332 of 2474)
PASS: lldb-unit :: tools/lldb-server/tests/./LLDBServerTests/StandardStartupTest.TestStopReplyContainsThreadPcs (1333 of 2474)
PASS: lldb-shell :: SymbolFile/DWARF/x86/DW_AT_declaration-with-children.s (1334 of 2474)
PASS: lldb-unit :: Process/gdb-remote/./ProcessGdbRemoteTests/GDBRemoteCommunicationServerTest.SendErrorResponse_Status (1335 of 2474)
PASS: lldb-shell :: ObjectFile/ELF/base-address.yaml (1336 of 2474)
PASS: lldb-api :: commands/expression/diagnostics/TestExprDiagnostics.py (1337 of 2474)
PASS: lldb-unit :: Utility/./UtilityTests/OptionsWithRawTest.EmptyArgsOnlySuffix (1338 of 2474)
UNSUPPORTED: lldb-shell :: ObjectFile/ELF/minidebuginfo-set-and-hit-breakpoint.test (1339 of 2474)
PASS: lldb-unit :: Utility/./UtilityTests/ArchSpecTest.YAML (1340 of 2474)
PASS: lldb-unit :: Utility/./UtilityTests/FileSpecTest.GetPath (1341 of 2474)
UNSUPPORTED: lldb-api :: tools/lldb-server/registers-target-xml-reading/TestGdbRemoteTargetXmlPacket.py (1342 of 2474)
PASS: lldb-unit :: Utility/./UtilityTests/DataExtractorTest.PeekData (1343 of 2474)
PASS: lldb-unit :: Utility/./UtilityTests/SerializationRountripTest.SerializeDeserializeCString (1344 of 2474)
UNSUPPORTED: lldb-api :: commands/expression/completion-crash-invalid-iterator/TestInvalidIteratorCompletionCrash.py (1345 of 2474)
PASS: lldb-api :: tools/lldb-vscode/variables/TestVSCode_variables.py (1346 of 2474)
UNSUPPORTED: lldb-api :: iohandler/completion/TestIOHandlerCompletion.py (1347 of 2474)
UNSUPPORTED: lldb-shell :: SymbolFile/dissassemble-entry-point.s (1348 of 2474)
PASS: lldb-api :: lang/cpp/global_operators/TestCppGlobalOperators.py (1349 of 2474)
PASS: lldb-api :: lang/cpp/typedef/TestCppTypedef.py (1350 of 2474)
PASS: lldb-shell :: SymbolFile/DWARF/x86/dir-separator-no-comp-dir-relative-name.s (1351 of 2474)
PASS: lldb-api :: lang/objc/foundation/TestObjCMethodsNSError.py (1352 of 2474)
PASS: lldb-api :: lang/c/vla/TestVLA.py (1353 of 2474)
PASS: lldb-api :: python_api/process/io/TestProcessIO.py (1354 of 2474)
PASS: lldb-api :: commands/frame/var/TestFrameVar.py (1355 of 2474)
PASS: lldb-api :: lang/objc/modules-incomplete/TestIncompleteModules.py (1356 of 2474)
PASS: lldb-unit :: Expression/./ExpressionTests/DiagnosticManagerTest.GetStringBasic (1357 of 2474)
PASS: lldb-unit :: Utility/./UtilityTests/ScalarTest.SetValueFromCString (1358 of 2474)
UNSUPPORTED: lldb-api :: functionalities/asan/TestReportData.py (1359 of 2474)
PASS: lldb-unit :: ScriptInterpreter/Python/./ScriptInterpreterPythonTests/PythonDataObjectsTest.TestCallable (1360 of 2474)
PASS: lldb-unit :: Process/minidump/./LLDBMinidumpTests/MinidumpParserTest.GetMemoryRegionInfoLinuxMaps (1361 of 2474)
UNSUPPORTED: lldb-shell :: Subprocess/clone-follow-parent-wp.test (1362 of 2474)
UNSUPPORTED: lldb-api :: lang/cpp/reference-to-outer-type/TestCppReferenceToOuterClass.py (1363 of 2474)
PASS: lldb-api :: functionalities/thread/step_until/TestStepUntil.py (1364 of 2474)
PASS: lldb-unit :: Host/./HostTests/SocketTests/SocketTest.TCPListen0ConnectAccept/ipv4 (1365 of 2474)
PASS: lldb-api :: functionalities/data-formatter/data-formatter-enum-format/TestDataFormatterEnumFormat.py (1366 of 2474)
PASS: lldb-api :: functionalities/archives/TestBSDArchives.py (1367 of 2474)
PASS: lldb-api :: functionalities/thread/ignore_suspended/TestIgnoreSuspendedThread.py (1368 of 2474)
PASS: lldb-api :: macosx/add-dsym/TestAddDsymMidExecutionCommand.py (1369 of 2474)
PASS: lldb-api :: functionalities/inferior-changed/TestInferiorChanged.py (1370 of 2474)
PASS: lldb-api :: macosx/version_zero/TestGetVersionZeroVersion.py (1371 of 2474)
PASS: lldb-api :: commands/quit/TestQuit.py (1372 of 2474)
PASS: lldb-api :: lang/cpp/virtual-overload/TestVirtualOverload.py (1373 of 2474)
PASS: lldb-api :: functionalities/breakpoint/dummy_target_breakpoints/TestBreakpointsWithNoTargets.py (1374 of 2474)
PASS: lldb-unit :: SymbolFile/NativePDB/./SymbolFileNativePDBTests/PDBFPOProgramToDWARFExpressionTests.MissingTargetRegister (1375 of 2474)
UNSUPPORTED: lldb-api :: tools/lldb-server/vCont-threads/TestGdbRemote_vContThreads.py (1376 of 2474)
PASS: lldb-shell :: Driver/TestTarget.test (1377 of 2474)
PASS: lldb-shell :: Register/Core/x86-32-freebsd-addr.test (1378 of 2474)
PASS: lldb-api :: lang/cpp/function-qualifiers/TestCppFunctionQualifiers.py (1379 of 2474)
PASS: lldb-api :: lang/objc/objc-checker/TestObjCCheckers.py (1380 of 2474)
PASS: lldb-shell :: SymbolFile/DWARF/x86/dwo-type-in-main-file.s (1381 of 2474)
PASS: lldb-api :: functionalities/multidebugger_commands/TestMultipleDebuggersCommands.py (1382 of 2474)
PASS: lldb-unit :: Utility/./UtilityTests/AnsiTerminal.WhiteSpace (1383 of 2474)
PASS: lldb-unit :: ObjectFile/Breakpad/./ObjectFileBreakpadTests/InlineRecord.parse (1384 of 2474)
PASS: lldb-api :: functionalities/thread/concurrent_events/TestConcurrentCrashWithWatchpointBreakpointSignal.py (1385 of 2474)
PASS: lldb-api :: tools/lldb-server/TestLldbGdbServer.py (1386 of 2474)
PASS: lldb-unit :: Host/./HostTests/FileSystemTest.OpenErrno (1387 of 2474)
PASS: lldb-unit :: Utility/./UtilityTests/UriParserTest.BracketedHostnameWithPortIPv6 (1388 of 2474)
PASS: lldb-unit :: Process/minidump/./LLDBMinidumpTests/MinidumpParserTest.MinidumpModuleOrder (1389 of 2474)
PASS: lldb-unit :: UnwindAssembly/x86/./UnwindAssemblyx86Tests/Testx86AssemblyInspectionEngine.Test64bitFramelessBigStackFrame (1390 of 2474)
PASS: lldb-api :: functionalities/param_entry_vals/basic_entry_values/TestBasicEntryValues.py (1391 of 2474)
PASS: lldb-unit :: Utility/./UtilityTests/ProcessInstanceInfo.Yaml (1392 of 2474)
PASS: lldb-api :: functionalities/data-formatter/data-formatter-stl/libcxx/deque/TestDataFormatterLibcxxDeque.py (1393 of 2474)
PASS: lldb-unit :: Symbol/./SymbolTests/PostfixExpression.ParseFPOProgram (1394 of 2474)
PASS: lldb-unit :: Utility/./UtilityTests/RangeTest.ContainsEndInclusiveInvalid (1395 of 2474)
PASS: lldb-api :: macosx/find-dsym/bundle-with-dot-in-filename/TestBundleWithDotInFilename.py (1396 of 2474)
PASS: lldb-unit :: Expression/./ExpressionTests/DWARFExpression.DW_OP_unknown (1397 of 2474)
PASS: lldb-api :: commands/expression/import-std-module/forward_decl_from_module/TestForwardDeclFromStdModule.py (1398 of 2474)
UNSUPPORTED: lldb-api :: benchmarks/continue/TestBenchmarkContinue.py (1399 of 2474)
UNSUPPORTED: lldb-shell :: Subprocess/fork-follow-child-softbp.test (1400 of 2474)
PASS: lldb-unit :: Utility/./UtilityTests/ArgsTest.TestMultipleArgs (1401 of 2474)
PASS: lldb-shell :: ObjectFile/ELF/gnu-debuglink.yaml (1402 of 2474)
PASS: lldb-unit :: Utility/./UtilityTests/StreamTest.PutHex32ByteOrderBig (1403 of 2474)
UNSUPPORTED: lldb-api :: commands/trace/TestTraceSave.py (1404 of 2474)
PASS: lldb-shell :: SymbolFile/DWARF/x86/gnu-style-compression.cpp (1405 of 2474)
PASS: lldb-unit :: Target/./TargetTests/RemoteAwarePlatformTest.TestResolveExecutabelOnClientByPlatform (1406 of 2474)
PASS: lldb-unit :: Utility/./UtilityTests/DataExtractorTest.UncommonAddressSize (1407 of 2474)
PASS: lldb-unit :: Utility/./UtilityTests/NameMatchesTest.StartsWith (1408 of 2474)
UNSUPPORTED: lldb-shell :: Register/arm-gp-read.test (1409 of 2474)
PASS: lldb-shell :: Quit/TestQuitExitCodeHex0.test (1410 of 2474)
PASS: lldb-unit :: Symbol/./SymbolTests/DWARFCallFrameInfoTest.Basic_dwarf4 (1411 of 2474)
PASS: lldb-unit :: Symbol/./SymbolTests/TestTypeSystemClang.TestOwningModule (1412 of 2474)
PASS: lldb-api :: commands/command/source/TestCommandSource.py (1413 of 2474)
PASS: lldb-unit :: SymbolFile/NativePDB/./SymbolFileNativePDBTests/PDBFPOProgramToDWARFExpressionTests.MultipleDependentAssignments (1414 of 2474)
UNSUPPORTED: lldb-api :: functionalities/data-formatter/data-formatter-stl/libstdcpp/map/TestDataFormatterStdMap.py (1415 of 2474)
PASS: lldb-unit :: UnwindAssembly/x86/./UnwindAssemblyx86Tests/Testx86AssemblyInspectionEngine.Test64bitFramelessSmallStackFrame (1416 of 2474)
UNSUPPORTED: lldb-api :: functionalities/data-formatter/data-formatter-stl/libstdcpp/iterator/TestDataFormatterStdIterator.py (1417 of 2474)
UNSUPPORTED: lldb-api :: functionalities/ptrauth_diagnostics/LDRAA_error/TestPtrauthLDRAADiagnostic.py (1418 of 2474)
PASS: lldb-unit :: Host/./HostTests/File.GetWaitableHandleFileno (1419 of 2474)
PASS: lldb-unit :: Symbol/./SymbolTests/TestClangASTImporter.CompleteFwdDeclWithOtherOrigin (1420 of 2474)
PASS: lldb-unit :: Utility/./UtilityTests/StreamTest.AddressSize (1421 of 2474)
PASS: lldb-unit :: SymbolFile/DWARF/./SymbolFileDWARFTests/DWARFDIETest.ChildIteration (1422 of 2474)
PASS: lldb-api :: commands/expression/import-std-module/list/TestListFromStdModule.py (1423 of 2474)
PASS: lldb-unit :: UnwindAssembly/x86/./UnwindAssemblyx86Tests/Testx86AssemblyInspectionEngine.TestSubRSP (1424 of 2474)
PASS: lldb-unit :: UnwindAssembly/x86/./UnwindAssemblyx86Tests/Testx86AssemblyInspectionEngine.TestSimple32bitFrameFunction (1425 of 2474)
PASS: lldb-api :: commands/process/attach/TestProcessAttach.py (1426 of 2474)
PASS: lldb-api :: commands/expression/test/TestExprs.py (1427 of 2474)
PASS: lldb-unit :: UnwindAssembly/x86/./UnwindAssemblyx86Tests/Testx86AssemblyInspectionEngine.Test32bitFramelessSmallStackFrame (1428 of 2474)
UNSUPPORTED: lldb-api :: functionalities/data-formatter/data-formatter-stl/libstdcpp/smart_ptr/TestDataFormatterStdSmartPtr.py (1429 of 2474)
PASS: lldb-unit :: Utility/./UtilityTests/StringExtractorTest.GetHexBytesAvail_Underflow (1430 of 2474)
PASS: lldb-unit :: Target/./TargetTests/MCBasedABI.MapRegisterName (1431 of 2474)
PASS: lldb-unit :: UnwindAssembly/x86/./UnwindAssemblyx86Tests/Testx86AssemblyInspectionEngine.TestPopEDI (1432 of 2474)
PASS: lldb-api :: commands/watchpoints/multiple_threads/TestWatchpointMultipleThreads.py (1433 of 2474)
PASS: lldb-unit :: UnwindAssembly/x86/./UnwindAssemblyx86Tests/Testx86AssemblyInspectionEngine.TestPushR14 (1434 of 2474)
PASS: lldb-shell :: Reproducer/TestFileRepro.test (1435 of 2474)
PASS: lldb-unit :: ScriptInterpreter/Python/./ScriptInterpreterPythonTests/PythonDataObjectsTest.TestTypeNameResolutionNoDot (1436 of 2474)
PASS: lldb-shell :: Quit/TestQuitExitCode30.test (1437 of 2474)
PASS: lldb-api :: commands/platform/file/close/TestPlatformFileClose.py (1438 of 2474)
PASS: lldb-unit :: Utility/./UtilityTests/ScalarTest.Division (1439 of 2474)
PASS: lldb-api :: lang/objc/modules-auto-import/TestModulesAutoImport.py (1440 of 2474)
PASS: lldb-api :: python_api/target/TestTargetAPI.py (1441 of 2474)
PASS: lldb-unit :: UnwindAssembly/x86/./UnwindAssemblyx86Tests/Testx86AssemblyInspectionEngine.TestPopEBX (1442 of 2474)
PASS: lldb-unit :: Core/./LLDBCoreTests/FormatEntity.LookupAllEntriesInTree (1443 of 2474)
PASS: lldb-api :: functionalities/thread/concurrent_events/TestConcurrentNWatchNBreak.py (1444 of 2474)
UNSUPPORTED: lldb-shell :: ScriptInterpreter/Lua/breakpoint_callback.test (1445 of 2474)
PASS: lldb-unit :: UnwindAssembly/x86/./UnwindAssemblyx86Tests/Testx86AssemblyInspectionEngine.Test32BitOnlyInstruction (1446 of 2474)
PASS: lldb-unit :: Utility/./UtilityTests/StringListTest.SplitIntoLines (1447 of 2474)
PASS: lldb-unit :: Core/./LLDBCoreTests/DumpDataExtractorTest.NullStream (1448 of 2474)
PASS: lldb-shell :: ScriptInterpreter/None/import_module.test (1449 of 2474)
PASS: lldb-unit :: Utility/./UtilityTests/RangeTest.NotEqual (1450 of 2474)
PASS: lldb-unit :: Expression/./ExpressionTests/DiagnosticManagerTest.GetStringMultipleDiags (1451 of 2474)
PASS: lldb-shell :: SymbolFile/DWARF/x86/debug-types-missing-signature.test (1452 of 2474)
PASS: lldb-api :: commands/expression/formatters/TestFormatters.py (1453 of 2474)
PASS: lldb-shell :: SymbolFile/NativePDB/break-by-function.cpp (1454 of 2474)
XFAIL: lldb-shell :: Register/x86-64-fp-write.test (1455 of 2474)
PASS: lldb-api :: functionalities/data-formatter/ostypeformatting/TestFormattersOsType.py (1456 of 2474)
PASS: lldb-api :: macosx/order/TestOrderFile.py (1457 of 2474)
PASS: lldb-unit :: Host/./HostTests/SocketAddressTest.GetAddressInfo (1458 of 2474)
PASS: lldb-api :: macosx/safe-to-func-call/TestSafeFuncCalls.py (1459 of 2474)
PASS: lldb-shell :: SymbolFile/DWARF/x86/DW_AT_data_bit_offset-DW_OP_stack_value.s (1460 of 2474)
PASS: lldb-api :: commands/target/stop-hook/delete/TestTargetStopHookDelete.py (1461 of 2474)
PASS: lldb-api :: commands/expression/pr52257/TestExprCrash.py (1462 of 2474)
PASS: lldb-unit :: ObjectFile/Breakpad/./ObjectFileBreakpadTests/InlineOriginRecord.parse (1463 of 2474)
PASS: lldb-api :: functionalities/data-formatter/data-formatter-objc/TestDataFormatterObjCNSData.py (1464 of 2474)
PASS: lldb-api :: commands/expression/import-std-module/non-module-type-separation/TestNonModuleTypeSeparation.py (1465 of 2474)
PASS: lldb-unit :: Utility/./UtilityTests/ScalarTest.ComparisonFloat (1466 of 2474)
PASS: lldb-shell :: ScriptInterpreter/Python/sb_address_exception.test (1467 of 2474)
PASS: lldb-api :: macosx/function-starts/TestFunctionStarts.py (1468 of 2474)
UNSUPPORTED: lldb-api :: functionalities/exec/TestExec.py (1469 of 2474)
PASS: lldb-shell :: SymbolFile/NativePDB/function-types-builtins.cpp (1470 of 2474)
PASS: lldb-unit :: Utility/./UtilityTests/StringLexerTest.NextIf (1471 of 2474)
PASS: lldb-unit :: Utility/./UtilityTests/BinaryStreamTest.PutULEB128TwoBytes (1472 of 2474)
PASS: lldb-unit :: Utility/./UtilityTests/ArgsTest.DoubleQuotedItem (1473 of 2474)
PASS: lldb-unit :: Expression/./ExpressionTests/CppModuleConfigurationTest.Sysroot (1474 of 2474)
PASS: lldb-api :: lang/objc/rdar-10967107/TestRdar10967107.py (1475 of 2474)
PASS: lldb-api :: commands/frame/language/TestGuessLanguage.py (1476 of 2474)
PASS: lldb-unit :: Utility/./UtilityTests/ArgsTest.StringListConstructor (1477 of 2474)
PASS: lldb-unit :: Process/Utility/./ProcessUtilityTests/MemoryTagManagerAArch64MTETest.MakeTaggedRange (1478 of 2474)
PASS: lldb-unit :: Utility/./UtilityTests/GeneratorTest.GetOrCreate (1479 of 2474)
PASS: lldb-api :: lang/cpp/unsigned_types/TestUnsignedTypes.py (1480 of 2474)
PASS: lldb-unit :: Core/./LLDBCoreTests/UniqueCStringMap.NoDefaultConstructor (1481 of 2474)
PASS: lldb-unit :: Core/./LLDBCoreTests/MangledTest.ResultForValidDLangName (1482 of 2474)
PASS: lldb-unit :: Process/gdb-remote/./ProcessGdbRemoteTests/GDBRemoteClientBaseTest.InterruptNoResponse (1483 of 2474)
PASS: lldb-api :: lang/cpp/typeof/TestTypeOfDeclTypeExpr.py (1484 of 2474)
PASS: lldb-unit :: UnwindAssembly/x86/./UnwindAssemblyx86Tests/Testx86AssemblyInspectionEngine.TestPushRBX (1485 of 2474)
UNSUPPORTED: lldb-shell :: Subprocess/vfork-follow-parent-softbp.test (1486 of 2474)
PASS: lldb-unit :: Symbol/./SymbolTests/Type.GetTypeScopeAndBasename (1487 of 2474)
PASS: lldb-shell :: SymbolFile/DWARF/x86/find-function-regex.cpp (1488 of 2474)
PASS: lldb-api :: tools/lldb-vscode/coreFile/TestVSCode_coreFile.py (1489 of 2474)
PASS: lldb-api :: lang/cpp/operators/TestCppOperators.py (1490 of 2474)
PASS: lldb-unit :: SymbolFile/NativePDB/./SymbolFileNativePDBTests/PDBFPOProgramToDWARFExpressionTests.InvalidAssignmentMultiple (1491 of 2474)
PASS: lldb-unit :: Platform/./LLDBPlatformTests/PlatformDarwinTest.GetCompatibleArchARMv5 (1492 of 2474)
PASS: lldb-unit :: UnwindAssembly/x86/./UnwindAssemblyx86Tests/Testx86AssemblyInspectionEngine.Testi386IgnoredRegisters (1493 of 2474)
PASS: lldb-api :: functionalities/postmortem/minidump/TestMiniDump.py (1494 of 2474)
PASS: lldb-unit :: Utility/./UtilityTests/StringLexerTest.NextIfList (1495 of 2474)
PASS: lldb-api :: lang/c/forward/TestForwardDeclaration.py (1496 of 2474)
PASS: lldb-unit :: Expression/./ExpressionTests/CppModuleConfigurationTest.LinuxLocalLibCpp (1497 of 2474)
PASS: lldb-unit :: Symbol/./SymbolTests/Type.CompilerContextPattern (1498 of 2474)
PASS: lldb-unit :: Utility/./UtilityTests/OptionsWithRawTest.ArgsButNoDelimiter (1499 of 2474)
UNSUPPORTED: lldb-api :: lang/objc/ptr_refs/TestPtrRefsObjC.py (1500 of 2474)
UNSUPPORTED: lldb-api :: iohandler/resize/TestIOHandlerResize.py (1501 of 2474)
PASS: lldb-api :: commands/expression/timeout/TestCallWithTimeout.py (1502 of 2474)
PASS: lldb-unit :: UnwindAssembly/x86/./UnwindAssemblyx86Tests/Testx86AssemblyInspectionEngine.TestPushRBP (1503 of 2474)
PASS: lldb-unit :: Symbol/./SymbolTests/LineEntryTest.GetSameLineContiguousAddressRangeNestedInline (1504 of 2474)
UNSUPPORTED: lldb-shell :: Register/x86-zmm-write.test (1505 of 2474)
PASS: lldb-shell :: Reproducer/TestSynchronous.test (1506 of 2474)
PASS: lldb-api :: commands/target/create-no-such-arch/TestNoSuchArch.py (1507 of 2474)
PASS: lldb-api :: functionalities/data-formatter/data-formatter-stl/libcxx/list/loop/TestDataFormatterLibcxxListLoop.py (1508 of 2474)
PASS: lldb-shell :: SymbolFile/Breakpad/line-table-edgecases.test (1509 of 2474)
PASS: lldb-unit :: Utility/./UtilityTests/BinaryStreamTest.PutULEB128FourBytes (1510 of 2474)
PASS: lldb-unit :: Language/CPlusPlus/./LanguageCPlusPlusTests/CPlusPlusLanguage.CPlusPlusNameParser (1511 of 2474)
PASS: lldb-unit :: Process/Utility/./ProcessUtilityTests/ProcMapTests/LinuxProcMapsTestFixture.ParseMapRegions/6 (1512 of 2474)
PASS: lldb-unit :: Utility/./UtilityTests/ArgsTest.TestInsertArg (1513 of 2474)
PASS: lldb-unit :: Utility/./UtilityTests/StreamTest.ChangingByteOrder (1514 of 2474)
PASS: lldb-api :: macosx/debugserver-exit-code/TestDebugServerExitCode.py (1515 of 2474)
PASS: lldb-api :: python_api/value/change_values/TestChangeValueAPI.py (1516 of 2474)
PASS: lldb-shell :: Settings/TestDefaultModuleCachePath.test (1517 of 2474)
PASS: lldb-unit :: Utility/./UtilityTests/TimerTest.CategoryTimes2 (1518 of 2474)
PASS: lldb-shell :: SymbolFile/Breakpad/unwind-via-raSearch.test (1519 of 2474)
PASS: lldb-api :: commands/expression/pr35310/TestExprsBug35310.py (1520 of 2474)
UNSUPPORTED: lldb-api :: macosx/simulator/TestSimulatorPlatform.py (1521 of 2474)
PASS: lldb-api :: lang/c/complex_int/TestComplexInt.py (1522 of 2474)
PASS: lldb-shell :: ObjectFile/ELF/PT_LOAD-empty.yaml (1523 of 2474)
PASS: lldb-unit :: Utility/./UtilityTests/SerializationRountripTest.SerializeDeserializePod (1524 of 2474)
PASS: lldb-api :: functionalities/thread/concurrent_events/TestConcurrentSignalWatchBreak.py (1525 of 2474)
PASS: lldb-unit :: Host/./HostTests/SocketTests/SocketTest.DomainListenConnectAccept/ipv6 (1526 of 2474)
UNSUPPORTED: lldb-api :: terminal/TestEditline.py (1527 of 2474)
PASS: lldb-api :: functionalities/float-display/TestFloatDisplay.py (1528 of 2474)
PASS: lldb-unit :: Utility/./UtilityTests/RangeTest.ContainsAddrInvalid (1529 of 2474)
PASS: lldb-api :: functionalities/postmortem/netbsd-core/TestNetBSDCore.py (1530 of 2474)
PASS: lldb-api :: lang/cpp/namespace/TestNamespace.py (1531 of 2474)
PASS: lldb-shell :: SymbolFile/DWARF/x86/win-i386-line-table.s (1532 of 2474)
PASS: lldb-unit :: Utility/./UtilityTests/StreamTest.PutMaxHex64ByteOrderBig (1533 of 2474)
PASS: lldb-unit :: Process/gdb-remote/./ProcessGdbRemoteTests/GDBRemoteCommunicationClientTest.GetMemoryRegionInfo (1534 of 2474)
PASS: lldb-api :: functionalities/thread/concurrent_events/TestConcurrentCrashWithSignal.py (1535 of 2474)
PASS: lldb-unit :: Utility/./UtilityTests/ReproducerTest.SetReplay (1536 of 2474)
PASS: lldb-unit :: Utility/./UtilityTests/StreamTest.PutRawBytesToBigEndian (1537 of 2474)
PASS: lldb-api :: functionalities/gdb_remote_client/TestRegDefinitionInParts.py (1538 of 2474)
PASS: lldb-api :: commands/expression/namespace_local_var_same_name_cpp_and_c/TestNamespaceLocalVarSameNameCppAndC.py (1539 of 2474)
PASS: lldb-api :: commands/expression/expr-in-syscall/TestExpressionInSyscall.py (1540 of 2474)
UNSUPPORTED: lldb-shell :: SymbolFile/DWARF/x86/DW_TAG_variable-DW_AT_decl_file-DW_AT_abstract_origin-crosscu1.s (1541 of 2474)
PASS: lldb-shell :: Reproducer/TestProcessList.test (1542 of 2474)
PASS: lldb-unit :: SymbolFile/NativePDB/./SymbolFileNativePDBTests/PDBFPOProgramToDWARFExpressionTests.MultipleIndependentAssignments (1543 of 2474)
PASS: lldb-api :: commands/watchpoints/watchpoint_commands/command/TestWatchpointCommandPython.py (1544 of 2474)
PASS: lldb-unit :: Signals/./SignalsTests/UnixSignalsTest.Iteration (1545 of 2474)
PASS: lldb-unit :: SymbolFile/DWARF/./SymbolFileDWARFTests/SymbolFileDWARFTests.TestAbbrevInvalidNULLTag (1546 of 2474)
PASS: lldb-unit :: Utility/./UtilityTests/RangeTest.Union (1547 of 2474)
PASS: lldb-api :: types/TestShortType.py (1548 of 2474)
PASS: lldb-unit :: Host/./HostTests/MainLoopTest.TwoSignalCallbacks (1549 of 2474)
PASS: lldb-api :: functionalities/gdb_remote_client/TestMultiprocess.py (1550 of 2474)
PASS: lldb-unit :: Utility/./UtilityTests/ArgsTest.ReplaceArgumentAtIndexShort (1551 of 2474)
PASS: lldb-api :: lang/objc/modules-cache/TestClangModulesCache.py (1552 of 2474)
PASS: lldb-api :: commands/breakpoint/set/func-regex/TestBreakpointRegexError.py (1553 of 2474)
PASS: lldb-unit :: Utility/./UtilityTests/DataExtractorTest.GetDouble (1554 of 2474)
PASS: lldb-api :: commands/target/stop-hook/disable/TestTargetStopHookDisable.py (1555 of 2474)
PASS: lldb-api :: functionalities/inline-stepping/TestInlineStepping.py (1556 of 2474)
PASS: lldb-unit :: Utility/./UtilityTests/StringListTest.RemoveBlankLines (1557 of 2474)
PASS: lldb-api :: functionalities/abbreviation/TestAbbreviations.py (1558 of 2474)
PASS: lldb-unit :: Utility/./UtilityTests/LogTest.Register (1559 of 2474)
PASS: lldb-shell :: SymbolFile/DWARF/x86/dwarf5-partial-index.cpp (1560 of 2474)
PASS: lldb-unit :: Utility/./UtilityTests/BinaryStreamTest.PutULEB128EightBytes (1561 of 2474)
PASS: lldb-unit :: Language/Highlighting/./HighlighterTests/HighlighterTest.ClangComments (1562 of 2474)
PASS: lldb-shell :: Breakpoint/breakpoint-command.test (1563 of 2474)
PASS: lldb-unit :: Expression/./ExpressionTests/CppModuleConfigurationTest.AmbiguousCLib (1564 of 2474)
PASS: lldb-api :: commands/thread/select/TestThreadSelect.py (1565 of 2474)
PASS: lldb-api :: functionalities/data-formatter/data-formatter-stl/libcxx/unordered/TestDataFormatterUnordered.py (1566 of 2474)
PASS: lldb-unit :: Utility/./UtilityTests/StringExtractorTest.GetHexU8_Underflow (1567 of 2474)
PASS: lldb-api :: functionalities/data-formatter/data-formatter-stl/generic/set/TestDataFormatterGenericSet.py (1568 of 2474)
PASS: lldb-api :: lang/cpp/char1632_t/TestChar1632T.py (1569 of 2474)
PASS: lldb-unit :: Utility/./UtilityTests/FileSpecTest.Yaml (1570 of 2474)
PASS: lldb-shell :: Minidump/Windows/broken-unwind.test (1571 of 2474)
UNSUPPORTED: lldb-shell :: ScriptInterpreter/Lua/bindings.test (1572 of 2474)
PASS: lldb-unit :: Expression/./ExpressionTests/DiagnosticManagerTest.PutString (1573 of 2474)
PASS: lldb-shell :: ObjectFile/ELF/netbsd-exec-8.99.30-amd64.yaml (1574 of 2474)
PASS: lldb-unit :: Utility/./UtilityTests/OptionsWithRawTest.WhitespaceInput (1575 of 2474)
PASS: lldb-shell :: SymbolFile/DWARF/dwo-relative-path.s (1576 of 2474)
PASS: lldb-unit :: Utility/./UtilityTests/FileSpecTest.Match (1577 of 2474)
PASS: lldb-unit :: Symbol/./SymbolTests/TestTypeSystemClang.TestGetBasicTypeFromName (1578 of 2474)
PASS: lldb-api :: python_api/frame/inlines/TestInlinedFrame.py (1579 of 2474)
PASS: lldb-api :: tools/lldb-vscode/breakpoint/TestVSCode_setBreakpoints.py (1580 of 2474)
PASS: lldb-api :: terminal/TestSTTYBeforeAndAfter.py (1581 of 2474)
PASS: lldb-shell :: BuildScript/toolchain-clang.test (1582 of 2474)
PASS: lldb-shell :: Driver/TestPositionalArgs.test (1583 of 2474)
PASS: lldb-api :: sanity/TestModuleCacheSanity.py (1584 of 2474)
PASS: lldb-api :: lang/objc/objc++/TestObjCXX.py (1585 of 2474)
PASS: lldb-api :: functionalities/unwind/zeroth_frame/TestZerothFrame.py (1586 of 2474)
PASS: lldb-unit :: UnwindAssembly/x86/./UnwindAssemblyx86Tests/Testx86AssemblyInspectionEngine.TestSpArithx86_64Augmented (1587 of 2474)
PASS: lldb-unit :: Process/gdb-remote/./ProcessGdbRemoteTests/GDBRemoteCommunicationServerTest.SendErrorResponse_ErrorList (1588 of 2474)
PASS: lldb-unit :: Utility/./UtilityTests/SerializationRountripTest.SerializeDeserializePodReferences (1589 of 2474)
UNSUPPORTED: lldb-shell :: BuildScript/toolchain-msvc.test (1590 of 2474)
PASS: lldb-shell :: Settings/TestModuleCacheSanity.test (1591 of 2474)
PASS: lldb-unit :: Target/./TargetTests/PathMappingListTest.RemapRoot (1592 of 2474)
PASS: lldb-api :: lang/cpp/breakpoint-commands/TestCPPBreakpointCommands.py (1593 of 2474)
PASS: lldb-unit :: Utility/./UtilityTests/StringListTest.GetSize (1594 of 2474)
PASS: lldb-unit :: Utility/./UtilityTests/ScalarTest.Scalar_512 (1595 of 2474)
PASS: lldb-unit :: Utility/./UtilityTests/RangeTest.SetRangeBase (1596 of 2474)
UNSUPPORTED: lldb-api :: tools/lldb-server/TestGdbRemoteCompletion.py (1597 of 2474)
PASS: lldb-api :: lang/cpp/signed_types/TestSignedTypes.py (1598 of 2474)
UNSUPPORTED: lldb-api :: lang/objc/conflicting-class-list-function-from-user/TestObjCClassListFunctionFromUser.py (1599 of 2474)
PASS: lldb-api :: functionalities/target_var/no_vars/TestTargetVarNoVars.py (1600 of 2474)
PASS: lldb-unit :: Utility/./UtilityTests/ProcessInstanceInfoList.Yaml (1601 of 2474)
PASS: lldb-unit :: Utility/./UtilityTests/GeneratorTest.Create (1602 of 2474)
UNSUPPORTED: lldb-api :: linux/sepdebugsymlink/TestTargetSymbolsSepDebugSymlink.py (1603 of 2474)
PASS: lldb-shell :: Register/Core/x86-64-linux-multithread.test (1604 of 2474)
PASS: lldb-unit :: Symbol/./SymbolTests/LineEntryTest.GetSameLineContiguousAddressRangeOneInline (1605 of 2474)
PASS: lldb-unit :: Utility/./UtilityTests/StreamTest.PutULEB128 (1606 of 2474)
PASS: lldb-unit :: Utility/./UtilityTests/DeserializerTest.HasData (1607 of 2474)
PASS: lldb-unit :: Core/./LLDBCoreTests/MangledTest.EmptyForInvalidName (1608 of 2474)
PASS: lldb-api :: lang/cpp/dynamic-value/TestDynamicValue.py (1609 of 2474)
PASS: lldb-api :: functionalities/gdb_remote_client/TestGDBRemoteDiskFileCompletion.py (1610 of 2474)
PASS: lldb-api :: lang/objc/hidden-ivars/TestHiddenIvars.py (1611 of 2474)
PASS: lldb-shell :: ObjectFile/ELF/section-addresses.yaml (1612 of 2474)
PASS: lldb-shell :: ObjectFile/Breakpad/uuid-matching-mac.test (1613 of 2474)
PASS: lldb-api :: tools/lldb-server/thread-name/TestGdbRemoteThreadName.py (1614 of 2474)
PASS: lldb-api :: functionalities/data-formatter/vector-types/TestVectorTypesFormatting.py (1615 of 2474)
PASS: lldb-api :: commands/expression/ir-interpreter/TestIRInterpreter.py (1616 of 2474)
UNSUPPORTED: lldb-api :: functionalities/thread/multi_break/TestMultipleBreakpoints.py (1617 of 2474)
PASS: lldb-api :: functionalities/thread/concurrent_events/TestConcurrentDelayWatchBreak.py (1618 of 2474)
PASS: lldb-api :: commands/expression/persistent_types/TestPersistentTypes.py (1619 of 2474)
PASS: lldb-unit :: ObjectFile/PECOFF/./ObjectFilePECOFFTests/PECallFrameInfoTest.Chained_eh (1620 of 2474)
PASS: lldb-unit :: Host/./HostTests/HostInfoTest.GetXcodeSDK (1621 of 2474)
PASS: lldb-shell :: SymbolFile/DWARF/x86/DW_AT_loclists_base.s (1622 of 2474)
PASS: lldb-api :: python_api/signals/TestSignalsAPI.py (1623 of 2474)
PASS: lldb-shell :: ScriptInterpreter/Python/fail_breakpoint_oneline.test (1624 of 2474)
PASS: lldb-shell :: ObjectFile/PECOFF/symbol.yaml (1625 of 2474)
PASS: lldb-unit :: Utility/./UtilityTests/ScalarTest.GetValue (1626 of 2474)
PASS: lldb-unit :: SymbolFile/NativePDB/./SymbolFileNativePDBTests/PDBFPOProgramToDWARFExpressionTests.InvalidOpBinary (1627 of 2474)
PASS: lldb-unit :: Utility/./UtilityTests/StreamTest.PutPtr (1628 of 2474)
PASS: lldb-shell :: SymbolFile/DWARF/x86/apple-index-is-used.cpp (1629 of 2474)
UNSUPPORTED: lldb-api :: commands/trace/TestTraceStartStop.py (1630 of 2474)
PASS: lldb-unit :: Utility/./UtilityTests/CompletionRequest.DuplicateFilteringWithComments (1631 of 2474)
PASS: lldb-shell :: SymbolFile/Breakpad/symtab-macho.test (1632 of 2474)
PASS: lldb-api :: lang/objc/real-definition/TestRealDefinition.py (1633 of 2474)
PASS: lldb-shell :: Register/Core/x86-64-linux-gp.test (1634 of 2474)
UNSUPPORTED: lldb-shell :: SymbolFile/NativePDB/stack_unwinding01.cpp (1635 of 2474)
PASS: lldb-api :: macosx/load-kext/TestLoadKext.py (1636 of 2474)
PASS: lldb-api :: commands/expression/import-std-module/shared_ptr/TestSharedPtrFromStdModule.py (1637 of 2474)
PASS: lldb-api :: commands/expression/cast_int_to_anonymous_enum/TestCastIntToAnonymousEnum.py (1638 of 2474)
PASS: lldb-api :: commands/expression/invalid-args/TestInvalidArgsExpression.py (1639 of 2474)
PASS: lldb-api :: functionalities/signal/TestSendSignal.py (1640 of 2474)
PASS: lldb-unit :: Utility/./UtilityTests/LogChannelEnabledTest.LLDB_LOG_ERROR (1641 of 2474)
PASS: lldb-shell :: ObjectFile/ELF/PT_LOAD-overlap-section.yaml (1642 of 2474)
PASS: lldb-api :: functionalities/data-formatter/data-formatter-stl/libcxx/unique_ptr/TestDataFormatterLibcxxUniquePtr.py (1643 of 2474)
PASS: lldb-api :: commands/frame/recognizer/TestFrameRecognizer.py (1644 of 2474)
PASS: lldb-unit :: Symbol/./SymbolTests/TestTypeSystemClang.TestRecordHasFields (1645 of 2474)
PASS: lldb-unit :: UnwindAssembly/x86/./UnwindAssemblyx86Tests/Testx86AssemblyInspectionEngine.TestPushExtended (1646 of 2474)
PASS: lldb-api :: lang/cpp/incomplete-types/TestCppIncompleteTypes.py (1647 of 2474)
PASS: lldb-unit :: SymbolFile/NativePDB/./SymbolFileNativePDBTests/PDBFPOProgramToDWARFExpressionTests.UnresolvedRegisterReference (1648 of 2474)
PASS: lldb-unit :: Host/./HostTests/Host.WaitStatusFormat (1649 of 2474)
PASS: lldb-unit :: Utility/./UtilityTests/RecordReplayTest.InstrumentedBarRef (1650 of 2474)
PASS: lldb-shell :: SymbolFile/NativePDB/function-types-classes.cpp (1651 of 2474)
PASS: lldb-unit :: Utility/./UtilityTests/BroadcasterTest.EventTypeHasListeners (1652 of 2474)
PASS: lldb-api :: lang/cpp/global_variables/TestCPPGlobalVariables.py (1653 of 2474)
PASS: lldb-unit :: Utility/./UtilityTests/ArchSpecTest.TripleComponentsWereSpecified (1654 of 2474)
PASS: lldb-unit :: Utility/./UtilityTests/OptionsWithRawTest.EmptySuffix (1655 of 2474)
PASS: lldb-shell :: Reproducer/Functionalities/TestDataFormatter.test (1656 of 2474)
PASS: lldb-unit :: Utility/./UtilityTests/LogTest.Unregister (1657 of 2474)
PASS: lldb-api :: lang/c/unicode/TestUnicodeSymbols.py (1658 of 2474)
PASS: lldb-unit :: Utility/./UtilityTests/StringLexerTest.Peek (1659 of 2474)
PASS: lldb-unit :: ScriptInterpreter/Python/./ScriptInterpreterPythonTests/PythonDataObjectsTest.TestPythonBytes (1660 of 2474)
PASS: lldb-unit :: SymbolFile/NativePDB/./SymbolFileNativePDBTests/PDBFPOProgramToDWARFExpressionTests.UnresolvedRegisterAssignmentReference (1661 of 2474)
PASS: lldb-unit :: Utility/./UtilityTests/TimerTest.CategoryTimes (1662 of 2474)
PASS: lldb-unit :: Process/minidump/./LLDBMinidumpTests/MinidumpParserTest.GetThreadContext_x86_32 (1663 of 2474)
PASS: lldb-api :: commands/expression/class_template_specialization_empty_pack/TestClassTemplateSpecializationParametersHandling.py (1664 of 2474)
PASS: lldb-api :: api/listeners/TestListener.py (1665 of 2474)
PASS: lldb-api :: lang/cpp/type_lookup/TestCppTypeLookup.py (1666 of 2474)
PASS: lldb-shell :: Commands/command-source.test (1667 of 2474)
PASS: lldb-unit :: Utility/./UtilityTests/UriParserTest.MinimalPort (1668 of 2474)
PASS: lldb-api :: lang/objc/ivar-IMP/TestObjCiVarIMP.py (1669 of 2474)
PASS: lldb-unit :: Utility/./UtilityTests/RangeDataVector.FindEntryThatContains (1670 of 2474)
UNSUPPORTED: lldb-api :: commands/register/register/aarch64_dynamic_regset/TestArm64DynamicRegsets.py (1671 of 2474)
PASS: lldb-api :: python_api/thread/TestThreadAPI.py (1672 of 2474)
PASS: lldb-api :: functionalities/gdb_remote_client/TestFork.py (1673 of 2474)
PASS: lldb-unit :: Utility/./UtilityTests/StringListTest.SplitIntoLinesEmpty (1674 of 2474)
PASS: lldb-unit :: Utility/./UtilityTests/IndexToObjectTest.ObjectForIndex (1675 of 2474)
PASS: lldb-shell :: ObjectFile/PDB/object.test (1676 of 2474)
PASS: lldb-api :: functionalities/load_lazy/TestLoadUsingLazyBind.py (1677 of 2474)
PASS: lldb-unit :: Process/gdb-remote/./ProcessGdbRemoteTests/GDBRemoteClientBaseTest.SendContinueAndInterrupt2PacketBug (1678 of 2474)
PASS: lldb-unit :: UnwindAssembly/x86/./UnwindAssemblyx86Tests/Testx86AssemblyInspectionEngine.TestPopEBP (1679 of 2474)
PASS: lldb-api :: commands/expression/import-std-module/retry-with-std-module/TestRetryWithStdModule.py (1680 of 2474)
PASS: lldb-unit :: Utility/./UtilityTests/CompletionRequest.DuplicateFiltering (1681 of 2474)
PASS: lldb-api :: tools/lldb-server/TestGdbRemoteKill.py (1682 of 2474)
PASS: lldb-api :: functionalities/postmortem/elf-core/thread_crash/TestLinuxCoreThreads.py (1683 of 2474)
PASS: lldb-unit :: Symbol/./SymbolTests/TestTypeSystemMap.GetTypeSystemForLanguageWithNoTarget (1684 of 2474)
PASS: lldb-api :: python_api/interpreter/TestCommandInterpreterAPI.py (1685 of 2474)
PASS: lldb-api :: functionalities/tail_call_frames/ambiguous_tail_call_seq1/TestAmbiguousTailCallSeq1.py (1686 of 2474)
PASS: lldb-unit :: ScriptInterpreter/Python/./ScriptInterpreterPythonTests/PythonDataObjectsTest.TestPythonIntegerToStr (1687 of 2474)
PASS: lldb-unit :: Host/./HostTests/SocketTests/SocketTest.UDPGetConnectURI/ipv6 (1688 of 2474)
PASS: lldb-unit :: Process/Utility/./ProcessUtilityTests/ProcSMapTests/LinuxProcSMapsTestFixture.ParseSMapRegions/9 (1689 of 2474)
PASS: lldb-unit :: Host/./HostTests/SocketTests/SocketTest.DomainGetConnectURI/ipv6 (1690 of 2474)
PASS: lldb-unit :: Utility/./UtilityTests/StreamTest.PutHex32ByteOrderLittle (1691 of 2474)
PASS: lldb-shell :: Register/Core/x86-64-freebsd-fp.test (1692 of 2474)
PASS: lldb-api :: functionalities/data-formatter/user-format-vs-summary/TestUserFormatVsSummary.py (1693 of 2474)
PASS: lldb-unit :: Interpreter/./InterpreterTests/TestProperties.DeepCopy (1694 of 2474)
PASS: lldb-shell :: Minidump/fb-dump.test (1695 of 2474)
UNSUPPORTED: lldb-api :: functionalities/breakpoint/hardware_breakpoints/hardware_breakpoint_on_multiple_threads/TestHWBreakMultiThread.py (1696 of 2474)
PASS: lldb-api :: lang/objc/objc-struct-argument/TestObjCStructArgument.py (1697 of 2474)
UNSUPPORTED: lldb-api :: functionalities/data-formatter/data-formatter-stl/libstdcpp/string/TestDataFormatterStdString.py (1698 of 2474)
PASS: lldb-api :: tools/lldb-vscode/console/TestVSCode_redirection_to_console.py (1699 of 2474)
PASS: lldb-shell :: ObjectFile/PECOFF/sections-names.yaml (1700 of 2474)
PASS: lldb-unit :: Expression/./ExpressionTests/CppModuleConfigurationTest.IgnoreLibStdCpp (1701 of 2474)
UNSUPPORTED: lldb-shell :: ScriptInterpreter/Lua/persistent_state.test (1702 of 2474)
PASS: lldb-api :: functionalities/thread/backtrace_all/TestBacktraceAll.py (1703 of 2474)
PASS: lldb-shell :: SymbolFile/DWARF/deterministic-build.cpp (1704 of 2474)
PASS: lldb-unit :: Core/./LLDBCoreTests/ModuleSpecTest.TestMachOFile (1705 of 2474)
UNSUPPORTED: lldb-api :: functionalities/data-formatter/data-formatter-stl/libstdcpp/vbool/TestDataFormatterStdVBool.py (1706 of 2474)
PASS: lldb-api :: functionalities/data-formatter/parray/TestPrintArray.py (1707 of 2474)
PASS: lldb-shell :: Host/TestCustomShell.test (1708 of 2474)
PASS: lldb-unit :: Utility/./UtilityTests/StringListTest.AppendListCStringArray (1709 of 2474)
UNSUPPORTED: lldb-shell :: Subprocess/clone-follow-child-wp.test (1710 of 2474)
PASS: lldb-shell :: Minidump/Windows/find-module.test (1711 of 2474)
PASS: lldb-shell :: Settings/TestEchoCommands.test (1712 of 2474)
PASS: lldb-api :: commands/expression/vector_of_enums/TestVectorOfEnums.py (1713 of 2474)
PASS: lldb-api :: functionalities/data-formatter/array_typedef/TestArrayTypedef.py (1714 of 2474)
PASS: lldb-unit :: Language/Highlighting/./HighlighterTests/HighlighterTest.ClangCursorPosEndOfLine (1715 of 2474)
PASS: lldb-unit :: Process/gdb-remote/./ProcessGdbRemoteTests/GDBRemoteClientBaseTest.SendContinueDelegateInterface (1716 of 2474)
UNSUPPORTED: lldb-shell :: ScriptInterpreter/Lua/breakpoint_function_callback.test (1717 of 2474)
UNSUPPORTED: lldb-api :: linux/aarch64/unwind_signal/TestUnwindSignal.py (1718 of 2474)
XFAIL: lldb-shell :: SymbolFile/DWARF/find-type-in-function.cpp (1719 of 2474)
PASS: lldb-unit :: SymbolFile/DWARF/./SymbolFileDWARFTests/DWARFUnitTest.ClangProducer (1720 of 2474)
PASS: lldb-shell :: SymbolFile/DWARF/x86/dwarf5_tu_index_abbrev_offset.s (1721 of 2474)
PASS: lldb-unit :: UnwindAssembly/x86/./UnwindAssemblyx86Tests/Testx86AssemblyInspectionEngine.TestSpillRegToStackViaMOVi386 (1722 of 2474)
UNSUPPORTED: lldb-shell :: Register/x86-ymm-read.test (1723 of 2474)
PASS: lldb-api :: lang/objc/objc-property/TestObjCProperty.py (1724 of 2474)
PASS: lldb-api :: functionalities/breakpoint/source_regexp/TestSourceRegexBreakpoints.py (1725 of 2474)
UNSUPPORTED: lldb-api :: functionalities/tsan/thread_leak/TestTsanThreadLeak.py (1726 of 2474)
PASS: lldb-api :: functionalities/gdb_remote_client/TestTargetXMLArch.py (1727 of 2474)
PASS: lldb-unit :: Utility/./UtilityTests/FileSpecTest.EqualDotsWindows (1728 of 2474)
PASS: lldb-unit :: Expression/./ExpressionTests/CppModuleConfigurationTest.MissingLibCpp (1729 of 2474)
PASS: lldb-shell :: ObjectFile/PECOFF/sections.yaml (1730 of 2474)
PASS: lldb-shell :: SymbolFile/DWARF/x86/find-variable-dwo.cpp (1731 of 2474)
PASS: lldb-api :: test_utils/TestInlineTest.py (1732 of 2474)
UNSUPPORTED: lldb-api :: android/platform/TestDefaultCacheLineSize.py (1733 of 2474)
PASS: lldb-unit :: Expression/./ExpressionTests/DWARFExpressionMockProcessTest.DW_OP_deref (1734 of 2474)
PASS: lldb-api :: commands/target/auto-install-main-executable/TestAutoInstallMainExecutable.py (1735 of 2474)
PASS: lldb-unit :: Symbol/./SymbolTests/TestTypeSystemMap.GetTypeSystemForLanguageWithInvalidModule (1736 of 2474)
PASS: lldb-shell :: Register/Core/x86-64-netbsd-multithread.test (1737 of 2474)
PASS: lldb-api :: functionalities/data-formatter/data-formatter-objc/cmtime/TestDataFormatterCMTime.py (1738 of 2474)
PASS: lldb-api :: functionalities/data-formatter/data-formatter-script/TestDataFormatterScript.py (1739 of 2474)
PASS: lldb-unit :: Utility/./UtilityTests/BinaryStreamTest.PutSLEB128FourBytes (1740 of 2474)
PASS: lldb-shell :: Subprocess/fork-follow-parent-wp.test (1741 of 2474)
PASS: lldb-unit :: Utility/./UtilityTests/StreamTest.PutHex16ByteOrderBig (1742 of 2474)
PASS: lldb-unit :: Utility/./UtilityTests/StringExtractorTest.GetHexU8_Exact (1743 of 2474)
PASS: lldb-unit :: ObjectFile/Breakpad/./ObjectFileBreakpadTests/InfoRecord.parse (1744 of 2474)
PASS: lldb-shell :: SymbolFile/DWARF/x86/find-basic-variable.cpp (1745 of 2474)
PASS: lldb-api :: functionalities/gdb_remote_client/TestGDBRemoteLoad.py (1746 of 2474)
PASS: lldb-unit :: Utility/./UtilityTests/OptionsWithRawTest.EmptyInput (1747 of 2474)
PASS: lldb-shell :: Register/x86-64-ymm-read.test (1748 of 2474)
PASS: lldb-unit :: Utility/./UtilityTests/FileSpecTest.FormatFileSpec (1749 of 2474)
PASS: lldb-api :: lang/objc/rdar-11355592/TestRdar11355592.py (1750 of 2474)
PASS: lldb-unit :: UnwindAssembly/x86/./UnwindAssemblyx86Tests/Testx86AssemblyInspectionEngine.TestPopR15 (1751 of 2474)
PASS: lldb-api :: lang/cpp/static_methods/TestCPPStaticMethods.py (1752 of 2474)
PASS: lldb-api :: functionalities/data-formatter/data-formatter-python-synth/TestDataFormatterPythonSynth.py (1753 of 2474)
PASS: lldb-api :: commands/expression/call-throws/TestCallThatThrows.py (1754 of 2474)
UNSUPPORTED: lldb-shell :: SymbolFile/PDB/function-level-linking.test (1755 of 2474)
PASS: lldb-shell :: SymbolFile/DWARF/x86/debug_aranges-empty-section.s (1756 of 2474)
PASS: lldb-unit :: Process/minidump/./LLDBMinidumpTests/MinidumpParserTest.GetFilteredModuleList (1757 of 2474)
PASS: lldb-api :: commands/frame/diagnose/bad-reference/TestBadReference.py (1758 of 2474)
PASS: lldb-unit :: Utility/./UtilityTests/DataExtractorTest.GetBitfield (1759 of 2474)
PASS: lldb-shell :: SymbolFile/DWARF/x86/find-method.cpp (1760 of 2474)
PASS: lldb-api :: lang/cpp/struct_with_keyword_name/TestStructWithKeywordName.py (1761 of 2474)
PASS: lldb-api :: commands/watchpoints/hello_watchpoint/TestMyFirstWatchpoint.py (1762 of 2474)
UNSUPPORTED: lldb-shell :: Register/x86-64-ymm16-write.test (1763 of 2474)
PASS: lldb-unit :: Host/./HostTests/TerminalTest.SetStopBits (1764 of 2474)
PASS: lldb-api :: lang/objc/global_ptrs/TestGlobalObjects.py (1765 of 2474)
PASS: lldb-api :: commands/expression/import-std-module/basic/TestImportStdModule.py (1766 of 2474)
PASS: lldb-api :: commands/expression/po_verbosity/TestPoVerbosity.py (1767 of 2474)
PASS: lldb-shell :: SymbolFile/DWARF/x86/debug_loclists-dwp.s (1768 of 2474)
PASS: lldb-api :: python_api/sblaunchinfo/TestSBLaunchInfo.py (1769 of 2474)
PASS: lldb-unit :: Utility/./UtilityTests/StreamTest.AddressNoSuffix (1770 of 2474)
PASS: lldb-shell :: Commands/command-backtrace-parser-1.test (1771 of 2474)
UNSUPPORTED: lldb-api :: tools/lldb-server/TestPtyServer.py (1772 of 2474)
PASS: lldb-api :: commands/expression/namespace_local_var_same_name_obj_c/TestNamespaceLocalVarSameNameObjC.py (1773 of 2474)
PASS: lldb-api :: lang/c/step_over_no_deadlock/TestStepOverDoesntBlock.py (1774 of 2474)
PASS: lldb-unit :: Utility/./UtilityTests/XcodeSDKTest.MergeTest (1775 of 2474)
PASS: lldb-unit :: Interpreter/./InterpreterTests/OptionValueString.DeepCopy (1776 of 2474)
PASS: lldb-api :: lang/objcxx/class-name-clash/TestNameClash.py (1777 of 2474)
PASS: lldb-api :: tools/lldb-vscode/correct-thread/TestVSCode_correct_thread.py (1778 of 2474)
UNSUPPORTED: lldb-api :: functionalities/longjmp/TestLongjmp.py (1779 of 2474)
PASS: lldb-unit :: Process/Utility/./ProcessUtilityTests/ProcMapTests/LinuxProcMapsTestFixture.ParseMapRegions/8 (1780 of 2474)
PASS: lldb-unit :: UnwindAssembly/x86/./UnwindAssemblyx86Tests/Testx86AssemblyInspectionEngine.TestStackRealignMSVC_i386 (1781 of 2474)
PASS: lldb-unit :: Process/./ProcessEventDataTests/ProcessEventDataTest.DoOnRemoval (1782 of 2474)
PASS: lldb-api :: sample_test/TestSampleTest.py (1783 of 2474)
PASS: lldb-api :: tools/lldb-server/TestGdbRemoteThreadsInStopReply.py (1784 of 2474)
PASS: lldb-shell :: SymbolFile/DWARF/x86/dir-separator-windows.s (1785 of 2474)
PASS: lldb-unit :: Platform/./LLDBPlatformTests/PlatformDarwinTest.GetCompatibleArchARMv7 (1786 of 2474)
PASS: lldb-unit :: Language/Highlighting/./HighlighterTests/HighlighterTest.ClangUnterminatedString (1787 of 2474)
PASS: lldb-unit :: Utility/./UtilityTests/EventTest.DumpEventDataBytes (1788 of 2474)
PASS: lldb-api :: commands/expression/import-std-module/weak_ptr-dbg-info-content/TestDbgInfoContentWeakPtrFromStdModule.py (1789 of 2474)
PASS: lldb-unit :: Utility/./UtilityTests/RegularExpression.Match (1790 of 2474)
PASS: lldb-unit :: Utility/./UtilityTests/XcodeSDKTest.SDKSupportsModules (1791 of 2474)
PASS: lldb-api :: lang/objc/objc-ivar-protocols/TestIvarProtocols.py (1792 of 2474)
PASS: lldb-shell :: SymbolFile/DWARF/x86/find-variable-file.cpp (1793 of 2474)
PASS: lldb-unit :: ScriptInterpreter/Python/./ScriptInterpreterPythonTests/PythonDataObjectsTest.TestPythonDictionaryToStructuredDictionary (1794 of 2474)
PASS: lldb-shell :: ObjectFile/MachO/subsections.yaml (1795 of 2474)
PASS: lldb-api :: python_api/disassemble-raw-data/TestDisassembleRawData.py (1796 of 2474)
PASS: lldb-unit :: Utility/./UtilityTests/StringExtractorTest.GetHexBytes_OddPair (1797 of 2474)
XFAIL: lldb-shell :: Expr/nodefaultlib.cpp (1798 of 2474)
PASS: lldb-api :: macosx/find-app-in-bundle/TestFindAppInBundle.py (1799 of 2474)
PASS: lldb-api :: functionalities/breakpoint/auto_continue/TestBreakpointAutoContinue.py (1800 of 2474)
PASS: lldb-shell :: SymbolFile/NativePDB/load-pdb.cpp (1801 of 2474)
UNSUPPORTED: lldb-api :: lang/objc/foundation/TestFoundationDisassembly.py (1802 of 2474)
PASS: lldb-unit :: Utility/./UtilityTests/StreamTest.PutStringAsRawHex8 (1803 of 2474)
PASS: lldb-api :: lang/cpp/this/TestCPPThis.py (1804 of 2474)
PASS: lldb-api :: commands/expression/options/TestExprOptions.py (1805 of 2474)
PASS: lldb-unit :: Utility/./UtilityTests/CompletionRequest.Constructor (1806 of 2474)
PASS: lldb-unit :: Utility/./UtilityTests/RegularExpression.Invalid (1807 of 2474)
PASS: lldb-api :: functionalities/data-formatter/data-formatter-stl/libcxx/tuple/TestDataFormatterLibcxxTuple.py (1808 of 2474)
PASS: lldb-unit :: debugserver/./debugserverTests/JSON.Parse (1809 of 2474)
PASS: lldb-api :: functionalities/paths/TestPaths.py (1810 of 2474)
PASS: lldb-unit :: ObjectFile/ELF/./ObjectFileELFTests/ObjectFileELFTest.GetSymtab_NoSymEntryPointArmAddressClass (1811 of 2474)
PASS: lldb-unit :: Utility/./UtilityTests/StreamTest.AddressRangeSize (1812 of 2474)
XFAIL: lldb-shell :: Register/x86-mm-xmm-write.test (1813 of 2474)
PASS: lldb-shell :: Reproducer/TestDriverOptions.test (1814 of 2474)
PASS: lldb-shell :: Reproducer/TestGDBRemoteRepro.test (1815 of 2474)
UNSUPPORTED: lldb-shell :: Register/x86-zmm-read.test (1816 of 2474)
UNSUPPORTED: lldb-shell :: Breakpoint/case-insensitive.test (1817 of 2474)
PASS: lldb-api :: functionalities/step_scripted/TestStepScripted.py (1818 of 2474)
PASS: lldb-unit :: Utility/./UtilityTests/StreamTest.AddressPrefix (1819 of 2474)
PASS: lldb-api :: python_api/watchpoint/watchlocation/TestTargetWatchAddress.py (1820 of 2474)
PASS: lldb-unit :: Utility/./UtilityTests/ConstStringTest.MangledCounterpart (1821 of 2474)
PASS: lldb-unit :: Utility/./UtilityTests/ArchSpecTest.TestSetTriple (1822 of 2474)
UNSUPPORTED: lldb-shell :: SymbolFile/NativePDB/ast-functions-msvc.cpp (1823 of 2474)
PASS: lldb-unit :: Process/gdb-remote/./ProcessGdbRemoteTests/GDBRemoteClientBaseTest.SendContinueAndWait (1824 of 2474)
UNSUPPORTED: lldb-api :: functionalities/thread/state/TestThreadStates.py (1825 of 2474)
PASS: lldb-unit :: Utility/./UtilityTests/StreamTest.PutSLEB128 (1826 of 2474)
PASS: lldb-unit :: Process/minidump/./LLDBMinidumpTests/MinidumpParserTest.MinidumpDuplicateModuleMappedSecond (1827 of 2474)
PASS: lldb-api :: lang/c/set_values/TestSetValues.py (1828 of 2474)
PASS: lldb-api :: commands/expression/rdar44436068/Test128BitsInteger.py (1829 of 2474)
PASS: lldb-api :: commands/expression/calculator_mode/TestCalculatorMode.py (1830 of 2474)
UNSUPPORTED: lldb-shell :: Register/arm-fp-read.test (1831 of 2474)
PASS: lldb-api :: tools/lldb-server/memory-allocation/TestGdbRemoteMemoryAllocation.py (1832 of 2474)
PASS: lldb-shell :: Register/Core/x86-32-linux-gp.test (1833 of 2474)
PASS: lldb-shell :: SymbolFile/Breakpad/line-table-discontinuous-file-ids.test (1834 of 2474)
PASS: lldb-unit :: Host/./HostTests/FileSystemTest.GetPermissions (1835 of 2474)
PASS: lldb-unit :: ObjectFile/Breakpad/./ObjectFileBreakpadTests/StackCFIRecord.parse (1836 of 2474)
PASS: lldb-unit :: UnwindAssembly/x86/./UnwindAssemblyx86Tests/Testx86AssemblyInspectionEngine.TestPushRBPWithREX (1837 of 2474)
PASS: lldb-shell :: Commands/CommandScriptImmediateOutput/CommandScriptImmediateOutputFile.test (1838 of 2474)
UNSUPPORTED: lldb-api :: functionalities/thread/thread_specific_break_plus_condition/TestThreadSpecificBpPlusCondition.py (1839 of 2474)
PASS: lldb-api :: python_api/lldbutil/iter/TestLLDBIterator.py (1840 of 2474)
PASS: lldb-unit :: Core/./LLDBCoreTests/ModuleSpecTest.TestELFFile (1841 of 2474)
PASS: lldb-api :: functionalities/thread/step_out/TestThreadStepOut.py (1842 of 2474)
PASS: lldb-unit :: Host/./HostTests/TerminalTest.SetParity (1843 of 2474)
PASS: lldb-unit :: SymbolFile/DWARF/./SymbolFileDWARFTests/DWARFUnitTest.MissingSentinel (1844 of 2474)
PASS: lldb-api :: python_api/watchpoint/TestWatchpointIter.py (1845 of 2474)
PASS: lldb-api :: lang/objcxx/cpp_keywords_enabled/TestObjCppKeywordsEnabled.py (1846 of 2474)
PASS: lldb-shell :: SymbolFile/NativePDB/s_constant.cpp (1847 of 2474)
PASS: lldb-shell :: SymbolFile/DWARF/x86/compilercontext.ll (1848 of 2474)
PASS: lldb-api :: functionalities/memory/read/TestMemoryRead.py (1849 of 2474)
PASS: lldb-api :: tools/lldb-vscode/attach/TestVSCode_attach.py (1850 of 2474)
PASS: lldb-unit :: Utility/./UtilityTests/StringListTest.InsertStringAtIndexStdString (1851 of 2474)
PASS: lldb-api :: python_api/objc_type/TestObjCType.py (1852 of 2474)
UNSUPPORTED: lldb-shell :: Register/x86-gp-read.test (1853 of 2474)
PASS: lldb-api :: commands/target/dump-symtab-demangle/TestDumpSymtabDemangle.py (1854 of 2474)
PASS: lldb-api :: lang/c/cpp_keyword_identifiers/TestCppKeywordsAsCIdentifiers.py (1855 of 2474)
PASS: lldb-shell :: Register/Core/x86-32-netbsd-multithread.test (1856 of 2474)
PASS: lldb-api :: commands/command/script/import/rdar-12586188/TestRdar12586188.py (1857 of 2474)
PASS: lldb-unit :: Expression/./ExpressionTests/CppModuleConfigurationTest.AmbiguousLibCpp (1858 of 2474)
PASS: lldb-shell :: SymbolFile/DWARF/x86/dwarf5-index-is-used.cpp (1859 of 2474)
PASS: lldb-shell :: SymbolFile/DWARF/x86/debug_ranges_and_rnglists.test (1860 of 2474)
PASS: lldb-unit :: Symbol/./SymbolTests/TestClangASTImporter.DeportDeclTagDecl (1861 of 2474)
UNSUPPORTED: lldb-shell :: ObjectFile/ELF/minidebuginfo-no-lzma.yaml (1862 of 2474)
PASS: lldb-shell :: Settings/TestSettingsSet.test (1863 of 2474)
PASS: lldb-shell :: Reproducer/TestMultipleTargets.test (1864 of 2474)
PASS: lldb-shell :: SymbolFile/NativePDB/ast-types.cpp (1865 of 2474)
PASS: lldb-unit :: Symbol/./SymbolTests/PostfixExpression.ParseOneExpression (1866 of 2474)
PASS: lldb-shell :: Driver/TestCommands.test (1867 of 2474)
PASS: lldb-api :: functionalities/breakpoint/breakpoint_language/TestBreakpointLanguage.py (1868 of 2474)
PASS: lldb-api :: lang/cpp/scratch-context-merging/structs/TestCppScratchContextMergingStructs.py (1869 of 2474)
PASS: lldb-api :: tools/lldb-server/TestGdbRemote_qThreadStopInfo.py (1870 of 2474)
PASS: lldb-api :: tools/lldb-server/TestGdbRemoteExpeditedRegisters.py (1871 of 2474)
PASS: lldb-api :: commands/platform/process/list/TestProcessList.py (1872 of 2474)
PASS: lldb-api :: python_api/watchpoint/TestWatchpointIgnoreCount.py (1873 of 2474)
PASS: lldb-api :: lang/objc/foundation/TestRuntimeTypes.py (1874 of 2474)
PASS: lldb-unit :: Process/gdb-remote/./ProcessGdbRemoteTests/GDBRemoteCommunicationServerTest.SendErrorResponse_StringError (1875 of 2474)
PASS: lldb-unit :: ScriptInterpreter/Python/./ScriptInterpreterPythonTests/PythonDataObjectsTest.TestPythonCallableInvoke (1876 of 2474)
PASS: lldb-unit :: Process/gdb-remote/./ProcessGdbRemoteTests/GDBRemoteClientBaseTest.SendContinueDelegateStructuredDataReceipt (1877 of 2474)
PASS: lldb-unit :: Utility/./UtilityTests/StreamTeeTest.Flush (1878 of 2474)
PASS: lldb-api :: commands/expression/issue_11588/Test11588.py (1879 of 2474)
PASS: lldb-shell :: Register/Core/x86-64-linux-fp.test (1880 of 2474)
PASS: lldb-unit :: Symbol/./SymbolTests/TestTypeSystemClang.TestGetTypeClassDeclType (1881 of 2474)
PASS: lldb-unit :: Language/Highlighting/./HighlighterTests/HighlighterTest.ClangScalarLiterals (1882 of 2474)
PASS: lldb-api :: functionalities/gdb_remote_client/TestIOSSimulator.py (1883 of 2474)
PASS: lldb-unit :: Process/gdb-remote/./ProcessGdbRemoteTests/GDBRemoteClientBaseTest.SendContinueAndAsyncSignal (1884 of 2474)
PASS: lldb-api :: lang/objc/variadic_methods/TestVariadicMethods.py (1885 of 2474)
PASS: lldb-unit :: Utility/./UtilityTests/NameMatchesTest.Equals (1886 of 2474)
PASS: lldb-api :: commands/expression/static-initializers/TestStaticInitializers.py (1887 of 2474)
PASS: lldb-unit :: Utility/./UtilityTests/Flags.Test (1888 of 2474)
PASS: lldb-unit :: Signals/./SignalsTests/UnixSignalsTest.GetInfo (1889 of 2474)
PASS: lldb-api :: lang/cpp/keywords_enabled/TestCppKeywordsEnabled.py (1890 of 2474)
PASS: lldb-unit :: Host/./HostTests/FileSystemTest.Readable (1891 of 2474)
PASS: lldb-unit :: Utility/./UtilityTests/ConstStringTest.CompareConstString (1892 of 2474)
PASS: lldb-api :: tools/lldb-server/signal-filtering/TestGdbRemote_QPassSignals.py (1893 of 2474)
PASS: lldb-unit :: Platform/./LLDBPlatformTests/PlatformDarwinTest.GetCompatibleArchARMv7f (1894 of 2474)
PASS: lldb-api :: python_api/value/empty_class/TestValueAPIEmptyClass.py (1895 of 2474)
PASS: lldb-unit :: Utility/./UtilityTests/StreamTeeTest.Constructor2Streams (1896 of 2474)
PASS: lldb-unit :: Target/./TargetTests/ModuleCacheTest.GetAndPutUuidExists (1897 of 2474)
PASS: lldb-unit :: Host/./HostTests/SocketTests/SocketTest.TCPGetConnectURI/ipv4 (1898 of 2474)
PASS: lldb-api :: tools/lldb-server/TestGdbRemoteAttachWait.py (1899 of 2474)
PASS: lldb-shell :: SymbolFile/DWARF/x86/dwarf5-implicit-const.s (1900 of 2474)
UNSUPPORTED: lldb-api :: benchmarks/expression/TestExpressionCmd.py (1901 of 2474)
PASS: lldb-shell :: Register/Core/x86-32-linux-multithread.test (1902 of 2474)
UNSUPPORTED: lldb-api :: functionalities/process_save_core/TestProcessSaveCore.py (1903 of 2474)
PASS: lldb-api :: functionalities/gdb_remote_client/TestWriteMemory.py (1904 of 2474)
PASS: lldb-unit :: Target/./TargetTests/ExecutionContextTest.GetByteOrder (1905 of 2474)
PASS: lldb-api :: lang/c/unions/TestUnionMembers.py (1906 of 2474)
PASS: lldb-unit :: Expression/./ExpressionTests/DiagnosticManagerTest.GetStringNoDiags (1907 of 2474)
PASS: lldb-api :: lang/cpp/breakpoint_in_member_func_w_non_primitive_params/TestBreakpointInMemberFuncWNonPrimitiveParams.py (1908 of 2474)
PASS: lldb-unit :: Utility/./UtilityTests/UUIDTest.StringConverion (1909 of 2474)
PASS: lldb-api :: functionalities/thread/concurrent_events/TestConcurrentCrashWithWatchpoint.py (1910 of 2474)
PASS: lldb-unit :: Utility/./UtilityTests/AnsiTerminal.Unknown (1911 of 2474)
PASS: lldb-unit :: Utility/./UtilityTests/ArgsTest.TestSingleQuotedArgWithSpace (1912 of 2474)
PASS: lldb-unit :: Platform/Android/./AdbClientTests/AdbClientTest.CreateByDeviceId (1913 of 2474)
UNSUPPORTED: lldb-shell :: ScriptInterpreter/Lua/breakpoint_oneline_callback.test (1914 of 2474)
PASS: lldb-shell :: SymbolFile/DWARF/x86/split-dwarf-inlining.cpp (1915 of 2474)
PASS: lldb-unit :: SymbolFile/DWARF/./SymbolFileDWARFTests/SymbolFileDWARFTests.TestAbbrevNullAttrValidForm (1916 of 2474)
UNSUPPORTED: lldb-api :: functionalities/ptrauth_diagnostics/BLRAA_error/TestPtrauthBLRAADiagnostic.py (1917 of 2474)
PASS: lldb-unit :: Expression/./ExpressionTests/DWARFExpression.DW_OP_const (1918 of 2474)
PASS: lldb-unit :: Utility/./UtilityTests/OptionsWithRawTest.SingleWordSuffix (1919 of 2474)
PASS: lldb-shell :: SymbolFile/Breakpad/inline-record.test (1920 of 2474)
UNSUPPORTED: lldb-shell :: Subprocess/fork-follow-child.test (1921 of 2474)
PASS: lldb-shell :: ObjectFile/MachO/lc_build_version.yaml (1922 of 2474)
PASS: lldb-api :: lang/objc/foundation/TestObjectDescriptionAPI.py (1923 of 2474)
PASS: lldb-api :: functionalities/data-formatter/data-formatter-objc/TestDataFormatterObjCNSError.py (1924 of 2474)
PASS: lldb-api :: lang/cpp/namespace/TestNamespaceLookup.py (1925 of 2474)
PASS: lldb-api :: functionalities/abbreviation/TestCommonShortSpellings.py (1926 of 2474)
PASS: lldb-api :: functionalities/data-formatter/poarray/TestPrintObjectArray.py (1927 of 2474)
PASS: lldb-unit :: UnwindAssembly/x86/./UnwindAssemblyx86Tests/Testx86AssemblyInspectionEngine.TestPopRBX (1928 of 2474)
PASS: lldb-api :: api/check_public_api_headers/TestPublicAPIHeaders.py (1929 of 2474)
PASS: lldb-unit :: Utility/./UtilityTests/RangeDataVector.FindEntryIndexesThatContain_Overlap (1930 of 2474)
PASS: lldb-api :: commands/watchpoints/watchpoint_commands/condition/TestWatchpointConditionCmd.py (1931 of 2474)
PASS: lldb-api :: api/multiple-targets/TestMultipleTargets.py (1932 of 2474)
PASS: lldb-unit :: Symbol/./SymbolTests/TestClangASTImporter.MetadataPropagationIndirectImport (1933 of 2474)
PASS: lldb-api :: functionalities/unwind/sigtramp/TestSigtrampUnwind.py (1934 of 2474)
PASS: lldb-unit :: ScriptInterpreter/Python/./ScriptInterpreterPythonTests/PythonDataObjectsTest.TestGlobalNameResolutionNoDot (1935 of 2474)
PASS: lldb-shell :: SymbolFile/DWARF/x86/parallel-indexing-stress.s (1936 of 2474)
PASS: lldb-unit :: Expression/./ExpressionTests/DiagnosticManagerTest.PutStringMultiple (1937 of 2474)
UNSUPPORTED: lldb-api :: commands/expression/import-std-module/pair/TestPairFromStdModule.py (1938 of 2474)
PASS: lldb-unit :: Process/minidump/./LLDBMinidumpTests/MinidumpParserTest.GetMemoryRegionInfoFromMemoryList (1939 of 2474)
UNSUPPORTED: lldb-shell :: Register/x86-fp-read.test (1940 of 2474)
UNSUPPORTED: lldb-shell :: SymbolFile/DWARF/x86/dwarf5-line-strp.s (1941 of 2474)
PASS: lldb-unit :: UnwindAssembly/x86/./UnwindAssemblyx86Tests/Testx86AssemblyInspectionEngine.TestStackRealign8BitDisp_i386 (1942 of 2474)
PASS: lldb-shell :: lldb-server/TestErrorMessages.test (1943 of 2474)
PASS: lldb-unit :: DataFormatter/./LLDBFormatterTests/FormatManagerTests.CompatibleLangs (1944 of 2474)
UNSUPPORTED: lldb-shell :: Register/aarch64-fp-read.test (1945 of 2474)
PASS: lldb-unit :: ScriptInterpreter/Python/./ScriptInterpreterPythonTests/PythonDataObjectsTest.TestPythonInteger (1946 of 2474)
PASS: lldb-api :: lang/c/stepping/TestThreadStepping.py (1947 of 2474)
UNSUPPORTED: lldb-api :: linux/add-symbols/TestTargetSymbolsAddCommand.py (1948 of 2474)
PASS: lldb-shell :: SymbolFile/DWARF/x86/dir-separator-posix.s (1949 of 2474)
PASS: lldb-api :: macosx/add-dsym/TestAddDsymDownload.py (1950 of 2474)
FAIL: lldb-api :: functionalities/scripted_process/TestScriptedProcess.py (1951 of 2474)
******************** TEST 'lldb-api :: functionalities/scripted_process/TestScriptedProcess.py' FAILED ********************
Script:
--
/Users/buildslave/jenkins/workspace/lldb-cmake-sanitized/lldb-build/lldb-test-build.noindex/copied-python /Users/buildslave/jenkins/workspace/lldb-cmake-sanitized/llvm-project/lldb/test/API/dotest.py -u CXXFLAGS -u CFLAGS --codesign-identity lldb_codesign --arch x86_64 --build-dir /Users/buildslave/jenkins/workspace/lldb-cmake-sanitized/lldb-build/lldb-test-build.noindex -t --env TERM=vt100 --env LLVM_LIBS_DIR=/Users/buildslave/jenkins/workspace/lldb-cmake-sanitized/lldb-build/./lib --inferior-env ASAN_OPTIONS=detect_stack_use_after_return=1 --inferior-env DYLD_INSERT_LIBRARIES=/Users/buildslave/jenkins/workspace/lldb-cmake-sanitized/host-compiler/lib/clang/14.0.99/lib/darwin/libclang_rt.asan_osx_dynamic.dylib --arch x86_64 --build-dir /Users/buildslave/jenkins/workspace/lldb-cmake-sanitized/lldb-build/lldb-test-build.noindex --lldb-module-cache-dir /Users/buildslave/jenkins/workspace/lldb-cmake-sanitized/lldb-build/lldb-test-build.noindex/module-cache-lldb/lldb-api --clang-module-cache-dir /Users/buildslave/jenkins/workspace/lldb-cmake-sanitized/lldb-build/lldb-test-build.noindex/module-cache-clang/lldb-api --executable /Users/buildslave/jenkins/workspace/lldb-cmake-sanitized/lldb-build/./bin/lldb --compiler /Users/buildslave/jenkins/workspace/lldb-cmake-sanitized/host-compiler/bin/clang --dsymutil /Users/buildslave/jenkins/workspace/lldb-cmake-sanitized/lldb-build/./bin/dsymutil --llvm-tools-dir /Users/buildslave/jenkins/workspace/lldb-cmake-sanitized/lldb-build/./bin --lldb-libs-dir /Users/buildslave/jenkins/workspace/lldb-cmake-sanitized/lldb-build/./lib /Users/buildslave/jenkins/workspace/lldb-cmake-sanitized/llvm-project/lldb/test/API/functionalities/scripted_process -p TestScriptedProcess.py
--
Exit Code: -6

Hide Details

Command Output (stdout): -- lldb version 14.0.99 (http://labmaster3.local/git/llvm-project.git revision 6259016361345e09f0607ef4e037e00bcbe4bd40) clang revision 6259016361345e09f0607ef4e037e00bcbe4bd40 llvm revision 6259016361345e09f0607ef4e037e00bcbe4bd40 Name of the class that will manage the scripted process: 'stack_core_scripted_process.StackCoreScriptedProcess' Saving 69632 bytes of data for memory region at 0x7ffeefbef000

Hide Details

-- Command Output (stderr): -- ================================================================= ==61237==ERROR: AddressSanitizer: heap-use-after-free on address 0x6160002508a0 at pc 0x00010e6bab30 bp 0x70000d4e2cf0 sp 0x70000d4e24b8 READ of size 512 at 0x6160002508a0 thread T6 #0 0x10e6bab2f in __asan_memcpy+0x1af (libclang_rt.asan_osx_dynamic.dylib:x86_64+0x44b2f) #1 0x11445e878 in lldb_private::DataExtractor::CopyByteOrderedData(unsigned long long, unsigned long long, void*, unsigned long long, lldb::ByteOrder) const DataExtractor.cpp:742 #2 0x1149eb8bb in lldb_private::ScriptedProcess::DoReadMemory(unsigned long long, void*, unsigned long, lldb_private::Status&) ScriptedProcess.cpp:237 #3 0x114283b1c in lldb_private::Process::ReadMemoryFromInferior(unsigned long long, void*, unsigned long, lldb_private::Status&) Process.cpp:2047 #4 0x11423bf8f in lldb_private::MemoryCache::Read(unsigned long long, void*, unsigned long, lldb_private::Status&) Memory.cpp:229 #5 0x1142c4f71 in lldb_private::RegisterContext::ReadRegisterValueFromMemory(lldb_private::RegisterInfo const*, unsigned long long, unsigned int, lldb_private::RegisterValue&) RegisterContext.cpp:343 #6 0x1142d6c96 in lldb_private::RegisterContextUnwind::ReadRegisterValueFromRegisterLocation(lldb_private::UnwindLLDB::RegisterLocation, lldb_private::RegisterInfo const*, lldb_private::RegisterValue&) RegisterContextUnwind.cpp:1138 #7 0x1142d4623 in lldb_private::RegisterContextUnwind::ReadGPRValue(lldb::RegisterKind, unsigned int, unsigned long long&) RegisterContextUnwind.cpp:2143 #8 0x1142c8da5 in lldb_private::RegisterContextUnwind::InitializeNonZerothFrame() RegisterContextUnwind.cpp:343 #9 0x1142c6110 in lldb_private::RegisterContextUnwind::RegisterContextUnwind(lldb_private::Thread&, std::__1::shared_ptr<lldb_private::RegisterContextUnwind> const&, lldb_private::SymbolContext&, unsigned int, lldb_private::UnwindLLDB&) RegisterContextUnwind.cpp:72 #10 0x114420cb0 in lldb_private::UnwindLLDB::GetOneMoreFrame(lldb_private::ABI*) UnwindLLDB.cpp:128 #11 0x11441f919 in lldb_private::UnwindLLDB::AddOneMoreFrame(lldb_private::ABI*) UnwindLLDB.cpp:332 #12 0x1144205e5 in lldb_private::UnwindLLDB::UpdateUnwindPlanForFirstFrameIfInvalid(lldb_private::ABI*) UnwindLLDB.cpp:305 #13 0x11441f47d in lldb_private::UnwindLLDB::AddFirstFrame() UnwindLLDB.cpp:99 #14 0x11442276d in lldb_private::UnwindLLDB::DoGetFrameInfoAtIndex(unsigned int, unsigned long long&, unsigned long long&, bool&) UnwindLLDB.cpp:395 #15 0x1143113fa in lldb_private::Unwind::GetFrameInfoAtIndex(unsigned int, unsigned long long&, unsigned long long&, bool&) Unwind.h:53 #16 0x11430dcbc in lldb_private::StackFrameList::GetFramesUpTo(unsigned int) StackFrameList.cpp:484 #17 0x11430bdb7 in lldb_private::StackFrameList::ResetCurrentInlinedDepth() StackFrameList.cpp:86 #18 0x1143abbc3 in lldb_private::Thread::ShouldStop(lldb_private::Event*) Thread.cpp:805 #19 0x1143c53c8 in lldb_private::ThreadList::ShouldStop(lldb_private::Event*) ThreadList.cpp:330 #20 0x1142918e0 in lldb_private::Process::ShouldBroadcastEvent(lldb_private::Event*) Process.cpp:3405 #21 0x114288804 in lldb_private::Process::HandlePrivateEvent(std::__1::shared_ptr<lldb_private::Event>&) Process.cpp:3630 #22 0x11429355a in lldb_private::Process::RunPrivateStateThread(bool) Process.cpp:3824 #23 0x114291f0d in lldb_private::Process::PrivateStateThread(void*) Process.cpp:3722 #24 0x113ff1a70 in lldb_private::HostNativeThreadBase::ThreadCreateTrampoline(void*) HostNativeThreadBase.cpp:65 #25 0x7fff6d496108 in _pthread_start+0x93 (libsystem_pthread.dylib:x86_64+0x6108) #26 0x7fff6d491b8a in thread_start+0xe (libsystem_pthread.dylib:x86_64+0x1b8a)

Hide Details

0x6160002508a0 is located 32 bytes inside of 545-byte region [0x616000250880,0x616000250aa1) freed by thread T6 here: #0 0x10e6bcbc9 in wrap_free+0xa9 (libclang_rt.asan_osx_dynamic.dylib:x86_64+0x46bc9) #1 0x10f1c3af2 in frame_dealloc+0xa0 (Python:x86_64+0x2aaf2) #2 0x10f1b2d2a in function_code_fastcall+0xf8 (Python:x86_64+0x19d2a) #3 0x10f1b3624 in _PyObject_Call_Prepend+0x95 (Python:x86_64+0x1a624) #4 0x10f1b22d2 in _PyObject_FastCallDict+0x107 (Python:x86_64+0x192d2) #5 0x10f1b37d2 in _PyObject_CallFunctionVa+0xd0 (Python:x86_64+0x1a7d2) #6 0x10f1b3a00 in PyObject_CallMethod+0xa8 (Python:x86_64+0x1aa00) #7 0x114b822e0 in std::__1::shared_ptr<lldb_private::DataExtractor> lldb_private::ScriptedPythonInterface::Dispatch<std::__1::shared_ptr<lldb_private::DataExtractor>, unsigned long long, unsigned long>(llvm::StringRef, lldb_private::Status&, unsigned long long, unsigned long) ScriptedPythonInterface.h:93 #8 0x114b81734 in lldb_private::ScriptedProcessPythonInterface::ReadMemoryAtAddress(unsigned long long, unsigned long, lldb_private::Status&) ScriptedProcessPythonInterface.cpp:120 #9 0x1149eb695 in lldb_private::ScriptedProcess::DoReadMemory(unsigned long long, void*, unsigned long, lldb_private::Status&) ScriptedProcess.cpp:232 #10 0x114283b1c in lldb_private::Process::ReadMemoryFromInferior(unsigned long long, void*, unsigned long, lldb_private::Status&) Process.cpp:2047 #11 0x11423bf8f in lldb_private::MemoryCache::Read(unsigned long long, void*, unsigned long, lldb_private::Status&) Memory.cpp:229 #12 0x1142c4f71 in lldb_private::RegisterContext::ReadRegisterValueFromMemory(lldb_private::RegisterInfo const*, unsigned long long, unsigned int, lldb_private::RegisterValue&) RegisterContext.cpp:343 #13 0x1142d6c96 in lldb_private::RegisterContextUnwind::ReadRegisterValueFromRegisterLocation(lldb_private::UnwindLLDB::RegisterLocation, lldb_private::RegisterInfo const*, lldb_private::RegisterValue&) RegisterContextUnwind.cpp:1138 #14 0x1142d4623 in lldb_private::RegisterContextUnwind::ReadGPRValue(lldb::RegisterKind, unsigned int, unsigned long long&) RegisterContextUnwind.cpp:2143 #15 0x1142c8da5 in lldb_private::RegisterContextUnwind::InitializeNonZerothFrame() RegisterContextUnwind.cpp:343 #16 0x1142c6110 in lldb_private::RegisterContextUnwind::RegisterContextUnwind(lldb_private::Thread&, std::__1::shared_ptr<lldb_private::RegisterContextUnwind> const&, lldb_private::SymbolContext&, unsigned int, lldb_private::UnwindLLDB&) RegisterContextUnwind.cpp:72 #17 0x114420cb0 in lldb_private::UnwindLLDB::GetOneMoreFrame(lldb_private::ABI*) UnwindLLDB.cpp:128 #18 0x11441f919 in lldb_private::UnwindLLDB::AddOneMoreFrame(lldb_private::ABI*) UnwindLLDB.cpp:332 #19 0x1144205e5 in lldb_private::UnwindLLDB::UpdateUnwindPlanForFirstFrameIfInvalid(lldb_private::ABI*) UnwindLLDB.cpp:305 #20 0x11441f47d in lldb_private::UnwindLLDB::AddFirstFrame() UnwindLLDB.cpp:99 #21 0x11442276d in lldb_private::UnwindLLDB::DoGetFrameInfoAtIndex(unsigned int, unsigned long long&, unsigned long long&, bool&) UnwindLLDB.cpp:395 #22 0x1143113fa in lldb_private::Unwind::GetFrameInfoAtIndex(unsigned int, unsigned long long&, unsigned long long&, bool&) Unwind.h:53 #23 0x11430dcbc in lldb_private::StackFrameList::GetFramesUpTo(unsigned int) StackFrameList.cpp:484 #24 0x11430bdb7 in lldb_private::StackFrameList::ResetCurrentInlinedDepth() StackFrameList.cpp:86 #25 0x1143abbc3 in lldb_private::Thread::ShouldStop(lldb_private::Event*) Thread.cpp:805 #26 0x1143c53c8 in lldb_private::ThreadList::ShouldStop(lldb_private::Event*) ThreadList.cpp:330 #27 0x1142918e0 in lldb_private::Process::ShouldBroadcastEvent(lldb_private::Event*) Process.cpp:3405 #28 0x114288804 in lldb_private::Process::HandlePrivateEvent(std::__1::shared_ptr<lldb_private::Event>&) Process.cpp:3630 #29 0x11429355a in lldb_private::Process::RunPrivateStateThread(bool) Process.cpp:3824

Hide Details

previously allocated by thread T6 here: #0 0x10e6bca80 in wrap_malloc+0xa0 (libclang_rt.asan_osx_dynamic.dylib:x86_64+0x46a80) #1 0x10f1e128b in _PyObject_Malloc+0x37 (Python:x86_64+0x4828b) #2 0x10f1aaecc in _PyBytes_FromSize+0x63 (Python:x86_64+0x11ecc) #3 0x10f1aae09 in PyBytes_FromStringAndSize+0x3d (Python:x86_64+0x11e09) #4 0x114b33cf7 in lldb_private::python::PythonBytes::PythonBytes(unsigned char const*, unsigned long) PythonDataObjects.cpp:290 #5 0x113bbae81 in _wrap_SBProcess_ReadMemory(_object*, _object*) LLDBWrapPython.cpp:45781 #6 0x10f1b3226 in _PyMethodDef_RawFastCallKeywords+0xeb (Python:x86_64+0x1a226) #7 0x10f1b28c6 in _PyCFunction_FastCallKeywords+0x2b (Python:x86_64+0x198c6) #8 0x10f248905 in call_function+0x1de (Python:x86_64+0xaf905) #9 0x10f2415ee in _PyEval_EvalFrameDefault+0x1b51 (Python:x86_64+0xa85ee) #10 0x10f1b2ca1 in function_code_fastcall+0x6f (Python:x86_64+0x19ca1) #11 0x10f24897d in call_function+0x256 (Python:x86_64+0xaf97d) #12 0x10f2415d5 in _PyEval_EvalFrameDefault+0x1b38 (Python:x86_64+0xa85d5) #13 0x10f1b2ca1 in function_code_fastcall+0x6f (Python:x86_64+0x19ca1) #14 0x10f1b3624 in _PyObject_Call_Prepend+0x95 (Python:x86_64+0x1a624) #15 0x10f1b22d2 in _PyObject_FastCallDict+0x107 (Python:x86_64+0x192d2) #16 0x10f1b37d2 in _PyObject_CallFunctionVa+0xd0 (Python:x86_64+0x1a7d2) #17 0x10f1b3a00 in PyObject_CallMethod+0xa8 (Python:x86_64+0x1aa00) #18 0x114b822e0 in std::__1::shared_ptr<lldb_private::DataExtractor> lldb_private::ScriptedPythonInterface::Dispatch<std::__1::shared_ptr<lldb_private::DataExtractor>, unsigned long long, unsigned long>(llvm::StringRef, lldb_private::Status&, unsigned long long, unsigned long) ScriptedPythonInterface.h:93 #19 0x114b81734 in lldb_private::ScriptedProcessPythonInterface::ReadMemoryAtAddress(unsigned long long, unsigned long, lldb_private::Status&) ScriptedProcessPythonInterface.cpp:120 #20 0x1149eb695 in lldb_private::ScriptedProcess::DoReadMemory(unsigned long long, void*, unsigned long, lldb_private::Status&) ScriptedProcess.cpp:232 #21 0x114283b1c in lldb_private::Process::ReadMemoryFromInferior(unsigned long long, void*, unsigned long, lldb_private::Status&) Process.cpp:2047 #22 0x11423bf8f in lldb_private::MemoryCache::Read(unsigned long long, void*, unsigned long, lldb_private::Status&) Memory.cpp:229 #23 0x1142c4f71 in lldb_private::RegisterContext::ReadRegisterValueFromMemory(lldb_private::RegisterInfo const*, unsigned long long, unsigned int, lldb_private::RegisterValue&) RegisterContext.cpp:343 #24 0x1142d6c96 in lldb_private::RegisterContextUnwind::ReadRegisterValueFromRegisterLocation(lldb_private::UnwindLLDB::RegisterLocation, lldb_private::RegisterInfo const*, lldb_private::RegisterValue&) RegisterContextUnwind.cpp:1138 #25 0x1142d4623 in lldb_private::RegisterContextUnwind::ReadGPRValue(lldb::RegisterKind, unsigned int, unsigned long long&) RegisterContextUnwind.cpp:2143 #26 0x1142c8da5 in lldb_private::RegisterContextUnwind::InitializeNonZerothFrame() RegisterContextUnwind.cpp:343 #27 0x1142c6110 in lldb_private::RegisterContextUnwind::RegisterContextUnwind(lldb_private::Thread&, std::__1::shared_ptr<lldb_private::RegisterContextUnwind> const&, lldb_private::SymbolContext&, unsigned int, lldb_private::UnwindLLDB&) RegisterContextUnwind.cpp:72 #28 0x114420cb0 in lldb_private::UnwindLLDB::GetOneMoreFrame(lldb_private::ABI*) UnwindLLDB.cpp:128 #29 0x11441f919 in lldb_private::UnwindLLDB::AddOneMoreFrame(lldb_private::ABI*) UnwindLLDB.cpp:332

Hide Details

Thread T6 created by T0 here: #0 0x10e6b655c in wrap_pthread_create+0x5c (libclang_rt.asan_osx_dynamic.dylib:x86_64+0x4055c) #1 0x1140154a1 in lldb_private::ThreadLauncher::LaunchThread(llvm::StringRef, void* (*)(void*), void*, unsigned long) ThreadLauncher.cpp:65 #2 0x11428a78f in lldb_private::Process::StartPrivateStateThread(bool) Process.cpp:3501 #3 0x114289f8a in lldb_private::Process::Launch(lldb_private::ProcessLaunchInfo&) Process.cpp:2547 #4 0x11436a72b in lldb_private::Target::Launch(lldb_private::ProcessLaunchInfo&, lldb_private::Stream*) Target.cpp:3063 #5 0x11373ea80 in lldb::SBTarget::Launch(lldb::SBLaunchInfo&, lldb::SBError&) SBTarget.cpp:439 #6 0x113bf8cba in _wrap_SBTarget_Launch(_object*, _object*) LLDBWrapPython.cpp:54084 #7 0x10f1b2bda in PyCFunction_Call+0x140 (Python:x86_64+0x19bda) #8 0x10f2419e2 in _PyEval_EvalFrameDefault+0x1f45 (Python:x86_64+0xa89e2) #9 0x10f2492da in _PyEval_EvalCodeWithName+0x72a (Python:x86_64+0xb02da) #10 0x10f1b288b in _PyFunction_FastCallKeywords+0xe0 (Python:x86_64+0x1988b) #11 0x10f24897d in call_function+0x256 (Python:x86_64+0xaf97d) #12 0x10f2415d5 in _PyEval_EvalFrameDefault+0x1b38 (Python:x86_64+0xa85d5) #13 0x10f1b2ca1 in function_code_fastcall+0x6f (Python:x86_64+0x19ca1) #14 0x10f241905 in _PyEval_EvalFrameDefault+0x1e68 (Python:x86_64+0xa8905) #15 0x10f2492da in _PyEval_EvalCodeWithName+0x72a (Python:x86_64+0xb02da) #16 0x10f1b24f4 in _PyFunction_FastCallDict+0x1b8 (Python:x86_64+0x194f4) #17 0x10f241905 in _PyEval_EvalFrameDefault+0x1e68 (Python:x86_64+0xa8905) #18 0x10f2492da in _PyEval_EvalCodeWithName+0x72a (Python:x86_64+0xb02da) #19 0x10f1b288b in _PyFunction_FastCallKeywords+0xe0 (Python:x86_64+0x1988b) #20 0x10f24897d in call_function+0x256 (Python:x86_64+0xaf97d) #21 0x10f24168c in _PyEval_EvalFrameDefault+0x1bef (Python:x86_64+0xa868c) #22 0x10f2492da in _PyEval_EvalCodeWithName+0x72a (Python:x86_64+0xb02da) #23 0x10f1b288b in _PyFunction_FastCallKeywords+0xe0 (Python:x86_64+0x1988b) #24 0x10f24897d in call_function+0x256 (Python:x86_64+0xaf97d) #25 0x10f24168c in _PyEval_EvalFrameDefault+0x1bef (Python:x86_64+0xa868c) #26 0x10f1b2ca1 in function_code_fastcall+0x6f (Python:x86_64+0x19ca1) #27 0x10f24897d in call_function+0x256 (Python:x86_64+0xaf97d) #28 0x10f2415d5 in _PyEval_EvalFrameDefault+0x1b38 (Python:x86_64+0xa85d5) #29 0x10f2492da in _PyEval_EvalCodeWithName+0x72a (Python:x86_64+0xb02da) #30 0x10f1b24f4 in _PyFunction_FastCallDict+0x1b8 (Python:x86_64+0x194f4) #31 0x10f1b3624 in _PyObject_Call_Prepend+0x95 (Python:x86_64+0x1a624) #32 0x10f1b29d4 in PyObject_Call+0x87 (Python:x86_64+0x199d4) #33 0x10f241905 in _PyEval_EvalFrameDefault+0x1e68 (Python:x86_64+0xa8905) #34 0x10f2492da in _PyEval_EvalCodeWithName+0x72a (Python:x86_64+0xb02da) #35 0x10f1b24f4 in _PyFunction_FastCallDict+0x1b8 (Python:x86_64+0x194f4) #36 0x10f1b3624 in _PyObject_Call_Prepend+0x95 (Python:x86_64+0x1a624) #37 0x10f1f04af in slot_tp_call+0x46 (Python:x86_64+0x574af) #38 0x10f1b272c in _PyObject_FastCallKeywords+0x166 (Python:x86_64+0x1972c) #39 0x10f248976 in call_function+0x24f (Python:x86_64+0xaf976) #40 0x10f24168c in _PyEval_EvalFrameDefault+0x1bef (Python:x86_64+0xa868c) #41 0x10f2492da in _PyEval_EvalCodeWithName+0x72a (Python:x86_64+0xb02da) #42 0x10f1b288b in _PyFunction_FastCallKeywords+0xe0 (Python:x86_64+0x1988b) #43 0x10f24897d in call_function+0x256 (Python:x86_64+0xaf97d) #44 0x10f2415d5 in _PyEval_EvalFrameDefault+0x1b38 (Python:x86_64+0xa85d5) #45 0x10f2492da in _PyEval_EvalCodeWithName+0x72a (Python:x86_64+0xb02da) #46 0x10f1b288b in _PyFunction_FastCallKeywords+0xe0 (Python:x86_64+0x1988b) #47 0x10f24897d in call_function+0x256 (Python:x86_64+0xaf97d) #48 0x10f2415d5 in _PyEval_EvalFrameDefault+0x1b38 (Python:x86_64+0xa85d5) #49 0x10f1b2ca1 in function_code_fastcall+0x6f (Python:x86_64+0x19ca1) #50 0x10f1b3624 in _PyObject_Call_Prepend+0x95 (Python:x86_64+0x1a624) #51 0x10f1b29d4 in PyObject_Call+0x87 (Python:x86_64+0x199d4) #52 0x10f241905 in _PyEval_EvalFrameDefault+0x1e68 (Python:x86_64+0xa8905) #53 0x10f2492da in _PyEval_EvalCodeWithName+0x72a (Python:x86_64+0xb02da) #54 0x10f1b24f4 in _PyFunction_FastCallDict+0x1b8 (Python:x86_64+0x194f4) #55 0x10f1b3624 in _PyObject_Call_Prepend+0x95 (Python:x86_64+0x1a624) #56 0x10f1f04af in slot_tp_call+0x46 (Python:x86_64+0x574af) #57 0x10f1b272c in _PyObject_FastCallKeywords+0x166 (Python:x86_64+0x1972c) #58 0x10f248976 in call_function+0x24f (Python:x86_64+0xaf976) #59 0x10f24168c in _PyEval_EvalFrameDefault+0x1bef (Python:x86_64+0xa868c) #60 0x10f1b2ca1 in function_code_fastcall+0x6f (Python:x86_64+0x19ca1) #61 0x10f24897d in call_function+0x256 (Python:x86_64+0xaf97d) #62 0x10f2415d5 in _PyEval_EvalFrameDefault+0x1b38 (Python:x86_64+0xa85d5) #63 0x10f1b2ca1 in function_code_fastcall+0x6f (Python:x86_64+0x19ca1) #64 0x10f24897d in call_function+0x256 (Python:x86_64+0xaf97d) #65 0x10f2415ee in _PyEval_EvalFrameDefault+0x1b51 (Python:x86_64+0xa85ee) #66 0x10f2492da in _PyEval_EvalCodeWithName+0x72a (Python:x86_64+0xb02da) #67 0x10f23fa14 in PyEval_EvalCode+0x29 (Python:x86_64+0xa6a14) #68 0x10f26e2aa in run_mod+0x35 (Python:x86_64+0xd52aa) #69 0x10f26d2c5 in PyRun_FileExFlags+0xa3 (Python:x86_64+0xd42c5) #70 0x10f26c9a4 in PyRun_SimpleFileExFlags+0x114 (Python:x86_64+0xd39a4) #71 0x10f284010 in pymain_main+0x13de (Python:x86_64+0xeb010) #72 0x10f2847b7 in _Py_UnixMain+0x67 (Python:x86_64+0xeb7b7) #73 0x7fff6d28dcc8 in start+0x0 (libdyld.dylib:x86_64+0x1acc8)

Hide Details

SUMMARY: AddressSanitizer: heap-use-after-free (libclang_rt.asan_osx_dynamic.dylib:x86_64+0x44b2f) in __asan_memcpy+0x1af Shadow bytes around the buggy address: 0x1c2c0004a0c0: fd fd fd fd fd fd fd fd fd fd fd fd fd fd fd fd 0x1c2c0004a0d0: fd fd fd fd fd fd fd fd fd fd fd fd fd fd fd fd 0x1c2c0004a0e0: fd fd fd fd fd fd fd fd fd fd fd fd fd fd fd fd 0x1c2c0004a0f0: fd fd fd fd fd fd fd fd fa fa fa fa fa fa fa fa 0x1c2c0004a100: fa fa fa fa fa fa fa fa fa fa fa fa fa fa fa fa =>0x1c2c0004a110: fd fd fd fd[fd]fd fd fd fd fd fd fd fd fd fd fd 0x1c2c0004a120: fd fd fd fd fd fd fd fd fd fd fd fd fd fd fd fd 0x1c2c0004a130: fd fd fd fd fd fd fd fd fd fd fd fd fd fd fd fd 0x1c2c0004a140: fd fd fd fd fd fd fd fd fd fd fd fd fd fd fd fd 0x1c2c0004a150: fd fd fd fd fd fa fa fa fa fa fa fa fa fa fa fa 0x1c2c0004a160: fa fa fa fa fa fa fa fa fa fa fa fa fa fa fa fa Shadow byte legend (one shadow byte represents 8 application bytes): Addressable: 00 Partially addressable: 01 02 03 04 05 06 07 Heap left redzone: fa Freed heap region: fd Stack left redzone: f1 Stack mid redzone: f2 Stack right redzone: f3 Stack after return: f5 Stack use after scope: f8 Global redzone: f9 Global init order: f6 Poisoned by user: f7 Container overflow: fc Array cookie: ac Intra object redzone: bb ASan internal: fe Left alloca redzone: ca Right alloca redzone: cb ==61237==ABORTING Fatal Python error: Aborted

Hide Details

Thread 0x00000001130aedc0 (most recent call first): File "/Users/buildslave/jenkins/workspace/lldb-cmake-sanitized/lldb-build/lib/python3.7/site-packages/lldb/__init__.py", line 10301 in Launch File "/Users/buildslave/jenkins/workspace/lldb-cmake-sanitized/llvm-project/lldb/test/API/functionalities/scripted_process/TestScriptedProcess.py", line 149 in test_launch_scripted_process_stack_frames File "/Users/buildslave/jenkins/workspace/lldb-cmake-sanitized/llvm-project/lldb/packages/Python/lldbsuite/test/decorators.py", line 149 in wrapper File "/Users/buildslave/jenkins/workspace/lldb-cmake-sanitized/llvm-project/lldb/packages/Python/lldbsuite/test/decorators.py", line 149 in wrapper File "/Users/buildslave/jenkins/workspace/lldb-cmake-sanitized/llvm-project/lldb/packages/Python/lldbsuite/test/lldbtest.py", line 1715 in test_method File "/Users/buildslave/jenkins/workspace/lldb-cmake-sanitized/llvm-project/lldb/third_party/Python/module/unittest2/unittest2/case.py", line 413 in runMethod File "/Users/buildslave/jenkins/workspace/lldb-cmake-sanitized/llvm-project/lldb/third_party/Python/module/unittest2/unittest2/case.py", line 383 in run File "/Users/buildslave/jenkins/workspace/lldb-cmake-sanitized/llvm-project/lldb/third_party/Python/module/unittest2/unittest2/case.py", line 458 in __call__ File "/Users/buildslave/jenkins/workspace/lldb-cmake-sanitized/llvm-project/lldb/third_party/Python/module/unittest2/unittest2/suite.py", line 117 in _wrapped_run File "/Users/buildslave/jenkins/workspace/lldb-cmake-sanitized/llvm-project/lldb/third_party/Python/module/unittest2/unittest2/suite.py", line 115 in _wrapped_run File "/Users/buildslave/jenkins/workspace/lldb-cmake-sanitized/llvm-project/lldb/third_party/Python/module/unittest2/unittest2/suite.py", line 85 in run File "/Users/buildslave/jenkins/workspace/lldb-cmake-sanitized/llvm-project/lldb/third_party/Python/module/unittest2/unittest2/suite.py", line 66 in __call__ File "/Users/buildslave/jenkins/workspace/lldb-cmake-sanitized/llvm-project/lldb/third_party/Python/module/unittest2/unittest2/runner.py", line 165 in run File "/Users/buildslave/jenkins/workspace/lldb-cmake-sanitized/llvm-project/lldb/packages/Python/lldbsuite/test/dotest.py", line 996 in run_suite File "/Users/buildslave/jenkins/workspace/lldb-cmake-sanitized/llvm-project/lldb/test/API/dotest.py", line 7 in <module>

Hide Details

--

Hide Details

******************** PASS: lldb-api :: commands/expression/import-std-module/module-build-errors/TestStdModuleBuildErrors.py (1952 of 2474) PASS: lldb-api :: lang/c/calling-conventions/TestCCallingConventions.py (1953 of 2474) PASS: lldb-api :: functionalities/gdb_remote_client/TestNoLocalFile.py (1954 of 2474) PASS: lldb-unit :: Core/./LLDBCoreTests/MangledTest.EmptyForInvalidDLangName (1955 of 2474) PASS: lldb-unit :: Utility/./UtilityTests/Flags.IsClear (1956 of 2474) PASS: lldb-unit :: Core/./LLDBCoreTests/DumpDataExtractorTest.Formats (1957 of 2474) PASS: lldb-unit :: Utility/./UtilityTests/Predicate.WaitForValueEqualTo (1958 of 2474) PASS: lldb-api :: functionalities/source-map/TestTargetSourceMap.py (1959 of 2474) PASS: lldb-api :: functionalities/thread/concurrent_events/TestConcurrentBreakpointOneDelayBreakpointThreads.py (1960 of 2474) UNSUPPORTED: lldb-api :: commands/trace/multiple-threads/TestTraceStartStopMultipleThreads.py (1961 of 2474) PASS: lldb-unit :: Utility/./UtilityTests/ArgsTest.GetArgumentArrayRef (1962 of 2474) PASS: lldb-unit :: Utility/./UtilityTests/StringListTest.SplitIntoLinesSingleTrailingCR (1963 of 2474) PASS: lldb-api :: lang/c/sizeof/TestCSizeof.py (1964 of 2474) PASS: lldb-unit :: Utility/./UtilityTests/RangeTest.DoesAdjoinOrIntersect (1965 of 2474) PASS: lldb-unit :: Utility/./UtilityTests/ArgsTest.TestTrailingBackslash (1966 of 2474) XFAIL: lldb-shell :: Register/x86-fp-write.test (1967 of 2474) PASS: lldb-unit :: Host/./HostTests/NativeProcessProtocolTest.ReadMemoryWithoutTrap (1968 of 2474) PASS: lldb-api :: functionalities/breakpoint/breakpoint_options/TestBreakpointOptions.py (1969 of 2474) PASS: lldb-unit :: Process/Utility/./ProcessUtilityTests/ProcSMapTests/LinuxProcSMapsTestFixture.ParseSMapRegions/0 (1970 of 2474) PASS: lldb-unit :: Utility/./UtilityTests/UriParserTest.LongPath (1971 of 2474) PASS: lldb-api :: lang/objc/orderedset/TestOrderedSet.py (1972 of 2474) PASS: lldb-api :: lang/cpp/operator-overload/TestOperatorOverload.py (1973 of 2474) UNSUPPORTED: lldb-shell :: Subprocess/clone-follow-parent.test (1974 of 2474) PASS: lldb-api :: lang/cpp/class_static/TestStaticVariables.py (1975 of 2474) PASS: lldb-unit :: ObjectFile/MachO/./ObjectFileMachOTests/ObjectFileMachOTest.ModuleFromSharedCacheInfo (1976 of 2474) PASS: lldb-api :: functionalities/data-formatter/data-formatter-globals/TestDataFormatterGlobals.py (1977 of 2474) PASS: lldb-unit :: Utility/./UtilityTests/ArchSpecTest.TestParseMachCPUDashSubtypeTripleExtra (1978 of 2474) PASS: lldb-api :: functionalities/tail_call_frames/ambiguous_tail_call_seq2/TestAmbiguousTailCallSeq2.py (1979 of 2474) PASS: lldb-api :: functionalities/gdb_remote_client/TestJLink6Armv7RegisterDefinition.py (1980 of 2474) PASS: lldb-api :: functionalities/data-formatter/data-formatter-stl/libcxx/variant/TestDataFormatterLibcxxVariant.py (1981 of 2474) PASS: lldb-unit :: Host/./HostTests/NativeProcessProtocolTest.ReadCStringFromMemory (1982 of 2474) PASS: lldb-shell :: SymbolFile/DWARF/x86/inline-function-address-shared.test (1983 of 2474) PASS: lldb-api :: commands/expression/unicode-in-variable/TestUnicodeInVariable.py (1984 of 2474) PASS: lldb-api :: python_api/name_lookup/TestNameLookup.py (1985 of 2474) PASS: lldb-api :: functionalities/data-formatter/data-formatter-stl/libcxx/shared_ptr/TestDataFormatterLibcxxSharedPtr.py (1986 of 2474) PASS: lldb-unit :: Host/./HostTests/SocketTests/SocketTest.DomainGetConnectURI/ipv4 (1987 of 2474) PASS: lldb-unit :: Utility/./UtilityTests/UriParserTest.Empty (1988 of 2474) PASS: lldb-shell :: SymbolFile/DWARF/x86/find-qualified-variable.cpp (1989 of 2474) PASS: lldb-shell :: SymbolFile/DWARF/x86/dwp-debug-types.s (1990 of 2474) PASS: lldb-unit :: Editline/./EditlineTests/EditlineTestFixture.EditlineReceivesSingleLineText (1991 of 2474) PASS: lldb-unit :: SymbolFile/NativePDB/./SymbolFileNativePDBTests/PDBFPOProgramToDWARFExpressionTests.DependencyChain (1992 of 2474) PASS: lldb-shell :: SymbolFile/NativePDB/tag-types.cpp (1993 of 2474) PASS: lldb-unit :: Process/minidump/./LLDBMinidumpTests/MinidumpParserTest.GetThreadContext_x86_32_wow64 (1994 of 2474) PASS: lldb-unit :: Process/Utility/./ProcessUtilityTests/ProcMapTests/LinuxProcMapsTestFixture.ParseMapRegions/2 (1995 of 2474) UNSUPPORTED: lldb-api :: commands/gui/breakpoints/TestGuiBreakpoints.py (1996 of 2474) PASS: lldb-api :: lang/cpp/template-arguments/TestCppTemplateArguments.py (1997 of 2474) PASS: lldb-unit :: Utility/./UtilityTests/ArgsTest.TestAppendArg (1998 of 2474) PASS: lldb-api :: lang/cpp/unique-types/TestUniqueTypes.py (1999 of 2474) UNSUPPORTED: lldb-shell :: Register/x86-gp-write.test (2000 of 2474) PASS: lldb-api :: functionalities/signal/raise/TestRaise.py (2001 of 2474) PASS: lldb-shell :: ScriptInterpreter/Python/Crashlog/parser_json.test (2002 of 2474) PASS: lldb-unit :: Process/gdb-remote/./ProcessGdbRemoteTests/PortMapTest.FreePortForProcess (2003 of 2474) PASS: lldb-unit :: Utility/./UtilityTests/RangeTest.DoesIntersect (2004 of 2474) PASS: lldb-api :: lang/cpp/limit-debug-info/TestWithLimitDebugInfo.py (2005 of 2474) PASS: lldb-unit :: Process/gdb-remote/./ProcessGdbRemoteTests/GDBRemoteCommunicationClientTest.SendTraceSupportedPacket (2006 of 2474) PASS: lldb-shell :: SymbolFile/Breakpad/line-table-mixed-path-styles.test (2007 of 2474) PASS: lldb-api :: python_api/watchpoint/TestSetWatchpoint.py (2008 of 2474) PASS: lldb-unit :: Utility/./UtilityTests/GeneratorTest.YamlMultiProvider (2009 of 2474) PASS: lldb-api :: functionalities/data-formatter/builtin-formats/TestBuiltinFormats.py (2010 of 2474) PASS: lldb-unit :: ScriptInterpreter/Python/./ScriptInterpreterPythonTests/PythonDataObjectsTest.TestPythonString (2011 of 2474) PASS: lldb-unit :: Expression/./ExpressionTests/DWARFExpression.DW_OP_pick (2012 of 2474) PASS: lldb-api :: commands/disassemble/basic/TestDisassembleBreakpoint.py (2013 of 2474) PASS: lldb-unit :: UnwindAssembly/x86/./UnwindAssemblyx86Tests/Testx86AssemblyInspectionEngine.TestLEAVE (2014 of 2474) PASS: lldb-unit :: Utility/./UtilityTests/StringListTest.GetMaxStringLengthIncreasingSize (2015 of 2474) PASS: lldb-api :: functionalities/gdb_remote_client/TestGDBServerTargetXML.py (2016 of 2474) PASS: lldb-unit :: Host/./HostTests/NativeProcessProtocolTest.SetBreakpointFailRead (2017 of 2474) UNSUPPORTED: lldb-shell :: Subprocess/vfork-follow-child-softbp.test (2018 of 2474) PASS: lldb-api :: commands/target/create-deps/TestTargetCreateDeps.py (2019 of 2474) PASS: lldb-api :: lang/cpp/offsetof/TestOffsetofCpp.py (2020 of 2474) PASS: lldb-unit :: Process/minidump/./LLDBMinidumpTests/MinidumpParserTest.MinidumpDuplicateModuleMinAddress (2021 of 2474) PASS: lldb-api :: functionalities/avoids-fd-leak/TestFdLeak.py (2022 of 2474) PASS: lldb-unit :: Utility/./UtilityTests/StringExtractorTest.DecodeHexU8_InvalidHex (2023 of 2474) UNSUPPORTED: lldb-api :: benchmarks/libcxxmap/TestBenchmarkLibcxxMap.py (2024 of 2474) UNSUPPORTED: lldb-shell :: ScriptInterpreter/Lua/nested_sessions.test (2025 of 2474) PASS: lldb-unit :: Process/minidump/./LLDBMinidumpTests/MinidumpParserTest.GetPidWindows (2026 of 2474) PASS: lldb-unit :: debugserver/./debugserverTests/RNBSocket.LoopBackListenIPv4 (2027 of 2474) PASS: lldb-api :: functionalities/gdb_remote_client/TestRecognizeBreakpoint.py (2028 of 2474) PASS: lldb-api :: functionalities/thread/concurrent_events/TestConcurrentDelayedCrashWithBreakpointSignal.py (2029 of 2474) PASS: lldb-api :: lang/cpp/unicode-literals/TestUnicodeLiterals.py (2030 of 2474) PASS: lldb-shell :: SymbolFile/DWARF/x86/debug-names-compressed.cpp (2031 of 2474) PASS: lldb-unit :: Utility/./UtilityTests/ArgsTest.TestUnknownEscape (2032 of 2474) PASS: lldb-api :: lang/objc/exceptions/TestObjCExceptions.py (2033 of 2474) PASS: lldb-unit :: Host/./HostTests/SocketTests/SocketTest.DecodeHostAndPort/ipv4 (2034 of 2474) PASS: lldb-api :: lang/mixed/TestMixedLanguages.py (2035 of 2474) PASS: lldb-shell :: Commands/command-regex-unalias.test (2036 of 2474) PASS: lldb-api :: functionalities/data-formatter/data-formatter-stl/libcxx/string/TestDataFormatterLibcxxString.py (2037 of 2474) PASS: lldb-unit :: Host/./HostTests/HostInfoTestInitialization.InitTwice (2038 of 2474) PASS: lldb-api :: commands/watchpoints/watchpoint_events/TestWatchpointEvents.py (2039 of 2474) PASS: lldb-api :: commands/target/modules/search-paths/insert/TestTargetModulesSearchpathsInsert.py (2040 of 2474) PASS: lldb-unit :: Utility/./UtilityTests/RangeTest.Slide (2041 of 2474) PASS: lldb-api :: functionalities/breakpoint/address_breakpoints/TestBadAddressBreakpoints.py (2042 of 2474) PASS: lldb-api :: python_api/lldbutil/frame/TestFrameUtils.py (2043 of 2474) PASS: lldb-shell :: ObjectFile/wasm/unified-debug-sections.yaml (2044 of 2474) XFAIL: lldb-shell :: Register/x86-mm-xmm-read.test (2045 of 2474) PASS: lldb-unit :: Utility/./UtilityTests/TimeoutTest.Format (2046 of 2474) UNSUPPORTED: lldb-api :: commands/gui/expand-threads-tree/TestGuiExpandThreadsTree.py (2047 of 2474) PASS: lldb-unit :: Utility/./UtilityTests/StringListTest.InsertStringAtIndexStart (2048 of 2474) UNSUPPORTED: lldb-api :: functionalities/data-formatter/data-formatter-stl/libstdcpp/list/TestDataFormatterStdList.py (2049 of 2474) PASS: lldb-unit :: Expression/./ExpressionTests/DiagnosticManagerTest.AddDiagnostic (2050 of 2474) PASS: lldb-api :: commands/expression/import-std-module/queue/TestQueueFromStdModule.py (2051 of 2474) PASS: lldb-unit :: Expression/./ExpressionTests/DWARFExpression.DW_OP_piece (2052 of 2474) PASS: lldb-api :: driver/batch_mode/TestBatchMode.py (2053 of 2474) UNSUPPORTED: lldb-api :: functionalities/thread/break_after_join/TestBreakAfterJoin.py (2054 of 2474) PASS: lldb-shell :: SymbolFile/DWARF/x86/DW_AT_const_value.s (2055 of 2474) PASS: lldb-shell :: Subprocess/vfork-follow-parent.test (2056 of 2474) PASS: lldb-shell :: ObjectFile/wasm/stripped-debug-sections.yaml (2057 of 2474) PASS: lldb-api :: functionalities/target_var/TestTargetVar.py (2058 of 2474) UNSUPPORTED: lldb-api :: functionalities/ptrauth_diagnostics/brkC47x_code/TestPtrauthBRKc47xDiagnostic.py (2059 of 2474) UNSUPPORTED: lldb-api :: commands/gui/basicdebug/TestGuiBasicDebug.py (2060 of 2474) UNSUPPORTED: lldb-api :: tools/lldb-server/TestGdbRemotePlatformFile.py (2061 of 2474) PASS: lldb-unit :: Core/./LLDBCoreTests/FormatEntityTest.DefinitionConstructionNameTypeData (2062 of 2474) PASS: lldb-unit :: Utility/./UtilityTests/StreamTest.PutBytesAsRawHex8ToMixedEndian (2063 of 2474) UNSUPPORTED: lldb-api :: commands/trace/TestTraceLoad.py (2064 of 2474) PASS: lldb-unit :: Utility/./UtilityTests/StreamTeeTest.DefaultConstructor (2065 of 2474) PASS: lldb-unit :: ObjectFile/PECOFF/./ObjectFilePECOFFTests/PECallFrameInfoTest.Frame_reg_eh (2066 of 2474) PASS: lldb-api :: functionalities/thread_plan/TestThreadPlanCommands.py (2067 of 2474) PASS: lldb-shell :: Driver/TestFile.test (2068 of 2474) PASS: lldb-unit :: Process/minidump/./LLDBMinidumpTests/MinidumpParserTest.GetPid (2069 of 2474) PASS: lldb-unit :: Process/gdb-remote/./ProcessGdbRemoteTests/GDBRemoteClientBaseTest.SendContinueAndAsyncPacket (2070 of 2474) PASS: lldb-api :: functionalities/thread/backtrace_limit/TestBacktraceLimit.py (2071 of 2474) PASS: lldb-unit :: Utility/./UtilityTests/ScalarTest.Comparison (2072 of 2474) PASS: lldb-api :: functionalities/gdb_remote_client/TestGDBRemotePlatformFile.py (2073 of 2474) PASS: lldb-unit :: Utility/./UtilityTests/RangeDataVector.FindEntryThatContains_Overlap (2074 of 2474) PASS: lldb-unit :: Language/CLanguages/./LanguageCLanguagesTests/CLanguages.LookupCLanguagesByLanguageType (2075 of 2474) PASS: lldb-unit :: Process/gdb-remote/./ProcessGdbRemoteTests/PortMapTest.FreePort (2076 of 2474) PASS: lldb-unit :: Utility/./UtilityTests/StringListTest.ShiftStdString (2077 of 2474) PASS: lldb-unit :: ObjectFile/ELF/./ObjectFileELFTests/ObjectFileELFTest.GetModuleSpecifications_EarlySectionHeaders (2078 of 2474) UNSUPPORTED: lldb-api :: arm/breakpoint-it/TestBreakpointIt.py (2079 of 2474) PASS: lldb-api :: functionalities/data-formatter/data-formatter-disabling/TestDataFormatterDisabling.py (2080 of 2474) UNSUPPORTED: lldb-shell :: SymbolFile/PDB/class-layout.test (2081 of 2474) PASS: lldb-unit :: Host/./HostTests/TerminalTest.SetCanonical (2082 of 2474) PASS: lldb-unit :: Utility/./UtilityTests/ArchSpecTest.OperatorBool (2083 of 2474) PASS: lldb-unit :: Utility/./UtilityTests/VMRange.Ordering (2084 of 2474) PASS: lldb-shell :: Register/Core/x86-64-netbsd-addr.test (2085 of 2474) UNSUPPORTED: lldb-shell :: SymbolFile/NativePDB/typedefs.cpp (2086 of 2474) PASS: lldb-unit :: Utility/./UtilityTests/StructuredDataTest.ParseJSONFromFile (2087 of 2474) UNSUPPORTED: lldb-shell :: ScriptInterpreter/Lua/quit.test (2088 of 2474) PASS: lldb-unit :: SymbolFile/DWARF/./SymbolFileDWARFTests/SymbolFileDWARFTests.ParseArangesIgnoreEmpty (2089 of 2474) PASS: lldb-shell :: SymbolFile/DWARF/x86/subprogram_ranges.test (2090 of 2474) UNSUPPORTED: lldb-shell :: SymbolFile/PDB/compilands.test (2091 of 2474) PASS: lldb-unit :: Utility/./UtilityTests/RegisterValueTest.GetSet8 (2092 of 2474) UNSUPPORTED: lldb-shell :: SymbolFile/PDB/enums-layout.test (2093 of 2474) PASS: lldb-unit :: Expression/./ExpressionTests/DWARFExpression.DW_OP_convert (2094 of 2474) UNSUPPORTED: lldb-api :: commands/expression/macros/TestMacros.py (2095 of 2474) PASS: lldb-unit :: Utility/./UtilityTests/Flags.AnyClear (2096 of 2474) PASS: lldb-api :: functionalities/stats_api/TestStatisticsAPI.py (2097 of 2474) PASS: lldb-api :: lang/objc/objc-new-syntax/TestObjCNewSyntaxArray.py (2098 of 2474) PASS: lldb-shell :: SymbolFile/DWARF/x86/debug_loc.s (2099 of 2474) PASS: lldb-shell :: SymbolFile/DWARF/clang-ast-from-dwarf-unamed-and-anon-structs.cpp (2100 of 2474) UNSUPPORTED: lldb-api :: functionalities/gdb_remote_client/TestWasm.py (2101 of 2474) UNSUPPORTED: lldb-shell :: Subprocess/vfork-follow-child-wp.test (2102 of 2474) PASS: lldb-api :: functionalities/rerun/TestRerun.py (2103 of 2474) PASS: lldb-api :: functionalities/postmortem/minidump-new/TestMiniDumpUUID.py (2104 of 2474) PASS: lldb-unit :: Utility/./UtilityTests/ConstStringTest.format_provider (2105 of 2474) PASS: lldb-api :: macosx/profile_vrs_detach/TestDetachVrsProfile.py (2106 of 2474) PASS: lldb-unit :: Target/./TargetTests/PathMappingListTest.RelativeTests (2107 of 2474) PASS: lldb-api :: functionalities/thread/exit_during_expression/TestExitDuringExpression.py (2108 of 2474) PASS: lldb-api :: commands/expression/char/TestExprsChar.py (2109 of 2474) PASS: lldb-unit :: Symbol/./SymbolTests/TestTypeSystemClang.TestNotDeletingUserCopyCstrDueToMoveCStr (2110 of 2474) PASS: lldb-shell :: ScriptInterpreter/Python/Crashlog/no_threadState.test (2111 of 2474) UNSUPPORTED: lldb-api :: functionalities/thread/concurrent_events/TestConcurrentManySignals.py (2112 of 2474) PASS: lldb-shell :: Breakpoint/case-sensitive.test (2113 of 2474) PASS: lldb-api :: lang/cpp/stl/TestSTL.py (2114 of 2474) PASS: lldb-unit :: Utility/./UtilityTests/StringExtractorTest.DecodeHexU8_Exact (2115 of 2474) PASS: lldb-unit :: Symbol/./SymbolTests/PostfixExpression.ToDWARF (2116 of 2474) PASS: lldb-unit :: Utility/./UtilityTests/RangeTest.ClearWithStarAddress (2117 of 2474) PASS: lldb-api :: functionalities/type_lookup/TestTypeLookup.py (2118 of 2474) PASS: lldb-api :: lang/c/local_variables/TestLocalVariables.py (2119 of 2474) PASS: lldb-unit :: Process/./ProcessEventDataTests/ProcessEventDataTest.ShouldStop (2120 of 2474) PASS: lldb-api :: lang/cpp/complete-type-check/TestCppIsTypeComplete.py (2121 of 2474) PASS: lldb-unit :: Interpreter/./InterpreterTests/VerifyUserMultiwordCmdPathTest.TestErrors (2122 of 2474) PASS: lldb-api :: lang/objc/foundation/TestObjCMethods2.py (2123 of 2474) PASS: lldb-unit :: Utility/./UtilityTests/SerializationRountripTest.SerializeDeserializePodPointers (2124 of 2474) PASS: lldb-shell :: Register/Core/aarch64-freebsd-multithread.test (2125 of 2474) UNSUPPORTED: lldb-api :: commands/register/register/aarch64_sve_registers/rw_access_dynamic_resize/TestSVEThreadedDynamic.py (2126 of 2474) PASS: lldb-shell :: Driver/TestConvenienceVariables.test (2127 of 2474) PASS: lldb-unit :: ObjectFile/ELF/./ObjectFileELFTests/ObjectFileELFTest.GetSymtab_NoSymEntryPointArmThumbAddressClass (2128 of 2474) UNSUPPORTED: lldb-api :: commands/trace/TestTraceSchema.py (2129 of 2474) PASS: lldb-unit :: Utility/./UtilityTests/XcodeSDKTest.SDKSupportsSwift (2130 of 2474) PASS: lldb-api :: functionalities/gdb_remote_client/TestProcessConnect.py (2131 of 2474) PASS: lldb-unit :: Process/minidump/./LLDBMinidumpTests/MinidumpParserTest.MinidumpDuplicateModuleMappedFirst (2132 of 2474) PASS: lldb-unit :: UnwindAssembly/x86/./UnwindAssemblyx86Tests/Testx86AssemblyInspectionEngine.TestMovRSPtoRBP (2133 of 2474) PASS: lldb-api :: commands/expression/import-std-module/shared_ptr-dbg-info-content/TestSharedPtrDbgInfoContentFromStdModule.py (2134 of 2474) PASS: lldb-api :: functionalities/tail_call_frames/inlining_and_tail_calls/TestInliningAndTailCalls.py (2135 of 2474) PASS: lldb-unit :: Utility/./UtilityTests/StringListTest.LongestCommonPrefixSingleElement (2136 of 2474) PASS: lldb-api :: functionalities/data-formatter/summary-string-onfail/Test-rdar-9974002.py (2137 of 2474) PASS: lldb-unit :: Utility/./UtilityTests/PassiveReplayTest.InstrumentedBarRef (2138 of 2474) PASS: lldb-api :: tools/lldb-server/register-reading/TestGdbRemoteGPacket.py (2139 of 2474) PASS: lldb-unit :: Utility/./UtilityTests/RegisterValueTest.GetScalarValue (2140 of 2474) UNSUPPORTED: lldb-shell :: Register/x86-64-xmm16-read.test (2141 of 2474) PASS: lldb-api :: functionalities/thread/concurrent_events/TestConcurrentTwoWatchpointsOneDelayBreakpoint.py (2142 of 2474) PASS: lldb-shell :: SymbolFile/DWARF/x86/find-method-local-struct.cpp (2143 of 2474) PASS: lldb-unit :: Host/./HostTests/SocketTests/SocketTest.UDPConnect/ipv4 (2144 of 2474) PASS: lldb-unit :: Language/Highlighting/./HighlighterTests/HighlighterTest.ClangPreserveNewLine (2145 of 2474) PASS: lldb-unit :: Process/minidump/./LLDBMinidumpTests/RegisterContextMinidump.CheckRegisterContextMinidump_ARM (2146 of 2474) PASS: lldb-api :: assert_messages_test/TestAssertMessages.py (2147 of 2474) PASS: lldb-unit :: Symbol/./SymbolTests/TestTypeSystemClang.TestGetTypeClassNested (2148 of 2474) PASS: lldb-api :: functionalities/dead-strip/TestDeadStrip.py (2149 of 2474) PASS: lldb-shell :: SymbolFile/DWARF/x86/find-inline-method.s (2150 of 2474) PASS: lldb-unit :: Utility/./UtilityTests/RangeTest.Equal (2151 of 2474) UNSUPPORTED: lldb-api :: benchmarks/libcxxlist/TestBenchmarkLibcxxList.py (2152 of 2474) PASS: lldb-unit :: Language/Highlighting/./HighlighterTests/HighlighterTest.DefaultHighlighter (2153 of 2474) PASS: lldb-unit :: Language/Highlighting/./HighlighterTests/HighlighterTest.ClangCursorPos (2154 of 2474) PASS: lldb-shell :: ScriptInterpreter/Python/python.test (2155 of 2474) PASS: lldb-api :: functionalities/gdb_remote_client/TestPlatformClient.py (2156 of 2474) PASS: lldb-unit :: Editline/./EditlineTests/EditlineTestFixture.EditlineReceivesMultiLineText (2157 of 2474) PASS: lldb-api :: commands/watchpoints/step_over_watchpoint/TestStepOverWatchpoint.py (2158 of 2474) PASS: lldb-api :: lang/c/offsetof/TestOffsetof.py (2159 of 2474) PASS: lldb-unit :: Language/Highlighting/./HighlighterTests/HighlighterTest.ClangCursorOutOfBounds (2160 of 2474) PASS: lldb-api :: functionalities/tail_call_frames/thread_step_out_message/TestArtificialFrameStepOutMessage.py (2161 of 2474) PASS: lldb-shell :: ObjectFile/ELF/many-sections.s (2162 of 2474) PASS: lldb-api :: functionalities/thread/concurrent_events/TestConcurrentTwoBreakpointsOneWatchpoint.py (2163 of 2474) PASS: lldb-unit :: Host/./HostTests/ConnectionFileDescriptorTest.TCPGetURIv4 (2164 of 2474) PASS: lldb-api :: functionalities/return-value/TestReturnValue.py (2165 of 2474) PASS: lldb-unit :: SymbolFile/NativePDB/./SymbolFileNativePDBTests/PDBFPOProgramToDWARFExpressionTests.UnresolvedCyclicRegisterAssignmentReference (2166 of 2474) PASS: lldb-unit :: Process/gdb-remote/./ProcessGdbRemoteTests/GDBRemoteCommunicationClientTest.TestPacketSpeedJSON (2167 of 2474) PASS: lldb-api :: commands/log/basic/TestLogging.py (2168 of 2474) PASS: lldb-unit :: Utility/./UtilityTests/StringExtractorTest.GetNameColonValueNoColon (2169 of 2474) PASS: lldb-api :: functionalities/wrong_commands/TestWrongCommands.py (2170 of 2474) PASS: lldb-unit :: SymbolFile/DWARF/./SymbolFileDWARFTests/DWARFASTParserClangTests.TestCallingConventionParsing (2171 of 2474) PASS: lldb-shell :: SymbolFile/DWARF/DW_AT_range-DW_FORM_sec_offset.s (2172 of 2474) PASS: lldb-api :: source-manager/TestSourceManager.py (2173 of 2474) PASS: lldb-unit :: Process/minidump/./LLDBMinidumpTests/MinidumpParserTest.GetArchitectureWindows (2174 of 2474) PASS: lldb-unit :: Utility/./UtilityTests/RecordReplayTest.InstrumentedFoo (2175 of 2474) PASS: lldb-unit :: Core/./LLDBCoreTests/SourceFileCache.FindSourceFileNotFound (2176 of 2474) PASS: lldb-api :: functionalities/unused-inlined-parameters/TestUnusedInlinedParameters.py (2177 of 2474) PASS: lldb-api :: lang/c/find_struct_type/TestFindStructTypes.py (2178 of 2474) UNSUPPORTED: lldb-shell :: Unwind/unwind-plan-dwarf-dump.test (2179 of 2474) PASS: lldb-unit :: Process/Utility/./ProcessUtilityTests/MemoryTagManagerAArch64MTETest.RemoveNonAddressBits (2180 of 2474) PASS: lldb-shell :: Breakpoint/dummy-target.test (2181 of 2474) PASS: lldb-api :: lang/c/conflicting-symbol/TestConflictingSymbol.py (2182 of 2474) PASS: lldb-shell :: Driver/TestCore.test (2183 of 2474) PASS: lldb-unit :: Utility/./UtilityTests/FileSpecTest.Equal (2184 of 2474) PASS: lldb-unit :: Utility/./UtilityTests/BinaryStreamTest.PutSLEB128ThreeBytes (2185 of 2474) UNSUPPORTED: lldb-api :: tools/lldb-server/memory-tagging/TestGdbRemoteMemoryTagging.py (2186 of 2474) PASS: lldb-api :: commands/apropos/with-process/TestAproposWithProcess.py (2187 of 2474) PASS: lldb-unit :: Utility/./UtilityTests/UriParserTest.BadPort (2188 of 2474) PASS: lldb-shell :: SymbolFile/DWARF/x86/array-sizes.s (2189 of 2474) UNSUPPORTED: lldb-api :: functionalities/ptr_refs/TestPtrRefs.py (2190 of 2474) PASS: lldb-shell :: SymbolFile/DWARF/x86/debug-line-basic.s (2191 of 2474) PASS: lldb-api :: functionalities/reproducers/fs-case-sensitivity/TestReproducerFSCaseSensitivity.py (2192 of 2474) PASS: lldb-unit :: Expression/./ExpressionTests/CppModuleConfigurationTest.Linux (2193 of 2474) PASS: lldb-unit :: Utility/./UtilityTests/BinaryStreamTest.PutULEB128Zero (2194 of 2474) UNSUPPORTED: lldb-shell :: BuildScript/toolchain-clang-cl.test (2195 of 2474) PASS: lldb-unit :: Utility/./UtilityTests/StreamTest.PutCharNull (2196 of 2474) PASS: lldb-unit :: SymbolFile/DWARF/./SymbolFileDWARFTests/XcodeSDKModuleTests.TestModuleGetXcodeSDK (2197 of 2474) PASS: lldb-unit :: Utility/./UtilityTests/ProcessInfoTest.Constructor (2198 of 2474) PASS: lldb-unit :: Symbol/./SymbolTests/DWARFCallFrameInfoTest.Basic_eh (2199 of 2474) PASS: lldb-api :: functionalities/breakpoint/breakpoint_command/TestBreakpointCommandsFromPython.py (2200 of 2474) PASS: lldb-api :: types/TestIntegerTypeExpr.py (2201 of 2474) PASS: lldb-unit :: Utility/./UtilityTests/ReproducerTest.SetCapture (2202 of 2474) PASS: lldb-api :: commands/expression/fixits/TestFixIts.py (2203 of 2474) PASS: lldb-shell :: SymbolFile/Breakpad/unwind-via-stack-win.test (2204 of 2474) PASS: lldb-unit :: Process/gdb-remote/./ProcessGdbRemoteTests/GDBRemoteCommunicationClientTest.GetMemoryRegionInfoInvalidResponse (2205 of 2474) PASS: lldb-unit :: Utility/./UtilityTests/StreamTest.QuotedCString (2206 of 2474) PASS: lldb-api :: commands/log/invalid-args/TestInvalidArgsLog.py (2207 of 2474) PASS: lldb-unit :: Expression/./ExpressionTests/ClangExpressionDeclMapTest.TestPersistentDeclLookup (2208 of 2474) PASS: lldb-api :: functionalities/conditional_break/TestConditionalBreak.py (2209 of 2474) PASS: lldb-api :: commands/process/launch-with-shellexpand/TestLaunchWithShellExpand.py (2210 of 2474) PASS: lldb-api :: lang/cpp/class-template-type-parameter-pack/TestClassTemplateTypeParameterPack.py (2211 of 2474) UNSUPPORTED: lldb-shell :: Unwind/eh-frame-small-fde.test (2212 of 2474) PASS: lldb-api :: lang/objc/forward-decl/TestForwardDecl.py (2213 of 2474) PASS: lldb-shell :: SymbolFile/DWARF/x86/split-dwarf-multiple-cu.ll (2214 of 2474) UNSUPPORTED: lldb-api :: commands/gui/basic/TestGuiBasic.py (2215 of 2474) UNSUPPORTED: lldb-shell :: ScriptInterpreter/Lua/convenience_variables.test (2216 of 2474) PASS: lldb-api :: functionalities/data-formatter/varscript_formatting/TestDataFormatterVarScriptFormatting.py (2217 of 2474) PASS: lldb-api :: commands/expression/scoped_enums/TestScopedEnumType.py (2218 of 2474) PASS: lldb-shell :: SymbolFile/DWARF/x86/dwarf5_locations.s (2219 of 2474) PASS: lldb-unit :: Utility/./UtilityTests/DataExtractorTest.GetMaxU64_unchecked (2220 of 2474) PASS: lldb-api :: lang/c/stepping/TestThreadStepInAvoidRegexp.py (2221 of 2474) PASS: lldb-unit :: Utility/./UtilityTests/DataExtractorTest.GetCStrAtNullOffset (2222 of 2474) PASS: lldb-shell :: SymbolFile/DWARF/x86/limit-debug-info.s (2223 of 2474) PASS: lldb-unit :: Utility/./UtilityTests/ProcessInstanceInfo.Dump (2224 of 2474) PASS: lldb-api :: functionalities/inferior-crashing/TestInferiorCrashingStep.py (2225 of 2474) PASS: lldb-shell :: ScriptInterpreter/Python/command_import.test (2226 of 2474) PASS: lldb-api :: functionalities/data-formatter/data-formatter-objc/TestDataFormatterObjCNSBundle.py (2227 of 2474) PASS: lldb-unit :: Symbol/./SymbolTests/TestClangASTImporter.CanImportInvalidType (2228 of 2474) PASS: lldb-api :: functionalities/postmortem/wow64_minidump/TestWow64MiniDump.py (2229 of 2474) PASS: lldb-api :: tools/lldb-server/inferior-crash/TestGdbRemoteSegFault.py (2230 of 2474) PASS: lldb-unit :: Interpreter/./InterpreterTests/OptionArgParserTest.toChar (2231 of 2474) PASS: lldb-api :: lang/cpp/template-specialization-type/TestTemplateSpecializationType.py (2232 of 2474) PASS: lldb-unit :: Utility/./UtilityTests/DataExtractorTest.GetCStrAtEnd (2233 of 2474) PASS: lldb-unit :: Target/./TargetTests/ModuleCacheTest.GetAndPut (2234 of 2474) PASS: lldb-unit :: Utility/./UtilityTests/UUIDTest.SetFromStringRef (2235 of 2474) PASS: lldb-unit :: Host/./HostTests/FileSystemTest.FileAndDirectoryComponents (2236 of 2474) PASS: lldb-api :: functionalities/thread/exit_during_break/TestExitDuringBreak.py (2237 of 2474) PASS: lldb-api :: functionalities/breakpoint/global_constructor/TestBreakpointInGlobalConstructor.py (2238 of 2474) PASS: lldb-unit :: ScriptInterpreter/Python/./ScriptInterpreterPythonTests/PythonDataObjectsTest.TestPythonTupleInitializerList2 (2239 of 2474) UNSUPPORTED: lldb-shell :: SymbolFile/NativePDB/local-variables.cpp (2240 of 2474) PASS: lldb-unit :: Utility/./UtilityTests/StringListTest.PopBack (2241 of 2474) PASS: lldb-unit :: Utility/./UtilityTests/ListenerTest.GetEventImmediate (2242 of 2474) PASS: lldb-api :: macosx/find-dsym/deep-bundle/TestDeepBundle.py (2243 of 2474) UNSUPPORTED: lldb-api :: lang/objc/objc-dynamic-value/TestObjCDynamicValue.py (2244 of 2474) PASS: lldb-unit :: Utility/./UtilityTests/TimerTest.CategoryTimesStats (2245 of 2474) PASS: lldb-unit :: Utility/./UtilityTests/StringExtractorTest.DecodeHexU8_Underflow (2246 of 2474) PASS: lldb-api :: commands/expression/radar_9531204/TestPrintfAfterUp.py (2247 of 2474) PASS: lldb-unit :: SymbolFile/DWARF/./SymbolFileDWARFTests/DWARFASTParserClangTests.EnsureAllDIEsInDeclContextHaveBeenParsedParsesOnlyMatchingEntries (2248 of 2474) PASS: lldb-unit :: Utility/./UtilityTests/StringListTest.GetMaxStringLengthMixed (2249 of 2474) PASS: lldb-unit :: Host/./HostTests/PipeTest.OpenAsReader (2250 of 2474) PASS: lldb-api :: functionalities/thread/jump/TestThreadJump.py (2251 of 2474) PASS: lldb-unit :: ObjectFile/Breakpad/./ObjectFileBreakpadTests/PublicRecord.parse (2252 of 2474) PASS: lldb-shell :: ObjectFile/ELF/null-jmprel.yaml (2253 of 2474) PASS: lldb-unit :: Utility/./UtilityTests/NameMatchesTest.Ignore (2254 of 2474) UNSUPPORTED: lldb-api :: lang/objc/rdar-12408181/TestRdar12408181.py (2255 of 2474) PASS: lldb-shell :: Breakpoint/debug_rnglist_basic.test (2256 of 2474) PASS: lldb-api :: commands/frame/diagnose/inheritance/TestDiagnoseInheritance.py (2257 of 2474) PASS: lldb-unit :: Utility/./UtilityTests/UriParserTest.TypicalPortPathIPv4 (2258 of 2474) PASS: lldb-shell :: Reproducer/TestDiscard.test (2259 of 2474) PASS: lldb-unit :: Utility/./UtilityTests/VMRange.CollectionContains (2260 of 2474) PASS: lldb-shell :: Commands/CommandScriptImmediateOutput/CommandScriptImmediateOutputConsole.test (2261 of 2474) PASS: lldb-api :: lang/objc/objc-new-syntax/TestObjCNewSyntaxDictionary.py (2262 of 2474) PASS: lldb-shell :: Reproducer/TestFinalize.test (2263 of 2474) PASS: lldb-api :: lang/objc/foundation/TestObjCMethods.py (2264 of 2474) PASS: lldb-unit :: Core/./LLDBCoreTests/RichManglingContextTest.IPDRealloc (2265 of 2474) PASS: lldb-api :: macosx/lc-note/kern-ver-str/TestKernVerStrLCNOTE.py (2266 of 2474) PASS: lldb-unit :: Utility/./UtilityTests/Flags.AllClear (2267 of 2474) PASS: lldb-unit :: Utility/./UtilityTests/BinaryStreamTest.PutULEB128NineBytes (2268 of 2474) PASS: lldb-unit :: UnwindAssembly/x86/./UnwindAssemblyx86Tests/Testx86AssemblyInspectionEngine.TestPush0 (2269 of 2474) PASS: lldb-api :: commands/expression/weak_symbols/TestWeakSymbols.py (2270 of 2474) PASS: lldb-api :: commands/command/delete/TestCommandDelete.py (2271 of 2474) PASS: lldb-api :: python_api/process/read-mem-cstring/TestReadMemCString.py (2272 of 2474) PASS: lldb-shell :: SymbolFile/DWARF/x86/dwarf5-debug_line-file-index.s (2273 of 2474) PASS: lldb-api :: commands/expression/argument_passing_restrictions/TestArgumentPassingRestrictions.py (2274 of 2474) PASS: lldb-unit :: Utility/./UtilityTests/ScalarTest.Promotion (2275 of 2474) PASS: lldb-api :: commands/expression/import-std-module/empty-module/TestEmptyStdModule.py (2276 of 2474) PASS: lldb-unit :: Utility/./UtilityTests/LogChannelEnabledTest.log_options (2277 of 2474) PASS: lldb-unit :: Utility/./UtilityTests/VMRange.Clear (2278 of 2474) PASS: lldb-api :: commands/frame/diagnose/dereference-this/TestDiagnoseDereferenceThis.py (2279 of 2474) PASS: lldb-api :: commands/expression/call-function/TestCallUserDefinedFunction.py (2280 of 2474) PASS: lldb-api :: python_api/file_handle/TestFileHandle.py (2281 of 2474) PASS: lldb-shell :: ObjectFile/ELF/PT_LOAD.yaml (2282 of 2474) PASS: lldb-unit :: debugserver/./debugserverTests/RNBSocket.AnyListen (2283 of 2474) PASS: lldb-api :: lang/cpp/modules-import/TestCXXModulesImport.py (2284 of 2474) PASS: lldb-api :: lang/objc/modules-compile-error/TestModulesCompileError.py (2285 of 2474) UNSUPPORTED: lldb-api :: functionalities/data-formatter/data-formatter-stl/libstdcpp/vector/TestDataFormatterStdVector.py (2286 of 2474) PASS: lldb-api :: macosx/indirect_symbol/TestIndirectSymbols.py (2287 of 2474) PASS: lldb-shell :: ObjectFile/PECOFF/section-types.yaml (2288 of 2474) PASS: lldb-api :: lang/cpp/alignas_base_class/TestAlignAsBaseClass.py (2289 of 2474) PASS: lldb-api :: commands/expression/codegen-crash-typedefdecl-not-in_declcontext/TestCodegenCrashTypedefDeclNotInDeclContext.py (2290 of 2474) PASS: lldb-unit :: Utility/./UtilityTests/UUIDTest.RelationalOperators (2291 of 2474) PASS: lldb-unit :: Expression/./ExpressionTests/DiagnosticManagerTest.PutStringSeverities (2292 of 2474) PASS: lldb-api :: python_api/value_var_update/TestValueVarUpdate.py (2293 of 2474) PASS: lldb-api :: commands/expression/persistent_ptr_update/TestPersistentPtrUpdate.py (2294 of 2474) PASS: lldb-unit :: Host/./HostTests/Host.GetEnvironment (2295 of 2474) PASS: lldb-unit :: Target/./TargetTests/MemoryRegionInfoTest.Formatv (2296 of 2474) PASS: lldb-api :: lang/c/record_decl_in_expr/TestRecordDeclInExpr.py (2297 of 2474) PASS: lldb-unit :: Symbol/./SymbolTests/TestClangASTImporter.CopyDeclTagDecl (2298 of 2474) PASS: lldb-unit :: Utility/./UtilityTests/PassiveReplayTest.InstrumentedBar (2299 of 2474) PASS: lldb-api :: functionalities/data-formatter/synthcapping/TestSyntheticCapping.py (2300 of 2474) PASS: lldb-api :: commands/version/TestVersion.py (2301 of 2474) PASS: lldb-unit :: Signals/./SignalsTests/UnixSignalsTest.GetFilteredSignals (2302 of 2474) PASS: lldb-unit :: Utility/./UtilityTests/FileSpecTest.FileAndDirectoryComponents (2303 of 2474) PASS: lldb-shell :: SymbolFile/DWARF/x86/debug_rnglists-dwp.s (2304 of 2474) PASS: lldb-api :: functionalities/data-formatter/ptr_ref_typedef/TestPtrRef2Typedef.py (2305 of 2474) PASS: lldb-shell :: SymbolFile/NativePDB/source-list.cpp (2306 of 2474) PASS: lldb-api :: python_api/function_symbol/TestSymbolAPI.py (2307 of 2474) PASS: lldb-unit :: Symbol/./SymbolTests/TestClangASTImporter.MetadataPropagation (2308 of 2474) PASS: lldb-unit :: Platform/./LLDBPlatformTests/PlatformAppleSimulatorTest.TestHostPlatformToSim (2309 of 2474) PASS: lldb-api :: lang/cpp/llvm-style/TestLLVMStyle.py (2310 of 2474) PASS: lldb-api :: lang/cpp/trivial_abi/TestTrivialABI.py (2311 of 2474) PASS: lldb-unit :: Platform/./LLDBPlatformTests/PlatformDarwinTest.GetCompatibleArchARMv7m (2312 of 2474) PASS: lldb-unit :: Symbol/./SymbolTests/TestTypeSystemClang.TestGetBasicTypeFromEnum (2313 of 2474) UNSUPPORTED: lldb-api :: tools/lldb-server/TestGdbRemoteAuxvSupport.py (2314 of 2474) PASS: lldb-shell :: Settings/TestDisassemblyFormat.test (2315 of 2474) PASS: lldb-shell :: Register/Core/x86-32-freebsd-multithread.test (2316 of 2474) PASS: lldb-api :: functionalities/load_using_paths/TestLoadUsingPaths.py (2317 of 2474) PASS: lldb-unit :: Core/./LLDBCoreTests/MangledTest.ResultForValidName (2318 of 2474) PASS: lldb-api :: functionalities/thread/thread_exit/TestThreadExit.py (2319 of 2474) PASS: lldb-unit :: ObjectFile/Breakpad/./ObjectFileBreakpadTests/FuncRecord.parse (2320 of 2474) PASS: lldb-api :: lang/objc/objc-new-syntax/TestObjCNewSyntaxLiteral.py (2321 of 2474) PASS: lldb-unit :: Process/gdb-remote/./ProcessGdbRemoteTests/GDBRemoteCommunicationClientTest.GetModulesInfo_UUID20 (2322 of 2474) PASS: lldb-shell :: Register/x86-multithread-write.test (2323 of 2474) PASS: lldb-unit :: Target/./TargetTests/ExecutionContextTest.GetByteOrderTarget (2324 of 2474) PASS: lldb-unit :: Host/./HostTests/FileSystemTest.Resolve (2325 of 2474) PASS: lldb-unit :: Utility/./UtilityTests/ArchSpecTest.TestParseMachCPUDashSubtypeTripleSimple (2326 of 2474) PASS: lldb-unit :: DataFormatter/./LLDBFormatterTests/TypeMatcherTests.RegexMatchPart (2327 of 2474) UNSUPPORTED: lldb-shell :: Register/x86-db-read.test (2328 of 2474) PASS: lldb-unit :: Platform/./LLDBPlatformTests/PlatformDarwinTest.GetCompatibleArchARM64 (2329 of 2474) PASS: lldb-unit :: Utility/./UtilityTests/StreamTest.SetIndentLevel (2330 of 2474) PASS: lldb-api :: commands/watchpoints/watchpoint_on_vectors/TestValueOfVectorVariable.py (2331 of 2474) PASS: lldb-unit :: Process/gdb-remote/./ProcessGdbRemoteTests/GDBRemoteClientBaseTest.SendContinueAndLateInterrupt (2332 of 2474) UNSUPPORTED: lldb-api :: functionalities/ptrauth_diagnostics/BRAA_error/TestPtrauthBRAADiagnostic.py (2333 of 2474) PASS: lldb-unit :: Host/./HostTests/FileSystemTest.GetByteSize (2334 of 2474) UNSUPPORTED: lldb-shell :: Reproducer/TestLuaImport.test (2335 of 2474) XFAIL: lldb-shell :: Register/x86-64-fp-read.test (2336 of 2474) UNSUPPORTED: lldb-api :: macosx/corefile-exception-reason/TestCorefileExceptionReason.py (2337 of 2474) PASS: lldb-shell :: ObjectFile/ELF/compressed-sections.yaml (2338 of 2474) PASS: lldb-api :: commands/gui/invalid-args/TestInvalidArgsGui.py (2339 of 2474) PASS: lldb-unit :: Language/Highlighting/./HighlighterTests/HighlighterTest.ClangTrailingBackslashBeforeNewline (2340 of 2474) PASS: lldb-unit :: Core/./LLDBCoreTests/FormatEntityTest.DefinitionConstructionNameAndType (2341 of 2474) PASS: lldb-api :: commands/expression/anonymous-struct/TestCallUserAnonTypedef.py (2342 of 2474) PASS: lldb-shell :: Watchpoint/SetErrorCases.test (2343 of 2474) PASS: lldb-unit :: Target/./TargetTests/PathMappingListTest.AbsoluteTests (2344 of 2474) UNSUPPORTED: lldb-shell :: Subprocess/vfork-follow-child.test (2345 of 2474) PASS: lldb-unit :: Utility/./UtilityTests/StreamTest.PutHex16ByteOrderLittle (2346 of 2474) PASS: lldb-api :: functionalities/breakpoint/breakpoint_names/TestBreakpointNames.py (2347 of 2474) PASS: lldb-shell :: Register/Core/x86-64-freebsd-gp.test (2348 of 2474) PASS: lldb-api :: functionalities/reproducers/attach/TestReproducerAttach.py (2349 of 2474) PASS: lldb-api :: lang/c/strings/TestCStrings.py (2350 of 2474) PASS: lldb-shell :: SymbolFile/DWARF/x86/DW_AT_location-DW_AT_const_value.s (2351 of 2474) PASS: lldb-unit :: Core/./LLDBCoreTests/SourceLocationSpecTest.Compare (2352 of 2474) PASS: lldb-unit :: UnwindAssembly/x86/./UnwindAssemblyx86Tests/Testx86AssemblyInspectionEngine.TestSimplei386ugmented (2353 of 2474) PASS: lldb-unit :: Core/./LLDBCoreTests/DumpDataExtractorTest.ItemByteSizeErrors (2354 of 2474) PASS: lldb-unit :: Utility/./UtilityTests/StringExtractorTest.InitMisc (2355 of 2474) UNSUPPORTED: lldb-api :: tools/lldb-vscode/disconnect/TestVSCode_disconnect.py (2356 of 2474) PASS: lldb-unit :: Utility/./UtilityTests/SerializationRountripTest.SerializeDeserializeObjectReference (2357 of 2474) PASS: lldb-api :: functionalities/data-formatter/language_category_updates/TestDataFormatterLanguageCategoryUpdates.py (2358 of 2474) PASS: lldb-unit :: DataFormatter/./LLDBFormatterTests/TypeMatcherTests.GetMatchStringExactName (2359 of 2474) PASS: lldb-unit :: Utility/./UtilityTests/ScalarTest.Getters (2360 of 2474) PASS: lldb-shell :: ObjectFile/ELF/avr-basic-info.yaml (2361 of 2474) PASS: lldb-api :: lang/cpp/forward-declared-template-specialization/TestCppForwardDeclaredTemplateSpecialization.py (2362 of 2474) PASS: lldb-unit :: Language/Highlighting/./HighlighterTests/HighlighterTest.ClangBraces (2363 of 2474) PASS: lldb-unit :: Utility/./UtilityTests/DataExtractorTest.GetMaxS64 (2364 of 2474) PASS: lldb-api :: lang/cpp/class-template-parameter-pack/TestClassTemplateParameterPack.py (2365 of 2474) PASS: lldb-api :: functionalities/plugins/python_os_plugin/TestPythonOSPlugin.py (2366 of 2474) UNSUPPORTED: lldb-api :: commands/trace/TestTraceTimestampCounters.py (2367 of 2474) PASS: lldb-api :: functionalities/object-file/TestImageListMultiArchitecture.py (2368 of 2474) PASS: lldb-unit :: Host/./HostTests/SocketTests/SocketTest.DomainListenConnectAccept/ipv4 (2369 of 2474) PASS: lldb-unit :: Host/./HostTests/SocketTests/SocketTest.UDPGetConnectURI/ipv4 (2370 of 2474) PASS: lldb-unit :: UnwindAssembly/x86/./UnwindAssemblyx86Tests/Testx86AssemblyInspectionEngine.TestPushImm (2371 of 2474) PASS: lldb-shell :: SymbolFile/DWARF/x86/dwp-separate-debug-file.cpp (2372 of 2474) PASS: lldb-unit :: API/./APITests/SBStructuredDataTest.NullImpl (2373 of 2474) PASS: lldb-unit :: Host/./HostTests/XML.GetAs (2374 of 2474) UNSUPPORTED: lldb-api :: functionalities/tsan/basic/TestTsanBasic.py (2375 of 2474) PASS: lldb-unit :: UnwindAssembly/x86/./UnwindAssemblyx86Tests/Testx86AssemblyInspectionEngine.TestPushR15 (2376 of 2474) PASS: lldb-api :: linux/builtin_trap/TestBuiltinTrap.py (2377 of 2474) PASS: lldb-api :: lang/cpp/call-function/TestCallCPPFunction.py (2378 of 2474) PASS: lldb-unit :: Expression/./ExpressionTests/DiagnosticManagerTest.AppendMessageSubsequentDiags (2379 of 2474) PASS: lldb-unit :: Utility/./UtilityTests/ArgsTest.TestArgv (2380 of 2474) PASS: lldb-unit :: Utility/./UtilityTests/UriParserTest.SchemeHostSeparator (2381 of 2474) PASS: lldb-api :: lang/objc/warnings-in-expr-parser/TestObjCWarningsInExprParser.py (2382 of 2474) PASS: lldb-unit :: Target/./TargetTests/StackFrameRecognizerTest.NullModuleRegex (2383 of 2474) PASS: lldb-api :: commands/watchpoints/watchpoint_size/TestWatchpointSizes.py (2384 of 2474) PASS: lldb-api :: functionalities/tail_call_frames/sbapi_support/TestTailCallFrameSBAPI.py (2385 of 2474) PASS: lldb-unit :: Utility/./UtilityTests/OptionsWithRawTest.ArgsButNoLeadingDash (2386 of 2474) PASS: lldb-shell :: Settings/TestFrameFormatNoColor.test (2387 of 2474) PASS: lldb-unit :: Utility/./UtilityTests/StringExtractorTest.GetNameColonValueNoSemicolon (2388 of 2474) PASS: lldb-unit :: SymbolFile/NativePDB/./SymbolFileNativePDBTests/PDBFPOProgramToDWARFExpressionTests.UnsupportedRASearch (2389 of 2474) PASS: lldb-unit :: Process/Utility/./ProcessUtilityTests/ProcSMapTests/LinuxProcSMapsTestFixture.ParseSMapRegions/3 (2390 of 2474) PASS: lldb-unit :: Utility/./UtilityTests/AnsiTerminal.AtEnd (2391 of 2474) PASS: lldb-shell :: ObjectFile/ELF/basic-info.yaml (2392 of 2474) PASS: lldb-shell :: ObjectFile/PECOFF/invalid-export-table.yaml (2393 of 2474) PASS: lldb-api :: functionalities/data-formatter/type_summary_list_arg/TestTypeSummaryListArg.py (2394 of 2474) PASS: lldb-shell :: Register/Core/x86-64-netbsd-fp.test (2395 of 2474) PASS: lldb-api :: lang/c/shared_lib/TestSharedLib.py (2396 of 2474) PASS: lldb-api :: commands/expression/inline-namespace/TestInlineNamespace.py (2397 of 2474) UNSUPPORTED: lldb-api :: tools/lldb-server/TestGdbRemoteSaveCore.py (2398 of 2474) PASS: lldb-shell :: SymbolFile/Breakpad/line-table.test (2399 of 2474) PASS: lldb-unit :: Utility/./UtilityTests/VASprintfTest.BufferResize (2400 of 2474) PASS: lldb-shell :: Breakpoint/split-dwarf-5-addrbase.test (2401 of 2474) PASS: lldb-unit :: Core/./LLDBCoreTests/RichManglingContextTest.SwitchProvider (2402 of 2474) UNSUPPORTED: lldb-shell :: Subprocess/vfork-follow-parent-wp.test (2403 of 2474) PASS: lldb-api :: functionalities/thread/num_threads/TestNumThreads.py (2404 of 2474) PASS: lldb-api :: functionalities/data-formatter/boolreference/TestFormattersBoolRefPtr.py (2405 of 2474) PASS: lldb-unit :: Utility/./UtilityTests/StringExtractorTest.GetHexU8_Exact_NoEof (2406 of 2474) PASS: lldb-unit :: Utility/./UtilityTests/StringExtractorTest.GetNameColonValueSuccess (2407 of 2474) PASS: lldb-unit :: DataFormatter/./LLDBFormatterTests/TypeMatcherTests.ExactName (2408 of 2474) PASS: lldb-unit :: Host/./HostTests/SocketTests/SocketTest.TCPListen0ConnectAccept/ipv6 (2409 of 2474) PASS: lldb-unit :: Host/./HostTests/SocketTests/SocketTest.UDPConnect/ipv6 (2410 of 2474) PASS: lldb-unit :: SymbolFile/NativePDB/./SymbolFileNativePDBTests/PDBFPOProgramToDWARFExpressionTests.UnknownOp (2411 of 2474) PASS: lldb-unit :: API/./APITests/SBCommandInterpreterTest.SingleWordCommand (2412 of 2474) PASS: lldb-shell :: SymbolFile/DWARF/x86/DW_AT_decl_file-DW_AT_specification-crosscu.s (2413 of 2474) PASS: lldb-api :: lang/objc/objc-ivar-stripped/TestObjCIvarStripped.py (2414 of 2474) PASS: lldb-api :: functionalities/data-formatter/data-formatter-objc/TestDataFormatterObjCExpr.py (2415 of 2474) PASS: lldb-api :: functionalities/breakpoint/breakpoint_ignore_count/TestBreakpointIgnoreCount.py (2416 of 2474) PASS: lldb-api :: python_api/lldbutil/process/TestPrintStackTraces.py (2417 of 2474) PASS: lldb-unit :: Utility/./UtilityTests/DataExtractorTest.GetFloatUnaligned (2418 of 2474) PASS: lldb-api :: lang/c/global_variables/TestGlobalVariables.py (2419 of 2474) PASS: lldb-api :: functionalities/plugins/python_os_plugin/stepping_plugin_threads/TestOSPluginStepping.py (2420 of 2474) PASS: lldb-api :: lang/c/local_types/TestUseClosestType.py (2421 of 2474) PASS: lldb-api :: functionalities/backticks/TestBackticksWithoutATarget.py (2422 of 2474) PASS: lldb-api :: lang/cpp/crtp/TestCppCRTP.py (2423 of 2474) UNSUPPORTED: lldb-api :: linux/mix-dwo-and-regular-objects/TestMixedDwarfBinary.py (2424 of 2474) PASS: lldb-api :: functionalities/postmortem/mach-core/TestMachCore.py (2425 of 2474) PASS: lldb-unit :: Interpreter/./InterpreterTests/OptionValueArgs.DeepCopy (2426 of 2474) PASS: lldb-unit :: ScriptInterpreter/Python/./ScriptInterpreterPythonTests/PythonDataObjectsTest.TestExtractingUInt64ThroughStructuredData (2427 of 2474) PASS: lldb-unit :: Utility/./UtilityTests/StringListTest.CopyList (2428 of 2474) UNSUPPORTED: lldb-api :: commands/platform/connect/TestPlatformConnect.py (2429 of 2474) PASS: lldb-api :: lang/objc/unicode-string/TestUnicodeString.py (2430 of 2474) UNSUPPORTED: lldb-shell :: SymbolFile/DWARF/debug-types-expressions.test (2431 of 2474) PASS: lldb-unit :: Utility/./UtilityTests/RangeTest.Clear (2432 of 2474) PASS: lldb-unit :: Process/Utility/./ProcessUtilityTests/RegisterContext_x86Test.AbridgedToFullTagWord (2433 of 2474) PASS: lldb-api :: lang/objc/bitfield_ivars/TestBitfieldIvars.py (2434 of 2474) PASS: lldb-api :: api/multiple-debuggers/TestMultipleDebuggers.py (2435 of 2474) PASS: lldb-api :: functionalities/data-formatter/data-formatter-proper-plurals/TestFormattersOneIsSingular.py (2436 of 2474) PASS: lldb-api :: functionalities/target-new-solib-notifications/TestModuleLoadedNotifys.py (2437 of 2474) PASS: lldb-unit :: Symbol/./SymbolTests/TestTypeSystemClang.TestFunctionTemplateConstruction (2438 of 2474) UNSUPPORTED: lldb-api :: macosx/lc-note/addrable-bits/TestAddrableBitsCorefile.py (2439 of 2474) PASS: lldb-api :: commands/frame/var-scope/TestFrameVariableScope.py (2440 of 2474) PASS: lldb-api :: lang/cpp/exceptions/TestCPPExceptionBreakpoints.py (2441 of 2474) PASS: lldb-api :: functionalities/breakpoint/move_nearest/TestMoveNearest.py (2442 of 2474) PASS: lldb-shell :: Commands/command-thread-select.test (2443 of 2474) PASS: lldb-unit :: Utility/./UtilityTests/StreamTest.ShiftOperatorPtr (2444 of 2474) PASS: lldb-unit :: Expression/./ExpressionTests/CppModuleConfigurationTest.MissingUsrInclude (2445 of 2474) PASS: lldb-unit :: Process/gdb-remote/./ProcessGdbRemoteTests/GDBRemoteCommunicationTest.ReadPacket_checksum (2446 of 2474) PASS: lldb-shell :: SymbolFile/NativePDB/globals-fundamental.cpp (2447 of 2474) PASS: lldb-unit :: Utility/./UtilityTests/AnsiTerminal.AtStart (2448 of 2474) PASS: lldb-unit :: Utility/./UtilityTests/UserIDResolver.GetUserName (2449 of 2474) PASS: lldb-api :: lang/objc/modules-non-objc-target/TestObjCModulesNonObjCTarget.py (2450 of 2474) PASS: lldb-unit :: ScriptInterpreter/Python/./ScriptInterpreterPythonTests/PythonDataObjectsTest.TestGlobalNameResolutionWithDot (2451 of 2474) PASS: lldb-unit :: Language/Highlighting/./HighlighterTests/HighlighterTest.ClangCommas (2452 of 2474) PASS: lldb-api :: lang/c/modules/TestCModules.py (2453 of 2474) PASS: lldb-api :: functionalities/inferior-crashing/TestInferiorCrashing.py (2454 of 2474) UNSUPPORTED: lldb-shell :: Register/x86-64-gp-write.test (2455 of 2474) UNSUPPORTED: lldb-shell :: SymbolFile/PDB/udt-layout.test (2456 of 2474) UNSUPPORTED: lldb-api :: functionalities/breakpoint/breakpoint_in_delayslot/TestAvoidBreakpointInDelaySlot.py (2457 of 2474) PASS: lldb-unit :: Platform/./LLDBPlatformTests/PlatformDarwinTest.GetCompatibleArchARMv7s (2458 of 2474) PASS: lldb-unit :: Process/gdb-remote/./ProcessGdbRemoteTests/GDBRemoteClientBaseTest.SendPacketAndReceiveResponseWithOutputSupport (2459 of 2474) PASS: lldb-unit :: Process/Utility/./ProcessUtilityTests/ProcSMapTests/LinuxProcSMapsTestFixture.ParseSMapRegions/2 (2460 of 2474) PASS: lldb-unit :: Expression/./ExpressionTests/CppModuleConfigurationTest.LibCppV2 (2461 of 2474) PASS: lldb-api :: lang/cpp/static_member_type_depending_on_parent_size/TestStaticMemberTypeDependingOnParentSize.py (2462 of 2474) PASS: lldb-api :: macosx/save_crashlog/TestSaveCrashlog.py (2463 of 2474) PASS: lldb-unit :: Utility/./UtilityTests/DataExtractorTest.GetCStrEmpty (2464 of 2474) PASS: lldb-api :: lang/objc/foundation/TestConstStrings.py (2465 of 2474) UNSUPPORTED: lldb-api :: benchmarks/expression/TestRepeatedExprs.py (2466 of 2474) PASS: lldb-api :: lang/objc/direct-dispatch-step/TestObjCDirectDispatchStepping.py (2467 of 2474) PASS: lldb-api :: commands/expression/import-std-module/stack/TestStackFromStdModule.py (2468 of 2474) PASS: lldb-api :: lang/cpp/thread_local/TestThreadLocal.py (2469 of 2474) PASS: lldb-unit :: Utility/./UtilityTests/StringListTest.GetMaxStringLengthEqualSize (2470 of 2474) PASS: lldb-shell :: SymbolFile/DWARF/x86/DW_TAG_variable-DW_AT_const_value.s (2471 of 2474) PASS: lldb-api :: functionalities/data-formatter/data-formatter-objc/TestDataFormatterObjCKVO.py (2472 of 2474) PASS: lldb-api :: functionalities/limit-debug-info/TestLimitDebugInfo.py (2473 of 2474) PASS: lldb-api :: commands/expression/import-std-module/vector/TestVectorFromStdModule.py (2474 of 2474) Slowest Tests: -------------------------------------------------------------------------- 267.71s: lldb-api :: tools/lldb-server/TestLldbGdbServer.py 196.11s: lldb-api :: functionalities/scripted_process/TestScriptedProcess.py 174.10s: lldb-api :: functionalities/memory-region/TestMemoryRegion.py 146.42s: lldb-api :: macosx/stack-corefile/TestStackCorefile.py 144.24s: lldb-api :: macosx/skinny-corefile/TestSkinnyCorefile.py 139.38s: lldb-api :: api/multithreaded/TestMultithreaded.py 91.33s: lldb-api :: functionalities/gdb_remote_client/TestWasm.py 88.88s: lldb-api :: types/TestLongTypesExpr.py 72.51s: lldb-api :: lang/objc/exceptions/TestObjCExceptions.py 70.58s: lldb-api :: commands/process/attach/TestProcessAttach.py 70.26s: lldb-api :: commands/expression/import-std-module/stack/TestStackFromStdModule.py 68.66s: lldb-api :: lang/cpp/namespace/TestNamespaceLookup.py 68.22s: lldb-api :: commands/expression/import-std-module/vector/TestVectorFromStdModule.py 66.69s: lldb-api :: lang/objc/hidden-ivars/TestHiddenIvars.py 65.93s: lldb-api :: commands/expression/import-std-module/queue/TestQueueFromStdModule.py 62.85s: lldb-api :: lang/objc/objc-new-syntax/TestObjCNewSyntaxLiteral.py 58.80s: lldb-api :: lang/objc/foundation/TestObjCMethods.py 56.45s: lldb-api :: types/TestIntegerTypeExpr.py 50.67s: lldb-api :: tools/lldb-server/TestGdbRemoteThreadsInStopReply.py 50.61s: lldb-api :: commands/expression/import-std-module/vector-of-vectors/TestVectorOfVectorsFromStdModule.py

Hide Details

Tests Times: -------------------------------------------------------------------------- [ Range ] :: [ Percentage ] :: [ Count ] -------------------------------------------------------------------------- [260s,280s) :: [ ] :: [ 1/2474] [240s,260s) :: [ ] :: [ 0/2474] [220s,240s) :: [ ] :: [ 0/2474] [200s,220s) :: [ ] :: [ 1/2474] [180s,200s) :: [ ] :: [ 1/2474] [160s,180s) :: [ ] :: [ 0/2474] [140s,160s) :: [ ] :: [ 3/2474] [120s,140s) :: [ ] :: [ 0/2474] [100s,120s) :: [ ] :: [ 0/2474] [ 80s,100s) :: [ ] :: [ 2/2474] [ 60s, 80s) :: [ ] :: [ 9/2474] [ 40s, 60s) :: [ ] :: [ 17/2474] [ 20s, 40s) :: [* ] :: [ 80/2474] [ 0s, 20s) :: [************************************** ] :: [2360/2474] -------------------------------------------------------------------------- ******************** Failed Tests (1): lldb-api :: functionalities/scripted_process/TestScriptedProcess.py

Hide Details

Hide Details

Testing Time: 2691.03s Unsupported : 232 Passed : 2231 Expectedly Failed: 10 Failed : 1 FAILED: tools/lldb/test/CMakeFiles/check-lldb cd /Users/buildslave/jenkins/workspace/lldb-cmake-sanitized/lldb-build/tools/lldb/test && /usr/local/Frameworks/Python.framework/Versions/3.7/bin/python3.7 /Users/buildslave/jenkins/workspace/lldb-cmake-sanitized/lldb-build/./bin/llvm-lit -v --time-tests --shuffle --xunit-xml-output=/Users/buildslave/jenkins/workspace/lldb-cmake-sanitized/test/results.xml -v -j 4 --timeout 1200 /Users/buildslave/jenkins/workspace/lldb-cmake-sanitized/lldb-build/tools/lldb/test ninja: build stopped: subcommand failed. Command failed: Command '['/usr/bin/env', 'TERM=vt100', '/usr/local/bin/ninja', '-v', 'check-lldb']' returned non-zero exit status 1. Command: ['/usr/bin/env', 'TERM=vt100', '/usr/local/bin/ninja', '-v', 'check-lldb'] [Pipeline] } [Pipeline] // timeout [Pipeline] } [Pipeline] // stage [Pipeline] stage [Pipeline] { (Declarative: Post Actions) [Pipeline] scanForIssues [Clang] Sleeping for 5 seconds due to JENKINS-32191... [Clang] Parsing console log (workspace: '/Users/buildslave/jenkins/workspace/lldb-cmake-sanitized') [Clang] -> found 0 issues (skipped 0 duplicates) [Clang] Parsing console log (workspace: '/Users/buildslave/jenkins/workspace/lldb-cmake-sanitized') [Clang] -> found 0 issues (skipped 0 duplicates) [Clang] Successfully parsed console log [Clang] -> found 0 issues (skipped 0 duplicates) [Clang] Parsing console log (workspace: '/Users/buildslave/jenkins/workspace/lldb-cmake-sanitized') [Clang] Skipping post processing [Clang] No filter has been set, publishing all 0 issues [Clang] Repository miner is not configured, skipping repository mining [Pipeline] junit Recording test results [Checks API] No suitable checks publisher found. [Pipeline] } [Pipeline] // stage [Pipeline] } [Pipeline] // withEnv [Pipeline] } [Pipeline] // node [Pipeline] End of Pipeline ERROR: script returned exit code 1 Finished: FAILURE