Console Output

Skipping 4,959 KB.. Full Log
"/Users/buildslave/jenkins/workspace/lldb-cmake-sanitized/host-compiler/bin/clang"  main.o -g -O0 -fno-builtin -isysroot "/Applications/Xcode.app/Contents/Developer/Platforms/MacOSX.platform/Developer/SDKs/MacOSX10.15.sdk" -arch x86_64  -I/Users/buildslave/jenkins/workspace/lldb-cmake-sanitized/llvm-project/lldb/packages/Python/lldbsuite/test/make/../../../../../include -I/Users/buildslave/jenkins/workspace/lldb-cmake-sanitized/llvm-project/lldb/test/API/python_api/value/empty_class -I/Users/buildslave/jenkins/workspace/lldb-cmake-sanitized/llvm-project/lldb/packages/Python/lldbsuite/test/make -include /Users/buildslave/jenkins/workspace/lldb-cmake-sanitized/llvm-project/lldb/packages/Python/lldbsuite/test/make/test_common.h  -fno-limit-debug-info  -fmodules -gmodules -fmodules-cache-path=/Users/buildslave/jenkins/workspace/lldb-cmake-sanitized/lldb-build/lldb-test-build.noindex/module-cache-clang/lldb-api -gmodules -fcxx-modules    --driver-mode=g++ -o "a.out"
codesign -s - "a.out"

Hide Details

Hide Details

FAIL: LLDB (/Users/buildslave/jenkins/workspace/lldb-cmake-sanitized/host-compiler/bin/clang-x86_64) :: test_gmodules (TestValueAPIEmptyClass.ValueAPIEmptyClassTestCase) <bound method SBProcess.Kill of <lldb.SBProcess; proxy of <Swig Object of type 'lldb::SBProcess *' at 0x10a2137b0> >>: success

Hide Details

Restore dir to: /Users/buildslave/jenkins/workspace/lldb-cmake-sanitized/lldb-build/tools/lldb/test ====================================================================== FAIL: test_dsym (TestValueAPIEmptyClass.ValueAPIEmptyClassTestCase) ---------------------------------------------------------------------- Traceback (most recent call last): File "/Users/buildslave/jenkins/workspace/lldb-cmake-sanitized/llvm-project/lldb/packages/Python/lldbsuite/test/lldbtest.py", line 1715, in test_method return attrvalue(self) File "/Users/buildslave/jenkins/workspace/lldb-cmake-sanitized/llvm-project/lldb/test/API/python_api/value/empty_class/TestValueAPIEmptyClass.py", line 30, in test self.assertEquals(process.GetState(), lldb.eStateStopped) AssertionError: 10 != 5 Config=x86_64-/Users/buildslave/jenkins/workspace/lldb-cmake-sanitized/host-compiler/bin/clang ====================================================================== FAIL: test_dwarf (TestValueAPIEmptyClass.ValueAPIEmptyClassTestCase) ---------------------------------------------------------------------- Traceback (most recent call last): File "/Users/buildslave/jenkins/workspace/lldb-cmake-sanitized/llvm-project/lldb/packages/Python/lldbsuite/test/lldbtest.py", line 1715, in test_method return attrvalue(self) File "/Users/buildslave/jenkins/workspace/lldb-cmake-sanitized/llvm-project/lldb/test/API/python_api/value/empty_class/TestValueAPIEmptyClass.py", line 30, in test self.assertEquals(process.GetState(), lldb.eStateStopped) AssertionError: 10 != 5 Config=x86_64-/Users/buildslave/jenkins/workspace/lldb-cmake-sanitized/host-compiler/bin/clang ====================================================================== FAIL: test_gmodules (TestValueAPIEmptyClass.ValueAPIEmptyClassTestCase) ---------------------------------------------------------------------- Traceback (most recent call last): File "/Users/buildslave/jenkins/workspace/lldb-cmake-sanitized/llvm-project/lldb/packages/Python/lldbsuite/test/lldbtest.py", line 1715, in test_method return attrvalue(self) File "/Users/buildslave/jenkins/workspace/lldb-cmake-sanitized/llvm-project/lldb/test/API/python_api/value/empty_class/TestValueAPIEmptyClass.py", line 30, in test self.assertEquals(process.GetState(), lldb.eStateStopped) AssertionError: 10 != 5 Config=x86_64-/Users/buildslave/jenkins/workspace/lldb-cmake-sanitized/host-compiler/bin/clang ---------------------------------------------------------------------- Ran 4 tests in 91.920s

Hide Details

RESULT: FAILED (0 passes, 3 failures, 0 errors, 1 skipped, 0 expected failures, 0 unexpected successes)

Hide Details

--

Hide Details

******************** FAIL: lldb-api :: lang/c/stepping/TestStepAndBreakpoints.py (1608 of 2474) ******************** TEST 'lldb-api :: lang/c/stepping/TestStepAndBreakpoints.py' FAILED ******************** Script: -- /Users/buildslave/jenkins/workspace/lldb-cmake-sanitized/lldb-build/lldb-test-build.noindex/copied-python /Users/buildslave/jenkins/workspace/lldb-cmake-sanitized/llvm-project/lldb/test/API/dotest.py -u CXXFLAGS -u CFLAGS --codesign-identity lldb_codesign --arch x86_64 --build-dir /Users/buildslave/jenkins/workspace/lldb-cmake-sanitized/lldb-build/lldb-test-build.noindex -t --env TERM=vt100 --env LLVM_LIBS_DIR=/Users/buildslave/jenkins/workspace/lldb-cmake-sanitized/lldb-build/./lib --inferior-env ASAN_OPTIONS=detect_stack_use_after_return=1 --inferior-env DYLD_INSERT_LIBRARIES=/Users/buildslave/jenkins/workspace/lldb-cmake-sanitized/host-compiler/lib/clang/14.0.99/lib/darwin/libclang_rt.asan_osx_dynamic.dylib --arch x86_64 --build-dir /Users/buildslave/jenkins/workspace/lldb-cmake-sanitized/lldb-build/lldb-test-build.noindex --lldb-module-cache-dir /Users/buildslave/jenkins/workspace/lldb-cmake-sanitized/lldb-build/lldb-test-build.noindex/module-cache-lldb/lldb-api --clang-module-cache-dir /Users/buildslave/jenkins/workspace/lldb-cmake-sanitized/lldb-build/lldb-test-build.noindex/module-cache-clang/lldb-api --executable /Users/buildslave/jenkins/workspace/lldb-cmake-sanitized/lldb-build/./bin/lldb --compiler /Users/buildslave/jenkins/workspace/lldb-cmake-sanitized/host-compiler/bin/clang --dsymutil /Users/buildslave/jenkins/workspace/lldb-cmake-sanitized/lldb-build/./bin/dsymutil --llvm-tools-dir /Users/buildslave/jenkins/workspace/lldb-cmake-sanitized/lldb-build/./bin --lldb-libs-dir /Users/buildslave/jenkins/workspace/lldb-cmake-sanitized/lldb-build/./lib /Users/buildslave/jenkins/workspace/lldb-cmake-sanitized/llvm-project/lldb/test/API/lang/c/stepping -p TestStepAndBreakpoints.py -- Exit Code: 1

Hide Details

Command Output (stdout): -- lldb version 14.0.99 (http://labmaster3.local/git/llvm-project.git revision 7eec832def5717b1bddb72c3b99c3df4f7a2f6da) clang revision 7eec832def5717b1bddb72c3b99c3df4f7a2f6da llvm revision 7eec832def5717b1bddb72c3b99c3df4f7a2f6da Skipping the following test categories: ['libstdcxx', 'dwo', 'llgs', 'fork']

Hide Details

-- Command Output (stderr): -- Change dir to: /Users/buildslave/jenkins/workspace/lldb-cmake-sanitized/llvm-project/lldb/test/API/lang/c/stepping runCmd: settings clear -all output:

Hide Details

runCmd: settings set symbols.enable-external-lookup false output:

Hide Details

runCmd: settings set target.inherit-tcc true output:

Hide Details

runCmd: settings set target.detach-on-error false output:

Hide Details

runCmd: settings set target.auto-apply-fixits false output:

Hide Details

runCmd: settings set plugin.process.gdb-remote.packet-timeout 60 output:

Hide Details

runCmd: settings set symbols.clang-modules-cache-path "/Users/buildslave/jenkins/workspace/lldb-cmake-sanitized/lldb-build/lldb-test-build.noindex/module-cache-lldb/lldb-api" output:

Hide Details

runCmd: settings set use-color false output:

Hide Details

runCmd: setting set target.prefer-dynamic-value no-dynamic-values output:

Hide Details

runCmd: settings set target.env-vars ASAN_OPTIONS=detect_stack_use_after_return=1 DYLD_INSERT_LIBRARIES=/Users/buildslave/jenkins/workspace/lldb-cmake-sanitized/host-compiler/lib/clang/14.0.99/lib/darwin/libclang_rt.asan_osx_dynamic.dylib output:

Hide Details

make VPATH=/Users/buildslave/jenkins/workspace/lldb-cmake-sanitized/llvm-project/lldb/test/API/lang/c/stepping -C /Users/buildslave/jenkins/workspace/lldb-cmake-sanitized/lldb-build/lldb-test-build.noindex/lang/c/stepping/TestStepAndBreakpoints.test_and_python_api_dsym -I /Users/buildslave/jenkins/workspace/lldb-cmake-sanitized/llvm-project/lldb/test/API/lang/c/stepping -I /Users/buildslave/jenkins/workspace/lldb-cmake-sanitized/llvm-project/lldb/packages/Python/lldbsuite/test/make -f /Users/buildslave/jenkins/workspace/lldb-cmake-sanitized/llvm-project/lldb/test/API/lang/c/stepping/Makefile MAKE_DSYM=YES all ARCH=x86_64 'CC="/Users/buildslave/jenkins/workspace/lldb-cmake-sanitized/host-compiler/bin/clang"' DSYMUTIL=/Users/buildslave/jenkins/workspace/lldb-cmake-sanitized/lldb-build/./bin/dsymutil CODESIGN=codesign CLANG_MODULE_CACHE_DIR=/Users/buildslave/jenkins/workspace/lldb-cmake-sanitized/lldb-build/lldb-test-build.noindex/module-cache-clang/lldb-api

Hide Details

"/Users/buildslave/jenkins/workspace/lldb-cmake-sanitized/host-compiler/bin/clang" -g -O0 -fno-builtin -isysroot "/Applications/Xcode.app/Contents/Developer/Platforms/MacOSX.platform/Developer/SDKs/MacOSX10.15.sdk" -arch x86_64 -I/Users/buildslave/jenkins/workspace/lldb-cmake-sanitized/llvm-project/lldb/packages/Python/lldbsuite/test/make/../../../../../include -I/Users/buildslave/jenkins/workspace/lldb-cmake-sanitized/llvm-project/lldb/test/API/lang/c/stepping -I/Users/buildslave/jenkins/workspace/lldb-cmake-sanitized/llvm-project/lldb/packages/Python/lldbsuite/test/make -include /Users/buildslave/jenkins/workspace/lldb-cmake-sanitized/llvm-project/lldb/packages/Python/lldbsuite/test/make/test_common.h -fno-limit-debug-info -MT main.o -MD -MP -MF main.d -c -o main.o /Users/buildslave/jenkins/workspace/lldb-cmake-sanitized/llvm-project/lldb/test/API/lang/c/stepping/main.c "/Users/buildslave/jenkins/workspace/lldb-cmake-sanitized/host-compiler/bin/clang" main.o -g -O0 -fno-builtin -isysroot "/Applications/Xcode.app/Contents/Developer/Platforms/MacOSX.platform/Developer/SDKs/MacOSX10.15.sdk" -arch x86_64 -I/Users/buildslave/jenkins/workspace/lldb-cmake-sanitized/llvm-project/lldb/packages/Python/lldbsuite/test/make/../../../../../include -I/Users/buildslave/jenkins/workspace/lldb-cmake-sanitized/llvm-project/lldb/test/API/lang/c/stepping -I/Users/buildslave/jenkins/workspace/lldb-cmake-sanitized/llvm-project/lldb/packages/Python/lldbsuite/test/make -include /Users/buildslave/jenkins/workspace/lldb-cmake-sanitized/llvm-project/lldb/packages/Python/lldbsuite/test/make/test_common.h -fno-limit-debug-info --driver-mode=g++ -o "a.out" codesign -s - "a.out" "/Users/buildslave/jenkins/workspace/lldb-cmake-sanitized/lldb-build/./bin/dsymutil" -o "a.out.dSYM" "a.out"

Hide Details

Hide Details

FAIL: LLDB (/Users/buildslave/jenkins/workspace/lldb-cmake-sanitized/host-compiler/bin/clang-x86_64) :: test_and_python_api_dsym (TestStepAndBreakpoints.TestCStepping) <bound method SBProcess.Kill of <lldb.SBProcess; proxy of <Swig Object of type 'lldb::SBProcess *' at 0x1213594b0> >>: success

Hide Details

runCmd: settings clear -all output:

Hide Details

runCmd: settings set symbols.enable-external-lookup false output:

Hide Details

runCmd: settings set target.inherit-tcc true output:

Hide Details

runCmd: settings set target.detach-on-error false output:

Hide Details

runCmd: settings set target.auto-apply-fixits false output:

Hide Details

runCmd: settings set plugin.process.gdb-remote.packet-timeout 60 output:

Hide Details

runCmd: settings set symbols.clang-modules-cache-path "/Users/buildslave/jenkins/workspace/lldb-cmake-sanitized/lldb-build/lldb-test-build.noindex/module-cache-lldb/lldb-api" output:

Hide Details

runCmd: settings set use-color false output:

Hide Details

runCmd: setting set target.prefer-dynamic-value no-dynamic-values output:

Hide Details

runCmd: settings set target.env-vars ASAN_OPTIONS=detect_stack_use_after_return=1 DYLD_INSERT_LIBRARIES=/Users/buildslave/jenkins/workspace/lldb-cmake-sanitized/host-compiler/lib/clang/14.0.99/lib/darwin/libclang_rt.asan_osx_dynamic.dylib output:

Hide Details

make VPATH=/Users/buildslave/jenkins/workspace/lldb-cmake-sanitized/llvm-project/lldb/test/API/lang/c/stepping -C /Users/buildslave/jenkins/workspace/lldb-cmake-sanitized/lldb-build/lldb-test-build.noindex/lang/c/stepping/TestStepAndBreakpoints.test_and_python_api_dwarf -I /Users/buildslave/jenkins/workspace/lldb-cmake-sanitized/llvm-project/lldb/test/API/lang/c/stepping -I /Users/buildslave/jenkins/workspace/lldb-cmake-sanitized/llvm-project/lldb/packages/Python/lldbsuite/test/make -f /Users/buildslave/jenkins/workspace/lldb-cmake-sanitized/llvm-project/lldb/test/API/lang/c/stepping/Makefile MAKE_DSYM=NO all ARCH=x86_64 'CC="/Users/buildslave/jenkins/workspace/lldb-cmake-sanitized/host-compiler/bin/clang"' DSYMUTIL=/Users/buildslave/jenkins/workspace/lldb-cmake-sanitized/lldb-build/./bin/dsymutil CODESIGN=codesign CLANG_MODULE_CACHE_DIR=/Users/buildslave/jenkins/workspace/lldb-cmake-sanitized/lldb-build/lldb-test-build.noindex/module-cache-clang/lldb-api

Hide Details

"/Users/buildslave/jenkins/workspace/lldb-cmake-sanitized/host-compiler/bin/clang" -g -O0 -fno-builtin -isysroot "/Applications/Xcode.app/Contents/Developer/Platforms/MacOSX.platform/Developer/SDKs/MacOSX10.15.sdk" -arch x86_64 -I/Users/buildslave/jenkins/workspace/lldb-cmake-sanitized/llvm-project/lldb/packages/Python/lldbsuite/test/make/../../../../../include -I/Users/buildslave/jenkins/workspace/lldb-cmake-sanitized/llvm-project/lldb/test/API/lang/c/stepping -I/Users/buildslave/jenkins/workspace/lldb-cmake-sanitized/llvm-project/lldb/packages/Python/lldbsuite/test/make -include /Users/buildslave/jenkins/workspace/lldb-cmake-sanitized/llvm-project/lldb/packages/Python/lldbsuite/test/make/test_common.h -fno-limit-debug-info -MT main.o -MD -MP -MF main.d -c -o main.o /Users/buildslave/jenkins/workspace/lldb-cmake-sanitized/llvm-project/lldb/test/API/lang/c/stepping/main.c "/Users/buildslave/jenkins/workspace/lldb-cmake-sanitized/host-compiler/bin/clang" main.o -g -O0 -fno-builtin -isysroot "/Applications/Xcode.app/Contents/Developer/Platforms/MacOSX.platform/Developer/SDKs/MacOSX10.15.sdk" -arch x86_64 -I/Users/buildslave/jenkins/workspace/lldb-cmake-sanitized/llvm-project/lldb/packages/Python/lldbsuite/test/make/../../../../../include -I/Users/buildslave/jenkins/workspace/lldb-cmake-sanitized/llvm-project/lldb/test/API/lang/c/stepping -I/Users/buildslave/jenkins/workspace/lldb-cmake-sanitized/llvm-project/lldb/packages/Python/lldbsuite/test/make -include /Users/buildslave/jenkins/workspace/lldb-cmake-sanitized/llvm-project/lldb/packages/Python/lldbsuite/test/make/test_common.h -fno-limit-debug-info --driver-mode=g++ -o "a.out" codesign -s - "a.out"

Hide Details

Hide Details

FAIL: LLDB (/Users/buildslave/jenkins/workspace/lldb-cmake-sanitized/host-compiler/bin/clang-x86_64) :: test_and_python_api_dwarf (TestStepAndBreakpoints.TestCStepping) <bound method SBProcess.Kill of <lldb.SBProcess; proxy of <Swig Object of type 'lldb::SBProcess *' at 0x10993ac60> >>: success

Hide Details

UNSUPPORTED: LLDB (/Users/buildslave/jenkins/workspace/lldb-cmake-sanitized/host-compiler/bin/clang-x86_64) :: test_and_python_api_dwo (TestStepAndBreakpoints.TestCStepping) (test case does not fall in any category of interest for this run) runCmd: settings clear -all output:

Hide Details

runCmd: settings set symbols.enable-external-lookup false output:

Hide Details

runCmd: settings set target.inherit-tcc true output:

Hide Details

runCmd: settings set target.detach-on-error false output:

Hide Details

runCmd: settings set target.auto-apply-fixits false output:

Hide Details

runCmd: settings set plugin.process.gdb-remote.packet-timeout 60 output:

Hide Details

runCmd: settings set symbols.clang-modules-cache-path "/Users/buildslave/jenkins/workspace/lldb-cmake-sanitized/lldb-build/lldb-test-build.noindex/module-cache-lldb/lldb-api" output:

Hide Details

runCmd: settings set use-color false output:

Hide Details

runCmd: setting set target.prefer-dynamic-value no-dynamic-values output:

Hide Details

runCmd: settings set target.env-vars ASAN_OPTIONS=detect_stack_use_after_return=1 DYLD_INSERT_LIBRARIES=/Users/buildslave/jenkins/workspace/lldb-cmake-sanitized/host-compiler/lib/clang/14.0.99/lib/darwin/libclang_rt.asan_osx_dynamic.dylib output:

Hide Details

make VPATH=/Users/buildslave/jenkins/workspace/lldb-cmake-sanitized/llvm-project/lldb/test/API/lang/c/stepping -C /Users/buildslave/jenkins/workspace/lldb-cmake-sanitized/lldb-build/lldb-test-build.noindex/lang/c/stepping/TestStepAndBreakpoints.test_and_python_api_gmodules -I /Users/buildslave/jenkins/workspace/lldb-cmake-sanitized/llvm-project/lldb/test/API/lang/c/stepping -I /Users/buildslave/jenkins/workspace/lldb-cmake-sanitized/llvm-project/lldb/packages/Python/lldbsuite/test/make -f /Users/buildslave/jenkins/workspace/lldb-cmake-sanitized/llvm-project/lldb/test/API/lang/c/stepping/Makefile MAKE_DSYM=NO MAKE_GMODULES=YES all ARCH=x86_64 'CC="/Users/buildslave/jenkins/workspace/lldb-cmake-sanitized/host-compiler/bin/clang"' DSYMUTIL=/Users/buildslave/jenkins/workspace/lldb-cmake-sanitized/lldb-build/./bin/dsymutil CODESIGN=codesign CLANG_MODULE_CACHE_DIR=/Users/buildslave/jenkins/workspace/lldb-cmake-sanitized/lldb-build/lldb-test-build.noindex/module-cache-clang/lldb-api

Hide Details

"/Users/buildslave/jenkins/workspace/lldb-cmake-sanitized/host-compiler/bin/clang" -g -O0 -fno-builtin -isysroot "/Applications/Xcode.app/Contents/Developer/Platforms/MacOSX.platform/Developer/SDKs/MacOSX10.15.sdk" -arch x86_64 -I/Users/buildslave/jenkins/workspace/lldb-cmake-sanitized/llvm-project/lldb/packages/Python/lldbsuite/test/make/../../../../../include -I/Users/buildslave/jenkins/workspace/lldb-cmake-sanitized/llvm-project/lldb/test/API/lang/c/stepping -I/Users/buildslave/jenkins/workspace/lldb-cmake-sanitized/llvm-project/lldb/packages/Python/lldbsuite/test/make -include /Users/buildslave/jenkins/workspace/lldb-cmake-sanitized/llvm-project/lldb/packages/Python/lldbsuite/test/make/test_common.h -fno-limit-debug-info -fmodules -gmodules -fmodules-cache-path=/Users/buildslave/jenkins/workspace/lldb-cmake-sanitized/lldb-build/lldb-test-build.noindex/module-cache-clang/lldb-api -gmodules -fcxx-modules -MT main.o -MD -MP -MF main.d -c -o main.o /Users/buildslave/jenkins/workspace/lldb-cmake-sanitized/llvm-project/lldb/test/API/lang/c/stepping/main.c "/Users/buildslave/jenkins/workspace/lldb-cmake-sanitized/host-compiler/bin/clang" main.o -g -O0 -fno-builtin -isysroot "/Applications/Xcode.app/Contents/Developer/Platforms/MacOSX.platform/Developer/SDKs/MacOSX10.15.sdk" -arch x86_64 -I/Users/buildslave/jenkins/workspace/lldb-cmake-sanitized/llvm-project/lldb/packages/Python/lldbsuite/test/make/../../../../../include -I/Users/buildslave/jenkins/workspace/lldb-cmake-sanitized/llvm-project/lldb/test/API/lang/c/stepping -I/Users/buildslave/jenkins/workspace/lldb-cmake-sanitized/llvm-project/lldb/packages/Python/lldbsuite/test/make -include /Users/buildslave/jenkins/workspace/lldb-cmake-sanitized/llvm-project/lldb/packages/Python/lldbsuite/test/make/test_common.h -fno-limit-debug-info -fmodules -gmodules -fmodules-cache-path=/Users/buildslave/jenkins/workspace/lldb-cmake-sanitized/lldb-build/lldb-test-build.noindex/module-cache-clang/lldb-api -gmodules -fcxx-modules --driver-mode=g++ -o "a.out" codesign -s - "a.out"

Hide Details

Hide Details

<bound method SBProcess.Kill of <lldb.SBProcess; proxy of <Swig Object of type 'lldb::SBProcess *' at 0x10993adb0> >>: success

Hide Details

PASS: LLDB (/Users/buildslave/jenkins/workspace/lldb-cmake-sanitized/host-compiler/bin/clang-x86_64) :: test_and_python_api_gmodules (TestStepAndBreakpoints.TestCStepping) Restore dir to: /Users/buildslave/jenkins/workspace/lldb-cmake-sanitized/lldb-build/tools/lldb/test ====================================================================== FAIL: test_and_python_api_dsym (TestStepAndBreakpoints.TestCStepping) Test stepping over vrs. hitting breakpoints & subsequent stepping in various forms. ---------------------------------------------------------------------- Traceback (most recent call last): File "/Users/buildslave/jenkins/workspace/lldb-cmake-sanitized/llvm-project/lldb/packages/Python/lldbsuite/test/lldbtest.py", line 1715, in test_method return attrvalue(self) File "/Users/buildslave/jenkins/workspace/lldb-cmake-sanitized/llvm-project/lldb/packages/Python/lldbsuite/test/decorators.py", line 119, in wrapper func(*args, **kwargs) File "/Users/buildslave/jenkins/workspace/lldb-cmake-sanitized/llvm-project/lldb/packages/Python/lldbsuite/test/decorators.py", line 119, in wrapper func(*args, **kwargs) File "/Users/buildslave/jenkins/workspace/lldb-cmake-sanitized/llvm-project/lldb/packages/Python/lldbsuite/test/decorators.py", line 119, in wrapper func(*args, **kwargs) File "/Users/buildslave/jenkins/workspace/lldb-cmake-sanitized/llvm-project/lldb/test/API/lang/c/stepping/TestStepAndBreakpoints.py", line 70, in test_and_python_api self.fail("Failed to stop at first breakpoint in main.") AssertionError: Failed to stop at first breakpoint in main. Config=x86_64-/Users/buildslave/jenkins/workspace/lldb-cmake-sanitized/host-compiler/bin/clang ====================================================================== FAIL: test_and_python_api_dwarf (TestStepAndBreakpoints.TestCStepping) Test stepping over vrs. hitting breakpoints & subsequent stepping in various forms. ---------------------------------------------------------------------- Traceback (most recent call last): File "/Users/buildslave/jenkins/workspace/lldb-cmake-sanitized/llvm-project/lldb/packages/Python/lldbsuite/test/lldbtest.py", line 1715, in test_method return attrvalue(self) File "/Users/buildslave/jenkins/workspace/lldb-cmake-sanitized/llvm-project/lldb/packages/Python/lldbsuite/test/decorators.py", line 119, in wrapper func(*args, **kwargs) File "/Users/buildslave/jenkins/workspace/lldb-cmake-sanitized/llvm-project/lldb/packages/Python/lldbsuite/test/decorators.py", line 119, in wrapper func(*args, **kwargs) File "/Users/buildslave/jenkins/workspace/lldb-cmake-sanitized/llvm-project/lldb/packages/Python/lldbsuite/test/decorators.py", line 119, in wrapper func(*args, **kwargs) File "/Users/buildslave/jenkins/workspace/lldb-cmake-sanitized/llvm-project/lldb/test/API/lang/c/stepping/TestStepAndBreakpoints.py", line 70, in test_and_python_api self.fail("Failed to stop at first breakpoint in main.") AssertionError: Failed to stop at first breakpoint in main. Config=x86_64-/Users/buildslave/jenkins/workspace/lldb-cmake-sanitized/host-compiler/bin/clang ---------------------------------------------------------------------- Ran 4 tests in 85.484s

Hide Details

RESULT: FAILED (1 passes, 2 failures, 0 errors, 1 skipped, 0 expected failures, 0 unexpected successes)

Hide Details

--

Hide Details

******************** PASS: lldb-api :: functionalities/data-formatter/frameformat_smallstruct/TestFrameFormatSmallStruct.py (1609 of 2474) PASS: lldb-unit :: Utility/./UtilityTests/ArgsTest.TestSingleArg (1610 of 2474) PASS: lldb-shell :: Commands/command-stop-hook-output.test (1611 of 2474) UNSUPPORTED: lldb-shell :: SymbolFile/PDB/variables-locations.test (1612 of 2474) PASS: lldb-unit :: Process/minidump/./LLDBMinidumpTests/MinidumpParserTest.GetMemoryRegionInfo (1613 of 2474) PASS: lldb-unit :: Target/./TargetTests/DynamicRegisterInfoRegisterTest.addSupplementaryRegister (1614 of 2474) UNSUPPORTED: lldb-shell :: Subprocess/vfork-follow-child-softbp.test (1615 of 2474) PASS: lldb-unit :: Interpreter/./InterpreterTests/OptionValueArgs.DeepCopy (1616 of 2474) PASS: lldb-unit :: Process/gdb-remote/./ProcessGdbRemoteTests/PortMapTest.FreePort (1617 of 2474) PASS: lldb-unit :: SymbolFile/DWARF/./SymbolFileDWARFTests/SymbolFileDWARFTests.TestAbbrevNullAttrValidForm (1618 of 2474) PASS: lldb-shell :: SymbolFile/DWARF/x86/debug_loc_and_loclists.s (1619 of 2474) PASS: lldb-unit :: ScriptInterpreter/Python/./ScriptInterpreterPythonTests/PythonDataObjectsTest.TestPythonStringToStr (1620 of 2474) PASS: lldb-api :: commands/platform/process/list/TestProcessList.py (1621 of 2474) FAIL: lldb-api :: lang/objc/objc-property/TestObjCProperty.py (1622 of 2474) ******************** TEST 'lldb-api :: lang/objc/objc-property/TestObjCProperty.py' FAILED ******************** Script: -- /Users/buildslave/jenkins/workspace/lldb-cmake-sanitized/lldb-build/lldb-test-build.noindex/copied-python /Users/buildslave/jenkins/workspace/lldb-cmake-sanitized/llvm-project/lldb/test/API/dotest.py -u CXXFLAGS -u CFLAGS --codesign-identity lldb_codesign --arch x86_64 --build-dir /Users/buildslave/jenkins/workspace/lldb-cmake-sanitized/lldb-build/lldb-test-build.noindex -t --env TERM=vt100 --env LLVM_LIBS_DIR=/Users/buildslave/jenkins/workspace/lldb-cmake-sanitized/lldb-build/./lib --inferior-env ASAN_OPTIONS=detect_stack_use_after_return=1 --inferior-env DYLD_INSERT_LIBRARIES=/Users/buildslave/jenkins/workspace/lldb-cmake-sanitized/host-compiler/lib/clang/14.0.99/lib/darwin/libclang_rt.asan_osx_dynamic.dylib --arch x86_64 --build-dir /Users/buildslave/jenkins/workspace/lldb-cmake-sanitized/lldb-build/lldb-test-build.noindex --lldb-module-cache-dir /Users/buildslave/jenkins/workspace/lldb-cmake-sanitized/lldb-build/lldb-test-build.noindex/module-cache-lldb/lldb-api --clang-module-cache-dir /Users/buildslave/jenkins/workspace/lldb-cmake-sanitized/lldb-build/lldb-test-build.noindex/module-cache-clang/lldb-api --executable /Users/buildslave/jenkins/workspace/lldb-cmake-sanitized/lldb-build/./bin/lldb --compiler /Users/buildslave/jenkins/workspace/lldb-cmake-sanitized/host-compiler/bin/clang --dsymutil /Users/buildslave/jenkins/workspace/lldb-cmake-sanitized/lldb-build/./bin/dsymutil --llvm-tools-dir /Users/buildslave/jenkins/workspace/lldb-cmake-sanitized/lldb-build/./bin --lldb-libs-dir /Users/buildslave/jenkins/workspace/lldb-cmake-sanitized/lldb-build/./lib /Users/buildslave/jenkins/workspace/lldb-cmake-sanitized/llvm-project/lldb/test/API/lang/objc/objc-property -p TestObjCProperty.py -- Exit Code: 1

Hide Details

Command Output (stdout): -- lldb version 14.0.99 (http://labmaster3.local/git/llvm-project.git revision 7eec832def5717b1bddb72c3b99c3df4f7a2f6da) clang revision 7eec832def5717b1bddb72c3b99c3df4f7a2f6da llvm revision 7eec832def5717b1bddb72c3b99c3df4f7a2f6da Skipping the following test categories: ['libstdcxx', 'dwo', 'llgs', 'fork']

Hide Details

-- Command Output (stderr): -- Change dir to: /Users/buildslave/jenkins/workspace/lldb-cmake-sanitized/llvm-project/lldb/test/API/lang/objc/objc-property runCmd: settings clear -all output:

Hide Details

runCmd: settings set symbols.enable-external-lookup false output:

Hide Details

runCmd: settings set target.inherit-tcc true output:

Hide Details

runCmd: settings set target.detach-on-error false output:

Hide Details

runCmd: settings set target.auto-apply-fixits false output:

Hide Details

runCmd: settings set plugin.process.gdb-remote.packet-timeout 60 output:

Hide Details

runCmd: settings set symbols.clang-modules-cache-path "/Users/buildslave/jenkins/workspace/lldb-cmake-sanitized/lldb-build/lldb-test-build.noindex/module-cache-lldb/lldb-api" output:

Hide Details

runCmd: settings set use-color false output:

Hide Details

runCmd: setting set target.prefer-dynamic-value no-dynamic-values output:

Hide Details

runCmd: settings set target.env-vars ASAN_OPTIONS=detect_stack_use_after_return=1 DYLD_INSERT_LIBRARIES=/Users/buildslave/jenkins/workspace/lldb-cmake-sanitized/host-compiler/lib/clang/14.0.99/lib/darwin/libclang_rt.asan_osx_dynamic.dylib output:

Hide Details

make VPATH=/Users/buildslave/jenkins/workspace/lldb-cmake-sanitized/llvm-project/lldb/test/API/lang/objc/objc-property -C /Users/buildslave/jenkins/workspace/lldb-cmake-sanitized/lldb-build/lldb-test-build.noindex/lang/objc/objc-property/TestObjCProperty.test_objc_properties_dsym -I /Users/buildslave/jenkins/workspace/lldb-cmake-sanitized/llvm-project/lldb/test/API/lang/objc/objc-property -I /Users/buildslave/jenkins/workspace/lldb-cmake-sanitized/llvm-project/lldb/packages/Python/lldbsuite/test/make -f /Users/buildslave/jenkins/workspace/lldb-cmake-sanitized/llvm-project/lldb/test/API/lang/objc/objc-property/Makefile MAKE_DSYM=YES all ARCH=x86_64 'CC="/Users/buildslave/jenkins/workspace/lldb-cmake-sanitized/host-compiler/bin/clang"' DSYMUTIL=/Users/buildslave/jenkins/workspace/lldb-cmake-sanitized/lldb-build/./bin/dsymutil CODESIGN=codesign CLANG_MODULE_CACHE_DIR=/Users/buildslave/jenkins/workspace/lldb-cmake-sanitized/lldb-build/lldb-test-build.noindex/module-cache-clang/lldb-api

Hide Details

"/Users/buildslave/jenkins/workspace/lldb-cmake-sanitized/host-compiler/bin/clang" -g -O0 -fno-builtin -isysroot "/Applications/Xcode.app/Contents/Developer/Platforms/MacOSX.platform/Developer/SDKs/MacOSX10.15.sdk" -arch x86_64 -I/Users/buildslave/jenkins/workspace/lldb-cmake-sanitized/llvm-project/lldb/packages/Python/lldbsuite/test/make/../../../../../include -I/Users/buildslave/jenkins/workspace/lldb-cmake-sanitized/llvm-project/lldb/test/API/lang/objc/objc-property -I/Users/buildslave/jenkins/workspace/lldb-cmake-sanitized/llvm-project/lldb/packages/Python/lldbsuite/test/make -include /Users/buildslave/jenkins/workspace/lldb-cmake-sanitized/llvm-project/lldb/packages/Python/lldbsuite/test/make/test_common.h -fno-limit-debug-info -MT main.o -MD -MP -MF main.d -c -o main.o /Users/buildslave/jenkins/workspace/lldb-cmake-sanitized/llvm-project/lldb/test/API/lang/objc/objc-property/main.m "/Users/buildslave/jenkins/workspace/lldb-cmake-sanitized/host-compiler/bin/clang" main.o -g -O0 -fno-builtin -isysroot "/Applications/Xcode.app/Contents/Developer/Platforms/MacOSX.platform/Developer/SDKs/MacOSX10.15.sdk" -arch x86_64 -I/Users/buildslave/jenkins/workspace/lldb-cmake-sanitized/llvm-project/lldb/packages/Python/lldbsuite/test/make/../../../../../include -I/Users/buildslave/jenkins/workspace/lldb-cmake-sanitized/llvm-project/lldb/test/API/lang/objc/objc-property -I/Users/buildslave/jenkins/workspace/lldb-cmake-sanitized/llvm-project/lldb/packages/Python/lldbsuite/test/make -include /Users/buildslave/jenkins/workspace/lldb-cmake-sanitized/llvm-project/lldb/packages/Python/lldbsuite/test/make/test_common.h -fno-limit-debug-info -lobjc -framework Foundation -lobjc --driver-mode=g++ -o "a.out" codesign -s - "a.out" "/Users/buildslave/jenkins/workspace/lldb-cmake-sanitized/lldb-build/./bin/dsymutil" -o "a.out.dSYM" "a.out"

Hide Details

Hide Details

FAIL: LLDB (/Users/buildslave/jenkins/workspace/lldb-cmake-sanitized/host-compiler/bin/clang-x86_64) :: test_objc_properties_dsym (TestObjCProperty.ObjCPropertyTestCase) <bound method SBProcess.Kill of <lldb.SBProcess; proxy of <Swig Object of type 'lldb::SBProcess *' at 0x129c18360> >>: success

Hide Details

runCmd: settings clear -all output:

Hide Details

runCmd: settings set symbols.enable-external-lookup false output:

Hide Details

runCmd: settings set target.inherit-tcc true output:

Hide Details

runCmd: settings set target.detach-on-error false output:

Hide Details

runCmd: settings set target.auto-apply-fixits false output:

Hide Details

runCmd: settings set plugin.process.gdb-remote.packet-timeout 60 output:

Hide Details

runCmd: settings set symbols.clang-modules-cache-path "/Users/buildslave/jenkins/workspace/lldb-cmake-sanitized/lldb-build/lldb-test-build.noindex/module-cache-lldb/lldb-api" output:

Hide Details

runCmd: settings set use-color false output:

Hide Details

runCmd: setting set target.prefer-dynamic-value no-dynamic-values output:

Hide Details

runCmd: settings set target.env-vars ASAN_OPTIONS=detect_stack_use_after_return=1 DYLD_INSERT_LIBRARIES=/Users/buildslave/jenkins/workspace/lldb-cmake-sanitized/host-compiler/lib/clang/14.0.99/lib/darwin/libclang_rt.asan_osx_dynamic.dylib output:

Hide Details

make VPATH=/Users/buildslave/jenkins/workspace/lldb-cmake-sanitized/llvm-project/lldb/test/API/lang/objc/objc-property -C /Users/buildslave/jenkins/workspace/lldb-cmake-sanitized/lldb-build/lldb-test-build.noindex/lang/objc/objc-property/TestObjCProperty.test_objc_properties_dwarf -I /Users/buildslave/jenkins/workspace/lldb-cmake-sanitized/llvm-project/lldb/test/API/lang/objc/objc-property -I /Users/buildslave/jenkins/workspace/lldb-cmake-sanitized/llvm-project/lldb/packages/Python/lldbsuite/test/make -f /Users/buildslave/jenkins/workspace/lldb-cmake-sanitized/llvm-project/lldb/test/API/lang/objc/objc-property/Makefile MAKE_DSYM=NO all ARCH=x86_64 'CC="/Users/buildslave/jenkins/workspace/lldb-cmake-sanitized/host-compiler/bin/clang"' DSYMUTIL=/Users/buildslave/jenkins/workspace/lldb-cmake-sanitized/lldb-build/./bin/dsymutil CODESIGN=codesign CLANG_MODULE_CACHE_DIR=/Users/buildslave/jenkins/workspace/lldb-cmake-sanitized/lldb-build/lldb-test-build.noindex/module-cache-clang/lldb-api

Hide Details

"/Users/buildslave/jenkins/workspace/lldb-cmake-sanitized/host-compiler/bin/clang" -g -O0 -fno-builtin -isysroot "/Applications/Xcode.app/Contents/Developer/Platforms/MacOSX.platform/Developer/SDKs/MacOSX10.15.sdk" -arch x86_64 -I/Users/buildslave/jenkins/workspace/lldb-cmake-sanitized/llvm-project/lldb/packages/Python/lldbsuite/test/make/../../../../../include -I/Users/buildslave/jenkins/workspace/lldb-cmake-sanitized/llvm-project/lldb/test/API/lang/objc/objc-property -I/Users/buildslave/jenkins/workspace/lldb-cmake-sanitized/llvm-project/lldb/packages/Python/lldbsuite/test/make -include /Users/buildslave/jenkins/workspace/lldb-cmake-sanitized/llvm-project/lldb/packages/Python/lldbsuite/test/make/test_common.h -fno-limit-debug-info -MT main.o -MD -MP -MF main.d -c -o main.o /Users/buildslave/jenkins/workspace/lldb-cmake-sanitized/llvm-project/lldb/test/API/lang/objc/objc-property/main.m "/Users/buildslave/jenkins/workspace/lldb-cmake-sanitized/host-compiler/bin/clang" main.o -g -O0 -fno-builtin -isysroot "/Applications/Xcode.app/Contents/Developer/Platforms/MacOSX.platform/Developer/SDKs/MacOSX10.15.sdk" -arch x86_64 -I/Users/buildslave/jenkins/workspace/lldb-cmake-sanitized/llvm-project/lldb/packages/Python/lldbsuite/test/make/../../../../../include -I/Users/buildslave/jenkins/workspace/lldb-cmake-sanitized/llvm-project/lldb/test/API/lang/objc/objc-property -I/Users/buildslave/jenkins/workspace/lldb-cmake-sanitized/llvm-project/lldb/packages/Python/lldbsuite/test/make -include /Users/buildslave/jenkins/workspace/lldb-cmake-sanitized/llvm-project/lldb/packages/Python/lldbsuite/test/make/test_common.h -fno-limit-debug-info -lobjc -framework Foundation -lobjc --driver-mode=g++ -o "a.out" codesign -s - "a.out"

Hide Details

Hide Details

FAIL: LLDB (/Users/buildslave/jenkins/workspace/lldb-cmake-sanitized/host-compiler/bin/clang-x86_64) :: test_objc_properties_dwarf (TestObjCProperty.ObjCPropertyTestCase) <bound method SBProcess.Kill of <lldb.SBProcess; proxy of <Swig Object of type 'lldb::SBProcess *' at 0x1121e3c60> >>: success

Hide Details

UNSUPPORTED: LLDB (/Users/buildslave/jenkins/workspace/lldb-cmake-sanitized/host-compiler/bin/clang-x86_64) :: test_objc_properties_dwo (TestObjCProperty.ObjCPropertyTestCase) (test case does not fall in any category of interest for this run) runCmd: settings clear -all output:

Hide Details

runCmd: settings set symbols.enable-external-lookup false output:

Hide Details

runCmd: settings set target.inherit-tcc true output:

Hide Details

runCmd: settings set target.detach-on-error false output:

Hide Details

runCmd: settings set target.auto-apply-fixits false output:

Hide Details

runCmd: settings set plugin.process.gdb-remote.packet-timeout 60 output:

Hide Details

runCmd: settings set symbols.clang-modules-cache-path "/Users/buildslave/jenkins/workspace/lldb-cmake-sanitized/lldb-build/lldb-test-build.noindex/module-cache-lldb/lldb-api" output:

Hide Details

runCmd: settings set use-color false output:

Hide Details

runCmd: setting set target.prefer-dynamic-value no-dynamic-values output:

Hide Details

runCmd: settings set target.env-vars ASAN_OPTIONS=detect_stack_use_after_return=1 DYLD_INSERT_LIBRARIES=/Users/buildslave/jenkins/workspace/lldb-cmake-sanitized/host-compiler/lib/clang/14.0.99/lib/darwin/libclang_rt.asan_osx_dynamic.dylib output:

Hide Details

make VPATH=/Users/buildslave/jenkins/workspace/lldb-cmake-sanitized/llvm-project/lldb/test/API/lang/objc/objc-property -C /Users/buildslave/jenkins/workspace/lldb-cmake-sanitized/lldb-build/lldb-test-build.noindex/lang/objc/objc-property/TestObjCProperty.test_objc_properties_gmodules -I /Users/buildslave/jenkins/workspace/lldb-cmake-sanitized/llvm-project/lldb/test/API/lang/objc/objc-property -I /Users/buildslave/jenkins/workspace/lldb-cmake-sanitized/llvm-project/lldb/packages/Python/lldbsuite/test/make -f /Users/buildslave/jenkins/workspace/lldb-cmake-sanitized/llvm-project/lldb/test/API/lang/objc/objc-property/Makefile MAKE_DSYM=NO MAKE_GMODULES=YES all ARCH=x86_64 'CC="/Users/buildslave/jenkins/workspace/lldb-cmake-sanitized/host-compiler/bin/clang"' DSYMUTIL=/Users/buildslave/jenkins/workspace/lldb-cmake-sanitized/lldb-build/./bin/dsymutil CODESIGN=codesign CLANG_MODULE_CACHE_DIR=/Users/buildslave/jenkins/workspace/lldb-cmake-sanitized/lldb-build/lldb-test-build.noindex/module-cache-clang/lldb-api

Hide Details

"/Users/buildslave/jenkins/workspace/lldb-cmake-sanitized/host-compiler/bin/clang" -g -O0 -fno-builtin -isysroot "/Applications/Xcode.app/Contents/Developer/Platforms/MacOSX.platform/Developer/SDKs/MacOSX10.15.sdk" -arch x86_64 -I/Users/buildslave/jenkins/workspace/lldb-cmake-sanitized/llvm-project/lldb/packages/Python/lldbsuite/test/make/../../../../../include -I/Users/buildslave/jenkins/workspace/lldb-cmake-sanitized/llvm-project/lldb/test/API/lang/objc/objc-property -I/Users/buildslave/jenkins/workspace/lldb-cmake-sanitized/llvm-project/lldb/packages/Python/lldbsuite/test/make -include /Users/buildslave/jenkins/workspace/lldb-cmake-sanitized/llvm-project/lldb/packages/Python/lldbsuite/test/make/test_common.h -fno-limit-debug-info -fmodules -gmodules -fmodules-cache-path=/Users/buildslave/jenkins/workspace/lldb-cmake-sanitized/lldb-build/lldb-test-build.noindex/module-cache-clang/lldb-api -gmodules -fcxx-modules -MT main.o -MD -MP -MF main.d -c -o main.o /Users/buildslave/jenkins/workspace/lldb-cmake-sanitized/llvm-project/lldb/test/API/lang/objc/objc-property/main.m "/Users/buildslave/jenkins/workspace/lldb-cmake-sanitized/host-compiler/bin/clang" main.o -g -O0 -fno-builtin -isysroot "/Applications/Xcode.app/Contents/Developer/Platforms/MacOSX.platform/Developer/SDKs/MacOSX10.15.sdk" -arch x86_64 -I/Users/buildslave/jenkins/workspace/lldb-cmake-sanitized/llvm-project/lldb/packages/Python/lldbsuite/test/make/../../../../../include -I/Users/buildslave/jenkins/workspace/lldb-cmake-sanitized/llvm-project/lldb/test/API/lang/objc/objc-property -I/Users/buildslave/jenkins/workspace/lldb-cmake-sanitized/llvm-project/lldb/packages/Python/lldbsuite/test/make -include /Users/buildslave/jenkins/workspace/lldb-cmake-sanitized/llvm-project/lldb/packages/Python/lldbsuite/test/make/test_common.h -fno-limit-debug-info -fmodules -gmodules -fmodules-cache-path=/Users/buildslave/jenkins/workspace/lldb-cmake-sanitized/lldb-build/lldb-test-build.noindex/module-cache-clang/lldb-api -gmodules -fcxx-modules -lobjc -framework Foundation -lobjc --driver-mode=g++ -o "a.out" codesign -s - "a.out"

Hide Details

Hide Details

<bound method SBProcess.Kill of <lldb.SBProcess; proxy of <Swig Object of type 'lldb::SBProcess *' at 0x129c18180> >>: success

Hide Details

PASS: LLDB (/Users/buildslave/jenkins/workspace/lldb-cmake-sanitized/host-compiler/bin/clang-x86_64) :: test_objc_properties_gmodules (TestObjCProperty.ObjCPropertyTestCase) Restore dir to: /Users/buildslave/jenkins/workspace/lldb-cmake-sanitized/lldb-build/tools/lldb/test ====================================================================== FAIL: test_objc_properties_dsym (TestObjCProperty.ObjCPropertyTestCase) Test that expr uses the correct property getters and setters ---------------------------------------------------------------------- Traceback (most recent call last): File "/Users/buildslave/jenkins/workspace/lldb-cmake-sanitized/llvm-project/lldb/packages/Python/lldbsuite/test/lldbtest.py", line 1715, in test_method return attrvalue(self) File "/Users/buildslave/jenkins/workspace/lldb-cmake-sanitized/llvm-project/lldb/test/API/lang/objc/objc-property/TestObjCProperty.py", line 51, in test_objc_properties PROCESS_STOPPED) AssertionError: 10 != 5 : Process status should be stopped Config=x86_64-/Users/buildslave/jenkins/workspace/lldb-cmake-sanitized/host-compiler/bin/clang ====================================================================== FAIL: test_objc_properties_dwarf (TestObjCProperty.ObjCPropertyTestCase) Test that expr uses the correct property getters and setters ---------------------------------------------------------------------- Traceback (most recent call last): File "/Users/buildslave/jenkins/workspace/lldb-cmake-sanitized/llvm-project/lldb/packages/Python/lldbsuite/test/lldbtest.py", line 1715, in test_method return attrvalue(self) File "/Users/buildslave/jenkins/workspace/lldb-cmake-sanitized/llvm-project/lldb/test/API/lang/objc/objc-property/TestObjCProperty.py", line 51, in test_objc_properties PROCESS_STOPPED) AssertionError: 10 != 5 : Process status should be stopped Config=x86_64-/Users/buildslave/jenkins/workspace/lldb-cmake-sanitized/host-compiler/bin/clang ---------------------------------------------------------------------- Ran 4 tests in 81.407s

Hide Details

RESULT: FAILED (1 passes, 2 failures, 0 errors, 1 skipped, 0 expected failures, 0 unexpected successes)

Hide Details

--

Hide Details

******************** PASS: lldb-shell :: SymbolFile/DWARF/clang-ast-from-dwarf-unamed-and-anon-structs.cpp (1623 of 2474) PASS: lldb-unit :: Host/./HostTests/MainLoopTest.UnmonitoredSignal (1624 of 2474) PASS: lldb-shell :: SymbolFile/DWARF/x86/dwarf5-debug_line.s (1625 of 2474) PASS: lldb-api :: functionalities/thread/concurrent_events/TestConcurrentDelaySignalBreak.py (1626 of 2474) PASS: lldb-unit :: Utility/./UtilityTests/StringListTest.LongestCommonPrefix (1627 of 2474) PASS: lldb-unit :: Host/./HostTests/TerminalTest.SetCanonical (1628 of 2474) PASS: lldb-api :: macosx/DBGSourcePathRemapping/TestDSYMSourcePathRemapping.py (1629 of 2474) PASS: lldb-unit :: Utility/./UtilityTests/CompletionRequest.TestCompletionOwnership (1630 of 2474) PASS: lldb-api :: functionalities/breakpoint/scripted_bkpt/TestScriptedResolver.py (1631 of 2474) PASS: lldb-shell :: Unwind/thread-step-out-ret-addr-check.test (1632 of 2474) PASS: lldb-unit :: Utility/./UtilityTests/ConstStringTest.FromMidOfBufferStringRef (1633 of 2474) PASS: lldb-shell :: Register/Core/x86-32-netbsd-addr.test (1634 of 2474) PASS: lldb-unit :: UnwindAssembly/x86/./UnwindAssemblyx86Tests/Testx86AssemblyInspectionEngine.TestPushR15 (1635 of 2474) PASS: lldb-unit :: Language/Highlighting/./HighlighterTests/HighlighterTest.HighlighterSelectionPath (1636 of 2474) PASS: lldb-unit :: Utility/./UtilityTests/StringExtractorTest.GetNameColonValueContainsColon (1637 of 2474) PASS: lldb-unit :: Utility/./UtilityTests/LogChannelTest.Enable (1638 of 2474) PASS: lldb-api :: functionalities/data-formatter/data-formatter-stl/libcxx/atomic/TestLibCxxAtomic.py (1639 of 2474) PASS: lldb-unit :: Host/./HostTests/FileSystemTest.EnumerateDirectory (1640 of 2474) PASS: lldb-shell :: ObjectFile/Breakpad/uuid-matching-mac.test (1641 of 2474) PASS: lldb-shell :: BuildScript/script-args.test (1642 of 2474) PASS: lldb-shell :: SymbolFile/DWARF/x86/find-function-regex.cpp (1643 of 2474) PASS: lldb-api :: lang/cpp/unicode-literals/TestUnicodeLiterals.py (1644 of 2474) PASS: lldb-api :: lang/cpp/keywords_enabled/TestCppKeywordsEnabled.py (1645 of 2474) PASS: lldb-api :: lang/cpp/function_refs/TestFunctionRefs.py (1646 of 2474) PASS: lldb-shell :: SymbolFile/NativePDB/function-types-calling-conv.cpp (1647 of 2474) PASS: lldb-unit :: Utility/./UtilityTests/BinaryStreamTest.PutSLEB128SixBytes (1648 of 2474) UNSUPPORTED: lldb-shell :: ScriptInterpreter/Lua/lua.test (1649 of 2474) UNSUPPORTED: lldb-api :: functionalities/ptrauth_diagnostics/brkC47x_x16_invalid/TestPtrauthBRKc47xX16Invalid.py (1650 of 2474) PASS: lldb-api :: lang/c/offsetof/TestOffsetof.py (1651 of 2474) PASS: lldb-unit :: Utility/./UtilityTests/ArgsTest.EscapeLLDBCommandArgument (1652 of 2474) PASS: lldb-unit :: Host/./HostTests/FileSystemTest.GetPermissions (1653 of 2474) PASS: lldb-shell :: Minidump/Windows/find-module.test (1654 of 2474) PASS: lldb-unit :: Utility/./UtilityTests/StringListTest.AppendList (1655 of 2474) PASS: lldb-unit :: Utility/./UtilityTests/ScalarTest.APIntConstructor (1656 of 2474) PASS: lldb-api :: lang/c/anonymous/TestAnonymous.py (1657 of 2474) PASS: lldb-unit :: ScriptInterpreter/Python/./ScriptInterpreterPythonTests/PythonDataObjectsTest.TestBorrowedReferences (1658 of 2474) PASS: lldb-api :: functionalities/source-map/TestTargetSourceMap.py (1659 of 2474) PASS: lldb-api :: functionalities/data-formatter/summary-string-onfail/Test-rdar-9974002.py (1660 of 2474) PASS: lldb-api :: functionalities/data-formatter/data-formatter-stl/libcxx/tuple/TestDataFormatterLibcxxTuple.py (1661 of 2474) PASS: lldb-unit :: Utility/./UtilityTests/DataExtractorTest.GetCStrEmpty (1662 of 2474) PASS: lldb-unit :: Core/./LLDBCoreTests/StreamCallbackTest.Callback (1663 of 2474) PASS: lldb-api :: lang/objc/objc-new-syntax/TestObjCNewSyntaxArray.py (1664 of 2474) PASS: lldb-api :: lang/c/shared_lib_stripped_symbols/TestSharedLibStrippedSymbols.py (1665 of 2474) UNSUPPORTED: lldb-api :: commands/trace/TestTraceLoad.py (1666 of 2474) PASS: lldb-api :: commands/watchpoints/watchpoint_disable/TestWatchpointDisable.py (1667 of 2474) PASS: lldb-unit :: Process/minidump/./LLDBMinidumpTests/MinidumpParserTest.GetArchitectureWindows (1668 of 2474) PASS: lldb-unit :: SymbolFile/NativePDB/./SymbolFileNativePDBTests/PDBFPOProgramToDWARFExpressionTests.UnresolvedDependentCyclicRegisterAssignmentReference (1669 of 2474) PASS: lldb-shell :: Register/Core/aarch64-freebsd-multithread.test (1670 of 2474) UNSUPPORTED: lldb-shell :: Register/x86-64-ymm16-write.test (1671 of 2474) PASS: lldb-shell :: ScriptInterpreter/Python/command_import.test (1672 of 2474) PASS: lldb-shell :: ObjectFile/PECOFF/section-types.yaml (1673 of 2474) PASS: lldb-unit :: Utility/./UtilityTests/NameMatchesTest.StartsWith (1674 of 2474) PASS: lldb-unit :: UnwindAssembly/x86/./UnwindAssemblyx86Tests/Testx86AssemblyInspectionEngine.TestReturnDetect (1675 of 2474) UNSUPPORTED: lldb-api :: commands/trace/TestTraceSave.py (1676 of 2474) PASS: lldb-unit :: Process/gdb-remote/./ProcessGdbRemoteTests/GDBRemoteCommunicationServerTest.SendErrorResponse_Status (1677 of 2474) PASS: lldb-unit :: Breakpoint/./LLDBBreakpointTests/BreakpointIDTest.StringIsBreakpointName (1678 of 2474) PASS: lldb-api :: lang/cpp/char8_t/TestCxxChar8_t.py (1679 of 2474) PASS: lldb-api :: functionalities/gdb_remote_client/TestRegDefinitionInParts.py (1680 of 2474) PASS: lldb-shell :: Recognizer/assert.test (1681 of 2474) PASS: lldb-unit :: SymbolFile/DWARF/./SymbolFileDWARFTests/SymbolFileDWARFTests.ParseArangesWithMultipleTerminators (1682 of 2474) UNSUPPORTED: lldb-api :: commands/watchpoints/watch_tagged_addr/TestWatchTaggedAddress.py (1683 of 2474) PASS: lldb-unit :: SymbolFile/DWARF/./SymbolFileDWARFTests/SymbolFileDWARFTests.TestAbbrevInvalidNULLTag (1684 of 2474) UNSUPPORTED: lldb-api :: functionalities/asan/TestMemoryHistory.py (1685 of 2474) PASS: lldb-unit :: Utility/./UtilityTests/StreamTeeTest.Flush (1686 of 2474) PASS: lldb-shell :: SymbolFile/NativePDB/s_constant.cpp (1687 of 2474) PASS: lldb-unit :: Utility/./UtilityTests/CompletionRequest.TryCompleteCurrentArgBad (1688 of 2474) PASS: lldb-shell :: Register/Core/x86-64-netbsd-fp.test (1689 of 2474) PASS: lldb-unit :: Utility/./UtilityTests/DataExtractorTest.GetMaxS64 (1690 of 2474) PASS: lldb-api :: functionalities/thread/concurrent_events/TestConcurrentWatchpointWithDelayWatchpointThreads.py (1691 of 2474) PASS: lldb-api :: commands/expression/weak_symbols/TestWeakSymbols.py (1692 of 2474) PASS: lldb-api :: lang/objc/orderedset/TestOrderedSet.py (1693 of 2474) PASS: lldb-shell :: SymbolFile/DWARF/x86/dead-code-filtering.yaml (1694 of 2474) PASS: lldb-api :: commands/frame/diagnose/bad-reference/TestBadReference.py (1695 of 2474) PASS: lldb-api :: lang/cpp/static_members/TestCPPStaticMembers.py (1696 of 2474) PASS: lldb-unit :: Utility/./UtilityTests/BinaryStreamTest.PutSLEB128EightBytes (1697 of 2474) PASS: lldb-unit :: Process/gdb-remote/./ProcessGdbRemoteTests/GDBRemoteClientBaseTest.InterruptNoResponse (1698 of 2474) PASS: lldb-unit :: Language/Highlighting/./HighlighterTests/HighlighterTest.ClangOperators (1699 of 2474) PASS: lldb-unit :: Core/./LLDBCoreTests/RichManglingContextTest.SwitchProvider (1700 of 2474) PASS: lldb-unit :: Utility/./UtilityTests/ArgsTest.GetQuotedCommandString (1701 of 2474) PASS: lldb-unit :: Symbol/./SymbolTests/TestClangASTImporter.DeportTypeTagDecl (1702 of 2474) PASS: lldb-shell :: ObjectFile/ELF/netbsd-exec-8.99.30-amd64.yaml (1703 of 2474) PASS: lldb-shell :: ObjectFile/ELF/basic-info.yaml (1704 of 2474) PASS: lldb-unit :: Utility/./UtilityTests/XcodeSDKTest.MergeTest (1705 of 2474) PASS: lldb-api :: functionalities/gdb_remote_client/TestTargetXMLArch.py (1706 of 2474) PASS: lldb-api :: python_api/debugger/TestDebuggerAPI.py (1707 of 2474) PASS: lldb-unit :: Utility/./UtilityTests/RegularExpression.Invalid (1708 of 2474) PASS: lldb-unit :: Utility/./UtilityTests/StringListTest.Clear (1709 of 2474) PASS: lldb-api :: lang/objc/modules-auto-import/TestModulesAutoImport.py (1710 of 2474) PASS: lldb-api :: functionalities/gdb_remote_client/TestPty.py (1711 of 2474) UNSUPPORTED: lldb-api :: python_api/event/TestEvents.py (1712 of 2474) UNSUPPORTED: lldb-api :: lang/c/typedef/Testtypedef.py (1713 of 2474) PASS: lldb-unit :: Symbol/./SymbolTests/TestTypeSystemClang.TestGetEnumIntegerTypeUnexpectedType (1714 of 2474) PASS: lldb-unit :: Process/Utility/./ProcessUtilityTests/ProcSMapTests/LinuxProcSMapsTestFixture.ParseSMapRegions/2 (1715 of 2474) PASS: lldb-unit :: Expression/./ExpressionTests/DiagnosticManagerTest.GetStringMultiline (1716 of 2474) PASS: lldb-unit :: Utility/./UtilityTests/StringListTest.InsertStringAtIndexStdString (1717 of 2474) PASS: lldb-unit :: Utility/./UtilityTests/StringListTest.AppendStringCString (1718 of 2474) PASS: lldb-api :: functionalities/set-data/TestSetData.py (1719 of 2474) PASS: lldb-api :: functionalities/breakpoint/address_breakpoints/TestAddressBreakpoints.py (1720 of 2474) PASS: lldb-unit :: Utility/./UtilityTests/StringLexerTest.NextIf (1721 of 2474) PASS: lldb-shell :: Driver/TestCommands.test (1722 of 2474) PASS: lldb-api :: functionalities/pre_run_dylibs/TestPreRunDylibs.py (1723 of 2474) PASS: lldb-shell :: ScriptInterpreter/None/none.test (1724 of 2474) UNSUPPORTED: lldb-api :: functionalities/ubsan/basic/TestUbsanBasic.py (1725 of 2474) PASS: lldb-api :: commands/target/stop-hook/delete/TestTargetStopHookDelete.py (1726 of 2474) PASS: lldb-api :: functionalities/breakpoint/dummy_target_breakpoints/TestBreakpointsWithNoTargets.py (1727 of 2474) PASS: lldb-api :: lang/cpp/scope/TestCppScope.py (1728 of 2474) PASS: lldb-shell :: SymbolFile/Breakpad/symtab-macho.test (1729 of 2474) PASS: lldb-unit :: Utility/./UtilityTests/ConstStringTest.MangledCounterpart (1730 of 2474) PASS: lldb-unit :: Interpreter/./InterpreterTests/TestProperties.DeepCopy (1731 of 2474) PASS: lldb-api :: lang/objc/objc-dyn-sbtype/TestObjCDynamicSBType.py (1732 of 2474) PASS: lldb-api :: python_api/sbvalue_persist/TestSBValuePersist.py (1733 of 2474) PASS: lldb-unit :: Utility/./UtilityTests/TimeoutTest.Construction (1734 of 2474) PASS: lldb-shell :: Driver/TestUseColor.test (1735 of 2474) PASS: lldb-shell :: SymbolFile/DWARF/x86/DW_AT_decl_file-DW_AT_specification-crosscu.s (1736 of 2474) PASS: lldb-unit :: Utility/./UtilityTests/ProcessInfoTest.Constructor (1737 of 2474) PASS: lldb-api :: lang/cpp/namespace_definitions/TestNamespaceDefinitions.py (1738 of 2474) PASS: lldb-unit :: debugserver/./debugserverTests/RNBSocket.LoopBackConnectIPv4 (1739 of 2474) PASS: lldb-api :: functionalities/inferior-crashing/recursive-inferior/TestRecursiveInferior.py (1740 of 2474) PASS: lldb-unit :: Utility/./UtilityTests/StreamTest.AddressRangeSize (1741 of 2474) UNSUPPORTED: lldb-shell :: Unwind/basic-block-sections.test (1742 of 2474) PASS: lldb-unit :: Utility/./UtilityTests/StreamTest.PutRawBytesToMixedEndian (1743 of 2474) PASS: lldb-unit :: Utility/./UtilityTests/RangeTest.ContainsRangeStartingFromZero (1744 of 2474) PASS: lldb-api :: commands/target/stop-hooks/TestStopHooks.py (1745 of 2474) PASS: lldb-unit :: Language/Highlighting/./HighlighterTests/HighlighterTest.Keywords (1746 of 2474) PASS: lldb-unit :: DataFormatter/./LLDBFormatterTests/TypeMatcherTests.GetMatchStringExactName (1747 of 2474) PASS: lldb-api :: lang/objc/modules-app-update/TestClangModulesAppUpdate.py (1748 of 2474) PASS: lldb-api :: lang/objc/objc-static-method/TestObjCStaticMethod.py (1749 of 2474) PASS: lldb-api :: functionalities/gdb_remote_client/TestIOSSimulator.py (1750 of 2474) PASS: lldb-api :: commands/expression/radar_8638051/Test8638051.py (1751 of 2474) UNSUPPORTED: lldb-api :: functionalities/data-formatter/data-formatter-stl/libstdcpp/map/TestDataFormatterStdMap.py (1752 of 2474) PASS: lldb-api :: commands/expression/vector_of_enums/TestVectorOfEnums.py (1753 of 2474) PASS: lldb-shell :: Expr/TestIRMemoryMap.test (1754 of 2474) UNSUPPORTED: lldb-api :: python_api/disassemble-raw-data/TestDisassemble_VST1_64.py (1755 of 2474) PASS: lldb-unit :: ScriptInterpreter/Python/./ScriptInterpreterPythonTests/PythonDataObjectsTest.TestPythonIntegerToStructuredInteger (1756 of 2474) PASS: lldb-unit :: Utility/./UtilityTests/NameMatchesTest.Contains (1757 of 2474) PASS: lldb-unit :: UnwindAssembly/x86/./UnwindAssemblyx86Tests/Testx86AssemblyInspectionEngine.Test32bitFramelessSmallStackFrame (1758 of 2474) PASS: lldb-unit :: Process/gdb-remote/./ProcessGdbRemoteTests/GDBRemoteCommunicationClientTest.GetQOffsets (1759 of 2474) PASS: lldb-unit :: Symbol/./SymbolTests/PostfixExpression.ParseOneExpression (1760 of 2474) PASS: lldb-shell :: ObjectFile/ELF/base-address.yaml (1761 of 2474) PASS: lldb-api :: lang/c/stepping/TestThreadStepInAvoidRegexp.py (1762 of 2474) PASS: lldb-api :: python_api/sberror/TestSBError.py (1763 of 2474) PASS: lldb-shell :: Settings/TestFrameFormatMangling.test (1764 of 2474) PASS: lldb-api :: functionalities/data-formatter/data-formatter-objc/TestDataFormatterObjCNSDate.py (1765 of 2474) UNSUPPORTED: lldb-shell :: Breakpoint/ppc64-localentry.test (1766 of 2474) PASS: lldb-unit :: Utility/./UtilityTests/StreamTest.AddressPrefixAndSuffix (1767 of 2474) PASS: lldb-api :: lang/cpp/limit-debug-info/TestWithLimitDebugInfo.py (1768 of 2474) PASS: lldb-unit :: Process/Utility/./ProcessUtilityTests/ProcSMapTests/LinuxProcSMapsTestFixture.ParseSMapRegions/8 (1769 of 2474) PASS: lldb-api :: commands/expression/import-std-module/list-dbg-info-content/TestDbgInfoContentListFromStdModule.py (1770 of 2474) PASS: lldb-unit :: debugserver/./debugserverTests/RNBSocket.AnyListen (1771 of 2474) PASS: lldb-api :: commands/frame/var-scope/TestFrameVariableScope.py (1772 of 2474) PASS: lldb-api :: lang/cpp/this/TestCPPThis.py (1773 of 2474) PASS: lldb-shell :: lldb-server/TestErrorMessages.test (1774 of 2474) PASS: lldb-shell :: SymbolFile/DWARF/x86/dwp-separate-debug-file.cpp (1775 of 2474) PASS: lldb-api :: tools/lldb-server/commandline/TestGdbRemoteConnection.py (1776 of 2474) PASS: lldb-unit :: Utility/./UtilityTests/UriParserTest.BracketedHostnameWithPortIPv6 (1777 of 2474) PASS: lldb-api :: functionalities/data-formatter/data-formatter-objc/TestDataFormatterObjCExpr.py (1778 of 2474) PASS: lldb-unit :: Utility/./UtilityTests/ListenerTest.GetEventWait (1779 of 2474) PASS: lldb-unit :: Host/./HostTests/SocketTests/SocketTest.UDPGetConnectURI/ipv6 (1780 of 2474) PASS: lldb-api :: functionalities/thread/concurrent_events/TestConcurrentCrashWithWatchpoint.py (1781 of 2474) PASS: lldb-shell :: ObjectFile/MachO/symtab.yaml (1782 of 2474) PASS: lldb-unit :: UnwindAssembly/x86/./UnwindAssemblyx86Tests/Testx86AssemblyInspectionEngine.TestPopEBX (1783 of 2474) PASS: lldb-shell :: ObjectFile/Breakpad/sections.test (1784 of 2474) PASS: lldb-unit :: Expression/./ExpressionTests/CppModuleConfigurationTest.Linux (1785 of 2474) PASS: lldb-shell :: SymbolFile/DWARF/x86/find-basic-function.cpp (1786 of 2474) PASS: lldb-unit :: Symbol/./SymbolTests/TestTypeSystemClang.TestNotDeletingUserCopyCstrDueToMoveCStr (1787 of 2474) PASS: lldb-shell :: SymbolFile/DWARF/x86/debug_ranges_and_rnglists.test (1788 of 2474) PASS: lldb-unit :: Utility/./UtilityTests/StreamTest.PutULEB128 (1789 of 2474) PASS: lldb-api :: functionalities/data-formatter/data-formatter-stl/generic/multiset/TestDataFormatterGenericMultiSet.py (1790 of 2474) PASS: lldb-api :: tools/lldb-server/register-reading/TestGdbRemoteGPacket.py (1791 of 2474) PASS: lldb-unit :: Symbol/./SymbolTests/PostfixExpression.ParseFPOProgram (1792 of 2474) PASS: lldb-api :: types/TestShortTypeExpr.py (1793 of 2474) PASS: lldb-unit :: Host/./HostTests/TerminalTest.SetParity (1794 of 2474) PASS: lldb-unit :: Process/Utility/./ProcessUtilityTests/MemoryTagManagerAArch64MTETest.ExpandToGranule (1795 of 2474) UNSUPPORTED: lldb-api :: functionalities/dyld-launch-linux/TestDyldLaunchLinux.py (1796 of 2474) PASS: lldb-shell :: ObjectFile/ELF/PT_LOAD-overlap-PT_TLS.yaml (1797 of 2474) PASS: lldb-unit :: Process/gdb-remote/./ProcessGdbRemoteTests/GDBRemoteCommunicationServerTest.SendErrorResponse_ErrorList (1798 of 2474) PASS: lldb-shell :: ObjectFile/MachO/subsections.yaml (1799 of 2474) PASS: lldb-api :: lang/cpp/operators/TestCppOperators.py (1800 of 2474) PASS: lldb-unit :: Utility/./UtilityTests/StreamTeeTest.SetStreamAtIndexOutOfBounds (1801 of 2474) PASS: lldb-unit :: Utility/./UtilityTests/StringListTest.InsertStringAtIndexOutOfBounds (1802 of 2474) PASS: lldb-api :: lang/objc/objc-struct-argument/TestObjCStructArgument.py (1803 of 2474) PASS: lldb-shell :: SymbolFile/DWARF/x86/dir-separator-windows.s (1804 of 2474) PASS: lldb-unit :: Utility/./UtilityTests/VMRange.Comparison (1805 of 2474) PASS: lldb-api :: tools/lldb-server/commandline/TestStubSetSID.py (1806 of 2474) PASS: lldb-shell :: SymbolFile/DWARF/x86/find-basic-type.cpp (1807 of 2474) PASS: lldb-shell :: SymbolFile/DWARF/x86/DW_AT_location-DW_AT_const_value.s (1808 of 2474) PASS: lldb-unit :: Utility/./UtilityTests/ScalarTest.SetValueFromData (1809 of 2474) PASS: lldb-unit :: Utility/./UtilityTests/CompletionRequest.Constructor (1810 of 2474) UNSUPPORTED: lldb-shell :: SymbolFile/NativePDB/typedefs.cpp (1811 of 2474) PASS: lldb-unit :: UnwindAssembly/x86/./UnwindAssemblyx86Tests/Testx86AssemblyInspectionEngine.TestPushESI (1812 of 2474) PASS: lldb-api :: commands/expression/scoped_enums/TestScopedEnumType.py (1813 of 2474) UNSUPPORTED: lldb-api :: functionalities/gdb_remote_client/TestAArch64XMLRegOffsets.py (1814 of 2474) PASS: lldb-unit :: ObjectFile/Breakpad/./ObjectFileBreakpadTests/InlineOriginRecord.parse (1815 of 2474) PASS: lldb-unit :: Symbol/./SymbolTests/TestCreateClassTemplateDecl.FindExistingTemplates (1816 of 2474) PASS: lldb-api :: commands/target/stop-hook/enable/TestTargetStopHookEnable.py (1817 of 2474) PASS: lldb-unit :: Utility/./UtilityTests/StreamTeeTest.CopyConstructor (1818 of 2474) PASS: lldb-unit :: Symbol/./SymbolTests/LineEntryTest.GetAllExactLineMatchesWithoutColumn (1819 of 2474) PASS: lldb-api :: functionalities/gdb_remote_client/TestPlatformKill.py (1820 of 2474) PASS: lldb-api :: functionalities/thread/num_threads/TestNumThreads.py (1821 of 2474) PASS: lldb-unit :: Utility/./UtilityTests/RangeTest.EqualInvalid (1822 of 2474) PASS: lldb-api :: functionalities/thread/concurrent_events/TestConcurrentDelaySignalWatch.py (1823 of 2474) PASS: lldb-unit :: Symbol/./SymbolTests/TestTypeSystemClang.GetFullyUnqualifiedType (1824 of 2474) PASS: lldb-unit :: Utility/./UtilityTests/StringExtractorTest.DecodeHexU8_Extra (1825 of 2474) PASS: lldb-unit :: Symbol/./SymbolTests/TestClangASTImporter.CopyDeclTagDecl (1826 of 2474) PASS: lldb-unit :: Core/./LLDBCoreTests/MangledTest.ResultForValidRustV0Name (1827 of 2474) PASS: lldb-unit :: Utility/./UtilityTests/ArgsTest.TestMultipleArgs (1828 of 2474) PASS: lldb-api :: functionalities/thread/concurrent_events/TestConcurrentWatchBreak.py (1829 of 2474) PASS: lldb-unit :: Process/gdb-remote/./ProcessGdbRemoteTests/GDBRemoteClientBaseTest.SendContinueAndLateInterrupt (1830 of 2474) PASS: lldb-api :: python_api/frame/TestFrames.py (1831 of 2474) PASS: lldb-api :: functionalities/inferior-crashing/TestInferiorCrashingStep.py (1832 of 2474) PASS: lldb-unit :: Symbol/./SymbolTests/Type.GetTypeScopeAndBasename (1833 of 2474) PASS: lldb-api :: python_api/target/TestTargetAPI.py (1834 of 2474) PASS: lldb-shell :: Host/TestCustomShell.test (1835 of 2474) PASS: lldb-api :: lang/objc/foundation/TestConstStrings.py (1836 of 2474) PASS: lldb-api :: lang/c/unions/TestUnionMembers.py (1837 of 2474) PASS: lldb-unit :: Utility/./UtilityTests/StreamTest.AddressPrefix (1838 of 2474) PASS: lldb-api :: functionalities/inferior-crashing/recursive-inferior/TestRecursiveInferiorStep.py (1839 of 2474) PASS: lldb-unit :: Thread/./ThreadTests/ThreadTest.GetPrivateStopInfo (1840 of 2474) PASS: lldb-shell :: Commands/command-script-import.test (1841 of 2474) UNSUPPORTED: lldb-api :: functionalities/tty/TestTerminal.py (1842 of 2474) PASS: lldb-api :: functionalities/unwind/noreturn/module-end/TestNoReturnModuleEnd.py (1843 of 2474) UNSUPPORTED: lldb-shell :: Register/x86-fp-read.test (1844 of 2474) PASS: lldb-api :: functionalities/breakpoint/breakpoint_ids/TestBreakpointIDs.py (1845 of 2474) PASS: lldb-api :: commands/apropos/with-process/TestAproposWithProcess.py (1846 of 2474) UNSUPPORTED: lldb-api :: functionalities/thread/concurrent_events/TestConcurrentManySignals.py (1847 of 2474) PASS: lldb-unit :: Utility/./UtilityTests/DataExtractorTest.GetFloatUnaligned (1848 of 2474) PASS: lldb-api :: functionalities/return-value/TestReturnValue.py (1849 of 2474) PASS: lldb-shell :: ObjectFile/ELF/build-id-case.yaml (1850 of 2474) PASS: lldb-shell :: SymbolFile/DWARF/x86/debug-types-basic.test (1851 of 2474) PASS: lldb-unit :: Core/./LLDBCoreTests/DumpDataExtractorTest.Formats (1852 of 2474) UNSUPPORTED: lldb-api :: commands/expression/multiline-navigation/TestMultilineNavigation.py (1853 of 2474) PASS: lldb-shell :: SymbolFile/NativePDB/nested-types.cpp (1854 of 2474) UNSUPPORTED: lldb-api :: benchmarks/stepping/TestSteppingSpeed.py (1855 of 2474) PASS: lldb-api :: functionalities/data-formatter/data-formatter-objc/nsstring/TestDataFormatterNSString.py (1856 of 2474) PASS: lldb-api :: lang/c/find_struct_type/TestFindStructTypes.py (1857 of 2474) PASS: lldb-api :: functionalities/data-formatter/data-formatter-objc/TestDataFormatterObjCNSError.py (1858 of 2474) PASS: lldb-shell :: Reproducer/TestProcessList.test (1859 of 2474) PASS: lldb-api :: lang/objc/objc-baseclass-sbtype/TestObjCBaseClassSBType.py (1860 of 2474) PASS: lldb-shell :: Driver/TestNoUseColor.test (1861 of 2474) PASS: lldb-unit :: Utility/./UtilityTests/StringListTest.JoinThree (1862 of 2474) PASS: lldb-api :: lang/cpp/class_static/TestStaticVariables.py (1863 of 2474) PASS: lldb-unit :: Core/./LLDBCoreTests/MangledTest.EmptyForInvalidName (1864 of 2474) PASS: lldb-api :: functionalities/data-formatter/data-formatter-stl/libcxx/shared_ptr/TestDataFormatterLibcxxSharedPtr.py (1865 of 2474) PASS: lldb-api :: commands/settings/use_source_cache/TestUseSourceCache.py (1866 of 2474) PASS: lldb-unit :: Utility/./UtilityTests/StringExtractorTest.GetHexBytes_OddPair (1867 of 2474) PASS: lldb-unit :: Process/Utility/./ProcessUtilityTests/ProcMapTests/LinuxProcMapsTestFixture.ParseMapRegions/2 (1868 of 2474) PASS: lldb-unit :: Process/gdb-remote/./ProcessGdbRemoteTests/GDBRemoteCommunicationClientTest.GetMemoryRegionInfo (1869 of 2474) PASS: lldb-unit :: Utility/./UtilityTests/LogChannelTest.EnableOptions (1870 of 2474) PASS: lldb-unit :: Core/./LLDBCoreTests/ModuleSpecTest.TestMachOFile (1871 of 2474) PASS: lldb-unit :: Expression/./ExpressionTests/DiagnosticManagerTest.AppendMessageSubsequentDiags (1872 of 2474) PASS: lldb-api :: functionalities/data-formatter/data-formatter-stl/libcxx/iterator/TestDataFormatterLibccIterator.py (1873 of 2474) PASS: lldb-api :: api/multiple-targets/TestMultipleTargets.py (1874 of 2474) PASS: lldb-unit :: Host/./HostTests/SocketTests/SocketTest.TCPGetAddress/ipv6 (1875 of 2474) PASS: lldb-api :: functionalities/postmortem/elf-core/TestLinuxCore.py (1876 of 2474) PASS: lldb-unit :: Core/./LLDBCoreTests/DumpDataExtractorTest.BaseAddress (1877 of 2474) PASS: lldb-unit :: Utility/./UtilityTests/PassiveReplayTest.InstrumentedFooInvalid (1878 of 2474) PASS: lldb-api :: commands/expression/import-std-module/module-build-errors/TestStdModuleBuildErrors.py (1879 of 2474) PASS: lldb-unit :: Utility/./UtilityTests/ListenerTest.GetEventImmediate (1880 of 2474) PASS: lldb-unit :: Symbol/./SymbolTests/TestClangASTImporter.CopyTypeTagDecl (1881 of 2474) UNSUPPORTED: lldb-api :: benchmarks/frame_variable/TestFrameVariableResponse.py (1882 of 2474) PASS: lldb-shell :: SymbolFile/DWARF/x86/debug_ranges-missing-section.s (1883 of 2474) PASS: lldb-api :: functionalities/data-formatter/synthcapping/TestSyntheticCapping.py (1884 of 2474) PASS: lldb-unit :: Utility/./UtilityTests/ArchSpecTest.Compatibility (1885 of 2474) PASS: lldb-unit :: Symbol/./SymbolTests/TestTypeSystemClang.TestBuiltinTypeForEncodingAndBitSize (1886 of 2474) PASS: lldb-unit :: Utility/./UtilityTests/BinaryStreamTest.PutULEB128ThreeBytes (1887 of 2474) PASS: lldb-shell :: SymbolFile/DWARF/x86/find-basic-namespace.cpp (1888 of 2474) PASS: lldb-shell :: Reproducer/TestDebugSymbols.test (1889 of 2474) PASS: lldb-unit :: UnwindAssembly/x86/./UnwindAssemblyx86Tests/Testx86AssemblyInspectionEngine.TestCALLNextInsn (1890 of 2474) UNSUPPORTED: lldb-shell :: Subprocess/fork-follow-child.test (1891 of 2474) PASS: lldb-api :: functionalities/gdb_remote_client/TestNoGPacketSupported.py (1892 of 2474) PASS: lldb-shell :: Minidump/memory-region.yaml (1893 of 2474) PASS: lldb-unit :: Utility/./UtilityTests/StringListTest.GetMaxStringLengthEqualSize (1894 of 2474) PASS: lldb-api :: functionalities/data-formatter/data-formatter-objc/TestDataFormatterObjCNSURL.py (1895 of 2474) PASS: lldb-unit :: Process/Utility/./ProcessUtilityTests/ProcMapTests/LinuxProcMapsTestFixture.ParseMapRegions/1 (1896 of 2474) PASS: lldb-api :: commands/expression/import-std-module/forward_list/TestForwardListFromStdModule.py (1897 of 2474) PASS: lldb-api :: functionalities/thread/concurrent_events/TestConcurrentBreakpointOneDelayBreakpointThreads.py (1898 of 2474) PASS: lldb-api :: functionalities/data-formatter/data-formatter-stl/libcxx/list/TestDataFormatterLibcxxList.py (1899 of 2474) PASS: lldb-unit :: Utility/./UtilityTests/DataExtractorTest.GetSLEB128_bit63 (1900 of 2474) PASS: lldb-api :: functionalities/breakpoint/cpp_exception/TestCPPExceptionBreakpoint.py (1901 of 2474) PASS: lldb-unit :: Platform/./LLDBPlatformTests/PlatformDarwinTest.GetCompatibleArchARMv6 (1902 of 2474) PASS: lldb-unit :: Utility/./UtilityTests/UriParserTest.TypicalPortPathIPv4 (1903 of 2474) PASS: lldb-api :: lang/cpp/printf/TestPrintf.py (1904 of 2474) PASS: lldb-unit :: Utility/./UtilityTests/SharedCluster.ClusterManager (1905 of 2474) PASS: lldb-api :: functionalities/thread/concurrent_events/TestConcurrentDelayedCrashWithBreakpointWatchpoint.py (1906 of 2474) PASS: lldb-api :: lang/cpp/this_class_type_mixing/TestThisClassTypeMixing.py (1907 of 2474) PASS: lldb-api :: commands/expression/import-std-module/forward_list-dbg-info-content/TestDbgInfoContentForwardListFromStdModule.py (1908 of 2474) PASS: lldb-unit :: Utility/./UtilityTests/GeneratorTest.Create (1909 of 2474) PASS: lldb-shell :: SymbolFile/DWARF/x86/dwarf5-index-is-used.cpp (1910 of 2474) PASS: lldb-api :: functionalities/breakpoint/auto_continue/TestBreakpointAutoContinue.py (1911 of 2474) PASS: lldb-shell :: Commands/command-regex-delete.test (1912 of 2474) PASS: lldb-unit :: Utility/./UtilityTests/OptionsWithRawTest.SingleWhitespaceInput (1913 of 2474) PASS: lldb-unit :: Utility/./UtilityTests/BinaryStreamTest.PutSLEB128OneByte (1914 of 2474) PASS: lldb-unit :: Utility/./UtilityTests/RangeTest.Copy (1915 of 2474) PASS: lldb-unit :: Target/./TargetTests/ModuleCacheTest.GetAndPutStrangeHostname (1916 of 2474) UNSUPPORTED: lldb-api :: benchmarks/libcxxlist/TestBenchmarkLibcxxList.py (1917 of 2474) PASS: lldb-unit :: Utility/./UtilityTests/RangeTest.ContainsAddrInvalid (1918 of 2474) PASS: lldb-unit :: Utility/./UtilityTests/LogChannelEnabledTest.LogVerboseThread (1919 of 2474) UNSUPPORTED: lldb-api :: linux/add-symbols/TestTargetSymbolsAddCommand.py (1920 of 2474) PASS: lldb-shell :: SymbolFile/Breakpad/unwind-via-raSearch.test (1921 of 2474) PASS: lldb-unit :: SymbolFile/DWARF/./SymbolFileDWARFTests/SymbolFileDWARFTests.TestAbbrevOutOfOrder (1922 of 2474) PASS: lldb-shell :: Breakpoint/case-sensitive.test (1923 of 2474) PASS: lldb-api :: functionalities/data-formatter/data-formatter-objc/TestDataFormatterObjCPlain.py (1924 of 2474) UNSUPPORTED: lldb-shell :: ObjectFile/ELF/minidebuginfo-no-lzma.yaml (1925 of 2474) PASS: lldb-shell :: ObjectFile/PDB/object.test (1926 of 2474) PASS: lldb-api :: lang/c/struct_types/TestStructTypes.py (1927 of 2474) PASS: lldb-unit :: Platform/./LLDBPlatformTests/PlatformAppleSimulatorTest.TestHostPlatformToSim (1928 of 2474) PASS: lldb-unit :: Utility/./UtilityTests/XcodeSDKTest.GetCanonicalNameAndConstruct (1929 of 2474) PASS: lldb-api :: functionalities/breakpoint/breakpoint_ignore_count/TestBreakpointIgnoreCount.py (1930 of 2474) PASS: lldb-unit :: SymbolFile/DWARF/./SymbolFileDWARFTests/SymbolFileDWARFTests.TestAbbrevValidAttrNullForm (1931 of 2474) UNSUPPORTED: lldb-shell :: BuildScript/toolchain-clang-cl.test (1932 of 2474) PASS: lldb-api :: functionalities/breakpoint/move_nearest/TestMoveNearest.py (1933 of 2474) PASS: lldb-unit :: Utility/./UtilityTests/StringListTest.GetMaxStringLengthEmpty (1934 of 2474) PASS: lldb-api :: functionalities/optimized_code/TestNoASanExceptionAfterEvalOP_piece.py (1935 of 2474) PASS: lldb-unit :: Utility/./UtilityTests/TimeoutTest.Format (1936 of 2474) PASS: lldb-api :: functionalities/data-formatter/parray/TestPrintArray.py (1937 of 2474) PASS: lldb-unit :: Utility/./UtilityTests/StringExtractorTest.GetHexBytesAvail_OddPair2 (1938 of 2474) PASS: lldb-shell :: Settings/TestModuleCacheSanity.test (1939 of 2474) PASS: lldb-api :: tools/lldb-server/TestGdbRemoteProcessInfo.py (1940 of 2474) PASS: lldb-api :: commands/disassemble/basic/TestFrameDisassemble.py (1941 of 2474) PASS: lldb-api :: lang/c/cpp_keyword_identifiers/TestCppKeywordsAsCIdentifiers.py (1942 of 2474) UNSUPPORTED: lldb-shell :: Unwind/unwind-plan-dwarf-dump.test (1943 of 2474) PASS: lldb-unit :: Target/./TargetTests/FindFileTest.FindFileTests (1944 of 2474) PASS: lldb-api :: functionalities/inline-stepping/TestInlineStepping.py (1945 of 2474) PASS: lldb-shell :: Minidump/Windows/broken-unwind.test (1946 of 2474) PASS: lldb-unit :: ScriptInterpreter/Python/./ScriptInterpreterPythonTests/PythonDataObjectsTest.TestPythonIntegerToStr (1947 of 2474) PASS: lldb-unit :: Utility/./UtilityTests/StringListTest.JoinMultiCharSeparator (1948 of 2474) PASS: lldb-api :: functionalities/backticks/TestBackticksWithoutATarget.py (1949 of 2474) PASS: lldb-unit :: Utility/./UtilityTests/FileSpecTest.EqualDotsPosix (1950 of 2474) PASS: lldb-unit :: Utility/./UtilityTests/CompletionRequest.DuplicateFiltering (1951 of 2474) PASS: lldb-unit :: SymbolFile/NativePDB/./SymbolFileNativePDBTests/PDBFPOProgramToDWARFExpressionTests.DependencyChain (1952 of 2474) PASS: lldb-api :: commands/session/save/TestSessionSave.py (1953 of 2474) PASS: lldb-unit :: UnwindAssembly/x86/./UnwindAssemblyx86Tests/Testx86AssemblyInspectionEngine.Test32BitOnlyInstruction (1954 of 2474) PASS: lldb-api :: python_api/findvalue_duplist/TestSBFrameFindValue.py (1955 of 2474) UNSUPPORTED: lldb-api :: terminal/TestEditline.py (1956 of 2474) PASS: lldb-api :: functionalities/paths/TestPaths.py (1957 of 2474) PASS: lldb-shell :: Process/TestEnvironment.test (1958 of 2474) PASS: lldb-unit :: Utility/./UtilityTests/UriParserTest.BadPort2 (1959 of 2474) UNSUPPORTED: lldb-api :: commands/trace/TestTraceStartStop.py (1960 of 2474) PASS: lldb-api :: commands/expression/two-files/TestObjCTypeQueryFromOtherCompileUnit.py (1961 of 2474) PASS: lldb-api :: commands/target/stop-hooks/TestStopHookScripted.py (1962 of 2474) PASS: lldb-api :: lang/objc/print-obj/TestPrintObj.py (1963 of 2474) PASS: lldb-api :: functionalities/object-file/TestImageListMultiArchitecture.py (1964 of 2474) UNSUPPORTED: lldb-shell :: ScriptInterpreter/Lua/io.test (1965 of 2474) PASS: lldb-api :: functionalities/data-formatter/data-formatter-objc/nsindexpath/TestDataFormatterNSIndexPath.py (1966 of 2474) PASS: lldb-api :: functionalities/breakpoint/serialize/TestBreakpointSerialization.py (1967 of 2474) PASS: lldb-api :: types/TestLongTypes.py (1968 of 2474) PASS: lldb-unit :: Utility/./UtilityTests/Flags.AnySet (1969 of 2474) PASS: lldb-unit :: Symbol/./SymbolTests/TestTypeSystemClang.GetExeModuleWhenMissingSymbolFile (1970 of 2474) PASS: lldb-api :: macosx/version_zero/TestGetVersionZeroVersion.py (1971 of 2474) UNSUPPORTED: lldb-api :: functionalities/ubsan/user-expression/TestUbsanUserExpression.py (1972 of 2474) PASS: lldb-unit :: Process/minidump/./LLDBMinidumpTests/MinidumpParserTest.MinidumpDuplicateModuleMappedFirst (1973 of 2474) UNSUPPORTED: lldb-api :: functionalities/data-formatter/data-formatter-stl/libstdcpp/vector/TestDataFormatterStdVector.py (1974 of 2474) UNSUPPORTED: lldb-shell :: Subprocess/vfork-follow-parent-softbp.test (1975 of 2474) PASS: lldb-api :: lang/objc/conflicting-definition/TestConflictingDefinition.py (1976 of 2474) PASS: lldb-api :: functionalities/breakpoint/objc/TestObjCBreakpoints.py (1977 of 2474) PASS: lldb-api :: tools/lldb-vscode/variables/TestVSCode_variables.py (1978 of 2474) PASS: lldb-api :: lang/objc/foundation/TestSymbolTable.py (1979 of 2474) PASS: lldb-api :: python_api/get-value-32bit-int/TestGetValue32BitInt.py (1980 of 2474) PASS: lldb-api :: lang/c/sizeof/TestCSizeof.py (1981 of 2474) PASS: lldb-unit :: Utility/./UtilityTests/StreamTeeTest.Assignment (1982 of 2474) PASS: lldb-api :: commands/expression/call-function/TestCallBuiltinFunction.py (1983 of 2474) PASS: lldb-api :: functionalities/data-formatter/varscript_formatting/TestDataFormatterVarScriptFormatting.py (1984 of 2474) PASS: lldb-unit :: ObjectFile/ELF/./ObjectFileELFTests/ObjectFileELFTest.SectionsResolveConsistently (1985 of 2474) PASS: lldb-unit :: Utility/./UtilityTests/StringListTest.Join (1986 of 2474) PASS: lldb-api :: python_api/symbol-context/TestSymbolContext.py (1987 of 2474) PASS: lldb-api :: lang/c/global_variables/TestGlobalVariables.py (1988 of 2474) PASS: lldb-unit :: Utility/./UtilityTests/StringLexerTest.AdvanceIf (1989 of 2474) PASS: lldb-api :: lang/cpp/covariant-return-types/TestCovariantReturnTypes.py (1990 of 2474) PASS: lldb-unit :: Utility/./UtilityTests/StringListTest.GetMaxStringLengthDecreasingSize (1991 of 2474) PASS: lldb-api :: lang/cpp/symbols/TestSymbols.py (1992 of 2474) PASS: lldb-shell :: ObjectFile/ELF/PT_TLS-overlap-PT_LOAD.yaml (1993 of 2474) PASS: lldb-shell :: ScriptInterpreter/Python/fail_breakpoint_oneline.test (1994 of 2474) PASS: lldb-unit :: Symbol/./SymbolTests/TestScratchTypeSystemClang.InferSubASTFromLangOpts (1995 of 2474) PASS: lldb-api :: lang/c/const_variables/TestConstVariables.py (1996 of 2474) PASS: lldb-unit :: ObjectFile/PECOFF/./ObjectFilePECOFFTests/PECallFrameInfoTest.Frame_reg_eh (1997 of 2474) PASS: lldb-unit :: Expression/./ExpressionTests/DiagnosticManagerTest.AddDiagnostic (1998 of 2474) PASS: lldb-unit :: Process/minidump/./LLDBMinidumpTests/RegisterContextMinidump.ConvertMinidumpContext_x86_64 (1999 of 2474) PASS: lldb-unit :: tools/lldb-server/tests/./LLDBServerTests/TestBase.DebugserverEnv (2000 of 2474) PASS: lldb-unit :: Process/minidump/./LLDBMinidumpTests/MinidumpParserTest.GetPidWow64 (2001 of 2474) PASS: lldb-api :: commands/expression/top-level/TestTopLevelExprs.py (2002 of 2474) PASS: lldb-api :: macosx/queues/TestQueues.py (2003 of 2474) PASS: lldb-api :: commands/add-dsym/uuid/TestAddDsymCommand.py (2004 of 2474) PASS: lldb-unit :: Utility/./UtilityTests/SerializationRountripTest.SerializeDeserializeObjectReference (2005 of 2474) PASS: lldb-unit :: Utility/./UtilityTests/StringExtractorTest.GetHexU8_Underflow (2006 of 2474) PASS: lldb-api :: python_api/thread/TestThreadAPI.py (2007 of 2474) UNSUPPORTED: lldb-api :: linux/aarch64/mte_tag_access/TestAArch64LinuxMTEMemoryTagAccess.py (2008 of 2474) PASS: lldb-unit :: Utility/./UtilityTests/LogChannelTest.Disable (2009 of 2474) PASS: lldb-unit :: Platform/./LLDBPlatformTests/PlatformDarwinTest.GetCompatibleArchARMv4 (2010 of 2474) PASS: lldb-unit :: Utility/./UtilityTests/StringListTest.SplitIntoLinesSingleTrailingCR (2011 of 2474) PASS: lldb-api :: lang/cpp/bool/TestCPPBool.py (2012 of 2474) PASS: lldb-shell :: SymbolFile/NativePDB/break-by-line.cpp (2013 of 2474) PASS: lldb-api :: commands/watchpoints/watchpoint_on_vectors/TestValueOfVectorVariable.py (2014 of 2474) PASS: lldb-api :: functionalities/data-formatter/data-formatter-objc/TestDataFormatterObjNSException.py (2015 of 2474) PASS: lldb-shell :: Quit/TestQuitExitCodeHex0.test (2016 of 2474) UNSUPPORTED: lldb-api :: functionalities/gdb_remote_client/TestQemuAArch64TargetXml.py (2017 of 2474) PASS: lldb-api :: commands/watchpoints/multiple_hits/TestMultipleHits.py (2018 of 2474) PASS: lldb-shell :: Quit/TestQuitExitCodeHexA.test (2019 of 2474) PASS: lldb-api :: lang/objc/bitfield_ivars/TestBitfieldIvars.py (2020 of 2474) PASS: lldb-shell :: SymbolFile/DWARF/x86/debug-types-missing-signature.test (2021 of 2474) PASS: lldb-shell :: ObjectFile/ELF/section-types.yaml (2022 of 2474) PASS: lldb-unit :: Utility/./UtilityTests/StringListTest.InsertStringAtIndexMove (2023 of 2474) PASS: lldb-api :: functionalities/rerun/TestRerun.py (2024 of 2474) PASS: lldb-unit :: Utility/./UtilityTests/StreamTest.ShiftOperatorPtr (2025 of 2474) PASS: lldb-unit :: Symbol/./SymbolTests/TestClangASTImporter.ImportInvalidType (2026 of 2474) UNSUPPORTED: lldb-shell :: Register/arm-gp-read.test (2027 of 2474) PASS: lldb-unit :: Utility/./UtilityTests/BinaryStreamTest.PutSLEB128TwoBytes (2028 of 2474) PASS: lldb-unit :: ScriptInterpreter/Python/./ScriptInterpreterPythonTests/PythonDataObjectsTest.TestPythonListToStructuredList (2029 of 2474) UNSUPPORTED: lldb-api :: functionalities/unwind/aarch64_unwind_pac/TestAArch64UnwindPAC.py (2030 of 2474) PASS: lldb-unit :: Process/Utility/./ProcessUtilityTests/MemoryTagManagerAArch64MTETest.UnpackTagsData (2031 of 2474) PASS: lldb-unit :: Process/gdb-remote/./ProcessGdbRemoteTests/GDBRemoteClientBaseTest.SendContinueAndWait (2032 of 2474) PASS: lldb-api :: lang/cpp/bitfields/TestCppBitfields.py (2033 of 2474) UNSUPPORTED: lldb-shell :: Process/Windows/exception_access_violation.cpp (2034 of 2474) PASS: lldb-api :: commands/watchpoints/watchpoint_size/TestWatchpointSizes.py (2035 of 2474) PASS: lldb-unit :: Expression/./ExpressionTests/CppModuleConfigurationTest.Xcode (2036 of 2474) PASS: lldb-unit :: Utility/./UtilityTests/StatusTest.ErrorConstructor (2037 of 2474) PASS: lldb-api :: commands/expression/import-std-module/deque-dbg-info-content/TestDbgInfoContentDequeFromStdModule.py (2038 of 2474) PASS: lldb-api :: commands/target/select/TestTargetSelect.py (2039 of 2474) PASS: lldb-shell :: Register/Core/x86-64-linux-gp.test (2040 of 2474) PASS: lldb-api :: commands/expression/import-std-module/conflicts/TestStdModuleWithConflicts.py (2041 of 2474) PASS: lldb-shell :: ObjectFile/Breakpad/discontiguous-sections.test (2042 of 2474) PASS: lldb-unit :: Core/./LLDBCoreTests/FormatEntity.LookupAllEntriesInTree (2043 of 2474) PASS: lldb-unit :: Platform/./LLDBPlatformTests/PlatformDarwinTest.GetCompatibleArchARMv7s (2044 of 2474) PASS: lldb-shell :: Register/x86-64-read.test (2045 of 2474) PASS: lldb-unit :: Utility/./UtilityTests/ArgsTest.TestSingleArgWithQuotedSpace (2046 of 2474) PASS: lldb-unit :: Utility/./UtilityTests/ScalarTest.Equality (2047 of 2474) PASS: lldb-api :: commands/breakpoint/set/func-regex/TestBreakpointRegexError.py (2048 of 2474) PASS: lldb-unit :: Utility/./UtilityTests/BinaryStreamTest.PutSLEB128Zero (2049 of 2474) PASS: lldb-shell :: ObjectFile/ELF/PT_LOAD-overlap-section.yaml (2050 of 2474) PASS: lldb-api :: functionalities/data-formatter/nsdictionarysynth/TestNSDictionarySynthetic.py (2051 of 2474) PASS: lldb-shell :: ScriptInterpreter/Python/Crashlog/text.test (2052 of 2474) PASS: lldb-api :: functionalities/data-formatter/pyobjsynthprovider/TestPyObjSynthProvider.py (2053 of 2474) PASS: lldb-unit :: Utility/./UtilityTests/StreamTest.PutRawBytesToLittleEndian (2054 of 2474) PASS: lldb-unit :: SymbolFile/DWARF/./SymbolFileDWARFTests/SymbolFileDWARFTests.ParseArangesNonzeroSegmentSize (2055 of 2474) PASS: lldb-unit :: ScriptInterpreter/Python/./ScriptInterpreterPythonTests/PythonDataObjectsTest.TestPythonCallableCheck (2056 of 2474) PASS: lldb-unit :: SymbolFile/NativePDB/./SymbolFileNativePDBTests/PDBFPOProgramToDWARFExpressionTests.SingleAssignmentRegisterRef (2057 of 2474) PASS: lldb-shell :: ObjectFile/ELF/compressed-sections.yaml (2058 of 2474) PASS: lldb-unit :: Utility/./UtilityTests/StreamTest.AddressRangeInvalidRange (2059 of 2474) PASS: lldb-unit :: Utility/./UtilityTests/ScalarTest.ComparisonFloat (2060 of 2474) PASS: lldb-unit :: Utility/./UtilityTests/LogTest.Unregister (2061 of 2474) PASS: lldb-api :: functionalities/data-formatter/data-formatter-synthtype/TestDataFormatterSynthType.py (2062 of 2474) PASS: lldb-unit :: UnwindAssembly/x86/./UnwindAssemblyx86Tests/Testx86AssemblyInspectionEngine.TestPopRBPWithREX (2063 of 2474) PASS: lldb-unit :: Utility/./UtilityTests/NameMatchesTest.EndsWith (2064 of 2474) PASS: lldb-unit :: Host/./HostTests/MainLoopTest.TerminatesImmediately (2065 of 2474) PASS: lldb-unit :: Utility/./UtilityTests/StringLexerTest.PutBack (2066 of 2474) UNSUPPORTED: lldb-api :: functionalities/ptrauth_diagnostics/BLRAA_error/TestPtrauthBLRAADiagnostic.py (2067 of 2474) PASS: lldb-api :: lang/objc/objc-static-method-stripped/TestObjCStaticMethodStripped.py (2068 of 2474) PASS: lldb-unit :: UnwindAssembly/x86/./UnwindAssemblyx86Tests/Testx86AssemblyInspectionEngine.TestPopEDI (2069 of 2474) PASS: lldb-unit :: Utility/./UtilityTests/StringExtractorTest.GetHexU8_Underflow2 (2070 of 2474) PASS: lldb-unit :: Utility/./UtilityTests/BinaryStreamTest.PutULEB128SevenBytes (2071 of 2474) PASS: lldb-unit :: Core/./LLDBCoreTests/MangledTest.EmptyForInvalidDLangName (2072 of 2474) PASS: lldb-shell :: Breakpoint/jit-loader_jitlink_elf.test (2073 of 2474) PASS: lldb-api :: lang/cpp/frame-var-anon-unions/TestFrameVariableAnonymousUnions.py (2074 of 2474) PASS: lldb-api :: functionalities/tail_call_frames/disambiguate_call_site/TestDisambiguateCallSite.py (2075 of 2474) PASS: lldb-api :: api/command-return-object/TestSBCommandReturnObject.py (2076 of 2474) PASS: lldb-shell :: SymbolFile/Breakpad/unwind-via-stack-cfi.test (2077 of 2474) PASS: lldb-unit :: Utility/./UtilityTests/StreamTest.AddressRange (2078 of 2474) UNSUPPORTED: lldb-api :: functionalities/breakpoint/breakpoint_callback_command_source/TestBreakpointCallbackCommandSource.py (2079 of 2474) PASS: lldb-unit :: Symbol/./SymbolTests/TestTypeSystemClang.TestRecordHasFields (2080 of 2474) PASS: lldb-unit :: Utility/./UtilityTests/ArgsTest.TestQuotedUnknownEscape (2081 of 2474) PASS: lldb-unit :: Utility/./UtilityTests/ArchSpecTest.TestParseMachCPUDashSubtypeTripleExtra (2082 of 2474) PASS: lldb-api :: functionalities/data-formatter/data-formatter-objc/cmtime/TestDataFormatterCMTime.py (2083 of 2474) PASS: lldb-api :: sanity/TestSettingSkipping.py (2084 of 2474) PASS: lldb-api :: lang/cpp/char1632_t/TestChar1632T.py (2085 of 2474) PASS: lldb-unit :: Utility/./UtilityTests/RecordReplayTest.InstrumentedBar (2086 of 2474) PASS: lldb-unit :: Utility/./UtilityTests/ScalarTest.RightShiftOperator (2087 of 2474) PASS: lldb-unit :: Process/gdb-remote/./ProcessGdbRemoteTests/GDBRemoteClientBaseTest.SendContinueAndInterrupt2PacketBug (2088 of 2474) PASS: lldb-unit :: Utility/./UtilityTests/RangeTest.DoesAdjoinOrIntersect (2089 of 2474) PASS: lldb-shell :: Reproducer/TestReuseDirectory.test (2090 of 2474) PASS: lldb-unit :: Utility/./UtilityTests/FileSpecTest.Equal (2091 of 2474) PASS: lldb-shell :: Reproducer/Functionalities/TestExpressionEvaluation.test (2092 of 2474) PASS: lldb-unit :: Language/Highlighting/./HighlighterTests/HighlighterTest.ClangEmptyInput (2093 of 2474) PASS: lldb-unit :: Process/gdb-remote/./ProcessGdbRemoteTests/PortMapTest.Constructors (2094 of 2474) PASS: lldb-unit :: Utility/./UtilityTests/BinaryStreamTest.PutULEB128FourBytes (2095 of 2474) PASS: lldb-api :: lang/mixed/TestMixedLanguages.py (2096 of 2474) UNSUPPORTED: lldb-api :: linux/aarch64/tagged_memory_region/TestAArch64LinuxTaggedMemoryRegion.py (2097 of 2474) PASS: lldb-shell :: ObjectFile/ELF/many-sections.s (2098 of 2474) PASS: lldb-unit :: SymbolFile/NativePDB/./SymbolFileNativePDBTests/PDBFPOProgramToDWARFExpressionTests.MissingTargetRegister (2099 of 2474) PASS: lldb-unit :: UnwindAssembly/x86/./UnwindAssemblyx86Tests/Testx86AssemblyInspectionEngine.Test64bitFramelessSmallStackFrame (2100 of 2474) PASS: lldb-unit :: Utility/./UtilityTests/StringListTest.SplitIntoLinesEmpty (2101 of 2474) PASS: lldb-unit :: UnwindAssembly/x86/./UnwindAssemblyx86Tests/Testx86AssemblyInspectionEngine.Testi386IgnoredRegisters (2102 of 2474) PASS: lldb-api :: functionalities/data-formatter/array_typedef/TestArrayTypedef.py (2103 of 2474) PASS: lldb-unit :: Utility/./UtilityTests/StreamTeeTest.Write (2104 of 2474) PASS: lldb-unit :: Utility/./UtilityTests/UriParserTest.BadPort (2105 of 2474) PASS: lldb-unit :: Utility/./UtilityTests/RangeDataVector.FindEntryThatContains (2106 of 2474) PASS: lldb-api :: tools/lldb-vscode/stackTrace/TestVSCode_stackTrace.py (2107 of 2474) PASS: lldb-api :: functionalities/unused-inlined-parameters/TestUnusedInlinedParameters.py (2108 of 2474) PASS: lldb-api :: types/TestDoubleTypesExpr.py (2109 of 2474) PASS: lldb-api :: commands/expression/codegen-crash-import-def-arraytype-element/TestImportDefinitionArrayType.py (2110 of 2474) PASS: lldb-unit :: Symbol/./SymbolTests/SymbolsTest.LocateExecutableSymbolFileForUnknownExecutableAndMissingSymbolFile (2111 of 2474) PASS: lldb-unit :: SymbolFile/DWARF/./SymbolFileDWARFTests/SymbolFileDWARFTests.TestAbbrevMissingTerminator (2112 of 2474) PASS: lldb-api :: types/TestFloatTypesExpr.py (2113 of 2474) PASS: lldb-unit :: Utility/./UtilityTests/BinaryStreamTest.PutSLEB128MaxValue (2114 of 2474) PASS: lldb-api :: lang/cpp/offsetof/TestOffsetofCpp.py (2115 of 2474) PASS: lldb-api :: commands/expression/pr52257/TestExprCrash.py (2116 of 2474) UNSUPPORTED: lldb-api :: iohandler/unicode/TestUnicode.py (2117 of 2474) PASS: lldb-unit :: Language/Highlighting/./HighlighterTests/HighlighterTest.DefaultHighlighter (2118 of 2474) PASS: lldb-shell :: SymbolFile/DWARF/x86/DW_AT_declaration-with-children.s (2119 of 2474) UNSUPPORTED: lldb-shell :: SymbolFile/Breakpad/stack-cfi-arm.yaml (2120 of 2474) PASS: lldb-unit :: Utility/./UtilityTests/SerializationRountripTest.SerializeDeserializeCStringArrayNullptr (2121 of 2474) PASS: lldb-shell :: ScriptInterpreter/Python/command_relative_import.test (2122 of 2474) PASS: lldb-unit :: Target/./TargetTests/PathMappingListTest.CrossPlatformTests (2123 of 2474) PASS: lldb-api :: lang/objc/objc_direct-methods/TestObjCDirectMethods.py (2124 of 2474) PASS: lldb-shell :: SymbolFile/DWARF/x86/debug_loc-aslr.s (2125 of 2474) PASS: lldb-unit :: Process/minidump/./LLDBMinidumpTests/MinidumpParserTest.GetMemoryRegionInfoFromMemoryList (2126 of 2474) PASS: lldb-unit :: ScriptInterpreter/Python/./ScriptInterpreterPythonTests/PythonDataObjectsTest.TestScript (2127 of 2474) PASS: lldb-unit :: Utility/./UtilityTests/RangeTest.SlideZero (2128 of 2474) PASS: lldb-unit :: Utility/./UtilityTests/StreamTest.PutSLEB128 (2129 of 2474) UNSUPPORTED: lldb-shell :: BuildScript/toolchain-msvc.test (2130 of 2474) PASS: lldb-unit :: Utility/./UtilityTests/ArgsTest.TestQuotedTrailingBackslash (2131 of 2474) PASS: lldb-api :: commands/watchpoints/watchpoint_commands/command/TestWatchpointCommandLLDB.py (2132 of 2474) PASS: lldb-unit :: Editline/./EditlineTests/EditlineTestFixture.EditlineReceivesSingleLineText (2133 of 2474) PASS: lldb-unit :: Utility/./UtilityTests/ConstStringTest.YAML (2134 of 2474) PASS: lldb-api :: commands/target/create-deps/TestTargetCreateDeps.py (2135 of 2474) PASS: lldb-shell :: Settings/TestFrameFormatNoColor.test (2136 of 2474) PASS: lldb-unit :: Utility/./UtilityTests/AnsiTerminal.Incomplete (2137 of 2474) UNSUPPORTED: lldb-shell :: SymbolFile/DWARF/split-dwarf-expression-eval-bug.cpp (2138 of 2474) PASS: lldb-unit :: Signals/./SignalsTests/UnixSignalsTest.VersionChange (2139 of 2474) PASS: lldb-unit :: Utility/./UtilityTests/LogTest.LLDB_LOG_nullptr (2140 of 2474) PASS: lldb-unit :: Interpreter/./InterpreterTests/OptionArgParserTest.toScriptLanguage (2141 of 2474) PASS: lldb-api :: functionalities/thread/concurrent_events/TestConcurrentBreakpointDelayBreakpointOneSignal.py (2142 of 2474) PASS: lldb-unit :: Utility/./UtilityTests/RangeTest.DefaultConstructor (2143 of 2474) PASS: lldb-unit :: Host/./HostTests/TerminalTest.SetHardwareFlowControl (2144 of 2474) PASS: lldb-api :: commands/expression/import-std-module/retry-with-std-module/TestRetryWithStdModule.py (2145 of 2474) PASS: lldb-shell :: Reproducer/Functionalities/TestDataFormatter.test (2146 of 2474) PASS: lldb-unit :: Utility/./UtilityTests/StreamTest.QuotedCString (2147 of 2474) PASS: lldb-api :: lang/objc/objc-struct-return/TestObjCStructReturn.py (2148 of 2474) PASS: lldb-unit :: Utility/./UtilityTests/AnsiTerminal.KnownPrefix (2149 of 2474) PASS: lldb-unit :: Utility/./UtilityTests/StringListTest.LongestCommonPrefixSingleElement (2150 of 2474) PASS: lldb-shell :: SymbolFile/DWARF/x86/gnu-style-compression.cpp (2151 of 2474) UNSUPPORTED: lldb-shell :: SymbolFile/PDB/variables.test (2152 of 2474) PASS: lldb-api :: python_api/watchpoint/watchlocation/TestSetWatchlocation.py (2153 of 2474) UNSUPPORTED: lldb-shell :: Register/x86-ymm-read.test (2154 of 2474) PASS: lldb-unit :: Utility/./UtilityTests/ConstStringTest.UpdateMangledCounterpart (2155 of 2474) PASS: lldb-unit :: Utility/./UtilityTests/ArgsTest.TestUnknownEscape (2156 of 2474) PASS: lldb-shell :: Error/assert.test (2157 of 2474) PASS: lldb-api :: functionalities/gdb_remote_client/TestPlatformClient.py (2158 of 2474) PASS: lldb-api :: commands/expression/import-std-module/shared_ptr-dbg-info-content/TestSharedPtrDbgInfoContentFromStdModule.py (2159 of 2474) UNSUPPORTED: lldb-api :: functionalities/breakpoint/hardware_breakpoints/hardware_breakpoint_on_multiple_threads/TestHWBreakMultiThread.py (2160 of 2474) UNSUPPORTED: lldb-api :: commands/trace/TestTraceTimestampCounters.py (2161 of 2474) PASS: lldb-shell :: Breakpoint/split-dwarf-5-addrbase.test (2162 of 2474) PASS: lldb-api :: functionalities/inferior-crashing/TestInferiorCrashing.py (2163 of 2474) PASS: lldb-unit :: ObjectFile/Breakpad/./ObjectFileBreakpadTests/FileRecord.parse (2164 of 2474) UNSUPPORTED: lldb-api :: functionalities/data-formatter/data-formatter-stl/libstdcpp/iterator/TestDataFormatterStdIterator.py (2165 of 2474) PASS: lldb-api :: functionalities/data-formatter/refpointer-recursion/TestDataFormatterRefPtrRecursion.py (2166 of 2474) PASS: lldb-unit :: UnwindAssembly/x86/./UnwindAssemblyx86Tests/Testx86AssemblyInspectionEngine.TestPushRBPWithREX (2167 of 2474) PASS: lldb-unit :: Utility/./UtilityTests/TildeExpressionResolver.ResolveFullPath (2168 of 2474) PASS: lldb-api :: commands/disassemble/basic/TestDisassembleBreakpoint.py (2169 of 2474) PASS: lldb-api :: functionalities/thread/concurrent_events/TestConcurrentDelayWatchBreak.py (2170 of 2474) PASS: lldb-api :: tools/lldb-server/inferior-crash/TestGdbRemoteSegFault.py (2171 of 2474) PASS: lldb-unit :: Process/minidump/./LLDBMinidumpTests/MinidumpParserTest.GetPidWindows (2172 of 2474) PASS: lldb-api :: commands/expression/persist_objc_pointeetype/TestPersistObjCPointeeType.py (2173 of 2474) PASS: lldb-api :: functionalities/thread/concurrent_events/TestConcurrentWatchBreakDelay.py (2174 of 2474) UNSUPPORTED: lldb-api :: macosx/lc-note/addrable-bits/TestAddrableBitsCorefile.py (2175 of 2474) PASS: lldb-unit :: Utility/./UtilityTests/AnsiTerminal.AtEnd (2176 of 2474) PASS: lldb-api :: types/TestDoubleTypes.py (2177 of 2474) PASS: lldb-unit :: Expression/./ExpressionTests/ClangExpressionDeclMapTest.TestUnknownIdentifierLookup (2178 of 2474) PASS: lldb-shell :: SymbolFile/DWARF/x86/DW_OP_piece-smaller-than-struct.s (2179 of 2474) UNSUPPORTED: lldb-shell :: ExecControl/StopHook/stop-hook-threads.test (2180 of 2474) PASS: lldb-api :: functionalities/dynamic_value_child_count/TestDynamicValueChildCount.py (2181 of 2474) PASS: lldb-unit :: Utility/./UtilityTests/OptionsWithRawTest.MultiWordSuffix (2182 of 2474) PASS: lldb-api :: functionalities/breakpoint/source_regexp/TestSourceRegexBreakpoints.py (2183 of 2474) PASS: lldb-unit :: Utility/./UtilityTests/StringListTest.CopyList (2184 of 2474) PASS: lldb-shell :: Reproducer/TestPythonImport.test (2185 of 2474) PASS: lldb-unit :: Utility/./UtilityTests/StreamTest.PutHex64ByteOrderBig (2186 of 2474) PASS: lldb-unit :: Utility/./UtilityTests/PassiveReplayTest.InstrumentedBar (2187 of 2474) PASS: lldb-unit :: Host/./HostTests/FileSystemTest.EmptyTest (2188 of 2474) PASS: lldb-api :: functionalities/dead-strip/TestDeadStrip.py (2189 of 2474) PASS: lldb-unit :: Host/./HostTests/FileActionTest.Open (2190 of 2474) PASS: lldb-api :: python_api/watchpoint/TestWatchpointIter.py (2191 of 2474) PASS: lldb-unit :: Language/Highlighting/./HighlighterTests/HighlighterTest.ClangTrailingBackslashWithWhitespace (2192 of 2474) UNSUPPORTED: lldb-api :: commands/gui/breakpoints/TestGuiBreakpoints.py (2193 of 2474) PASS: lldb-api :: commands/frame/diagnose/inheritance/TestDiagnoseInheritance.py (2194 of 2474) PASS: lldb-api :: commands/expression/import-std-module/deque-basic/TestDequeFromStdModule.py (2195 of 2474) PASS: lldb-unit :: Platform/./LLDBPlatformTests/PlatformAppleSimulatorTest.TestSimHasSimEnvionament (2196 of 2474) PASS: lldb-api :: commands/register/register/register_command/TestRegisters.py (2197 of 2474) PASS: lldb-unit :: Symbol/./SymbolTests/TestTypeSystemClang.TestDisplayNameEmpty (2198 of 2474) PASS: lldb-unit :: ScriptInterpreter/Python/./ScriptInterpreterPythonTests/PythonDataObjectsTest.TestPythonTupleValues (2199 of 2474) PASS: lldb-unit :: Host/./HostTests/MainLoopTest.ReadObject (2200 of 2474) PASS: lldb-unit :: Utility/./UtilityTests/RangeTest.Equal (2201 of 2474) PASS: lldb-unit :: Expression/./ExpressionTests/DWARFExpressionMockProcessTest.DW_OP_deref (2202 of 2474) PASS: lldb-api :: functionalities/tail_call_frames/thread_step_out_or_return/TestSteppingOutWithArtificialFrames.py (2203 of 2474) PASS: lldb-shell :: ObjectFile/ELF/section-permissions.yaml (2204 of 2474) PASS: lldb-api :: tools/lldb-vscode/attach/TestVSCode_attach.py (2205 of 2474) PASS: lldb-api :: functionalities/step-avoids-no-debug/TestStepNoDebug.py (2206 of 2474) PASS: lldb-unit :: Utility/./UtilityTests/StringListTest.ShiftStdString (2207 of 2474) PASS: lldb-api :: lang/cpp/pointer_to_member_type_depending_on_parent_size/TestPointerToMemberTypeDependingOnParentSize.py (2208 of 2474) PASS: lldb-unit :: Platform/Android/./AdbClientTests/AdbClientTest.CreateByDeviceId_ByEnvVar (2209 of 2474) UNSUPPORTED: lldb-shell :: ScriptInterpreter/Lua/lua-python.test (2210 of 2474) UNSUPPORTED: lldb-shell :: Subprocess/vfork-follow-child.test (2211 of 2474) PASS: lldb-api :: functionalities/data-formatter/language_category_updates/TestDataFormatterLanguageCategoryUpdates.py (2212 of 2474) PASS: lldb-shell :: SymbolFile/DWARF/x86/dwarf5-debug_line-file-index.s (2213 of 2474) UNSUPPORTED: lldb-shell :: SymbolFile/PDB/class-layout.test (2214 of 2474) PASS: lldb-api :: functionalities/reproducers/attach/TestReproducerAttach.py (2215 of 2474) PASS: lldb-unit :: Process/Utility/./ProcessUtilityTests/ProcSMapTests/LinuxProcSMapsTestFixture.ParseSMapRegions/3 (2216 of 2474) UNSUPPORTED: lldb-api :: arm/breakpoint-it/TestBreakpointIt.py (2217 of 2474) PASS: lldb-shell :: ObjectFile/ELF/PT_LOAD-overlap.yaml (2218 of 2474) PASS: lldb-unit :: Utility/./UtilityTests/StreamTeeTest.SetStreamAtIndexOverwrite (2219 of 2474) PASS: lldb-api :: lang/cpp/template-function/TestTemplateFunctions.py (2220 of 2474) PASS: lldb-unit :: Process/minidump/./LLDBMinidumpTests/MinidumpParserTest.GetMemoryRegionInfoLinuxMaps (2221 of 2474) PASS: lldb-unit :: Process/minidump/./LLDBMinidumpTests/MinidumpParserTest.GetThreadContext_x86_32 (2222 of 2474) PASS: lldb-shell :: ObjectFile/ELF/PT_LOAD.yaml (2223 of 2474) PASS: lldb-unit :: UnwindAssembly/x86/./UnwindAssemblyx86Tests/Testx86AssemblyInspectionEngine.TestPushECX (2224 of 2474) PASS: lldb-shell :: SymbolFile/Breakpad/stack-cfi-parsing.test (2225 of 2474) PASS: lldb-unit :: Utility/./UtilityTests/FileSpecTest.EqualDotsWindows (2226 of 2474) PASS: lldb-api :: lang/objcxx/cpp_keywords_enabled/TestObjCppKeywordsEnabled.py (2227 of 2474) PASS: lldb-shell :: Settings/TestSettingsSet.test (2228 of 2474) PASS: lldb-api :: functionalities/data-formatter/ostypeformatting/TestFormattersOsType.py (2229 of 2474) PASS: lldb-api :: functionalities/load_lazy/TestLoadUsingLazyBind.py (2230 of 2474) PASS: lldb-unit :: ObjectFile/ELF/./ObjectFileELFTests/ObjectFileELFTest.GetSymtab_NoSymEntryPointArmThumbAddressClass (2231 of 2474) PASS: lldb-unit :: Symbol/./SymbolTests/TestCreateClassTemplateDecl.FindExistingTemplatesWithParameterPack (2232 of 2474) PASS: lldb-unit :: Host/./HostTests/SocketTests/SocketTest.TCPListen0ConnectAccept/ipv4 (2233 of 2474) PASS: lldb-unit :: Process/gdb-remote/./ProcessGdbRemoteTests/GDBRemoteCommunicationClientTest.SendSignalsToIgnore (2234 of 2474) PASS: lldb-api :: functionalities/breakpoint/breakpoint_hit_count/TestBreakpointHitCount.py (2235 of 2474) PASS: lldb-shell :: SymbolFile/DWARF/x86/find-variable-dwo.cpp (2236 of 2474) UNSUPPORTED: lldb-api :: functionalities/asan/TestReportData.py (2237 of 2474) PASS: lldb-unit :: Utility/./UtilityTests/StringExtractorTest.GetNameColonValueSuccess (2238 of 2474) FAIL: lldb-api :: functionalities/scripted_process/TestScriptedProcess.py (2239 of 2474) ******************** TEST 'lldb-api :: functionalities/scripted_process/TestScriptedProcess.py' FAILED ******************** Script: -- /Users/buildslave/jenkins/workspace/lldb-cmake-sanitized/lldb-build/lldb-test-build.noindex/copied-python /Users/buildslave/jenkins/workspace/lldb-cmake-sanitized/llvm-project/lldb/test/API/dotest.py -u CXXFLAGS -u CFLAGS --codesign-identity lldb_codesign --arch x86_64 --build-dir /Users/buildslave/jenkins/workspace/lldb-cmake-sanitized/lldb-build/lldb-test-build.noindex -t --env TERM=vt100 --env LLVM_LIBS_DIR=/Users/buildslave/jenkins/workspace/lldb-cmake-sanitized/lldb-build/./lib --inferior-env ASAN_OPTIONS=detect_stack_use_after_return=1 --inferior-env DYLD_INSERT_LIBRARIES=/Users/buildslave/jenkins/workspace/lldb-cmake-sanitized/host-compiler/lib/clang/14.0.99/lib/darwin/libclang_rt.asan_osx_dynamic.dylib --arch x86_64 --build-dir /Users/buildslave/jenkins/workspace/lldb-cmake-sanitized/lldb-build/lldb-test-build.noindex --lldb-module-cache-dir /Users/buildslave/jenkins/workspace/lldb-cmake-sanitized/lldb-build/lldb-test-build.noindex/module-cache-lldb/lldb-api --clang-module-cache-dir /Users/buildslave/jenkins/workspace/lldb-cmake-sanitized/lldb-build/lldb-test-build.noindex/module-cache-clang/lldb-api --executable /Users/buildslave/jenkins/workspace/lldb-cmake-sanitized/lldb-build/./bin/lldb --compiler /Users/buildslave/jenkins/workspace/lldb-cmake-sanitized/host-compiler/bin/clang --dsymutil /Users/buildslave/jenkins/workspace/lldb-cmake-sanitized/lldb-build/./bin/dsymutil --llvm-tools-dir /Users/buildslave/jenkins/workspace/lldb-cmake-sanitized/lldb-build/./bin --lldb-libs-dir /Users/buildslave/jenkins/workspace/lldb-cmake-sanitized/lldb-build/./lib /Users/buildslave/jenkins/workspace/lldb-cmake-sanitized/llvm-project/lldb/test/API/functionalities/scripted_process -p TestScriptedProcess.py -- Exit Code: -6

Hide Details

Command Output (stdout): -- lldb version 14.0.99 (http://labmaster3.local/git/llvm-project.git revision 7eec832def5717b1bddb72c3b99c3df4f7a2f6da) clang revision 7eec832def5717b1bddb72c3b99c3df4f7a2f6da llvm revision 7eec832def5717b1bddb72c3b99c3df4f7a2f6da Name of the class that will manage the scripted process: 'stack_core_scripted_process.StackCoreScriptedProcess' Saving 69632 bytes of data for memory region at 0x7ffeefbef000

Hide Details

-- Command Output (stderr): -- ================================================================= ==71882==ERROR: AddressSanitizer: heap-use-after-free on address 0x6160002508a0 at pc 0x0001032adb30 bp 0x7000099decf0 sp 0x7000099de4b8 READ of size 512 at 0x6160002508a0 thread T6 #0 0x1032adb2f in __asan_memcpy+0x1af (libclang_rt.asan_osx_dynamic.dylib:x86_64+0x44b2f) #1 0x1133df858 in lldb_private::DataExtractor::CopyByteOrderedData(unsigned long long, unsigned long long, void*, unsigned long long, lldb::ByteOrder) const DataExtractor.cpp:742 #2 0x11396c5eb in lldb_private::ScriptedProcess::DoReadMemory(unsigned long long, void*, unsigned long, lldb_private::Status&) ScriptedProcess.cpp:237 #3 0x113204aac in lldb_private::Process::ReadMemoryFromInferior(unsigned long long, void*, unsigned long, lldb_private::Status&) Process.cpp:2047 #4 0x1131bcf1f in lldb_private::MemoryCache::Read(unsigned long long, void*, unsigned long, lldb_private::Status&) Memory.cpp:229 #5 0x113245f01 in lldb_private::RegisterContext::ReadRegisterValueFromMemory(lldb_private::RegisterInfo const*, unsigned long long, unsigned int, lldb_private::RegisterValue&) RegisterContext.cpp:343 #6 0x113257c26 in lldb_private::RegisterContextUnwind::ReadRegisterValueFromRegisterLocation(lldb_private::UnwindLLDB::RegisterLocation, lldb_private::RegisterInfo const*, lldb_private::RegisterValue&) RegisterContextUnwind.cpp:1138 #7 0x1132555b3 in lldb_private::RegisterContextUnwind::ReadGPRValue(lldb::RegisterKind, unsigned int, unsigned long long&) RegisterContextUnwind.cpp:2143 #8 0x113249d35 in lldb_private::RegisterContextUnwind::InitializeNonZerothFrame() RegisterContextUnwind.cpp:343 #9 0x1132470a0 in lldb_private::RegisterContextUnwind::RegisterContextUnwind(lldb_private::Thread&, std::__1::shared_ptr<lldb_private::RegisterContextUnwind> const&, lldb_private::SymbolContext&, unsigned int, lldb_private::UnwindLLDB&) RegisterContextUnwind.cpp:72 #10 0x1133a1c90 in lldb_private::UnwindLLDB::GetOneMoreFrame(lldb_private::ABI*) UnwindLLDB.cpp:128 #11 0x1133a08f9 in lldb_private::UnwindLLDB::AddOneMoreFrame(lldb_private::ABI*) UnwindLLDB.cpp:332 #12 0x1133a15c5 in lldb_private::UnwindLLDB::UpdateUnwindPlanForFirstFrameIfInvalid(lldb_private::ABI*) UnwindLLDB.cpp:305 #13 0x1133a045d in lldb_private::UnwindLLDB::AddFirstFrame() UnwindLLDB.cpp:99 #14 0x1133a374d in lldb_private::UnwindLLDB::DoGetFrameInfoAtIndex(unsigned int, unsigned long long&, unsigned long long&, bool&) UnwindLLDB.cpp:395 #15 0x11329238a in lldb_private::Unwind::GetFrameInfoAtIndex(unsigned int, unsigned long long&, unsigned long long&, bool&) Unwind.h:53 #16 0x11328ec4c in lldb_private::StackFrameList::GetFramesUpTo(unsigned int) StackFrameList.cpp:484 #17 0x11328cd47 in lldb_private::StackFrameList::ResetCurrentInlinedDepth() StackFrameList.cpp:86 #18 0x11332cba3 in lldb_private::Thread::ShouldStop(lldb_private::Event*) Thread.cpp:805 #19 0x1133463a8 in lldb_private::ThreadList::ShouldStop(lldb_private::Event*) ThreadList.cpp:330 #20 0x113212870 in lldb_private::Process::ShouldBroadcastEvent(lldb_private::Event*) Process.cpp:3405 #21 0x113209794 in lldb_private::Process::HandlePrivateEvent(std::__1::shared_ptr<lldb_private::Event>&) Process.cpp:3630 #22 0x1132144ea in lldb_private::Process::RunPrivateStateThread(bool) Process.cpp:3824 #23 0x113212e9d in lldb_private::Process::PrivateStateThread(void*) Process.cpp:3722 #24 0x112f727a0 in lldb_private::HostNativeThreadBase::ThreadCreateTrampoline(void*) HostNativeThreadBase.cpp:65 #25 0x7fff71d0b108 in _pthread_start+0x93 (libsystem_pthread.dylib:x86_64+0x6108) #26 0x7fff71d06b8a in thread_start+0xe (libsystem_pthread.dylib:x86_64+0x1b8a)

Hide Details

0x6160002508a0 is located 32 bytes inside of 545-byte region [0x616000250880,0x616000250aa1) freed by thread T6 here: #0 0x1032afbc9 in wrap_free+0xa9 (libclang_rt.asan_osx_dynamic.dylib:x86_64+0x46bc9) #1 0x103dafaf2 in frame_dealloc+0xa0 (Python:x86_64+0x2aaf2) #2 0x103d9ed2a in function_code_fastcall+0xf8 (Python:x86_64+0x19d2a) #3 0x103d9f624 in _PyObject_Call_Prepend+0x95 (Python:x86_64+0x1a624) #4 0x103d9e2d2 in _PyObject_FastCallDict+0x107 (Python:x86_64+0x192d2) #5 0x103d9f7d2 in _PyObject_CallFunctionVa+0xd0 (Python:x86_64+0x1a7d2) #6 0x103d9fa00 in PyObject_CallMethod+0xa8 (Python:x86_64+0x1aa00) #7 0x113b02fb0 in std::__1::shared_ptr<lldb_private::DataExtractor> lldb_private::ScriptedPythonInterface::Dispatch<std::__1::shared_ptr<lldb_private::DataExtractor>, unsigned long long, unsigned long>(llvm::StringRef, lldb_private::Status&, unsigned long long, unsigned long) ScriptedPythonInterface.h:93 #8 0x113b02404 in lldb_private::ScriptedProcessPythonInterface::ReadMemoryAtAddress(unsigned long long, unsigned long, lldb_private::Status&) ScriptedProcessPythonInterface.cpp:120 #9 0x11396c3c5 in lldb_private::ScriptedProcess::DoReadMemory(unsigned long long, void*, unsigned long, lldb_private::Status&) ScriptedProcess.cpp:232 #10 0x113204aac in lldb_private::Process::ReadMemoryFromInferior(unsigned long long, void*, unsigned long, lldb_private::Status&) Process.cpp:2047 #11 0x1131bcf1f in lldb_private::MemoryCache::Read(unsigned long long, void*, unsigned long, lldb_private::Status&) Memory.cpp:229 #12 0x113245f01 in lldb_private::RegisterContext::ReadRegisterValueFromMemory(lldb_private::RegisterInfo const*, unsigned long long, unsigned int, lldb_private::RegisterValue&) RegisterContext.cpp:343 #13 0x113257c26 in lldb_private::RegisterContextUnwind::ReadRegisterValueFromRegisterLocation(lldb_private::UnwindLLDB::RegisterLocation, lldb_private::RegisterInfo const*, lldb_private::RegisterValue&) RegisterContextUnwind.cpp:1138 #14 0x1132555b3 in lldb_private::RegisterContextUnwind::ReadGPRValue(lldb::RegisterKind, unsigned int, unsigned long long&) RegisterContextUnwind.cpp:2143 #15 0x113249d35 in lldb_private::RegisterContextUnwind::InitializeNonZerothFrame() RegisterContextUnwind.cpp:343 #16 0x1132470a0 in lldb_private::RegisterContextUnwind::RegisterContextUnwind(lldb_private::Thread&, std::__1::shared_ptr<lldb_private::RegisterContextUnwind> const&, lldb_private::SymbolContext&, unsigned int, lldb_private::UnwindLLDB&) RegisterContextUnwind.cpp:72 #17 0x1133a1c90 in lldb_private::UnwindLLDB::GetOneMoreFrame(lldb_private::ABI*) UnwindLLDB.cpp:128 #18 0x1133a08f9 in lldb_private::UnwindLLDB::AddOneMoreFrame(lldb_private::ABI*) UnwindLLDB.cpp:332 #19 0x1133a15c5 in lldb_private::UnwindLLDB::UpdateUnwindPlanForFirstFrameIfInvalid(lldb_private::ABI*) UnwindLLDB.cpp:305 #20 0x1133a045d in lldb_private::UnwindLLDB::AddFirstFrame() UnwindLLDB.cpp:99 #21 0x1133a374d in lldb_private::UnwindLLDB::DoGetFrameInfoAtIndex(unsigned int, unsigned long long&, unsigned long long&, bool&) UnwindLLDB.cpp:395 #22 0x11329238a in lldb_private::Unwind::GetFrameInfoAtIndex(unsigned int, unsigned long long&, unsigned long long&, bool&) Unwind.h:53 #23 0x11328ec4c in lldb_private::StackFrameList::GetFramesUpTo(unsigned int) StackFrameList.cpp:484 #24 0x11328cd47 in lldb_private::StackFrameList::ResetCurrentInlinedDepth() StackFrameList.cpp:86 #25 0x11332cba3 in lldb_private::Thread::ShouldStop(lldb_private::Event*) Thread.cpp:805 #26 0x1133463a8 in lldb_private::ThreadList::ShouldStop(lldb_private::Event*) ThreadList.cpp:330 #27 0x113212870 in lldb_private::Process::ShouldBroadcastEvent(lldb_private::Event*) Process.cpp:3405 #28 0x113209794 in lldb_private::Process::HandlePrivateEvent(std::__1::shared_ptr<lldb_private::Event>&) Process.cpp:3630 #29 0x1132144ea in lldb_private::Process::RunPrivateStateThread(bool) Process.cpp:3824

Hide Details

previously allocated by thread T6 here: #0 0x1032afa80 in wrap_malloc+0xa0 (libclang_rt.asan_osx_dynamic.dylib:x86_64+0x46a80) #1 0x103dcd28b in _PyObject_Malloc+0x37 (Python:x86_64+0x4828b) #2 0x103d96ecc in _PyBytes_FromSize+0x63 (Python:x86_64+0x11ecc) #3 0x103d96e09 in PyBytes_FromStringAndSize+0x3d (Python:x86_64+0x11e09) #4 0x113ab49c7 in lldb_private::python::PythonBytes::PythonBytes(unsigned char const*, unsigned long) PythonDataObjects.cpp:290 #5 0x112b3bb41 in _wrap_SBProcess_ReadMemory(_object*, _object*) LLDBWrapPython.cpp:45781 #6 0x103d9f226 in _PyMethodDef_RawFastCallKeywords+0xeb (Python:x86_64+0x1a226) #7 0x103d9e8c6 in _PyCFunction_FastCallKeywords+0x2b (Python:x86_64+0x198c6) #8 0x103e34905 in call_function+0x1de (Python:x86_64+0xaf905) #9 0x103e2d5ee in _PyEval_EvalFrameDefault+0x1b51 (Python:x86_64+0xa85ee) #10 0x103d9eca1 in function_code_fastcall+0x6f (Python:x86_64+0x19ca1) #11 0x103e3497d in call_function+0x256 (Python:x86_64+0xaf97d) #12 0x103e2d5d5 in _PyEval_EvalFrameDefault+0x1b38 (Python:x86_64+0xa85d5) #13 0x103d9eca1 in function_code_fastcall+0x6f (Python:x86_64+0x19ca1) #14 0x103d9f624 in _PyObject_Call_Prepend+0x95 (Python:x86_64+0x1a624) #15 0x103d9e2d2 in _PyObject_FastCallDict+0x107 (Python:x86_64+0x192d2) #16 0x103d9f7d2 in _PyObject_CallFunctionVa+0xd0 (Python:x86_64+0x1a7d2) #17 0x103d9fa00 in PyObject_CallMethod+0xa8 (Python:x86_64+0x1aa00) #18 0x113b02fb0 in std::__1::shared_ptr<lldb_private::DataExtractor> lldb_private::ScriptedPythonInterface::Dispatch<std::__1::shared_ptr<lldb_private::DataExtractor>, unsigned long long, unsigned long>(llvm::StringRef, lldb_private::Status&, unsigned long long, unsigned long) ScriptedPythonInterface.h:93 #19 0x113b02404 in lldb_private::ScriptedProcessPythonInterface::ReadMemoryAtAddress(unsigned long long, unsigned long, lldb_private::Status&) ScriptedProcessPythonInterface.cpp:120 #20 0x11396c3c5 in lldb_private::ScriptedProcess::DoReadMemory(unsigned long long, void*, unsigned long, lldb_private::Status&) ScriptedProcess.cpp:232 #21 0x113204aac in lldb_private::Process::ReadMemoryFromInferior(unsigned long long, void*, unsigned long, lldb_private::Status&) Process.cpp:2047 #22 0x1131bcf1f in lldb_private::MemoryCache::Read(unsigned long long, void*, unsigned long, lldb_private::Status&) Memory.cpp:229 #23 0x113245f01 in lldb_private::RegisterContext::ReadRegisterValueFromMemory(lldb_private::RegisterInfo const*, unsigned long long, unsigned int, lldb_private::RegisterValue&) RegisterContext.cpp:343 #24 0x113257c26 in lldb_private::RegisterContextUnwind::ReadRegisterValueFromRegisterLocation(lldb_private::UnwindLLDB::RegisterLocation, lldb_private::RegisterInfo const*, lldb_private::RegisterValue&) RegisterContextUnwind.cpp:1138 #25 0x1132555b3 in lldb_private::RegisterContextUnwind::ReadGPRValue(lldb::RegisterKind, unsigned int, unsigned long long&) RegisterContextUnwind.cpp:2143 #26 0x113249d35 in lldb_private::RegisterContextUnwind::InitializeNonZerothFrame() RegisterContextUnwind.cpp:343 #27 0x1132470a0 in lldb_private::RegisterContextUnwind::RegisterContextUnwind(lldb_private::Thread&, std::__1::shared_ptr<lldb_private::RegisterContextUnwind> const&, lldb_private::SymbolContext&, unsigned int, lldb_private::UnwindLLDB&) RegisterContextUnwind.cpp:72 #28 0x1133a1c90 in lldb_private::UnwindLLDB::GetOneMoreFrame(lldb_private::ABI*) UnwindLLDB.cpp:128 #29 0x1133a08f9 in lldb_private::UnwindLLDB::AddOneMoreFrame(lldb_private::ABI*) UnwindLLDB.cpp:332

Hide Details

Thread T6 created by T0 here: #0 0x1032a955c in wrap_pthread_create+0x5c (libclang_rt.asan_osx_dynamic.dylib:x86_64+0x4055c) #1 0x112f961d1 in lldb_private::ThreadLauncher::LaunchThread(llvm::StringRef, void* (*)(void*), void*, unsigned long) ThreadLauncher.cpp:65 #2 0x11320b71f in lldb_private::Process::StartPrivateStateThread(bool) Process.cpp:3501 #3 0x11320af1a in lldb_private::Process::Launch(lldb_private::ProcessLaunchInfo&) Process.cpp:2547 #4 0x1132eb6cb in lldb_private::Target::Launch(lldb_private::ProcessLaunchInfo&, lldb_private::Stream*) Target.cpp:3063 #5 0x1126bf740 in lldb::SBTarget::Launch(lldb::SBLaunchInfo&, lldb::SBError&) SBTarget.cpp:439 #6 0x112b7997a in _wrap_SBTarget_Launch(_object*, _object*) LLDBWrapPython.cpp:54084 #7 0x103d9ebda in PyCFunction_Call+0x140 (Python:x86_64+0x19bda) #8 0x103e2d9e2 in _PyEval_EvalFrameDefault+0x1f45 (Python:x86_64+0xa89e2) #9 0x103e352da in _PyEval_EvalCodeWithName+0x72a (Python:x86_64+0xb02da) #10 0x103d9e88b in _PyFunction_FastCallKeywords+0xe0 (Python:x86_64+0x1988b) #11 0x103e3497d in call_function+0x256 (Python:x86_64+0xaf97d) #12 0x103e2d5d5 in _PyEval_EvalFrameDefault+0x1b38 (Python:x86_64+0xa85d5) #13 0x103d9eca1 in function_code_fastcall+0x6f (Python:x86_64+0x19ca1) #14 0x103e2d905 in _PyEval_EvalFrameDefault+0x1e68 (Python:x86_64+0xa8905) #15 0x103e352da in _PyEval_EvalCodeWithName+0x72a (Python:x86_64+0xb02da) #16 0x103d9e4f4 in _PyFunction_FastCallDict+0x1b8 (Python:x86_64+0x194f4) #17 0x103e2d905 in _PyEval_EvalFrameDefault+0x1e68 (Python:x86_64+0xa8905) #18 0x103e352da in _PyEval_EvalCodeWithName+0x72a (Python:x86_64+0xb02da) #19 0x103d9e88b in _PyFunction_FastCallKeywords+0xe0 (Python:x86_64+0x1988b) #20 0x103e3497d in call_function+0x256 (Python:x86_64+0xaf97d) #21 0x103e2d68c in _PyEval_EvalFrameDefault+0x1bef (Python:x86_64+0xa868c) #22 0x103e352da in _PyEval_EvalCodeWithName+0x72a (Python:x86_64+0xb02da) #23 0x103d9e88b in _PyFunction_FastCallKeywords+0xe0 (Python:x86_64+0x1988b) #24 0x103e3497d in call_function+0x256 (Python:x86_64+0xaf97d) #25 0x103e2d68c in _PyEval_EvalFrameDefault+0x1bef (Python:x86_64+0xa868c) #26 0x103d9eca1 in function_code_fastcall+0x6f (Python:x86_64+0x19ca1) #27 0x103e3497d in call_function+0x256 (Python:x86_64+0xaf97d) #28 0x103e2d5d5 in _PyEval_EvalFrameDefault+0x1b38 (Python:x86_64+0xa85d5) #29 0x103e352da in _PyEval_EvalCodeWithName+0x72a (Python:x86_64+0xb02da) #30 0x103d9e4f4 in _PyFunction_FastCallDict+0x1b8 (Python:x86_64+0x194f4) #31 0x103d9f624 in _PyObject_Call_Prepend+0x95 (Python:x86_64+0x1a624) #32 0x103d9e9d4 in PyObject_Call+0x87 (Python:x86_64+0x199d4) #33 0x103e2d905 in _PyEval_EvalFrameDefault+0x1e68 (Python:x86_64+0xa8905) #34 0x103e352da in _PyEval_EvalCodeWithName+0x72a (Python:x86_64+0xb02da) #35 0x103d9e4f4 in _PyFunction_FastCallDict+0x1b8 (Python:x86_64+0x194f4) #36 0x103d9f624 in _PyObject_Call_Prepend+0x95 (Python:x86_64+0x1a624) #37 0x103ddc4af in slot_tp_call+0x46 (Python:x86_64+0x574af) #38 0x103d9e72c in _PyObject_FastCallKeywords+0x166 (Python:x86_64+0x1972c) #39 0x103e34976 in call_function+0x24f (Python:x86_64+0xaf976) #40 0x103e2d68c in _PyEval_EvalFrameDefault+0x1bef (Python:x86_64+0xa868c) #41 0x103e352da in _PyEval_EvalCodeWithName+0x72a (Python:x86_64+0xb02da) #42 0x103d9e88b in _PyFunction_FastCallKeywords+0xe0 (Python:x86_64+0x1988b) #43 0x103e3497d in call_function+0x256 (Python:x86_64+0xaf97d) #44 0x103e2d5d5 in _PyEval_EvalFrameDefault+0x1b38 (Python:x86_64+0xa85d5) #45 0x103e352da in _PyEval_EvalCodeWithName+0x72a (Python:x86_64+0xb02da) #46 0x103d9e88b in _PyFunction_FastCallKeywords+0xe0 (Python:x86_64+0x1988b) #47 0x103e3497d in call_function+0x256 (Python:x86_64+0xaf97d) #48 0x103e2d5d5 in _PyEval_EvalFrameDefault+0x1b38 (Python:x86_64+0xa85d5) #49 0x103d9eca1 in function_code_fastcall+0x6f (Python:x86_64+0x19ca1) #50 0x103d9f624 in _PyObject_Call_Prepend+0x95 (Python:x86_64+0x1a624) #51 0x103d9e9d4 in PyObject_Call+0x87 (Python:x86_64+0x199d4) #52 0x103e2d905 in _PyEval_EvalFrameDefault+0x1e68 (Python:x86_64+0xa8905) #53 0x103e352da in _PyEval_EvalCodeWithName+0x72a (Python:x86_64+0xb02da) #54 0x103d9e4f4 in _PyFunction_FastCallDict+0x1b8 (Python:x86_64+0x194f4) #55 0x103d9f624 in _PyObject_Call_Prepend+0x95 (Python:x86_64+0x1a624) #56 0x103ddc4af in slot_tp_call+0x46 (Python:x86_64+0x574af) #57 0x103d9e72c in _PyObject_FastCallKeywords+0x166 (Python:x86_64+0x1972c) #58 0x103e34976 in call_function+0x24f (Python:x86_64+0xaf976) #59 0x103e2d68c in _PyEval_EvalFrameDefault+0x1bef (Python:x86_64+0xa868c) #60 0x103d9eca1 in function_code_fastcall+0x6f (Python:x86_64+0x19ca1) #61 0x103e3497d in call_function+0x256 (Python:x86_64+0xaf97d) #62 0x103e2d5d5 in _PyEval_EvalFrameDefault+0x1b38 (Python:x86_64+0xa85d5) #63 0x103d9eca1 in function_code_fastcall+0x6f (Python:x86_64+0x19ca1) #64 0x103e3497d in call_function+0x256 (Python:x86_64+0xaf97d) #65 0x103e2d5ee in _PyEval_EvalFrameDefault+0x1b51 (Python:x86_64+0xa85ee) #66 0x103e352da in _PyEval_EvalCodeWithName+0x72a (Python:x86_64+0xb02da) #67 0x103e2ba14 in PyEval_EvalCode+0x29 (Python:x86_64+0xa6a14) #68 0x103e5a2aa in run_mod+0x35 (Python:x86_64+0xd52aa) #69 0x103e592c5 in PyRun_FileExFlags+0xa3 (Python:x86_64+0xd42c5) #70 0x103e589a4 in PyRun_SimpleFileExFlags+0x114 (Python:x86_64+0xd39a4) #71 0x103e70010 in pymain_main+0x13de (Python:x86_64+0xeb010) #72 0x103e707b7 in _Py_UnixMain+0x67 (Python:x86_64+0xeb7b7) #73 0x7fff71b02cc8 in start+0x0 (libdyld.dylib:x86_64+0x1acc8)

Hide Details

SUMMARY: AddressSanitizer: heap-use-after-free (libclang_rt.asan_osx_dynamic.dylib:x86_64+0x44b2f) in __asan_memcpy+0x1af Shadow bytes around the buggy address: 0x1c2c0004a0c0: fd fd fd fd fd fd fd fd fd fd fd fd fd fd fd fd 0x1c2c0004a0d0: fd fd fd fd fd fd fd fd fd fd fd fd fd fd fd fd 0x1c2c0004a0e0: fd fd fd fd fd fd fd fd fd fd fd fd fd fd fd fd 0x1c2c0004a0f0: fd fd fd fd fd fd fd fd fa fa fa fa fa fa fa fa 0x1c2c0004a100: fa fa fa fa fa fa fa fa fa fa fa fa fa fa fa fa =>0x1c2c0004a110: fd fd fd fd[fd]fd fd fd fd fd fd fd fd fd fd fd 0x1c2c0004a120: fd fd fd fd fd fd fd fd fd fd fd fd fd fd fd fd 0x1c2c0004a130: fd fd fd fd fd fd fd fd fd fd fd fd fd fd fd fd 0x1c2c0004a140: fd fd fd fd fd fd fd fd fd fd fd fd fd fd fd fd 0x1c2c0004a150: fd fd fd fd fd fa fa fa fa fa fa fa fa fa fa fa 0x1c2c0004a160: fa fa fa fa fa fa fa fa fa fa fa fa fa fa fa fa Shadow byte legend (one shadow byte represents 8 application bytes): Addressable: 00 Partially addressable: 01 02 03 04 05 06 07 Heap left redzone: fa Freed heap region: fd Stack left redzone: f1 Stack mid redzone: f2 Stack right redzone: f3 Stack after return: f5 Stack use after scope: f8 Global redzone: f9 Global init order: f6 Poisoned by user: f7 Container overflow: fc Array cookie: ac Intra object redzone: bb ASan internal: fe Left alloca redzone: ca Right alloca redzone: cb ==71882==ABORTING Fatal Python error: Aborted

Hide Details

Thread 0x000000011202fdc0 (most recent call first): File "/Users/buildslave/jenkins/workspace/lldb-cmake-sanitized/lldb-build/lib/python3.7/site-packages/lldb/__init__.py", line 10301 in Launch File "/Users/buildslave/jenkins/workspace/lldb-cmake-sanitized/llvm-project/lldb/test/API/functionalities/scripted_process/TestScriptedProcess.py", line 149 in test_launch_scripted_process_stack_frames File "/Users/buildslave/jenkins/workspace/lldb-cmake-sanitized/llvm-project/lldb/packages/Python/lldbsuite/test/decorators.py", line 149 in wrapper File "/Users/buildslave/jenkins/workspace/lldb-cmake-sanitized/llvm-project/lldb/packages/Python/lldbsuite/test/decorators.py", line 149 in wrapper File "/Users/buildslave/jenkins/workspace/lldb-cmake-sanitized/llvm-project/lldb/packages/Python/lldbsuite/test/lldbtest.py", line 1715 in test_method File "/Users/buildslave/jenkins/workspace/lldb-cmake-sanitized/llvm-project/lldb/third_party/Python/module/unittest2/unittest2/case.py", line 413 in runMethod File "/Users/buildslave/jenkins/workspace/lldb-cmake-sanitized/llvm-project/lldb/third_party/Python/module/unittest2/unittest2/case.py", line 383 in run File "/Users/buildslave/jenkins/workspace/lldb-cmake-sanitized/llvm-project/lldb/third_party/Python/module/unittest2/unittest2/case.py", line 458 in __call__ File "/Users/buildslave/jenkins/workspace/lldb-cmake-sanitized/llvm-project/lldb/third_party/Python/module/unittest2/unittest2/suite.py", line 117 in _wrapped_run File "/Users/buildslave/jenkins/workspace/lldb-cmake-sanitized/llvm-project/lldb/third_party/Python/module/unittest2/unittest2/suite.py", line 115 in _wrapped_run File "/Users/buildslave/jenkins/workspace/lldb-cmake-sanitized/llvm-project/lldb/third_party/Python/module/unittest2/unittest2/suite.py", line 85 in run File "/Users/buildslave/jenkins/workspace/lldb-cmake-sanitized/llvm-project/lldb/third_party/Python/module/unittest2/unittest2/suite.py", line 66 in __call__ File "/Users/buildslave/jenkins/workspace/lldb-cmake-sanitized/llvm-project/lldb/third_party/Python/module/unittest2/unittest2/runner.py", line 165 in run File "/Users/buildslave/jenkins/workspace/lldb-cmake-sanitized/llvm-project/lldb/packages/Python/lldbsuite/test/dotest.py", line 996 in run_suite File "/Users/buildslave/jenkins/workspace/lldb-cmake-sanitized/llvm-project/lldb/test/API/dotest.py", line 7 in <module>

Hide Details

--

Hide Details

******************** PASS: lldb-api :: commands/command/script/import/rdar-12586188/TestRdar12586188.py (2240 of 2474) PASS: lldb-shell :: Register/x86-multithread-write.test (2241 of 2474) PASS: lldb-unit :: Utility/./UtilityTests/FileSpecTest.Yaml (2242 of 2474) PASS: lldb-api :: commands/expression/issue_11588/Test11588.py (2243 of 2474) PASS: lldb-unit :: Core/./LLDBCoreTests/DumpDataExtractorTest.ItemByteSizeErrors (2244 of 2474) PASS: lldb-unit :: SymbolFile/NativePDB/./SymbolFileNativePDBTests/PDBFPOProgramToDWARFExpressionTests.InvalidOpUnary (2245 of 2474) PASS: lldb-api :: functionalities/data-formatter/synthupdate/TestSyntheticFilterRecompute.py (2246 of 2474) PASS: lldb-shell :: SymbolFile/DWARF/x86/debug_rnglists.s (2247 of 2474) PASS: lldb-unit :: Utility/./UtilityTests/FileSpecTest.FormatFileSpec (2248 of 2474) PASS: lldb-api :: commands/expression/ir-interpreter-phi-nodes/TestIRInterpreterPHINodes.py (2249 of 2474) PASS: lldb-unit :: Utility/./UtilityTests/StreamTest.PutHex16ByteOrderLittle (2250 of 2474) UNSUPPORTED: lldb-shell :: SymbolFile/PDB/calling-conventions.test (2251 of 2474) PASS: lldb-api :: lang/objc/objc-stepping/TestObjCStepping.py (2252 of 2474) PASS: lldb-shell :: Register/Core/x86-64-linux-fp.test (2253 of 2474) PASS: lldb-unit :: ScriptInterpreter/Python/./ScriptInterpreterPythonTests/PythonDataObjectsTest.TestPythonTupleSize (2254 of 2474) PASS: lldb-unit :: Utility/./UtilityTests/RegisterValueTest.GetSet8 (2255 of 2474) PASS: lldb-unit :: Utility/./UtilityTests/StreamTest.PutNHex8 (2256 of 2474) PASS: lldb-api :: lang/cpp/unique-types/TestUniqueTypes.py (2257 of 2474) PASS: lldb-shell :: Quit/TestQuitExitCode-30.test (2258 of 2474) PASS: lldb-unit :: Utility/./UtilityTests/StringListTest.Assignment (2259 of 2474) PASS: lldb-unit :: Utility/./UtilityTests/StreamTest.PutHex64ByteOrderLittle (2260 of 2474) PASS: lldb-shell :: Reproducer/TestVersionCheck.test (2261 of 2474) PASS: lldb-api :: commands/expression/po_verbosity/TestPoVerbosity.py (2262 of 2474) PASS: lldb-api :: lang/cpp/exceptions/TestCPPExceptionBreakpoints.py (2263 of 2474) UNSUPPORTED: lldb-api :: commands/register/register/aarch64_sve_registers/rw_access_static_config/TestSVERegisters.py (2264 of 2474) PASS: lldb-unit :: Utility/./UtilityTests/StringExtractorTest.DecodeHexU8_Underflow (2265 of 2474) PASS: lldb-api :: lang/cpp/gmodules-templates/TestGModules.py (2266 of 2474) PASS: lldb-api :: lang/cpp/non-type-template-param/TestCppNonTypeTemplateParam.py (2267 of 2474) PASS: lldb-unit :: Process/gdb-remote/./ProcessGdbRemoteTests/GDBRemoteClientBaseTest.SendContinueAndAsyncSignal (2268 of 2474) PASS: lldb-api :: lang/objc/objc-foundation-dictionary-empty/TestNSDictionary0.py (2269 of 2474) PASS: lldb-unit :: Utility/./UtilityTests/RangeTest.Union (2270 of 2474) PASS: lldb-unit :: Utility/./UtilityTests/RecordReplayTest.InstrumentedBarRef (2271 of 2474) PASS: lldb-unit :: Language/Highlighting/./HighlighterTests/HighlighterTest.ClangStringLiterals (2272 of 2474) PASS: lldb-api :: commands/expression/call-throws/TestCallThatThrows.py (2273 of 2474) PASS: lldb-unit :: SymbolFile/NativePDB/./SymbolFileNativePDBTests/PDBFPOProgramToDWARFExpressionTests.InvalidAssignmentMultiple (2274 of 2474) PASS: lldb-api :: functionalities/reproducers/fs-case-sensitivity/TestReproducerFSCaseSensitivity.py (2275 of 2474) PASS: lldb-unit :: Utility/./UtilityTests/StringExtractorTest.GetHexU8_InvalidHex (2276 of 2474) PASS: lldb-api :: tools/lldb-vscode/console/TestVSCode_redirection_to_console.py (2277 of 2474) PASS: lldb-shell :: ObjectFile/PECOFF/uuid.yaml (2278 of 2474) PASS: lldb-api :: functionalities/thread/concurrent_events/TestConcurrentCrashWithBreak.py (2279 of 2474) PASS: lldb-unit :: Symbol/./SymbolTests/TestTypeSystemMap.GetTypeSystemForLanguageWithNoTarget (2280 of 2474) PASS: lldb-api :: commands/gui/invalid-args/TestInvalidArgsGui.py (2281 of 2474) PASS: lldb-api :: python_api/interpreter/TestRunCommandInterpreterAPI.py (2282 of 2474) PASS: lldb-unit :: Host/./HostTests/SocketTests/SocketTest.DomainListenConnectAccept/ipv4 (2283 of 2474) PASS: lldb-api :: lang/cpp/dynamic-value-same-basename/TestDynamicValueSameBase.py (2284 of 2474) UNSUPPORTED: lldb-api :: tools/lldb-server/TestGdbRemoteAuxvSupport.py (2285 of 2474) PASS: lldb-unit :: Host/./HostTests/TerminalTest.SetParityCheck (2286 of 2474) PASS: lldb-unit :: Utility/./UtilityTests/OptionsWithRawTest.QuotedSuffix (2287 of 2474) PASS: lldb-api :: macosx/builtin-debugtrap/TestBuiltinDebugTrap.py (2288 of 2474) PASS: lldb-unit :: Utility/./UtilityTests/UriParserTest.BracketedHostnameWithColon (2289 of 2474) PASS: lldb-unit :: Core/./LLDBCoreTests/MangledTest.NameIndexes_FindFunctionSymbols (2290 of 2474) PASS: lldb-unit :: Utility/./UtilityTests/RegisterValueTest.GetScalarValue (2291 of 2474) PASS: lldb-unit :: Utility/./UtilityTests/ScalarTest.SetValueFromCString (2292 of 2474) PASS: lldb-unit :: Utility/./UtilityTests/StringLexerTest.Next (2293 of 2474) UNSUPPORTED: lldb-shell :: Reproducer/TestLuaImport.test (2294 of 2474) PASS: lldb-unit :: Utility/./UtilityTests/RegularExpression.CopyAssignment (2295 of 2474) UNSUPPORTED: lldb-api :: commands/expression/completion-crash-invalid-iterator/TestInvalidIteratorCompletionCrash.py (2296 of 2474) PASS: lldb-shell :: SymbolFile/DWARF/x86/find-basic-variable.cpp (2297 of 2474) PASS: lldb-shell :: Reproducer/TestWorkingDir.test (2298 of 2474) PASS: lldb-api :: functionalities/breakpoint/step_over_breakpoint/TestStepOverBreakpoint.py (2299 of 2474) PASS: lldb-shell :: Commands/command-thread-select.test (2300 of 2474) PASS: lldb-api :: tools/lldb-server/TestGdbRemote_vCont.py (2301 of 2474) PASS: lldb-unit :: Utility/./UtilityTests/StringListTest.GetMaxStringLengthMixed (2302 of 2474) PASS: lldb-unit :: Utility/./UtilityTests/ScalarTest.Scalar_512 (2303 of 2474) PASS: lldb-unit :: UnwindAssembly/x86/./UnwindAssemblyx86Tests/Testx86AssemblyInspectionEngine.TestAddRSP (2304 of 2474) PASS: lldb-api :: functionalities/breakpoint/breakpoint_options/TestBreakpointOptions.py (2305 of 2474) PASS: lldb-api :: macosx/stack-corefile/TestStackCorefile.py (2306 of 2474) PASS: lldb-unit :: Utility/./UtilityTests/ArgsTest.GetShellSafeArgument (2307 of 2474) PASS: lldb-api :: commands/expression/radar_9531204/TestPrintfAfterUp.py (2308 of 2474) PASS: lldb-api :: commands/statistics/basic/TestStats.py (2309 of 2474) UNSUPPORTED: lldb-shell :: Subprocess/clone-follow-parent-softbp.test (2310 of 2474) PASS: lldb-api :: functionalities/breakpoint/breakpoint_names/TestBreakpointNames.py (2311 of 2474) PASS: lldb-api :: commands/expression/import-std-module/forward_decl_from_module/TestForwardDeclFromStdModule.py (2312 of 2474) PASS: lldb-shell :: Reproducer/TestVerify.test (2313 of 2474) PASS: lldb-unit :: Process/minidump/./LLDBMinidumpTests/MinidumpParserTest.MinidumpDuplicateModuleSeparateCode (2314 of 2474) PASS: lldb-api :: lang/cpp/signed_types/TestSignedTypes.py (2315 of 2474) PASS: lldb-unit :: Utility/./UtilityTests/XcodeSDKTest.SDKSupportsSwift (2316 of 2474) PASS: lldb-unit :: Utility/./UtilityTests/DataExtractorTest.GetBitfield (2317 of 2474) PASS: lldb-unit :: Utility/./UtilityTests/FileSpecTest.RemoveLastPathComponent (2318 of 2474) UNSUPPORTED: lldb-shell :: Subprocess/fork-follow-parent-softbp.test (2319 of 2474) PASS: lldb-shell :: SymbolFile/DWARF/x86/static_scope.s (2320 of 2474) PASS: lldb-unit :: Host/./HostTests/SocketTests/SocketTest.TCPGetAddress/ipv4 (2321 of 2474) UNSUPPORTED: lldb-api :: linux/thread/create_during_instruction_step/TestCreateDuringInstructionStep.py (2322 of 2474) PASS: lldb-unit :: Utility/./UtilityTests/RangeTest.ContainsRange (2323 of 2474) PASS: lldb-shell :: SymbolFile/DWARF/x86/debug-types-line-tables.s (2324 of 2474) PASS: lldb-shell :: Quit/TestQuitExitCodeImplicit0.test (2325 of 2474) PASS: lldb-unit :: Process/minidump/./LLDBMinidumpTests/MinidumpParserTest.FindMemoryRangeWithFullMemoryMinidump (2326 of 2474) PASS: lldb-api :: lang/objc/radar-9691614/TestObjCMethodReturningBOOL.py (2327 of 2474) PASS: lldb-unit :: Utility/./UtilityTests/BinaryStreamTest.PutSLEB128FourBytes (2328 of 2474) PASS: lldb-unit :: UnwindAssembly/x86/./UnwindAssemblyx86Tests/Testx86AssemblyInspectionEngine.TestPush0 (2329 of 2474) PASS: lldb-unit :: Platform/./LLDBPlatformTests/PlatformDarwinTest.GetCompatibleArchARMv7em (2330 of 2474) PASS: lldb-unit :: Utility/./UtilityTests/StringExtractorTest.GetU64LittleEndian (2331 of 2474) PASS: lldb-unit :: Utility/./UtilityTests/EnvironmentTest.EnvpConversion (2332 of 2474) PASS: lldb-unit :: Utility/./UtilityTests/SerializationRountripTest.SerializeDeserializePodReferences (2333 of 2474) PASS: lldb-unit :: Utility/./UtilityTests/Flags.Clear (2334 of 2474) PASS: lldb-unit :: Utility/./UtilityTests/StringExtractorTest.GetHexBytesAvail_Partial (2335 of 2474) PASS: lldb-api :: functionalities/type_lookup/TestTypeLookup.py (2336 of 2474) PASS: lldb-api :: functionalities/pointer_num_children/TestPointerNumChildren.py (2337 of 2474) UNSUPPORTED: lldb-shell :: Register/x86-gp-read.test (2338 of 2474) PASS: lldb-api :: functionalities/inferior-changed/TestInferiorChanged.py (2339 of 2474) UNSUPPORTED: lldb-api :: linux/mix-dwo-and-regular-objects/TestMixedDwarfBinary.py (2340 of 2474) PASS: lldb-unit :: Utility/./UtilityTests/UriParserTest.BracketedHostnameWithPortIPv4 (2341 of 2474) PASS: lldb-api :: lang/cpp/subst_template_type_param/TestSubstTemplateTypeParam.py (2342 of 2474) PASS: lldb-shell :: Driver/TestSingleQuote.test (2343 of 2474) PASS: lldb-api :: functionalities/limit-debug-info/TestLimitDebugInfo.py (2344 of 2474) UNSUPPORTED: lldb-api :: commands/expression/macros/TestMacros.py (2345 of 2474) PASS: lldb-api :: lang/objc/forward-decl/TestForwardDecl.py (2346 of 2474) PASS: lldb-api :: commands/expression/import-std-module/vector-dbg-info-content/TestDbgInfoContentVectorFromStdModule.py (2347 of 2474) XFAIL: lldb-shell :: SymbolFile/DWARF/find-type-in-function.cpp (2348 of 2474) PASS: lldb-shell :: Register/Core/x86-64-netbsd-gp.test (2349 of 2474) PASS: lldb-shell :: Register/Core/x86-32-linux-addr.test (2350 of 2474) PASS: lldb-unit :: SymbolFile/DWARF/./SymbolFileDWARFTests/SymbolFileDWARFTests.TestAbbrevOrder1Start5 (2351 of 2474) PASS: lldb-api :: functionalities/signal/raise/TestRaise.py (2352 of 2474) PASS: lldb-unit :: ObjectFile/Breakpad/./ObjectFileBreakpadTests/FuncRecord.parse (2353 of 2474) PASS: lldb-unit :: Utility/./UtilityTests/RangeTest.NotEqual (2354 of 2474) PASS: lldb-unit :: Host/./HostTests/SocketAddressTest.GetAddressInfo (2355 of 2474) PASS: lldb-unit :: Host/./HostTests/File.GetWaitableHandleFileno (2356 of 2474) UNSUPPORTED: lldb-shell :: SymbolFile/NativePDB/local-variables.cpp (2357 of 2474) PASS: lldb-api :: functionalities/data-formatter/data-formatter-globals/TestDataFormatterGlobals.py (2358 of 2474) PASS: lldb-unit :: ScriptInterpreter/Python/./ScriptInterpreterPythonTests/PythonDataObjectsTest.TestTypeNameResolutionNoDot (2359 of 2474) PASS: lldb-unit :: Utility/./UtilityTests/Flags.AllSet (2360 of 2474) PASS: lldb-api :: tools/lldb-server/TestGdbRemoteThreadsInStopReply.py (2361 of 2474) PASS: lldb-unit :: Utility/./UtilityTests/RangeTest.SetRangeBase (2362 of 2474) PASS: lldb-unit :: Utility/./UtilityTests/StreamTest.SetIndentLevel (2363 of 2474) PASS: lldb-unit :: ObjectFile/PECOFF/./ObjectFilePECOFFTests/PECallFrameInfoTest.Chained_eh (2364 of 2474) UNSUPPORTED: lldb-shell :: Watchpoint/netbsd-nouserdbregs.test (2365 of 2474) PASS: lldb-unit :: Core/./LLDBCoreTests/DumpDataExtractorTest.MultiLine (2366 of 2474) PASS: lldb-unit :: ObjectFile/Breakpad/./ObjectFileBreakpadTests/StackCFIRecord.parse (2367 of 2474) PASS: lldb-api :: functionalities/abbreviation/TestCommonShortSpellings.py (2368 of 2474) PASS: lldb-unit :: Utility/./UtilityTests/GeneratorTest.YamlMultiProvider (2369 of 2474) PASS: lldb-api :: lang/objcxx/conflicting-names-class-update-utility-expr/TestObjCConflictingNamesForClassUpdateExpr.py (2370 of 2474) PASS: lldb-unit :: Utility/./UtilityTests/ArgsTest.TestAppendArg (2371 of 2474) UNSUPPORTED: lldb-api :: functionalities/breakpoint/breakpoint_in_delayslot/TestAvoidBreakpointInDelaySlot.py (2372 of 2474) UNSUPPORTED: lldb-shell :: Expr/TestIRMemoryMapWindows.test (2373 of 2474) PASS: lldb-api :: functionalities/thread/backtrace_all/TestBacktraceAll.py (2374 of 2474) PASS: lldb-api :: commands/expression/import_base_class_when_class_has_derived_member/TestImportBaseClassWhenClassHasDerivedMember.py (2375 of 2474) PASS: lldb-unit :: Utility/./UtilityTests/GeneratorTest.Get (2376 of 2474) PASS: lldb-unit :: Utility/./UtilityTests/SubsystemRAIITest.NormalSubsystem (2377 of 2474) PASS: lldb-api :: functionalities/memory/tag/TestMemoryTag.py (2378 of 2474) PASS: lldb-api :: macosx/duplicate-archive-members/TestDuplicateMembers.py (2379 of 2474) PASS: lldb-api :: tools/lldb-vscode/console/TestVSCode_console.py (2380 of 2474) PASS: lldb-api :: functionalities/data-formatter/data-formatter-stl/libcxx/unique_ptr/TestDataFormatterLibcxxUniquePtr.py (2381 of 2474) PASS: lldb-shell :: ObjectFile/MachO/lc_build_version.yaml (2382 of 2474) PASS: lldb-api :: lang/cpp/stl/TestStdCXXDisassembly.py (2383 of 2474) PASS: lldb-api :: tools/lldb-server/TestGdbRemoteExpeditedRegisters.py (2384 of 2474) UNSUPPORTED: lldb-shell :: Register/x86-64-gp-write.test (2385 of 2474) PASS: lldb-api :: functionalities/breakpoint/breakpoint_command/TestBreakpointCommand.py (2386 of 2474) PASS: lldb-api :: lang/cpp/template-arguments/TestCppTemplateArguments.py (2387 of 2474) PASS: lldb-api :: functionalities/thread/concurrent_events/TestConcurrentTwoBreakpointThreads.py (2388 of 2474) PASS: lldb-unit :: Core/./LLDBCoreTests/DumpDataExtractorTest.FormatCharArray (2389 of 2474) PASS: lldb-unit :: Utility/./UtilityTests/DataExtractorTest.GetMaxU64 (2390 of 2474) UNSUPPORTED: lldb-api :: functionalities/longjmp/TestLongjmp.py (2391 of 2474) PASS: lldb-unit :: Utility/./UtilityTests/StringExtractorTest.InitEmpty (2392 of 2474) UNSUPPORTED: lldb-shell :: Register/x86-ymm-write.test (2393 of 2474) PASS: lldb-api :: macosx/indirect_symbol/TestIndirectSymbols.py (2394 of 2474) PASS: lldb-shell :: SymbolFile/DWARF/x86/dwarf5_locations.s (2395 of 2474) PASS: lldb-unit :: Host/./HostTests/NativeProcessProtocolTest.SetBreakpointFailWrite (2396 of 2474) PASS: lldb-unit :: Utility/./UtilityTests/UriParserTest.PortOverflow (2397 of 2474) PASS: lldb-unit :: Utility/./UtilityTests/StringListTest.JoinSingle (2398 of 2474) PASS: lldb-shell :: SymbolFile/DWARF/x86/dwarf5-implicit-const.s (2399 of 2474) PASS: lldb-unit :: Core/./LLDBCoreTests/UniqueCStringMap.NoDefaultConstructor (2400 of 2474) PASS: lldb-unit :: Utility/./UtilityTests/StringListTest.AppendListCStringArray (2401 of 2474) UNSUPPORTED: lldb-shell :: Subprocess/fork-follow-child-softbp.test (2402 of 2474) PASS: lldb-shell :: ObjectFile/ELF/null-jmprel.yaml (2403 of 2474) PASS: lldb-unit :: Host/./HostTests/NativeProcessProtocolTest.SetBreakpointFailVerify (2404 of 2474) PASS: lldb-shell :: Breakpoint/debug_addrx.test (2405 of 2474) PASS: lldb-api :: commands/expression/import-std-module/shared_ptr/TestSharedPtrFromStdModule.py (2406 of 2474) PASS: lldb-api :: commands/expression/regression-access-function-template-in-record/TestRegressionAccessFunctionTemplateInRecord.py (2407 of 2474) PASS: lldb-unit :: Symbol/./SymbolTests/TestTypeSystemClang.TestGetTypeClassTypeOf (2408 of 2474) PASS: lldb-api :: functionalities/data-formatter/vector-types/TestVectorTypesFormatting.py (2409 of 2474) PASS: lldb-unit :: Utility/./UtilityTests/ScalarTest.LongLongAssigmentOperator (2410 of 2474) PASS: lldb-unit :: Host/./HostTests/MainLoopTest.TwoSignalCallbacks (2411 of 2474) PASS: lldb-unit :: Utility/./UtilityTests/VMRange.CollectionContains (2412 of 2474) PASS: lldb-unit :: Process/Utility/./ProcessUtilityTests/MemoryTagManagerAArch64MTETest.PackTags (2413 of 2474) UNSUPPORTED: lldb-api :: commands/expression/multiline-completion/TestMultilineCompletion.py (2414 of 2474) PASS: lldb-api :: functionalities/tail_call_frames/ambiguous_tail_call_seq1/TestAmbiguousTailCallSeq1.py (2415 of 2474) PASS: lldb-unit :: Process/gdb-remote/./ProcessGdbRemoteTests/GDBRemoteCommunicationClientTest.WriteRegister (2416 of 2474) PASS: lldb-unit :: Utility/./UtilityTests/ArchSpecTest.MergeFromMachOUnknown (2417 of 2474) UNSUPPORTED: lldb-shell :: SymbolFile/PDB/pointers.test (2418 of 2474) PASS: lldb-api :: commands/expression/static-initializers/TestStaticInitializers.py (2419 of 2474) UNSUPPORTED: lldb-shell :: Subprocess/clone-follow-parent-wp.test (2420 of 2474) PASS: lldb-api :: functionalities/data-formatter/nsarraysynth/TestNSArraySynthetic.py (2421 of 2474) PASS: lldb-unit :: Utility/./UtilityTests/StringExtractorTest.InitMisc (2422 of 2474) PASS: lldb-api :: lang/cpp/constructors/TestCppConstructors.py (2423 of 2474) PASS: lldb-unit :: Utility/./UtilityTests/StreamTest.AddressSuffix (2424 of 2474) PASS: lldb-api :: python_api/disassemble-raw-data/TestDisassembleRawData.py (2425 of 2474) PASS: lldb-api :: functionalities/multiword-commands/TestMultiWordCommands.py (2426 of 2474) PASS: lldb-shell :: BuildScript/compiler-full-path.test (2427 of 2474) PASS: lldb-unit :: Utility/./UtilityTests/ArgsTest.BareSingleQuote (2428 of 2474) PASS: lldb-shell :: SymbolFile/DWARF/x86/DW_AT_data_bit_offset-DW_OP_stack_value.s (2429 of 2474) UNSUPPORTED: lldb-shell :: SymbolFile/PDB/func-symbols.test (2430 of 2474) PASS: lldb-unit :: Utility/./UtilityTests/UriParserTest.Empty (2431 of 2474) PASS: lldb-api :: functionalities/data-formatter/type_summary_list_script/TestTypeSummaryListScript.py (2432 of 2474) PASS: lldb-unit :: Expression/./ExpressionTests/DiagnosticManagerTest.PutString (2433 of 2474) PASS: lldb-unit :: tools/lldb-server/tests/./LLDBServerTests/TestBase.LaunchModePreservesEnvironment (2434 of 2474) PASS: lldb-unit :: Utility/./UtilityTests/TimerTest.CategoryTimesStats (2435 of 2474) PASS: lldb-shell :: SymbolFile/DWARF/x86/debug_loclists-dwo.s (2436 of 2474) PASS: lldb-api :: lang/c/record_decl_in_expr/TestRecordDeclInExpr.py (2437 of 2474) PASS: lldb-unit :: Process/minidump/./LLDBMinidumpTests/MinidumpParserTest.GetMiscInfo_no_stream (2438 of 2474) PASS: lldb-api :: commands/frame/diagnose/local-variable/TestLocalVariable.py (2439 of 2474) PASS: lldb-shell :: Minidump/no-process-id.yaml (2440 of 2474) PASS: lldb-unit :: Utility/./UtilityTests/ConstStringTest.format_provider (2441 of 2474) PASS: lldb-unit :: Language/Highlighting/./HighlighterTests/HighlighterTest.Colons (2442 of 2474) PASS: lldb-api :: commands/command/source/TestCommandSource.py (2443 of 2474) PASS: lldb-unit :: Utility/./UtilityTests/OptionsWithRawTest.SingleWordSuffix (2444 of 2474) PASS: lldb-unit :: Utility/./UtilityTests/StringExtractorTest.GetHexU8_Underflow_NoEof (2445 of 2474) PASS: lldb-shell :: Breakpoint/debug_rnglist_rlestartend.test (2446 of 2474) PASS: lldb-shell :: ScriptInterpreter/Python/python.test (2447 of 2474) PASS: lldb-shell :: ObjectFile/wasm/unified-debug-sections.yaml (2448 of 2474) UNSUPPORTED: lldb-api :: functionalities/disassemble/aarch64-adrp-add/TestAArch64AdrpAdd.py (2449 of 2474) PASS: lldb-unit :: Symbol/./SymbolTests/TestTypeSystemClang.TestGetBasicTypeFromName (2450 of 2474) PASS: lldb-unit :: Language/Highlighting/./HighlighterTests/HighlighterTest.ClangIdentifiers (2451 of 2474) PASS: lldb-api :: commands/expression/test/TestExprs2.py (2452 of 2474) PASS: lldb-unit :: Utility/./UtilityTests/FileSpecTest.FileAndDirectoryComponents (2453 of 2474) PASS: lldb-unit :: Utility/./UtilityTests/SerializationRountripTest.SerializeDeserializeObjectPointer (2454 of 2474) PASS: lldb-unit :: Target/./TargetTests/PathMappingListTest.RemapRoot (2455 of 2474) UNSUPPORTED: lldb-api :: functionalities/data-formatter/data-formatter-stl/libstdcpp/unique_ptr/TestDataFormatterStdUniquePtr.py (2456 of 2474) PASS: lldb-api :: commands/watchpoints/watchpoint_commands/condition/TestWatchpointConditionCmd.py (2457 of 2474) PASS: lldb-api :: api/multiple-debuggers/TestMultipleDebuggers.py (2458 of 2474) PASS: lldb-api :: functionalities/thread/concurrent_events/TestConcurrentWatchpointDelayWatchpointOneBreakpoint.py (2459 of 2474) PASS: lldb-unit :: Utility/./UtilityTests/VMRange.Ordering (2460 of 2474) PASS: lldb-unit :: Language/Highlighting/./HighlighterTests/HighlighterTest.DefaultHighlighterWithCursorOutOfBounds (2461 of 2474) PASS: lldb-unit :: UnwindAssembly/x86/./UnwindAssemblyx86Tests/Testx86AssemblyInspectionEngine.TestSimplex86_64Augmented (2462 of 2474) PASS: lldb-unit :: Symbol/./SymbolTests/TestClangASTImporter.DeportDeclTagDecl (2463 of 2474) PASS: lldb-unit :: SymbolFile/DWARF/./SymbolFileDWARFTests/DWARFUnitTest.ClangProducer (2464 of 2474) PASS: lldb-unit :: Utility/./UtilityTests/RangeVector.CombineConsecutiveRanges (2465 of 2474) PASS: lldb-unit :: Process/gdb-remote/./ProcessGdbRemoteTests/GDBRemoteCommunicationClientTest.GetModulesInfo (2466 of 2474) PASS: lldb-unit :: Utility/./UtilityTests/StringExtractorTest.GetNameColonValueNoColon (2467 of 2474) UNSUPPORTED: lldb-shell :: Subprocess/clone-follow-child-wp.test (2468 of 2474) PASS: lldb-unit :: Process/minidump/./LLDBMinidumpTests/MinidumpParserTest.GetThreadContext_x86_64 (2469 of 2474) PASS: lldb-unit :: Process/minidump/./LLDBMinidumpTests/MinidumpParserTest.FindMemoryRange (2470 of 2474) PASS: lldb-unit :: Utility/./UtilityTests/UriParserTest.TypicalPortPathIPv6 (2471 of 2474) PASS: lldb-api :: functionalities/data-formatter/data-formatter-cpp/TestDataFormatterCpp.py (2472 of 2474) PASS: lldb-api :: functionalities/thread/concurrent_events/TestConcurrentTwoWatchpointsOneBreakpoint.py (2473 of 2474) PASS: lldb-api :: lang/objc/objc-new-syntax/TestObjCNewSyntaxDictionary.py (2474 of 2474) Slowest Tests: -------------------------------------------------------------------------- 271.49s: lldb-api :: tools/lldb-server/TestLldbGdbServer.py 204.62s: lldb-api :: functionalities/scripted_process/TestScriptedProcess.py 177.67s: lldb-api :: functionalities/memory-region/TestMemoryRegion.py 169.82s: lldb-api :: macosx/stack-corefile/TestStackCorefile.py 138.21s: lldb-api :: macosx/skinny-corefile/TestSkinnyCorefile.py 137.75s: lldb-api :: api/multithreaded/TestMultithreaded.py 103.51s: lldb-api :: lang/objc/foundation/TestRuntimeTypes.py 98.44s: lldb-api :: functionalities/thread/exit_during_break/TestExitDuringBreak.py 94.10s: lldb-api :: functionalities/tail_call_frames/cross_object/TestCrossObjectTailCalls.py 93.16s: lldb-api :: sample_test/TestSampleInlineTest.py 93.09s: lldb-api :: python_api/value/empty_class/TestValueAPIEmptyClass.py 91.56s: lldb-api :: functionalities/gdb_remote_client/TestWasm.py 87.82s: lldb-api :: types/TestLongTypesExpr.py 86.71s: lldb-api :: lang/c/stepping/TestStepAndBreakpoints.py 82.57s: lldb-api :: lang/objc/objc-property/TestObjCProperty.py 74.86s: lldb-api :: commands/expression/import-std-module/vector/TestVectorFromStdModule.py 70.84s: lldb-api :: commands/process/attach/TestProcessAttach.py 69.15s: lldb-api :: commands/expression/import-std-module/queue/TestQueueFromStdModule.py 69.03s: lldb-api :: lang/objc/exceptions/TestObjCExceptions.py 68.94s: lldb-api :: commands/expression/import-std-module/stack/TestStackFromStdModule.py

Hide Details

Tests Times: -------------------------------------------------------------------------- [ Range ] :: [ Percentage ] :: [ Count ] -------------------------------------------------------------------------- [260s,280s) :: [ ] :: [ 1/2474] [240s,260s) :: [ ] :: [ 0/2474] [220s,240s) :: [ ] :: [ 0/2474] [200s,220s) :: [ ] :: [ 1/2474] [180s,200s) :: [ ] :: [ 1/2474] [160s,180s) :: [ ] :: [ 1/2474] [140s,160s) :: [ ] :: [ 2/2474] [120s,140s) :: [ ] :: [ 0/2474] [100s,120s) :: [ ] :: [ 2/2474] [ 80s,100s) :: [ ] :: [ 7/2474] [ 60s, 80s) :: [ ] :: [ 10/2474] [ 40s, 60s) :: [ ] :: [ 14/2474] [ 20s, 40s) :: [* ] :: [ 79/2474] [ 0s, 20s) :: [************************************** ] :: [2356/2474] -------------------------------------------------------------------------- ******************** Failed Tests (9): lldb-api :: functionalities/scripted_process/TestScriptedProcess.py lldb-api :: functionalities/tail_call_frames/cross_object/TestCrossObjectTailCalls.py lldb-api :: functionalities/thread/exit_during_break/TestExitDuringBreak.py lldb-api :: lang/c/stepping/TestStepAndBreakpoints.py lldb-api :: lang/objc/foundation/TestRuntimeTypes.py lldb-api :: lang/objc/objc-property/TestObjCProperty.py lldb-api :: python_api/value/empty_class/TestValueAPIEmptyClass.py lldb-api :: sample_test/TestSampleInlineTest.py lldb-api :: tools/lldb-vscode/breakpoint/TestVSCode_setExceptionBreakpoints.py

Hide Details

Hide Details

Testing Time: 2850.59s Unsupported : 232 Passed : 2223 Expectedly Failed: 10 Failed : 9 FAILED: tools/lldb/test/CMakeFiles/check-lldb cd /Users/buildslave/jenkins/workspace/lldb-cmake-sanitized/lldb-build/tools/lldb/test && /usr/local/Frameworks/Python.framework/Versions/3.7/bin/python3.7 /Users/buildslave/jenkins/workspace/lldb-cmake-sanitized/lldb-build/./bin/llvm-lit -v --time-tests --shuffle --xunit-xml-output=/Users/buildslave/jenkins/workspace/lldb-cmake-sanitized/test/results.xml -v -j 4 --timeout 1200 /Users/buildslave/jenkins/workspace/lldb-cmake-sanitized/lldb-build/tools/lldb/test ninja: build stopped: subcommand failed. Command failed: Command '['/usr/bin/env', 'TERM=vt100', '/usr/local/bin/ninja', '-v', 'check-lldb']' returned non-zero exit status 1. Command: ['/usr/bin/env', 'TERM=vt100', '/usr/local/bin/ninja', '-v', 'check-lldb'] [Pipeline] } [Pipeline] // timeout [Pipeline] } [Pipeline] // stage [Pipeline] stage [Pipeline] { (Declarative: Post Actions) [Pipeline] scanForIssues [Clang] Sleeping for 5 seconds due to JENKINS-32191... [Clang] Parsing console log (workspace: '/Users/buildslave/jenkins/workspace/lldb-cmake-sanitized') [Clang] -> found 0 issues (skipped 0 duplicates) [Clang] Parsing console log (workspace: '/Users/buildslave/jenkins/workspace/lldb-cmake-sanitized') [Clang] -> found 0 issues (skipped 0 duplicates) [Clang] Successfully parsed console log [Clang] -> found 0 issues (skipped 0 duplicates) [Clang] Parsing console log (workspace: '/Users/buildslave/jenkins/workspace/lldb-cmake-sanitized') [Clang] Skipping post processing [Clang] No filter has been set, publishing all 0 issues [Clang] Repository miner is not configured, skipping repository mining [Pipeline] junit Recording test results [Checks API] No suitable checks publisher found. [Pipeline] } [Pipeline] // stage [Pipeline] } [Pipeline] // withEnv [Pipeline] } [Pipeline] // node [Pipeline] End of Pipeline ERROR: script returned exit code 1 Finished: FAILURE