Console Output

Skipping 2,518 KB.. Full Log
PASS: lldb-api :: functionalities/inferior-crashing/recursive-inferior/TestRecursiveInferiorStep.py (1178 of 2474)
UNSUPPORTED: lldb-shell :: SymbolFile/PDB/type-quals.test (1179 of 2474)
PASS: lldb-unit :: Core/./LLDBCoreTests/DumpDataExtractorTest.Formats (1180 of 2474)
PASS: lldb-api :: lang/c/register_variables/TestRegisterVariables.py (1181 of 2474)
PASS: lldb-shell :: SymbolFile/DWARF/x86/DW_OP_piece-struct.s (1182 of 2474)
PASS: lldb-unit :: Utility/./UtilityTests/FileSpecTest.IsRelative (1183 of 2474)
PASS: lldb-api :: python_api/watchpoint/watchlocation/TestTargetWatchAddress.py (1184 of 2474)
PASS: lldb-shell :: Minidump/breakpad-symbols.test (1185 of 2474)
PASS: lldb-api :: lang/cpp/const_this/TestConstThis.py (1186 of 2474)
PASS: lldb-unit :: Host/./HostTests/SocketTests/SocketTest.TCPGetAddress/ipv4 (1187 of 2474)
PASS: lldb-shell :: Subprocess/fork-follow-parent-wp.test (1188 of 2474)
UNSUPPORTED: lldb-shell :: Register/x86-zmm-write.test (1189 of 2474)
UNSUPPORTED: lldb-api :: functionalities/thread/break_after_join/TestBreakAfterJoin.py (1190 of 2474)
PASS: lldb-api :: lang/cpp/thread_local/TestThreadLocal.py (1191 of 2474)
PASS: lldb-api :: commands/expression/formatters/TestFormatters.py (1192 of 2474)
PASS: lldb-unit :: Symbol/./SymbolTests/TestTypeSystemClang.TestGetEnumIntegerTypeUnexpectedType (1193 of 2474)
PASS: lldb-unit :: Utility/./UtilityTests/StreamTest.PutBytesAsRawHex8ToLittleEndian (1194 of 2474)
UNSUPPORTED: lldb-api :: functionalities/gdb_remote_client/TestWasm.py (1195 of 2474)
PASS: lldb-unit :: ScriptInterpreter/Python/./ScriptInterpreterPythonTests/PythonDataObjectsTest.TestObjectAttributes (1196 of 2474)
PASS: lldb-shell :: Process/UnsupportedLanguage.test (1197 of 2474)
PASS: lldb-api :: lang/cpp/template-specialization-type/TestTemplateSpecializationType.py (1198 of 2474)
PASS: lldb-api :: functionalities/data-formatter/type_summary_list_script/TestTypeSummaryListScript.py (1199 of 2474)
PASS: lldb-api :: commands/expression/argument_passing_restrictions/TestArgumentPassingRestrictions.py (1200 of 2474)
PASS: lldb-unit :: Process/./ProcessEventDataTests/ProcessEventDataTest.DoOnRemoval (1201 of 2474)
PASS: lldb-shell :: ObjectFile/wasm/stripped-debug-sections.yaml (1202 of 2474)
PASS: lldb-api :: commands/expression/anonymous-struct/TestCallUserAnonTypedef.py (1203 of 2474)
PASS: lldb-api :: lang/objc/modules-app-update/TestClangModulesAppUpdate.py (1204 of 2474)
PASS: lldb-api :: iohandler/resize/TestIOHandlerResizeNoEditline.py (1205 of 2474)
PASS: lldb-unit :: Host/./HostTests/SocketTests/SocketTest.TCPListen0GetPort/ipv6 (1206 of 2474)
PASS: lldb-api :: types/TestCharType.py (1207 of 2474)
PASS: lldb-api :: commands/watchpoints/watchpoint_commands/TestWatchpointCommands.py (1208 of 2474)
PASS: lldb-api :: lang/c/cpp_keyword_identifiers/TestCppKeywordsAsCIdentifiers.py (1209 of 2474)
PASS: lldb-shell :: ObjectFile/ELF/avr-basic-info.yaml (1210 of 2474)
PASS: lldb-unit :: Process/gdb-remote/./ProcessGdbRemoteTests/GDBRemoteCommunicationClientTest.WriteRegister (1211 of 2474)
PASS: lldb-unit :: Host/./HostTests/File.GetWaitableHandleFileno (1212 of 2474)
FAIL: lldb-api :: functionalities/scripted_process/TestScriptedProcess.py (1213 of 2474)
******************** TEST 'lldb-api :: functionalities/scripted_process/TestScriptedProcess.py' FAILED ********************
Script:
--
/Users/buildslave/jenkins/workspace/lldb-cmake-sanitized/lldb-build/lldb-test-build.noindex/copied-python /Users/buildslave/jenkins/workspace/lldb-cmake-sanitized/llvm-project/lldb/test/API/dotest.py -u CXXFLAGS -u CFLAGS --codesign-identity lldb_codesign --arch x86_64 --build-dir /Users/buildslave/jenkins/workspace/lldb-cmake-sanitized/lldb-build/lldb-test-build.noindex -t --env TERM=vt100 --env LLVM_LIBS_DIR=/Users/buildslave/jenkins/workspace/lldb-cmake-sanitized/lldb-build/./lib --inferior-env ASAN_OPTIONS=detect_stack_use_after_return=1 --inferior-env DYLD_INSERT_LIBRARIES=/Users/buildslave/jenkins/workspace/lldb-cmake-sanitized/host-compiler/lib/clang/14.0.99/lib/darwin/libclang_rt.asan_osx_dynamic.dylib --arch x86_64 --build-dir /Users/buildslave/jenkins/workspace/lldb-cmake-sanitized/lldb-build/lldb-test-build.noindex --lldb-module-cache-dir /Users/buildslave/jenkins/workspace/lldb-cmake-sanitized/lldb-build/lldb-test-build.noindex/module-cache-lldb/lldb-api --clang-module-cache-dir /Users/buildslave/jenkins/workspace/lldb-cmake-sanitized/lldb-build/lldb-test-build.noindex/module-cache-clang/lldb-api --executable /Users/buildslave/jenkins/workspace/lldb-cmake-sanitized/lldb-build/./bin/lldb --compiler /Users/buildslave/jenkins/workspace/lldb-cmake-sanitized/host-compiler/bin/clang --dsymutil /Users/buildslave/jenkins/workspace/lldb-cmake-sanitized/lldb-build/./bin/dsymutil --llvm-tools-dir /Users/buildslave/jenkins/workspace/lldb-cmake-sanitized/lldb-build/./bin --lldb-libs-dir /Users/buildslave/jenkins/workspace/lldb-cmake-sanitized/lldb-build/./lib /Users/buildslave/jenkins/workspace/lldb-cmake-sanitized/llvm-project/lldb/test/API/functionalities/scripted_process -p TestScriptedProcess.py
--
Exit Code: -6

Hide Details

Command Output (stdout): -- lldb version 14.0.99 (http://labmaster3.local/git/llvm-project.git revision 1bd4dc4f2854edf3035732416ec7e4adbddaf982) clang revision 1bd4dc4f2854edf3035732416ec7e4adbddaf982 llvm revision 1bd4dc4f2854edf3035732416ec7e4adbddaf982 Name of the class that will manage the scripted process: 'stack_core_scripted_process.StackCoreScriptedProcess' Saving 69632 bytes of data for memory region at 0x7ffeefbef000

Hide Details

-- Command Output (stderr): -- ================================================================= ==32618==ERROR: AddressSanitizer: heap-use-after-free on address 0x6160002508a0 at pc 0x00010e7cba30 bp 0x700005006cf0 sp 0x7000050064b8 READ of size 512 at 0x6160002508a0 thread T6 #0 0x10e7cba2f in __asan_memcpy+0x1af (libclang_rt.asan_osx_dynamic.dylib:x86_64+0x44a2f) #1 0x11324a058 in lldb_private::DataExtractor::CopyByteOrderedData(unsigned long long, unsigned long long, void*, unsigned long long, lldb::ByteOrder) const DataExtractor.cpp:742 #2 0x1137d6deb in lldb_private::ScriptedProcess::DoReadMemory(unsigned long long, void*, unsigned long, lldb_private::Status&) ScriptedProcess.cpp:237 #3 0x11306f2ac in lldb_private::Process::ReadMemoryFromInferior(unsigned long long, void*, unsigned long, lldb_private::Status&) Process.cpp:2047 #4 0x11302771f in lldb_private::MemoryCache::Read(unsigned long long, void*, unsigned long, lldb_private::Status&) Memory.cpp:229 #5 0x1130b0701 in lldb_private::RegisterContext::ReadRegisterValueFromMemory(lldb_private::RegisterInfo const*, unsigned long long, unsigned int, lldb_private::RegisterValue&) RegisterContext.cpp:343 #6 0x1130c2426 in lldb_private::RegisterContextUnwind::ReadRegisterValueFromRegisterLocation(lldb_private::UnwindLLDB::RegisterLocation, lldb_private::RegisterInfo const*, lldb_private::RegisterValue&) RegisterContextUnwind.cpp:1138 #7 0x1130bfdb3 in lldb_private::RegisterContextUnwind::ReadGPRValue(lldb::RegisterKind, unsigned int, unsigned long long&) RegisterContextUnwind.cpp:2143 #8 0x1130b4535 in lldb_private::RegisterContextUnwind::InitializeNonZerothFrame() RegisterContextUnwind.cpp:343 #9 0x1130b18a0 in lldb_private::RegisterContextUnwind::RegisterContextUnwind(lldb_private::Thread&, std::__1::shared_ptr<lldb_private::RegisterContextUnwind> const&, lldb_private::SymbolContext&, unsigned int, lldb_private::UnwindLLDB&) RegisterContextUnwind.cpp:72 #10 0x11320c490 in lldb_private::UnwindLLDB::GetOneMoreFrame(lldb_private::ABI*) UnwindLLDB.cpp:128 #11 0x11320b0f9 in lldb_private::UnwindLLDB::AddOneMoreFrame(lldb_private::ABI*) UnwindLLDB.cpp:332 #12 0x11320bdc5 in lldb_private::UnwindLLDB::UpdateUnwindPlanForFirstFrameIfInvalid(lldb_private::ABI*) UnwindLLDB.cpp:305 #13 0x11320ac5d in lldb_private::UnwindLLDB::AddFirstFrame() UnwindLLDB.cpp:99 #14 0x11320df4d in lldb_private::UnwindLLDB::DoGetFrameInfoAtIndex(unsigned int, unsigned long long&, unsigned long long&, bool&) UnwindLLDB.cpp:395 #15 0x1130fcb8a in lldb_private::Unwind::GetFrameInfoAtIndex(unsigned int, unsigned long long&, unsigned long long&, bool&) Unwind.h:53 #16 0x1130f944c in lldb_private::StackFrameList::GetFramesUpTo(unsigned int) StackFrameList.cpp:484 #17 0x1130f7547 in lldb_private::StackFrameList::ResetCurrentInlinedDepth() StackFrameList.cpp:86 #18 0x1131973a3 in lldb_private::Thread::ShouldStop(lldb_private::Event*) Thread.cpp:805 #19 0x1131b0ba8 in lldb_private::ThreadList::ShouldStop(lldb_private::Event*) ThreadList.cpp:330 #20 0x11307d070 in lldb_private::Process::ShouldBroadcastEvent(lldb_private::Event*) Process.cpp:3405 #21 0x113073f94 in lldb_private::Process::HandlePrivateEvent(std::__1::shared_ptr<lldb_private::Event>&) Process.cpp:3630 #22 0x11307ecea in lldb_private::Process::RunPrivateStateThread(bool) Process.cpp:3824 #23 0x11307d69d in lldb_private::Process::PrivateStateThread(void*) Process.cpp:3722 #24 0x112ddcfa0 in lldb_private::HostNativeThreadBase::ThreadCreateTrampoline(void*) HostNativeThreadBase.cpp:65 #25 0x7fff71d0b108 in _pthread_start+0x93 (libsystem_pthread.dylib:x86_64+0x6108) #26 0x7fff71d06b8a in thread_start+0xe (libsystem_pthread.dylib:x86_64+0x1b8a)

Hide Details

0x6160002508a0 is located 32 bytes inside of 545-byte region [0x616000250880,0x616000250aa1) freed by thread T6 here: #0 0x10e7cdac9 in wrap_free+0xa9 (libclang_rt.asan_osx_dynamic.dylib:x86_64+0x46ac9) #1 0x10f2d2af2 in frame_dealloc+0xa0 (Python:x86_64+0x2aaf2) #2 0x10f2c1d2a in function_code_fastcall+0xf8 (Python:x86_64+0x19d2a) #3 0x10f2c2624 in _PyObject_Call_Prepend+0x95 (Python:x86_64+0x1a624) #4 0x10f2c12d2 in _PyObject_FastCallDict+0x107 (Python:x86_64+0x192d2) #5 0x10f2c27d2 in _PyObject_CallFunctionVa+0xd0 (Python:x86_64+0x1a7d2) #6 0x10f2c2a00 in PyObject_CallMethod+0xa8 (Python:x86_64+0x1aa00) #7 0x11396d7b0 in std::__1::shared_ptr<lldb_private::DataExtractor> lldb_private::ScriptedPythonInterface::Dispatch<std::__1::shared_ptr<lldb_private::DataExtractor>, unsigned long long, unsigned long>(llvm::StringRef, lldb_private::Status&, unsigned long long, unsigned long) ScriptedPythonInterface.h:93 #8 0x11396cc04 in lldb_private::ScriptedProcessPythonInterface::ReadMemoryAtAddress(unsigned long long, unsigned long, lldb_private::Status&) ScriptedProcessPythonInterface.cpp:120 #9 0x1137d6bc5 in lldb_private::ScriptedProcess::DoReadMemory(unsigned long long, void*, unsigned long, lldb_private::Status&) ScriptedProcess.cpp:232 #10 0x11306f2ac in lldb_private::Process::ReadMemoryFromInferior(unsigned long long, void*, unsigned long, lldb_private::Status&) Process.cpp:2047 #11 0x11302771f in lldb_private::MemoryCache::Read(unsigned long long, void*, unsigned long, lldb_private::Status&) Memory.cpp:229 #12 0x1130b0701 in lldb_private::RegisterContext::ReadRegisterValueFromMemory(lldb_private::RegisterInfo const*, unsigned long long, unsigned int, lldb_private::RegisterValue&) RegisterContext.cpp:343 #13 0x1130c2426 in lldb_private::RegisterContextUnwind::ReadRegisterValueFromRegisterLocation(lldb_private::UnwindLLDB::RegisterLocation, lldb_private::RegisterInfo const*, lldb_private::RegisterValue&) RegisterContextUnwind.cpp:1138 #14 0x1130bfdb3 in lldb_private::RegisterContextUnwind::ReadGPRValue(lldb::RegisterKind, unsigned int, unsigned long long&) RegisterContextUnwind.cpp:2143 #15 0x1130b4535 in lldb_private::RegisterContextUnwind::InitializeNonZerothFrame() RegisterContextUnwind.cpp:343 #16 0x1130b18a0 in lldb_private::RegisterContextUnwind::RegisterContextUnwind(lldb_private::Thread&, std::__1::shared_ptr<lldb_private::RegisterContextUnwind> const&, lldb_private::SymbolContext&, unsigned int, lldb_private::UnwindLLDB&) RegisterContextUnwind.cpp:72 #17 0x11320c490 in lldb_private::UnwindLLDB::GetOneMoreFrame(lldb_private::ABI*) UnwindLLDB.cpp:128 #18 0x11320b0f9 in lldb_private::UnwindLLDB::AddOneMoreFrame(lldb_private::ABI*) UnwindLLDB.cpp:332 #19 0x11320bdc5 in lldb_private::UnwindLLDB::UpdateUnwindPlanForFirstFrameIfInvalid(lldb_private::ABI*) UnwindLLDB.cpp:305 #20 0x11320ac5d in lldb_private::UnwindLLDB::AddFirstFrame() UnwindLLDB.cpp:99 #21 0x11320df4d in lldb_private::UnwindLLDB::DoGetFrameInfoAtIndex(unsigned int, unsigned long long&, unsigned long long&, bool&) UnwindLLDB.cpp:395 #22 0x1130fcb8a in lldb_private::Unwind::GetFrameInfoAtIndex(unsigned int, unsigned long long&, unsigned long long&, bool&) Unwind.h:53 #23 0x1130f944c in lldb_private::StackFrameList::GetFramesUpTo(unsigned int) StackFrameList.cpp:484 #24 0x1130f7547 in lldb_private::StackFrameList::ResetCurrentInlinedDepth() StackFrameList.cpp:86 #25 0x1131973a3 in lldb_private::Thread::ShouldStop(lldb_private::Event*) Thread.cpp:805 #26 0x1131b0ba8 in lldb_private::ThreadList::ShouldStop(lldb_private::Event*) ThreadList.cpp:330 #27 0x11307d070 in lldb_private::Process::ShouldBroadcastEvent(lldb_private::Event*) Process.cpp:3405 #28 0x113073f94 in lldb_private::Process::HandlePrivateEvent(std::__1::shared_ptr<lldb_private::Event>&) Process.cpp:3630 #29 0x11307ecea in lldb_private::Process::RunPrivateStateThread(bool) Process.cpp:3824

Hide Details

previously allocated by thread T6 here: #0 0x10e7cd980 in wrap_malloc+0xa0 (libclang_rt.asan_osx_dynamic.dylib:x86_64+0x46980) #1 0x10f2f028b in _PyObject_Malloc+0x37 (Python:x86_64+0x4828b) #2 0x10f2b9ecc in _PyBytes_FromSize+0x63 (Python:x86_64+0x11ecc) #3 0x10f2b9e09 in PyBytes_FromStringAndSize+0x3d (Python:x86_64+0x11e09) #4 0x11391f1c7 in lldb_private::python::PythonBytes::PythonBytes(unsigned char const*, unsigned long) PythonDataObjects.cpp:290 #5 0x1129a6341 in _wrap_SBProcess_ReadMemory(_object*, _object*) LLDBWrapPython.cpp:45781 #6 0x10f2c2226 in _PyMethodDef_RawFastCallKeywords+0xeb (Python:x86_64+0x1a226) #7 0x10f2c18c6 in _PyCFunction_FastCallKeywords+0x2b (Python:x86_64+0x198c6) #8 0x10f357905 in call_function+0x1de (Python:x86_64+0xaf905) #9 0x10f3505ee in _PyEval_EvalFrameDefault+0x1b51 (Python:x86_64+0xa85ee) #10 0x10f2c1ca1 in function_code_fastcall+0x6f (Python:x86_64+0x19ca1) #11 0x10f35797d in call_function+0x256 (Python:x86_64+0xaf97d) #12 0x10f3505d5 in _PyEval_EvalFrameDefault+0x1b38 (Python:x86_64+0xa85d5) #13 0x10f2c1ca1 in function_code_fastcall+0x6f (Python:x86_64+0x19ca1) #14 0x10f2c2624 in _PyObject_Call_Prepend+0x95 (Python:x86_64+0x1a624) #15 0x10f2c12d2 in _PyObject_FastCallDict+0x107 (Python:x86_64+0x192d2) #16 0x10f2c27d2 in _PyObject_CallFunctionVa+0xd0 (Python:x86_64+0x1a7d2) #17 0x10f2c2a00 in PyObject_CallMethod+0xa8 (Python:x86_64+0x1aa00) #18 0x11396d7b0 in std::__1::shared_ptr<lldb_private::DataExtractor> lldb_private::ScriptedPythonInterface::Dispatch<std::__1::shared_ptr<lldb_private::DataExtractor>, unsigned long long, unsigned long>(llvm::StringRef, lldb_private::Status&, unsigned long long, unsigned long) ScriptedPythonInterface.h:93 #19 0x11396cc04 in lldb_private::ScriptedProcessPythonInterface::ReadMemoryAtAddress(unsigned long long, unsigned long, lldb_private::Status&) ScriptedProcessPythonInterface.cpp:120 #20 0x1137d6bc5 in lldb_private::ScriptedProcess::DoReadMemory(unsigned long long, void*, unsigned long, lldb_private::Status&) ScriptedProcess.cpp:232 #21 0x11306f2ac in lldb_private::Process::ReadMemoryFromInferior(unsigned long long, void*, unsigned long, lldb_private::Status&) Process.cpp:2047 #22 0x11302771f in lldb_private::MemoryCache::Read(unsigned long long, void*, unsigned long, lldb_private::Status&) Memory.cpp:229 #23 0x1130b0701 in lldb_private::RegisterContext::ReadRegisterValueFromMemory(lldb_private::RegisterInfo const*, unsigned long long, unsigned int, lldb_private::RegisterValue&) RegisterContext.cpp:343 #24 0x1130c2426 in lldb_private::RegisterContextUnwind::ReadRegisterValueFromRegisterLocation(lldb_private::UnwindLLDB::RegisterLocation, lldb_private::RegisterInfo const*, lldb_private::RegisterValue&) RegisterContextUnwind.cpp:1138 #25 0x1130bfdb3 in lldb_private::RegisterContextUnwind::ReadGPRValue(lldb::RegisterKind, unsigned int, unsigned long long&) RegisterContextUnwind.cpp:2143 #26 0x1130b4535 in lldb_private::RegisterContextUnwind::InitializeNonZerothFrame() RegisterContextUnwind.cpp:343 #27 0x1130b18a0 in lldb_private::RegisterContextUnwind::RegisterContextUnwind(lldb_private::Thread&, std::__1::shared_ptr<lldb_private::RegisterContextUnwind> const&, lldb_private::SymbolContext&, unsigned int, lldb_private::UnwindLLDB&) RegisterContextUnwind.cpp:72 #28 0x11320c490 in lldb_private::UnwindLLDB::GetOneMoreFrame(lldb_private::ABI*) UnwindLLDB.cpp:128 #29 0x11320b0f9 in lldb_private::UnwindLLDB::AddOneMoreFrame(lldb_private::ABI*) UnwindLLDB.cpp:332

Hide Details

Thread T6 created by T0 here: #0 0x10e7c745c in wrap_pthread_create+0x5c (libclang_rt.asan_osx_dynamic.dylib:x86_64+0x4045c) #1 0x112e009d1 in lldb_private::ThreadLauncher::LaunchThread(llvm::StringRef, void* (*)(void*), void*, unsigned long) ThreadLauncher.cpp:65 #2 0x113075f1f in lldb_private::Process::StartPrivateStateThread(bool) Process.cpp:3501 #3 0x11307571a in lldb_private::Process::Launch(lldb_private::ProcessLaunchInfo&) Process.cpp:2547 #4 0x113155ecb in lldb_private::Target::Launch(lldb_private::ProcessLaunchInfo&, lldb_private::Stream*) Target.cpp:3063 #5 0x112529f40 in lldb::SBTarget::Launch(lldb::SBLaunchInfo&, lldb::SBError&) SBTarget.cpp:439 #6 0x1129e417a in _wrap_SBTarget_Launch(_object*, _object*) LLDBWrapPython.cpp:54084 #7 0x10f2c1bda in PyCFunction_Call+0x140 (Python:x86_64+0x19bda) #8 0x10f3509e2 in _PyEval_EvalFrameDefault+0x1f45 (Python:x86_64+0xa89e2) #9 0x10f3582da in _PyEval_EvalCodeWithName+0x72a (Python:x86_64+0xb02da) #10 0x10f2c188b in _PyFunction_FastCallKeywords+0xe0 (Python:x86_64+0x1988b) #11 0x10f35797d in call_function+0x256 (Python:x86_64+0xaf97d) #12 0x10f3505d5 in _PyEval_EvalFrameDefault+0x1b38 (Python:x86_64+0xa85d5) #13 0x10f2c1ca1 in function_code_fastcall+0x6f (Python:x86_64+0x19ca1) #14 0x10f350905 in _PyEval_EvalFrameDefault+0x1e68 (Python:x86_64+0xa8905) #15 0x10f3582da in _PyEval_EvalCodeWithName+0x72a (Python:x86_64+0xb02da) #16 0x10f2c14f4 in _PyFunction_FastCallDict+0x1b8 (Python:x86_64+0x194f4) #17 0x10f350905 in _PyEval_EvalFrameDefault+0x1e68 (Python:x86_64+0xa8905) #18 0x10f3582da in _PyEval_EvalCodeWithName+0x72a (Python:x86_64+0xb02da) #19 0x10f2c188b in _PyFunction_FastCallKeywords+0xe0 (Python:x86_64+0x1988b) #20 0x10f35797d in call_function+0x256 (Python:x86_64+0xaf97d) #21 0x10f35068c in _PyEval_EvalFrameDefault+0x1bef (Python:x86_64+0xa868c) #22 0x10f3582da in _PyEval_EvalCodeWithName+0x72a (Python:x86_64+0xb02da) #23 0x10f2c188b in _PyFunction_FastCallKeywords+0xe0 (Python:x86_64+0x1988b) #24 0x10f35797d in call_function+0x256 (Python:x86_64+0xaf97d) #25 0x10f35068c in _PyEval_EvalFrameDefault+0x1bef (Python:x86_64+0xa868c) #26 0x10f2c1ca1 in function_code_fastcall+0x6f (Python:x86_64+0x19ca1) #27 0x10f35797d in call_function+0x256 (Python:x86_64+0xaf97d) #28 0x10f3505d5 in _PyEval_EvalFrameDefault+0x1b38 (Python:x86_64+0xa85d5) #29 0x10f3582da in _PyEval_EvalCodeWithName+0x72a (Python:x86_64+0xb02da) #30 0x10f2c14f4 in _PyFunction_FastCallDict+0x1b8 (Python:x86_64+0x194f4) #31 0x10f2c2624 in _PyObject_Call_Prepend+0x95 (Python:x86_64+0x1a624) #32 0x10f2c19d4 in PyObject_Call+0x87 (Python:x86_64+0x199d4) #33 0x10f350905 in _PyEval_EvalFrameDefault+0x1e68 (Python:x86_64+0xa8905) #34 0x10f3582da in _PyEval_EvalCodeWithName+0x72a (Python:x86_64+0xb02da) #35 0x10f2c14f4 in _PyFunction_FastCallDict+0x1b8 (Python:x86_64+0x194f4) #36 0x10f2c2624 in _PyObject_Call_Prepend+0x95 (Python:x86_64+0x1a624) #37 0x10f2ff4af in slot_tp_call+0x46 (Python:x86_64+0x574af) #38 0x10f2c172c in _PyObject_FastCallKeywords+0x166 (Python:x86_64+0x1972c) #39 0x10f357976 in call_function+0x24f (Python:x86_64+0xaf976) #40 0x10f35068c in _PyEval_EvalFrameDefault+0x1bef (Python:x86_64+0xa868c) #41 0x10f3582da in _PyEval_EvalCodeWithName+0x72a (Python:x86_64+0xb02da) #42 0x10f2c188b in _PyFunction_FastCallKeywords+0xe0 (Python:x86_64+0x1988b) #43 0x10f35797d in call_function+0x256 (Python:x86_64+0xaf97d) #44 0x10f3505d5 in _PyEval_EvalFrameDefault+0x1b38 (Python:x86_64+0xa85d5) #45 0x10f3582da in _PyEval_EvalCodeWithName+0x72a (Python:x86_64+0xb02da) #46 0x10f2c188b in _PyFunction_FastCallKeywords+0xe0 (Python:x86_64+0x1988b) #47 0x10f35797d in call_function+0x256 (Python:x86_64+0xaf97d) #48 0x10f3505d5 in _PyEval_EvalFrameDefault+0x1b38 (Python:x86_64+0xa85d5) #49 0x10f2c1ca1 in function_code_fastcall+0x6f (Python:x86_64+0x19ca1) #50 0x10f2c2624 in _PyObject_Call_Prepend+0x95 (Python:x86_64+0x1a624) #51 0x10f2c19d4 in PyObject_Call+0x87 (Python:x86_64+0x199d4) #52 0x10f350905 in _PyEval_EvalFrameDefault+0x1e68 (Python:x86_64+0xa8905) #53 0x10f3582da in _PyEval_EvalCodeWithName+0x72a (Python:x86_64+0xb02da) #54 0x10f2c14f4 in _PyFunction_FastCallDict+0x1b8 (Python:x86_64+0x194f4) #55 0x10f2c2624 in _PyObject_Call_Prepend+0x95 (Python:x86_64+0x1a624) #56 0x10f2ff4af in slot_tp_call+0x46 (Python:x86_64+0x574af) #57 0x10f2c172c in _PyObject_FastCallKeywords+0x166 (Python:x86_64+0x1972c) #58 0x10f357976 in call_function+0x24f (Python:x86_64+0xaf976) #59 0x10f35068c in _PyEval_EvalFrameDefault+0x1bef (Python:x86_64+0xa868c) #60 0x10f2c1ca1 in function_code_fastcall+0x6f (Python:x86_64+0x19ca1) #61 0x10f35797d in call_function+0x256 (Python:x86_64+0xaf97d) #62 0x10f3505d5 in _PyEval_EvalFrameDefault+0x1b38 (Python:x86_64+0xa85d5) #63 0x10f2c1ca1 in function_code_fastcall+0x6f (Python:x86_64+0x19ca1) #64 0x10f35797d in call_function+0x256 (Python:x86_64+0xaf97d) #65 0x10f3505ee in _PyEval_EvalFrameDefault+0x1b51 (Python:x86_64+0xa85ee) #66 0x10f3582da in _PyEval_EvalCodeWithName+0x72a (Python:x86_64+0xb02da) #67 0x10f34ea14 in PyEval_EvalCode+0x29 (Python:x86_64+0xa6a14) #68 0x10f37d2aa in run_mod+0x35 (Python:x86_64+0xd52aa) #69 0x10f37c2c5 in PyRun_FileExFlags+0xa3 (Python:x86_64+0xd42c5) #70 0x10f37b9a4 in PyRun_SimpleFileExFlags+0x114 (Python:x86_64+0xd39a4) #71 0x10f393010 in pymain_main+0x13de (Python:x86_64+0xeb010) #72 0x10f3937b7 in _Py_UnixMain+0x67 (Python:x86_64+0xeb7b7) #73 0x7fff71b02cc8 in start+0x0 (libdyld.dylib:x86_64+0x1acc8)

Hide Details

SUMMARY: AddressSanitizer: heap-use-after-free (libclang_rt.asan_osx_dynamic.dylib:x86_64+0x44a2f) in __asan_memcpy+0x1af Shadow bytes around the buggy address: 0x1c2c0004a0c0: fd fd fd fd fd fd fd fd fd fd fd fd fd fd fd fd 0x1c2c0004a0d0: fd fd fd fd fd fd fd fd fd fd fd fd fd fd fd fd 0x1c2c0004a0e0: fd fd fd fd fd fd fd fd fd fd fd fd fd fd fd fd 0x1c2c0004a0f0: fd fd fd fd fd fd fd fd fa fa fa fa fa fa fa fa 0x1c2c0004a100: fa fa fa fa fa fa fa fa fa fa fa fa fa fa fa fa =>0x1c2c0004a110: fd fd fd fd[fd]fd fd fd fd fd fd fd fd fd fd fd 0x1c2c0004a120: fd fd fd fd fd fd fd fd fd fd fd fd fd fd fd fd 0x1c2c0004a130: fd fd fd fd fd fd fd fd fd fd fd fd fd fd fd fd 0x1c2c0004a140: fd fd fd fd fd fd fd fd fd fd fd fd fd fd fd fd 0x1c2c0004a150: fd fd fd fd fd fa fa fa fa fa fa fa fa fa fa fa 0x1c2c0004a160: fa fa fa fa fa fa fa fa fa fa fa fa fa fa fa fa Shadow byte legend (one shadow byte represents 8 application bytes): Addressable: 00 Partially addressable: 01 02 03 04 05 06 07 Heap left redzone: fa Freed heap region: fd Stack left redzone: f1 Stack mid redzone: f2 Stack right redzone: f3 Stack after return: f5 Stack use after scope: f8 Global redzone: f9 Global init order: f6 Poisoned by user: f7 Container overflow: fc Array cookie: ac Intra object redzone: bb ASan internal: fe Left alloca redzone: ca Right alloca redzone: cb ==32618==ABORTING Fatal Python error: Aborted

Hide Details

Thread 0x000000010fe4edc0 (most recent call first): File "/Users/buildslave/jenkins/workspace/lldb-cmake-sanitized/lldb-build/lib/python3.7/site-packages/lldb/__init__.py", line 10301 in Launch File "/Users/buildslave/jenkins/workspace/lldb-cmake-sanitized/llvm-project/lldb/test/API/functionalities/scripted_process/TestScriptedProcess.py", line 149 in test_launch_scripted_process_stack_frames File "/Users/buildslave/jenkins/workspace/lldb-cmake-sanitized/llvm-project/lldb/packages/Python/lldbsuite/test/decorators.py", line 149 in wrapper File "/Users/buildslave/jenkins/workspace/lldb-cmake-sanitized/llvm-project/lldb/packages/Python/lldbsuite/test/decorators.py", line 149 in wrapper File "/Users/buildslave/jenkins/workspace/lldb-cmake-sanitized/llvm-project/lldb/packages/Python/lldbsuite/test/lldbtest.py", line 1715 in test_method File "/Users/buildslave/jenkins/workspace/lldb-cmake-sanitized/llvm-project/lldb/third_party/Python/module/unittest2/unittest2/case.py", line 413 in runMethod File "/Users/buildslave/jenkins/workspace/lldb-cmake-sanitized/llvm-project/lldb/third_party/Python/module/unittest2/unittest2/case.py", line 383 in run File "/Users/buildslave/jenkins/workspace/lldb-cmake-sanitized/llvm-project/lldb/third_party/Python/module/unittest2/unittest2/case.py", line 458 in __call__ File "/Users/buildslave/jenkins/workspace/lldb-cmake-sanitized/llvm-project/lldb/third_party/Python/module/unittest2/unittest2/suite.py", line 117 in _wrapped_run File "/Users/buildslave/jenkins/workspace/lldb-cmake-sanitized/llvm-project/lldb/third_party/Python/module/unittest2/unittest2/suite.py", line 115 in _wrapped_run File "/Users/buildslave/jenkins/workspace/lldb-cmake-sanitized/llvm-project/lldb/third_party/Python/module/unittest2/unittest2/suite.py", line 85 in run File "/Users/buildslave/jenkins/workspace/lldb-cmake-sanitized/llvm-project/lldb/third_party/Python/module/unittest2/unittest2/suite.py", line 66 in __call__ File "/Users/buildslave/jenkins/workspace/lldb-cmake-sanitized/llvm-project/lldb/third_party/Python/module/unittest2/unittest2/runner.py", line 165 in run File "/Users/buildslave/jenkins/workspace/lldb-cmake-sanitized/llvm-project/lldb/packages/Python/lldbsuite/test/dotest.py", line 996 in run_suite File "/Users/buildslave/jenkins/workspace/lldb-cmake-sanitized/llvm-project/lldb/test/API/dotest.py", line 7 in <module>

Hide Details

--

Hide Details

******************** PASS: lldb-unit :: Utility/./UtilityTests/BinaryStreamTest.PutSLEB128One (1214 of 2474) PASS: lldb-unit :: Target/./TargetTests/MemoryRegionInfoTest.Formatv (1215 of 2474) PASS: lldb-unit :: Utility/./UtilityTests/StreamTeeTest.SetStreamAtIndexOutOfBounds (1216 of 2474) PASS: lldb-api :: python_api/get-value-32bit-int/TestGetValue32BitInt.py (1217 of 2474) PASS: lldb-api :: python_api/formatters/TestFormattersSBAPI.py (1218 of 2474) PASS: lldb-unit :: Utility/./UtilityTests/Flags.GetBitSize (1219 of 2474) PASS: lldb-shell :: Register/Core/x86-64-freebsd-fp.test (1220 of 2474) PASS: lldb-shell :: SymbolFile/DWARF/x86/static_scope.s (1221 of 2474) PASS: lldb-unit :: Utility/./UtilityTests/StreamTest.PutNHex8 (1222 of 2474) PASS: lldb-unit :: Utility/./UtilityTests/StringExtractorTest.GetU32LittleEndian (1223 of 2474) PASS: lldb-unit :: UnwindAssembly/x86/./UnwindAssemblyx86Tests/Testx86AssemblyInspectionEngine.TestSubESP (1224 of 2474) PASS: lldb-unit :: Core/./LLDBCoreTests/UniqueCStringMap.NoDefaultConstructor (1225 of 2474) UNSUPPORTED: lldb-api :: lang/cpp/reference-to-outer-type/TestCppReferenceToOuterClass.py (1226 of 2474) PASS: lldb-unit :: Process/gdb-remote/./ProcessGdbRemoteTests/GDBRemoteCommunicationClientTest.ReadRegister (1227 of 2474) PASS: lldb-unit :: Utility/./UtilityTests/BinaryStreamTest.PutULEB128Zero (1228 of 2474) UNSUPPORTED: lldb-api :: commands/gui/viewlarge/TestGuiViewLarge.py (1229 of 2474) PASS: lldb-api :: macosx/version_zero/TestGetVersionZeroVersion.py (1230 of 2474) PASS: lldb-shell :: ScriptInterpreter/Python/Crashlog/parser_text.test (1231 of 2474) PASS: lldb-api :: commands/platform/sdk/TestPlatformSDK.py (1232 of 2474) PASS: lldb-shell :: Expr/TestMultilineExpr.test (1233 of 2474) PASS: lldb-unit :: Utility/./UtilityTests/StringListTest.LongestCommonPrefixDuplicateElement (1234 of 2474) UNSUPPORTED: lldb-api :: functionalities/ptrauth_diagnostics/LDRAA_error/TestPtrauthLDRAADiagnostic.py (1235 of 2474) PASS: lldb-unit :: UnwindAssembly/x86/./UnwindAssemblyx86Tests/Testx86AssemblyInspectionEngine.TestPopR15 (1236 of 2474) UNSUPPORTED: lldb-api :: commands/trace/TestTraceSchema.py (1237 of 2474) PASS: lldb-unit :: Utility/./UtilityTests/ArgsTest.TestOverwriteArgs (1238 of 2474) UNSUPPORTED: lldb-api :: linux/add-symbols/TestTargetSymbolsAddCommand.py (1239 of 2474) PASS: lldb-shell :: Reproducer/TestPythonImport.test (1240 of 2474) PASS: lldb-unit :: UnwindAssembly/x86/./UnwindAssemblyx86Tests/Testx86AssemblyInspectionEngine.TestSimple32bitFrameFunction (1241 of 2474) PASS: lldb-api :: tools/lldb-vscode/breakpoint-events/TestVSCode_breakpointEvents.py (1242 of 2474) PASS: lldb-unit :: Host/./HostTests/XML.GetAs (1243 of 2474) PASS: lldb-api :: sanity/TestModuleCacheSanity.py (1244 of 2474) PASS: lldb-unit :: Host/./HostTests/SocketTests/SocketTest.TCPGetConnectURI/ipv6 (1245 of 2474) UNSUPPORTED: lldb-shell :: SymbolFile/PDB/calling-conventions.test (1246 of 2474) PASS: lldb-api :: tools/lldb-vscode/module/TestVSCode_module.py (1247 of 2474) UNSUPPORTED: lldb-api :: functionalities/unwind/aarch64_unwind_pac/TestAArch64UnwindPAC.py (1248 of 2474) PASS: lldb-api :: python_api/watchpoint/TestWatchpointIter.py (1249 of 2474) PASS: lldb-api :: lang/cpp/complete-type-check/TestCppIsTypeComplete.py (1250 of 2474) PASS: lldb-unit :: Language/Highlighting/./HighlighterTests/HighlighterTest.HighlighterSelectionType (1251 of 2474) PASS: lldb-unit :: ScriptInterpreter/Python/./ScriptInterpreterPythonTests/PythonDataObjectsTest.TestResetting (1252 of 2474) PASS: lldb-shell :: Driver/TestSingleQuote.test (1253 of 2474) PASS: lldb-shell :: SymbolFile/DWARF/dwo-relative-path.s (1254 of 2474) PASS: lldb-api :: functionalities/breakpoint/serialize/TestBreakpointSerialization.py (1255 of 2474) PASS: lldb-unit :: Signals/./SignalsTests/UnixSignalsTest.GetFilteredSignals (1256 of 2474) PASS: lldb-unit :: Utility/./UtilityTests/RegisterValueTest.GetSet8 (1257 of 2474) PASS: lldb-api :: functionalities/step-avoids-no-debug/TestStepNoDebug.py (1258 of 2474) PASS: lldb-api :: commands/expression/import-std-module/retry-with-std-module/TestRetryWithStdModule.py (1259 of 2474) PASS: lldb-unit :: Utility/./UtilityTests/OptionsWithRawTest.ArgsButNoDelimiter (1260 of 2474) PASS: lldb-unit :: Utility/./UtilityTests/StringExtractorTest.GetHexU8_Exact (1261 of 2474) PASS: lldb-unit :: Process/minidump/./LLDBMinidumpTests/MinidumpParserTest.GetMemoryRegionInfoLinuxMapsError (1262 of 2474) PASS: lldb-unit :: Host/./HostTests/SocketTests/SocketTest.TCPGetConnectURI/ipv4 (1263 of 2474) PASS: lldb-unit :: Utility/./UtilityTests/NameMatchesTest.Ignore (1264 of 2474) PASS: lldb-unit :: Utility/./UtilityTests/StringExtractorTest.GetU64LittleEndian (1265 of 2474) PASS: lldb-unit :: Utility/./UtilityTests/StreamTest.PutCString (1266 of 2474) PASS: lldb-api :: commands/watchpoints/watchpoint_on_vectors/TestValueOfVectorVariable.py (1267 of 2474) PASS: lldb-shell :: ObjectFile/wasm/basic.yaml (1268 of 2474) PASS: lldb-unit :: Process/minidump/./LLDBMinidumpTests/MinidumpParserTest.GetPidWindows (1269 of 2474) PASS: lldb-unit :: Utility/./UtilityTests/StringListTest.InsertStringAtIndexMove (1270 of 2474) PASS: lldb-unit :: SymbolFile/DWARF/./SymbolFileDWARFTests/DWARFUnitTest.SwiftProducer (1271 of 2474) PASS: lldb-unit :: Core/./LLDBCoreTests/ModuleSpecTest.InvalidInMemoryBufferValidFile (1272 of 2474) PASS: lldb-unit :: Target/./TargetTests/DynamicRegisterInfoRegisterTest.SetRegisterInfo (1273 of 2474) PASS: lldb-api :: python_api/watchpoint/condition/TestWatchpointConditionAPI.py (1274 of 2474) PASS: lldb-api :: python_api/disassemble-raw-data/TestDisassembleRawData.py (1275 of 2474) PASS: lldb-shell :: SymbolFile/DWARF/x86/debug_rnglists.s (1276 of 2474) PASS: lldb-api :: functionalities/signal/raise/TestRaise.py (1277 of 2474) PASS: lldb-unit :: Utility/./UtilityTests/StringListTest.SplitIntoLinesEmpty (1278 of 2474) PASS: lldb-shell :: ObjectFile/ELF/basic-info.yaml (1279 of 2474) PASS: lldb-api :: functionalities/thread/concurrent_events/TestConcurrentTwoWatchpointsOneBreakpoint.py (1280 of 2474) UNSUPPORTED: lldb-shell :: SymbolFile/DWARF/x86/DW_TAG_GNU_call_site-DW_AT_low_pc.s (1281 of 2474) PASS: lldb-unit :: Symbol/./SymbolTests/TestTypeSystemClang.TemplateArguments (1282 of 2474) PASS: lldb-shell :: SymbolFile/DWARF/x86/debug_aranges-empty-section.s (1283 of 2474) PASS: lldb-shell :: SymbolFile/DWARF/x86/debug_rnglists-dwp.s (1284 of 2474) PASS: lldb-unit :: Utility/./UtilityTests/StringListTest.SplitIntoLinesSingleTrailingCR (1285 of 2474) PASS: lldb-unit :: Symbol/./SymbolTests/TestTypeSystemClang.TestUnifyAccessSpecifiers (1286 of 2474) PASS: lldb-unit :: ScriptInterpreter/Python/./ScriptInterpreterPythonTests/PythonDataObjectsTest.TestPythonListValueEquality (1287 of 2474) PASS: lldb-api :: commands/expression/import-std-module/deque-basic/TestDequeFromStdModule.py (1288 of 2474) PASS: lldb-api :: functionalities/breakpoint/breakpoint_by_file_colon_line/TestBreakpointByFileColonLine.py (1289 of 2474) PASS: lldb-unit :: Host/./HostTests/SocketTests/SocketTest.TCPGetAddress/ipv6 (1290 of 2474) PASS: lldb-shell :: SymbolFile/Breakpad/line-table.test (1291 of 2474) PASS: lldb-api :: tools/lldb-server/TestGdbRemoteRegisterState.py (1292 of 2474) PASS: lldb-api :: functionalities/gdb_remote_client/TestRegDefinitionInParts.py (1293 of 2474) PASS: lldb-unit :: Symbol/./SymbolTests/TestTypeSystemClang.TestBuiltinTypeForEncodingAndBitSize (1294 of 2474) PASS: lldb-unit :: Utility/./UtilityTests/StringListTest.AppendListCStringArrayEmpty (1295 of 2474) PASS: lldb-api :: commands/platform/basic/TestPlatformPython.py (1296 of 2474) PASS: lldb-api :: functionalities/breakpoint/breakpoint_hit_count/TestBreakpointHitCount.py (1297 of 2474) PASS: lldb-api :: tools/lldb-server/TestGdbRemoteKill.py (1298 of 2474) PASS: lldb-unit :: ObjectFile/Breakpad/./ObjectFileBreakpadTests/ModuleRecord.parse (1299 of 2474) PASS: lldb-unit :: Utility/./UtilityTests/ArgsTest.TestSingleArg (1300 of 2474) PASS: lldb-unit :: Utility/./UtilityTests/RangeDataVector.FindEntryThatContains_Overlap (1301 of 2474) PASS: lldb-unit :: Process/minidump/./LLDBMinidumpTests/MinidumpParserTest.GetPid (1302 of 2474) PASS: lldb-unit :: Utility/./UtilityTests/UriParserTest.SchemeHostSeparator3 (1303 of 2474) PASS: lldb-unit :: Utility/./UtilityTests/RangeTest.SetRangeBase (1304 of 2474) PASS: lldb-api :: lang/cpp/printf/TestPrintf.py (1305 of 2474) PASS: lldb-shell :: Commands/command-backtrace-parser-2.test (1306 of 2474) PASS: lldb-shell :: SymbolFile/DWARF/x86/debug-line-basic.s (1307 of 2474) PASS: lldb-unit :: ObjectFile/Breakpad/./ObjectFileBreakpadTests/InlineOriginRecord.parse (1308 of 2474) PASS: lldb-api :: functionalities/paths/TestPaths.py (1309 of 2474) PASS: lldb-api :: functionalities/tail_call_frames/thread_step_out_message/TestArtificialFrameStepOutMessage.py (1310 of 2474) PASS: lldb-api :: functionalities/data-formatter/data-formatter-stl/libcxx/queue/TestDataFormatterLibcxxQueue.py (1311 of 2474) PASS: lldb-unit :: Target/./TargetTests/DynamicRegisterInfoRegisterTest.addSupplementaryRegister (1312 of 2474) PASS: lldb-unit :: Language/Highlighting/./HighlighterTests/HighlighterTest.ClangCursorPosAfterOtherToken (1313 of 2474) PASS: lldb-api :: functionalities/thread/step_out/TestThreadStepOut.py (1314 of 2474) PASS: lldb-shell :: SymbolFile/DWARF/x86/debug-types-basic.test (1315 of 2474) PASS: lldb-api :: functionalities/source-map/TestTargetSourceMap.py (1316 of 2474) PASS: lldb-unit :: Language/Highlighting/./HighlighterTests/HighlighterTest.ClangPPDirectives (1317 of 2474) PASS: lldb-unit :: Utility/./UtilityTests/StringListTest.AppendListCStringArray (1318 of 2474) PASS: lldb-unit :: Utility/./UtilityTests/UriParserTest.BracketedHostnameWithPortIPv4 (1319 of 2474) PASS: lldb-shell :: ObjectFile/Breakpad/sections.test (1320 of 2474) PASS: lldb-shell :: Register/Core/x86-32-freebsd-addr.test (1321 of 2474) PASS: lldb-unit :: UnwindAssembly/x86/./UnwindAssemblyx86Tests/Testx86AssemblyInspectionEngine.TestStackRealignMSVC_i386 (1322 of 2474) PASS: lldb-unit :: UnwindAssembly/x86/./UnwindAssemblyx86Tests/Testx86AssemblyInspectionEngine.TestPushR15 (1323 of 2474) PASS: lldb-api :: commands/expression/function_template_specialization_temp_args/TestFunctionTemplateSpecializationTempArgs.py (1324 of 2474) PASS: lldb-unit :: Utility/./UtilityTests/TimerTest.CategoryTimes (1325 of 2474) UNSUPPORTED: lldb-shell :: Reproducer/TestLuaImport.test (1326 of 2474) PASS: lldb-api :: functionalities/thread/exit_during_break/TestExitDuringBreak.py (1327 of 2474) PASS: lldb-unit :: UnwindAssembly/x86/./UnwindAssemblyx86Tests/Testx86AssemblyInspectionEngine.TestPopEBP (1328 of 2474) PASS: lldb-unit :: Process/minidump/./LLDBMinidumpTests/RegisterContextMinidump.ConvertMinidumpContext_x86_64 (1329 of 2474) UNSUPPORTED: lldb-api :: commands/expression/multiline-navigation/TestMultilineNavigation.py (1330 of 2474) PASS: lldb-unit :: Utility/./UtilityTests/ScalarTest.SetValueFromCString (1331 of 2474) PASS: lldb-shell :: ObjectFile/PECOFF/sections.yaml (1332 of 2474) PASS: lldb-unit :: Utility/./UtilityTests/NameMatchesTest.EndsWith (1333 of 2474) PASS: lldb-unit :: UnwindAssembly/x86/./UnwindAssemblyx86Tests/Testx86AssemblyInspectionEngine.Test32bitFramelessSmallStackFrame (1334 of 2474) PASS: lldb-unit :: Utility/./UtilityTests/StreamTeeTest.CopyConstructor (1335 of 2474) PASS: lldb-api :: lang/cpp/class_types/TestClassTypes.py (1336 of 2474) PASS: lldb-api :: functionalities/tail_call_frames/thread_step_out_or_return/TestSteppingOutWithArtificialFrames.py (1337 of 2474) PASS: lldb-unit :: Utility/./UtilityTests/ScalarTest.Promotion (1338 of 2474) PASS: lldb-api :: macosx/safe-to-func-call/TestSafeFuncCalls.py (1339 of 2474) PASS: lldb-shell :: ScriptInterpreter/Python/command_relative_import.test (1340 of 2474) PASS: lldb-unit :: Utility/./UtilityTests/NameMatchesTest.Contains (1341 of 2474) PASS: lldb-api :: commands/target/modules/search-paths/insert/TestTargetModulesSearchpathsInsert.py (1342 of 2474) PASS: lldb-shell :: ObjectFile/ELF/PT_LOAD-overlap.yaml (1343 of 2474) PASS: lldb-shell :: SymbolFile/DWARF/x86/debug_line-tombstone.s (1344 of 2474) PASS: lldb-api :: functionalities/gdb_remote_client/TestNoGPacketSupported.py (1345 of 2474) PASS: lldb-api :: commands/frame/recognizer/TestFrameRecognizer.py (1346 of 2474) PASS: lldb-shell :: SymbolFile/DWARF/x86/array-sizes.s (1347 of 2474) PASS: lldb-unit :: Utility/./UtilityTests/StringLexerTest.NextIf (1348 of 2474) PASS: lldb-unit :: ScriptInterpreter/Python/./ScriptInterpreterPythonTests/PythonDataObjectsTest.TestPythonTupleInitializerList2 (1349 of 2474) UNSUPPORTED: lldb-shell :: Subprocess/fork-follow-child-wp.test (1350 of 2474) UNSUPPORTED: lldb-api :: iohandler/unicode/TestUnicode.py (1351 of 2474) PASS: lldb-unit :: Core/./LLDBCoreTests/FormatEntityTest.DefinitionConstructionNameAndString (1352 of 2474) PASS: lldb-unit :: Utility/./UtilityTests/StringListTest.GetMaxStringLengthEmpty (1353 of 2474) PASS: lldb-unit :: Utility/./UtilityTests/ArgsTest.TestSingleQuotedArgWithSpace (1354 of 2474) UNSUPPORTED: lldb-api :: linux/aarch64/mte_memory_region/TestAArch64LinuxMTEMemoryRegion.py (1355 of 2474) PASS: lldb-api :: functionalities/thread/backtrace_all/TestBacktraceAll.py (1356 of 2474) PASS: lldb-api :: functionalities/step-vrs-interrupt/TestStepVrsInterruptTimeout.py (1357 of 2474) PASS: lldb-unit :: Process/Utility/./ProcessUtilityTests/ProcSMapTests/LinuxProcSMapsTestFixture.ParseSMapRegions/0 (1358 of 2474) PASS: lldb-unit :: Utility/./UtilityTests/BroadcasterTest.EventTypeHasListeners (1359 of 2474) PASS: lldb-api :: lang/objc/unicode-string/TestUnicodeString.py (1360 of 2474) UNSUPPORTED: lldb-shell :: Register/x86-64-ymm16-write.test (1361 of 2474) PASS: lldb-api :: commands/target/dump-symtab-demangle/TestDumpSymtabDemangle.py (1362 of 2474) PASS: lldb-unit :: Utility/./UtilityTests/StringLexerTest.NextIfList (1363 of 2474) PASS: lldb-shell :: Minidump/Windows/broken-unwind.test (1364 of 2474) UNSUPPORTED: lldb-shell :: ScriptInterpreter/Lua/nested_sessions.test (1365 of 2474) PASS: lldb-unit :: Utility/./UtilityTests/SerializationRountripTest.SerializeDeserializeObjectPointer (1366 of 2474) PASS: lldb-unit :: Utility/./UtilityTests/CompletionRequest.TryCompleteCurrentArgMode (1367 of 2474) PASS: lldb-unit :: Process/gdb-remote/./ProcessGdbRemoteTests/GDBRemoteCommunicationClientTest.ReadMemoryTags (1368 of 2474) PASS: lldb-api :: tools/lldb-vscode/breakpoint/TestVSCode_setFunctionBreakpoints.py (1369 of 2474) UNSUPPORTED: lldb-shell :: SymbolFile/NativePDB/typedefs.cpp (1370 of 2474) PASS: lldb-shell :: SymbolFile/DWARF/x86/dwarf5-partial-index.cpp (1371 of 2474) PASS: lldb-unit :: Utility/./UtilityTests/FileSpecTest.OperatorBool (1372 of 2474) PASS: lldb-shell :: ScriptInterpreter/Python/command_import.test (1373 of 2474) PASS: lldb-api :: functionalities/data-formatter/synthupdate/TestSyntheticFilterRecompute.py (1374 of 2474) PASS: lldb-api :: lang/objc/modules-hash-mismatch/TestClangModulesHashMismatch.py (1375 of 2474) PASS: lldb-unit :: ScriptInterpreter/Python/./ScriptInterpreterPythonTests/PythonDataObjectsTest.TestPythonCallableInvoke (1376 of 2474) PASS: lldb-shell :: SymbolFile/DWARF/x86/dwarf5-split.s (1377 of 2474) PASS: lldb-unit :: Utility/./UtilityTests/ArchSpecTest.TestParseMachCPUDashSubtypeTripleSimple (1378 of 2474) PASS: lldb-api :: lang/cpp/global_operators/TestCppGlobalOperators.py (1379 of 2474) PASS: lldb-api :: lang/objc/real-definition/TestRealDefinition.py (1380 of 2474) PASS: lldb-shell :: SymbolFile/DWARF/clang-ast-from-dwarf-unamed-and-anon-structs.cpp (1381 of 2474) PASS: lldb-api :: lang/objc/foundation/TestSymbolTable.py (1382 of 2474) PASS: lldb-api :: lang/cpp/dynamic-value-same-basename/TestDynamicValueSameBase.py (1383 of 2474) PASS: lldb-api :: python_api/watchpoint/TestSetWatchpoint.py (1384 of 2474) PASS: lldb-unit :: Process/gdb-remote/./ProcessGdbRemoteTests/PortMapTest.Constructors (1385 of 2474) UNSUPPORTED: lldb-shell :: ScriptInterpreter/Lua/convenience_variables.test (1386 of 2474) UNSUPPORTED: lldb-shell :: ScriptInterpreter/Lua/breakpoint_oneline_callback.test (1387 of 2474) PASS: lldb-api :: lang/objc/foundation/TestConstStrings.py (1388 of 2474) PASS: lldb-api :: macosx/queues/TestQueues.py (1389 of 2474) PASS: lldb-unit :: Process/minidump/./LLDBMinidumpTests/RegisterContextMinidump.ConvertMinidumpContext_x86_32 (1390 of 2474) PASS: lldb-api :: functionalities/data-formatter/data-formatter-objc/TestDataFormatterObjCExpr.py (1391 of 2474) PASS: lldb-unit :: tools/lldb-server/tests/./LLDBServerTests/TestBase.LaunchModePreservesEnvironment (1392 of 2474) PASS: lldb-shell :: Register/Core/x86-64-netbsd-fp.test (1393 of 2474) PASS: lldb-unit :: Utility/./UtilityTests/RecordReplayTest.InstrumentedBarRef (1394 of 2474) UNSUPPORTED: lldb-shell :: Expr/TestIRMemoryMapWindows.test (1395 of 2474) PASS: lldb-shell :: Register/Core/x86-32-freebsd-gp.test (1396 of 2474) PASS: lldb-api :: functionalities/thread/concurrent_events/TestConcurrentTwoWatchpointsOneSignal.py (1397 of 2474) PASS: lldb-api :: commands/expression/fixits/TestFixIts.py (1398 of 2474) PASS: lldb-unit :: Symbol/./SymbolTests/TestTypeSystemClang.TestGetTypeClassDeclType (1399 of 2474) PASS: lldb-shell :: Commands/command-script-import.test (1400 of 2474) PASS: lldb-unit :: Host/./HostTests/SocketTests/SocketTest.TCPListen0GetPort/ipv4 (1401 of 2474) PASS: lldb-unit :: Utility/./UtilityTests/ListenerTest.GetEventWait (1402 of 2474) PASS: lldb-api :: macosx/DBGSourcePathRemapping/TestDSYMSourcePathRemapping.py (1403 of 2474) PASS: lldb-unit :: Utility/./UtilityTests/OptionsWithRawTest.SingleWhitespaceInput (1404 of 2474) PASS: lldb-unit :: Core/./LLDBCoreTests/ModuleSpecTest.InvalidInMemoryBuffer (1405 of 2474) PASS: lldb-shell :: Heap/heap-cstr.test (1406 of 2474) PASS: lldb-api :: functionalities/breakpoint/breakpoint_options/TestBreakpointOptions.py (1407 of 2474) PASS: lldb-api :: commands/command/container/TestContainerCommands.py (1408 of 2474) PASS: lldb-shell :: SymbolFile/DWARF/x86/debug-types-dwarf5.s (1409 of 2474) PASS: lldb-api :: functionalities/postmortem/netbsd-core/TestNetBSDCore.py (1410 of 2474) UNSUPPORTED: lldb-api :: functionalities/dyld-launch-linux/TestDyldLaunchLinux.py (1411 of 2474) PASS: lldb-unit :: Utility/./UtilityTests/StringExtractorTest.GetHexU8_Underflow_NoEof (1412 of 2474) PASS: lldb-unit :: Utility/./UtilityTests/OptionsWithRawTest.MultiWordSuffix (1413 of 2474) PASS: lldb-unit :: Host/./HostTests/FileSystemTest.EmptyTest (1414 of 2474) PASS: lldb-shell :: Settings/TestDisableColor.test (1415 of 2474) PASS: lldb-api :: functionalities/breakpoint/cpp_exception/TestCPPExceptionBreakpoint.py (1416 of 2474) PASS: lldb-unit :: debugserver/./debugserverTests/RNBSocket.LoopBackListenIPv4 (1417 of 2474) PASS: lldb-api :: lang/objc/conflicting-definition/TestConflictingDefinition.py (1418 of 2474) PASS: lldb-unit :: Utility/./UtilityTests/StringListTest.Clear (1419 of 2474) UNSUPPORTED: lldb-shell :: Subprocess/vfork-follow-child-softbp.test (1420 of 2474) PASS: lldb-unit :: Utility/./UtilityTests/BinaryStreamTest.PutULEB128OneByte (1421 of 2474) UNSUPPORTED: lldb-api :: benchmarks/frame_variable/TestFrameVariableResponse.py (1422 of 2474) PASS: lldb-api :: functionalities/data-formatter/data-formatter-disabling/TestDataFormatterDisabling.py (1423 of 2474) PASS: lldb-api :: macosx/universal/TestUniversal.py (1424 of 2474) PASS: lldb-unit :: SymbolFile/DWARF/./SymbolFileDWARFTests/DWARFASTParserClangTests.EnsureAllDIEsInDeclContextHaveBeenParsedParsesOnlyMatchingEntries (1425 of 2474) PASS: lldb-api :: functionalities/data-formatter/nsarraysynth/TestNSArraySynthetic.py (1426 of 2474) PASS: lldb-shell :: SymbolFile/Breakpad/inline-record.test (1427 of 2474) PASS: lldb-unit :: Process/gdb-remote/./ProcessGdbRemoteTests/GDBRemoteCommunicationClientTest.SaveRestoreRegistersNoSuffix (1428 of 2474) PASS: lldb-unit :: Host/./HostTests/SocketTests/SocketTest.DecodeHostAndPort/ipv6 (1429 of 2474) PASS: lldb-api :: api/listeners/TestListener.py (1430 of 2474) PASS: lldb-shell :: ObjectFile/ELF/eh_frame-symbols.yaml (1431 of 2474) PASS: lldb-api :: commands/expression/persist_objc_pointeetype/TestPersistObjCPointeeType.py (1432 of 2474) PASS: lldb-unit :: Utility/./UtilityTests/StringListTest.JoinEmpty (1433 of 2474) UNSUPPORTED: lldb-api :: functionalities/longjmp/TestLongjmp.py (1434 of 2474) UNSUPPORTED: lldb-api :: commands/trace/TestTraceDumpInfo.py (1435 of 2474) PASS: lldb-api :: commands/expression/char/TestExprsChar.py (1436 of 2474) PASS: lldb-unit :: Utility/./UtilityTests/StringListTest.InsertStringAtIndexEnd (1437 of 2474) PASS: lldb-unit :: Process/Utility/./ProcessUtilityTests/MemoryTagManagerAArch64MTETest.ExpandToGranule (1438 of 2474) PASS: lldb-unit :: Expression/./ExpressionTests/DiagnosticManagerTest.HasFixits (1439 of 2474) PASS: lldb-api :: lang/mixed/TestMixedLanguages.py (1440 of 2474) PASS: lldb-unit :: Symbol/./SymbolTests/TestTypeSystemClang.TestNotDeletingUserCopyCstrDueToMoveCStr (1441 of 2474) PASS: lldb-unit :: Process/minidump/./LLDBMinidumpTests/MinidumpParserTest.MinidumpDuplicateModuleMappedSecond (1442 of 2474) PASS: lldb-shell :: Breakpoint/debug_rnglist_rlestartend.test (1443 of 2474) PASS: lldb-api :: commands/expression/scoped_enums/TestScopedEnumType.py (1444 of 2474) PASS: lldb-unit :: Utility/./UtilityTests/StringExtractorTest.GetNameColonValueSuccess (1445 of 2474) PASS: lldb-shell :: ObjectFile/ELF/PT_TLS-overlap-PT_LOAD.yaml (1446 of 2474) PASS: lldb-unit :: Symbol/./SymbolTests/TestTypeSystemClang.TestFunctionTemplateInRecordConstruction (1447 of 2474) PASS: lldb-unit :: Utility/./UtilityTests/XcodeSDKTest.MergeTest (1448 of 2474) PASS: lldb-unit :: Utility/./UtilityTests/StreamTeeTest.Flush (1449 of 2474) PASS: lldb-unit :: Process/gdb-remote/./ProcessGdbRemoteTests/GDBRemoteClientBaseTest.InterruptNoResponse (1450 of 2474) UNSUPPORTED: lldb-shell :: SymbolFile/PDB/function-level-linking.test (1451 of 2474) PASS: lldb-unit :: Utility/./UtilityTests/PassiveReplayTest.InstrumentedFoo (1452 of 2474) PASS: lldb-shell :: ObjectFile/PECOFF/sections-names.yaml (1453 of 2474) PASS: lldb-unit :: SymbolFile/DWARF/./SymbolFileDWARFTests/DWARFUnitTest.MissingSentinel (1454 of 2474) PASS: lldb-api :: functionalities/data-formatter/data-formatter-objc/TestDataFormatterObjCNSBundle.py (1455 of 2474) PASS: lldb-shell :: SymbolFile/DWARF/x86/limit-debug-info.s (1456 of 2474) PASS: lldb-unit :: Utility/./UtilityTests/BinaryStreamTest.PutSLEB128EightBytes (1457 of 2474) PASS: lldb-unit :: Language/Highlighting/./HighlighterTests/HighlighterTest.Keywords (1458 of 2474) PASS: lldb-unit :: Utility/./UtilityTests/StringLexerTest.Peek (1459 of 2474) PASS: lldb-unit :: UnwindAssembly/x86/./UnwindAssemblyx86Tests/Testx86AssemblyInspectionEngine.TestAddESP (1460 of 2474) UNSUPPORTED: lldb-api :: functionalities/tsan/multiple/TestTsanMultiple.py (1461 of 2474) PASS: lldb-unit :: Host/./HostTests/ProcessLaunchInfoTest.Constructor (1462 of 2474) UNSUPPORTED: lldb-api :: functionalities/breakpoint/hardware_breakpoints/write_memory_with_hw_breakpoint/TestWriteMemoryWithHWBreakpoint.py (1463 of 2474) UNSUPPORTED: lldb-shell :: Breakpoint/case-insensitive.test (1464 of 2474) PASS: lldb-api :: commands/log/invalid-args/TestInvalidArgsLog.py (1465 of 2474) PASS: lldb-api :: lang/objc/rdar-11355592/TestRdar11355592.py (1466 of 2474) PASS: lldb-unit :: Utility/./UtilityTests/StringListTest.InsertStringAtIndexStart (1467 of 2474) PASS: lldb-api :: lang/cpp/char8_t/TestCxxChar8_t.py (1468 of 2474) PASS: lldb-api :: macosx/find-dsym/deep-bundle/TestDeepBundle.py (1469 of 2474) PASS: lldb-unit :: Utility/./UtilityTests/RecordReplayTest.InstrumentedBarPtr (1470 of 2474) PASS: lldb-unit :: Utility/./UtilityTests/ArchSpecTest.MergeFrom (1471 of 2474) PASS: lldb-api :: functionalities/launch_stop_at_entry/TestStopAtEntry.py (1472 of 2474) UNSUPPORTED: lldb-api :: iohandler/completion/TestIOHandlerCompletion.py (1473 of 2474) PASS: lldb-api :: commands/frame/diagnose/array/TestArray.py (1474 of 2474) PASS: lldb-unit :: Utility/./UtilityTests/StreamTest.AddressEmptyPrefix (1475 of 2474) PASS: lldb-unit :: Symbol/./SymbolTests/TestTypeSystemClang.GetExeModuleWhenMissingSymbolFile (1476 of 2474) UNSUPPORTED: lldb-api :: commands/gui/basicdebug/TestGuiBasicDebug.py (1477 of 2474) UNSUPPORTED: lldb-shell :: ScriptInterpreter/Lua/persistent_state.test (1478 of 2474) UNSUPPORTED: lldb-api :: commands/watchpoints/variable_out_of_scope/TestWatchedVarHitWhenInScope.py (1479 of 2474) PASS: lldb-api :: functionalities/thread/concurrent_events/TestConcurrentDelayedCrashWithBreakpointWatchpoint.py (1480 of 2474) PASS: lldb-api :: commands/expression/import-std-module/no-std-module/TestMissingStdModule.py (1481 of 2474) PASS: lldb-api :: functionalities/data-formatter/data-formatter-stl/libcxx/vector/TestDataFormatterLibcxxVector.py (1482 of 2474) PASS: lldb-api :: lang/objc/foundation/TestObjectDescriptionAPI.py (1483 of 2474) PASS: lldb-unit :: SymbolFile/NativePDB/./SymbolFileNativePDBTests/PDBFPOProgramToDWARFExpressionTests.MissingTargetRegister (1484 of 2474) PASS: lldb-unit :: ObjectFile/ELF/./ObjectFileELFTests/ObjectFileELFTest.GetSymtab_NoSymEntryPointArmThumbAddressClass (1485 of 2474) PASS: lldb-shell :: ObjectFile/ELF/gnu-debuglink.yaml (1486 of 2474) PASS: lldb-unit :: Process/minidump/./LLDBMinidumpTests/MinidumpParserTest.GetMiscInfo_no_stream (1487 of 2474) PASS: lldb-api :: python_api/process/read-mem-cstring/TestReadMemCString.py (1488 of 2474) PASS: lldb-unit :: Utility/./UtilityTests/ScalarTest.APIntConstructor (1489 of 2474) PASS: lldb-shell :: Quit/TestQuitExitCode-30.test (1490 of 2474) PASS: lldb-unit :: SymbolFile/DWARF/./SymbolFileDWARFTests/SymbolFileDWARFTests.TestAbbrevOutOfOrder (1491 of 2474) PASS: lldb-unit :: Thread/./ThreadTests/ThreadTest.GetPrivateStopInfo (1492 of 2474) PASS: lldb-unit :: SymbolFile/DWARF/./SymbolFileDWARFTests/DWARFUnitTest.ClangProducer (1493 of 2474) PASS: lldb-shell :: Commands/command-stop-hook-output.test (1494 of 2474) PASS: lldb-unit :: Utility/./UtilityTests/ReproducerTest.SetReplay (1495 of 2474) PASS: lldb-shell :: SymbolFile/DWARF/x86/debug_loclists-dwp.s (1496 of 2474) PASS: lldb-unit :: Host/./HostTests/FileActionTest.Open (1497 of 2474) PASS: lldb-unit :: Utility/./UtilityTests/StreamTest.AddressNoSuffix (1498 of 2474) PASS: lldb-unit :: Platform/./LLDBPlatformTests/PlatformDarwinTest.GetCompatibleArchARMv7m (1499 of 2474) PASS: lldb-unit :: UnwindAssembly/x86/./UnwindAssemblyx86Tests/Testx86AssemblyInspectionEngine.TestCALLNextInsn (1500 of 2474) PASS: lldb-api :: python_api/frame/inlines/TestInlinedFrame.py (1501 of 2474) PASS: lldb-unit :: Host/./HostTests/HostInfoTestInitialization.InitTwice (1502 of 2474) PASS: lldb-api :: commands/expression/no-deadlock/TestExprDoesntBlock.py (1503 of 2474) PASS: lldb-unit :: Utility/./UtilityTests/OptionsWithRawTest.UnterminatedQuote (1504 of 2474) PASS: lldb-shell :: SymbolFile/DWARF/x86/debug_ranges.s (1505 of 2474) PASS: lldb-api :: functionalities/gdb_remote_client/TestPlatformClient.py (1506 of 2474) PASS: lldb-api :: functionalities/param_entry_vals/basic_entry_values/TestBasicEntryValues.py (1507 of 2474) PASS: lldb-unit :: Platform/./LLDBPlatformTests/PlatformDarwinTest.GetCompatibleArchARMv6 (1508 of 2474) PASS: lldb-api :: functionalities/data-formatter/data-formatter-stl/generic/forward_list/TestDataFormatterGenericForwardList.py (1509 of 2474) PASS: lldb-api :: commands/frame/var/TestFrameVar.py (1510 of 2474) PASS: lldb-api :: commands/expression/regression-access-function-template-in-record/TestRegressionAccessFunctionTemplateInRecord.py (1511 of 2474) PASS: lldb-unit :: ObjectFile/ELF/./ObjectFileELFTests/ObjectFileELFTest.GetSymtab_NoSymEntryPointArmAddressClass (1512 of 2474) PASS: lldb-unit :: API/./APITests/SBCommandInterpreterTest.SingleWordCommand (1513 of 2474) PASS: lldb-unit :: Signals/./SignalsTests/UnixSignalsTest.Iteration (1514 of 2474) PASS: lldb-unit :: Symbol/./SymbolTests/TestTypeSystemMap.GetTypeSystemForLanguageWithNoTarget (1515 of 2474) PASS: lldb-api :: api/command-return-object/TestSBCommandReturnObject.py (1516 of 2474) PASS: lldb-api :: tools/lldb-vscode/correct-thread/TestVSCode_correct_thread.py (1517 of 2474) PASS: lldb-api :: python_api/interpreter/TestRunCommandInterpreterAPI.py (1518 of 2474) UNSUPPORTED: lldb-api :: commands/expression/import-std-module/pair/TestPairFromStdModule.py (1519 of 2474) PASS: lldb-unit :: Process/minidump/./LLDBMinidumpTests/MinidumpParserTest.GetArchitecture (1520 of 2474) PASS: lldb-unit :: Host/./HostTests/HostInfoTest.GetXcodeSDK (1521 of 2474) PASS: lldb-shell :: SymbolFile/Breakpad/line-table-missing-file.test (1522 of 2474) UNSUPPORTED: lldb-shell :: Register/aarch64-fp-read.test (1523 of 2474) PASS: lldb-api :: functionalities/thread/state_after_expression/TestStateAfterExpression.py (1524 of 2474) PASS: lldb-unit :: Process/gdb-remote/./ProcessGdbRemoteTests/GDBRemoteCommunicationServerLLGSTest.LLGSArgToURL (1525 of 2474) PASS: lldb-unit :: Utility/./UtilityTests/LogChannelTest.EnableOptions (1526 of 2474) PASS: lldb-unit :: Utility/./UtilityTests/AnsiTerminal.Incomplete (1527 of 2474) PASS: lldb-unit :: Process/Utility/./ProcessUtilityTests/ProcMapTests/LinuxProcMapsTestFixture.ParseMapRegions/0 (1528 of 2474) UNSUPPORTED: lldb-api :: linux/aarch64/unwind_signal/TestUnwindSignal.py (1529 of 2474) PASS: lldb-api :: lang/c/modules/TestCModules.py (1530 of 2474) PASS: lldb-shell :: ObjectFile/ELF/PT_LOAD-overlap-PT_TLS.yaml (1531 of 2474) PASS: lldb-api :: lang/cpp/class-template-non-type-parameter-pack/TestClassTemplateNonTypeParameterPack.py (1532 of 2474) PASS: lldb-unit :: Utility/./UtilityTests/ArgsTest.TestQuotedTrailingBackslash (1533 of 2474) PASS: lldb-unit :: Process/Utility/./ProcessUtilityTests/ProcSMapTests/LinuxProcSMapsTestFixture.ParseSMapRegions/1 (1534 of 2474) PASS: lldb-api :: commands/gui/invalid-args/TestInvalidArgsGui.py (1535 of 2474) UNSUPPORTED: lldb-api :: linux/mix-dwo-and-regular-objects/TestMixedDwarfBinary.py (1536 of 2474) PASS: lldb-shell :: SymbolFile/DWARF/x86/dwarf5-index-is-used.cpp (1537 of 2474) PASS: lldb-api :: lang/cpp/incompatible-class-templates/TestCppIncompatibleClassTemplates.py (1538 of 2474) PASS: lldb-api :: commands/version/TestVersion.py (1539 of 2474) PASS: lldb-shell :: SymbolFile/Breakpad/stack-cfi-parsing.test (1540 of 2474) PASS: lldb-unit :: Utility/./UtilityTests/BroadcasterTest.BroadcastEvent (1541 of 2474) UNSUPPORTED: lldb-api :: commands/trace/TestTraceTimestampCounters.py (1542 of 2474) PASS: lldb-shell :: Commands/command-breakpoint-col.test (1543 of 2474) PASS: lldb-unit :: Process/gdb-remote/./ProcessGdbRemoteTests/GDBRemoteClientBaseTest.SendContinueAndInterrupt (1544 of 2474) PASS: lldb-unit :: Utility/./UtilityTests/StringLexerTest.AdvanceIf (1545 of 2474) PASS: lldb-unit :: ScriptInterpreter/Python/./ScriptInterpreterPythonTests/PythonDataObjectsTest.TestPythonString (1546 of 2474) PASS: lldb-unit :: Utility/./UtilityTests/DataExtractorTest.GetSLEB128_bit63 (1547 of 2474) PASS: lldb-unit :: UnwindAssembly/x86/./UnwindAssemblyx86Tests/Testx86AssemblyInspectionEngine.TestPopRBPWithREX (1548 of 2474) PASS: lldb-unit :: Process/minidump/./LLDBMinidumpTests/MinidumpParserTest.GetFilteredModuleList (1549 of 2474) UNSUPPORTED: lldb-api :: commands/register/register/aarch64_sve_registers/rw_access_static_config/TestSVERegisters.py (1550 of 2474) PASS: lldb-shell :: SymbolFile/DWARF/x86/dwp.s (1551 of 2474) PASS: lldb-api :: tools/lldb-vscode/coreFile/TestVSCode_coreFile.py (1552 of 2474) PASS: lldb-unit :: Utility/./UtilityTests/RecordReplayTest.ValidSequence (1553 of 2474) PASS: lldb-unit :: UnwindAssembly/x86/./UnwindAssemblyx86Tests/Testx86AssemblyInspectionEngine.TestSpillRegToStackViaMOVi386 (1554 of 2474) PASS: lldb-api :: commands/expression/import-std-module/module-build-errors/TestStdModuleBuildErrors.py (1555 of 2474) PASS: lldb-api :: lang/objc/orderedset/TestOrderedSet.py (1556 of 2474) PASS: lldb-api :: tools/lldb-server/TestGdbRemoteAttach.py (1557 of 2474) PASS: lldb-unit :: Symbol/./SymbolTests/TestTypeSystemClang.TestDisplayName (1558 of 2474) PASS: lldb-unit :: ObjectFile/Breakpad/./ObjectFileBreakpadTests/FileRecord.parse (1559 of 2474) PASS: lldb-unit :: Utility/./UtilityTests/LogChannelTest.Disable (1560 of 2474) PASS: lldb-unit :: Utility/./UtilityTests/StringListTest.PopBack (1561 of 2474) PASS: lldb-unit :: Utility/./UtilityTests/StreamTest.PutChar (1562 of 2474) PASS: lldb-api :: functionalities/data-formatter/data-formatter-stl/libcxx/unordered/TestDataFormatterUnordered.py (1563 of 2474) PASS: lldb-api :: tools/lldb-server/inferior-crash/TestGdbRemoteSegFault.py (1564 of 2474) PASS: lldb-unit :: Utility/./UtilityTests/ArgsTest.TestInsertArg (1565 of 2474) PASS: lldb-api :: tools/lldb-server/register-reading/TestGdbRemoteGPacket.py (1566 of 2474) PASS: lldb-unit :: Host/./HostTests/NativeProcessProtocolTest.ReadCStringFromMemory_MaxSize (1567 of 2474) UNSUPPORTED: lldb-shell :: SymbolFile/PDB/variables-locations.test (1568 of 2474) PASS: lldb-shell :: Register/Core/x86-64-netbsd-multithread.test (1569 of 2474) PASS: lldb-unit :: Utility/./UtilityTests/TimerTest.CategoryTimes2 (1570 of 2474) PASS: lldb-unit :: Symbol/./SymbolTests/TestClangASTImporter.CopyDeclTagDecl (1571 of 2474) PASS: lldb-unit :: Core/./LLDBCoreTests/SourceFileCache.FindSourceFileFound (1572 of 2474) PASS: lldb-unit :: Signals/./SignalsTests/UnixSignalsTest.GetInfo (1573 of 2474) PASS: lldb-shell :: ObjectFile/Breakpad/discontiguous-sections.test (1574 of 2474) PASS: lldb-api :: lang/objc/objc-class-method/TestObjCClassMethod.py (1575 of 2474) PASS: lldb-shell :: SymbolFile/Breakpad/symtab-macho.test (1576 of 2474) UNSUPPORTED: lldb-shell :: ScriptInterpreter/Lua/io.test (1577 of 2474) PASS: lldb-unit :: Utility/./UtilityTests/StringExtractorTest.GetNameColonValueNoSemicolon (1578 of 2474) UNSUPPORTED: lldb-api :: commands/register/register/aarch64_dynamic_regset/TestArm64DynamicRegsets.py (1579 of 2474) PASS: lldb-api :: functionalities/thread/concurrent_events/TestConcurrentDelaySignalBreak.py (1580 of 2474) UNSUPPORTED: lldb-shell :: SymbolFile/PDB/ast-restore.test (1581 of 2474) PASS: lldb-shell :: Minidump/Windows/find-module.test (1582 of 2474) PASS: lldb-unit :: Language/Highlighting/./HighlighterTests/HighlighterTest.ClangTrailingBackslashBeforeNewline (1583 of 2474) PASS: lldb-api :: lang/objcxx/conflicting-names-class-update-utility-expr/TestObjCConflictingNamesForClassUpdateExpr.py (1584 of 2474) PASS: lldb-api :: functionalities/postmortem/wow64_minidump/TestWow64MiniDump.py (1585 of 2474) PASS: lldb-unit :: Process/gdb-remote/./ProcessGdbRemoteTests/GDBRemoteCommunicationServerTest.SendErrorResponse_Status (1586 of 2474) PASS: lldb-api :: commands/expression/cast_int_to_anonymous_enum/TestCastIntToAnonymousEnum.py (1587 of 2474) PASS: lldb-api :: lang/objc/modules-objc-property/TestModulesObjCProperty.py (1588 of 2474) PASS: lldb-unit :: Utility/./UtilityTests/ScalarTest.Comparison (1589 of 2474) PASS: lldb-shell :: ObjectFile/wasm/unified-debug-sections.yaml (1590 of 2474) PASS: lldb-unit :: Utility/./UtilityTests/VMRange.SetEndAddress (1591 of 2474) UNSUPPORTED: lldb-api :: functionalities/signal/handle-segv/TestHandleSegv.py (1592 of 2474) PASS: lldb-api :: functionalities/data-formatter/data-formatter-stl/libcxx/list/loop/TestDataFormatterLibcxxListLoop.py (1593 of 2474) PASS: lldb-shell :: SymbolFile/DWARF/x86/DW_AT_decl_file-DW_AT_specification-crosscu.s (1594 of 2474) PASS: lldb-unit :: Utility/./UtilityTests/UriParserTest.Minimal (1595 of 2474) PASS: lldb-shell :: Minidump/no-process-id.yaml (1596 of 2474) PASS: lldb-unit :: Host/./HostTests/SocketTests/SocketTest.UDPGetConnectURI/ipv6 (1597 of 2474) PASS: lldb-shell :: ScriptInterpreter/Python/python.test (1598 of 2474) PASS: lldb-api :: commands/expression/error-limit/TestExprErrorLimit.py (1599 of 2474) PASS: lldb-shell :: ObjectFile/PECOFF/basic-info-arm.yaml (1600 of 2474) PASS: lldb-shell :: BuildScript/toolchain-clang.test (1601 of 2474) PASS: lldb-unit :: Symbol/./SymbolTests/TestClangASTImporter.MetadataPropagation (1602 of 2474) UNSUPPORTED: lldb-shell :: Subprocess/fork-follow-parent-softbp.test (1603 of 2474) PASS: lldb-unit :: Utility/./UtilityTests/VMRange.Reset (1604 of 2474) PASS: lldb-api :: functionalities/gdb_remote_client/TestPty.py (1605 of 2474) PASS: lldb-unit :: Host/./HostTests/SocketTests/SocketTest.TCPListen0ConnectAccept/ipv4 (1606 of 2474) PASS: lldb-unit :: Core/./LLDBCoreTests/RichManglingContextTest.SwitchProvider (1607 of 2474) PASS: lldb-api :: lang/cpp/forward-declared-template-specialization/TestCppForwardDeclaredTemplateSpecialization.py (1608 of 2474) PASS: lldb-api :: functionalities/data-formatter/data-formatter-smart-array/TestDataFormatterSmartArray.py (1609 of 2474) PASS: lldb-api :: commands/expression/call-function/TestCallBuiltinFunction.py (1610 of 2474) PASS: lldb-unit :: Utility/./UtilityTests/UriParserTest.BracketedHostnamePort (1611 of 2474) PASS: lldb-shell :: SymbolFile/DWARF/x86/debug_rnglists-dwo.s (1612 of 2474) PASS: lldb-api :: functionalities/limit-debug-info/TestLimitDebugInfo.py (1613 of 2474) PASS: lldb-unit :: Host/./HostTests/SocketTests/SocketTest.DomainListenConnectAccept/ipv6 (1614 of 2474) PASS: lldb-unit :: Utility/./UtilityTests/BinaryStreamTest.PutSLEB128MaxValue (1615 of 2474) PASS: lldb-api :: lang/cpp/breakpoint_in_member_func_w_non_primitive_params/TestBreakpointInMemberFuncWNonPrimitiveParams.py (1616 of 2474) PASS: lldb-unit :: Process/minidump/./LLDBMinidumpTests/RegisterContextMinidump.CheckRegisterContextMinidump_ARM (1617 of 2474) PASS: lldb-api :: lang/cpp/function-qualifiers/TestCppFunctionQualifiers.py (1618 of 2474) UNSUPPORTED: lldb-shell :: Register/x86-db-read.test (1619 of 2474) PASS: lldb-api :: types/TestFloatTypesExpr.py (1620 of 2474) PASS: lldb-api :: python_api/lldbutil/iter/TestRegistersIterator.py (1621 of 2474) PASS: lldb-api :: commands/expression/rdar42038760/TestScalarURem.py (1622 of 2474) PASS: lldb-unit :: Target/./TargetTests/RemoteAwarePlatformTest.TestResolveExecutabelOnClientByPlatform (1623 of 2474) PASS: lldb-unit :: Utility/./UtilityTests/CompletionRequest.DuplicateFilteringWithComments (1624 of 2474) PASS: lldb-unit :: Core/./LLDBCoreTests/DumpDataExtractorTest.ItemByteSizeErrors (1625 of 2474) PASS: lldb-api :: commands/command/delete/TestCommandDelete.py (1626 of 2474) UNSUPPORTED: lldb-api :: commands/trace/TestTraceDumpInstructions.py (1627 of 2474) PASS: lldb-api :: functionalities/inferior-assert/TestInferiorAssert.py (1628 of 2474) PASS: lldb-shell :: ObjectFile/ELF/PT_LOAD.yaml (1629 of 2474) PASS: lldb-unit :: DataFormatter/./LLDBFormatterTests/StringPrinterTests.CxxASCII (1630 of 2474) PASS: lldb-unit :: Process/minidump/./LLDBMinidumpTests/MinidumpParserTest.GetThreadsAndGetThreadContext (1631 of 2474) PASS: lldb-api :: functionalities/data-formatter/data-formatter-advanced/TestDataFormatterAdv.py (1632 of 2474) PASS: lldb-api :: functionalities/thread/concurrent_events/TestConcurrentBreakpointsDelayedBreakpointOneWatchpoint.py (1633 of 2474) UNSUPPORTED: lldb-api :: lang/objc/foundation/TestFoundationDisassembly.py (1634 of 2474) PASS: lldb-api :: commands/expression/rdar44436068/Test128BitsInteger.py (1635 of 2474) PASS: lldb-unit :: Language/Highlighting/./HighlighterTests/HighlighterTest.FallbackHighlighter (1636 of 2474) PASS: lldb-api :: functionalities/breakpoint/comp_dir_symlink/TestCompDirSymLink.py (1637 of 2474) PASS: lldb-unit :: Expression/./ExpressionTests/CppModuleConfigurationTest.LinuxLocalLibCpp (1638 of 2474) PASS: lldb-api :: commands/target/create-deps/TestTargetCreateDeps.py (1639 of 2474) PASS: lldb-api :: functionalities/breakpoint/breakpoint_ids/TestBreakpointIDs.py (1640 of 2474) PASS: lldb-api :: functionalities/testid/TestTestId.py (1641 of 2474) PASS: lldb-shell :: ObjectFile/ELF/aarch64-relocations.yaml (1642 of 2474) PASS: lldb-api :: commands/target/stop-hook/delete/TestTargetStopHookDelete.py (1643 of 2474) PASS: lldb-unit :: Utility/./UtilityTests/Flags.Reset (1644 of 2474) PASS: lldb-api :: commands/expression/import-std-module/queue/TestQueueFromStdModule.py (1645 of 2474) PASS: lldb-unit :: SymbolFile/DWARF/./SymbolFileDWARFTests/SymbolFileDWARFTests.ParseArangesSkipErrors (1646 of 2474) PASS: lldb-shell :: Reproducer/TestCrash.test (1647 of 2474) UNSUPPORTED: lldb-api :: linux/aarch64/mte_tag_access/TestAArch64LinuxMTEMemoryTagAccess.py (1648 of 2474) PASS: lldb-unit :: Utility/./UtilityTests/BinaryStreamTest.PutSLEB128SevenBytes (1649 of 2474) PASS: lldb-api :: lang/cpp/overloaded-functions/TestOverloadedFunctions.py (1650 of 2474) PASS: lldb-api :: functionalities/breakpoint/address_breakpoints/TestAddressBreakpoints.py (1651 of 2474) PASS: lldb-unit :: Interpreter/./InterpreterTests/CompletionTest.DirCompletionAbsolute (1652 of 2474) PASS: lldb-unit :: Utility/./UtilityTests/StringListTest.SetSize (1653 of 2474) PASS: lldb-unit :: Utility/./UtilityTests/RangeTest.NotEqual (1654 of 2474) PASS: lldb-unit :: Utility/./UtilityTests/StreamTest.PutULEB128 (1655 of 2474) PASS: lldb-api :: functionalities/data-formatter/data-formatter-objc/TestDataFormatterObjCNSNumber.py (1656 of 2474) XFAIL: lldb-shell :: Register/x86-mm-xmm-read.test (1657 of 2474) PASS: lldb-unit :: Utility/./UtilityTests/ScalarTest.ComparisonFloat (1658 of 2474) PASS: lldb-unit :: Utility/./UtilityTests/PassiveReplayTest.InstrumentedBarRef (1659 of 2474) PASS: lldb-unit :: Process/minidump/./LLDBMinidumpTests/MinidumpParserTest.MinidumpDuplicateModuleMappedSecondHigh (1660 of 2474) UNSUPPORTED: lldb-api :: functionalities/exec/TestExec.py (1661 of 2474) PASS: lldb-unit :: SymbolFile/NativePDB/./SymbolFileNativePDBTests/PDBFPOProgramToDWARFExpressionTests.InvalidOpBinary (1662 of 2474) UNSUPPORTED: lldb-api :: tools/lldb-server/TestGdbRemoteCompletion.py (1663 of 2474) PASS: lldb-api :: functionalities/thread/concurrent_events/TestConcurrentSignalWatchBreak.py (1664 of 2474) PASS: lldb-api :: functionalities/thread/concurrent_events/TestConcurrentDelayedCrashWithBreakpointSignal.py (1665 of 2474) PASS: lldb-unit :: Utility/./UtilityTests/SerializationRountripTest.SerializeDeserializeCStringNull (1666 of 2474) PASS: lldb-api :: python_api/value_var_update/TestValueVarUpdate.py (1667 of 2474) PASS: lldb-api :: lang/cpp/diamond/TestCppDiamond.py (1668 of 2474) PASS: lldb-api :: commands/expression/call-function/TestCallStdStringFunction.py (1669 of 2474) PASS: lldb-unit :: ScriptInterpreter/Python/./ScriptInterpreterPythonTests/PythonDataObjectsTest.TestPythonByteArray (1670 of 2474) PASS: lldb-unit :: Host/./HostTests/SocketTests/SocketTest.UDPGetConnectURI/ipv4 (1671 of 2474) PASS: lldb-shell :: Register/Core/x86-32-freebsd-fp.test (1672 of 2474) PASS: lldb-api :: functionalities/archives/TestBSDArchives.py (1673 of 2474) PASS: lldb-api :: python_api/symbol-context/TestSymbolContext.py (1674 of 2474) UNSUPPORTED: lldb-api :: functionalities/tsan/global_location/TestTsanGlobalLocation.py (1675 of 2474) PASS: lldb-shell :: SymbolFile/Breakpad/line-table-discontinuous-file-ids.test (1676 of 2474) UNSUPPORTED: lldb-shell :: Register/x86-64-xmm16-write.test (1677 of 2474) PASS: lldb-unit :: Utility/./UtilityTests/StringExtractorTest.DecodeHexU8_Exact (1678 of 2474) PASS: lldb-api :: commands/frame/diagnose/virtual-method-call/TestDiagnoseDereferenceVirtualMethodCall.py (1679 of 2474) UNSUPPORTED: lldb-api :: arm/breakpoint-thumb-codesection/TestBreakpointThumbCodesection.py (1680 of 2474) PASS: lldb-api :: lang/cpp/global_variables/TestCPPGlobalVariables.py (1681 of 2474) PASS: lldb-unit :: ScriptInterpreter/Python/./ScriptInterpreterPythonTests/PythonDataObjectsTest.TestPythonCallableCheck (1682 of 2474) PASS: lldb-unit :: SymbolFile/DWARF/./SymbolFileDWARFTests/SymbolFileDWARFTests.TestAbbrevOrder1Start1 (1683 of 2474) PASS: lldb-api :: lang/cpp/rvalue-references/TestRvalueReferences.py (1684 of 2474) PASS: lldb-api :: commands/breakpoint/set/func-regex/TestBreakpointRegexError.py (1685 of 2474) PASS: lldb-api :: commands/expression/import-std-module/forward_list-dbg-info-content/TestDbgInfoContentForwardListFromStdModule.py (1686 of 2474) PASS: lldb-shell :: SymbolFile/DWARF/x86/DW_AT_data_bit_offset-DW_OP_stack_value.s (1687 of 2474) PASS: lldb-unit :: Utility/./UtilityTests/StreamTest.AddressRangeInvalidRange (1688 of 2474) PASS: lldb-unit :: Utility/./UtilityTests/ArgsTest.Yaml (1689 of 2474) PASS: lldb-unit :: Process/gdb-remote/./ProcessGdbRemoteTests/GDBRemoteClientBaseTest.SendContinueAndWait (1690 of 2474) PASS: lldb-unit :: Symbol/./SymbolTests/TestCreateClassTemplateDecl.FindExistingTemplates (1691 of 2474) PASS: lldb-unit :: Process/Utility/./ProcessUtilityTests/ProcSMapTests/LinuxProcSMapsTestFixture.ParseSMapRegions/8 (1692 of 2474) PASS: lldb-api :: lang/cpp/call-function/TestCallCPPFunction.py (1693 of 2474) UNSUPPORTED: lldb-api :: commands/expression/macros/TestMacros.py (1694 of 2474) PASS: lldb-api :: tools/lldb-vscode/stackTrace/TestVSCode_stackTrace.py (1695 of 2474) UNSUPPORTED: lldb-api :: benchmarks/stepping/TestSteppingSpeed.py (1696 of 2474) PASS: lldb-shell :: ScriptInterpreter/Python/eof.test (1697 of 2474) UNSUPPORTED: lldb-api :: benchmarks/libcxxmap/TestBenchmarkLibcxxMap.py (1698 of 2474) PASS: lldb-unit :: UnwindAssembly/x86/./UnwindAssemblyx86Tests/Testx86AssemblyInspectionEngine.TestPopESI (1699 of 2474) PASS: lldb-api :: functionalities/thread/concurrent_events/TestConcurrentDelayWatchBreak.py (1700 of 2474) PASS: lldb-unit :: Process/Utility/./ProcessUtilityTests/MemoryTagManagerAArch64MTETest.RemoveNonAddressBits (1701 of 2474) PASS: lldb-unit :: Utility/./UtilityTests/RangeTest.ContainsAddrInvalid (1702 of 2474) PASS: lldb-api :: functionalities/data-formatter/data-formatter-stl/libcxx/string/TestDataFormatterLibcxxString.py (1703 of 2474) PASS: lldb-unit :: Utility/./UtilityTests/RecordReplayTest.InstrumentedFooSameThis (1704 of 2474) PASS: lldb-api :: functionalities/breakpoint/global_constructor/TestBreakpointInGlobalConstructor.py (1705 of 2474) UNSUPPORTED: lldb-api :: python_api/event/TestEvents.py (1706 of 2474) PASS: lldb-unit :: Process/gdb-remote/./ProcessGdbRemoteTests/GDBRemoteClientBaseTest.SendContinueAndAsyncSignal (1707 of 2474) PASS: lldb-unit :: Utility/./UtilityTests/ArgsTest.ReplaceArgumentAtIndexFarOutOfRange (1708 of 2474) PASS: lldb-unit :: Utility/./UtilityTests/DataExtractorTest.GetCStrUnterminated (1709 of 2474) PASS: lldb-unit :: Language/Highlighting/./HighlighterTests/HighlighterTest.ClangComments (1710 of 2474) UNSUPPORTED: lldb-shell :: SymbolFile/PDB/vbases.test (1711 of 2474) PASS: lldb-unit :: debugserver/./debugserverTests/RNBSocket.LoopBackListenIPv6 (1712 of 2474) PASS: lldb-unit :: Utility/./UtilityTests/FileSpecTest.Match (1713 of 2474) PASS: lldb-unit :: SymbolFile/DWARF/./SymbolFileDWARFTests/XcodeSDKModuleTests.TestModuleGetXcodeSDK (1714 of 2474) PASS: lldb-api :: commands/expression/vector_of_enums/TestVectorOfEnums.py (1715 of 2474) PASS: lldb-shell :: SymbolFile/DWARF/x86/dwo-type-in-main-file.s (1716 of 2474) PASS: lldb-unit :: Utility/./UtilityTests/StringListTest.LongestCommonPrefixSingleElement (1717 of 2474) PASS: lldb-api :: functionalities/memory/find/TestMemoryFind.py (1718 of 2474) UNSUPPORTED: lldb-shell :: SymbolFile/PDB/func-symbols.test (1719 of 2474) PASS: lldb-unit :: UnwindAssembly/x86/./UnwindAssemblyx86Tests/Testx86AssemblyInspectionEngine.TestStackRealign32BitDisp_x86_64 (1720 of 2474) PASS: lldb-unit :: Expression/./ExpressionTests/DiagnosticManagerTest.AddDiagnostic (1721 of 2474) PASS: lldb-api :: functionalities/unwind/zeroth_frame/TestZerothFrame.py (1722 of 2474) PASS: lldb-unit :: Host/./HostTests/TerminalTest.PipeIsNotATerminal (1723 of 2474) PASS: lldb-unit :: Process/minidump/./LLDBMinidumpTests/MinidumpParserTest.GetLinuxProcStatus (1724 of 2474) PASS: lldb-shell :: ObjectFile/ELF/minidebuginfo-find-symbols.yaml (1725 of 2474) PASS: lldb-unit :: Host/./HostTests/TerminalTest.SaveRestore (1726 of 2474) UNSUPPORTED: lldb-api :: lang/c/typedef/Testtypedef.py (1727 of 2474) PASS: lldb-shell :: Minidump/memory-region-from-module.yaml (1728 of 2474) PASS: lldb-unit :: Utility/./UtilityTests/VMRange.IsValid (1729 of 2474) PASS: lldb-unit :: Utility/./UtilityTests/DataExtractorTest.GetMaxS64 (1730 of 2474) PASS: lldb-unit :: Utility/./UtilityTests/RangeTest.EqualInvalid (1731 of 2474) PASS: lldb-unit :: Utility/./UtilityTests/ArgsTest.TestArgv (1732 of 2474) PASS: lldb-api :: lang/cpp/modules-import/TestCXXModulesImport.py (1733 of 2474) UNSUPPORTED: lldb-api :: lang/objc/modules-update/TestClangModulesUpdate.py (1734 of 2474) PASS: lldb-unit :: Process/gdb-remote/./ProcessGdbRemoteTests/GDBRemoteClientBaseTest.SendContinueAndLateInterrupt (1735 of 2474) PASS: lldb-shell :: SymbolFile/DWARF/x86/debug-types-missing-signature.test (1736 of 2474) PASS: lldb-api :: functionalities/thread/concurrent_events/TestConcurrentTwoWatchpointThreads.py (1737 of 2474) PASS: lldb-unit :: Utility/./UtilityTests/BinaryStreamTest.PutULEB128SixBytes (1738 of 2474) PASS: lldb-shell :: Register/Core/x86-64-freebsd-multithread.test (1739 of 2474) PASS: lldb-api :: functionalities/data-formatter/data-formatter-stl/libcxx/tuple/TestDataFormatterLibcxxTuple.py (1740 of 2474) PASS: lldb-unit :: Process/gdb-remote/./ProcessGdbRemoteTests/GDBRemoteCommunicationServerTest.SendErrorResponse_ErrorList (1741 of 2474) PASS: lldb-api :: functionalities/thread/concurrent_events/TestConcurrentManyCrash.py (1742 of 2474) PASS: lldb-api :: python_api/value/change_values/TestChangeValueAPI.py (1743 of 2474) PASS: lldb-unit :: UnwindAssembly/x86/./UnwindAssemblyx86Tests/Testx86AssemblyInspectionEngine.TestStackRealign8BitDisp_i386 (1744 of 2474) PASS: lldb-api :: commands/thread/select/TestThreadSelect.py (1745 of 2474) PASS: lldb-unit :: Process/gdb-remote/./ProcessGdbRemoteTests/GDBRemoteCommunicationClientTest.GetModulesInfoInvalidResponse (1746 of 2474) PASS: lldb-shell :: Reproducer/TestFileRepro.test (1747 of 2474) PASS: lldb-unit :: Utility/./UtilityTests/SerializationRountripTest.SerializeDeserializePodPointers (1748 of 2474) PASS: lldb-unit :: Utility/./UtilityTests/BinaryStreamTest.PutSLEB128FiveBytes (1749 of 2474) PASS: lldb-unit :: Utility/./UtilityTests/StringListTest.LongestCommonPrefix (1750 of 2474) PASS: lldb-unit :: Utility/./UtilityTests/RangeTest.LessThanInvalid (1751 of 2474) PASS: lldb-unit :: Platform/./LLDBPlatformTests/PlatformAppleSimulatorTest.TestSimHasSimEnvionament (1752 of 2474) PASS: lldb-unit :: Utility/./UtilityTests/StreamTest.AddressSuffix (1753 of 2474) PASS: lldb-unit :: UnwindAssembly/x86/./UnwindAssemblyx86Tests/Testx86AssemblyInspectionEngine.TestPopEDI (1754 of 2474) PASS: lldb-unit :: Utility/./UtilityTests/RangeTest.DefaultConstructor (1755 of 2474) PASS: lldb-unit :: Utility/./UtilityTests/StringExtractorGDBRemoteTest.GetPidTidMultipleValues (1756 of 2474) PASS: lldb-unit :: Utility/./UtilityTests/SerializationRountripTest.SerializeDeserializePodReferences (1757 of 2474) PASS: lldb-shell :: ObjectFile/MachO/lc_build_version.yaml (1758 of 2474) PASS: lldb-unit :: Host/./HostTests/SocketTests/SocketTest.UDPConnect/ipv6 (1759 of 2474) PASS: lldb-api :: commands/frame/language/TestGuessLanguage.py (1760 of 2474) PASS: lldb-shell :: Breakpoint/split-dwarf-5-addrbase.test (1761 of 2474) UNSUPPORTED: lldb-api :: functionalities/asan/TestReportData.py (1762 of 2474) PASS: lldb-api :: lang/c/step-target/TestStepTarget.py (1763 of 2474) PASS: lldb-unit :: Interpreter/./InterpreterTests/OptionValueFileColonLine.setFromString (1764 of 2474) PASS: lldb-shell :: SymbolFile/DWARF/x86/gnu-style-compression.cpp (1765 of 2474) PASS: lldb-unit :: ScriptInterpreter/Python/./ScriptInterpreterPythonTests/PythonDataObjectsTest.TestPythonListToStructuredList (1766 of 2474) UNSUPPORTED: lldb-api :: commands/watchpoints/hello_watchlocation/TestWatchLocation.py (1767 of 2474) PASS: lldb-unit :: Utility/./UtilityTests/Flags.IsClear (1768 of 2474) PASS: lldb-api :: functionalities/data-formatter/data-formatter-objc/cmtime/TestDataFormatterCMTime.py (1769 of 2474) UNSUPPORTED: lldb-shell :: ObjectFile/ELF/minidebuginfo-no-lzma.yaml (1770 of 2474) PASS: lldb-unit :: Symbol/./SymbolTests/TestTypeSystemClang.TestOwningModule (1771 of 2474) PASS: lldb-api :: functionalities/unwind/noreturn/TestNoreturnUnwind.py (1772 of 2474) PASS: lldb-unit :: Utility/./UtilityTests/LogTest.LLDB_LOG_nullptr (1773 of 2474) UNSUPPORTED: lldb-api :: functionalities/data-formatter/data-formatter-stl/libstdcpp/string/TestDataFormatterStdString.py (1774 of 2474) PASS: lldb-shell :: SymbolFile/DWARF/x86/apple-index-is-used.cpp (1775 of 2474) PASS: lldb-api :: commands/expression/import-std-module/iterator/TestIteratorFromStdModule.py (1776 of 2474) PASS: lldb-unit :: UnwindAssembly/x86/./UnwindAssemblyx86Tests/Testx86AssemblyInspectionEngine.TestPushRBP (1777 of 2474) PASS: lldb-unit :: ScriptInterpreter/Python/./ScriptInterpreterPythonTests/PythonDataObjectsTest.TestRun (1778 of 2474) PASS: lldb-unit :: Target/./TargetTests/PathMappingListTest.AbsoluteTests (1779 of 2474) PASS: lldb-api :: test_utils/base/TestBaseTest.py (1780 of 2474) XFAIL: lldb-shell :: Register/x86-64-ymm-write.test (1781 of 2474) UNSUPPORTED: lldb-api :: functionalities/thread/multi_break/TestMultipleBreakpoints.py (1782 of 2474) PASS: lldb-unit :: Utility/./UtilityTests/UriParserTest.BadPort2 (1783 of 2474) UNSUPPORTED: lldb-api :: commands/expression/call-restarts/TestCallThatRestarts.py (1784 of 2474) PASS: lldb-api :: python_api/sbdata/TestSBData.py (1785 of 2474) PASS: lldb-api :: commands/expression/import-std-module/forward_list/TestForwardListFromStdModule.py (1786 of 2474) PASS: lldb-api :: commands/process/attach/attach_denied/TestAttachDenied.py (1787 of 2474) PASS: lldb-unit :: Utility/./UtilityTests/StringLexerTest.HasAtLeast (1788 of 2474) PASS: lldb-unit :: Utility/./UtilityTests/EnvironmentTest.EnvpConversion (1789 of 2474) PASS: lldb-unit :: Process/Utility/./ProcessUtilityTests/MemoryTagManagerAArch64MTETest.AddressDiff (1790 of 2474) PASS: lldb-api :: functionalities/gdb_remote_client/TestGDBRemotePlatformFile.py (1791 of 2474) PASS: lldb-unit :: Utility/./UtilityTests/StringLexerTest.Next (1792 of 2474) PASS: lldb-unit :: Utility/./UtilityTests/StringListTest.GetMaxStringLengthMixed (1793 of 2474) PASS: lldb-api :: types/TestShortTypeExpr.py (1794 of 2474) PASS: lldb-unit :: Utility/./UtilityTests/StreamTest.PutRawBytesToBigEndian (1795 of 2474) PASS: lldb-unit :: Symbol/./SymbolTests/TestTypeSystemClang.TestDeletingImplicitCopyCstrDueToMoveCStr (1796 of 2474) PASS: lldb-unit :: Utility/./UtilityTests/ArgsTest.StringListConstructor (1797 of 2474) PASS: lldb-api :: python_api/sbstructureddata/TestStructuredDataAPI.py (1798 of 2474) PASS: lldb-api :: test_utils/TestInlineTest.py (1799 of 2474) UNSUPPORTED: lldb-api :: linux/aarch64/mte_tag_faults/TestAArch64LinuxMTEMemoryTagFaults.py (1800 of 2474) PASS: lldb-shell :: Reproducer/TestVerify.test (1801 of 2474) PASS: lldb-api :: macosx/lc-note/firmware-corefile/TestFirmwareCorefiles.py (1802 of 2474) UNSUPPORTED: lldb-shell :: Subprocess/fork-follow-child-softbp.test (1803 of 2474) UNSUPPORTED: lldb-shell :: SymbolFile/DWARF/dwarf5-lazy-dwo.c (1804 of 2474) PASS: lldb-unit :: debugserver/./debugserverTests/RNBSocket.AnyListen (1805 of 2474) PASS: lldb-unit :: Symbol/./SymbolTests/LineEntryTest.GetSameLineContiguousAddressRangeNestedInline (1806 of 2474) PASS: lldb-api :: lang/cpp/namespace/TestNamespace.py (1807 of 2474) PASS: lldb-unit :: Utility/./UtilityTests/RangeDataVector.FindEntryIndexesThatContain (1808 of 2474) PASS: lldb-api :: lang/cpp/member-and-local-vars-with-same-name/TestMembersAndLocalsWithSameName.py (1809 of 2474) PASS: lldb-unit :: Utility/./UtilityTests/ArgsTest.GetArgumentArrayRef (1810 of 2474) PASS: lldb-unit :: Language/Highlighting/./HighlighterTests/HighlighterTest.ClangStringLiterals (1811 of 2474) PASS: lldb-unit :: ScriptInterpreter/Python/./ScriptInterpreterPythonTests/PythonDataObjectsTest.TestCallable (1812 of 2474) PASS: lldb-unit :: Host/./HostTests/FileSystemTest.GetByteSize (1813 of 2474) UNSUPPORTED: lldb-api :: functionalities/asan/TestMemoryHistory.py (1814 of 2474) PASS: lldb-unit :: Process/gdb-remote/./ProcessGdbRemoteTests/GDBRemoteCommunicationClientTest.GetMemoryRegionInfoInvalidResponse (1815 of 2474) PASS: lldb-api :: lang/c/inlines/TestRedefinitionsInInlines.py (1816 of 2474) PASS: lldb-unit :: Host/./HostTests/NativeProcessProtocolTest.ReadCStringFromMemory_CrossPageBoundary (1817 of 2474) UNSUPPORTED: lldb-api :: tools/lldb-server/TestGdbRemoteModuleInfo.py (1818 of 2474) PASS: lldb-shell :: Settings/TestStopCommandSourceOnError.test (1819 of 2474) PASS: lldb-api :: commands/expression/ir-interpreter-phi-nodes/TestIRInterpreterPHINodes.py (1820 of 2474) PASS: lldb-api :: functionalities/unwind/sigtramp/TestSigtrampUnwind.py (1821 of 2474) PASS: lldb-unit :: Utility/./UtilityTests/StreamTest.ChangingByteOrder (1822 of 2474) PASS: lldb-unit :: Utility/./UtilityTests/TimerTest.CategoryTimesNested (1823 of 2474) PASS: lldb-api :: commands/expression/import-std-module/vector-dbg-info-content/TestDbgInfoContentVectorFromStdModule.py (1824 of 2474) PASS: lldb-api :: lang/cpp/crtp/TestCppCRTP.py (1825 of 2474) PASS: lldb-api :: commands/target/create-no-such-arch/TestNoSuchArch.py (1826 of 2474) PASS: lldb-api :: lang/objc/objc-static-method-stripped/TestObjCStaticMethodStripped.py (1827 of 2474) PASS: lldb-shell :: Breakpoint/debug_rnglistx_rlex.test (1828 of 2474) PASS: lldb-api :: macosx/thread_suspend/TestInternalThreadSuspension.py (1829 of 2474) UNSUPPORTED: lldb-api :: tools/lldb-server/vCont-threads/TestGdbRemote_vContThreads.py (1830 of 2474) PASS: lldb-unit :: DataFormatter/./LLDBFormatterTests/TypeMatcherTests.GetMatchStringRegex (1831 of 2474) PASS: lldb-unit :: SymbolFile/DWARF/./SymbolFileDWARFTests/SymbolFileDWARFTests.TestAbilitiesForDWARF (1832 of 2474) PASS: lldb-unit :: Utility/./UtilityTests/ArgsTest.ReplaceArgumentAtIndexShort (1833 of 2474) PASS: lldb-unit :: Utility/./UtilityTests/DeserializerTest.HasData (1834 of 2474) UNSUPPORTED: lldb-shell :: Register/aarch64-gp-read.test (1835 of 2474) PASS: lldb-unit :: Utility/./UtilityTests/ConstStringTest.MangledCounterpart (1836 of 2474) PASS: lldb-api :: lang/c/function_types/TestFunctionTypes.py (1837 of 2474) PASS: lldb-api :: functionalities/unwind/noreturn/module-end/TestNoReturnModuleEnd.py (1838 of 2474) PASS: lldb-shell :: SymbolFile/DWARF/x86/debug_loc-aslr.s (1839 of 2474) PASS: lldb-unit :: Expression/./ExpressionTests/ClangExpressionDeclMapTest.TestUnknownIdentifierLookup (1840 of 2474) PASS: lldb-unit :: Process/gdb-remote/./ProcessGdbRemoteTests/GDBRemoteClientBaseTest.SendContinueAndAsyncPacket (1841 of 2474) PASS: lldb-unit :: Utility/./UtilityTests/LogChannelEnabledTest.LogGetLogThread (1842 of 2474) PASS: lldb-api :: macosx/dyld-trie-symbols/TestDyldTrieSymbols.py (1843 of 2474) PASS: lldb-unit :: Utility/./UtilityTests/StatusTest.ErrorConstructor (1844 of 2474) PASS: lldb-shell :: BuildScript/modes.test (1845 of 2474) PASS: lldb-shell :: ScriptInterpreter/Python/scripted_breakpoint.test (1846 of 2474) PASS: lldb-unit :: SymbolFile/NativePDB/./SymbolFileNativePDBTests/PDBFPOProgramToDWARFExpressionTests.InvalidAssignmentSingle (1847 of 2474) PASS: lldb-api :: functionalities/data-formatter/data-formatter-stl/libstdcpp/unique_ptr/invalid/TestDataFormatterInvalidStdUniquePtr.py (1848 of 2474) PASS: lldb-unit :: Host/./HostTests/SocketTests/SocketTest.UDPConnect/ipv4 (1849 of 2474) PASS: lldb-shell :: SymbolFile/NativePDB/globals-fundamental.cpp (1850 of 2474) PASS: lldb-api :: functionalities/data-formatter/data-formatter-globals/TestDataFormatterGlobals.py (1851 of 2474) UNSUPPORTED: lldb-api :: commands/trace/TestTraceExport.py (1852 of 2474) PASS: lldb-unit :: Language/Highlighting/./HighlighterTests/HighlighterTest.ClangOperators (1853 of 2474) PASS: lldb-api :: lang/c/set_values/TestSetValues.py (1854 of 2474) PASS: lldb-shell :: ObjectFile/ELF/duplicate-section.yaml (1855 of 2474) PASS: lldb-api :: lang/objc/objc++/TestObjCXX.py (1856 of 2474) PASS: lldb-api :: lang/cpp/class_types/TestClassTypesDisassembly.py (1857 of 2474) PASS: lldb-shell :: Driver/TestQuiet.test (1858 of 2474) UNSUPPORTED: lldb-shell :: SymbolFile/PDB/typedefs.test (1859 of 2474) PASS: lldb-shell :: SymbolFile/DWARF/x86/find-variable-dwo.cpp (1860 of 2474) UNSUPPORTED: lldb-shell :: Unwind/eh-frame-small-fde.test (1861 of 2474) UNSUPPORTED: lldb-shell :: Subprocess/vfork-follow-child-wp.test (1862 of 2474) PASS: lldb-api :: functionalities/data-formatter/data-formatter-objc/TestDataFormatterObjCNSData.py (1863 of 2474) PASS: lldb-shell :: ObjectFile/ELF/section-permissions.yaml (1864 of 2474) PASS: lldb-api :: commands/expression/codegen-crash-typedefdecl-not-in_declcontext/TestCodegenCrashTypedefDeclNotInDeclContext.py (1865 of 2474) PASS: lldb-shell :: SymbolFile/NativePDB/break-by-line.cpp (1866 of 2474) PASS: lldb-api :: functionalities/thread/concurrent_events/TestConcurrentWatchpointWithDelayWatchpointThreads.py (1867 of 2474) PASS: lldb-unit :: Process/gdb-remote/./ProcessGdbRemoteTests/GDBRemoteCommunicationClientTest.SendSignalsToIgnore (1868 of 2474) PASS: lldb-unit :: Utility/./UtilityTests/StreamTeeTest.GetStreamAtIndexOutOfBoundsEmpty (1869 of 2474) PASS: lldb-api :: commands/expression/import-std-module/deque-dbg-info-content/TestDbgInfoContentDequeFromStdModule.py (1870 of 2474) PASS: lldb-shell :: ObjectFile/ELF/section-types.yaml (1871 of 2474) PASS: lldb-api :: macosx/nslog/TestDarwinNSLogOutput.py (1872 of 2474) PASS: lldb-shell :: Breakpoint/debug_rnglist_offset_pair.test (1873 of 2474) PASS: lldb-shell :: Breakpoint/case-sensitive.test (1874 of 2474) PASS: lldb-api :: python_api/value/linked_list/TestValueAPILinkedList.py (1875 of 2474) PASS: lldb-shell :: ObjectFile/ELF/short-build-id.yaml (1876 of 2474) PASS: lldb-shell :: SymbolFile/DWARF/x86/DW_AT_low_pc-addrx.s (1877 of 2474) PASS: lldb-unit :: Process/gdb-remote/./ProcessGdbRemoteTests/GDBRemoteCommunicationClientTest.SendTraceSupportedPacket (1878 of 2474) PASS: lldb-unit :: Utility/./UtilityTests/AnsiTerminal.AtStart (1879 of 2474) PASS: lldb-api :: commands/expression/import_base_class_when_class_has_derived_member/TestImportBaseClassWhenClassHasDerivedMember.py (1880 of 2474) PASS: lldb-unit :: ScriptInterpreter/Python/./ScriptInterpreterPythonTests/PythonDataObjectsTest.TestPythonStringToStr (1881 of 2474) PASS: lldb-shell :: SymbolFile/DWARF/x86/find-method.cpp (1882 of 2474) PASS: lldb-api :: lang/objc/objc-struct-argument/TestObjCStructArgument.py (1883 of 2474) PASS: lldb-api :: functionalities/data-formatter/data-formatter-stl/generic/set/TestDataFormatterGenericSet.py (1884 of 2474) PASS: lldb-unit :: Expression/./ExpressionTests/DiagnosticManagerTest.PutStringSeverities (1885 of 2474) PASS: lldb-api :: functionalities/load_after_attach/TestLoadAfterAttach.py (1886 of 2474) PASS: lldb-api :: commands/target/dump/TestTargetDumpTypeSystem.py (1887 of 2474) PASS: lldb-unit :: Utility/./UtilityTests/ProcessInstanceInfo.DumpTable_invalidUID (1888 of 2474) PASS: lldb-api :: commands/platform/file/read/TestPlatformFileRead.py (1889 of 2474) PASS: lldb-shell :: Register/x86-multithread-write.test (1890 of 2474) PASS: lldb-unit :: Host/./HostTests/NativeProcessProtocolTest.SetBreakpoint (1891 of 2474) PASS: lldb-unit :: Process/Utility/./ProcessUtilityTests/ProcMapTests/LinuxProcMapsTestFixture.ParseMapRegions/1 (1892 of 2474) PASS: lldb-shell :: SymbolFile/Breakpad/line-table-mixed-path-styles.test (1893 of 2474) PASS: lldb-api :: tools/lldb-vscode/variables/TestVSCode_variables.py (1894 of 2474) PASS: lldb-api :: functionalities/postmortem/minidump/TestMiniDump.py (1895 of 2474) PASS: lldb-unit :: Language/Highlighting/./HighlighterTests/HighlighterTest.ClangSquareBrackets (1896 of 2474) PASS: lldb-unit :: Utility/./UtilityTests/BinaryStreamTest.PutULEB128NineBytes (1897 of 2474) PASS: lldb-unit :: Utility/./UtilityTests/AnsiTerminal.Twice (1898 of 2474) PASS: lldb-unit :: Utility/./UtilityTests/RangeTest.Constructor (1899 of 2474) PASS: lldb-api :: tools/lldb-server/commandline/TestStubSetSID.py (1900 of 2474) PASS: lldb-api :: functionalities/dynamic_value_child_count/TestDynamicValueChildCount.py (1901 of 2474) PASS: lldb-api :: functionalities/postmortem/minidump-new/TestMiniDumpUUID.py (1902 of 2474) PASS: lldb-api :: commands/expression/test/TestExprs2.py (1903 of 2474) PASS: lldb-shell :: SymbolFile/NativePDB/ast-functions.cpp (1904 of 2474) PASS: lldb-unit :: Utility/./UtilityTests/UriParserTest.MinimalPort (1905 of 2474) PASS: lldb-api :: commands/target/stop-hook/disable/TestTargetStopHookDisable.py (1906 of 2474) PASS: lldb-api :: lang/c/stepping/TestThreadStepping.py (1907 of 2474) PASS: lldb-unit :: Utility/./UtilityTests/DataExtractorTest.GetDouble (1908 of 2474) PASS: lldb-api :: functionalities/breakpoint/debugbreak/TestDebugBreak.py (1909 of 2474) UNSUPPORTED: lldb-api :: benchmarks/expression/TestRepeatedExprs.py (1910 of 2474) PASS: lldb-unit :: Core/./LLDBCoreTests/SourceFileCache.FindSourceFileNotFound (1911 of 2474) PASS: lldb-api :: functionalities/show_location/TestShowLocationDwarf5.py (1912 of 2474) PASS: lldb-api :: functionalities/postmortem/elf-core/thread_crash/TestLinuxCoreThreads.py (1913 of 2474) XFAIL: lldb-shell :: Register/x86-fp-write.test (1914 of 2474) PASS: lldb-unit :: Utility/./UtilityTests/StreamTeeTest.Constructor1Stream (1915 of 2474) PASS: lldb-api :: functionalities/gdb_remote_client/TestGDBRemoteLoad.py (1916 of 2474) PASS: lldb-unit :: ScriptInterpreter/Python/./ScriptInterpreterPythonTests/PythonDataObjectsTest.TestBorrowedReferences (1917 of 2474) PASS: lldb-api :: functionalities/data-formatter/data-formatter-proper-plurals/TestFormattersOneIsSingular.py (1918 of 2474) PASS: lldb-unit :: Utility/./UtilityTests/CompletionRequest.TryCompleteCurrentArgBad (1919 of 2474) PASS: lldb-shell :: Unwind/eh-frame-dwarf-unwind.test (1920 of 2474) PASS: lldb-unit :: Utility/./UtilityTests/StreamTest.PutSLEB128 (1921 of 2474) PASS: lldb-unit :: Utility/./UtilityTests/ArgsTest.TestSingleArgWithQuotedSpace (1922 of 2474) PASS: lldb-unit :: Process/Utility/./ProcessUtilityTests/MemoryTagManagerAArch64MTETest.MakeTaggedRange (1923 of 2474) PASS: lldb-api :: functionalities/float-display/TestFloatDisplay.py (1924 of 2474) PASS: lldb-api :: commands/platform/basic/TestPlatformCommand.py (1925 of 2474) PASS: lldb-api :: functionalities/gdb_remote_client/TestNoWatchpointSupportInfo.py (1926 of 2474) PASS: lldb-api :: python_api/process/io/TestProcessIO.py (1927 of 2474) UNSUPPORTED: lldb-api :: linux/aarch64/tagged_memory_region/TestAArch64LinuxTaggedMemoryRegion.py (1928 of 2474) PASS: lldb-api :: tools/lldb-server/TestLldbGdbServer.py (1929 of 2474) PASS: lldb-unit :: Language/CPlusPlus/./LanguageCPlusPlusTests/CPlusPlusLanguage.GenerateAlternateFunctionManglings (1930 of 2474) PASS: lldb-unit :: Process/Utility/./ProcessUtilityTests/RegisterContext_x86Test.AbridgedToFullTagWord (1931 of 2474) PASS: lldb-unit :: Process/minidump/./LLDBMinidumpTests/MinidumpParserTest.GetMemoryRegionInfoFromMemory64List (1932 of 2474) PASS: lldb-unit :: Core/./LLDBCoreTests/FormatEntityTest.DefinitionConstructionNameTypeData (1933 of 2474) PASS: lldb-unit :: UnwindAssembly/x86/./UnwindAssemblyx86Tests/Testx86AssemblyInspectionEngine.Test32BitOnlyInstruction (1934 of 2474) PASS: lldb-api :: macosx/indirect_symbol/TestIndirectSymbols.py (1935 of 2474) PASS: lldb-api :: commands/expression/import-std-module/weak_ptr/TestWeakPtrFromStdModule.py (1936 of 2474) PASS: lldb-api :: commands/expression/dollar-in-variable/TestDollarInVariable.py (1937 of 2474) PASS: lldb-shell :: ObjectFile/PECOFF/section-types.yaml (1938 of 2474) PASS: lldb-unit :: ScriptInterpreter/Python/./ScriptInterpreterPythonTests/PythonDataObjectsTest.TestExceptions (1939 of 2474) PASS: lldb-api :: functionalities/gdb_remote_client/TestGDBRemoteClient.py (1940 of 2474) PASS: lldb-api :: python_api/watchpoint/TestWatchpointIgnoreCount.py (1941 of 2474) PASS: lldb-shell :: Register/Core/x86-64-freebsd-gp.test (1942 of 2474) PASS: lldb-api :: functionalities/breakpoint/breakpoint_command/TestBreakpointCommand.py (1943 of 2474) PASS: lldb-unit :: Core/./LLDBCoreTests/MangledTest.EmptyForInvalidName (1944 of 2474) PASS: lldb-api :: functionalities/data-formatter/poarray/TestPrintObjectArray.py (1945 of 2474) PASS: lldb-unit :: Utility/./UtilityTests/LogChannelTest.Enable (1946 of 2474) PASS: lldb-unit :: Utility/./UtilityTests/StringExtractorTest.DecodeHexU8_Underflow2 (1947 of 2474) PASS: lldb-shell :: ObjectFile/ELF/PT_LOAD-overlap-PT_INTERP.yaml (1948 of 2474) PASS: lldb-shell :: SymbolFile/DWARF/x86/debug_loc.s (1949 of 2474) PASS: lldb-unit :: Process/Utility/./ProcessUtilityTests/ProcSMapTests/LinuxProcSMapsTestFixture.ParseSMapRegions/4 (1950 of 2474) PASS: lldb-shell :: ObjectFile/MachO/lc_build_version_notools.yaml (1951 of 2474) PASS: lldb-api :: functionalities/thread/concurrent_events/TestConcurrentTwoBreakpointsOneWatchpoint.py (1952 of 2474) PASS: lldb-unit :: Process/minidump/./LLDBMinidumpTests/MinidumpParserTest.GetMemoryRegionInfoFromMemoryList (1953 of 2474) PASS: lldb-api :: tools/lldb-vscode/launch/TestVSCode_launch.py (1954 of 2474) PASS: lldb-api :: commands/watchpoints/watchpoint_commands/condition/TestWatchpointConditionCmd.py (1955 of 2474) PASS: lldb-api :: commands/command/invalid-args/TestInvalidArgsCommand.py (1956 of 2474) PASS: lldb-api :: commands/expression/pr35310/TestExprsBug35310.py (1957 of 2474) PASS: lldb-unit :: Process/Utility/./ProcessUtilityTests/ProcSMapTests/LinuxProcSMapsTestFixture.ParseSMapRegions/7 (1958 of 2474) PASS: lldb-api :: commands/expression/static-initializers/TestStaticInitializers.py (1959 of 2474) PASS: lldb-api :: lang/objc/objc_direct-methods/TestObjCDirectMethods.py (1960 of 2474) PASS: lldb-shell :: Reproducer/Functionalities/TestExpressionEvaluation.test (1961 of 2474) PASS: lldb-shell :: SymbolFile/DWARF/x86/win-i386-line-table.s (1962 of 2474) PASS: lldb-api :: functionalities/data-formatter/stringprinter/TestStringPrinter.py (1963 of 2474) PASS: lldb-unit :: tools/lldb-server/tests/./LLDBServerTests/StandardStartupTest.TestStopReplyContainsThreadPcs (1964 of 2474) PASS: lldb-unit :: Language/Highlighting/./HighlighterTests/HighlighterTest.ClangCursorPosInOtherToken (1965 of 2474) UNSUPPORTED: lldb-shell :: SymbolFile/PDB/enums-layout.test (1966 of 2474) PASS: lldb-api :: functionalities/data-formatter/refpointer-recursion/TestDataFormatterRefPtrRecursion.py (1967 of 2474) PASS: lldb-unit :: Interpreter/./InterpreterTests/OptionValueString.DeepCopy (1968 of 2474) PASS: lldb-api :: functionalities/data-formatter/data-formatter-objc/TestDataFormatterObjCPlain.py (1969 of 2474) PASS: lldb-unit :: SymbolFile/DWARF/./SymbolFileDWARFTests/DWARFUnitTest.LLVMGCCProducer (1970 of 2474) PASS: lldb-unit :: Utility/./UtilityTests/RangeTest.Copy (1971 of 2474) PASS: lldb-unit :: Utility/./UtilityTests/ArchSpecTest.TripleComponentsWereSpecified (1972 of 2474) PASS: lldb-api :: lang/cpp/stl/TestStdCXXDisassembly.py (1973 of 2474) PASS: lldb-unit :: Target/./TargetTests/ExecutionContextTest.GetByteOrder (1974 of 2474) PASS: lldb-unit :: Utility/./UtilityTests/UserIDResolver.GetGroupName (1975 of 2474) PASS: lldb-api :: functionalities/thread/concurrent_events/TestConcurrentDelaySignalWatch.py (1976 of 2474) PASS: lldb-unit :: Process/Utility/./ProcessUtilityTests/MemoryTagManagerAArch64MTETest.RepeatTagsForRange (1977 of 2474) UNSUPPORTED: lldb-api :: terminal/TestEditline.py (1978 of 2474) PASS: lldb-unit :: DataFormatter/./LLDBFormatterTests/StringPrinterTests.CxxUTF8 (1979 of 2474) PASS: lldb-api :: functionalities/data-formatter/data-formatter-synthval/TestDataFormatterSynthVal.py (1980 of 2474) PASS: lldb-shell :: Quit/TestQuitExitCodeTooManyArgs.test (1981 of 2474) PASS: lldb-unit :: Symbol/./SymbolTests/TestClangASTImporter.MetadataPropagationIndirectImport (1982 of 2474) PASS: lldb-unit :: Target/./TargetTests/MCBasedABI.MapRegisterName (1983 of 2474) PASS: lldb-unit :: Process/minidump/./LLDBMinidumpTests/MinidumpParserTest.GetMemory (1984 of 2474) PASS: lldb-unit :: Utility/./UtilityTests/SubsystemRAIITest.SubsystemWithErrorFailure (1985 of 2474) PASS: lldb-api :: commands/expression/xvalue/TestXValuePrinting.py (1986 of 2474) PASS: lldb-unit :: UnwindAssembly/x86/./UnwindAssemblyx86Tests/Testx86AssemblyInspectionEngine.TestPushExtended (1987 of 2474) PASS: lldb-unit :: Host/./HostTests/FileSystemTest.OpenErrno (1988 of 2474) PASS: lldb-shell :: SymbolFile/DWARF/x86/find-variable-file.cpp (1989 of 2474) UNSUPPORTED: lldb-shell :: Minidump/Windows/arm-fp-unwind.test (1990 of 2474) UNSUPPORTED: lldb-api :: functionalities/ubsan/user-expression/TestUbsanUserExpression.py (1991 of 2474) PASS: lldb-unit :: UnwindAssembly/x86/./UnwindAssemblyx86Tests/Testx86AssemblyInspectionEngine.TestPopR12 (1992 of 2474) PASS: lldb-api :: functionalities/data-formatter/data-formatter-objc/TestDataFormatterObjCNSDate.py (1993 of 2474) PASS: lldb-unit :: Platform/./LLDBPlatformTests/PlatformDarwinTest.GetCompatibleArchARMv4 (1994 of 2474) PASS: lldb-unit :: Utility/./UtilityTests/ScalarTest.GetBytes (1995 of 2474) PASS: lldb-api :: lang/cpp/class-template-parameter-pack/TestClassTemplateParameterPack.py (1996 of 2474) PASS: lldb-api :: commands/expression/context-object-objc/TestContextObjectObjc.py (1997 of 2474) PASS: lldb-api :: commands/expression/import-std-module/list-dbg-info-content/TestDbgInfoContentListFromStdModule.py (1998 of 2474) PASS: lldb-unit :: Language/Highlighting/./HighlighterTests/HighlighterTest.Colons (1999 of 2474) PASS: lldb-shell :: Driver/TestConvenienceVariables.test (2000 of 2474) PASS: lldb-api :: commands/expression/codegen-crash-import-def-arraytype-element/TestImportDefinitionArrayType.py (2001 of 2474) PASS: lldb-unit :: Process/minidump/./LLDBMinidumpTests/MinidumpParserTest.FindMemoryRange (2002 of 2474) PASS: lldb-api :: lang/c/const_variables/TestConstVariables.py (2003 of 2474) PASS: lldb-unit :: Utility/./UtilityTests/ListenerTest.GetEventImmediate (2004 of 2474) PASS: lldb-api :: tools/lldb-server/TestGdbRemoteAttachOrWait.py (2005 of 2474) PASS: lldb-unit :: Utility/./UtilityTests/ScalarTest.Getters (2006 of 2474) PASS: lldb-unit :: Utility/./UtilityTests/FileSpecTest.PrependPathComponent (2007 of 2474) PASS: lldb-api :: macosx/save_crashlog/TestSaveCrashlog.py (2008 of 2474) PASS: lldb-unit :: Utility/./UtilityTests/UriParserTest.BadPort (2009 of 2474) PASS: lldb-api :: functionalities/breakpoint/address_breakpoints/TestBadAddressBreakpoints.py (2010 of 2474) PASS: lldb-shell :: ScriptInterpreter/None/import_module.test (2011 of 2474) PASS: lldb-api :: commands/expression/timeout/TestCallWithTimeout.py (2012 of 2474) PASS: lldb-unit :: Utility/./UtilityTests/DataExtractorTest.GetFloatUnaligned (2013 of 2474) PASS: lldb-shell :: SymbolFile/DWARF/x86/dead-code-filtering.yaml (2014 of 2474) PASS: lldb-api :: functionalities/tail_call_frames/cross_object/TestCrossObjectTailCalls.py (2015 of 2474) PASS: lldb-unit :: UnwindAssembly/x86/./UnwindAssemblyx86Tests/Testx86AssemblyInspectionEngine.TestSimplei386ugmented (2016 of 2474) PASS: lldb-unit :: Expression/./ExpressionTests/CppModuleConfigurationTest.MissingLibCpp (2017 of 2474) PASS: lldb-unit :: Utility/./UtilityTests/RangeTest.ContainsEndInclusive (2018 of 2474) PASS: lldb-api :: functionalities/pointer_num_children/TestPointerNumChildren.py (2019 of 2474) PASS: lldb-api :: lang/objc/rdar-10967107/TestRdar10967107.py (2020 of 2474) PASS: lldb-unit :: Utility/./UtilityTests/StringListTest.GetMaxStringLengthIncreasingSize (2021 of 2474) PASS: lldb-shell :: Reproducer/TestDebugSymbols.test (2022 of 2474) PASS: lldb-unit :: Platform/./LLDBPlatformTests/PlatformDarwinTest.TestParseVersionBuildDir (2023 of 2474) PASS: lldb-unit :: Host/./HostTests/MainLoopTest.Signal (2024 of 2474) PASS: lldb-api :: lang/c/forward/TestForwardDeclaration.py (2025 of 2474) PASS: lldb-shell :: SymbolFile/DWARF/x86/dir-separator-no-comp-dir-relative-name.s (2026 of 2474) PASS: lldb-shell :: Settings/TestFrameFormatNoColor.test (2027 of 2474) PASS: lldb-unit :: Utility/./UtilityTests/RegularExpression.Valid (2028 of 2474) PASS: lldb-unit :: Utility/./UtilityTests/StringExtractorTest.GetNameColonValueContainsColon (2029 of 2474) PASS: lldb-unit :: Utility/./UtilityTests/StringExtractorTest.GetU32BigEndian (2030 of 2474) PASS: lldb-unit :: Process/minidump/./LLDBMinidumpTests/MinidumpParserTest.MinidumpDuplicateModuleSeparateCode (2031 of 2474) PASS: lldb-unit :: Target/./TargetTests/FindFileTest.FindFileTests (2032 of 2474) PASS: lldb-api :: functionalities/data-formatter/builtin-formats/TestBuiltinFormats.py (2033 of 2474) PASS: lldb-api :: python_api/watchpoint/watchlocation/TestSetWatchlocation.py (2034 of 2474) PASS: lldb-unit :: Core/./LLDBCoreTests/MangledTest.ResultForValidName (2035 of 2474) PASS: lldb-unit :: Utility/./UtilityTests/LogTest.Unregister (2036 of 2474) PASS: lldb-api :: functionalities/jitloader_gdb/TestJITLoaderGDB.py (2037 of 2474) PASS: lldb-unit :: Process/gdb-remote/./ProcessGdbRemoteTests/PortMapTest.FreePortForProcess (2038 of 2474) PASS: lldb-api :: functionalities/data-formatter/data-formatter-stl/libcxx/list/TestDataFormatterLibcxxList.py (2039 of 2474) PASS: lldb-shell :: SymbolFile/DWARF/x86/dwarf5-implicit-const.s (2040 of 2474) PASS: lldb-api :: lang/cpp/this_class_type_mixing/TestThisClassTypeMixing.py (2041 of 2474) PASS: lldb-shell :: ObjectFile/Breakpad/breakpad-identification.test (2042 of 2474) UNSUPPORTED: lldb-shell :: Register/x86-gp-write.test (2043 of 2474) PASS: lldb-unit :: Process/Utility/./ProcessUtilityTests/ProcMapTests/LinuxProcMapsTestFixture.ParseMapRegions/7 (2044 of 2474) PASS: lldb-api :: functionalities/gdb_remote_client/TestMemoryRegionDirtyPages.py (2045 of 2474) PASS: lldb-api :: functionalities/data-formatter/data-formatter-stl/libcxx/optional/TestDataFormatterLibcxxOptional.py (2046 of 2474) PASS: lldb-shell :: ScriptInterpreter/Python/silent_command_script_import.test (2047 of 2474) PASS: lldb-unit :: Utility/./UtilityTests/BinaryStreamTest.PutSLEB128SixBytes (2048 of 2474) PASS: lldb-shell :: SymbolFile/DWARF/x86/debug-types-line-tables.s (2049 of 2474) PASS: lldb-unit :: Utility/./UtilityTests/BinaryStreamTest.PutULEB128One (2050 of 2474) PASS: lldb-shell :: ObjectFile/ELF/section-overlap.yaml (2051 of 2474) PASS: lldb-api :: commands/watchpoints/watchpoint_set_command/TestWatchLocationWithWatchSet.py (2052 of 2474) PASS: lldb-unit :: Core/./LLDBCoreTests/SourceLocationSpecTest.Equal (2053 of 2474) PASS: lldb-shell :: BuildScript/script-args.test (2054 of 2474) PASS: lldb-unit :: Utility/./UtilityTests/DataExtractorTest.GetMaxU64_unchecked (2055 of 2474) PASS: lldb-unit :: Target/./TargetTests/PathMappingListTest.CrossPlatformTests (2056 of 2474) PASS: lldb-api :: lang/objc/modules-inline-functions/TestModulesInlineFunctions.py (2057 of 2474) PASS: lldb-api :: commands/frame/diagnose/complicated-expression/TestComplicatedExpression.py (2058 of 2474) PASS: lldb-shell :: ScriptInterpreter/Python/Crashlog/no_threadState.test (2059 of 2474) UNSUPPORTED: lldb-api :: functionalities/data-formatter/data-formatter-stl/libstdcpp/tuple/TestDataFormatterStdTuple.py (2060 of 2474) PASS: lldb-unit :: Utility/./UtilityTests/StringExtractorTest.GetHexBytesAvail_Partial (2061 of 2474) PASS: lldb-unit :: Process/minidump/./LLDBMinidumpTests/MinidumpParserTest.MinidumpModuleOrder (2062 of 2474) PASS: lldb-unit :: SymbolFile/DWARF/./SymbolFileDWARFTests/SymbolFileDWARFTests.TestAbbrevNullAttrValidForm (2063 of 2474) PASS: lldb-unit :: Utility/./UtilityTests/StreamTest.Indent (2064 of 2474) PASS: lldb-api :: functionalities/var_path/TestVarPath.py (2065 of 2474) UNSUPPORTED: lldb-shell :: Register/x86-fp-read.test (2066 of 2474) PASS: lldb-api :: commands/expression/weak_symbols/TestWeakSymbols.py (2067 of 2474) PASS: lldb-unit :: Utility/./UtilityTests/StringExtractorTest.GetHexBytesAvail (2068 of 2474) PASS: lldb-api :: commands/expression/inline-namespace/TestInlineNamespace.py (2069 of 2474) PASS: lldb-unit :: Expression/./ExpressionTests/ClangHostTest.ComputeClangResourceDirectory (2070 of 2474) UNSUPPORTED: lldb-api :: benchmarks/continue/TestBenchmarkContinue.py (2071 of 2474) PASS: lldb-unit :: Symbol/./SymbolTests/TestScratchTypeSystemClang.InferSubASTFromLangOpts (2072 of 2474) PASS: lldb-api :: functionalities/tail_call_frames/disambiguate_tail_call_seq/TestDisambiguateTailCallSeq.py (2073 of 2474) PASS: lldb-shell :: ScriptInterpreter/None/none.test (2074 of 2474) PASS: lldb-unit :: Utility/./UtilityTests/StringListTest.SplitIntoLines (2075 of 2474) PASS: lldb-api :: lang/objc/objc-super/TestObjCSuper.py (2076 of 2474) PASS: lldb-unit :: Utility/./UtilityTests/OptionsWithRawTest.EmptyArgsOnlySuffix (2077 of 2474) PASS: lldb-api :: lang/c/shared_lib/TestSharedLib.py (2078 of 2474) PASS: lldb-api :: functionalities/thread/create_after_attach/TestCreateAfterAttach.py (2079 of 2474) PASS: lldb-shell :: Commands/command-thread-select.test (2080 of 2474) PASS: lldb-shell :: SymbolFile/DWARF/x86/module-ownership.mm (2081 of 2474) PASS: lldb-unit :: UnwindAssembly/x86/./UnwindAssemblyx86Tests/Testx86AssemblyInspectionEngine.TestPushEBP (2082 of 2474) PASS: lldb-unit :: Utility/./UtilityTests/DataExtractorTest.GetCStr (2083 of 2474) UNSUPPORTED: lldb-shell :: Subprocess/clone-follow-parent-wp.test (2084 of 2474) PASS: lldb-api :: functionalities/data-formatter/summary-string-onfail/Test-rdar-9974002.py (2085 of 2474) PASS: lldb-api :: macosx/debugserver-exit-code/TestDebugServerExitCode.py (2086 of 2474) PASS: lldb-api :: functionalities/gdb_remote_client/TestGDBRemoteDiskFileCompletion.py (2087 of 2474) PASS: lldb-api :: lang/c/offsetof/TestOffsetof.py (2088 of 2474) PASS: lldb-api :: functionalities/gdb_remote_client/TestStopPCs.py (2089 of 2474) PASS: lldb-api :: macosx/order/TestOrderFile.py (2090 of 2474) PASS: lldb-api :: lang/objcxx/objcxx-ivar-vector/TestIvarVector.py (2091 of 2474) PASS: lldb-unit :: Utility/./UtilityTests/CompletionRequest.TryCompleteCurrentArgGood (2092 of 2474) PASS: lldb-api :: commands/expression/unwind_expression/TestUnwindExpression.py (2093 of 2474) PASS: lldb-unit :: Utility/./UtilityTests/StringExtractorTest.GetHexBytes (2094 of 2474) UNSUPPORTED: lldb-api :: functionalities/tsan/basic/TestTsanBasic.py (2095 of 2474) PASS: lldb-api :: lang/cpp/function-local-class/TestCppFunctionLocalClass.py (2096 of 2474) PASS: lldb-shell :: Settings/TestLineMarkerColor.test (2097 of 2474) PASS: lldb-api :: commands/expression/import-std-module/list/TestListFromStdModule.py (2098 of 2474) PASS: lldb-unit :: Utility/./UtilityTests/StringExtractorTest.GetHexU8_InvalidHex (2099 of 2474) UNSUPPORTED: lldb-shell :: Register/arm-gp-read.test (2100 of 2474) PASS: lldb-api :: lang/objc/objc-foundation-dictionary-empty/TestNSDictionary0.py (2101 of 2474) PASS: lldb-unit :: Utility/./UtilityTests/DataExtractorTest.GetCStrAtNullOffset (2102 of 2474) PASS: lldb-api :: types/TestShortType.py (2103 of 2474) PASS: lldb-unit :: ObjectFile/PECOFF/./ObjectFilePECOFFTests/PECallFrameInfoTest.Chained_eh (2104 of 2474) PASS: lldb-api :: lang/cpp/namespace/TestNamespaceLookup.py (2105 of 2474) PASS: lldb-api :: functionalities/multiword-commands/TestMultiWordCommands.py (2106 of 2474) PASS: lldb-api :: functionalities/process_crash_info/TestProcessCrashInfo.py (2107 of 2474) UNSUPPORTED: lldb-api :: iohandler/resize/TestIOHandlerResize.py (2108 of 2474) UNSUPPORTED: lldb-shell :: Register/x86-64-zmm-write.test (2109 of 2474) UNSUPPORTED: lldb-api :: tools/lldb-server/registers-target-xml-reading/TestGdbRemoteTargetXmlPacket.py (2110 of 2474) PASS: lldb-shell :: Driver/TestProcessAttach.test (2111 of 2474) PASS: lldb-shell :: ObjectFile/ELF/build-id-case.yaml (2112 of 2474) PASS: lldb-shell :: SymbolFile/NativePDB/function-types-calling-conv.cpp (2113 of 2474) UNSUPPORTED: lldb-api :: macosx/simulator/TestSimulatorPlatform.py (2114 of 2474) PASS: lldb-unit :: Utility/./UtilityTests/UserIDResolver.GetUserName (2115 of 2474) PASS: lldb-unit :: Utility/./UtilityTests/RecordReplayTest.InstrumentedBar (2116 of 2474) PASS: lldb-unit :: Utility/./UtilityTests/UriParserTest.PortOverflow (2117 of 2474) PASS: lldb-api :: lang/objc/print-obj/TestPrintObj.py (2118 of 2474) PASS: lldb-shell :: Settings/TestSettingsWrite.test (2119 of 2474) PASS: lldb-shell :: ScriptInterpreter/Python/fail_breakpoint_oneline.test (2120 of 2474) PASS: lldb-unit :: UnwindAssembly/x86/./UnwindAssemblyx86Tests/Testx86AssemblyInspectionEngine.TestPushRBPWithREX (2121 of 2474) PASS: lldb-unit :: Platform/./LLDBPlatformTests/PlatformDarwinTest.GetCompatibleArchARMv7k (2122 of 2474) PASS: lldb-unit :: Utility/./UtilityTests/SerializationRountripTest.SerializeDeserializeObjectReference (2123 of 2474) PASS: lldb-api :: python_api/objc_type/TestObjCType.py (2124 of 2474) PASS: lldb-shell :: SymbolFile/NativePDB/disassembly.cpp (2125 of 2474) PASS: lldb-shell :: Reproducer/TestRelativePath.test (2126 of 2474) PASS: lldb-api :: functionalities/data-formatter/data-formatter-skip-summary/TestDataFormatterSkipSummary.py (2127 of 2474) PASS: lldb-api :: lang/objc/objc-new-syntax/TestObjCNewSyntaxDictionary.py (2128 of 2474) PASS: lldb-shell :: SymbolFile/DWARF/x86/childless-compile-unit.s (2129 of 2474) PASS: lldb-api :: linux/builtin_trap/TestBuiltinTrap.py (2130 of 2474) PASS: lldb-shell :: SymbolFile/DWARF/x86/inline-function-address-shared.test (2131 of 2474) PASS: lldb-api :: commands/command/script/import/rdar-12586188/TestRdar12586188.py (2132 of 2474) PASS: lldb-api :: commands/expression/ir-interpreter/TestIRInterpreter.py (2133 of 2474) PASS: lldb-api :: functionalities/gdb_remote_client/TestRemoteRegNums.py (2134 of 2474) PASS: lldb-shell :: Error/assert.test (2135 of 2474) PASS: lldb-api :: functionalities/tail_call_frames/disambiguate_paths_to_common_sink/TestDisambiguatePathsToCommonSink.py (2136 of 2474) PASS: lldb-shell :: Reproducer/TestDriverOptions.test (2137 of 2474) PASS: lldb-api :: functionalities/gdb_remote_client/TestNoLocalFile.py (2138 of 2474) PASS: lldb-unit :: Host/./HostTests/NativeProcessProtocolTest.SetBreakpointFailRead (2139 of 2474) PASS: lldb-api :: tools/lldb-server/thread-name/TestGdbRemoteThreadName.py (2140 of 2474) PASS: lldb-unit :: Host/./HostTests/TerminalTest.SetCanonical (2141 of 2474) PASS: lldb-unit :: Utility/./UtilityTests/StreamTest.PutHex16ByteOrderBig (2142 of 2474) PASS: lldb-unit :: Utility/./UtilityTests/StreamTest.SetIndentLevel (2143 of 2474) UNSUPPORTED: lldb-shell :: Register/x86-64-zmm-read.test (2144 of 2474) PASS: lldb-api :: lang/c/builtin-types/TestCBuiltinTypes.py (2145 of 2474) PASS: lldb-unit :: Utility/./UtilityTests/Flags.AnyClear (2146 of 2474) PASS: lldb-shell :: Register/x86-64-ymm-read.test (2147 of 2474) PASS: lldb-unit :: Utility/./UtilityTests/CompletionRequest.TestCompletionOwnership (2148 of 2474) PASS: lldb-api :: tools/lldb-server/TestGdbRemoteProcessInfo.py (2149 of 2474) PASS: lldb-shell :: Register/Core/x86-32-netbsd-multithread.test (2150 of 2474) PASS: lldb-shell :: Driver/TestTarget.test (2151 of 2474) PASS: lldb-shell :: Process/TestEnvironment.test (2152 of 2474) PASS: lldb-api :: commands/expression/options/TestExprOptions.py (2153 of 2474) PASS: lldb-unit :: Utility/./UtilityTests/TimeoutTest.Construction (2154 of 2474) PASS: lldb-api :: functionalities/signal/handle-abrt/TestHandleAbort.py (2155 of 2474) PASS: lldb-unit :: API/./APITests/SBStructuredDataTest.NullImpl (2156 of 2474) PASS: lldb-unit :: Utility/./UtilityTests/ConstStringTest.FromMidOfBufferStringRef (2157 of 2474) PASS: lldb-unit :: Utility/./UtilityTests/RangeTest.DoesIntersect (2158 of 2474) PASS: lldb-api :: lang/objcxx/hide-runtime-values/TestObjCXXHideRuntimeValues.py (2159 of 2474) PASS: lldb-api :: functionalities/object-file/TestImageListMultiArchitecture.py (2160 of 2474) PASS: lldb-api :: commands/command/nested_alias/TestNestedAlias.py (2161 of 2474) PASS: lldb-api :: lang/objc/objc-checker/TestObjCCheckers.py (2162 of 2474) PASS: lldb-unit :: Utility/./UtilityTests/StringListTest.LongestCommonPrefixEmpty (2163 of 2474) PASS: lldb-unit :: Utility/./UtilityTests/DataExtractorTest.GetMaxU64 (2164 of 2474) PASS: lldb-shell :: ObjectFile/ELF/base-address.yaml (2165 of 2474) PASS: lldb-unit :: Target/./TargetTests/ModuleCacheTest.GetAndPutUuidExists (2166 of 2474) UNSUPPORTED: lldb-api :: lang/cpp/function-template-parameter-pack/TestFunctionTemplateParameterPack.py (2167 of 2474) PASS: lldb-unit :: Utility/./UtilityTests/OptionsWithRawTest.SingleWordSuffix (2168 of 2474) PASS: lldb-api :: functionalities/dead-strip/TestDeadStrip.py (2169 of 2474) PASS: lldb-api :: python_api/sblaunchinfo/TestSBLaunchInfo.py (2170 of 2474) PASS: lldb-api :: types/TestCharTypeExpr.py (2171 of 2474) PASS: lldb-unit :: Utility/./UtilityTests/GeneratorTest.Create (2172 of 2474) PASS: lldb-shell :: ObjectFile/ELF/minidebuginfo-corrupt-xz.yaml (2173 of 2474) PASS: lldb-shell :: Reproducer/TestMultipleTargets.test (2174 of 2474) PASS: lldb-shell :: Minidump/disassemble-no-module.yaml (2175 of 2474) PASS: lldb-api :: functionalities/unused-inlined-parameters/TestUnusedInlinedParameters.py (2176 of 2474) PASS: lldb-unit :: UnwindAssembly/x86/./UnwindAssemblyx86Tests/Testx86AssemblyInspectionEngine.TestSimplex86_64Augmented (2177 of 2474) PASS: lldb-shell :: SymbolFile/DWARF/x86/parallel-indexing-stress.s (2178 of 2474) PASS: lldb-api :: api/check_public_api_headers/TestPublicAPIHeaders.py (2179 of 2474) UNSUPPORTED: lldb-api :: functionalities/data-formatter/data-formatter-stl/libstdcpp/vbool/TestDataFormatterStdVBool.py (2180 of 2474) PASS: lldb-unit :: Language/Highlighting/./HighlighterTests/HighlighterTest.ClangCursorPosBeforeOtherToken (2181 of 2474) PASS: lldb-unit :: Language/Highlighting/./HighlighterTests/HighlighterTest.ClangUnterminatedString (2182 of 2474) PASS: lldb-unit :: Utility/./UtilityTests/UriParserTest.SchemeHostSeparator (2183 of 2474) PASS: lldb-unit :: Process/minidump/./LLDBMinidumpTests/MinidumpParserTest.GetExceptionStream (2184 of 2474) PASS: lldb-shell :: Process/Optimization.test (2185 of 2474) PASS: lldb-unit :: Utility/./UtilityTests/StringListTest.AppendStringMove (2186 of 2474) PASS: lldb-api :: macosx/macCatalyst/TestMacCatalyst.py (2187 of 2474) PASS: lldb-unit :: Utility/./UtilityTests/RangeDataVector.FindEntryIndexesThatContain_Overlap (2188 of 2474) PASS: lldb-api :: lang/cpp/limit-debug-info/TestWithLimitDebugInfo.py (2189 of 2474) PASS: lldb-shell :: SymbolFile/Breakpad/unwind-via-stack-cfi.test (2190 of 2474) PASS: lldb-shell :: Register/Core/x86-64-linux-gp.test (2191 of 2474) PASS: lldb-api :: commands/watchpoints/watchpoint_commands/command/TestWatchpointCommandLLDB.py (2192 of 2474) PASS: lldb-unit :: Host/./HostTests/MainLoopTest.TwoSignalCallbacks (2193 of 2474) PASS: lldb-unit :: debugserver/./debugserverTests/RNBSocket.LoopBackConnectIPv6 (2194 of 2474) UNSUPPORTED: lldb-shell :: Subprocess/vfork-follow-parent-softbp.test (2195 of 2474) PASS: lldb-api :: lang/objc/exceptions/TestObjCExceptions.py (2196 of 2474) PASS: lldb-api :: lang/c/stepping/TestStepAndBreakpoints.py (2197 of 2474) PASS: lldb-unit :: Utility/./UtilityTests/PassiveReplayTest.InstrumentedFooInvalid (2198 of 2474) PASS: lldb-unit :: ScriptInterpreter/Python/./ScriptInterpreterPythonTests/PythonDataObjectsTest.TestPythonInteger (2199 of 2474) PASS: lldb-api :: commands/expression/class_template_specialization_empty_pack/TestClassTemplateSpecializationParametersHandling.py (2200 of 2474) PASS: lldb-unit :: Platform/./LLDBPlatformTests/PlatformDarwinTest.GetCompatibleArchARMv5 (2201 of 2474) PASS: lldb-shell :: ObjectFile/ELF/PT_LOAD-empty.yaml (2202 of 2474) PASS: lldb-unit :: Utility/./UtilityTests/AnsiTerminal.AtEnd (2203 of 2474) UNSUPPORTED: lldb-shell :: ExecControl/StopHook/stop-hook-threads.test (2204 of 2474) PASS: lldb-api :: macosx/duplicate-archive-members/TestDuplicateMembers.py (2205 of 2474) PASS: lldb-shell :: Register/x86-64-read.test (2206 of 2474) PASS: lldb-shell :: SymbolFile/DWARF/x86/dir-separator-posix.s (2207 of 2474) PASS: lldb-api :: lang/c/bitfields/TestBitfields.py (2208 of 2474) PASS: lldb-api :: lang/cpp/class-loading-via-member-typedef/TestClassLoadingViaMemberTypedef.py (2209 of 2474) PASS: lldb-unit :: UnwindAssembly/x86/./UnwindAssemblyx86Tests/Testx86AssemblyInspectionEngine.TestDisassemblyMidFunctionEpilogues (2210 of 2474) PASS: lldb-unit :: Utility/./UtilityTests/Predicate.WaitForValueEqualTo (2211 of 2474) PASS: lldb-api :: macosx/load-kext/TestLoadKext.py (2212 of 2474) UNSUPPORTED: lldb-api :: android/platform/TestDefaultCacheLineSize.py (2213 of 2474) PASS: lldb-unit :: Symbol/./SymbolTests/TestTypeSystemClang.AddMethodToObjCObjectType (2214 of 2474) PASS: lldb-unit :: Core/./LLDBCoreTests/DumpDataExtractorTest.FormatCharArray (2215 of 2474) PASS: lldb-api :: functionalities/gdb_remote_client/TestProcessConnect.py (2216 of 2474) PASS: lldb-unit :: Interpreter/./InterpreterTests/VerifyUserMultiwordCmdPathTest.TestErrors (2217 of 2474) PASS: lldb-api :: lang/objc/objc-dyn-sbtype/TestObjCDynamicSBType.py (2218 of 2474) PASS: lldb-api :: types/TestDoubleTypesExpr.py (2219 of 2474) PASS: lldb-shell :: SymbolFile/DWARF/DW_AT_range-DW_FORM_sec_offset.s (2220 of 2474) PASS: lldb-unit :: Target/./TargetTests/ExecutionContextTest.GetByteOrderTarget (2221 of 2474) PASS: lldb-unit :: Utility/./UtilityTests/FileSpecTest.FileAndDirectoryComponents (2222 of 2474) PASS: lldb-unit :: Language/Highlighting/./HighlighterTests/HighlighterTest.ClangPreserveNewLine (2223 of 2474) UNSUPPORTED: lldb-api :: functionalities/ubsan/basic/TestUbsanBasic.py (2224 of 2474) PASS: lldb-shell :: ObjectFile/ELF/section-types-edgecases.yaml (2225 of 2474) PASS: lldb-unit :: UnwindAssembly/x86/./UnwindAssemblyx86Tests/Testx86AssemblyInspectionEngine.TestPushEDI (2226 of 2474) PASS: lldb-unit :: Process/Utility/./ProcessUtilityTests/ProcSMapTests/LinuxProcSMapsTestFixture.ParseSMapRegions/3 (2227 of 2474) PASS: lldb-shell :: Reproducer/TestVersionCheck.test (2228 of 2474) PASS: lldb-shell :: SymbolFile/DWARF/x86/find-basic-variable.cpp (2229 of 2474) PASS: lldb-unit :: ObjectFile/Breakpad/./ObjectFileBreakpadTests/PublicRecord.parse (2230 of 2474) PASS: lldb-unit :: Utility/./UtilityTests/StringListTest.JoinMultiCharSeparator (2231 of 2474) PASS: lldb-unit :: Utility/./UtilityTests/RegularExpression.Match (2232 of 2474) PASS: lldb-api :: commands/expression/import_builtin_fileid/TestImportBuiltinFileID.py (2233 of 2474) PASS: lldb-unit :: Utility/./UtilityTests/RangeTest.LessThan (2234 of 2474) PASS: lldb-api :: macosx/lc-note/kern-ver-str/TestKernVerStrLCNOTE.py (2235 of 2474) PASS: lldb-shell :: SymbolFile/Breakpad/unwind-via-stack-win-no-memory-info.yaml (2236 of 2474) PASS: lldb-api :: functionalities/gdb_remote_client/TestWriteMemory.py (2237 of 2474) PASS: lldb-unit :: Process/gdb-remote/./ProcessGdbRemoteTests/GDBRemoteCommunicationTest.ReadPacket_checksum (2238 of 2474) PASS: lldb-api :: lang/cpp/bitfields/TestCppBitfields.py (2239 of 2474) PASS: lldb-shell :: Driver/TestRepl.test (2240 of 2474) UNSUPPORTED: lldb-shell :: SymbolFile/NativePDB/ast-functions-msvc.cpp (2241 of 2474) PASS: lldb-api :: functionalities/target_var/no_vars/TestTargetVarNoVars.py (2242 of 2474) PASS: lldb-api :: commands/expression/import-std-module/vector/TestVectorFromStdModule.py (2243 of 2474) PASS: lldb-unit :: SymbolFile/DWARF/./SymbolFileDWARFTests/DWARFDIETest.ChildIteration (2244 of 2474) PASS: lldb-api :: types/TestRecursiveTypes.py (2245 of 2474) PASS: lldb-unit :: Utility/./UtilityTests/StringLexerTest.PutBack (2246 of 2474) PASS: lldb-unit :: Utility/./UtilityTests/BinaryStreamTest.PutSLEB128OneByte (2247 of 2474) PASS: lldb-api :: lang/c/step_over_no_deadlock/TestStepOverDoesntBlock.py (2248 of 2474) PASS: lldb-api :: functionalities/data-formatter/data-formatter-stl/libcxx/initializerlist/TestInitializerList.py (2249 of 2474) PASS: lldb-unit :: DataFormatter/./LLDBFormatterTests/TypeMatcherTests.GetMatchStringExactName (2250 of 2474) PASS: lldb-api :: commands/expression/deleting-implicit-copy-constructor/TestDeletingImplicitCopyConstructor.py (2251 of 2474) PASS: lldb-unit :: Language/Highlighting/./HighlighterTests/HighlighterTest.DefaultHighlighter (2252 of 2474) PASS: lldb-api :: lang/objcxx/class-name-clash/TestNameClash.py (2253 of 2474) PASS: lldb-unit :: Expression/./ExpressionTests/DiagnosticManagerTest.GetStringPreserveOrder (2254 of 2474) PASS: lldb-unit :: UnwindAssembly/x86/./UnwindAssemblyx86Tests/Testx86AssemblyInspectionEngine.TestPopRBX (2255 of 2474) PASS: lldb-unit :: Utility/./UtilityTests/StreamTest.ShiftOperatorPtr (2256 of 2474) PASS: lldb-unit :: Symbol/./SymbolTests/TestClangASTImporter.DeportDeclTagDecl (2257 of 2474) PASS: lldb-api :: commands/expression/result_numbering/TestResultNumbering.py (2258 of 2474) PASS: lldb-unit :: Core/./LLDBCoreTests/RichManglingContextTest.FromCxxMethodName (2259 of 2474) PASS: lldb-unit :: UnwindAssembly/x86/./UnwindAssemblyx86Tests/Testx86AssemblyInspectionEngine.TestPushESI (2260 of 2474) PASS: lldb-api :: python_api/name_lookup/TestNameLookup.py (2261 of 2474) PASS: lldb-api :: commands/expression/radar_9531204/TestPrintfAfterUp.py (2262 of 2474) PASS: lldb-unit :: ScriptInterpreter/Python/./ScriptInterpreterPythonTests/PythonDataObjectsTest.TestPythonStringToStructuredString (2263 of 2474) PASS: lldb-unit :: Utility/./UtilityTests/TimeoutTest.Format (2264 of 2474) UNSUPPORTED: lldb-shell :: Subprocess/clone-follow-child-softbp.test (2265 of 2474) PASS: lldb-unit :: Utility/./UtilityTests/ArchSpecTest.Compatibility (2266 of 2474) PASS: lldb-unit :: SymbolFile/NativePDB/./SymbolFileNativePDBTests/PDBFPOProgramToDWARFExpressionTests.UnresolvedRegisterAssignmentReference (2267 of 2474) PASS: lldb-unit :: Host/./HostTests/ConnectionFileDescriptorTest.TCPGetURIv4 (2268 of 2474) PASS: lldb-api :: functionalities/thread/exit_during_expression/TestExitDuringExpression.py (2269 of 2474) PASS: lldb-api :: commands/statistics/basic/TestStats.py (2270 of 2474) PASS: lldb-api :: functionalities/thread/num_threads/TestNumThreads.py (2271 of 2474) PASS: lldb-unit :: Utility/./UtilityTests/Flags.AnySet (2272 of 2474) PASS: lldb-unit :: Utility/./UtilityTests/StructuredDataTest.ParseJSONFromFile (2273 of 2474) PASS: lldb-api :: commands/expression/call-function/TestCallStopAndContinue.py (2274 of 2474) PASS: lldb-unit :: ScriptInterpreter/Python/./ScriptInterpreterPythonTests/PythonDataObjectsTest.TestInstanceNameResolutionNoDot (2275 of 2474) PASS: lldb-unit :: UnwindAssembly/x86/./UnwindAssemblyx86Tests/Testx86AssemblyInspectionEngine.TestSpillRegToStackViaMOVx86_64 (2276 of 2474) XFAIL: lldb-shell :: Register/x86-64-write.test (2277 of 2474) PASS: lldb-shell :: SymbolFile/DWARF/x86/debug_ranges_and_rnglists.test (2278 of 2474) PASS: lldb-api :: commands/watchpoints/watchpoint_commands/command/TestWatchpointCommandPython.py (2279 of 2474) PASS: lldb-unit :: Process/minidump/./LLDBMinidumpTests/MinidumpParserTest.GetPidWow64 (2280 of 2474) PASS: lldb-unit :: Utility/./UtilityTests/ProcessInstanceInfo.DumpTable (2281 of 2474) PASS: lldb-api :: functionalities/thread/concurrent_events/TestConcurrentWatchBreak.py (2282 of 2474) PASS: lldb-shell :: Host/TestCustomShell.test (2283 of 2474) PASS: lldb-shell :: SymbolFile/DWARF/x86/dir-separator-windows.s (2284 of 2474) PASS: lldb-api :: functionalities/memory-region/TestMemoryRegion.py (2285 of 2474) PASS: lldb-unit :: Core/./LLDBCoreTests/FormatEntityTest.DefinitionConstructionNameAndType (2286 of 2474) PASS: lldb-shell :: SymbolFile/DWARF/x86/find-method-local-struct.cpp (2287 of 2474) PASS: lldb-unit :: Symbol/./SymbolTests/TestTypeSystemClang.TestGetTypeClassTypeOf (2288 of 2474) PASS: lldb-api :: functionalities/dlopen_other_executable/TestDlopenOtherExecutable.py (2289 of 2474) PASS: lldb-unit :: Language/CLanguages/./LanguageCLanguagesTests/CLanguages.LookupCLanguagesByLanguageType (2290 of 2474) PASS: lldb-unit :: Utility/./UtilityTests/XcodeSDKTest.GetSDKTypeForTriple (2291 of 2474) PASS: lldb-api :: tools/lldb-server/TestGdbRemoteAttachWait.py (2292 of 2474) PASS: lldb-api :: lang/objcxx/objc-builtin-types/TestObjCBuiltinTypes.py (2293 of 2474) PASS: lldb-api :: functionalities/inferior-crashing/recursive-inferior/TestRecursiveInferior.py (2294 of 2474) PASS: lldb-unit :: Utility/./UtilityTests/StreamTest.PutMaxHex64ByteOrderLittle (2295 of 2474) PASS: lldb-unit :: Utility/./UtilityTests/OptionsWithRawTest.EmptyInput (2296 of 2474) PASS: lldb-unit :: Utility/./UtilityTests/AnsiTerminal.Unknown (2297 of 2474) PASS: lldb-unit :: ObjectFile/MachO/./ObjectFileMachOTests/ObjectFileMachOTest.ModuleFromSharedCacheInfo (2298 of 2474) PASS: lldb-api :: tools/lldb-server/commandline/TestGdbRemoteConnection.py (2299 of 2474) UNSUPPORTED: lldb-shell :: SymbolFile/PDB/variables.test (2300 of 2474) PASS: lldb-unit :: Symbol/./SymbolTests/LineEntryTest.GetAllExactLineColumnMatches (2301 of 2474) PASS: lldb-unit :: Host/./HostTests/MainLoopTest.ReadObject (2302 of 2474) UNSUPPORTED: lldb-shell :: SymbolFile/target-symbols-add-unwind.test (2303 of 2474) PASS: lldb-api :: commands/watchpoints/watchpoint_size/TestWatchpointSizes.py (2304 of 2474) PASS: lldb-shell :: ObjectFile/ELF/section-addresses.yaml (2305 of 2474) PASS: lldb-unit :: Process/gdb-remote/./ProcessGdbRemoteTests/GDBRemoteClientBaseTest.SendContinueDelegateStructuredDataReceipt (2306 of 2474) PASS: lldb-api :: functionalities/thread/thread_exit/TestThreadExit.py (2307 of 2474) PASS: lldb-unit :: debugserver/./debugserverTests/RNBSocket.LoopBackConnectIPv4 (2308 of 2474) PASS: lldb-api :: functionalities/abbreviation/TestAbbreviations.py (2309 of 2474) PASS: lldb-unit :: Utility/./UtilityTests/StringExtractorTest.GetHexBytesAvail_OddPair (2310 of 2474) UNSUPPORTED: lldb-shell :: SymbolFile/PDB/pointers.test (2311 of 2474) PASS: lldb-api :: lang/cpp/std-function-step-into-callable/TestStdFunctionStepIntoCallable.py (2312 of 2474) PASS: lldb-api :: functionalities/thread/concurrent_events/TestConcurrentBreakpointOneDelayBreakpointThreads.py (2313 of 2474) UNSUPPORTED: lldb-shell :: ScriptInterpreter/Lua/watchpoint_callback.test (2314 of 2474) PASS: lldb-api :: functionalities/stats_api/TestStatisticsAPI.py (2315 of 2474) PASS: lldb-api :: lang/c/global_variables/TestGlobalVariables.py (2316 of 2474) PASS: lldb-shell :: ObjectFile/PECOFF/symbol.yaml (2317 of 2474) PASS: lldb-unit :: Utility/./UtilityTests/DataExtractorTest.GetULEB128_bit63 (2318 of 2474) PASS: lldb-shell :: Breakpoint/debug_rnglist_basic.test (2319 of 2474) PASS: lldb-unit :: Utility/./UtilityTests/StreamTest.AddressPrefix (2320 of 2474) PASS: lldb-api :: functionalities/data-formatter/compactvectors/TestCompactVectors.py (2321 of 2474) PASS: lldb-api :: functionalities/breakpoint/breakpoint_locations/TestBreakpointLocations.py (2322 of 2474) UNSUPPORTED: lldb-api :: python_api/disassemble-raw-data/TestDisassemble_VST1_64.py (2323 of 2474) PASS: lldb-unit :: Utility/./UtilityTests/StringExtractorTest.DecodeHexU8_Underflow (2324 of 2474) PASS: lldb-api :: lang/cpp/breakpoint-commands/TestCPPBreakpointCommands.py (2325 of 2474) PASS: lldb-api :: python_api/exprpath_synthetic/TestExprPathSynthetic.py (2326 of 2474) PASS: lldb-api :: commands/watchpoints/watchpoint_disable/TestWatchpointDisable.py (2327 of 2474) PASS: lldb-api :: commands/expression/import-std-module/non-module-type-separation/TestNonModuleTypeSeparation.py (2328 of 2474) PASS: lldb-api :: lang/objc/hidden-ivars/TestHiddenIvars.py (2329 of 2474) PASS: lldb-unit :: ObjectFile/Breakpad/./ObjectFileBreakpadTests/FuncRecord.parse (2330 of 2474) PASS: lldb-api :: python_api/module_section/TestModuleAndSection.py (2331 of 2474) PASS: lldb-unit :: Breakpoint/./LLDBBreakpointTests/BreakpointIDTest.StringIsBreakpointName (2332 of 2474) PASS: lldb-shell :: ObjectFile/Breakpad/uuid-matching-mac.test (2333 of 2474) PASS: lldb-api :: functionalities/load_unload/TestLoadUnload.py (2334 of 2474) PASS: lldb-shell :: ScriptInterpreter/Python/Crashlog/json.test (2335 of 2474) PASS: lldb-unit :: Utility/./UtilityTests/GeneratorTest.Get (2336 of 2474) PASS: lldb-unit :: Utility/./UtilityTests/ArgsTest.DoubleQuotedItem (2337 of 2474) PASS: lldb-unit :: Utility/./UtilityTests/RangeTest.DoesAdjoinOrIntersect (2338 of 2474) PASS: lldb-unit :: Utility/./UtilityTests/StreamTest.AddressPrefixAndSuffix (2339 of 2474) PASS: lldb-api :: functionalities/gdb_remote_client/TestFork.py (2340 of 2474) PASS: lldb-unit :: Symbol/./SymbolTests/LineEntryTest.GetSameLineContiguousAddressRangeOneInline (2341 of 2474) PASS: lldb-unit :: Utility/./UtilityTests/ScalarTest.CastOperations (2342 of 2474) PASS: lldb-unit :: Host/./HostTests/SocketTests/SocketTest.DecodeHostAndPort/ipv4 (2343 of 2474) PASS: lldb-unit :: Utility/./UtilityTests/StringListTest.ShiftCString (2344 of 2474) PASS: lldb-api :: lang/objc/tagged-pointer/TestTaggedPointerCmd.py (2345 of 2474) UNSUPPORTED: lldb-shell :: Unwind/eh-frame-augment-noop.test (2346 of 2474) PASS: lldb-api :: functionalities/data-formatter/data-formatter-stl/generic/bitset/TestDataFormatterGenericBitset.py (2347 of 2474) PASS: lldb-unit :: Utility/./UtilityTests/ReproducerTest.SetCapture (2348 of 2474) PASS: lldb-unit :: Utility/./UtilityTests/ScalarTest.SetValueFromData (2349 of 2474) PASS: lldb-unit :: Process/gdb-remote/./ProcessGdbRemoteTests/GDBRemoteCommunicationServerTest.SendErrorResponse_StringError (2350 of 2474) PASS: lldb-unit :: Core/./LLDBCoreTests/MangledTest.EmptyForInvalidDLangName (2351 of 2474) PASS: lldb-api :: functionalities/thread/concurrent_events/TestConcurrentTwoBreakpointsOneSignal.py (2352 of 2474) PASS: lldb-api :: tools/lldb-server/memory-allocation/TestGdbRemoteMemoryAllocation.py (2353 of 2474) PASS: lldb-api :: functionalities/completion/TestCompletion.py (2354 of 2474) PASS: lldb-unit :: Platform/./LLDBPlatformTests/PlatformDarwinTest.GetCompatibleArchARM64 (2355 of 2474) PASS: lldb-api :: lang/cpp/gmodules-templates/TestGModules.py (2356 of 2474) PASS: lldb-api :: commands/command/script_alias/TestCommandScriptAlias.py (2357 of 2474) PASS: lldb-api :: lang/cpp/nested-class-other-compilation-unit/TestNestedClassWithParentInAnotherCU.py (2358 of 2474) PASS: lldb-api :: lang/objc/modules-cache/TestClangModulesCache.py (2359 of 2474) PASS: lldb-unit :: Process/minidump/./LLDBMinidumpTests/MinidumpParserTest.InvalidMinidump (2360 of 2474) PASS: lldb-shell :: ObjectFile/PECOFF/basic-info-arm64.yaml (2361 of 2474) PASS: lldb-api :: commands/expression/import-std-module/shared_ptr-dbg-info-content/TestSharedPtrDbgInfoContentFromStdModule.py (2362 of 2474) PASS: lldb-unit :: UnwindAssembly/x86/./UnwindAssemblyx86Tests/Testx86AssemblyInspectionEngine.TestMovRSPtoRBP (2363 of 2474) PASS: lldb-unit :: Utility/./UtilityTests/BinaryStreamTest.PutULEB128EightBytes (2364 of 2474) UNSUPPORTED: lldb-api :: macosx/lc-note/addrable-bits/TestAddrableBitsCorefile.py (2365 of 2474) PASS: lldb-unit :: Symbol/./SymbolTests/TestTypeSystemClang.TestGetEnumIntegerTypeInvalid (2366 of 2474) PASS: lldb-api :: functionalities/data-formatter/format-propagation/TestFormatPropagation.py (2367 of 2474) PASS: lldb-api :: functionalities/data-formatter/data-formatter-objc/TestDataFormatterObjCNSContainer.py (2368 of 2474) PASS: lldb-unit :: ObjectFile/Breakpad/./ObjectFileBreakpadTests/LineRecord.parse (2369 of 2474) PASS: lldb-unit :: Symbol/./SymbolTests/LineEntryTest.GetAllExactLineMatchesWithoutColumn (2370 of 2474) PASS: lldb-api :: lang/c/local_types/TestUseClosestType.py (2371 of 2474) PASS: lldb-api :: functionalities/data-formatter/var-in-aggregate-misuse/TestVarInAggregateMisuse.py (2372 of 2474) PASS: lldb-unit :: Symbol/./SymbolTests/TestTypeSystemClang.TestGetBasicTypeFromName (2373 of 2474) PASS: lldb-shell :: Quit/TestQuitExitCodeNonInt.test (2374 of 2474) PASS: lldb-api :: macosx/stack-corefile/TestStackCorefile.py (2375 of 2474) PASS: lldb-api :: functionalities/data-formatter/data-formatter-enum-format/TestDataFormatterEnumFormat.py (2376 of 2474) PASS: lldb-api :: functionalities/thread/jump/TestThreadJump.py (2377 of 2474) PASS: lldb-api :: macosx/skinny-corefile/TestSkinnyCorefile.py (2378 of 2474) UNSUPPORTED: lldb-api :: functionalities/ptrauth_diagnostics/brkC47x_x16_invalid/TestPtrauthBRKc47xX16Invalid.py (2379 of 2474) PASS: lldb-unit :: Utility/./UtilityTests/SharedCluster.ClusterManager (2380 of 2474) XFAIL: lldb-shell :: Expr/nodefaultlib.cpp (2381 of 2474) PASS: lldb-api :: functionalities/type_lookup/TestTypeLookup.py (2382 of 2474) PASS: lldb-unit :: Utility/./UtilityTests/DataExtractorTest.GetCStrAtEnd (2383 of 2474) PASS: lldb-unit :: Utility/./UtilityTests/ConstStringTest.NullAndEmptyStates (2384 of 2474) PASS: lldb-api :: lang/cpp/unicode-literals/TestUnicodeLiterals.py (2385 of 2474) PASS: lldb-unit :: Utility/./UtilityTests/StringExtractorTest.GetHexU8_Underflow2_NoEof (2386 of 2474) PASS: lldb-api :: functionalities/data-formatter/dump_dynamic/TestDumpDynamic.py (2387 of 2474) PASS: lldb-api :: tools/lldb-server/TestGdbRemoteExpeditedRegisters.py (2388 of 2474) PASS: lldb-unit :: Core/./LLDBCoreTests/MangledTest.ResultForValidDLangName (2389 of 2474) PASS: lldb-api :: functionalities/tail_call_frames/sbapi_support/TestTailCallFrameSBAPI.py (2390 of 2474) PASS: lldb-api :: types/TestFloatTypes.py (2391 of 2474) PASS: lldb-unit :: Thread/./ThreadTests/ThreadTest.SetStopInfo (2392 of 2474) PASS: lldb-unit :: Expression/./ExpressionTests/CppModuleConfigurationTest.Linux (2393 of 2474) PASS: lldb-api :: api/multiple-debuggers/TestMultipleDebuggers.py (2394 of 2474) UNSUPPORTED: lldb-api :: tools/lldb-server/TestGdbRemoteSaveCore.py (2395 of 2474) PASS: lldb-unit :: Utility/./UtilityTests/StreamTest.PutStringAsRawHex8 (2396 of 2474) PASS: lldb-unit :: Utility/./UtilityTests/StringListTest.InsertStringAtIndexOutOfBounds (2397 of 2474) PASS: lldb-api :: lang/objc/modules/TestObjCModules.py (2398 of 2474) PASS: lldb-unit :: Utility/./UtilityTests/OptionsWithRawTest.ArgsButNoLeadingDash (2399 of 2474) PASS: lldb-api :: functionalities/reproducers/fs-case-sensitivity/TestReproducerFSCaseSensitivity.py (2400 of 2474) PASS: lldb-api :: functionalities/thread/concurrent_events/TestConcurrentNWatchNBreak.py (2401 of 2474) PASS: lldb-api :: functionalities/thread/concurrent_events/TestConcurrentCrashWithBreak.py (2402 of 2474) PASS: lldb-api :: tools/lldb-vscode/attach/TestVSCode_attach.py (2403 of 2474) PASS: lldb-unit :: UnwindAssembly/x86/./UnwindAssemblyx86Tests/Testx86AssemblyInspectionEngine.TestPushR14 (2404 of 2474) PASS: lldb-api :: functionalities/breakpoint/objc/TestObjCBreakpoints.py (2405 of 2474) UNSUPPORTED: lldb-shell :: SymbolFile/NativePDB/local-variables.cpp (2406 of 2474) PASS: lldb-unit :: Utility/./UtilityTests/ScalarTest.TruncOrExtendTo (2407 of 2474) PASS: lldb-api :: functionalities/recursion/TestValueObjectRecursion.py (2408 of 2474) PASS: lldb-unit :: Utility/./UtilityTests/StreamTest.PutCharNull (2409 of 2474) PASS: lldb-shell :: SymbolFile/NativePDB/locate-pdb.cpp (2410 of 2474) PASS: lldb-unit :: Utility/./UtilityTests/CompletionRequest.Constructor (2411 of 2474) PASS: lldb-unit :: Utility/./UtilityTests/StringListTest.JoinSingle (2412 of 2474) PASS: lldb-unit :: Utility/./UtilityTests/FileSpecTest.RemoveLastPathComponent (2413 of 2474) PASS: lldb-unit :: Utility/./UtilityTests/StringListTest.AppendStringStdString (2414 of 2474) PASS: lldb-api :: functionalities/data-formatter/data-formatter-objc/TestDataFormatterObjCNSError.py (2415 of 2474) PASS: lldb-unit :: Symbol/./SymbolTests/PostfixExpression.ToDWARF (2416 of 2474) UNSUPPORTED: lldb-api :: tools/lldb-server/TestGdbRemoteAuxvSupport.py (2417 of 2474) UNSUPPORTED: lldb-api :: functionalities/data-formatter/data-formatter-stl/libstdcpp/unique_ptr/TestDataFormatterStdUniquePtr.py (2418 of 2474) PASS: lldb-api :: commands/settings/quoting/TestQuoting.py (2419 of 2474) PASS: lldb-unit :: Process/minidump/./LLDBMinidumpTests/MinidumpParserTest.GetArchitectureWindows (2420 of 2474) PASS: lldb-api :: functionalities/data-formatter/data-formatter-cpp/TestDataFormatterCpp.py (2421 of 2474) PASS: lldb-api :: commands/frame/diagnose/local-variable/TestLocalVariable.py (2422 of 2474) PASS: lldb-api :: commands/watchpoints/watchpoint_events/TestWatchpointEvents.py (2423 of 2474) PASS: lldb-unit :: Process/minidump/./LLDBMinidumpTests/MinidumpParserTest.GetMiscInfoWindows (2424 of 2474) PASS: lldb-shell :: ObjectFile/PECOFF/dep-modules.yaml (2425 of 2474) PASS: lldb-shell :: Quit/TestQuitExitCode30.test (2426 of 2474) PASS: lldb-api :: functionalities/plugins/python_os_plugin/TestPythonOSPlugin.py (2427 of 2474) PASS: lldb-unit :: Utility/./UtilityTests/FileSpecTest.GuessPathStyle (2428 of 2474) PASS: lldb-unit :: Host/./HostTests/TerminalTest.SetRaw (2429 of 2474) UNSUPPORTED: lldb-shell :: Register/x86-ymm-write.test (2430 of 2474) UNSUPPORTED: lldb-api :: benchmarks/turnaround/TestCompileRunToBreakpointTurnaround.py (2431 of 2474) PASS: lldb-unit :: Utility/./UtilityTests/UriParserTest.MinimalPortPath (2432 of 2474) PASS: lldb-api :: commands/expression/pr52257/TestExprCrash.py (2433 of 2474) PASS: lldb-unit :: Utility/./UtilityTests/UriParserTest.SchemeHostSeparator2 (2434 of 2474) PASS: lldb-shell :: lldb-server/TestErrorMessages.test (2435 of 2474) PASS: lldb-shell :: Reproducer/TestReuseDirectory.test (2436 of 2474) PASS: lldb-unit :: Language/Highlighting/./HighlighterTests/HighlighterTest.ClangCursorPosEndOfLine (2437 of 2474) PASS: lldb-api :: commands/register/register/register_command/TestRegisters.py (2438 of 2474) PASS: lldb-unit :: Utility/./UtilityTests/StringListTest.CopyListSingle (2439 of 2474) PASS: lldb-shell :: ObjectFile/ELF/riscv-arch.yaml (2440 of 2474) PASS: lldb-api :: functionalities/gdb_remote_client/TestThreadInfoTrailingComma.py (2441 of 2474) PASS: lldb-unit :: Utility/./UtilityTests/StringExtractorTest.GetHexBytesAvail_FullString (2442 of 2474) PASS: lldb-unit :: Utility/./UtilityTests/DataExtractorTest.PeekData (2443 of 2474) PASS: lldb-unit :: Utility/./UtilityTests/VMRange.Clear (2444 of 2474) PASS: lldb-unit :: Symbol/./SymbolTests/TestTypeSystemClang.TestGetBasicTypeFromEnum (2445 of 2474) PASS: lldb-shell :: Quit/TestQuitExitCode0.test (2446 of 2474) UNSUPPORTED: lldb-api :: functionalities/ptr_refs/TestPtrRefs.py (2447 of 2474) UNSUPPORTED: lldb-api :: functionalities/tsan/thread_leak/TestTsanThreadLeak.py (2448 of 2474) UNSUPPORTED: lldb-api :: commands/expression/multiline-completion/TestMultilineCompletion.py (2449 of 2474) PASS: lldb-api :: lang/objcxx/cxx-bridged-po/TestObjCXXBridgedPO.py (2450 of 2474) PASS: lldb-api :: functionalities/breakpoint/break_in_loaded_dylib/TestBreakInLoadedDylib.py (2451 of 2474) PASS: lldb-api :: lang/cpp/exceptions/TestCPPExceptionBreakpoints.py (2452 of 2474) UNSUPPORTED: lldb-shell :: ScriptInterpreter/Lua/fail_breakpoint_oneline.test (2453 of 2474) PASS: lldb-unit :: Platform/./LLDBPlatformTests/PlatformDarwinTest.GetCompatibleArchARMv7s (2454 of 2474) PASS: lldb-unit :: SymbolFile/DWARF/./SymbolFileDWARFTests/SymbolFileDWARFTests.ParseArangesIgnoreEmpty (2455 of 2474) PASS: lldb-api :: commands/frame/diagnose/bad-reference/TestBadReference.py (2456 of 2474) UNSUPPORTED: lldb-api :: functionalities/data-formatter/data-formatter-stl/libstdcpp/vector/TestDataFormatterStdVector.py (2457 of 2474) PASS: lldb-unit :: Host/./HostTests/ConnectionFileDescriptorTest.TCPGetURIv6 (2458 of 2474) PASS: lldb-api :: functionalities/tail_call_frames/inlining_and_tail_calls/TestInliningAndTailCalls.py (2459 of 2474) PASS: lldb-unit :: Core/./LLDBCoreTests/DumpDataExtractorTest.StartOffset (2460 of 2474) PASS: lldb-api :: functionalities/postmortem/minidump-new/TestMiniDumpNew.py (2461 of 2474) PASS: lldb-api :: functionalities/gdb_remote_client/TestThreadSelectionBug.py (2462 of 2474) PASS: lldb-unit :: Utility/./UtilityTests/AnsiTerminal.Empty (2463 of 2474) PASS: lldb-unit :: Process/minidump/./LLDBMinidumpTests/MinidumpParserTest.GetThreadContext_x86_32 (2464 of 2474) PASS: lldb-unit :: Utility/./UtilityTests/OptionsWithRawTest.EmptySuffix (2465 of 2474) PASS: lldb-unit :: Utility/./UtilityTests/VMRange.ContainsRange (2466 of 2474) PASS: lldb-api :: functionalities/data-formatter/data-formatter-categories/TestDataFormatterCategories.py (2467 of 2474) UNSUPPORTED: lldb-shell :: Subprocess/clone-follow-child.test (2468 of 2474) PASS: lldb-api :: commands/expression/radar_9673664/TestExprHelpExamples.py (2469 of 2474) PASS: lldb-unit :: ObjectFile/Breakpad/./ObjectFileBreakpadTests/Record.classify (2470 of 2474) PASS: lldb-unit :: Utility/./UtilityTests/BinaryStreamTest.PutSLEB128ThreeBytes (2471 of 2474) PASS: lldb-api :: lang/cpp/namespace_definitions/TestNamespaceDefinitions.py (2472 of 2474) PASS: lldb-shell :: Minidump/dump-all.test (2473 of 2474) PASS: lldb-api :: commands/expression/test/TestExprs.py (2474 of 2474) Slowest Tests: -------------------------------------------------------------------------- 267.39s: lldb-api :: tools/lldb-server/TestLldbGdbServer.py 247.99s: lldb-api :: macosx/stack-corefile/TestStackCorefile.py 247.14s: lldb-api :: macosx/skinny-corefile/TestSkinnyCorefile.py 208.63s: lldb-api :: functionalities/memory-region/TestMemoryRegion.py 195.76s: lldb-api :: functionalities/scripted_process/TestScriptedProcess.py 137.91s: lldb-api :: api/multithreaded/TestMultithreaded.py 91.45s: lldb-api :: functionalities/gdb_remote_client/TestWasm.py 87.80s: lldb-api :: types/TestLongTypesExpr.py 77.07s: lldb-api :: commands/expression/import-std-module/vector/TestVectorFromStdModule.py 74.11s: lldb-api :: lang/objc/exceptions/TestObjCExceptions.py 71.50s: lldb-api :: commands/expression/import-std-module/queue/TestQueueFromStdModule.py 70.57s: lldb-api :: commands/process/attach/TestProcessAttach.py 68.98s: lldb-api :: commands/expression/import-std-module/stack/TestStackFromStdModule.py 67.25s: lldb-api :: lang/cpp/namespace/TestNamespaceLookup.py 66.64s: lldb-api :: lang/objc/hidden-ivars/TestHiddenIvars.py 61.14s: lldb-api :: lang/objc/objc-new-syntax/TestObjCNewSyntaxLiteral.py 58.54s: lldb-api :: lang/objc/foundation/TestObjCMethods.py 54.84s: lldb-api :: types/TestIntegerTypeExpr.py 50.74s: lldb-api :: tools/lldb-server/TestGdbRemoteThreadsInStopReply.py 50.60s: lldb-api :: python_api/target/TestTargetAPI.py

Hide Details

Tests Times: -------------------------------------------------------------------------- [ Range ] :: [ Percentage ] :: [ Count ] -------------------------------------------------------------------------- [260s,280s) :: [ ] :: [ 1/2474] [240s,260s) :: [ ] :: [ 2/2474] [220s,240s) :: [ ] :: [ 0/2474] [200s,220s) :: [ ] :: [ 2/2474] [180s,200s) :: [ ] :: [ 0/2474] [160s,180s) :: [ ] :: [ 0/2474] [140s,160s) :: [ ] :: [ 1/2474] [120s,140s) :: [ ] :: [ 0/2474] [100s,120s) :: [ ] :: [ 0/2474] [ 80s,100s) :: [ ] :: [ 3/2474] [ 60s, 80s) :: [ ] :: [ 8/2474] [ 40s, 60s) :: [ ] :: [ 17/2474] [ 20s, 40s) :: [* ] :: [ 81/2474] [ 0s, 20s) :: [************************************** ] :: [2359/2474] -------------------------------------------------------------------------- ******************** Failed Tests (1): lldb-api :: functionalities/scripted_process/TestScriptedProcess.py

Hide Details

Hide Details

Testing Time: 2737.08s Unsupported : 232 Passed : 2231 Expectedly Failed: 10 Failed : 1 FAILED: tools/lldb/test/CMakeFiles/check-lldb cd /Users/buildslave/jenkins/workspace/lldb-cmake-sanitized/lldb-build/tools/lldb/test && /usr/local/Frameworks/Python.framework/Versions/3.7/bin/python3.7 /Users/buildslave/jenkins/workspace/lldb-cmake-sanitized/lldb-build/./bin/llvm-lit -v --time-tests --shuffle --xunit-xml-output=/Users/buildslave/jenkins/workspace/lldb-cmake-sanitized/test/results.xml -v -j 4 --timeout 1200 /Users/buildslave/jenkins/workspace/lldb-cmake-sanitized/lldb-build/tools/lldb/test ninja: build stopped: subcommand failed. Command failed: Command '['/usr/bin/env', 'TERM=vt100', '/usr/local/bin/ninja', '-v', 'check-lldb']' returned non-zero exit status 1. Command: ['/usr/bin/env', 'TERM=vt100', '/usr/local/bin/ninja', '-v', 'check-lldb'] [Pipeline] } [Pipeline] // timeout [Pipeline] } [Pipeline] // stage [Pipeline] stage [Pipeline] { (Declarative: Post Actions) [Pipeline] scanForIssues [Clang] Sleeping for 5 seconds due to JENKINS-32191... [Clang] Parsing console log (workspace: '/Users/buildslave/jenkins/workspace/lldb-cmake-sanitized') [Clang] -> found 0 issues (skipped 0 duplicates) [Clang] Parsing console log (workspace: '/Users/buildslave/jenkins/workspace/lldb-cmake-sanitized') [Clang] -> found 0 issues (skipped 0 duplicates) [Clang] Successfully parsed console log [Clang] -> found 0 issues (skipped 0 duplicates) [Clang] Parsing console log (workspace: '/Users/buildslave/jenkins/workspace/lldb-cmake-sanitized') [Clang] Skipping post processing [Clang] No filter has been set, publishing all 0 issues [Clang] Repository miner is not configured, skipping repository mining [Pipeline] junit Recording test results [Checks API] No suitable checks publisher found. [Pipeline] } [Pipeline] // stage [Pipeline] } [Pipeline] // withEnv [Pipeline] } [Pipeline] // node [Pipeline] End of Pipeline ERROR: script returned exit code 1 Finished: FAILURE