Console Output

Skipping 9,585 KB.. Full Log
PASS: lldb-unit :: Utility/./UtilityTests/UriParserTest.BadPort2 (1177 of 2474)
PASS: lldb-unit :: Utility/./UtilityTests/StreamTest.AddressNoSuffix (1178 of 2474)
PASS: lldb-api :: commands/expression/namespace_local_var_same_name_obj_c/TestNamespaceLocalVarSameNameObjC.py (1179 of 2474)
PASS: lldb-shell :: ScriptInterpreter/Python/scripted_breakpoint_lua.test (1180 of 2474)
PASS: lldb-api :: lang/objc/objc-ivar-protocols/TestIvarProtocols.py (1181 of 2474)
PASS: lldb-api :: functionalities/load_unload/TestLoadUnload.py (1182 of 2474)
PASS: lldb-unit :: Utility/./UtilityTests/BinaryStreamTest.PutSLEB128NineBytes (1183 of 2474)
PASS: lldb-api :: commands/expression/import-std-module/array/TestArrayFromStdModule.py (1184 of 2474)
PASS: lldb-api :: commands/disassemble/basic/TestFrameDisassemble.py (1185 of 2474)
PASS: lldb-api :: macosx/lc-note/firmware-corefile/TestFirmwareCorefiles.py (1186 of 2474)
PASS: lldb-unit :: Platform/./LLDBPlatformTests/PlatformDarwinTest.GetCompatibleArchARM64 (1187 of 2474)
PASS: lldb-unit :: Language/Highlighting/./HighlighterTests/HighlighterTest.Keywords (1188 of 2474)
PASS: lldb-shell :: SymbolFile/DWARF/x86/find-basic-namespace.cpp (1189 of 2474)
PASS: lldb-shell :: SymbolFile/DWARF/x86/find-basic-function.cpp (1190 of 2474)
PASS: lldb-api :: commands/frame/diagnose/array/TestArray.py (1191 of 2474)
PASS: lldb-unit :: Utility/./UtilityTests/StringExtractorTest.GetHexU8_Underflow2 (1192 of 2474)
PASS: lldb-api :: lang/cpp/class-template-non-type-parameter-pack/TestClassTemplateNonTypeParameterPack.py (1193 of 2474)
PASS: lldb-unit :: Expression/./ExpressionTests/CppModuleConfigurationTest.AmbiguousLibCpp (1194 of 2474)
PASS: lldb-shell :: Reproducer/TestFileRepro.test (1195 of 2474)
PASS: lldb-unit :: Utility/./UtilityTests/TimerTest.CategoryTimes (1196 of 2474)
PASS: lldb-api :: lang/c/local_types/TestUseClosestType.py (1197 of 2474)
PASS: lldb-unit :: Process/minidump/./LLDBMinidumpTests/MinidumpParserTest.GetMemory (1198 of 2474)
PASS: lldb-unit :: Utility/./UtilityTests/NameMatchesTest.EndsWith (1199 of 2474)
PASS: lldb-api :: lang/objc/modules-cache/TestClangModulesCache.py (1200 of 2474)
PASS: lldb-api :: api/multithreaded/TestMultithreaded.py (1201 of 2474)
PASS: lldb-unit :: Process/minidump/./LLDBMinidumpTests/MinidumpParserTest.MinidumpDuplicateModuleSeparateCode (1202 of 2474)
UNSUPPORTED: lldb-shell :: SymbolFile/PDB/compilands.test (1203 of 2474)
PASS: lldb-unit :: Utility/./UtilityTests/UserIDResolver.GetUserName (1204 of 2474)
PASS: lldb-shell :: Reproducer/TestFinalize.test (1205 of 2474)
PASS: lldb-api :: commands/expression/radar_9531204/TestPrintfAfterUp.py (1206 of 2474)
PASS: lldb-unit :: Utility/./UtilityTests/DataExtractorTest.GetULEB128_bit63 (1207 of 2474)
PASS: lldb-api :: commands/expression/result_numbering/TestResultNumbering.py (1208 of 2474)
PASS: lldb-shell :: SymbolFile/DWARF/clang-ast-from-dwarf-unamed-and-anon-structs.cpp (1209 of 2474)
PASS: lldb-unit :: Host/./HostTests/SocketTests/SocketTest.TCPGetAddress/ipv4 (1210 of 2474)
PASS: lldb-shell :: Minidump/memory-region.yaml (1211 of 2474)
UNSUPPORTED: lldb-api :: arm/breakpoint-thumb-codesection/TestBreakpointThumbCodesection.py (1212 of 2474)
PASS: lldb-unit :: ScriptInterpreter/Python/./ScriptInterpreterPythonTests/PythonDataObjectsTest.TestPythonListManipulation (1213 of 2474)
PASS: lldb-unit :: ScriptInterpreter/Python/./ScriptInterpreterPythonTests/PythonDataObjectsTest.TestPythonListValueEquality (1214 of 2474)
PASS: lldb-unit :: Core/./LLDBCoreTests/MangledTest.EmptyForInvalidRustV0Name (1215 of 2474)
UNSUPPORTED: lldb-api :: functionalities/tsan/global_location/TestTsanGlobalLocation.py (1216 of 2474)
PASS: lldb-api :: functionalities/object-file/TestImageListMultiArchitecture.py (1217 of 2474)
PASS: lldb-unit :: API/./APITests/SBStructuredDataTest.NullImpl (1218 of 2474)
PASS: lldb-unit :: Utility/./UtilityTests/StringListTest.InsertStringAtIndexStart (1219 of 2474)
PASS: lldb-unit :: Core/./LLDBCoreTests/CommunicationTest.SynchronizeWhileClosing (1220 of 2474)
PASS: lldb-api :: functionalities/data-formatter/dump_dynamic/TestDumpDynamic.py (1221 of 2474)
PASS: lldb-unit :: Utility/./UtilityTests/StringExtractorTest.GetHexBytesAvail_FullString (1222 of 2474)
PASS: lldb-api :: commands/frame/diagnose/complicated-expression/TestComplicatedExpression.py (1223 of 2474)
PASS: lldb-api :: commands/expression/import-std-module/conflicts/TestStdModuleWithConflicts.py (1224 of 2474)
PASS: lldb-api :: macosx/duplicate-archive-members/TestDuplicateMembers.py (1225 of 2474)
PASS: lldb-unit :: Utility/./UtilityTests/StringExtractorTest.DecodeHexU8_Underflow2 (1226 of 2474)
UNSUPPORTED: lldb-shell :: SymbolFile/DWARF/debug-types-expressions.test (1227 of 2474)
PASS: lldb-api :: python_api/lldbutil/TestSwigVersion.py (1228 of 2474)
PASS: lldb-shell :: SymbolFile/DWARF/x86/parallel-indexing-stress.s (1229 of 2474)
PASS: lldb-unit :: Process/Utility/./ProcessUtilityTests/ProcMapTests/LinuxProcMapsTestFixture.ParseMapRegions/6 (1230 of 2474)
PASS: lldb-shell :: ObjectFile/MachO/lc_version_min.yaml (1231 of 2474)
PASS: lldb-unit :: Utility/./UtilityTests/VMRange.ContainsAddr (1232 of 2474)
PASS: lldb-unit :: Utility/./UtilityTests/StringExtractorGDBRemoteTest.GetPidTid (1233 of 2474)
PASS: lldb-api :: python_api/sbdata/TestSBData.py (1234 of 2474)
PASS: lldb-unit :: Utility/./UtilityTests/GeneratorTest.YamlMultiProvider (1235 of 2474)
PASS: lldb-unit :: Utility/./UtilityTests/FileSpecTest.PrependPathComponent (1236 of 2474)
PASS: lldb-unit :: ScriptInterpreter/Python/./ScriptInterpreterPythonTests/PythonDataObjectsTest.TestCallable (1237 of 2474)
PASS: lldb-unit :: Host/./HostTests/TerminalTest.SaveRestore (1238 of 2474)
PASS: lldb-unit :: Utility/./UtilityTests/ArgsTest.GetArgumentArrayRef (1239 of 2474)
PASS: lldb-unit :: ScriptInterpreter/Python/./ScriptInterpreterPythonTests/PythonDataObjectsTest.TestPythonStringToStr (1240 of 2474)
PASS: lldb-unit :: Host/./HostTests/TerminalTest.SetEcho (1241 of 2474)
PASS: lldb-unit :: UnwindAssembly/x86/./UnwindAssemblyx86Tests/Testx86AssemblyInspectionEngine.TestSpillRegToStackViaMOVx86_64 (1242 of 2474)
UNSUPPORTED: lldb-shell :: Unwind/eh-frame-small-fde.test (1243 of 2474)
PASS: lldb-api :: commands/disassemble/basic/TestDisassembleBreakpoint.py (1244 of 2474)
PASS: lldb-unit :: Host/./HostTests/FileSystemTest.Resolve (1245 of 2474)
PASS: lldb-unit :: Utility/./UtilityTests/ScalarTest.Scalar_512 (1246 of 2474)
PASS: lldb-api :: commands/expression/no-deadlock/TestExprDoesntBlock.py (1247 of 2474)
UNSUPPORTED: lldb-api :: lang/objc/rdar-12408181/TestRdar12408181.py (1248 of 2474)
PASS: lldb-unit :: Process/minidump/./LLDBMinidumpTests/MinidumpParserTest.GetMiscInfoWindows (1249 of 2474)
PASS: lldb-shell :: Driver/TestRepl.test (1250 of 2474)
PASS: lldb-unit :: UnwindAssembly/x86/./UnwindAssemblyx86Tests/Testx86AssemblyInspectionEngine.TestPopRBP (1251 of 2474)
PASS: lldb-shell :: ObjectFile/wasm/basic.yaml (1252 of 2474)
PASS: lldb-shell :: Minidump/Windows/Sigsegv/sigsegv.test (1253 of 2474)
PASS: lldb-api :: python_api/sbvalue_persist/TestSBValuePersist.py (1254 of 2474)
PASS: lldb-api :: functionalities/thread/concurrent_events/TestConcurrentTwoBreakpointThreads.py (1255 of 2474)
UNSUPPORTED: lldb-shell :: Subprocess/fork-follow-parent-softbp.test (1256 of 2474)
PASS: lldb-unit :: Host/./HostTests/ProcessLaunchInfoTest.Constructor (1257 of 2474)
PASS: lldb-api :: tools/lldb-vscode/coreFile/TestVSCode_coreFile.py (1258 of 2474)
PASS: lldb-api :: commands/expression/ir-interpreter-phi-nodes/TestIRInterpreterPHINodes.py (1259 of 2474)
PASS: lldb-unit :: Process/minidump/./LLDBMinidumpTests/MinidumpParserTest.GetThreadContext_x86_32 (1260 of 2474)
PASS: lldb-unit :: Utility/./UtilityTests/UriParserTest.BadPort (1261 of 2474)
PASS: lldb-unit :: Core/./LLDBCoreTests/RichManglingContextTest.FromCxxMethodName (1262 of 2474)
PASS: lldb-unit :: UnwindAssembly/x86/./UnwindAssemblyx86Tests/Testx86AssemblyInspectionEngine.TestMovRSPtoRBP (1263 of 2474)
PASS: lldb-api :: python_api/process/io/TestProcessIO.py (1264 of 2474)
PASS: lldb-api :: commands/breakpoint/command/list/TestBreakpointCommandList.py (1265 of 2474)
UNSUPPORTED: lldb-shell :: Register/x86-64-zmm-read.test (1266 of 2474)
PASS: lldb-shell :: Register/Core/x86-64-freebsd-multithread.test (1267 of 2474)
PASS: lldb-shell :: SymbolFile/DWARF/x86/dwp-debug-types.s (1268 of 2474)
PASS: lldb-shell :: SymbolFile/NativePDB/source-list.cpp (1269 of 2474)
PASS: lldb-api :: lang/objc/objc-optimized/TestObjcOptimized.py (1270 of 2474)
PASS: lldb-unit :: Utility/./UtilityTests/GeneratorTest.Create (1271 of 2474)
UNSUPPORTED: lldb-api :: linux/mix-dwo-and-regular-objects/TestMixedDwarfBinary.py (1272 of 2474)
PASS: lldb-api :: lang/objc/direct-dispatch-step/TestObjCDirectDispatchStepping.py (1273 of 2474)
PASS: lldb-api :: commands/command/container/TestContainerCommands.py (1274 of 2474)
PASS: lldb-api :: functionalities/breakpoint/address_breakpoints/TestBadAddressBreakpoints.py (1275 of 2474)
PASS: lldb-api :: functionalities/gdb_remote_client/TestMemoryRegionDirtyPages.py (1276 of 2474)
PASS: lldb-unit :: Utility/./UtilityTests/DataExtractorTest.GetMaxS64 (1277 of 2474)
UNSUPPORTED: lldb-shell :: Register/arm-gp-read.test (1278 of 2474)
PASS: lldb-unit :: Interpreter/./InterpreterTests/CompletionTest.FileCompletionAbsolute (1279 of 2474)
PASS: lldb-unit :: Utility/./UtilityTests/UriParserTest.PortOverflow (1280 of 2474)
PASS: lldb-api :: commands/target/modules/search-paths/insert/TestTargetModulesSearchpathsInsert.py (1281 of 2474)
PASS: lldb-unit :: Utility/./UtilityTests/PassiveReplayTest.InstrumentedFoo (1282 of 2474)
UNSUPPORTED: lldb-api :: functionalities/ptrauth_diagnostics/LDRAA_error/TestPtrauthLDRAADiagnostic.py (1283 of 2474)
PASS: lldb-api :: functionalities/lazy-loading/TestLazyLoading.py (1284 of 2474)
PASS: lldb-unit :: DataFormatter/./LLDBFormatterTests/StringPrinterTests.CxxASCII (1285 of 2474)
PASS: lldb-api :: commands/expression/namespace_local_var_same_name_cpp_and_c/TestNamespaceLocalVarSameNameCppAndC.py (1286 of 2474)
UNSUPPORTED: lldb-api :: commands/trace/TestTraceSave.py (1287 of 2474)
PASS: lldb-unit :: Utility/./UtilityTests/StringExtractorGDBRemoteTest.GetPidTidMultipleValues (1288 of 2474)
PASS: lldb-unit :: Language/Highlighting/./HighlighterTests/HighlighterTest.ClangTrailingBackslashMissingNewLine (1289 of 2474)
PASS: lldb-unit :: Utility/./UtilityTests/StreamTest.PutPtr (1290 of 2474)
PASS: lldb-unit :: Utility/./UtilityTests/StringListTest.CopyListEmpty (1291 of 2474)
PASS: lldb-api :: tools/lldb-server/TestGdbRemoteKill.py (1292 of 2474)
PASS: lldb-unit :: ScriptInterpreter/Python/./ScriptInterpreterPythonTests/PythonDataObjectsTest.TestDictionaryResolutionWithDot (1293 of 2474)
PASS: lldb-shell :: SymbolFile/DWARF/x86/find-variable-dwo.cpp (1294 of 2474)
PASS: lldb-unit :: Target/./TargetTests/MCBasedABI.MapRegisterName (1295 of 2474)
PASS: lldb-unit :: Platform/./LLDBPlatformTests/PlatformDarwinTest.GetCompatibleArchARMv4 (1296 of 2474)
PASS: lldb-shell :: Breakpoint/debug_addrx.test (1297 of 2474)
PASS: lldb-api :: functionalities/data-formatter/format-propagation/TestFormatPropagation.py (1298 of 2474)
PASS: lldb-api :: functionalities/data-formatter/data-formatter-objc/cmtime/TestDataFormatterCMTime.py (1299 of 2474)
UNSUPPORTED: lldb-shell :: Register/x86-64-xmm16-read.test (1300 of 2474)
PASS: lldb-unit :: ScriptInterpreter/Python/./ScriptInterpreterPythonTests/PythonDataObjectsTest.TestRun (1301 of 2474)
UNSUPPORTED: lldb-api :: linux/sepdebugsymlink/TestTargetSymbolsSepDebugSymlink.py (1302 of 2474)
PASS: lldb-api :: tools/lldb-vscode/correct-thread/TestVSCode_correct_thread.py (1303 of 2474)
PASS: lldb-api :: lang/cpp/nsimport/TestCppNsImport.py (1304 of 2474)
PASS: lldb-unit :: Utility/./UtilityTests/UriParserTest.BracketedHostnameWithPortIPv4 (1305 of 2474)
PASS: lldb-shell :: Register/Core/aarch64-freebsd-multithread.test (1306 of 2474)
PASS: lldb-api :: lang/c/strings/TestCStrings.py (1307 of 2474)
PASS: lldb-api :: commands/expression/weak_symbols/TestWeakSymbols.py (1308 of 2474)
PASS: lldb-unit :: Process/gdb-remote/./ProcessGdbRemoteTests/GDBRemoteCommunicationClientTest.WriteRegister (1309 of 2474)
PASS: lldb-api :: python_api/watchpoint/condition/TestWatchpointConditionAPI.py (1310 of 2474)
UNSUPPORTED: lldb-api :: benchmarks/stepping/TestSteppingSpeed.py (1311 of 2474)
PASS: lldb-unit :: ScriptInterpreter/Python/./ScriptInterpreterPythonTests/PythonDataObjectsTest.TestPythonCallableInvoke (1312 of 2474)
PASS: lldb-api :: commands/expression/argument_passing_restrictions/TestArgumentPassingRestrictions.py (1313 of 2474)
PASS: lldb-unit :: Symbol/./SymbolTests/TestTypeSystemClang.GetFullyUnqualifiedType (1314 of 2474)
PASS: lldb-shell :: Recognizer/assert.test (1315 of 2474)
PASS: lldb-api :: lang/cpp/member-and-local-vars-with-same-name/TestMembersAndLocalsWithSameName.py (1316 of 2474)
UNSUPPORTED: lldb-api :: functionalities/process_save_core_minidump/TestProcessSaveCoreMinidump.py (1317 of 2474)
PASS: lldb-api :: tools/lldb-vscode/launch/TestVSCode_launch.py (1318 of 2474)
PASS: lldb-api :: lang/cpp/class_static/TestStaticVariables.py (1319 of 2474)
PASS: lldb-unit :: Host/./HostTests/TerminalTest.SetRaw (1320 of 2474)
PASS: lldb-api :: tools/lldb-vscode/variables/TestVSCode_variables.py (1321 of 2474)
PASS: lldb-unit :: Process/minidump/./LLDBMinidumpTests/MinidumpParserTest.MinidumpDuplicateModuleMappedSecondHigh (1322 of 2474)
PASS: lldb-api :: lang/cpp/crtp/TestCppCRTP.py (1323 of 2474)
PASS: lldb-api :: commands/expression/codegen-crash-import-def-arraytype-element/TestImportDefinitionArrayType.py (1324 of 2474)
PASS: lldb-unit :: ScriptInterpreter/Python/./ScriptInterpreterPythonTests/PythonDataObjectsTest.TestPythonByteArray (1325 of 2474)
PASS: lldb-unit :: Host/./HostTests/NativeProcessProtocolTest.ReadMemoryWithoutTrap (1326 of 2474)
PASS: lldb-shell :: SymbolFile/DWARF/x86/find-method.cpp (1327 of 2474)
PASS: lldb-unit :: Process/Utility/./ProcessUtilityTests/ProcMapTests/LinuxProcMapsTestFixture.ParseMapRegions/0 (1328 of 2474)
PASS: lldb-unit :: Utility/./UtilityTests/StringExtractorTest.GetHexBytes_OddPair2 (1329 of 2474)
PASS: lldb-api :: functionalities/gdb_remote_client/TestGDBRemoteDiskFileCompletion.py (1330 of 2474)
PASS: lldb-api :: types/TestRecursiveTypes.py (1331 of 2474)
PASS: lldb-api :: functionalities/data-formatter/data-formatter-smart-array/TestDataFormatterSmartArray.py (1332 of 2474)
UNSUPPORTED: lldb-shell :: Register/x86-gp-read.test (1333 of 2474)
PASS: lldb-api :: python_api/lldbutil/process/TestPrintStackTraces.py (1334 of 2474)
PASS: lldb-api :: tools/lldb-server/TestGdbRemoteSingleStep.py (1335 of 2474)
PASS: lldb-api :: functionalities/avoids-fd-leak/TestFdLeak.py (1336 of 2474)
PASS: lldb-api :: commands/settings/use_source_cache/TestUseSourceCache.py (1337 of 2474)
PASS: lldb-unit :: Utility/./UtilityTests/StringListTest.LongestCommonPrefixSingleElement (1338 of 2474)
PASS: lldb-api :: functionalities/postmortem/elf-core/thread_crash/TestLinuxCoreThreads.py (1339 of 2474)
PASS: lldb-api :: python_api/thread/TestThreadAPI.py (1340 of 2474)
PASS: lldb-api :: lang/cpp/gmodules/TestWithModuleDebugging.py (1341 of 2474)
PASS: lldb-api :: functionalities/data-formatter/data-formatter-stl/libcxx/map/TestDataFormatterLibccMap.py (1342 of 2474)
PASS: lldb-unit :: Utility/./UtilityTests/PassiveReplayTest.InstrumentedBar (1343 of 2474)
PASS: lldb-unit :: Utility/./UtilityTests/RegularExpression.Invalid (1344 of 2474)
PASS: lldb-api :: types/TestLongTypes.py (1345 of 2474)
PASS: lldb-api :: functionalities/optimized_code/TestNoASanExceptionAfterEvalOP_piece.py (1346 of 2474)
UNSUPPORTED: lldb-shell :: SymbolFile/PDB/pointers.test (1347 of 2474)
PASS: lldb-unit :: ScriptInterpreter/Python/./ScriptInterpreterPythonTests/PythonDataObjectsTest.TestTypeNameResolutionNoDot (1348 of 2474)
PASS: lldb-unit :: UnwindAssembly/x86/./UnwindAssemblyx86Tests/Testx86AssemblyInspectionEngine.TestPushR12 (1349 of 2474)
PASS: lldb-unit :: Host/./HostTests/SocketAddressTest.Set (1350 of 2474)
PASS: lldb-unit :: ScriptInterpreter/Python/./ScriptInterpreterPythonTests/PythonDataObjectsTest.TestPythonBytes (1351 of 2474)
PASS: lldb-shell :: ObjectFile/Breakpad/discontiguous-sections.test (1352 of 2474)
PASS: lldb-unit :: Utility/./UtilityTests/Predicate.WaitForValueNotEqualTo (1353 of 2474)
PASS: lldb-api :: lang/objcxx/objcxx-ivar-vector/TestIvarVector.py (1354 of 2474)
PASS: lldb-unit :: Utility/./UtilityTests/StringListTest.LongestCommonPrefixEmpty (1355 of 2474)
PASS: lldb-unit :: Language/Highlighting/./HighlighterTests/HighlighterTest.ClangBraces (1356 of 2474)
PASS: lldb-api :: python_api/sbstructureddata/TestStructuredDataAPI.py (1357 of 2474)
PASS: lldb-unit :: Expression/./ExpressionTests/CppModuleConfigurationTest.UnknownLibCppFile (1358 of 2474)
PASS: lldb-shell :: ObjectFile/wasm/unified-debug-sections.yaml (1359 of 2474)
PASS: lldb-unit :: Process/Utility/./ProcessUtilityTests/ProcSMapTests/LinuxProcSMapsTestFixture.ParseSMapRegions/3 (1360 of 2474)
PASS: lldb-api :: lang/cpp/unsigned_types/TestUnsignedTypes.py (1361 of 2474)
PASS: lldb-api :: functionalities/dead-strip/TestDeadStrip.py (1362 of 2474)
PASS: lldb-unit :: Utility/./UtilityTests/ProcessInstanceInfo.DumpTable (1363 of 2474)
PASS: lldb-api :: lang/cpp/call-function/TestCallCPPFunction.py (1364 of 2474)
PASS: lldb-unit :: Utility/./UtilityTests/StringListTest.JoinThree (1365 of 2474)
PASS: lldb-api :: lang/c/modules/TestCModules.py (1366 of 2474)
UNSUPPORTED: lldb-shell :: ScriptInterpreter/Lua/independent_state.test (1367 of 2474)
PASS: lldb-unit :: Utility/./UtilityTests/StringListTest.JoinMultiCharSeparator (1368 of 2474)
UNSUPPORTED: lldb-shell :: ScriptInterpreter/Lua/lua-python.test (1369 of 2474)
PASS: lldb-api :: functionalities/data-formatter/data-formatter-objc/nsstring/TestDataFormatterNSString.py (1370 of 2474)
PASS: lldb-shell :: Reproducer/TestCrash.test (1371 of 2474)
PASS: lldb-shell :: Unwind/thread-step-out-ret-addr-check.test (1372 of 2474)
PASS: lldb-shell :: SymbolFile/NativePDB/function-types-builtins.cpp (1373 of 2474)
PASS: lldb-shell :: Settings/TestFrameFormatMangling.test (1374 of 2474)
PASS: lldb-unit :: Utility/./UtilityTests/XcodeSDKTest.SDKSupportsSwift (1375 of 2474)
PASS: lldb-api :: lang/cpp/modules-import/TestCXXModulesImport.py (1376 of 2474)
PASS: lldb-shell :: SymbolFile/Breakpad/line-table-edgecases.test (1377 of 2474)
PASS: lldb-api :: commands/expression/pr52257/TestExprCrash.py (1378 of 2474)
PASS: lldb-unit :: Utility/./UtilityTests/LogChannelEnabledTest.LogThread (1379 of 2474)
PASS: lldb-unit :: DataFormatter/./LLDBFormatterTests/TypeMatcherTests.RegexMatchPart (1380 of 2474)
PASS: lldb-api :: functionalities/gdb_remote_client/TestPartialGPacket.py (1381 of 2474)
PASS: lldb-unit :: SymbolFile/NativePDB/./SymbolFileNativePDBTests/PDBFPOProgramToDWARFExpressionTests.UnsupportedRASearch (1382 of 2474)
PASS: lldb-unit :: Host/./HostTests/TerminalTest.SetParity (1383 of 2474)
UNSUPPORTED: lldb-api :: functionalities/data-formatter/data-formatter-stl/libstdcpp/vbool/TestDataFormatterStdVBool.py (1384 of 2474)
PASS: lldb-unit :: Host/./HostTests/MainLoopTest.DetectsEOF (1385 of 2474)
PASS: lldb-unit :: Expression/./ExpressionTests/CppModuleConfigurationTest.IgnoreLibStdCpp (1386 of 2474)
PASS: lldb-api :: iohandler/resize/TestIOHandlerResizeNoEditline.py (1387 of 2474)
PASS: lldb-api :: python_api/value/empty_class/TestValueAPIEmptyClass.py (1388 of 2474)
PASS: lldb-unit :: Expression/./ExpressionTests/CppModuleConfigurationTest.MissingUsrInclude (1389 of 2474)
PASS: lldb-unit :: Utility/./UtilityTests/StreamTest.Indent (1390 of 2474)
PASS: lldb-unit :: UnwindAssembly/x86/./UnwindAssemblyx86Tests/Testx86AssemblyInspectionEngine.TestSimplex86_64Augmented (1391 of 2474)
PASS: lldb-unit :: Utility/./UtilityTests/BinaryStreamTest.PutULEB128SevenBytes (1392 of 2474)
PASS: lldb-shell :: Settings/TestSettingsSet.test (1393 of 2474)
PASS: lldb-api :: lang/cpp/alignas_base_class/TestAlignAsBaseClass.py (1394 of 2474)
PASS: lldb-api :: lang/objc/objc-property/TestObjCProperty.py (1395 of 2474)
PASS: lldb-shell :: SymbolFile/DWARF/x86/compilercontext.ll (1396 of 2474)
PASS: lldb-api :: functionalities/param_entry_vals/basic_entry_values/TestBasicEntryValues.py (1397 of 2474)
PASS: lldb-shell :: SymbolFile/DWARF/x86/debug-types-signature-loop.s (1398 of 2474)
PASS: lldb-unit :: ScriptInterpreter/Python/./ScriptInterpreterPythonTests/PythonDataObjectsTest.TestBorrowedReferences (1399 of 2474)
PASS: lldb-api :: tools/lldb-server/signal-filtering/TestGdbRemote_QPassSignals.py (1400 of 2474)
PASS: lldb-unit :: Core/./LLDBCoreTests/FormatEntity.LookupAllEntriesInTree (1401 of 2474)
PASS: lldb-unit :: Utility/./UtilityTests/XcodeSDKTest.SDKSupportsModules (1402 of 2474)
UNSUPPORTED: lldb-shell :: Register/aarch64-gp-read.test (1403 of 2474)
PASS: lldb-api :: functionalities/postmortem/minidump/TestMiniDump.py (1404 of 2474)
PASS: lldb-api :: commands/expression/fixits/TestFixIts.py (1405 of 2474)
PASS: lldb-api :: lang/cpp/complete-type-check/TestCppIsTypeComplete.py (1406 of 2474)
PASS: lldb-unit :: Utility/./UtilityTests/Flags.Reset (1407 of 2474)
PASS: lldb-api :: lang/objc/self/TestObjCSelf.py (1408 of 2474)
PASS: lldb-unit :: Host/./HostTests/Host.WaitStatusFormat (1409 of 2474)
PASS: lldb-shell :: SymbolFile/DWARF/x86/limit-debug-info.s (1410 of 2474)
PASS: lldb-unit :: debugserver/./debugserverTests/RNBSocket.LoopBackConnectIPv4 (1411 of 2474)
PASS: lldb-unit :: Core/./LLDBCoreTests/CommunicationTest.WriteAll (1412 of 2474)
PASS: lldb-unit :: Utility/./UtilityTests/StringListTest.AppendStringMove (1413 of 2474)
PASS: lldb-unit :: Host/./HostTests/SocketTests/SocketTest.TCPListen0GetPort/ipv4 (1414 of 2474)
PASS: lldb-unit :: ScriptInterpreter/Python/./ScriptInterpreterPythonTests/PythonDataObjectsTest.TestPythonBoolean (1415 of 2474)
PASS: lldb-unit :: ScriptInterpreter/Python/./ScriptInterpreterPythonTests/PythonDataObjectsTest.TestGlobalNameResolutionNoDot (1416 of 2474)
PASS: lldb-unit :: Utility/./UtilityTests/RangeDataVector.CustomSort (1417 of 2474)
UNSUPPORTED: lldb-shell :: SymbolFile/DWARF/x86/DW_TAG_variable-DW_AT_decl_file-DW_AT_abstract_origin-crosscu1.s (1418 of 2474)
UNSUPPORTED: lldb-shell :: Subprocess/clone-follow-child-softbp.test (1419 of 2474)
PASS: lldb-api :: functionalities/inferior-crashing/recursive-inferior/TestRecursiveInferior.py (1420 of 2474)
PASS: lldb-unit :: Utility/./UtilityTests/IndexToObjectTest.ObjectForIndex (1421 of 2474)
PASS: lldb-shell :: Quit/TestQuitExitCodeImplicit0.test (1422 of 2474)
PASS: lldb-unit :: Platform/./LLDBPlatformTests/PlatformDarwinTest.GetCompatibleArchARMv7k (1423 of 2474)
PASS: lldb-api :: lang/cpp/exceptions/TestCPPExceptionBreakpoints.py (1424 of 2474)
PASS: lldb-api :: commands/command/source/TestCommandSource.py (1425 of 2474)
PASS: lldb-unit :: Utility/./UtilityTests/StringListTest.AppendList (1426 of 2474)
PASS: lldb-unit :: Utility/./UtilityTests/DeserializerTest.HasData (1427 of 2474)
UNSUPPORTED: lldb-shell :: Process/Windows/exception_access_violation.cpp (1428 of 2474)
PASS: lldb-unit :: Utility/./UtilityTests/PassiveReplayTest.InstrumentedFooInvalid (1429 of 2474)
PASS: lldb-api :: lang/cpp/class-loading-via-member-typedef/TestClassLoadingViaMemberTypedef.py (1430 of 2474)
PASS: lldb-shell :: ScriptInterpreter/Python/Crashlog/no_threadState.test (1431 of 2474)
PASS: lldb-api :: functionalities/postmortem/elf-core/gcore/TestGCore.py (1432 of 2474)
PASS: lldb-api :: functionalities/gdb_remote_client/TestGDBRemoteClient.py (1433 of 2474)
PASS: lldb-api :: python_api/sbvalue_const_addrof/TestSBValueConstAddrOf.py (1434 of 2474)
PASS: lldb-api :: commands/add-dsym/uuid/TestAddDsymCommand.py (1435 of 2474)
PASS: lldb-api :: commands/gui/invalid-args/TestInvalidArgsGui.py (1436 of 2474)
PASS: lldb-unit :: Language/Highlighting/./HighlighterTests/HighlighterTest.ClangEmptyInput (1437 of 2474)
PASS: lldb-api :: functionalities/tail_call_frames/disambiguate_paths_to_common_sink/TestDisambiguatePathsToCommonSink.py (1438 of 2474)
PASS: lldb-unit :: Utility/./UtilityTests/StringExtractorTest.GetNameColonValueSuccess (1439 of 2474)
PASS: lldb-shell :: SymbolFile/Breakpad/stack-cfi-parsing.test (1440 of 2474)
PASS: lldb-api :: tools/lldb-server/commandline/TestGdbRemoteConnection.py (1441 of 2474)
PASS: lldb-unit :: Utility/./UtilityTests/VMRange.ContainsRange (1442 of 2474)
UNSUPPORTED: lldb-api :: benchmarks/libcxxlist/TestBenchmarkLibcxxList.py (1443 of 2474)
PASS: lldb-api :: commands/expression/anonymous-struct/TestCallUserAnonTypedef.py (1444 of 2474)
PASS: lldb-unit :: Utility/./UtilityTests/StringListTest.CopyList (1445 of 2474)
PASS: lldb-api :: commands/command/nested_alias/TestNestedAlias.py (1446 of 2474)
PASS: lldb-unit :: Utility/./UtilityTests/GeneratorTest.GetOrCreate (1447 of 2474)
PASS: lldb-unit :: Expression/./ExpressionTests/DiagnosticManagerTest.PutString (1448 of 2474)
PASS: lldb-unit :: Host/./HostTests/SocketTests/SocketTest.TCPListen0GetPort/ipv6 (1449 of 2474)
PASS: lldb-unit :: Utility/./UtilityTests/StringExtractorTest.GetHexBytesAvail_Partial (1450 of 2474)
PASS: lldb-api :: commands/settings/quoting/TestQuoting.py (1451 of 2474)
PASS: lldb-unit :: Utility/./UtilityTests/FileSpecTest.GuessPathStyle (1452 of 2474)
PASS: lldb-unit :: Utility/./UtilityTests/ScalarTest.Getters (1453 of 2474)
PASS: lldb-api :: functionalities/data-formatter/data-formatter-objc/TestDataFormatterObjCPlain.py (1454 of 2474)
PASS: lldb-api :: types/TestLongTypesExpr.py (1455 of 2474)
PASS: lldb-shell :: Register/x86-64-gp-read.test (1456 of 2474)
PASS: lldb-unit :: Process/Utility/./ProcessUtilityTests/ProcSMapTests/LinuxProcSMapsTestFixture.ParseSMapRegions/9 (1457 of 2474)
PASS: lldb-api :: functionalities/gdb_remote_client/TestRestartBug.py (1458 of 2474)
UNSUPPORTED: lldb-api :: tools/lldb-server/registers-target-xml-reading/TestGdbRemoteTargetXmlPacket.py (1459 of 2474)
PASS: lldb-unit :: Utility/./UtilityTests/RegisterValueTest.GetScalarValue (1460 of 2474)
PASS: lldb-api :: commands/target/dump-symtab-demangle/TestDumpSymtabDemangle.py (1461 of 2474)
PASS: lldb-api :: functionalities/unwind/noreturn/TestNoreturnUnwind.py (1462 of 2474)
PASS: lldb-unit :: Language/CPlusPlus/./LanguageCPlusPlusTests/CPlusPlusLanguage.ExtractContextAndIdentifier (1463 of 2474)
PASS: lldb-api :: lang/cpp/rvalue-references/TestRvalueReferences.py (1464 of 2474)
PASS: lldb-api :: functionalities/postmortem/wow64_minidump/TestWow64MiniDump.py (1465 of 2474)
PASS: lldb-shell :: SymbolFile/DWARF/x86/debug-types-basic.test (1466 of 2474)
UNSUPPORTED: lldb-shell :: Subprocess/clone-follow-parent-wp.test (1467 of 2474)
PASS: lldb-api :: commands/expression/top-level/TestTopLevelExprs.py (1468 of 2474)
PASS: lldb-shell :: ObjectFile/ELF/section-types-edgecases.yaml (1469 of 2474)
PASS: lldb-api :: lang/objcxx/class-name-clash/TestNameClash.py (1470 of 2474)
XFAIL: lldb-shell :: Register/x86-64-fp-read.test (1471 of 2474)
PASS: lldb-api :: commands/frame/var-scope/TestFrameVariableScope.py (1472 of 2474)
PASS: lldb-unit :: Utility/./UtilityTests/NameMatchesTest.RegularExpression (1473 of 2474)
PASS: lldb-api :: lang/c/forward/TestForwardDeclaration.py (1474 of 2474)
PASS: lldb-api :: commands/expression/radar_8638051/Test8638051.py (1475 of 2474)
PASS: lldb-unit :: Symbol/./SymbolTests/TestClangASTImporter.RecordLayout (1476 of 2474)
PASS: lldb-api :: commands/watchpoints/watchpoint_disable/TestWatchpointDisable.py (1477 of 2474)
PASS: lldb-unit :: Signals/./SignalsTests/UnixSignalsTest.VersionChange (1478 of 2474)
PASS: lldb-unit :: Utility/./UtilityTests/RangeTest.DoesAdjoinOrIntersect (1479 of 2474)
PASS: lldb-unit :: ObjectFile/Breakpad/./ObjectFileBreakpadTests/StackWinRecord.parse (1480 of 2474)
PASS: lldb-unit :: Utility/./UtilityTests/UriParserTest.SchemeHostSeparator (1481 of 2474)
PASS: lldb-api :: commands/session/save/TestSessionSave.py (1482 of 2474)
PASS: lldb-unit :: ScriptInterpreter/Python/./ScriptInterpreterPythonTests/PythonDataObjectsTest.TestPythonIntegerToStructuredInteger (1483 of 2474)
PASS: lldb-shell :: Breakpoint/split-dwarf5-debug-stroffsets.test (1484 of 2474)
PASS: lldb-unit :: ScriptInterpreter/Python/./ScriptInterpreterPythonTests/PythonDataObjectsTest.TestOwnedReferences (1485 of 2474)
PASS: lldb-api :: macosx/skinny-corefile/TestSkinnyCorefile.py (1486 of 2474)
PASS: lldb-api :: functionalities/thread/concurrent_events/TestConcurrentWatchBreakDelay.py (1487 of 2474)
PASS: lldb-api :: lang/cpp/stl/TestSTL.py (1488 of 2474)
UNSUPPORTED: lldb-api :: functionalities/signal/handle-segv/TestHandleSegv.py (1489 of 2474)
PASS: lldb-api :: functionalities/breakpoint/auto_continue/TestBreakpointAutoContinue.py (1490 of 2474)
PASS: lldb-unit :: Utility/./UtilityTests/UriParserTest.TypicalPortPathIPv6 (1491 of 2474)
PASS: lldb-unit :: Host/./HostTests/ConnectionFileDescriptorTest.TCPGetURIv6 (1492 of 2474)
PASS: lldb-unit :: Utility/./UtilityTests/ArgsTest.TestTrailingBackslash (1493 of 2474)
PASS: lldb-unit :: Utility/./UtilityTests/FileSpecTest.Equal (1494 of 2474)
PASS: lldb-unit :: Utility/./UtilityTests/BinaryStreamTest.PutULEB128FourBytes (1495 of 2474)
PASS: lldb-unit :: Utility/./UtilityTests/ConstStringTest.NullAndEmptyStates (1496 of 2474)
UNSUPPORTED: lldb-shell :: ScriptInterpreter/Lua/partial_statements.test (1497 of 2474)
PASS: lldb-api :: commands/expression/persistent_types/TestPersistentTypes.py (1498 of 2474)
PASS: lldb-api :: functionalities/breakpoint/scripted_bkpt/TestScriptedResolver.py (1499 of 2474)
PASS: lldb-api :: functionalities/gdb_remote_client/TestPlatformKill.py (1500 of 2474)
XFAIL: lldb-shell :: Register/x86-64-write.test (1501 of 2474)
PASS: lldb-api :: functionalities/conditional_break/TestConditionalBreak.py (1502 of 2474)
PASS: lldb-api :: python_api/function_symbol/TestSymbolAPI.py (1503 of 2474)
PASS: lldb-api :: functionalities/data-formatter/data-formatter-synth/TestDataFormatterSynth.py (1504 of 2474)
PASS: lldb-unit :: Core/./LLDBCoreTests/FormatEntityTest.DefinitionConstructionNameAndType (1505 of 2474)
PASS: lldb-unit :: SymbolFile/DWARF/./SymbolFileDWARFTests/SymbolFileDWARFTests.ParseArangesIgnoreEmpty (1506 of 2474)
PASS: lldb-unit :: SymbolFile/DWARF/./SymbolFileDWARFTests/DWARFUnitTest.MissingSentinel (1507 of 2474)
PASS: lldb-unit :: Host/./HostTests/File.GetStreamFromDescriptor (1508 of 2474)
PASS: lldb-unit :: ScriptInterpreter/Python/./ScriptInterpreterPythonTests/PythonDataObjectsTest.TestPythonTupleSize (1509 of 2474)
PASS: lldb-unit :: Host/./HostTests/SocketTests/SocketTest.UDPConnect/ipv6 (1510 of 2474)
PASS: lldb-api :: commands/statistics/basic/TestStats.py (1511 of 2474)
PASS: lldb-shell :: SymbolFile/DWARF/x86/DW_TAG_variable-invalid_location.s (1512 of 2474)
PASS: lldb-unit :: Symbol/./SymbolTests/TestClangASTImporter.MetadataPropagationAfterCopying (1513 of 2474)
PASS: lldb-api :: functionalities/breakpoint/debugbreak/TestDebugBreak.py (1514 of 2474)
PASS: lldb-unit :: Language/Highlighting/./HighlighterTests/HighlighterTest.FallbackHighlighter (1515 of 2474)
PASS: lldb-unit :: Utility/./UtilityTests/StreamTest.ChangingByteOrder (1516 of 2474)
UNSUPPORTED: lldb-api :: commands/watchpoints/hello_watchlocation/TestWatchLocation.py (1517 of 2474)
PASS: lldb-unit :: Symbol/./SymbolTests/DWARFCallFrameInfoTest.Basic_dwarf3 (1518 of 2474)
PASS: lldb-unit :: Utility/./UtilityTests/BinaryStreamTest.PutSLEB128MaxValue (1519 of 2474)
PASS: lldb-api :: commands/thread/select/TestThreadSelect.py (1520 of 2474)
PASS: lldb-api :: functionalities/step-vrs-interrupt/TestStepVrsInterruptTimeout.py (1521 of 2474)
PASS: lldb-api :: commands/expression/import-std-module/retry-with-std-module/TestRetryWithStdModule.py (1522 of 2474)
PASS: lldb-shell :: Register/Core/x86-32-linux-multithread.test (1523 of 2474)
XFAIL: lldb-shell :: Expr/nodefaultlib.cpp (1524 of 2474)
PASS: lldb-unit :: Utility/./UtilityTests/StreamTest.AddressRange (1525 of 2474)
PASS: lldb-unit :: Symbol/./SymbolTests/TestClangASTImporter.CopyDeclTagDecl (1526 of 2474)
PASS: lldb-shell :: ObjectFile/ELF/PT_LOAD-overlap-PT_INTERP.yaml (1527 of 2474)
PASS: lldb-api :: lang/objc/unicode-string/TestUnicodeString.py (1528 of 2474)
PASS: lldb-api :: tools/lldb-vscode/breakpoint/TestVSCode_setBreakpoints.py (1529 of 2474)
PASS: lldb-unit :: ScriptInterpreter/Python/./ScriptInterpreterPythonTests/PythonDataObjectsTest.TestGlobalNameResolutionWithDot (1530 of 2474)
PASS: lldb-unit :: UnwindAssembly/x86/./UnwindAssemblyx86Tests/Testx86AssemblyInspectionEngine.TestPushEDI (1531 of 2474)
PASS: lldb-api :: commands/target/basic/TestTargetCommand.py (1532 of 2474)
PASS: lldb-unit :: Language/CLanguages/./LanguageCLanguagesTests/CLanguages.LookupCLanguagesByLanguageType (1533 of 2474)
PASS: lldb-api :: functionalities/inferior-changed/TestInferiorChanged.py (1534 of 2474)
PASS: lldb-api :: commands/expression/import-std-module/stack/TestStackFromStdModule.py (1535 of 2474)
PASS: lldb-api :: macosx/safe-to-func-call/TestSafeFuncCalls.py (1536 of 2474)
PASS: lldb-shell :: SymbolFile/DWARF/x86/dir-separator-posix.s (1537 of 2474)
PASS: lldb-unit :: Expression/./ExpressionTests/DiagnosticManagerTest.FixedExpression (1538 of 2474)
PASS: lldb-shell :: Expr/TestMultilineExpr.test (1539 of 2474)
PASS: lldb-unit :: Utility/./UtilityTests/StreamTest.PutULEB128 (1540 of 2474)
PASS: lldb-unit :: Utility/./UtilityTests/ScalarTest.GetBytes (1541 of 2474)
PASS: lldb-unit :: Utility/./UtilityTests/SerializationRountripTest.SerializeDeserializeObjectPointer (1542 of 2474)
PASS: lldb-unit :: Utility/./UtilityTests/BinaryStreamTest.PutULEB128One (1543 of 2474)
XFAIL: lldb-shell :: Register/x86-mm-xmm-read.test (1544 of 2474)
PASS: lldb-api :: functionalities/data-formatter/ostypeformatting/TestFormattersOsType.py (1545 of 2474)
PASS: lldb-api :: functionalities/thread/state_after_expression/TestStateAfterExpression.py (1546 of 2474)
PASS: lldb-shell :: Register/Core/x86-32-freebsd-fp.test (1547 of 2474)
UNSUPPORTED: lldb-api :: functionalities/thread/thread_specific_break_plus_condition/TestThreadSpecificBpPlusCondition.py (1548 of 2474)
PASS: lldb-api :: functionalities/load_after_attach/TestLoadAfterAttach.py (1549 of 2474)
PASS: lldb-unit :: ScriptInterpreter/Python/./ScriptInterpreterPythonTests/PythonDataObjectsTest.TestPythonStringToStructuredString (1550 of 2474)
PASS: lldb-unit :: Target/./TargetTests/ExecutionContextTest.GetByteOrderTarget (1551 of 2474)
PASS: lldb-shell :: SymbolFile/DWARF/x86/debug_ranges_and_rnglists.test (1552 of 2474)
UNSUPPORTED: lldb-api :: commands/watchpoints/watch_tagged_addr/TestWatchTaggedAddress.py (1553 of 2474)
PASS: lldb-api :: commands/target/auto-install-main-executable/TestAutoInstallMainExecutable.py (1554 of 2474)
PASS: lldb-unit :: Utility/./UtilityTests/DataExtractorTest.GetMaxU64 (1555 of 2474)
PASS: lldb-unit :: Utility/./UtilityTests/DataExtractorTest.GetMaxU64_unchecked (1556 of 2474)
PASS: lldb-unit :: Utility/./UtilityTests/StringExtractorTest.DecodeHexU8_Underflow (1557 of 2474)
PASS: lldb-unit :: Utility/./UtilityTests/StringExtractorTest.GetHexBytesAvail (1558 of 2474)
PASS: lldb-unit :: Process/Utility/./ProcessUtilityTests/RegisterContext_x86Test.FullToAbridgedTagWord (1559 of 2474)
UNSUPPORTED: lldb-shell :: SymbolFile/DWARF/x86/dwarf5-line-strp.s (1560 of 2474)
PASS: lldb-unit :: Process/minidump/./LLDBMinidumpTests/MinidumpParserTest.GetMiscInfo_no_stream (1561 of 2474)
PASS: lldb-api :: lang/objc/objc-static-method/TestObjCStaticMethod.py (1562 of 2474)
PASS: lldb-unit :: Utility/./UtilityTests/ScalarTest.LongLongAssigmentOperator (1563 of 2474)
PASS: lldb-unit :: Utility/./UtilityTests/UriParserTest.SchemeHostSeparator4 (1564 of 2474)
PASS: lldb-unit :: Utility/./UtilityTests/ArgsTest.TestUnknownEscape (1565 of 2474)
PASS: lldb-unit :: UnwindAssembly/x86/./UnwindAssemblyx86Tests/Testx86AssemblyInspectionEngine.TestSubESP (1566 of 2474)
PASS: lldb-unit :: Symbol/./SymbolTests/TestTypeSystemClang.TestGetEnumIntegerTypeBasicTypes (1567 of 2474)
PASS: lldb-unit :: Utility/./UtilityTests/RegularExpression.Valid (1568 of 2474)
PASS: lldb-api :: macosx/lc-note/kern-ver-str/TestKernVerStrLCNOTE.py (1569 of 2474)
PASS: lldb-unit :: Utility/./UtilityTests/DataExtractorTest.GetCStrUnterminated (1570 of 2474)
PASS: lldb-unit :: Utility/./UtilityTests/BinaryStreamTest.PutSLEB128EightBytes (1571 of 2474)
PASS: lldb-api :: commands/source/info/TestSourceInfo.py (1572 of 2474)
PASS: lldb-unit :: UnwindAssembly/x86/./UnwindAssemblyx86Tests/Testx86AssemblyInspectionEngine.TestPopEBX (1573 of 2474)
PASS: lldb-api :: commands/expression/context-object-objc/TestContextObjectObjc.py (1574 of 2474)
PASS: lldb-api :: lang/c/complex/TestComplexC99.py (1575 of 2474)
PASS: lldb-api :: lang/objc/modules-inline-functions/TestModulesInlineFunctions.py (1576 of 2474)
PASS: lldb-shell :: Register/Core/x86-64-linux-fp.test (1577 of 2474)
PASS: lldb-api :: functionalities/target_var/no_vars/TestTargetVarNoVars.py (1578 of 2474)
PASS: lldb-unit :: Utility/./UtilityTests/StatusTest.ErrorConstructor (1579 of 2474)
UNSUPPORTED: lldb-api :: functionalities/data-formatter/data-formatter-stl/libstdcpp/vector/TestDataFormatterStdVector.py (1580 of 2474)
PASS: lldb-shell :: ObjectFile/PECOFF/dep-modules.yaml (1581 of 2474)
PASS: lldb-unit :: Utility/./UtilityTests/StringListTest.JoinNonSpace (1582 of 2474)
UNSUPPORTED: lldb-api :: commands/trace/TestTraceExport.py (1583 of 2474)
PASS: lldb-unit :: tools/lldb-server/tests/./LLDBServerTests/StandardStartupTest.TestStopReplyContainsThreadPcs (1584 of 2474)
PASS: lldb-unit :: Process/./ProcessEventDataTests/ProcessEventDataTest.ShouldStop (1585 of 2474)
PASS: lldb-shell :: ObjectFile/PDB/object.test (1586 of 2474)
PASS: lldb-unit :: Host/./HostTests/ConnectionFileDescriptorTest.TCPGetURIv4 (1587 of 2474)
UNSUPPORTED: lldb-shell :: SymbolFile/PDB/calling-conventions.test (1588 of 2474)
PASS: lldb-api :: commands/command/script/import/rdar-12586188/TestRdar12586188.py (1589 of 2474)
PASS: lldb-shell :: Commands/CommandScriptImmediateOutput/CommandScriptImmediateOutputFile.test (1590 of 2474)
UNSUPPORTED: lldb-shell :: ScriptInterpreter/Lua/nested_sessions.test (1591 of 2474)
PASS: lldb-shell :: SymbolFile/DWARF/x86/inline-function-address.ll (1592 of 2474)
PASS: lldb-api :: functionalities/data-formatter/nsarraysynth/TestNSArraySynthetic.py (1593 of 2474)
PASS: lldb-unit :: Utility/./UtilityTests/XcodeSDKTest.GetCanonicalNameAndConstruct (1594 of 2474)
PASS: lldb-unit :: Host/./HostTests/TerminalTest.PtyIsATerminal (1595 of 2474)
PASS: lldb-unit :: Target/./TargetTests/RemoteAwarePlatformTest.TestResolveExecutabelOnClientByPlatform (1596 of 2474)
PASS: lldb-shell :: Quit/TestQuitExitCodeHex0.test (1597 of 2474)
PASS: lldb-api :: functionalities/tail_call_frames/inlining_and_tail_calls/TestInliningAndTailCalls.py (1598 of 2474)
PASS: lldb-unit :: ScriptInterpreter/Python/./ScriptInterpreterPythonTests/PythonDataObjectsTest.TestExceptions (1599 of 2474)
PASS: lldb-unit :: Utility/./UtilityTests/StringListTest.LongestCommonPrefixNoPrefix (1600 of 2474)
PASS: lldb-unit :: Process/gdb-remote/./ProcessGdbRemoteTests/PortMapTest.FreePortForProcess (1601 of 2474)
PASS: lldb-unit :: Process/gdb-remote/./ProcessGdbRemoteTests/GDBRemoteClientBaseTest.SendContinueAndAsyncSignal (1602 of 2474)
PASS: lldb-shell :: Settings/TestDisassemblyFormat.test (1603 of 2474)
PASS: lldb-unit :: Expression/./ExpressionTests/ClangHostTest.MacOSX (1604 of 2474)
PASS: lldb-api :: lang/cpp/break-on-initializers/TestBreakOnCPP11Initializers.py (1605 of 2474)
UNSUPPORTED: lldb-shell :: Unwind/unwind-plan-dwarf-dump.test (1606 of 2474)
PASS: lldb-api :: commands/expression/radar_9673664/TestExprHelpExamples.py (1607 of 2474)
UNSUPPORTED: lldb-shell :: SymbolFile/NativePDB/local-variables.cpp (1608 of 2474)
PASS: lldb-api :: lang/objc/conflicting-definition/TestConflictingDefinition.py (1609 of 2474)
PASS: lldb-shell :: SymbolFile/DWARF/x86/find-basic-type.cpp (1610 of 2474)
PASS: lldb-api :: sanity/TestModuleCacheSanity.py (1611 of 2474)
PASS: lldb-api :: functionalities/tail_call_frames/ambiguous_tail_call_seq2/TestAmbiguousTailCallSeq2.py (1612 of 2474)
PASS: lldb-unit :: Utility/./UtilityTests/AnsiTerminal.Twice (1613 of 2474)
PASS: lldb-api :: commands/expression/save_jit_objects/TestSaveJITObjects.py (1614 of 2474)
PASS: lldb-unit :: Host/./HostTests/FileSystemTest.MakeAbsolute (1615 of 2474)
PASS: lldb-shell :: SymbolFile/DWARF/x86/unused-inlined-params.test (1616 of 2474)
UNSUPPORTED: lldb-api :: macosx/posix_spawn/TestLaunchProcessPosixSpawn.py (1617 of 2474)
PASS: lldb-unit :: Utility/./UtilityTests/CompletionRequest.TestCompletionOwnership (1618 of 2474)
PASS: lldb-unit :: Utility/./UtilityTests/ScalarTest.ExtractBitfield (1619 of 2474)
PASS: lldb-api :: functionalities/data-formatter/pyobjsynthprovider/TestPyObjSynthProvider.py (1620 of 2474)
UNSUPPORTED: lldb-api :: functionalities/data-formatter/data-formatter-stl/libstdcpp/string/TestDataFormatterStdString.py (1621 of 2474)
PASS: lldb-api :: commands/expression/codegen-crash-typedefdecl-not-in_declcontext/TestCodegenCrashTypedefDeclNotInDeclContext.py (1622 of 2474)
UNSUPPORTED: lldb-shell :: Subprocess/fork-follow-child-wp.test (1623 of 2474)
PASS: lldb-api :: functionalities/data-formatter/data-formatter-stl/libcxx/queue/TestDataFormatterLibcxxQueue.py (1624 of 2474)
PASS: lldb-unit :: Utility/./UtilityTests/RecordReplayTest.ValidSequence (1625 of 2474)
PASS: lldb-api :: python_api/value/TestValueAPI.py (1626 of 2474)
PASS: lldb-unit :: Platform/./LLDBPlatformTests/PlatformDarwinTest.GetCompatibleArchARMv6m (1627 of 2474)
PASS: lldb-api :: lang/c/enum_types/TestEnumTypes.py (1628 of 2474)
PASS: lldb-unit :: Process/minidump/./LLDBMinidumpTests/MinidumpParserTest.GetMemoryRegionInfoLinuxMaps (1629 of 2474)
PASS: lldb-api :: lang/c/stepping/TestThreadStepInAvoidRegexp.py (1630 of 2474)
PASS: lldb-unit :: Utility/./UtilityTests/RangeTest.Copy (1631 of 2474)
PASS: lldb-unit :: Host/./HostTests/TerminalTest.SetCanonical (1632 of 2474)
PASS: lldb-api :: python_api/findvalue_duplist/TestSBFrameFindValue.py (1633 of 2474)
PASS: lldb-api :: commands/command/delete/TestCommandDelete.py (1634 of 2474)
PASS: lldb-shell :: SymbolFile/NativePDB/locate-pdb.cpp (1635 of 2474)
PASS: lldb-unit :: Language/Highlighting/./HighlighterTests/HighlighterTest.ClangUnterminatedString (1636 of 2474)
PASS: lldb-api :: functionalities/thread/concurrent_events/TestConcurrentManyBreakpoints.py (1637 of 2474)
PASS: lldb-unit :: Utility/./UtilityTests/StringListTest.ShiftStdString (1638 of 2474)
PASS: lldb-unit :: ObjectFile/Breakpad/./ObjectFileBreakpadTests/InlineRecord.parse (1639 of 2474)
PASS: lldb-api :: tools/lldb-server/TestGdbRemote_qThreadStopInfo.py (1640 of 2474)
PASS: lldb-unit :: Utility/./UtilityTests/AnsiTerminal.Unknown (1641 of 2474)
PASS: lldb-unit :: Utility/./UtilityTests/RangeTest.DoesIntersect (1642 of 2474)
PASS: lldb-api :: lang/objcxx/cpp_keywords_enabled/TestObjCppKeywordsEnabled.py (1643 of 2474)
PASS: lldb-shell :: SymbolFile/NativePDB/lookup-by-address.cpp (1644 of 2474)
PASS: lldb-unit :: ObjectFile/MachO/./ObjectFileMachOTests/ObjectFileMachOTest.ModuleFromSharedCacheInfo (1645 of 2474)
PASS: lldb-api :: functionalities/find-line-entry/TestFindLineEntry.py (1646 of 2474)
PASS: lldb-shell :: Driver/TestSingleQuote.test (1647 of 2474)
PASS: lldb-api :: functionalities/data-formatter/data-formatter-stl/libcxx/string/TestDataFormatterLibcxxString.py (1648 of 2474)
PASS: lldb-api :: lang/objc/radar-9691614/TestObjCMethodReturningBOOL.py (1649 of 2474)
UNSUPPORTED: lldb-api :: commands/trace/TestTraceTimestampCounters.py (1650 of 2474)
PASS: lldb-api :: commands/expression/rdar42038760/TestScalarURem.py (1651 of 2474)
PASS: lldb-shell :: SymbolFile/DWARF/x86/DW_AT_low_pc-addrx.s (1652 of 2474)
PASS: lldb-unit :: SymbolFile/DWARF/./SymbolFileDWARFTests/SymbolFileDWARFTests.TestAbilitiesForDWARF (1653 of 2474)
UNSUPPORTED: lldb-api :: commands/platform/connect/TestPlatformConnect.py (1654 of 2474)
PASS: lldb-shell :: Driver/TestCore.test (1655 of 2474)
PASS: lldb-shell :: Breakpoint/single-file-split-dwarf.test (1656 of 2474)
PASS: lldb-unit :: UnwindAssembly/x86/./UnwindAssemblyx86Tests/Testx86AssemblyInspectionEngine.TestPopR13 (1657 of 2474)
PASS: lldb-api :: tools/lldb-server/TestGdbRemoteExpeditedRegisters.py (1658 of 2474)
PASS: lldb-unit :: Utility/./UtilityTests/ArchSpecTest.Compatibility (1659 of 2474)
PASS: lldb-api :: tools/lldb-vscode/evaluate/TestVSCode_evaluate.py (1660 of 2474)
PASS: lldb-unit :: Process/minidump/./LLDBMinidumpTests/MinidumpParserTest.InvalidMinidump (1661 of 2474)
UNSUPPORTED: lldb-shell :: ObjectFile/PECOFF/disassemble-thumb.yaml (1662 of 2474)
PASS: lldb-shell :: ObjectFile/ELF/aarch64-relocations.yaml (1663 of 2474)
PASS: lldb-unit :: Host/./HostTests/SocketTests/SocketTest.UDPConnect/ipv4 (1664 of 2474)
PASS: lldb-unit :: Utility/./UtilityTests/StringListTest.SplitIntoLines (1665 of 2474)
UNSUPPORTED: lldb-api :: functionalities/ptr_refs/TestPtrRefs.py (1666 of 2474)
PASS: lldb-unit :: Utility/./UtilityTests/StreamTeeTest.CopyConstructor (1667 of 2474)
PASS: lldb-api :: functionalities/thread/step_until/TestStepUntil.py (1668 of 2474)
PASS: lldb-unit :: Core/./LLDBCoreTests/SourceFileCache.FindSourceFileNotFound (1669 of 2474)
PASS: lldb-unit :: Utility/./UtilityTests/StringExtractorTest.GetHexU8_Underflow2_NoEof (1670 of 2474)
PASS: lldb-api :: functionalities/breakpoint/address_breakpoints/TestAddressBreakpoints.py (1671 of 2474)
PASS: lldb-shell :: SymbolFile/NativePDB/globals-fundamental.cpp (1672 of 2474)
PASS: lldb-shell :: Process/TestEnvironment.test (1673 of 2474)
PASS: lldb-api :: functionalities/data-formatter/data-formatter-stl/libcxx/function/TestLibCxxFunction.py (1674 of 2474)
PASS: lldb-shell :: ObjectFile/ELF/netbsd-core-amd64.test (1675 of 2474)
PASS: lldb-api :: functionalities/signal/raise/TestRaise.py (1676 of 2474)
PASS: lldb-api :: test_utils/TestPExpectTest.py (1677 of 2474)
PASS: lldb-api :: functionalities/step_scripted/TestStepScripted.py (1678 of 2474)
UNSUPPORTED: lldb-api :: tools/lldb-server/TestPtyServer.py (1679 of 2474)
PASS: lldb-api :: tools/lldb-server/inferior-crash/TestGdbRemoteSegFault.py (1680 of 2474)
PASS: lldb-unit :: Process/minidump/./LLDBMinidumpTests/MinidumpParserTest.GetLinuxProcStatus_no_stream (1681 of 2474)
PASS: lldb-api :: macosx/universal/TestUniversal.py (1682 of 2474)
PASS: lldb-shell :: Unwind/eh-frame-dwarf-unwind.test (1683 of 2474)
PASS: lldb-api :: commands/expression/import-std-module/shared_ptr-dbg-info-content/TestSharedPtrDbgInfoContentFromStdModule.py (1684 of 2474)
PASS: lldb-shell :: ScriptInterpreter/Python/python.test (1685 of 2474)
PASS: lldb-api :: python_api/class_members/TestSBTypeClassMembers.py (1686 of 2474)
PASS: lldb-unit :: Host/./HostTests/SocketTests/SocketTest.DecodeHostAndPort/ipv6 (1687 of 2474)
PASS: lldb-unit :: Language/CPlusPlus/./LanguageCPlusPlusTests/CPlusPlusLanguage.MethodNameParsing (1688 of 2474)
PASS: lldb-api :: commands/expression/vector_of_enums/TestVectorOfEnums.py (1689 of 2474)
PASS: lldb-shell :: Driver/TestConvenienceVariables.test (1690 of 2474)
UNSUPPORTED: lldb-api :: functionalities/gdb_remote_client/TestWasm.py (1691 of 2474)
UNSUPPORTED: lldb-shell :: Register/aarch64-fp-read.test (1692 of 2474)
UNSUPPORTED: lldb-shell :: SymbolFile/PDB/typedefs.test (1693 of 2474)
PASS: lldb-shell :: Commands/command-breakpoint-col.test (1694 of 2474)
PASS: lldb-unit :: Target/./TargetTests/ExecutionContextTest.GetByteOrder (1695 of 2474)
PASS: lldb-unit :: Utility/./UtilityTests/DataExtractorTest.GetCStr (1696 of 2474)
PASS: lldb-unit :: Utility/./UtilityTests/BinaryStreamTest.PutSLEB128SixBytes (1697 of 2474)
PASS: lldb-unit :: Utility/./UtilityTests/StateTest.Formatv (1698 of 2474)
PASS: lldb-unit :: Utility/./UtilityTests/StringExtractorTest.GetHexBytes_Underflow (1699 of 2474)
PASS: lldb-unit :: Utility/./UtilityTests/AnsiTerminal.AtStart (1700 of 2474)
PASS: lldb-api :: lang/objc/objc-foundation-dictionary-empty/TestNSDictionary0.py (1701 of 2474)
PASS: lldb-shell :: SymbolFile/DWARF/x86/dwarf5-index-is-used.cpp (1702 of 2474)
PASS: lldb-unit :: SymbolFile/NativePDB/./SymbolFileNativePDBTests/PDBFPOProgramToDWARFExpressionTests.MultipleDependentAssignments (1703 of 2474)
PASS: lldb-unit :: Process/Utility/./ProcessUtilityTests/MemoryTagManagerAArch64MTETest.UnpackTagsData (1704 of 2474)
PASS: lldb-api :: lang/objc/foundation/TestObjCMethodsNSArray.py (1705 of 2474)
PASS: lldb-shell :: ObjectFile/ELF/eh_frame-symbols.yaml (1706 of 2474)
PASS: lldb-unit :: UnwindAssembly/x86/./UnwindAssemblyx86Tests/Testx86AssemblyInspectionEngine.TestPopEDI (1707 of 2474)
PASS: lldb-api :: lang/objc/objc-baseclass-sbtype/TestObjCBaseClassSBType.py (1708 of 2474)
PASS: lldb-api :: commands/expression/import-std-module/weak_ptr/TestWeakPtrFromStdModule.py (1709 of 2474)
PASS: lldb-api :: functionalities/data-formatter/data-formatter-cpp/TestDataFormatterCpp.py (1710 of 2474)
PASS: lldb-shell :: ObjectFile/PECOFF/basic-info-arm.yaml (1711 of 2474)
PASS: lldb-unit :: Utility/./UtilityTests/RangeTest.ContainsRangeStartingFromZero (1712 of 2474)
PASS: lldb-api :: functionalities/thread/concurrent_events/TestConcurrentSignalDelayBreak.py (1713 of 2474)
PASS: lldb-api :: commands/expression/cast_int_to_anonymous_enum/TestCastIntToAnonymousEnum.py (1714 of 2474)
PASS: lldb-api :: functionalities/testid/TestTestId.py (1715 of 2474)
PASS: lldb-unit :: Host/./HostTests/NativeProcessProtocolTest.SetBreakpointFailWrite (1716 of 2474)
PASS: lldb-unit :: Utility/./UtilityTests/UUIDTest.StringConverion (1717 of 2474)
PASS: lldb-api :: functionalities/breakpoint/move_nearest/TestMoveNearest.py (1718 of 2474)
PASS: lldb-api :: functionalities/breakpoint/source_regexp/TestSourceRegexBreakpoints.py (1719 of 2474)
PASS: lldb-unit :: Host/./HostTests/SocketTests/SocketTest.DomainGetConnectURI/ipv4 (1720 of 2474)
PASS: lldb-api :: functionalities/thread/concurrent_events/TestConcurrentManyWatchpoints.py (1721 of 2474)
PASS: lldb-shell :: SymbolFile/DWARF/deterministic-build.cpp (1722 of 2474)
PASS: lldb-api :: lang/c/vla/TestVLA.py (1723 of 2474)
PASS: lldb-unit :: Utility/./UtilityTests/DataExtractorTest.GetDouble (1724 of 2474)
PASS: lldb-api :: functionalities/data-formatter/language_category_updates/TestDataFormatterLanguageCategoryUpdates.py (1725 of 2474)
PASS: lldb-unit :: Language/Highlighting/./HighlighterTests/HighlighterTest.ClangCursorPosEndOfLine (1726 of 2474)
PASS: lldb-unit :: Utility/./UtilityTests/LogChannelEnabledTest.LogVerboseThread (1727 of 2474)
PASS: lldb-unit :: UnwindAssembly/x86/./UnwindAssemblyx86Tests/Testx86AssemblyInspectionEngine.TestPushEDX (1728 of 2474)
PASS: lldb-unit :: Process/Utility/./ProcessUtilityTests/ProcSMapTests/LinuxProcSMapsTestFixture.ParseSMapRegions/1 (1729 of 2474)
PASS: lldb-unit :: Language/Highlighting/./HighlighterTests/HighlighterTest.ClangPPDirectives (1730 of 2474)
PASS: lldb-api :: lang/cpp/bitfields/TestCppBitfields.py (1731 of 2474)
PASS: lldb-unit :: Process/gdb-remote/./ProcessGdbRemoteTests/GDBRemoteCommunicationClientTest.SendSignalsToIgnore (1732 of 2474)
PASS: lldb-unit :: Symbol/./SymbolTests/TestTypeSystemClang.TestRecordHasFields (1733 of 2474)
PASS: lldb-unit :: Process/minidump/./LLDBMinidumpTests/MinidumpParserTest.GetThreadContext_x86_64 (1734 of 2474)
PASS: lldb-unit :: Utility/./UtilityTests/LogChannelTest.Disable (1735 of 2474)
PASS: lldb-unit :: Symbol/./SymbolTests/TestTypeSystemClang.TestBuiltinTypeForEncodingAndBitSize (1736 of 2474)
PASS: lldb-api :: functionalities/breakpoint/step_over_breakpoint/TestStepOverBreakpoint.py (1737 of 2474)
PASS: lldb-unit :: Utility/./UtilityTests/BinaryStreamTest.PutULEB128NineBytes (1738 of 2474)
PASS: lldb-unit :: Process/Utility/./ProcessUtilityTests/MemoryTagManagerAArch64MTETest.RemoveNonAddressBits (1739 of 2474)
PASS: lldb-unit :: Interpreter/./InterpreterTests/OptionArgParserTest.toChar (1740 of 2474)
PASS: lldb-unit :: Process/minidump/./LLDBMinidumpTests/MinidumpParserTest.GetPidWow64 (1741 of 2474)
PASS: lldb-unit :: Utility/./UtilityTests/AnsiTerminal.Basic (1742 of 2474)
PASS: lldb-api :: functionalities/data-formatter/data-formatter-script/TestDataFormatterScript.py (1743 of 2474)
PASS: lldb-api :: commands/target/stop-hooks/TestStopHookScripted.py (1744 of 2474)
PASS: lldb-shell :: ObjectFile/wasm/embedded-debug-sections.yaml (1745 of 2474)
PASS: lldb-api :: tools/lldb-server/inferior-crash/TestGdbRemoteAbort.py (1746 of 2474)
PASS: lldb-shell :: Commands/command-script-import.test (1747 of 2474)
PASS: lldb-api :: tools/lldb-server/TestGdbRemote_vCont.py (1748 of 2474)
PASS: lldb-unit :: Process/minidump/./LLDBMinidumpTests/MinidumpParserTest.GetPid (1749 of 2474)
PASS: lldb-unit :: SymbolFile/NativePDB/./SymbolFileNativePDBTests/PDBFPOProgramToDWARFExpressionTests.UnresolvedDependentCyclicRegisterAssignmentReference (1750 of 2474)
PASS: lldb-unit :: Utility/./UtilityTests/RangeTest.Clear (1751 of 2474)
PASS: lldb-api :: commands/expression/completion/TestExprCompletion.py (1752 of 2474)
PASS: lldb-api :: python_api/sblaunchinfo/TestSBLaunchInfo.py (1753 of 2474)
PASS: lldb-api :: functionalities/return-value/TestReturnValue.py (1754 of 2474)
PASS: lldb-shell :: ObjectFile/ELF/PT_LOAD-overlap.yaml (1755 of 2474)
PASS: lldb-api :: lang/cpp/this_class_type_mixing/TestThisClassTypeMixing.py (1756 of 2474)
UNSUPPORTED: lldb-api :: macosx/macCatalystAppMacOSFramework/TestMacCatalystAppWithMacOSFramework.py (1757 of 2474)
PASS: lldb-unit :: Host/./HostTests/HostInfoTest.GetXcodeSDK (1758 of 2474)
PASS: lldb-shell :: SymbolFile/DWARF/x86/dwarf5-atomic.s (1759 of 2474)
PASS: lldb-api :: lang/cpp/std-function-step-into-callable/TestStdFunctionStepIntoCallable.py (1760 of 2474)
PASS: lldb-shell :: SymbolFile/NativePDB/global-classes.cpp (1761 of 2474)
PASS: lldb-api :: functionalities/gdb_remote_client/TestIOSSimulator.py (1762 of 2474)
PASS: lldb-api :: lang/cpp/scope/TestCppScope.py (1763 of 2474)
PASS: lldb-shell :: Driver/TestCommands.test (1764 of 2474)
PASS: lldb-api :: lang/c/step_over_no_deadlock/TestStepOverDoesntBlock.py (1765 of 2474)
PASS: lldb-unit :: Core/./LLDBCoreTests/DumpDataExtractorTest.StartOffset (1766 of 2474)
PASS: lldb-api :: lang/objc/cpp_keyword_identifiers/TestCppKeywordsAsObjCIdentifiers.py (1767 of 2474)
PASS: lldb-unit :: SymbolFile/DWARF/./SymbolFileDWARFTests/SymbolFileDWARFTests.ParseArangesNonzeroSegmentSize (1768 of 2474)
PASS: lldb-shell :: SymbolFile/DWARF/x86/module-ownership.mm (1769 of 2474)
PASS: lldb-api :: lang/cpp/const_this/TestConstThis.py (1770 of 2474)
PASS: lldb-unit :: Utility/./UtilityTests/PassiveReplayTest.InstrumentedBarRef (1771 of 2474)
UNSUPPORTED: lldb-shell :: Register/x86-zmm-write.test (1772 of 2474)
PASS: lldb-unit :: ScriptInterpreter/Python/./ScriptInterpreterPythonTests/PythonDataObjectsTest.TestPythonIntegerToStr (1773 of 2474)
PASS: lldb-shell :: SymbolFile/DWARF/x86/dir-separator-no-comp-dir.s (1774 of 2474)
PASS: lldb-unit :: Utility/./UtilityTests/BinaryStreamTest.PutSLEB128ThreeBytes (1775 of 2474)
UNSUPPORTED: lldb-api :: benchmarks/libcxxmap/TestBenchmarkLibcxxMap.py (1776 of 2474)
PASS: lldb-api :: functionalities/process_group/TestChangeProcessGroup.py (1777 of 2474)
PASS: lldb-api :: commands/session/history/TestSessionHistory.py (1778 of 2474)
PASS: lldb-api :: functionalities/data-formatter/data-formatter-stl/libcxx/vector/TestDataFormatterLibcxxVector.py (1779 of 2474)
PASS: lldb-api :: driver/batch_mode/TestBatchMode.py (1780 of 2474)
PASS: lldb-shell :: SymbolFile/DWARF/x86/debug-line-basic.s (1781 of 2474)
PASS: lldb-api :: functionalities/postmortem/mach-core/TestMachCore.py (1782 of 2474)
PASS: lldb-api :: functionalities/data-formatter/data-formatter-enum-format/TestDataFormatterEnumFormat.py (1783 of 2474)
PASS: lldb-api :: functionalities/breakpoint/breakpoint_conditions/TestBreakpointConditions.py (1784 of 2474)
PASS: lldb-unit :: Symbol/./SymbolTests/TestTypeSystemClang.TestGetTypeClassDeclType (1785 of 2474)
PASS: lldb-api :: functionalities/data-formatter/data-formatter-stl/libcxx/tuple/TestDataFormatterLibcxxTuple.py (1786 of 2474)
PASS: lldb-unit :: Process/gdb-remote/./ProcessGdbRemoteTests/GDBRemoteCommunicationClientTest.GetModulesInfo_UUID20 (1787 of 2474)
PASS: lldb-api :: lang/cpp/llvm-style/TestLLVMStyle.py (1788 of 2474)
PASS: lldb-unit :: UnwindAssembly/x86/./UnwindAssemblyx86Tests/Testx86AssemblyInspectionEngine.TestPushESI (1789 of 2474)
PASS: lldb-unit :: Utility/./UtilityTests/RangeTest.LessThanInvalid (1790 of 2474)
PASS: lldb-unit :: Process/gdb-remote/./ProcessGdbRemoteTests/GDBRemoteCommunicationClientTest.GetMemoryRegionInfo (1791 of 2474)
PASS: lldb-unit :: Symbol/./SymbolTests/Type.GetTypeScopeAndBasename (1792 of 2474)
PASS: lldb-api :: functionalities/gdb_remote_client/TestArmRegisterDefinition.py (1793 of 2474)
PASS: lldb-api :: functionalities/data-formatter/compactvectors/TestCompactVectors.py (1794 of 2474)
PASS: lldb-shell :: Commands/command-image-lookup.yaml (1795 of 2474)
PASS: lldb-api :: functionalities/data-formatter/data-formatter-categories/TestDataFormatterCategories.py (1796 of 2474)
PASS: lldb-unit :: Utility/./UtilityTests/OptionsWithRawTest.MultiWordSuffix (1797 of 2474)
PASS: lldb-unit :: API/./APITests/SBCommandInterpreterTest.MultiWordCommand (1798 of 2474)
PASS: lldb-api :: lang/objc/objc-new-syntax/TestObjCNewSyntaxDictionary.py (1799 of 2474)
PASS: lldb-unit :: Core/./LLDBCoreTests/MangledTest.ResultForValidName (1800 of 2474)
PASS: lldb-unit :: Utility/./UtilityTests/RangeTest.SizeTypes (1801 of 2474)
PASS: lldb-shell :: Process/UnsupportedLanguage.test (1802 of 2474)
PASS: lldb-shell :: SymbolFile/symbol-binding.test (1803 of 2474)
PASS: lldb-unit :: Utility/./UtilityTests/AnsiTerminal.WhiteSpace (1804 of 2474)
PASS: lldb-unit :: Language/Highlighting/./HighlighterTests/HighlighterTest.ClangTrailingBackslashBeforeNewline (1805 of 2474)
PASS: lldb-unit :: Symbol/./SymbolTests/TestTypeSystemClang.TestRemoveFastQualifiers (1806 of 2474)
PASS: lldb-api :: functionalities/gdb_remote_client/TestNoGPacketSupported.py (1807 of 2474)
UNSUPPORTED: lldb-api :: commands/trace/TestTraceDumpInfo.py (1808 of 2474)
PASS: lldb-api :: functionalities/data-formatter/data-formatter-objc/TestDataFormatterObjCKVO.py (1809 of 2474)
PASS: lldb-unit :: SymbolFile/NativePDB/./SymbolFileNativePDBTests/PDBFPOProgramToDWARFExpressionTests.UnresolvedCyclicRegisterAssignmentReference (1810 of 2474)
PASS: lldb-api :: functionalities/tail_call_frames/disambiguate_tail_call_seq/TestDisambiguateTailCallSeq.py (1811 of 2474)
PASS: lldb-unit :: Symbol/./SymbolTests/PostfixExpression.ParseOneExpression (1812 of 2474)
PASS: lldb-api :: commands/expression/import-std-module/vector-bool/TestVectorBoolFromStdModule.py (1813 of 2474)
PASS: lldb-unit :: Process/Utility/./ProcessUtilityTests/ProcSMapTests/LinuxProcSMapsTestFixture.ParseSMapRegions/5 (1814 of 2474)
PASS: lldb-shell :: SymbolFile/DWARF/x86/dwp.s (1815 of 2474)
PASS: lldb-shell :: SymbolFile/Breakpad/line-table-discontinuous-file-ids.test (1816 of 2474)
PASS: lldb-unit :: Utility/./UtilityTests/ArchSpecTest.MergeFrom (1817 of 2474)
PASS: lldb-unit :: Expression/./ExpressionTests/DWARFExpression.DW_OP_unknown (1818 of 2474)
UNSUPPORTED: lldb-api :: commands/expression/completion-crash-invalid-iterator/TestInvalidIteratorCompletionCrash.py (1819 of 2474)
PASS: lldb-shell :: ObjectFile/PECOFF/uuid.yaml (1820 of 2474)
PASS: lldb-api :: functionalities/abbreviation/TestCommonShortSpellings.py (1821 of 2474)
PASS: lldb-unit :: Process/minidump/./LLDBMinidumpTests/MinidumpParserTest.GetThreadContext_x86_32_wow64 (1822 of 2474)
PASS: lldb-api :: functionalities/thread/concurrent_events/TestConcurrentSignalBreak.py (1823 of 2474)
PASS: lldb-shell :: ObjectFile/ELF/PT_TLS-overlap-PT_LOAD.yaml (1824 of 2474)
PASS: lldb-api :: functionalities/data-formatter/user-format-vs-summary/TestUserFormatVsSummary.py (1825 of 2474)
PASS: lldb-unit :: UnwindAssembly/x86/./UnwindAssemblyx86Tests/Testx86AssemblyInspectionEngine.TestPush0 (1826 of 2474)
PASS: lldb-unit :: Utility/./UtilityTests/UriParserTest.SchemeHostSeparator2 (1827 of 2474)
PASS: lldb-unit :: Utility/./UtilityTests/ConstStringTest.MangledCounterpart (1828 of 2474)
PASS: lldb-unit :: SymbolFile/DWARF/./SymbolFileDWARFTests/DWARFUnitTest.LLVMGCCProducer (1829 of 2474)
PASS: lldb-unit :: Utility/./UtilityTests/StringListTest.AppendStringStdString (1830 of 2474)
PASS: lldb-unit :: ObjectFile/Breakpad/./ObjectFileBreakpadTests/ModuleRecord.parse (1831 of 2474)
PASS: lldb-unit :: Utility/./UtilityTests/StreamTest.PutBytesAsRawHex8ToBigEndian (1832 of 2474)
PASS: lldb-api :: commands/expression/call-throws/TestCallThatThrows.py (1833 of 2474)
UNSUPPORTED: lldb-shell :: Subprocess/clone-follow-parent.test (1834 of 2474)
PASS: lldb-api :: commands/register/register/register_command/TestRegisters.py (1835 of 2474)
PASS: lldb-unit :: ObjectFile/PECOFF/./ObjectFilePECOFFTests/PECallFrameInfoTest.Chained_eh (1836 of 2474)
PASS: lldb-unit :: Host/./HostTests/NativeProcessProtocolTest.SetBreakpoint (1837 of 2474)
PASS: lldb-unit :: SymbolFile/NativePDB/./SymbolFileNativePDBTests/PDBFPOProgramToDWARFExpressionTests.InvalidAssignmentSingle (1838 of 2474)
PASS: lldb-api :: api/multiple-debuggers/TestMultipleDebuggers.py (1839 of 2474)
PASS: lldb-api :: commands/expression/call-function/TestCallUserDefinedFunction.py (1840 of 2474)
PASS: lldb-api :: lang/c/step-target/TestStepTarget.py (1841 of 2474)
PASS: lldb-shell :: Reproducer/TestRelativePath.test (1842 of 2474)
PASS: lldb-unit :: Utility/./UtilityTests/StringListTest.LongestCommonPrefixDuplicateElement (1843 of 2474)
PASS: lldb-unit :: Symbol/./SymbolTests/LineEntryTest.GetSameLineContiguousAddressRangeNoInlines (1844 of 2474)
PASS: lldb-api :: functionalities/breakpoint/hardware_breakpoints/require_hw_breakpoints/TestRequireHWBreakpoints.py (1845 of 2474)
PASS: lldb-unit :: Utility/./UtilityTests/ScalarTest.Comparison (1846 of 2474)
PASS: lldb-unit :: Utility/./UtilityTests/StreamTest.PutRawBytesToBigEndian (1847 of 2474)
UNSUPPORTED: lldb-shell :: ScriptInterpreter/Lua/breakpoint_function_callback.test (1848 of 2474)
UNSUPPORTED: lldb-shell :: Register/x86-zmm-read.test (1849 of 2474)
PASS: lldb-unit :: Utility/./UtilityTests/BinaryStreamTest.PutULEB128TwoBytes (1850 of 2474)
UNSUPPORTED: lldb-shell :: Register/x86-ymm-read.test (1851 of 2474)
PASS: lldb-api :: functionalities/data-formatter/data-formatter-named-summaries/TestDataFormatterNamedSummaries.py (1852 of 2474)
PASS: lldb-shell :: ObjectFile/ELF/short-build-id.yaml (1853 of 2474)
PASS: lldb-unit :: Utility/./UtilityTests/NameMatchesTest.Ignore (1854 of 2474)
PASS: lldb-unit :: UnwindAssembly/x86/./UnwindAssemblyx86Tests/Testx86AssemblyInspectionEngine.TestStackRealign8BitDisp_i386 (1855 of 2474)
PASS: lldb-shell :: SymbolFile/DWARF/x86/find-basic-variable.cpp (1856 of 2474)
PASS: lldb-unit :: Utility/./UtilityTests/StreamTest.SetIndentLevel (1857 of 2474)
PASS: lldb-unit :: Utility/./UtilityTests/FileSpecTest.AppendPathComponent (1858 of 2474)
PASS: lldb-api :: functionalities/data-formatter/data-formatter-synthtype/TestDataFormatterSynthType.py (1859 of 2474)
PASS: lldb-api :: functionalities/gdb_remote_client/TestThreadInfoTrailingComma.py (1860 of 2474)
PASS: lldb-unit :: UnwindAssembly/x86/./UnwindAssemblyx86Tests/Testx86AssemblyInspectionEngine.TestStackRealign32BitDisp_x86_64 (1861 of 2474)
PASS: lldb-api :: commands/platform/file/close/TestPlatformFileClose.py (1862 of 2474)
PASS: lldb-unit :: Process/gdb-remote/./ProcessGdbRemoteTests/GDBRemoteClientBaseTest.SendContinueDelegateInterface (1863 of 2474)
PASS: lldb-shell :: ObjectFile/ELF/section-addresses.yaml (1864 of 2474)
UNSUPPORTED: lldb-api :: functionalities/unwind/aarch64_unwind_pac/TestAArch64UnwindPAC.py (1865 of 2474)
PASS: lldb-unit :: Utility/./UtilityTests/CompletionRequest.FakeLastArg (1866 of 2474)
UNSUPPORTED: lldb-shell :: SymbolFile/PDB/variables.test (1867 of 2474)
PASS: lldb-unit :: UnwindAssembly/x86/./UnwindAssemblyx86Tests/Testx86AssemblyInspectionEngine.TestPushRBP (1868 of 2474)
PASS: lldb-api :: functionalities/data-formatter/data-formatter-objc/nsindexpath/TestDataFormatterNSIndexPath.py (1869 of 2474)
PASS: lldb-unit :: Utility/./UtilityTests/StringListTest.SplitIntoLinesEmpty (1870 of 2474)
PASS: lldb-api :: lang/objc/objc-ivar-stripped/TestObjCIvarStripped.py (1871 of 2474)
PASS: lldb-api :: python_api/process/TestProcessAPI.py (1872 of 2474)
PASS: lldb-api :: functionalities/load_lazy/TestLoadUsingLazyBind.py (1873 of 2474)
PASS: lldb-api :: functionalities/breakpoint/cpp/TestCPPBreakpointLocations.py (1874 of 2474)
PASS: lldb-unit :: Utility/./UtilityTests/StringListTest.CopyListSingle (1875 of 2474)
PASS: lldb-unit :: Core/./LLDBCoreTests/SourceLocationSpecTest.Equal (1876 of 2474)
PASS: lldb-api :: commands/frame/diagnose/dereference-this/TestDiagnoseDereferenceThis.py (1877 of 2474)
PASS: lldb-api :: functionalities/thread/jump/TestThreadJump.py (1878 of 2474)
PASS: lldb-shell :: Settings/TestFrameFormatColor.test (1879 of 2474)
PASS: lldb-unit :: Symbol/./SymbolTests/TestTypeSystemClang.TestConvertAccessTypeToAccessSpecifier (1880 of 2474)
PASS: lldb-unit :: Utility/./UtilityTests/VMRange.SetEndAddress (1881 of 2474)
PASS: lldb-shell :: ObjectFile/Breakpad/sections-trailing-func.test (1882 of 2474)
PASS: lldb-unit :: Utility/./UtilityTests/LogChannelTest.List (1883 of 2474)
PASS: lldb-unit :: Utility/./UtilityTests/SharedCluster.ClusterManager (1884 of 2474)
UNSUPPORTED: lldb-api :: commands/gui/viewlarge/TestGuiViewLarge.py (1885 of 2474)
PASS: lldb-shell :: ObjectFile/ELF/base-address.yaml (1886 of 2474)
PASS: lldb-shell :: SymbolFile/Breakpad/unwind-via-stack-cfi.test (1887 of 2474)
PASS: lldb-api :: functionalities/data-formatter/data-formatter-objc/TestDataFormatterObjCExpr.py (1888 of 2474)
PASS: lldb-api :: lang/c/stepping/TestThreadStepping.py (1889 of 2474)
PASS: lldb-unit :: Core/./LLDBCoreTests/MangledTest.ResultForBlockInvocation (1890 of 2474)
PASS: lldb-api :: functionalities/thread/exit_during_break/TestExitDuringBreak.py (1891 of 2474)
PASS: lldb-api :: tools/lldb-server/TestGdbRemoteAttachOrWait.py (1892 of 2474)
PASS: lldb-unit :: Utility/./UtilityTests/TildeExpressionResolver.ResolveFullPath (1893 of 2474)
PASS: lldb-unit :: UnwindAssembly/x86/./UnwindAssemblyx86Tests/Testx86AssemblyInspectionEngine.TestPushEBX (1894 of 2474)
UNSUPPORTED: lldb-api :: benchmarks/continue/TestBenchmarkContinue.py (1895 of 2474)
PASS: lldb-unit :: Utility/./UtilityTests/OptionsWithRawTest.EmptySuffix (1896 of 2474)
PASS: lldb-shell :: SymbolFile/DWARF/x86/DW_AT_loclists_base.s (1897 of 2474)
PASS: lldb-unit :: Utility/./UtilityTests/DataExtractorTest.UncommonAddressSize (1898 of 2474)
PASS: lldb-unit :: Platform/./LLDBPlatformTests/PlatformDarwinTest.GetCompatibleArchARMv7 (1899 of 2474)
PASS: lldb-api :: commands/frame/var/TestFrameVar.py (1900 of 2474)
PASS: lldb-unit :: Process/Utility/./ProcessUtilityTests/ProcSMapTests/LinuxProcSMapsTestFixture.ParseSMapRegions/8 (1901 of 2474)
PASS: lldb-api :: python_api/value/change_values/TestChangeValueAPI.py (1902 of 2474)
PASS: lldb-shell :: Settings/TestSettingsWrite.test (1903 of 2474)
PASS: lldb-api :: commands/log/basic/TestLogging.py (1904 of 2474)
PASS: lldb-unit :: Process/minidump/./LLDBMinidumpTests/RegisterContextMinidump.ConvertMinidumpContext_x86_32 (1905 of 2474)
PASS: lldb-unit :: Process/gdb-remote/./ProcessGdbRemoteTests/GDBRemoteCommunicationClientTest.GetModulesInfoInvalidResponse (1906 of 2474)
PASS: lldb-unit :: Utility/./UtilityTests/StreamTeeTest.SetStreamAtIndexOutOfBounds (1907 of 2474)
PASS: lldb-shell :: Reproducer/TestPythonImport.test (1908 of 2474)
PASS: lldb-unit :: SymbolFile/DWARF/./SymbolFileDWARFTests/SymbolFileDWARFTests.ParseAranges (1909 of 2474)
PASS: lldb-api :: python_api/sberror/TestSBError.py (1910 of 2474)
PASS: lldb-shell :: SymbolFile/DWARF/x86/debug-types-missing-signature.test (1911 of 2474)
PASS: lldb-shell :: Reproducer/TestDump.test (1912 of 2474)
PASS: lldb-unit :: Utility/./UtilityTests/StreamTeeTest.GetStreamAtIndexOutOfBounds (1913 of 2474)
PASS: lldb-unit :: Host/./HostTests/SocketTests/SocketTest.DomainListenConnectAccept/ipv4 (1914 of 2474)
UNSUPPORTED: lldb-shell :: ScriptInterpreter/Lua/watchpoint_callback.test (1915 of 2474)
PASS: lldb-unit :: Platform/./LLDBPlatformTests/PlatformDarwinTest.GetCompatibleArchARMv6 (1916 of 2474)
PASS: lldb-api :: lang/objcxx/cxx-bridged-po/TestObjCXXBridgedPO.py (1917 of 2474)
PASS: lldb-api :: python_api/formatters/TestFormattersSBAPI.py (1918 of 2474)
PASS: lldb-shell :: Register/x86-multithread-read.test (1919 of 2474)
PASS: lldb-api :: functionalities/data-formatter/cstring-utf8-summary/TestCstringUnicode.py (1920 of 2474)
PASS: lldb-api :: tools/lldb-vscode/runInTerminal/TestVSCode_runInTerminal.py (1921 of 2474)
PASS: lldb-unit :: Process/gdb-remote/./ProcessGdbRemoteTests/GDBRemoteCommunicationServerTest.SendErrorResponse_ErrorNumber (1922 of 2474)
UNSUPPORTED: lldb-shell :: SymbolFile/PDB/function-level-linking.test (1923 of 2474)
PASS: lldb-unit :: Utility/./UtilityTests/DataExtractorTest.GetCStrAtNullOffset (1924 of 2474)
PASS: lldb-unit :: Host/./HostTests/SocketTests/SocketTest.TCPListen0ConnectAccept/ipv6 (1925 of 2474)
PASS: lldb-api :: python_api/section/TestSectionAPI.py (1926 of 2474)
PASS: lldb-unit :: Utility/./UtilityTests/NameMatchesTest.StartsWith (1927 of 2474)
PASS: lldb-unit :: Expression/./ExpressionTests/DiagnosticManagerTest.GetStringPreserveOrder (1928 of 2474)
UNSUPPORTED: lldb-api :: commands/gui/breakpoints/TestGuiBreakpoints.py (1929 of 2474)
PASS: lldb-unit :: Language/Highlighting/./HighlighterTests/HighlighterTest.ClangComments (1930 of 2474)
UNSUPPORTED: lldb-api :: linux/aarch64/mte_tag_access/TestAArch64LinuxMTEMemoryTagAccess.py (1931 of 2474)
PASS: lldb-api :: functionalities/type_get_module/TestTypeGetModule.py (1932 of 2474)
PASS: lldb-api :: functionalities/var_path/TestVarPath.py (1933 of 2474)
PASS: lldb-unit :: Expression/./ExpressionTests/CppModuleConfigurationTest.Linux (1934 of 2474)
PASS: lldb-api :: lang/cpp/incomplete-types/TestCppIncompleteTypes.py (1935 of 2474)
PASS: lldb-api :: lang/cpp/typedef/TestCppTypedef.py (1936 of 2474)
PASS: lldb-api :: functionalities/data-formatter/vector-types/TestVectorTypesFormatting.py (1937 of 2474)
PASS: lldb-unit :: UnwindAssembly/x86/./UnwindAssemblyx86Tests/Testx86AssemblyInspectionEngine.TestDisassemblyMidFunctionEpilogues (1938 of 2474)
PASS: lldb-unit :: Core/./LLDBCoreTests/SourceLocationSpecTest.FileLineColumnComponents (1939 of 2474)
PASS: lldb-shell :: ScriptInterpreter/Python/Crashlog/json.test (1940 of 2474)
PASS: lldb-shell :: Register/Core/x86-64-linux-multithread.test (1941 of 2474)
PASS: lldb-shell :: ObjectFile/MachO/lc_build_version_notools.yaml (1942 of 2474)
PASS: lldb-api :: functionalities/data-formatter/typedef_array/TestTypedefArray.py (1943 of 2474)
PASS: lldb-unit :: Utility/./UtilityTests/RangeDataVector.FindEntryThatContains_Overlap (1944 of 2474)
PASS: lldb-api :: lang/cpp/namespace_definitions/TestNamespaceDefinitions.py (1945 of 2474)
PASS: lldb-unit :: debugserver/./debugserverTests/RNBSocket.AnyListen (1946 of 2474)
PASS: lldb-api :: tools/lldb-vscode/console/TestVSCode_redirection_to_console.py (1947 of 2474)
PASS: lldb-unit :: Target/./TargetTests/PathMappingListTest.AbsoluteTests (1948 of 2474)
PASS: lldb-shell :: ObjectFile/PECOFF/sections.yaml (1949 of 2474)
PASS: lldb-unit :: ObjectFile/ELF/./ObjectFileELFTests/ObjectFileELFTest.GetModuleSpecifications_EarlySectionHeaders (1950 of 2474)
PASS: lldb-unit :: Expression/./ExpressionTests/CppModuleConfigurationTest.AmbiguousCLib (1951 of 2474)
PASS: lldb-shell :: SymbolFile/DWARF/x86/debug_rnglists.s (1952 of 2474)
PASS: lldb-unit :: Utility/./UtilityTests/StringLexerTest.AdvanceIf (1953 of 2474)
PASS: lldb-api :: functionalities/tail_call_frames/unambiguous_sequence/TestUnambiguousTailCalls.py (1954 of 2474)
PASS: lldb-unit :: Utility/./UtilityTests/StringExtractorTest.DecodeHexU8_Exact (1955 of 2474)
PASS: lldb-unit :: Process/gdb-remote/./ProcessGdbRemoteTests/GDBRemoteClientBaseTest.SendContinueAndAsyncPacket (1956 of 2474)
PASS: lldb-shell :: ObjectFile/Breakpad/sections.test (1957 of 2474)
PASS: lldb-unit :: Host/./HostTests/SocketTests/SocketTest.DecodeHostAndPort/ipv4 (1958 of 2474)
PASS: lldb-unit :: Process/gdb-remote/./ProcessGdbRemoteTests/GDBRemoteClientBaseTest.SendContinueAndLateInterrupt (1959 of 2474)
PASS: lldb-api :: functionalities/postmortem/minidump-new/TestMiniDumpNew.py (1960 of 2474)
PASS: lldb-shell :: Quit/TestQuitExitCode30.test (1961 of 2474)
PASS: lldb-shell :: SymbolFile/DWARF/x86/debug-names-compressed.cpp (1962 of 2474)
PASS: lldb-unit :: Symbol/./SymbolTests/TestTypeSystemClang.TestUnifyAccessSpecifiers (1963 of 2474)
UNSUPPORTED: lldb-shell :: SymbolFile/PDB/vbases.test (1964 of 2474)
PASS: lldb-unit :: Utility/./UtilityTests/LogChannelEnabledTest.log_options (1965 of 2474)
PASS: lldb-api :: commands/target/stop-hooks/TestStopHooks.py (1966 of 2474)
PASS: lldb-api :: commands/expression/test/TestExprs.py (1967 of 2474)
PASS: lldb-unit :: Process/gdb-remote/./ProcessGdbRemoteTests/GDBRemoteClientBaseTest.InterruptNoResponse (1968 of 2474)
PASS: lldb-unit :: Utility/./UtilityTests/LogChannelTest.Enable (1969 of 2474)
PASS: lldb-api :: commands/frame/diagnose/inheritance/TestDiagnoseInheritance.py (1970 of 2474)
PASS: lldb-shell :: ScriptInterpreter/None/import_module.test (1971 of 2474)
PASS: lldb-unit :: Process/Utility/./ProcessUtilityTests/ProcMapTests/LinuxProcMapsTestFixture.ParseMapRegions/2 (1972 of 2474)
PASS: lldb-api :: commands/expression/persist_objc_pointeetype/TestPersistObjCPointeeType.py (1973 of 2474)
PASS: lldb-unit :: Utility/./UtilityTests/StatusTest.ErrorCodeConstructor (1974 of 2474)
PASS: lldb-api :: functionalities/memory/find/TestMemoryFind.py (1975 of 2474)
PASS: lldb-unit :: Process/gdb-remote/./ProcessGdbRemoteTests/GDBRemoteCommunicationServerLLGSTest.LLGSArgToURL (1976 of 2474)
PASS: lldb-unit :: Process/gdb-remote/./ProcessGdbRemoteTests/GDBRemoteCommunicationClientTest.GetQOffsets (1977 of 2474)
PASS: lldb-unit :: Utility/./UtilityTests/ArchSpecTest.TestParseMachCPUDashSubtypeTripleSimple (1978 of 2474)
PASS: lldb-shell :: ObjectFile/ELF/section-types.yaml (1979 of 2474)
PASS: lldb-unit :: Host/./HostTests/NativeProcessProtocolTest.ReadCStringFromMemory_CrossPageBoundary (1980 of 2474)
PASS: lldb-api :: commands/target/dump/TestTargetDumpTypeSystem.py (1981 of 2474)
PASS: lldb-unit :: Core/./LLDBCoreTests/MangledTest.EmptyForInvalidDLangName (1982 of 2474)
PASS: lldb-shell :: SymbolFile/DWARF/x86/dwarf5-implicit-const.s (1983 of 2474)
PASS: lldb-api :: python_api/frame/get-variables/TestGetVariables.py (1984 of 2474)
PASS: lldb-shell :: SymbolFile/NativePDB/break-by-function.cpp (1985 of 2474)
PASS: lldb-shell :: SymbolFile/DWARF/x86/debug_loc.s (1986 of 2474)
PASS: lldb-unit :: Utility/./UtilityTests/FileSpecTest.Yaml (1987 of 2474)
PASS: lldb-api :: types/TestCharType.py (1988 of 2474)
PASS: lldb-unit :: Process/minidump/./LLDBMinidumpTests/MinidumpParserTest.GetMemoryRegionInfoFromMemory64List (1989 of 2474)
PASS: lldb-api :: python_api/get-value-32bit-int/TestGetValue32BitInt.py (1990 of 2474)
PASS: lldb-unit :: Target/./TargetTests/MemoryRegionInfoTest.Formatv (1991 of 2474)
PASS: lldb-unit :: Language/Highlighting/./HighlighterTests/HighlighterTest.DefaultHighlighterWithCursor (1992 of 2474)
PASS: lldb-api :: lang/objc/objc-stepping/TestObjCStepping.py (1993 of 2474)
PASS: lldb-unit :: Utility/./UtilityTests/RangeTest.ContainsEndInclusiveInvalid (1994 of 2474)
PASS: lldb-api :: functionalities/breakpoint/breakpoint_options/TestBreakpointOptions.py (1995 of 2474)
PASS: lldb-api :: commands/expression/rdar44436068/Test128BitsInteger.py (1996 of 2474)
PASS: lldb-api :: lang/objc/objc-dyn-sbtype/TestObjCDynamicSBType.py (1997 of 2474)
PASS: lldb-shell :: SymbolFile/DWARF/DW_AT_range-DW_FORM_sec_offset.s (1998 of 2474)
PASS: lldb-unit :: Host/./HostTests/TerminalTest.PipeIsNotATerminal (1999 of 2474)
PASS: lldb-unit :: Utility/./UtilityTests/RangeTest.NotEqualInvalid (2000 of 2474)
PASS: lldb-api :: functionalities/gdb_remote_client/TestRemoteRegNums.py (2001 of 2474)
UNSUPPORTED: lldb-api :: commands/expression/multiline-navigation/TestMultilineNavigation.py (2002 of 2474)
PASS: lldb-shell :: SymbolFile/DWARF/x86/debug_ranges-missing-section.s (2003 of 2474)
PASS: lldb-api :: commands/expression/persistent_variables/TestPersistentVariables.py (2004 of 2474)
PASS: lldb-shell :: Register/Core/x86-32-linux-fp.test (2005 of 2474)
PASS: lldb-unit :: UnwindAssembly/x86/./UnwindAssemblyx86Tests/Testx86AssemblyInspectionEngine.TestPushR13 (2006 of 2474)
PASS: lldb-unit :: Utility/./UtilityTests/BinaryStreamTest.PutSLEB128TwoBytes (2007 of 2474)
PASS: lldb-shell :: Minidump/Windows/broken-unwind.test (2008 of 2474)
PASS: lldb-unit :: Utility/./UtilityTests/VMRange.Clear (2009 of 2474)
PASS: lldb-api :: commands/expression/import-std-module/basic/TestImportStdModule.py (2010 of 2474)
PASS: lldb-unit :: Symbol/./SymbolTests/LineEntryTest.GetAllExactLineMatchesWithoutColumn (2011 of 2474)
PASS: lldb-api :: lang/cpp/class_types/TestClassTypes.py (2012 of 2474)
PASS: lldb-api :: tools/lldb-vscode/console/TestVSCode_console.py (2013 of 2474)
PASS: lldb-api :: functionalities/abbreviation/TestAbbreviations.py (2014 of 2474)
PASS: lldb-api :: functionalities/breakpoint/dummy_target_breakpoints/TestBreakpointsWithNoTargets.py (2015 of 2474)
PASS: lldb-unit :: Language/Highlighting/./HighlighterTests/HighlighterTest.ClangCommas (2016 of 2474)
PASS: lldb-api :: commands/expression/import-std-module/sysroot/TestStdModuleSysroot.py (2017 of 2474)
PASS: lldb-unit :: Core/./LLDBCoreTests/RichManglingContextTest.Basic (2018 of 2474)
PASS: lldb-api :: tools/lldb-vscode/attach/TestVSCode_attach.py (2019 of 2474)
PASS: lldb-api :: lang/cpp/template-function/TestTemplateFunctions.py (2020 of 2474)
PASS: lldb-unit :: Symbol/./SymbolTests/TestClangASTImporter.CopyTypeTagDecl (2021 of 2474)
PASS: lldb-api :: python_api/watchpoint/TestWatchpointIgnoreCount.py (2022 of 2474)
PASS: lldb-api :: functionalities/gdb_remote_client/TestGDBRemotePlatformFile.py (2023 of 2474)
PASS: lldb-api :: functionalities/data-formatter/data-formatter-disabling/TestDataFormatterDisabling.py (2024 of 2474)
PASS: lldb-unit :: Process/minidump/./LLDBMinidumpTests/MinidumpParserTest.GetThreadsAndGetThreadContext (2025 of 2474)
PASS: lldb-api :: functionalities/data-formatter/data-formatter-objc/TestDataFormatterObjCCF.py (2026 of 2474)
PASS: lldb-shell :: SymbolFile/DWARF/x86/static_scope.s (2027 of 2474)
PASS: lldb-unit :: Utility/./UtilityTests/TimeoutTest.Construction (2028 of 2474)
UNSUPPORTED: lldb-api :: lang/cpp/function-template-parameter-pack/TestFunctionTemplateParameterPack.py (2029 of 2474)
PASS: lldb-api :: functionalities/thread/concurrent_events/TestConcurrentTwoWatchpointThreads.py (2030 of 2474)
PASS: lldb-unit :: Utility/./UtilityTests/StreamTeeTest.Constructor1Stream (2031 of 2474)
PASS: lldb-api :: functionalities/data-formatter/builtin-formats/TestBuiltinFormats.py (2032 of 2474)
PASS: lldb-api :: commands/expression/import-std-module/non-module-type-separation/TestNonModuleTypeSeparation.py (2033 of 2474)
UNSUPPORTED: lldb-api :: tools/lldb-server/TestGdbRemoteAuxvSupport.py (2034 of 2474)
PASS: lldb-unit :: Utility/./UtilityTests/StreamTest.ShiftOperatorStrings (2035 of 2474)
PASS: lldb-api :: functionalities/data-formatter/data-formatter-stl/generic/multiset/TestDataFormatterGenericMultiSet.py (2036 of 2474)
PASS: lldb-api :: functionalities/thread/step_out/TestThreadStepOut.py (2037 of 2474)
PASS: lldb-unit :: UnwindAssembly/x86/./UnwindAssemblyx86Tests/Testx86AssemblyInspectionEngine.TestPushEBP (2038 of 2474)
PASS: lldb-api :: lang/objc/hidden-ivars/TestHiddenIvars.py (2039 of 2474)
PASS: lldb-unit :: Process/Utility/./ProcessUtilityTests/MemoryTagManagerAArch64MTETest.GetLogicalTag (2040 of 2474)
PASS: lldb-api :: functionalities/set-data/TestSetData.py (2041 of 2474)
PASS: lldb-api :: tools/lldb-vscode/breakpoint-events/TestVSCode_breakpointEvents.py (2042 of 2474)
PASS: lldb-shell :: SymbolFile/DWARF/clang-ast-from-dwarf-objc-property.m (2043 of 2474)
PASS: lldb-shell :: Driver/TestFile.test (2044 of 2474)
PASS: lldb-shell :: SymbolFile/DWARF/x86/DW_OP_piece-struct.s (2045 of 2474)
PASS: lldb-api :: functionalities/data-formatter/data-formatter-stl/libstdcpp/unique_ptr/invalid/TestDataFormatterInvalidStdUniquePtr.py (2046 of 2474)
PASS: lldb-api :: functionalities/gdb_remote_client/TestTargetXMLArch.py (2047 of 2474)
PASS: lldb-unit :: Interpreter/./InterpreterTests/OptionValueArgs.DeepCopy (2048 of 2474)
PASS: lldb-shell :: SymbolFile/DWARF/x86/DW_AT_location-DW_AT_const_value.s (2049 of 2474)
PASS: lldb-api :: python_api/sbtype_typeclass/TestSBTypeTypeClass.py (2050 of 2474)
PASS: lldb-shell :: SymbolFile/Breakpad/unwind-via-raSearch.test (2051 of 2474)
PASS: lldb-api :: tools/lldb-server/TestGdbRemoteProcessInfo.py (2052 of 2474)
UNSUPPORTED: lldb-api :: commands/expression/call-restarts/TestCallThatRestarts.py (2053 of 2474)
PASS: lldb-api :: lang/cpp/frame-var-anon-unions/TestFrameVariableAnonymousUnions.py (2054 of 2474)
FAIL: lldb-api :: functionalities/scripted_process/TestScriptedProcess.py (2055 of 2474)
******************** TEST 'lldb-api :: functionalities/scripted_process/TestScriptedProcess.py' FAILED ********************
Script:
--
/Users/buildslave/jenkins/workspace/lldb-cmake-sanitized/lldb-build/lldb-test-build.noindex/copied-python /Users/buildslave/jenkins/workspace/lldb-cmake-sanitized/llvm-project/lldb/test/API/dotest.py -u CXXFLAGS -u CFLAGS --codesign-identity lldb_codesign --arch x86_64 --build-dir /Users/buildslave/jenkins/workspace/lldb-cmake-sanitized/lldb-build/lldb-test-build.noindex -t --env TERM=vt100 --env LLVM_LIBS_DIR=/Users/buildslave/jenkins/workspace/lldb-cmake-sanitized/lldb-build/./lib --inferior-env ASAN_OPTIONS=detect_stack_use_after_return=1 --inferior-env DYLD_INSERT_LIBRARIES=/Users/buildslave/jenkins/workspace/lldb-cmake-sanitized/host-compiler/lib/clang/14.0.99/lib/darwin/libclang_rt.asan_osx_dynamic.dylib --arch x86_64 --build-dir /Users/buildslave/jenkins/workspace/lldb-cmake-sanitized/lldb-build/lldb-test-build.noindex --lldb-module-cache-dir /Users/buildslave/jenkins/workspace/lldb-cmake-sanitized/lldb-build/lldb-test-build.noindex/module-cache-lldb/lldb-api --clang-module-cache-dir /Users/buildslave/jenkins/workspace/lldb-cmake-sanitized/lldb-build/lldb-test-build.noindex/module-cache-clang/lldb-api --executable /Users/buildslave/jenkins/workspace/lldb-cmake-sanitized/lldb-build/./bin/lldb --compiler /Users/buildslave/jenkins/workspace/lldb-cmake-sanitized/host-compiler/bin/clang --dsymutil /Users/buildslave/jenkins/workspace/lldb-cmake-sanitized/lldb-build/./bin/dsymutil --llvm-tools-dir /Users/buildslave/jenkins/workspace/lldb-cmake-sanitized/lldb-build/./bin --lldb-libs-dir /Users/buildslave/jenkins/workspace/lldb-cmake-sanitized/lldb-build/./lib /Users/buildslave/jenkins/workspace/lldb-cmake-sanitized/llvm-project/lldb/test/API/functionalities/scripted_process -p TestScriptedProcess.py
--
Exit Code: -6

Hide Details

Command Output (stdout): -- lldb version 14.0.99 (http://labmaster3.local/git/llvm-project.git revision ad48ef1e3142aafcf23ab9b8037e96c9208c2074) clang revision ad48ef1e3142aafcf23ab9b8037e96c9208c2074 llvm revision ad48ef1e3142aafcf23ab9b8037e96c9208c2074 Name of the class that will manage the scripted process: 'stack_core_scripted_process.StackCoreScriptedProcess' Saving 69632 bytes of data for memory region at 0x7ffeefbef000

Hide Details

-- Command Output (stderr): -- ================================================================= ==60511==ERROR: AddressSanitizer: heap-use-after-free on address 0x6160002508a0 at pc 0x00010b94fa30 bp 0x700007b34cf0 sp 0x700007b344b8 READ of size 512 at 0x6160002508a0 thread T6 #0 0x10b94fa2f in __asan_memcpy+0x1af (libclang_rt.asan_osx_dynamic.dylib:x86_64+0x44a2f) #1 0x11053e328 in lldb_private::DataExtractor::CopyByteOrderedData(unsigned long long, unsigned long long, void*, unsigned long long, lldb::ByteOrder) const DataExtractor.cpp:742 #2 0x110acb0bb in lldb_private::ScriptedProcess::DoReadMemory(unsigned long long, void*, unsigned long, lldb_private::Status&) ScriptedProcess.cpp:237 #3 0x11036357c in lldb_private::Process::ReadMemoryFromInferior(unsigned long long, void*, unsigned long, lldb_private::Status&) Process.cpp:2047 #4 0x11031b9ef in lldb_private::MemoryCache::Read(unsigned long long, void*, unsigned long, lldb_private::Status&) Memory.cpp:229 #5 0x1103a49d1 in lldb_private::RegisterContext::ReadRegisterValueFromMemory(lldb_private::RegisterInfo const*, unsigned long long, unsigned int, lldb_private::RegisterValue&) RegisterContext.cpp:343 #6 0x1103b66f6 in lldb_private::RegisterContextUnwind::ReadRegisterValueFromRegisterLocation(lldb_private::UnwindLLDB::RegisterLocation, lldb_private::RegisterInfo const*, lldb_private::RegisterValue&) RegisterContextUnwind.cpp:1138 #7 0x1103b4083 in lldb_private::RegisterContextUnwind::ReadGPRValue(lldb::RegisterKind, unsigned int, unsigned long long&) RegisterContextUnwind.cpp:2143 #8 0x1103a8805 in lldb_private::RegisterContextUnwind::InitializeNonZerothFrame() RegisterContextUnwind.cpp:343 #9 0x1103a5b70 in lldb_private::RegisterContextUnwind::RegisterContextUnwind(lldb_private::Thread&, std::__1::shared_ptr<lldb_private::RegisterContextUnwind> const&, lldb_private::SymbolContext&, unsigned int, lldb_private::UnwindLLDB&) RegisterContextUnwind.cpp:72 #10 0x110500760 in lldb_private::UnwindLLDB::GetOneMoreFrame(lldb_private::ABI*) UnwindLLDB.cpp:128 #11 0x1104ff3c9 in lldb_private::UnwindLLDB::AddOneMoreFrame(lldb_private::ABI*) UnwindLLDB.cpp:332 #12 0x110500095 in lldb_private::UnwindLLDB::UpdateUnwindPlanForFirstFrameIfInvalid(lldb_private::ABI*) UnwindLLDB.cpp:305 #13 0x1104fef2d in lldb_private::UnwindLLDB::AddFirstFrame() UnwindLLDB.cpp:99 #14 0x11050221d in lldb_private::UnwindLLDB::DoGetFrameInfoAtIndex(unsigned int, unsigned long long&, unsigned long long&, bool&) UnwindLLDB.cpp:395 #15 0x1103f0e5a in lldb_private::Unwind::GetFrameInfoAtIndex(unsigned int, unsigned long long&, unsigned long long&, bool&) Unwind.h:53 #16 0x1103ed71c in lldb_private::StackFrameList::GetFramesUpTo(unsigned int) StackFrameList.cpp:484 #17 0x1103eb817 in lldb_private::StackFrameList::ResetCurrentInlinedDepth() StackFrameList.cpp:86 #18 0x11048b673 in lldb_private::Thread::ShouldStop(lldb_private::Event*) Thread.cpp:805 #19 0x1104a4e78 in lldb_private::ThreadList::ShouldStop(lldb_private::Event*) ThreadList.cpp:330 #20 0x110371340 in lldb_private::Process::ShouldBroadcastEvent(lldb_private::Event*) Process.cpp:3405 #21 0x110368264 in lldb_private::Process::HandlePrivateEvent(std::__1::shared_ptr<lldb_private::Event>&) Process.cpp:3630 #22 0x110372fba in lldb_private::Process::RunPrivateStateThread(bool) Process.cpp:3824 #23 0x11037196d in lldb_private::Process::PrivateStateThread(void*) Process.cpp:3722 #24 0x1100d1270 in lldb_private::HostNativeThreadBase::ThreadCreateTrampoline(void*) HostNativeThreadBase.cpp:65 #25 0x7fff725ac108 in _pthread_start+0x93 (libsystem_pthread.dylib:x86_64+0x6108) #26 0x7fff725a7b8a in thread_start+0xe (libsystem_pthread.dylib:x86_64+0x1b8a)

Hide Details

0x6160002508a0 is located 32 bytes inside of 545-byte region [0x616000250880,0x616000250aa1) freed by thread T6 here: #0 0x10b951ac9 in wrap_free+0xa9 (libclang_rt.asan_osx_dynamic.dylib:x86_64+0x46ac9) #1 0x10c456af2 in frame_dealloc+0xa0 (Python:x86_64+0x2aaf2) #2 0x10c445d2a in function_code_fastcall+0xf8 (Python:x86_64+0x19d2a) #3 0x10c446624 in _PyObject_Call_Prepend+0x95 (Python:x86_64+0x1a624) #4 0x10c4452d2 in _PyObject_FastCallDict+0x107 (Python:x86_64+0x192d2) #5 0x10c4467d2 in _PyObject_CallFunctionVa+0xd0 (Python:x86_64+0x1a7d2) #6 0x10c446a00 in PyObject_CallMethod+0xa8 (Python:x86_64+0x1aa00) #7 0x110c61a80 in std::__1::shared_ptr<lldb_private::DataExtractor> lldb_private::ScriptedPythonInterface::Dispatch<std::__1::shared_ptr<lldb_private::DataExtractor>, unsigned long long, unsigned long>(llvm::StringRef, lldb_private::Status&, unsigned long long, unsigned long) ScriptedPythonInterface.h:93 #8 0x110c60ed4 in lldb_private::ScriptedProcessPythonInterface::ReadMemoryAtAddress(unsigned long long, unsigned long, lldb_private::Status&) ScriptedProcessPythonInterface.cpp:120 #9 0x110acae95 in lldb_private::ScriptedProcess::DoReadMemory(unsigned long long, void*, unsigned long, lldb_private::Status&) ScriptedProcess.cpp:232 #10 0x11036357c in lldb_private::Process::ReadMemoryFromInferior(unsigned long long, void*, unsigned long, lldb_private::Status&) Process.cpp:2047 #11 0x11031b9ef in lldb_private::MemoryCache::Read(unsigned long long, void*, unsigned long, lldb_private::Status&) Memory.cpp:229 #12 0x1103a49d1 in lldb_private::RegisterContext::ReadRegisterValueFromMemory(lldb_private::RegisterInfo const*, unsigned long long, unsigned int, lldb_private::RegisterValue&) RegisterContext.cpp:343 #13 0x1103b66f6 in lldb_private::RegisterContextUnwind::ReadRegisterValueFromRegisterLocation(lldb_private::UnwindLLDB::RegisterLocation, lldb_private::RegisterInfo const*, lldb_private::RegisterValue&) RegisterContextUnwind.cpp:1138 #14 0x1103b4083 in lldb_private::RegisterContextUnwind::ReadGPRValue(lldb::RegisterKind, unsigned int, unsigned long long&) RegisterContextUnwind.cpp:2143 #15 0x1103a8805 in lldb_private::RegisterContextUnwind::InitializeNonZerothFrame() RegisterContextUnwind.cpp:343 #16 0x1103a5b70 in lldb_private::RegisterContextUnwind::RegisterContextUnwind(lldb_private::Thread&, std::__1::shared_ptr<lldb_private::RegisterContextUnwind> const&, lldb_private::SymbolContext&, unsigned int, lldb_private::UnwindLLDB&) RegisterContextUnwind.cpp:72 #17 0x110500760 in lldb_private::UnwindLLDB::GetOneMoreFrame(lldb_private::ABI*) UnwindLLDB.cpp:128 #18 0x1104ff3c9 in lldb_private::UnwindLLDB::AddOneMoreFrame(lldb_private::ABI*) UnwindLLDB.cpp:332 #19 0x110500095 in lldb_private::UnwindLLDB::UpdateUnwindPlanForFirstFrameIfInvalid(lldb_private::ABI*) UnwindLLDB.cpp:305 #20 0x1104fef2d in lldb_private::UnwindLLDB::AddFirstFrame() UnwindLLDB.cpp:99 #21 0x11050221d in lldb_private::UnwindLLDB::DoGetFrameInfoAtIndex(unsigned int, unsigned long long&, unsigned long long&, bool&) UnwindLLDB.cpp:395 #22 0x1103f0e5a in lldb_private::Unwind::GetFrameInfoAtIndex(unsigned int, unsigned long long&, unsigned long long&, bool&) Unwind.h:53 #23 0x1103ed71c in lldb_private::StackFrameList::GetFramesUpTo(unsigned int) StackFrameList.cpp:484 #24 0x1103eb817 in lldb_private::StackFrameList::ResetCurrentInlinedDepth() StackFrameList.cpp:86 #25 0x11048b673 in lldb_private::Thread::ShouldStop(lldb_private::Event*) Thread.cpp:805 #26 0x1104a4e78 in lldb_private::ThreadList::ShouldStop(lldb_private::Event*) ThreadList.cpp:330 #27 0x110371340 in lldb_private::Process::ShouldBroadcastEvent(lldb_private::Event*) Process.cpp:3405 #28 0x110368264 in lldb_private::Process::HandlePrivateEvent(std::__1::shared_ptr<lldb_private::Event>&) Process.cpp:3630 #29 0x110372fba in lldb_private::Process::RunPrivateStateThread(bool) Process.cpp:3824

Hide Details

previously allocated by thread T6 here: #0 0x10b951980 in wrap_malloc+0xa0 (libclang_rt.asan_osx_dynamic.dylib:x86_64+0x46980) #1 0x10c47428b in _PyObject_Malloc+0x37 (Python:x86_64+0x4828b) #2 0x10c43decc in _PyBytes_FromSize+0x63 (Python:x86_64+0x11ecc) #3 0x10c43de09 in PyBytes_FromStringAndSize+0x3d (Python:x86_64+0x11e09) #4 0x110c13497 in lldb_private::python::PythonBytes::PythonBytes(unsigned char const*, unsigned long) PythonDataObjects.cpp:290 #5 0x10fc9a611 in _wrap_SBProcess_ReadMemory(_object*, _object*) LLDBWrapPython.cpp:45781 #6 0x10c446226 in _PyMethodDef_RawFastCallKeywords+0xeb (Python:x86_64+0x1a226) #7 0x10c4458c6 in _PyCFunction_FastCallKeywords+0x2b (Python:x86_64+0x198c6) #8 0x10c4db905 in call_function+0x1de (Python:x86_64+0xaf905) #9 0x10c4d45ee in _PyEval_EvalFrameDefault+0x1b51 (Python:x86_64+0xa85ee) #10 0x10c445ca1 in function_code_fastcall+0x6f (Python:x86_64+0x19ca1) #11 0x10c4db97d in call_function+0x256 (Python:x86_64+0xaf97d) #12 0x10c4d45d5 in _PyEval_EvalFrameDefault+0x1b38 (Python:x86_64+0xa85d5) #13 0x10c445ca1 in function_code_fastcall+0x6f (Python:x86_64+0x19ca1) #14 0x10c446624 in _PyObject_Call_Prepend+0x95 (Python:x86_64+0x1a624) #15 0x10c4452d2 in _PyObject_FastCallDict+0x107 (Python:x86_64+0x192d2) #16 0x10c4467d2 in _PyObject_CallFunctionVa+0xd0 (Python:x86_64+0x1a7d2) #17 0x10c446a00 in PyObject_CallMethod+0xa8 (Python:x86_64+0x1aa00) #18 0x110c61a80 in std::__1::shared_ptr<lldb_private::DataExtractor> lldb_private::ScriptedPythonInterface::Dispatch<std::__1::shared_ptr<lldb_private::DataExtractor>, unsigned long long, unsigned long>(llvm::StringRef, lldb_private::Status&, unsigned long long, unsigned long) ScriptedPythonInterface.h:93 #19 0x110c60ed4 in lldb_private::ScriptedProcessPythonInterface::ReadMemoryAtAddress(unsigned long long, unsigned long, lldb_private::Status&) ScriptedProcessPythonInterface.cpp:120 #20 0x110acae95 in lldb_private::ScriptedProcess::DoReadMemory(unsigned long long, void*, unsigned long, lldb_private::Status&) ScriptedProcess.cpp:232 #21 0x11036357c in lldb_private::Process::ReadMemoryFromInferior(unsigned long long, void*, unsigned long, lldb_private::Status&) Process.cpp:2047 #22 0x11031b9ef in lldb_private::MemoryCache::Read(unsigned long long, void*, unsigned long, lldb_private::Status&) Memory.cpp:229 #23 0x1103a49d1 in lldb_private::RegisterContext::ReadRegisterValueFromMemory(lldb_private::RegisterInfo const*, unsigned long long, unsigned int, lldb_private::RegisterValue&) RegisterContext.cpp:343 #24 0x1103b66f6 in lldb_private::RegisterContextUnwind::ReadRegisterValueFromRegisterLocation(lldb_private::UnwindLLDB::RegisterLocation, lldb_private::RegisterInfo const*, lldb_private::RegisterValue&) RegisterContextUnwind.cpp:1138 #25 0x1103b4083 in lldb_private::RegisterContextUnwind::ReadGPRValue(lldb::RegisterKind, unsigned int, unsigned long long&) RegisterContextUnwind.cpp:2143 #26 0x1103a8805 in lldb_private::RegisterContextUnwind::InitializeNonZerothFrame() RegisterContextUnwind.cpp:343 #27 0x1103a5b70 in lldb_private::RegisterContextUnwind::RegisterContextUnwind(lldb_private::Thread&, std::__1::shared_ptr<lldb_private::RegisterContextUnwind> const&, lldb_private::SymbolContext&, unsigned int, lldb_private::UnwindLLDB&) RegisterContextUnwind.cpp:72 #28 0x110500760 in lldb_private::UnwindLLDB::GetOneMoreFrame(lldb_private::ABI*) UnwindLLDB.cpp:128 #29 0x1104ff3c9 in lldb_private::UnwindLLDB::AddOneMoreFrame(lldb_private::ABI*) UnwindLLDB.cpp:332

Hide Details

Thread T6 created by T0 here: #0 0x10b94b45c in wrap_pthread_create+0x5c (libclang_rt.asan_osx_dynamic.dylib:x86_64+0x4045c) #1 0x1100f4ca1 in lldb_private::ThreadLauncher::LaunchThread(llvm::StringRef, void* (*)(void*), void*, unsigned long) ThreadLauncher.cpp:65 #2 0x11036a1ef in lldb_private::Process::StartPrivateStateThread(bool) Process.cpp:3501 #3 0x1103699ea in lldb_private::Process::Launch(lldb_private::ProcessLaunchInfo&) Process.cpp:2547 #4 0x11044a19b in lldb_private::Target::Launch(lldb_private::ProcessLaunchInfo&, lldb_private::Stream*) Target.cpp:3063 #5 0x10f81e210 in lldb::SBTarget::Launch(lldb::SBLaunchInfo&, lldb::SBError&) SBTarget.cpp:439 #6 0x10fcd844a in _wrap_SBTarget_Launch(_object*, _object*) LLDBWrapPython.cpp:54084 #7 0x10c445bda in PyCFunction_Call+0x140 (Python:x86_64+0x19bda) #8 0x10c4d49e2 in _PyEval_EvalFrameDefault+0x1f45 (Python:x86_64+0xa89e2) #9 0x10c4dc2da in _PyEval_EvalCodeWithName+0x72a (Python:x86_64+0xb02da) #10 0x10c44588b in _PyFunction_FastCallKeywords+0xe0 (Python:x86_64+0x1988b) #11 0x10c4db97d in call_function+0x256 (Python:x86_64+0xaf97d) #12 0x10c4d45d5 in _PyEval_EvalFrameDefault+0x1b38 (Python:x86_64+0xa85d5) #13 0x10c445ca1 in function_code_fastcall+0x6f (Python:x86_64+0x19ca1) #14 0x10c4d4905 in _PyEval_EvalFrameDefault+0x1e68 (Python:x86_64+0xa8905) #15 0x10c4dc2da in _PyEval_EvalCodeWithName+0x72a (Python:x86_64+0xb02da) #16 0x10c4454f4 in _PyFunction_FastCallDict+0x1b8 (Python:x86_64+0x194f4) #17 0x10c4d4905 in _PyEval_EvalFrameDefault+0x1e68 (Python:x86_64+0xa8905) #18 0x10c4dc2da in _PyEval_EvalCodeWithName+0x72a (Python:x86_64+0xb02da) #19 0x10c44588b in _PyFunction_FastCallKeywords+0xe0 (Python:x86_64+0x1988b) #20 0x10c4db97d in call_function+0x256 (Python:x86_64+0xaf97d) #21 0x10c4d468c in _PyEval_EvalFrameDefault+0x1bef (Python:x86_64+0xa868c) #22 0x10c4dc2da in _PyEval_EvalCodeWithName+0x72a (Python:x86_64+0xb02da) #23 0x10c44588b in _PyFunction_FastCallKeywords+0xe0 (Python:x86_64+0x1988b) #24 0x10c4db97d in call_function+0x256 (Python:x86_64+0xaf97d) #25 0x10c4d468c in _PyEval_EvalFrameDefault+0x1bef (Python:x86_64+0xa868c) #26 0x10c445ca1 in function_code_fastcall+0x6f (Python:x86_64+0x19ca1) #27 0x10c4db97d in call_function+0x256 (Python:x86_64+0xaf97d) #28 0x10c4d45d5 in _PyEval_EvalFrameDefault+0x1b38 (Python:x86_64+0xa85d5) #29 0x10c4dc2da in _PyEval_EvalCodeWithName+0x72a (Python:x86_64+0xb02da) #30 0x10c4454f4 in _PyFunction_FastCallDict+0x1b8 (Python:x86_64+0x194f4) #31 0x10c446624 in _PyObject_Call_Prepend+0x95 (Python:x86_64+0x1a624) #32 0x10c4459d4 in PyObject_Call+0x87 (Python:x86_64+0x199d4) #33 0x10c4d4905 in _PyEval_EvalFrameDefault+0x1e68 (Python:x86_64+0xa8905) #34 0x10c4dc2da in _PyEval_EvalCodeWithName+0x72a (Python:x86_64+0xb02da) #35 0x10c4454f4 in _PyFunction_FastCallDict+0x1b8 (Python:x86_64+0x194f4) #36 0x10c446624 in _PyObject_Call_Prepend+0x95 (Python:x86_64+0x1a624) #37 0x10c4834af in slot_tp_call+0x46 (Python:x86_64+0x574af) #38 0x10c44572c in _PyObject_FastCallKeywords+0x166 (Python:x86_64+0x1972c) #39 0x10c4db976 in call_function+0x24f (Python:x86_64+0xaf976) #40 0x10c4d468c in _PyEval_EvalFrameDefault+0x1bef (Python:x86_64+0xa868c) #41 0x10c4dc2da in _PyEval_EvalCodeWithName+0x72a (Python:x86_64+0xb02da) #42 0x10c44588b in _PyFunction_FastCallKeywords+0xe0 (Python:x86_64+0x1988b) #43 0x10c4db97d in call_function+0x256 (Python:x86_64+0xaf97d) #44 0x10c4d45d5 in _PyEval_EvalFrameDefault+0x1b38 (Python:x86_64+0xa85d5) #45 0x10c4dc2da in _PyEval_EvalCodeWithName+0x72a (Python:x86_64+0xb02da) #46 0x10c44588b in _PyFunction_FastCallKeywords+0xe0 (Python:x86_64+0x1988b) #47 0x10c4db97d in call_function+0x256 (Python:x86_64+0xaf97d) #48 0x10c4d45d5 in _PyEval_EvalFrameDefault+0x1b38 (Python:x86_64+0xa85d5) #49 0x10c445ca1 in function_code_fastcall+0x6f (Python:x86_64+0x19ca1) #50 0x10c446624 in _PyObject_Call_Prepend+0x95 (Python:x86_64+0x1a624) #51 0x10c4459d4 in PyObject_Call+0x87 (Python:x86_64+0x199d4) #52 0x10c4d4905 in _PyEval_EvalFrameDefault+0x1e68 (Python:x86_64+0xa8905) #53 0x10c4dc2da in _PyEval_EvalCodeWithName+0x72a (Python:x86_64+0xb02da) #54 0x10c4454f4 in _PyFunction_FastCallDict+0x1b8 (Python:x86_64+0x194f4) #55 0x10c446624 in _PyObject_Call_Prepend+0x95 (Python:x86_64+0x1a624) #56 0x10c4834af in slot_tp_call+0x46 (Python:x86_64+0x574af) #57 0x10c44572c in _PyObject_FastCallKeywords+0x166 (Python:x86_64+0x1972c) #58 0x10c4db976 in call_function+0x24f (Python:x86_64+0xaf976) #59 0x10c4d468c in _PyEval_EvalFrameDefault+0x1bef (Python:x86_64+0xa868c) #60 0x10c445ca1 in function_code_fastcall+0x6f (Python:x86_64+0x19ca1) #61 0x10c4db97d in call_function+0x256 (Python:x86_64+0xaf97d) #62 0x10c4d45d5 in _PyEval_EvalFrameDefault+0x1b38 (Python:x86_64+0xa85d5) #63 0x10c445ca1 in function_code_fastcall+0x6f (Python:x86_64+0x19ca1) #64 0x10c4db97d in call_function+0x256 (Python:x86_64+0xaf97d) #65 0x10c4d45ee in _PyEval_EvalFrameDefault+0x1b51 (Python:x86_64+0xa85ee) #66 0x10c4dc2da in _PyEval_EvalCodeWithName+0x72a (Python:x86_64+0xb02da) #67 0x10c4d2a14 in PyEval_EvalCode+0x29 (Python:x86_64+0xa6a14) #68 0x10c5012aa in run_mod+0x35 (Python:x86_64+0xd52aa) #69 0x10c5002c5 in PyRun_FileExFlags+0xa3 (Python:x86_64+0xd42c5) #70 0x10c4ff9a4 in PyRun_SimpleFileExFlags+0x114 (Python:x86_64+0xd39a4) #71 0x10c517010 in pymain_main+0x13de (Python:x86_64+0xeb010) #72 0x10c5177b7 in _Py_UnixMain+0x67 (Python:x86_64+0xeb7b7) #73 0x7fff723a3cc8 in start+0x0 (libdyld.dylib:x86_64+0x1acc8)

Hide Details

SUMMARY: AddressSanitizer: heap-use-after-free (libclang_rt.asan_osx_dynamic.dylib:x86_64+0x44a2f) in __asan_memcpy+0x1af Shadow bytes around the buggy address: 0x1c2c0004a0c0: fd fd fd fd fd fd fd fd fd fd fd fd fd fd fd fd 0x1c2c0004a0d0: fd fd fd fd fd fd fd fd fd fd fd fd fd fd fd fd 0x1c2c0004a0e0: fd fd fd fd fd fd fd fd fd fd fd fd fd fd fd fd 0x1c2c0004a0f0: fd fd fd fd fd fd fd fd fa fa fa fa fa fa fa fa 0x1c2c0004a100: fa fa fa fa fa fa fa fa fa fa fa fa fa fa fa fa =>0x1c2c0004a110: fd fd fd fd[fd]fd fd fd fd fd fd fd fd fd fd fd 0x1c2c0004a120: fd fd fd fd fd fd fd fd fd fd fd fd fd fd fd fd 0x1c2c0004a130: fd fd fd fd fd fd fd fd fd fd fd fd fd fd fd fd 0x1c2c0004a140: fd fd fd fd fd fd fd fd fd fd fd fd fd fd fd fd 0x1c2c0004a150: fd fd fd fd fd fa fa fa fa fa fa fa fa fa fa fa 0x1c2c0004a160: fa fa fa fa fa fa fa fa fa fa fa fa fa fa fa fa Shadow byte legend (one shadow byte represents 8 application bytes): Addressable: 00 Partially addressable: 01 02 03 04 05 06 07 Heap left redzone: fa Freed heap region: fd Stack left redzone: f1 Stack mid redzone: f2 Stack right redzone: f3 Stack after return: f5 Stack use after scope: f8 Global redzone: f9 Global init order: f6 Poisoned by user: f7 Container overflow: fc Array cookie: ac Intra object redzone: bb ASan internal: fe Left alloca redzone: ca Right alloca redzone: cb ==60511==ABORTING Fatal Python error: Aborted

Hide Details

Thread 0x000000010f18ddc0 (most recent call first): File "/Users/buildslave/jenkins/workspace/lldb-cmake-sanitized/lldb-build/lib/python3.7/site-packages/lldb/__init__.py", line 10301 in Launch File "/Users/buildslave/jenkins/workspace/lldb-cmake-sanitized/llvm-project/lldb/test/API/functionalities/scripted_process/TestScriptedProcess.py", line 149 in test_launch_scripted_process_stack_frames File "/Users/buildslave/jenkins/workspace/lldb-cmake-sanitized/llvm-project/lldb/packages/Python/lldbsuite/test/decorators.py", line 149 in wrapper File "/Users/buildslave/jenkins/workspace/lldb-cmake-sanitized/llvm-project/lldb/packages/Python/lldbsuite/test/decorators.py", line 149 in wrapper File "/Users/buildslave/jenkins/workspace/lldb-cmake-sanitized/llvm-project/lldb/packages/Python/lldbsuite/test/lldbtest.py", line 1715 in test_method File "/Users/buildslave/jenkins/workspace/lldb-cmake-sanitized/llvm-project/lldb/third_party/Python/module/unittest2/unittest2/case.py", line 413 in runMethod File "/Users/buildslave/jenkins/workspace/lldb-cmake-sanitized/llvm-project/lldb/third_party/Python/module/unittest2/unittest2/case.py", line 383 in run File "/Users/buildslave/jenkins/workspace/lldb-cmake-sanitized/llvm-project/lldb/third_party/Python/module/unittest2/unittest2/case.py", line 458 in __call__ File "/Users/buildslave/jenkins/workspace/lldb-cmake-sanitized/llvm-project/lldb/third_party/Python/module/unittest2/unittest2/suite.py", line 117 in _wrapped_run File "/Users/buildslave/jenkins/workspace/lldb-cmake-sanitized/llvm-project/lldb/third_party/Python/module/unittest2/unittest2/suite.py", line 115 in _wrapped_run File "/Users/buildslave/jenkins/workspace/lldb-cmake-sanitized/llvm-project/lldb/third_party/Python/module/unittest2/unittest2/suite.py", line 85 in run File "/Users/buildslave/jenkins/workspace/lldb-cmake-sanitized/llvm-project/lldb/third_party/Python/module/unittest2/unittest2/suite.py", line 66 in __call__ File "/Users/buildslave/jenkins/workspace/lldb-cmake-sanitized/llvm-project/lldb/third_party/Python/module/unittest2/unittest2/runner.py", line 165 in run File "/Users/buildslave/jenkins/workspace/lldb-cmake-sanitized/llvm-project/lldb/packages/Python/lldbsuite/test/dotest.py", line 996 in run_suite File "/Users/buildslave/jenkins/workspace/lldb-cmake-sanitized/llvm-project/lldb/test/API/dotest.py", line 7 in <module>

Hide Details

--

Hide Details

******************** PASS: lldb-api :: commands/expression/import-std-module/forward_list/TestForwardListFromStdModule.py (2056 of 2474) PASS: lldb-api :: commands/expression/import-std-module/unique_ptr/TestUniquePtrFromStdModule.py (2057 of 2474) PASS: lldb-api :: lang/cpp/unique-types/TestUniqueTypes.py (2058 of 2474) PASS: lldb-api :: functionalities/gdb_remote_client/TestPty.py (2059 of 2474) PASS: lldb-unit :: Utility/./UtilityTests/StreamTeeTest.DefaultConstructor (2060 of 2474) PASS: lldb-unit :: Utility/./UtilityTests/StringExtractorTest.GetHexU8_InvalidHex (2061 of 2474) PASS: lldb-unit :: Utility/./UtilityTests/BinaryStreamTest.PutSLEB128SevenBytes (2062 of 2474) UNSUPPORTED: lldb-api :: tools/lldb-server/memory-tagging/TestGdbRemoteMemoryTagging.py (2063 of 2474) PASS: lldb-unit :: Process/minidump/./LLDBMinidumpTests/MinidumpParserTest.MinidumpDuplicateModuleMinAddress (2064 of 2474) PASS: lldb-shell :: Commands/command-regex-unalias.test (2065 of 2474) PASS: lldb-api :: macosx/thread-names/TestInterruptThreadNames.py (2066 of 2474) PASS: lldb-unit :: Utility/./UtilityTests/SerializationRountripTest.SerializeDeserializeObjectReference (2067 of 2474) PASS: lldb-unit :: Host/./HostTests/MainLoopTest.Signal (2068 of 2474) UNSUPPORTED: lldb-shell :: Subprocess/vfork-follow-child-wp.test (2069 of 2474) PASS: lldb-unit :: Utility/./UtilityTests/ListenerTest.GetEventWait (2070 of 2474) PASS: lldb-unit :: Utility/./UtilityTests/OptionsWithRawTest.WhitespaceSuffix (2071 of 2474) PASS: lldb-api :: commands/expression/import-std-module/deque-basic/TestDequeFromStdModule.py (2072 of 2474) PASS: lldb-api :: functionalities/multiword-commands/TestMultiWordCommands.py (2073 of 2474) PASS: lldb-shell :: ObjectFile/wasm/stripped-debug-sections.yaml (2074 of 2474) PASS: lldb-unit :: SymbolFile/DWARF/./SymbolFileDWARFTests/DWARFDIETest.ChildIteration (2075 of 2474) PASS: lldb-api :: lang/cpp/auto/TestCPPAuto.py (2076 of 2474) PASS: lldb-api :: types/TestShortTypeExpr.py (2077 of 2474) PASS: lldb-api :: source-manager/TestSourceManager.py (2078 of 2474) PASS: lldb-shell :: ScriptInterpreter/None/none.test (2079 of 2474) PASS: lldb-api :: commands/process/attach/attach_denied/TestAttachDenied.py (2080 of 2474) PASS: lldb-api :: functionalities/thread/concurrent_events/TestConcurrentWatchpointDelayWatchpointOneBreakpoint.py (2081 of 2474) PASS: lldb-api :: lang/cpp/accelerator-table/TestCPPAccelerator.py (2082 of 2474) PASS: lldb-api :: macosx/find-dsym/bundle-with-dot-in-filename/TestBundleWithDotInFilename.py (2083 of 2474) PASS: lldb-api :: commands/frame/select/TestFrameSelect.py (2084 of 2474) PASS: lldb-unit :: Target/./TargetTests/ModuleCacheTest.GetAndPutUuidExists (2085 of 2474) PASS: lldb-api :: lang/objc/rdar-10967107/TestRdar10967107.py (2086 of 2474) PASS: lldb-shell :: SymbolFile/DWARF/x86/apple-index-is-used.cpp (2087 of 2474) PASS: lldb-api :: lang/c/shared_lib/TestSharedLib.py (2088 of 2474) PASS: lldb-unit :: Process/gdb-remote/./ProcessGdbRemoteTests/GDBRemoteCommunicationServerTest.SendErrorResponse_UnimplementedError (2089 of 2474) PASS: lldb-unit :: Core/./LLDBCoreTests/DumpDataExtractorTest.Formats (2090 of 2474) PASS: lldb-api :: lang/cpp/virtual-functions/TestCppVirtualFunctions.py (2091 of 2474) PASS: lldb-api :: commands/expression/call-function/TestCallStdStringFunction.py (2092 of 2474) UNSUPPORTED: lldb-shell :: SymbolFile/DWARF/dwarf5-lazy-dwo.c (2093 of 2474) PASS: lldb-unit :: Process/minidump/./LLDBMinidumpTests/MinidumpParserTest.GetMemoryRegionInfoLinuxMapsError (2094 of 2474) PASS: lldb-unit :: UnwindAssembly/x86/./UnwindAssemblyx86Tests/Testx86AssemblyInspectionEngine.TestPopRBPWithREX (2095 of 2474) PASS: lldb-unit :: Utility/./UtilityTests/OptionsWithRawTest.TerminatedQuote (2096 of 2474) PASS: lldb-api :: lang/cpp/this/TestCPPThis.py (2097 of 2474) PASS: lldb-unit :: Utility/./UtilityTests/RangeTest.SlideZero (2098 of 2474) PASS: lldb-unit :: Utility/./UtilityTests/UriParserTest.MinimalPath (2099 of 2474) PASS: lldb-shell :: Reproducer/TestDiscard.test (2100 of 2474) PASS: lldb-shell :: SymbolFile/NativePDB/load-pdb.cpp (2101 of 2474) PASS: lldb-api :: test_utils/TestInlineTest.py (2102 of 2474) PASS: lldb-unit :: SymbolFile/NativePDB/./SymbolFileNativePDBTests/PDBFPOProgramToDWARFExpressionTests.DependencyChain (2103 of 2474) PASS: lldb-unit :: Utility/./UtilityTests/StringExtractorTest.InitMisc (2104 of 2474) PASS: lldb-api :: lang/cpp/multiple-inheritance/TestCppMultipleInheritance.py (2105 of 2474) PASS: lldb-unit :: UnwindAssembly/x86/./UnwindAssemblyx86Tests/Testx86AssemblyInspectionEngine.Test64bitFramelessBigStackFrame (2106 of 2474) PASS: lldb-api :: lang/cpp/breakpoint_in_member_func_w_non_primitive_params/TestBreakpointInMemberFuncWNonPrimitiveParams.py (2107 of 2474) PASS: lldb-unit :: UnwindAssembly/x86/./UnwindAssemblyx86Tests/Testx86AssemblyInspectionEngine.TestPushECX (2108 of 2474) PASS: lldb-api :: functionalities/breakpoint/breakpoint_ignore_count/TestBreakpointIgnoreCount.py (2109 of 2474) PASS: lldb-api :: functionalities/data-formatter/data-formatter-skip-summary/TestDataFormatterSkipSummary.py (2110 of 2474) PASS: lldb-shell :: Register/Core/x86-32-netbsd-addr.test (2111 of 2474) PASS: lldb-unit :: Utility/./UtilityTests/ScalarTest.GetValue (2112 of 2474) PASS: lldb-api :: commands/expression/xvalue/TestXValuePrinting.py (2113 of 2474) PASS: lldb-api :: functionalities/thread/concurrent_events/TestConcurrentCrashWithBreak.py (2114 of 2474) PASS: lldb-unit :: UnwindAssembly/x86/./UnwindAssemblyx86Tests/Testx86AssemblyInspectionEngine.TestPopR12 (2115 of 2474) UNSUPPORTED: lldb-api :: lang/c/typedef/Testtypedef.py (2116 of 2474) PASS: lldb-unit :: SymbolFile/NativePDB/./SymbolFileNativePDBTests/PDBFPOProgramToDWARFExpressionTests.InvalidAssignmentMultiple (2117 of 2474) PASS: lldb-unit :: Process/Utility/./ProcessUtilityTests/ProcMapTests/LinuxProcMapsTestFixture.ParseMapRegions/3 (2118 of 2474) UNSUPPORTED: lldb-api :: lang/cpp/reference-to-outer-type/TestCppReferenceToOuterClass.py (2119 of 2474) PASS: lldb-unit :: Host/./HostTests/TerminalTest.SetHardwareFlowControl (2120 of 2474) UNSUPPORTED: lldb-api :: functionalities/data-formatter/data-formatter-stl/libstdcpp/tuple/TestDataFormatterStdTuple.py (2121 of 2474) PASS: lldb-api :: functionalities/multidebugger_commands/TestMultipleDebuggersCommands.py (2122 of 2474) PASS: lldb-unit :: Host/./HostTests/XML.GetAs (2123 of 2474) PASS: lldb-unit :: UnwindAssembly/x86/./UnwindAssemblyx86Tests/Testx86AssemblyInspectionEngine.Test64bitFramelessSmallStackFrame (2124 of 2474) PASS: lldb-unit :: Utility/./UtilityTests/StreamTeeTest.AppendStream (2125 of 2474) PASS: lldb-unit :: Utility/./UtilityTests/RangeVector.CombineConsecutiveRanges (2126 of 2474) PASS: lldb-api :: lang/c/const_variables/TestConstVariables.py (2127 of 2474) PASS: lldb-shell :: ObjectFile/ELF/riscv-arch.yaml (2128 of 2474) PASS: lldb-api :: lang/c/global_variables/TestGlobalVariables.py (2129 of 2474) PASS: lldb-api :: commands/expression/import-std-module/vector/TestVectorFromStdModule.py (2130 of 2474) PASS: lldb-api :: python_api/value_var_update/TestValueVarUpdate.py (2131 of 2474) PASS: lldb-unit :: Core/./LLDBCoreTests/SourceLocationSpecTest.Compare (2132 of 2474) PASS: lldb-unit :: Thread/./ThreadTests/ThreadTest.GetPrivateStopInfo (2133 of 2474) PASS: lldb-api :: commands/expression/import-std-module/empty-module/TestEmptyStdModule.py (2134 of 2474) PASS: lldb-unit :: ObjectFile/ELF/./ObjectFileELFTests/ObjectFileELFTest.GetSymtab_NoSymEntryPointArmAddressClass (2135 of 2474) PASS: lldb-shell :: Minidump/fb-dump.test (2136 of 2474) PASS: lldb-unit :: Utility/./UtilityTests/StreamTest.PutCStringWithStringRef (2137 of 2474) UNSUPPORTED: lldb-api :: benchmarks/expression/TestRepeatedExprs.py (2138 of 2474) PASS: lldb-unit :: Utility/./UtilityTests/ArgsTest.ReplaceArgumentAtIndexOutOfRange (2139 of 2474) PASS: lldb-shell :: SymbolFile/DWARF/x86/debug_rnglists-dwo.s (2140 of 2474) PASS: lldb-unit :: UnwindAssembly/x86/./UnwindAssemblyx86Tests/Testx86AssemblyInspectionEngine.TestPushRBPWithREX (2141 of 2474) PASS: lldb-shell :: Commands/command-backtrace-parser-1.test (2142 of 2474) UNSUPPORTED: lldb-api :: lang/objc/conflicting-class-list-function-from-user/TestObjCClassListFunctionFromUser.py (2143 of 2474) PASS: lldb-api :: functionalities/breakpoint/global_constructor/TestBreakpointInGlobalConstructor.py (2144 of 2474) PASS: lldb-unit :: Utility/./UtilityTests/LogChannelEnabledTest.LLDB_LOG_ERROR (2145 of 2474) PASS: lldb-shell :: SymbolFile/NativePDB/function-types-classes.cpp (2146 of 2474) PASS: lldb-unit :: SymbolFile/DWARF/./SymbolFileDWARFTests/SymbolFileDWARFTests.TestAbbrevOrder1Start1 (2147 of 2474) PASS: lldb-api :: functionalities/type_lookup/TestTypeLookup.py (2148 of 2474) UNSUPPORTED: lldb-api :: terminal/TestEditline.py (2149 of 2474) PASS: lldb-unit :: Utility/./UtilityTests/DataExtractorTest.GetBitfield (2150 of 2474) UNSUPPORTED: lldb-api :: linux/add-symbols/TestTargetSymbolsAddCommand.py (2151 of 2474) UNSUPPORTED: lldb-shell :: SymbolFile/DWARF/split-optimized.c (2152 of 2474) PASS: lldb-unit :: Utility/./UtilityTests/ProcessInstanceInfoList.Yaml (2153 of 2474) PASS: lldb-api :: lang/cpp/default-template-args/TestDefaultTemplateArgs.py (2154 of 2474) UNSUPPORTED: lldb-shell :: Register/arm-fp-read.test (2155 of 2474) PASS: lldb-api :: tools/lldb-server/TestLldbGdbServer.py (2156 of 2474) PASS: lldb-api :: commands/frame/diagnose/virtual-method-call/TestDiagnoseDereferenceVirtualMethodCall.py (2157 of 2474) PASS: lldb-shell :: ObjectFile/PECOFF/basic-info-arm64.yaml (2158 of 2474) PASS: lldb-unit :: Utility/./UtilityTests/BinaryStreamTest.PutSLEB128Zero (2159 of 2474) PASS: lldb-unit :: Core/./LLDBCoreTests/UniqueCStringMap.NoDefaultConstructor (2160 of 2474) UNSUPPORTED: lldb-api :: linux/aarch64/tagged_memory_region/TestAArch64LinuxTaggedMemoryRegion.py (2161 of 2474) PASS: lldb-api :: functionalities/data-formatter/ptr_ref_typedef/TestPtrRef2Typedef.py (2162 of 2474) PASS: lldb-unit :: Symbol/./SymbolTests/Type.CompilerContextPattern (2163 of 2474) PASS: lldb-unit :: ScriptInterpreter/Python/./ScriptInterpreterPythonTests/PythonDataObjectsTest.TestPythonDictionaryValueEquality (2164 of 2474) UNSUPPORTED: lldb-shell :: ScriptInterpreter/Lua/fail_breakpoint_oneline.test (2165 of 2474) PASS: lldb-api :: lang/objc/objc-struct-argument/TestObjCStructArgument.py (2166 of 2474) PASS: lldb-unit :: Interpreter/./InterpreterTests/OptionValueString.DeepCopy (2167 of 2474) PASS: lldb-api :: lang/objc/blocks/TestObjCIvarsInBlocks.py (2168 of 2474) PASS: lldb-api :: functionalities/gdb_remote_client/TestRegDefinitionInParts.py (2169 of 2474) PASS: lldb-unit :: debugserver/./debugserverTests/RNBSocket.LoopBackConnectIPv6 (2170 of 2474) PASS: lldb-api :: functionalities/data-formatter/data-formatter-advanced/TestDataFormatterAdv.py (2171 of 2474) PASS: lldb-unit :: Interpreter/./InterpreterTests/VerifyUserMultiwordCmdPathTest.TestErrors (2172 of 2474) PASS: lldb-unit :: Utility/./UtilityTests/StructuredDataTest.ParseJSONFromFile (2173 of 2474) PASS: lldb-api :: commands/apropos/with-process/TestAproposWithProcess.py (2174 of 2474) PASS: lldb-api :: types/TestFloatTypesExpr.py (2175 of 2474) PASS: lldb-unit :: Utility/./UtilityTests/CompletionRequest.TryCompleteCurrentArgGood (2176 of 2474) PASS: lldb-shell :: SymbolFile/NativePDB/tag-types.cpp (2177 of 2474) PASS: lldb-api :: macosx/save_crashlog/TestSaveCrashlog.py (2178 of 2474) PASS: lldb-shell :: SymbolFile/DWARF/x86/inline-function-address-shared.test (2179 of 2474) UNSUPPORTED: lldb-api :: commands/expression/multiline-completion/TestMultilineCompletion.py (2180 of 2474) PASS: lldb-shell :: ObjectFile/PECOFF/basic-info.yaml (2181 of 2474) XFAIL: lldb-shell :: Unwind/prefer-debug-over-eh-frame.test (2182 of 2474) PASS: lldb-unit :: Target/./TargetTests/DynamicRegisterInfoRegisterTest.SetRegisterInfo (2183 of 2474) PASS: lldb-unit :: Expression/./ExpressionTests/DWARFExpression.DW_OP_pick (2184 of 2474) PASS: lldb-unit :: Utility/./UtilityTests/StreamTeeTest.Constructor2Streams (2185 of 2474) PASS: lldb-api :: lang/cpp/typeof/TestTypeOfDeclTypeExpr.py (2186 of 2474) PASS: lldb-unit :: Core/./LLDBCoreTests/ModuleSpecTest.TestELFFile (2187 of 2474) PASS: lldb-api :: macosx/stack-corefile/TestStackCorefile.py (2188 of 2474) PASS: lldb-unit :: DataFormatter/./LLDBFormatterTests/TypeMatcherTests.RegexName (2189 of 2474) PASS: lldb-api :: functionalities/data-formatter/data-formatter-stl/libcxx/variant/TestDataFormatterLibcxxVariant.py (2190 of 2474) PASS: lldb-api :: functionalities/target_var/TestTargetVar.py (2191 of 2474) PASS: lldb-api :: lang/objcxx/objc-builtin-types/TestObjCBuiltinTypes.py (2192 of 2474) PASS: lldb-shell :: Reproducer/TestWorkingDir.test (2193 of 2474) UNSUPPORTED: lldb-api :: linux/aarch64/mte_memory_region/TestAArch64LinuxMTEMemoryRegion.py (2194 of 2474) PASS: lldb-unit :: Utility/./UtilityTests/CompletionRequest.DuplicateFilteringWithComments (2195 of 2474) PASS: lldb-api :: functionalities/breakpoint/cpp_exception/TestCPPExceptionBreakpoint.py (2196 of 2474) UNSUPPORTED: lldb-api :: commands/gui/basicdebug/TestGuiBasicDebug.py (2197 of 2474) PASS: lldb-unit :: Utility/./UtilityTests/ArgsTest.AppendArguments (2198 of 2474) PASS: lldb-unit :: Utility/./UtilityTests/ScalarTest.SetValueFromData (2199 of 2474) PASS: lldb-api :: lang/c/unions/TestUnionMembers.py (2200 of 2474) PASS: lldb-api :: functionalities/completion/TestCompletion.py (2201 of 2474) PASS: lldb-unit :: Utility/./UtilityTests/ProcessInstanceInfo.Yaml (2202 of 2474) PASS: lldb-unit :: Utility/./UtilityTests/StringExtractorTest.GetNameColonValueNoSemicolon (2203 of 2474) PASS: lldb-shell :: Register/Core/x86-32-linux-gp.test (2204 of 2474) PASS: lldb-unit :: Expression/./ExpressionTests/DWARFExpression.DW_OP_implicit_value (2205 of 2474) UNSUPPORTED: lldb-shell :: ExecControl/StopHook/stop-hook-threads.test (2206 of 2474) PASS: lldb-shell :: ObjectFile/Breakpad/uuid-matching-mac.test (2207 of 2474) PASS: lldb-shell :: ScriptInterpreter/Python/Crashlog/parser_text.test (2208 of 2474) PASS: lldb-unit :: Platform/Android/./AdbClientTests/AdbClientTest.CreateByDeviceId_ByEnvVar (2209 of 2474) PASS: lldb-unit :: Platform/./LLDBPlatformTests/PlatformAppleSimulatorTest.TestHostPlatformToSim (2210 of 2474) UNSUPPORTED: lldb-api :: functionalities/data-formatter/data-formatter-stl/libstdcpp/map/TestDataFormatterStdMap.py (2211 of 2474) PASS: lldb-unit :: Utility/./UtilityTests/StreamTest.PutHex8 (2212 of 2474) PASS: lldb-api :: macosx/function-starts/TestFunctionStarts.py (2213 of 2474) PASS: lldb-unit :: Utility/./UtilityTests/ArgsTest.ReplaceArgumentAtIndexLonger (2214 of 2474) PASS: lldb-unit :: Utility/./UtilityTests/Flags.AnySet (2215 of 2474) PASS: lldb-api :: commands/expression/import-std-module/queue/TestQueueFromStdModule.py (2216 of 2474) PASS: lldb-api :: lang/c/record_decl_in_expr/TestRecordDeclInExpr.py (2217 of 2474) PASS: lldb-api :: lang/c/function_types/TestFunctionTypes.py (2218 of 2474) PASS: lldb-unit :: Process/gdb-remote/./ProcessGdbRemoteTests/GDBRemoteCommunicationClientTest.ReadMemoryTags (2219 of 2474) PASS: lldb-unit :: Utility/./UtilityTests/ConstStringTest.YAML (2220 of 2474) PASS: lldb-api :: commands/expression/completion-in-lambda-and-unnamed-class/TestCompletionInLambdaAndUnnamedClass.py (2221 of 2474) PASS: lldb-api :: commands/expression/dont_allow_jit/TestAllowJIT.py (2222 of 2474) PASS: lldb-shell :: Breakpoint/debug_rnglistx_rlex.test (2223 of 2474) PASS: lldb-api :: commands/expression/formatters/TestFormatters.py (2224 of 2474) PASS: lldb-api :: functionalities/data-formatter/data-formatter-synthval/TestDataFormatterSynthVal.py (2225 of 2474) PASS: lldb-api :: functionalities/float-display/TestFloatDisplay.py (2226 of 2474) UNSUPPORTED: lldb-api :: tools/lldb-server/libraries-svr4/TestGdbRemoteLibrariesSvr4Support.py (2227 of 2474) PASS: lldb-shell :: Register/Core/x86-64-netbsd-fp.test (2228 of 2474) PASS: lldb-unit :: Utility/./UtilityTests/StringListTest.ForRange (2229 of 2474) PASS: lldb-api :: functionalities/breakpoint/breakpoint_locations/TestBreakpointLocations.py (2230 of 2474) PASS: lldb-api :: lang/cpp/dynamic-value-same-basename/TestDynamicValueSameBase.py (2231 of 2474) PASS: lldb-api :: api/multiple-targets/TestMultipleTargets.py (2232 of 2474) PASS: lldb-api :: functionalities/postmortem/minidump-new/TestMiniDumpUUID.py (2233 of 2474) UNSUPPORTED: lldb-shell :: Register/x86-64-xmm16-write.test (2234 of 2474) PASS: lldb-unit :: Core/./LLDBCoreTests/RichManglingContextTest.IPDRealloc (2235 of 2474) PASS: lldb-shell :: ObjectFile/ELF/compressed-sections.yaml (2236 of 2474) PASS: lldb-unit :: Symbol/./SymbolTests/DWARFCallFrameInfoTest.Basic_dwarf4 (2237 of 2474) PASS: lldb-unit :: Core/./LLDBCoreTests/DumpDataExtractorTest.NullStream (2238 of 2474) PASS: lldb-unit :: Symbol/./SymbolTests/PostfixExpression.ToDWARF (2239 of 2474) PASS: lldb-unit :: Target/./TargetTests/ModuleCacheTest.GetAndPut (2240 of 2474) PASS: lldb-api :: commands/expression/import-std-module/vector-of-vectors/TestVectorOfVectorsFromStdModule.py (2241 of 2474) PASS: lldb-shell :: Reproducer/TestVersionCheck.test (2242 of 2474) PASS: lldb-api :: functionalities/thread/ignore_suspended/TestIgnoreSuspendedThread.py (2243 of 2474) PASS: lldb-shell :: ObjectFile/ELF/duplicate-section.yaml (2244 of 2474) PASS: lldb-unit :: Utility/./UtilityTests/NameMatchesTest.Equals (2245 of 2474) PASS: lldb-unit :: Symbol/./SymbolTests/TestTypeSystemClang.TestFunctionTemplateConstruction (2246 of 2474) PASS: lldb-unit :: Core/./LLDBCoreTests/StreamCallbackTest.Callback (2247 of 2474) PASS: lldb-shell :: Register/Core/x86-32-freebsd-gp.test (2248 of 2474) PASS: lldb-api :: functionalities/data-formatter/data-formatter-stl/generic/bitset/TestDataFormatterGenericBitset.py (2249 of 2474) PASS: lldb-unit :: Core/./LLDBCoreTests/SourceLocationSpecTest.OperatorBool (2250 of 2474) UNSUPPORTED: lldb-api :: commands/trace/TestTraceSchema.py (2251 of 2474) PASS: lldb-shell :: SymbolFile/DWARF/x86/dwo-type-in-main-file.s (2252 of 2474) PASS: lldb-api :: commands/frame/diagnose/bad-reference/TestBadReference.py (2253 of 2474) PASS: lldb-api :: tools/lldb-server/thread-name/TestGdbRemoteThreadName.py (2254 of 2474) PASS: lldb-unit :: Language/Highlighting/./HighlighterTests/HighlighterTest.DefaultHighlighterWithCursorOutOfBounds (2255 of 2474) PASS: lldb-api :: commands/expression/import_base_class_when_class_has_derived_member/TestImportBaseClassWhenClassHasDerivedMember.py (2256 of 2474) UNSUPPORTED: lldb-shell :: Subprocess/vfork-follow-child.test (2257 of 2474) PASS: lldb-api :: commands/command/script/import/TestImport.py (2258 of 2474) UNSUPPORTED: lldb-shell :: ScriptInterpreter/Lua/command_script_import.test (2259 of 2474) PASS: lldb-api :: lang/c/struct_types/TestStructTypes.py (2260 of 2474) PASS: lldb-unit :: SymbolFile/DWARF/./SymbolFileDWARFTests/SymbolFileDWARFTests.TestAbbrevOutOfOrder (2261 of 2474) PASS: lldb-shell :: Commands/command-disassemble-process.yaml (2262 of 2474) PASS: lldb-unit :: Host/./HostTests/TerminalTest.SaveRestoreRAII (2263 of 2474) PASS: lldb-unit :: Core/./LLDBCoreTests/FormatEntityTest.DefinitionConstructionNameAndString (2264 of 2474) PASS: lldb-unit :: Host/./HostTests/TerminalTest.SetStopBits (2265 of 2474) PASS: lldb-api :: functionalities/jitloader_gdb/TestJITLoaderGDB.py (2266 of 2474) PASS: lldb-unit :: Utility/./UtilityTests/StringListTest.ShiftMove (2267 of 2474) PASS: lldb-unit :: Editline/./EditlineTests/EditlineTestFixture.EditlineReceivesSingleLineText (2268 of 2474) PASS: lldb-unit :: Symbol/./SymbolTests/LineEntryTest.GetAllExactLineColumnMatches (2269 of 2474) UNSUPPORTED: lldb-api :: functionalities/longjmp/TestLongjmp.py (2270 of 2474) PASS: lldb-unit :: Core/./LLDBCoreTests/ModuleSpecTest.InvalidInMemoryBuffer (2271 of 2474) PASS: lldb-api :: functionalities/data-formatter/type_summary_list_arg/TestTypeSummaryListArg.py (2272 of 2474) PASS: lldb-api :: lang/cpp/limit-debug-info/TestWithLimitDebugInfo.py (2273 of 2474) PASS: lldb-unit :: Utility/./UtilityTests/StringListTest.GetMaxStringLengthDecreasingSize (2274 of 2474) PASS: lldb-unit :: Process/gdb-remote/./ProcessGdbRemoteTests/GDBRemoteCommunicationServerTest.SendErrorResponse_Status (2275 of 2474) PASS: lldb-api :: functionalities/thread/concurrent_events/TestConcurrentTwoWatchpointsOneSignal.py (2276 of 2474) PASS: lldb-api :: lang/objc/objc-new-syntax/TestObjCNewSyntaxLiteral.py (2277 of 2474) PASS: lldb-api :: functionalities/memory/cache/TestMemoryCache.py (2278 of 2474) PASS: lldb-unit :: Process/Utility/./ProcessUtilityTests/RegisterContext_x86Test.AbridgedToFullTagWord (2279 of 2474) PASS: lldb-unit :: Process/Utility/./ProcessUtilityTests/MemoryTagManagerAArch64MTETest.ExpandToGranule (2280 of 2474) PASS: lldb-api :: lang/objc/complete-type-check/TestObjCIsTypeComplete.py (2281 of 2474) UNSUPPORTED: lldb-shell :: Minidump/Windows/arm-fp-unwind.test (2282 of 2474) PASS: lldb-shell :: Reproducer/TestDriverOptions.test (2283 of 2474) PASS: lldb-unit :: Host/./HostTests/NativeProcessProtocolTest.SetBreakpointFailVerify (2284 of 2474) PASS: lldb-api :: lang/cpp/pointer_to_member_type_depending_on_parent_size/TestPointerToMemberTypeDependingOnParentSize.py (2285 of 2474) PASS: lldb-unit :: UnwindAssembly/x86/./UnwindAssemblyx86Tests/Testx86AssemblyInspectionEngine.Testi386IgnoredRegisters (2286 of 2474) UNSUPPORTED: lldb-api :: macosx/simulator/TestSimulatorPlatform.py (2287 of 2474) PASS: lldb-unit :: Utility/./UtilityTests/OptionsWithRawTest.UnterminatedQuote (2288 of 2474) PASS: lldb-unit :: Utility/./UtilityTests/TimerTest.CategoryTimes2 (2289 of 2474) PASS: lldb-shell :: Register/Core/x86-32-freebsd-multithread.test (2290 of 2474) PASS: lldb-api :: commands/watchpoints/watchpoint_commands/condition/TestWatchpointConditionCmd.py (2291 of 2474) PASS: lldb-unit :: Utility/./UtilityTests/FileSpecTest.RemoveLastPathComponent (2292 of 2474) UNSUPPORTED: lldb-shell :: SymbolFile/PDB/expressions.test (2293 of 2474) PASS: lldb-unit :: Expression/./ExpressionTests/DiagnosticManagerTest.PutStringMultiple (2294 of 2474) PASS: lldb-shell :: Commands/command-disassemble.s (2295 of 2474) PASS: lldb-shell :: Process/Optimization.test (2296 of 2474) PASS: lldb-shell :: ScriptInterpreter/Python/command_relative_import.test (2297 of 2474) PASS: lldb-unit :: Utility/./UtilityTests/StringExtractorTest.GetU64LittleEndian (2298 of 2474) PASS: lldb-unit :: Host/./HostTests/TerminalTest.SetBaudRate (2299 of 2474) PASS: lldb-shell :: SymbolFile/DWARF/x86/dwarf5-partial-index.cpp (2300 of 2474) PASS: lldb-unit :: Host/./HostTests/TerminalTest.SetParityCheck (2301 of 2474) PASS: lldb-unit :: Utility/./UtilityTests/BinaryStreamTest.PutULEB128MaxValue (2302 of 2474) PASS: lldb-unit :: Process/minidump/./LLDBMinidumpTests/MinidumpParserTest.GetPidWindows (2303 of 2474) PASS: lldb-api :: commands/target/select/TestTargetSelect.py (2304 of 2474) PASS: lldb-unit :: Host/./HostTests/PipeTest.OpenAsReader (2305 of 2474) PASS: lldb-unit :: Utility/./UtilityTests/FileSpecTest.EqualDotsPosix (2306 of 2474) PASS: lldb-shell :: SymbolFile/DWARF/x86/array-sizes.s (2307 of 2474) PASS: lldb-api :: functionalities/breakpoint/serialize/TestBreakpointSerialization.py (2308 of 2474) PASS: lldb-api :: commands/expression/import_builtin_fileid/TestImportBuiltinFileID.py (2309 of 2474) PASS: lldb-unit :: Utility/./UtilityTests/SerializationRountripTest.SerializeDeserializeCString (2310 of 2474) PASS: lldb-unit :: DataFormatter/./LLDBFormatterTests/StringPrinterTests.SwiftUTF8 (2311 of 2474) PASS: lldb-api :: functionalities/data-formatter/data-formatter-stl/libcxx/shared_ptr/TestDataFormatterLibcxxSharedPtr.py (2312 of 2474) PASS: lldb-unit :: UnwindAssembly/x86/./UnwindAssemblyx86Tests/Testx86AssemblyInspectionEngine.TestPushEAX (2313 of 2474) PASS: lldb-unit :: SymbolFile/DWARF/./SymbolFileDWARFTests/DWARFASTParserClangTests.EnsureAllDIEsInDeclContextHaveBeenParsedParsesOnlyMatchingEntries (2314 of 2474) UNSUPPORTED: lldb-shell :: SymbolFile/NativePDB/stack_unwinding01.cpp (2315 of 2474) PASS: lldb-unit :: Utility/./UtilityTests/RangeTest.NotEqual (2316 of 2474) PASS: lldb-api :: functionalities/data-formatter/data-formatter-stl/libcxx/unique_ptr/TestDataFormatterLibcxxUniquePtr.py (2317 of 2474) PASS: lldb-unit :: Expression/./ExpressionTests/DiagnosticManagerTest.AppendMessageNoDiag (2318 of 2474) PASS: lldb-unit :: UnwindAssembly/x86/./UnwindAssemblyx86Tests/Testx86AssemblyInspectionEngine.TestPopRBX (2319 of 2474) PASS: lldb-unit :: Utility/./UtilityTests/StreamTest.ShiftOperatorPtr (2320 of 2474) PASS: lldb-api :: commands/process/launch-with-shellexpand/TestLaunchWithShellExpand.py (2321 of 2474) PASS: lldb-shell :: Register/Core/x86-64-netbsd-multithread.test (2322 of 2474) UNSUPPORTED: lldb-api :: functionalities/asan/TestMemoryHistory.py (2323 of 2474) PASS: lldb-api :: functionalities/gdb_remote_client/TestRecognizeBreakpoint.py (2324 of 2474) PASS: lldb-shell :: Register/x86-64-read.test (2325 of 2474) PASS: lldb-unit :: Utility/./UtilityTests/StringExtractorTest.GetU32LittleEndian (2326 of 2474) UNSUPPORTED: lldb-api :: python_api/event/TestEvents.py (2327 of 2474) PASS: lldb-api :: commands/platform/basic/TestPlatformPython.py (2328 of 2474) PASS: lldb-unit :: Core/./LLDBCoreTests/RichManglingContextTest.SwitchProvider (2329 of 2474) PASS: lldb-unit :: SymbolFile/NativePDB/./SymbolFileNativePDBTests/PDBFPOProgramToDWARFExpressionTests.UnresolvedRegisterReference (2330 of 2474) PASS: lldb-shell :: ObjectFile/PECOFF/section-types.yaml (2331 of 2474) PASS: lldb-shell :: ObjectFile/PECOFF/symbol.yaml (2332 of 2474) PASS: lldb-unit :: ObjectFile/Breakpad/./ObjectFileBreakpadTests/Record.classify (2333 of 2474) PASS: lldb-api :: tools/lldb-vscode/stackTrace/TestVSCode_stackTrace.py (2334 of 2474) PASS: lldb-unit :: Utility/./UtilityTests/BinaryStreamTest.PutULEB128EightBytes (2335 of 2474) UNSUPPORTED: lldb-shell :: ScriptInterpreter/Lua/bindings.test (2336 of 2474) PASS: lldb-unit :: Utility/./UtilityTests/RecordReplayTest.InstrumentedBarRef (2337 of 2474) PASS: lldb-api :: commands/breakpoint/set/func-regex/TestBreakpointRegexError.py (2338 of 2474) PASS: lldb-unit :: Utility/./UtilityTests/StringListTest.DefaultConstructor (2339 of 2474) PASS: lldb-shell :: SymbolFile/DWARF/x86/dead-code-filtering.yaml (2340 of 2474) PASS: lldb-api :: commands/expression/import-std-module/forward_list-dbg-info-content/TestDbgInfoContentForwardListFromStdModule.py (2341 of 2474) PASS: lldb-unit :: Utility/./UtilityTests/ArgsTest.StringListConstructor (2342 of 2474) PASS: lldb-unit :: Symbol/./SymbolTests/DWARFCallFrameInfoTest.Basic_eh (2343 of 2474) PASS: lldb-unit :: SymbolFile/NativePDB/./SymbolFileNativePDBTests/PDBFPOProgramToDWARFExpressionTests.SingleAssignmentRegisterRef (2344 of 2474) PASS: lldb-api :: functionalities/data-formatter/data-formatter-objc/TestDataFormatterObjCNSDate.py (2345 of 2474) UNSUPPORTED: lldb-shell :: SymbolFile/DWARF/split-dwarf-expression-eval-bug.cpp (2346 of 2474) PASS: lldb-api :: commands/expression/entry-bp/TestExprEntryBP.py (2347 of 2474) PASS: lldb-api :: functionalities/data-formatter/refpointer-recursion/TestDataFormatterRefPtrRecursion.py (2348 of 2474) UNSUPPORTED: lldb-api :: commands/watchpoints/multi_watchpoint_slots/TestWatchpointMultipleSlots.py (2349 of 2474) PASS: lldb-shell :: Reproducer/TestDSYM.test (2350 of 2474) PASS: lldb-unit :: Host/./HostTests/File.GetWaitableHandleFileno (2351 of 2474) PASS: lldb-api :: python_api/module_section/TestModuleAndSection.py (2352 of 2474) PASS: lldb-api :: python_api/function_symbol/TestDisasmAPI.py (2353 of 2474) UNSUPPORTED: lldb-shell :: SymbolFile/PDB/ast-restore.test (2354 of 2474) PASS: lldb-shell :: ObjectFile/PECOFF/export-dllfunc.yaml (2355 of 2474) PASS: lldb-unit :: UnwindAssembly/x86/./UnwindAssemblyx86Tests/Testx86AssemblyInspectionEngine.TestPushExtended (2356 of 2474) PASS: lldb-unit :: Utility/./UtilityTests/LogChannelTest.EnableOptions (2357 of 2474) PASS: lldb-unit :: Host/./HostTests/SocketTests/SocketTest.TCPGetConnectURI/ipv4 (2358 of 2474) PASS: lldb-unit :: Target/./TargetTests/PathMappingListTest.CrossPlatformTests (2359 of 2474) PASS: lldb-api :: commands/reproducer/invalid-args/TestInvalidArgsReproducer.py (2360 of 2474) PASS: lldb-api :: functionalities/breakpoint/breakpoint_command/TestBreakpointCommand.py (2361 of 2474) PASS: lldb-unit :: Target/./TargetTests/ModuleCacheTest.GetAndPutStrangeHostname (2362 of 2474) PASS: lldb-unit :: Utility/./UtilityTests/StringExtractorTest.GetHexU8_Extra (2363 of 2474) PASS: lldb-unit :: Host/./HostTests/MainLoopTest.UnmonitoredSignal (2364 of 2474) PASS: lldb-api :: functionalities/data-formatter/data-formatter-stl/libcxx/vbool/TestDataFormatterLibcxxVBool.py (2365 of 2474) PASS: lldb-shell :: SymbolFile/NativePDB/ast-functions.cpp (2366 of 2474) PASS: lldb-api :: functionalities/inferior-crashing/recursive-inferior/TestRecursiveInferiorStep.py (2367 of 2474) PASS: lldb-unit :: Expression/./ExpressionTests/CppModuleConfigurationTest.LinuxLocalLibCpp (2368 of 2474) PASS: lldb-unit :: Utility/./UtilityTests/StringListTest.Clear (2369 of 2474) PASS: lldb-api :: lang/cpp/symbols/TestSymbols.py (2370 of 2474) PASS: lldb-unit :: Process/minidump/./LLDBMinidumpTests/MinidumpParserTest.MinidumpDuplicateModuleMappedFirst (2371 of 2474) PASS: lldb-unit :: Utility/./UtilityTests/SubsystemRAIITest.NormalSubsystem (2372 of 2474) PASS: lldb-unit :: Utility/./UtilityTests/StringLexerTest.Next (2373 of 2474) PASS: lldb-api :: commands/expression/inline-namespace/TestInlineNamespace.py (2374 of 2474) UNSUPPORTED: lldb-api :: functionalities/tsan/cpp_global_location/TestTsanCPPGlobalLocation.py (2375 of 2474) PASS: lldb-unit :: Utility/./UtilityTests/BinaryStreamTest.PutSLEB128One (2376 of 2474) PASS: lldb-unit :: Utility/./UtilityTests/StringExtractorTest.GetNameColonValueNoColon (2377 of 2474) PASS: lldb-unit :: Expression/./ExpressionTests/ClangHostTest.ComputeClangResourceDirectory (2378 of 2474) PASS: lldb-unit :: Process/gdb-remote/./ProcessGdbRemoteTests/GDBRemoteCommunicationClientTest.GetMemoryRegionInfoInvalidResponse (2379 of 2474) PASS: lldb-unit :: Target/./TargetTests/ExecutionContextTest.GetByteOrderProcess (2380 of 2474) PASS: lldb-unit :: Utility/./UtilityTests/StringListTest.GetMaxStringLengthEmpty (2381 of 2474) PASS: lldb-unit :: Utility/./UtilityTests/SerializationRountripTest.SerializeDeserializePodReferences (2382 of 2474) PASS: lldb-api :: functionalities/data-formatter/poarray/TestPrintObjectArray.py (2383 of 2474) PASS: lldb-unit :: Utility/./UtilityTests/ScalarTest.ComparisonFloat (2384 of 2474) PASS: lldb-unit :: Utility/./UtilityTests/StreamTeeTest.GetStreamAtIndexOutOfBoundsEmpty (2385 of 2474) PASS: lldb-unit :: Utility/./UtilityTests/StringListTest.SplitIntoLinesSingleTrailingCR (2386 of 2474) UNSUPPORTED: lldb-api :: iohandler/completion/TestIOHandlerCompletion.py (2387 of 2474) PASS: lldb-shell :: SymbolFile/DWARF/x86/debug_loclists-dwp.s (2388 of 2474) XFAIL: lldb-shell :: Register/x86-mm-xmm-write.test (2389 of 2474) PASS: lldb-shell :: SymbolFile/DWARF/x86/debug-types-dwarf5.s (2390 of 2474) PASS: lldb-api :: commands/help/TestHelp.py (2391 of 2474) PASS: lldb-shell :: Minidump/Windows/find-module.test (2392 of 2474) PASS: lldb-unit :: Utility/./UtilityTests/LogChannelEnabledTest.LogGetLogThread (2393 of 2474) PASS: lldb-unit :: Utility/./UtilityTests/StringListTest.JoinEmpty (2394 of 2474) PASS: lldb-shell :: SymbolFile/DWARF/x86/gnu-style-compression.cpp (2395 of 2474) PASS: lldb-api :: lang/c/tls_globals/TestTlsGlobals.py (2396 of 2474) PASS: lldb-unit :: debugserver/./debugserverTests/RNBSocket.LoopBackListenIPv6 (2397 of 2474) PASS: lldb-unit :: UnwindAssembly/x86/./UnwindAssemblyx86Tests/Testx86AssemblyInspectionEngine.TestSpillRegToStackViaMOVi386 (2398 of 2474) PASS: lldb-unit :: ScriptInterpreter/Python/./ScriptInterpreterPythonTests/PythonDataObjectsTest.TestPythonFile (2399 of 2474) PASS: lldb-shell :: SymbolFile/NativePDB/s_constant.cpp (2400 of 2474) PASS: lldb-unit :: Process/minidump/./LLDBMinidumpTests/MinidumpParserTest.GetFilteredModuleList (2401 of 2474) PASS: lldb-unit :: Utility/./UtilityTests/StreamTeeTest.SetStreamAtIndexOverwrite (2402 of 2474) PASS: lldb-unit :: Language/Highlighting/./HighlighterTests/HighlighterTest.ClangCursorPosBeforeOtherToken (2403 of 2474) PASS: lldb-unit :: Utility/./UtilityTests/VASprintfTest.BufferResize (2404 of 2474) PASS: lldb-api :: functionalities/breakpoint/break_in_loaded_dylib/TestBreakInLoadedDylib.py (2405 of 2474) UNSUPPORTED: lldb-api :: tools/lldb-server/vCont-threads/TestGdbRemote_vContThreads.py (2406 of 2474) UNSUPPORTED: lldb-api :: functionalities/unwind/ehframe/TestEhFrameUnwind.py (2407 of 2474) PASS: lldb-unit :: Utility/./UtilityTests/RangeDataVector.FindEntryIndexesThatContain_Overlap (2408 of 2474) PASS: lldb-api :: functionalities/data-formatter/array_typedef/TestArrayTypedef.py (2409 of 2474) PASS: lldb-unit :: Utility/./UtilityTests/RangeTest.ClearWithStarAddress (2410 of 2474) PASS: lldb-api :: functionalities/gdb_remote_client/TestPlatformClient.py (2411 of 2474) PASS: lldb-shell :: ScriptInterpreter/Python/Crashlog/parser_json.test (2412 of 2474) PASS: lldb-api :: lang/cpp/subst_template_type_param/TestSubstTemplateTypeParam.py (2413 of 2474) UNSUPPORTED: lldb-shell :: Expr/TestIRMemoryMapWindows.test (2414 of 2474) PASS: lldb-api :: functionalities/data-formatter/data-formatter-objc/TestDataFormatterObjCNSBundle.py (2415 of 2474) PASS: lldb-api :: functionalities/backticks/TestBackticksWithoutATarget.py (2416 of 2474) PASS: lldb-unit :: ScriptInterpreter/Python/./ScriptInterpreterPythonTests/PythonDataObjectsTest.TestObjectAttributes (2417 of 2474) XFAIL: lldb-shell :: Register/x86-64-fp-write.test (2418 of 2474) PASS: lldb-unit :: Utility/./UtilityTests/OptionsWithRawTest.SingleWhitespaceInput (2419 of 2474) PASS: lldb-unit :: Utility/./UtilityTests/XcodeSDKTest.GetSDKTypeForTriple (2420 of 2474) PASS: lldb-api :: functionalities/show_location/TestShowLocationDwarf5.py (2421 of 2474) PASS: lldb-api :: lang/objc/objc_direct-methods/TestObjCDirectMethods.py (2422 of 2474) UNSUPPORTED: lldb-shell :: Unwind/eh-frame-augment-noop.test (2423 of 2474) PASS: lldb-unit :: Utility/./UtilityTests/ScalarTest.APIntConstructor (2424 of 2474) PASS: lldb-api :: lang/objc/exceptions/TestObjCExceptions.py (2425 of 2474) PASS: lldb-api :: python_api/disassemble-raw-data/TestDisassembleRawData.py (2426 of 2474) PASS: lldb-api :: commands/process/signal/TestProcessSignal.py (2427 of 2474) PASS: lldb-api :: lang/cpp/inlines/TestInlines.py (2428 of 2474) PASS: lldb-api :: functionalities/thread/concurrent_events/TestConcurrentManyCrash.py (2429 of 2474) PASS: lldb-api :: lang/c/shared_lib_stripped_symbols/TestSharedLibStrippedSymbols.py (2430 of 2474) PASS: lldb-unit :: Utility/./UtilityTests/StringListTest.AppendListCStringArray (2431 of 2474) PASS: lldb-shell :: Minidump/disassemble-no-module.yaml (2432 of 2474) PASS: lldb-api :: lang/cpp/keywords_enabled/TestCppKeywordsEnabled.py (2433 of 2474) PASS: lldb-api :: commands/target/create-deps/TestTargetCreateDeps.py (2434 of 2474) PASS: lldb-shell :: Settings/TestStopCommandSourceOnError.test (2435 of 2474) PASS: lldb-api :: commands/apropos/basic/TestApropos.py (2436 of 2474) PASS: lldb-unit :: Process/gdb-remote/./ProcessGdbRemoteTests/GDBRemoteCommunicationClientTest.SendTraceSupportedPacket (2437 of 2474) PASS: lldb-api :: commands/command/invalid-args/TestInvalidArgsCommand.py (2438 of 2474) PASS: lldb-unit :: Utility/./UtilityTests/ConstStringTest.FromMidOfBufferStringRef (2439 of 2474) PASS: lldb-api :: commands/expression/import-std-module/vector-dbg-info-content/TestDbgInfoContentVectorFromStdModule.py (2440 of 2474) PASS: lldb-api :: lang/cpp/constructors/TestCppConstructors.py (2441 of 2474) PASS: lldb-api :: functionalities/data-formatter/type_summary_list_script/TestTypeSummaryListScript.py (2442 of 2474) PASS: lldb-api :: lang/cpp/signed_types/TestSignedTypes.py (2443 of 2474) PASS: lldb-shell :: Minidump/dump-all.test (2444 of 2474) PASS: lldb-api :: commands/expression/import-std-module/missing-module-sources/TestStdModuleSourcesMissing.py (2445 of 2474) PASS: lldb-unit :: Language/Highlighting/./HighlighterTests/HighlighterTest.ClangIdentifiers (2446 of 2474) UNSUPPORTED: lldb-api :: commands/trace/TestTraceLoad.py (2447 of 2474) PASS: lldb-unit :: Expression/./ExpressionTests/DiagnosticManagerTest.GetStringNoDiags (2448 of 2474) PASS: lldb-api :: lang/cpp/thread_local/TestThreadLocal.py (2449 of 2474) PASS: lldb-unit :: Utility/./UtilityTests/ScalarTest.RightShiftOperator (2450 of 2474) PASS: lldb-shell :: Commands/command-source.test (2451 of 2474) PASS: lldb-shell :: SymbolFile/DWARF/x86/debug-types-dwo-cross-reference.cpp (2452 of 2474) PASS: lldb-unit :: Utility/./UtilityTests/OptionsWithRawTest.ArgsButNoLeadingDash (2453 of 2474) PASS: lldb-unit :: ScriptInterpreter/Python/./ScriptInterpreterPythonTests/PythonDataObjectsTest.TestResetting (2454 of 2474) PASS: lldb-api :: lang/objc/rdar-11355592/TestRdar11355592.py (2455 of 2474) PASS: lldb-api :: functionalities/unused-inlined-parameters/TestUnusedInlinedParameters.py (2456 of 2474) UNSUPPORTED: lldb-api :: functionalities/thread/concurrent_events/TestConcurrentManySignals.py (2457 of 2474) PASS: lldb-unit :: Utility/./UtilityTests/StreamTeeTest.Write (2458 of 2474) PASS: lldb-unit :: ScriptInterpreter/Python/./ScriptInterpreterPythonTests/PythonDataObjectsTest.TestPythonInteger (2459 of 2474) PASS: lldb-api :: commands/expression/persistent_ptr_update/TestPersistentPtrUpdate.py (2460 of 2474) PASS: lldb-unit :: Utility/./UtilityTests/LogTest.Unregister (2461 of 2474) UNSUPPORTED: lldb-shell :: BuildScript/toolchain-msvc.test (2462 of 2474) PASS: lldb-api :: lang/cpp/virtual-overload/TestVirtualOverload.py (2463 of 2474) PASS: lldb-api :: functionalities/breakpoint/breakpoint_by_line_and_column/TestBreakpointByLineAndColumn.py (2464 of 2474) PASS: lldb-unit :: Utility/./UtilityTests/Flags.AnyClear (2465 of 2474) PASS: lldb-api :: functionalities/thread/create_after_attach/TestCreateAfterAttach.py (2466 of 2474) PASS: lldb-api :: functionalities/data-formatter/data-formatter-stl/libcxx/initializerlist/TestInitializerList.py (2467 of 2474) PASS: lldb-api :: commands/expression/unicode-in-variable/TestUnicodeInVariable.py (2468 of 2474) PASS: lldb-api :: python_api/watchpoint/watchlocation/TestSetWatchlocation.py (2469 of 2474) UNSUPPORTED: lldb-shell :: Subprocess/fork-follow-child.test (2470 of 2474) PASS: lldb-unit :: Utility/./UtilityTests/StringExtractorTest.DecodeHexU8_InvalidHex (2471 of 2474) PASS: lldb-api :: commands/expression/context-object/TestContextObject.py (2472 of 2474) PASS: lldb-api :: lang/objc/single-entry-dictionary/TestObjCSingleEntryDictionary.py (2473 of 2474) PASS: lldb-api :: lang/objc/foundation/TestObjCMethodsNSError.py (2474 of 2474) Slowest Tests: -------------------------------------------------------------------------- 267.64s: lldb-api :: tools/lldb-server/TestLldbGdbServer.py 196.63s: lldb-api :: functionalities/scripted_process/TestScriptedProcess.py 162.26s: lldb-api :: functionalities/memory-region/TestMemoryRegion.py 159.31s: lldb-api :: macosx/skinny-corefile/TestSkinnyCorefile.py 153.72s: lldb-api :: macosx/stack-corefile/TestStackCorefile.py 137.89s: lldb-api :: api/multithreaded/TestMultithreaded.py 91.47s: lldb-api :: functionalities/gdb_remote_client/TestWasm.py 89.42s: lldb-api :: types/TestLongTypesExpr.py 74.59s: lldb-api :: commands/expression/import-std-module/vector/TestVectorFromStdModule.py 71.91s: lldb-api :: lang/objc/exceptions/TestObjCExceptions.py 70.90s: lldb-api :: commands/process/attach/TestProcessAttach.py 70.59s: lldb-api :: commands/expression/import-std-module/queue/TestQueueFromStdModule.py 69.51s: lldb-api :: commands/expression/import-std-module/stack/TestStackFromStdModule.py 66.06s: lldb-api :: lang/objc/hidden-ivars/TestHiddenIvars.py 65.04s: lldb-api :: lang/cpp/namespace/TestNamespaceLookup.py 62.62s: lldb-api :: lang/objc/objc-new-syntax/TestObjCNewSyntaxLiteral.py 59.06s: lldb-api :: lang/objc/foundation/TestObjCMethods.py 55.30s: lldb-api :: types/TestIntegerTypeExpr.py 52.44s: lldb-api :: types/TestLongTypes.py 50.86s: lldb-api :: tools/lldb-server/TestGdbRemoteThreadsInStopReply.py

Hide Details

Tests Times: -------------------------------------------------------------------------- [ Range ] :: [ Percentage ] :: [ Count ] -------------------------------------------------------------------------- [260s,280s) :: [ ] :: [ 1/2474] [240s,260s) :: [ ] :: [ 0/2474] [220s,240s) :: [ ] :: [ 0/2474] [200s,220s) :: [ ] :: [ 1/2474] [180s,200s) :: [ ] :: [ 0/2474] [160s,180s) :: [ ] :: [ 3/2474] [140s,160s) :: [ ] :: [ 1/2474] [120s,140s) :: [ ] :: [ 0/2474] [100s,120s) :: [ ] :: [ 0/2474] [ 80s,100s) :: [ ] :: [ 2/2474] [ 60s, 80s) :: [ ] :: [ 9/2474] [ 40s, 60s) :: [ ] :: [ 18/2474] [ 20s, 40s) :: [* ] :: [ 82/2474] [ 0s, 20s) :: [************************************** ] :: [2357/2474] -------------------------------------------------------------------------- ******************** Failed Tests (1): lldb-api :: functionalities/scripted_process/TestScriptedProcess.py

Hide Details

Hide Details

Testing Time: 2692.56s Unsupported : 232 Passed : 2231 Expectedly Failed: 10 Failed : 1 FAILED: tools/lldb/test/CMakeFiles/check-lldb cd /Users/buildslave/jenkins/workspace/lldb-cmake-sanitized/lldb-build/tools/lldb/test && /usr/local/Frameworks/Python.framework/Versions/3.7/bin/python3.7 /Users/buildslave/jenkins/workspace/lldb-cmake-sanitized/lldb-build/./bin/llvm-lit -v --time-tests --shuffle --xunit-xml-output=/Users/buildslave/jenkins/workspace/lldb-cmake-sanitized/test/results.xml -v -j 4 --timeout 1200 /Users/buildslave/jenkins/workspace/lldb-cmake-sanitized/lldb-build/tools/lldb/test ninja: build stopped: subcommand failed. Command failed: Command '['/usr/bin/env', 'TERM=vt100', '/usr/local/bin/ninja', '-v', 'check-lldb']' returned non-zero exit status 1. Command: ['/usr/bin/env', 'TERM=vt100', '/usr/local/bin/ninja', '-v', 'check-lldb'] [Pipeline] } [Pipeline] // timeout [Pipeline] } [Pipeline] // stage [Pipeline] stage [Pipeline] { (Declarative: Post Actions) [Pipeline] scanForIssues [Clang] Sleeping for 5 seconds due to JENKINS-32191... [Clang] Parsing console log (workspace: '/Users/buildslave/jenkins/workspace/lldb-cmake-sanitized') [Clang] -> found 0 issues (skipped 0 duplicates) [Clang] Parsing console log (workspace: '/Users/buildslave/jenkins/workspace/lldb-cmake-sanitized') [Clang] -> found 0 issues (skipped 0 duplicates) [Clang] Successfully parsed console log [Clang] -> found 0 issues (skipped 0 duplicates) [Clang] Parsing console log (workspace: '/Users/buildslave/jenkins/workspace/lldb-cmake-sanitized') [Clang] Skipping post processing [Clang] No filter has been set, publishing all 0 issues [Clang] Repository miner is not configured, skipping repository mining [Pipeline] junit Recording test results [Checks API] No suitable checks publisher found. [Pipeline] } [Pipeline] // stage [Pipeline] } [Pipeline] // withEnv [Pipeline] } [Pipeline] // node [Pipeline] End of Pipeline ERROR: script returned exit code 1 Finished: FAILURE