Console Output

Skipping 9,585 KB.. Full Log
PASS: lldb-unit :: Process/gdb-remote/./ProcessGdbRemoteTests/GDBRemoteClientBaseTest.SendContinueAndInterrupt (1167 of 2474)
PASS: lldb-api :: commands/target/create-deps/TestTargetCreateDeps.py (1168 of 2474)
PASS: lldb-api :: lang/objc/objc-super/TestObjCSuper.py (1169 of 2474)
PASS: lldb-unit :: Utility/./UtilityTests/ArgsTest.TestUnknownEscape (1170 of 2474)
PASS: lldb-api :: lang/cpp/function-local-class/TestCppFunctionLocalClass.py (1171 of 2474)
PASS: lldb-api :: python_api/lldbutil/iter/TestLLDBIterator.py (1172 of 2474)
UNSUPPORTED: lldb-api :: functionalities/breakpoint/hardware_breakpoints/hardware_breakpoint_on_multiple_threads/TestHWBreakMultiThread.py (1173 of 2474)
PASS: lldb-api :: functionalities/mtc/simple/TestMTCSimple.py (1174 of 2474)
PASS: lldb-unit :: Utility/./UtilityTests/StringExtractorGDBRemoteTest.GetPidTidMultipleValues (1175 of 2474)
PASS: lldb-api :: functionalities/data-formatter/vector-types/TestVectorTypesFormatting.py (1176 of 2474)
PASS: lldb-api :: functionalities/postmortem/netbsd-core/TestNetBSDCore.py (1177 of 2474)
PASS: lldb-api :: lang/objc/objc-checker/TestObjCCheckers.py (1178 of 2474)
PASS: lldb-api :: functionalities/breakpoint/cpp_exception/TestCPPExceptionBreakpoint.py (1179 of 2474)
PASS: lldb-api :: lang/cpp/multiple-inheritance/TestCppMultipleInheritance.py (1180 of 2474)
PASS: lldb-api :: functionalities/gdb_remote_client/TestFork.py (1181 of 2474)
PASS: lldb-api :: python_api/sbtype_typeclass/TestSBTypeTypeClass.py (1182 of 2474)
PASS: lldb-unit :: Host/./HostTests/NativeProcessProtocolTest.SetBreakpointFailRead (1183 of 2474)
PASS: lldb-unit :: UnwindAssembly/x86/./UnwindAssemblyx86Tests/Testx86AssemblyInspectionEngine.TestPushRBP (1184 of 2474)
UNSUPPORTED: lldb-shell :: SymbolFile/PDB/type-quals.test (1185 of 2474)
PASS: lldb-unit :: Utility/./UtilityTests/VMRange.Ordering (1186 of 2474)
PASS: lldb-api :: python_api/lldbutil/process/TestPrintStackTraces.py (1187 of 2474)
PASS: lldb-api :: functionalities/data-formatter/data-formatter-enum-format/TestDataFormatterEnumFormat.py (1188 of 2474)
PASS: lldb-unit :: UnwindAssembly/x86/./UnwindAssemblyx86Tests/Testx86AssemblyInspectionEngine.TestSimplei386ugmented (1189 of 2474)
PASS: lldb-unit :: Symbol/./SymbolTests/TestTypeSystemClang.TestGetTypeClassDeclType (1190 of 2474)
PASS: lldb-unit :: Utility/./UtilityTests/StringListTest.AppendStringCString (1191 of 2474)
PASS: lldb-api :: functionalities/memory/tag/TestMemoryTag.py (1192 of 2474)
PASS: lldb-unit :: Platform/./LLDBPlatformTests/PlatformAppleSimulatorTest.TestSimHasSimEnvionament (1193 of 2474)
UNSUPPORTED: lldb-api :: functionalities/thread/multi_break/TestMultipleBreakpoints.py (1194 of 2474)
PASS: lldb-shell :: Breakpoint/split-dwarf-5-addrbase.test (1195 of 2474)
PASS: lldb-api :: commands/expression/ignore-artificial-constructors/TestIgnoreArtificialConstructors.py (1196 of 2474)
PASS: lldb-unit :: Language/Highlighting/./HighlighterTests/HighlighterTest.DefaultHighlighter (1197 of 2474)
PASS: lldb-unit :: Language/CPlusPlus/./LanguageCPlusPlusTests/CPlusPlusLanguage.GenerateAlternateFunctionManglings (1198 of 2474)
PASS: lldb-api :: commands/target/stop-hooks/TestStopHookScripted.py (1199 of 2474)
XFAIL: lldb-shell :: Register/x86-mm-xmm-write.test (1200 of 2474)
PASS: lldb-unit :: Target/./TargetTests/PathMappingListTest.RelativeTests (1201 of 2474)
PASS: lldb-api :: lang/c/step-target/TestStepTarget.py (1202 of 2474)
PASS: lldb-api :: lang/objc/rdar-11355592/TestRdar11355592.py (1203 of 2474)
PASS: lldb-api :: lang/cpp/struct_with_keyword_name/TestStructWithKeywordName.py (1204 of 2474)
PASS: lldb-api :: lang/cpp/incompatible-class-templates/TestCppIncompatibleClassTemplates.py (1205 of 2474)
PASS: lldb-unit :: Utility/./UtilityTests/SerializationRountripTest.SerializeDeserializeCStringNull (1206 of 2474)
PASS: lldb-api :: lang/cpp/dynamic-value-same-basename/TestDynamicValueSameBase.py (1207 of 2474)
PASS: lldb-api :: lang/objc/objc++/TestObjCXX.py (1208 of 2474)
PASS: lldb-api :: python_api/watchpoint/watchlocation/TestSetWatchlocation.py (1209 of 2474)
PASS: lldb-unit :: Process/minidump/./LLDBMinidumpTests/MinidumpParserTest.GetPid (1210 of 2474)
PASS: lldb-api :: functionalities/data-formatter/data-formatter-objc/TestDataFormatterObjCNSNumber.py (1211 of 2474)
PASS: lldb-api :: commands/expression/test/TestExprs.py (1212 of 2474)
PASS: lldb-shell :: ScriptInterpreter/None/import_module.test (1213 of 2474)
PASS: lldb-unit :: ScriptInterpreter/Python/./ScriptInterpreterPythonTests/PythonDataObjectsTest.TestPythonFile (1214 of 2474)
PASS: lldb-unit :: Core/./LLDBCoreTests/MangledTest.ResultForValidName (1215 of 2474)
PASS: lldb-shell :: Driver/TestHelp.test (1216 of 2474)
PASS: lldb-api :: python_api/symbol-context/two-files/TestSymbolContextTwoFiles.py (1217 of 2474)
PASS: lldb-api :: functionalities/testid/TestTestId.py (1218 of 2474)
PASS: lldb-api :: commands/expression/import_builtin_fileid/TestImportBuiltinFileID.py (1219 of 2474)
PASS: lldb-shell :: Register/Core/x86-64-netbsd-gp.test (1220 of 2474)
PASS: lldb-unit :: Host/./HostTests/XML.GetAs (1221 of 2474)
PASS: lldb-unit :: Language/Highlighting/./HighlighterTests/HighlighterTest.ClangEmptyInput (1222 of 2474)
PASS: lldb-unit :: Process/minidump/./LLDBMinidumpTests/MinidumpParserTest.GetThreadContext_x86_32 (1223 of 2474)
PASS: lldb-api :: functionalities/thread/concurrent_events/TestConcurrentBreakpointOneDelayBreakpointThreads.py (1224 of 2474)
PASS: lldb-unit :: SymbolFile/NativePDB/./SymbolFileNativePDBTests/PDBFPOProgramToDWARFExpressionTests.InvalidOpBinary (1225 of 2474)
PASS: lldb-unit :: Utility/./UtilityTests/AnsiTerminal.KnownPrefix (1226 of 2474)
PASS: lldb-unit :: Utility/./UtilityTests/StringExtractorTest.GetHexU8_Extra (1227 of 2474)
PASS: lldb-shell :: ObjectFile/PECOFF/sections.yaml (1228 of 2474)
PASS: lldb-unit :: debugserver/./debugserverTests/JSON.Parse (1229 of 2474)
PASS: lldb-api :: functionalities/data-formatter/data-formatter-stl/libcxx/shared_ptr/TestDataFormatterLibcxxSharedPtr.py (1230 of 2474)
PASS: lldb-unit :: SymbolFile/DWARF/./SymbolFileDWARFTests/DWARFASTParserClangTests.EnsureAllDIEsInDeclContextHaveBeenParsedParsesOnlyMatchingEntries (1231 of 2474)
PASS: lldb-unit :: Core/./LLDBCoreTests/DumpDataExtractorTest.NullStream (1232 of 2474)
PASS: lldb-api :: commands/expression/import-std-module/list/TestListFromStdModule.py (1233 of 2474)
PASS: lldb-api :: commands/frame/diagnose/local-variable/TestLocalVariable.py (1234 of 2474)
PASS: lldb-api :: lang/objc/variadic_methods/TestVariadicMethods.py (1235 of 2474)
PASS: lldb-api :: functionalities/data-formatter/builtin-formats/TestBuiltinFormats.py (1236 of 2474)
PASS: lldb-api :: functionalities/data-formatter/compactvectors/TestCompactVectors.py (1237 of 2474)
PASS: lldb-shell :: Minidump/Windows/find-module.test (1238 of 2474)
PASS: lldb-api :: commands/version/TestVersion.py (1239 of 2474)
PASS: lldb-api :: lang/cpp/type_lookup/TestCppTypeLookup.py (1240 of 2474)
PASS: lldb-unit :: Utility/./UtilityTests/OptionsWithRawTest.MultiWordSuffix (1241 of 2474)
PASS: lldb-shell :: ObjectFile/MachO/lc_build_version.yaml (1242 of 2474)
PASS: lldb-unit :: ObjectFile/MachO/./ObjectFileMachOTests/ObjectFileMachOTest.ModuleFromSharedCacheInfo (1243 of 2474)
PASS: lldb-unit :: Utility/./UtilityTests/StreamTest.PutSLEB128 (1244 of 2474)
PASS: lldb-unit :: Process/gdb-remote/./ProcessGdbRemoteTests/GDBRemoteCommunicationClientTest.SaveRestoreRegistersNoSuffix (1245 of 2474)
PASS: lldb-unit :: Process/gdb-remote/./ProcessGdbRemoteTests/GDBRemoteClientBaseTest.SendContinueAndWait (1246 of 2474)
PASS: lldb-unit :: Utility/./UtilityTests/LogChannelTest.EnableOptions (1247 of 2474)
PASS: lldb-unit :: Host/./HostTests/MainLoopTest.DetectsEOF (1248 of 2474)
PASS: lldb-api :: functionalities/tail_call_frames/sbapi_support/TestTailCallFrameSBAPI.py (1249 of 2474)
PASS: lldb-unit :: Utility/./UtilityTests/ScalarTest.ComparisonFloat (1250 of 2474)
PASS: lldb-unit :: Utility/./UtilityTests/StreamTeeTest.CopyConstructor (1251 of 2474)
UNSUPPORTED: lldb-api :: tools/lldb-server/TestGdbRemoteAuxvSupport.py (1252 of 2474)
PASS: lldb-shell :: SymbolFile/DWARF/x86/DW_AT_const_value-bitfields.s (1253 of 2474)
PASS: lldb-api :: functionalities/breakpoint/breakpoint_command/TestRegexpBreakCommand.py (1254 of 2474)
PASS: lldb-api :: functionalities/thread/concurrent_events/TestConcurrentDelaySignalWatch.py (1255 of 2474)
PASS: lldb-unit :: Utility/./UtilityTests/OptionsWithRawTest.WhitespaceInput (1256 of 2474)
PASS: lldb-unit :: Utility/./UtilityTests/StringExtractorTest.DecodeHexU8_Exact (1257 of 2474)
PASS: lldb-unit :: Language/Highlighting/./HighlighterTests/HighlighterTest.ClangBraces (1258 of 2474)
PASS: lldb-shell :: Commands/command-disassemble-process.yaml (1259 of 2474)
PASS: lldb-api :: lang/cpp/class_types/TestClassTypesDisassembly.py (1260 of 2474)
PASS: lldb-shell :: Commands/command-backtrace-parser-2.test (1261 of 2474)
PASS: lldb-unit :: Interpreter/./InterpreterTests/OptionValueFileColonLine.setFromString (1262 of 2474)
PASS: lldb-unit :: Process/gdb-remote/./ProcessGdbRemoteTests/GDBRemoteCommunicationTest.ReadPacket_checksum (1263 of 2474)
PASS: lldb-unit :: Utility/./UtilityTests/DataExtractorTest.PeekData (1264 of 2474)
PASS: lldb-unit :: Utility/./UtilityTests/UriParserTest.BracketedHostnameWithPortIPv4 (1265 of 2474)
PASS: lldb-shell :: ObjectFile/PECOFF/basic-info.yaml (1266 of 2474)
UNSUPPORTED: lldb-api :: commands/register/register/aarch64_sve_registers/rw_access_dynamic_resize/TestSVEThreadedDynamic.py (1267 of 2474)
PASS: lldb-unit :: Symbol/./SymbolTests/TestTypeSystemClang.TestGetTypeClassTypeOfExpr (1268 of 2474)
PASS: lldb-unit :: Interpreter/./InterpreterTests/OptionArgParserTest.toScriptLanguage (1269 of 2474)
PASS: lldb-unit :: tools/lldb-server/tests/./LLDBServerTests/StandardStartupTest.TestStopReplyContainsThreadPcs (1270 of 2474)
PASS: lldb-api :: functionalities/postmortem/elf-core/TestLinuxCore.py (1271 of 2474)
PASS: lldb-unit :: UnwindAssembly/x86/./UnwindAssemblyx86Tests/Testx86AssemblyInspectionEngine.TestPushR14 (1272 of 2474)
PASS: lldb-api :: functionalities/breakpoint/breakpoint_command/TestBreakpointCommandsFromPython.py (1273 of 2474)
PASS: lldb-unit :: ScriptInterpreter/Python/./ScriptInterpreterPythonTests/PythonDataObjectsTest.TestPythonStringToStr (1274 of 2474)
PASS: lldb-unit :: Utility/./UtilityTests/OptionsWithRawTest.UnterminatedQuote (1275 of 2474)
PASS: lldb-unit :: Target/./TargetTests/PathMappingListTest.RemapRoot (1276 of 2474)
PASS: lldb-unit :: Host/./HostTests/SocketTests/SocketTest.TCPGetConnectURI/ipv4 (1277 of 2474)
PASS: lldb-unit :: Utility/./UtilityTests/Flags.GetBitSize (1278 of 2474)
PASS: lldb-unit :: Core/./LLDBCoreTests/SourceLocationSpecTest.OperatorBool (1279 of 2474)
PASS: lldb-api :: lang/cpp/class-template-type-parameter-pack/TestClassTemplateTypeParameterPack.py (1280 of 2474)
PASS: lldb-unit :: Host/./HostTests/TerminalTest.SaveRestore (1281 of 2474)
PASS: lldb-unit :: Process/minidump/./LLDBMinidumpTests/MinidumpParserTest.MinidumpDuplicateModuleMappedSecondHigh (1282 of 2474)
PASS: lldb-unit :: Utility/./UtilityTests/StreamTest.PutHex16ByteOrderBig (1283 of 2474)
PASS: lldb-api :: api/listeners/TestListener.py (1284 of 2474)
PASS: lldb-unit :: Core/./LLDBCoreTests/DumpDataExtractorTest.StartOffset (1285 of 2474)
PASS: lldb-api :: commands/frame/diagnose/dereference-this/TestDiagnoseDereferenceThis.py (1286 of 2474)
PASS: lldb-api :: lang/cpp/operator-overload/TestOperatorOverload.py (1287 of 2474)
PASS: lldb-api :: commands/expression/pr35310/TestExprsBug35310.py (1288 of 2474)
PASS: lldb-api :: commands/disassemble/basic/TestFrameDisassemble.py (1289 of 2474)
PASS: lldb-unit :: Utility/./UtilityTests/ArchSpecTest.TestParseMachCPUDashSubtypeTripleExtra (1290 of 2474)
PASS: lldb-unit :: Utility/./UtilityTests/PassiveReplayTest.InstrumentedBar (1291 of 2474)
PASS: lldb-shell :: Reproducer/TestMultipleTargets.test (1292 of 2474)
UNSUPPORTED: lldb-api :: functionalities/data-formatter/data-formatter-stl/libstdcpp/tuple/TestDataFormatterStdTuple.py (1293 of 2474)
PASS: lldb-unit :: Core/./LLDBCoreTests/FormatEntityTest.DefinitionConstructionNameAndType (1294 of 2474)
PASS: lldb-unit :: Process/minidump/./LLDBMinidumpTests/MinidumpParserTest.GetThreadContext_x86_32_wow64 (1295 of 2474)
PASS: lldb-unit :: Utility/./UtilityTests/ConstStringTest.MangledCounterpart (1296 of 2474)
PASS: lldb-unit :: Host/./HostTests/TerminalTest.SetEcho (1297 of 2474)
PASS: lldb-shell :: ObjectFile/Breakpad/discontiguous-sections.test (1298 of 2474)
PASS: lldb-unit :: debugserver/./debugserverTests/RNBSocket.LoopBackListenIPv6 (1299 of 2474)
PASS: lldb-api :: commands/expression/import-std-module/vector-bool/TestVectorBoolFromStdModule.py (1300 of 2474)
PASS: lldb-unit :: Utility/./UtilityTests/UUIDTest.Validity (1301 of 2474)
PASS: lldb-unit :: ScriptInterpreter/Python/./ScriptInterpreterPythonTests/PythonDataObjectsTest.TestExceptions (1302 of 2474)
PASS: lldb-unit :: Target/./TargetTests/RemoteAwarePlatformTest.TestResolveExecutabelOnClientByPlatform (1303 of 2474)
UNSUPPORTED: lldb-api :: functionalities/unwind/ehframe/TestEhFrameUnwind.py (1304 of 2474)
PASS: lldb-unit :: Utility/./UtilityTests/ArgsTest.AppendArguments (1305 of 2474)
PASS: lldb-api :: lang/objc/objc-ivar-stripped/TestObjCIvarStripped.py (1306 of 2474)
PASS: lldb-api :: commands/expression/call-function/TestCallStopAndContinue.py (1307 of 2474)
UNSUPPORTED: lldb-api :: repl/clang/TestClangREPL.py (1308 of 2474)
PASS: lldb-shell :: SymbolFile/DWARF/x86/debug-types-signature-loop.s (1309 of 2474)
UNSUPPORTED: lldb-api :: commands/gui/basic/TestGuiBasic.py (1310 of 2474)
PASS: lldb-unit :: Utility/./UtilityTests/VASprintfTest.BufferResize (1311 of 2474)
PASS: lldb-api :: lang/cpp/namespace/TestNamespace.py (1312 of 2474)
PASS: lldb-unit :: Process/minidump/./LLDBMinidumpTests/RegisterContextMinidump.ConvertMinidumpContext_x86_64 (1313 of 2474)
PASS: lldb-unit :: Utility/./UtilityTests/RangeTest.ContainsAddrInvalid (1314 of 2474)
UNSUPPORTED: lldb-api :: functionalities/unwind/aarch64_unwind_pac/TestAArch64UnwindPAC.py (1315 of 2474)
PASS: lldb-unit :: Utility/./UtilityTests/ArchSpecTest.MergeFromMachOUnknown (1316 of 2474)
PASS: lldb-unit :: Core/./LLDBCoreTests/MangledTest.ResultForValidDLangName (1317 of 2474)
PASS: lldb-unit :: Core/./LLDBCoreTests/DumpDataExtractorTest.Formats (1318 of 2474)
PASS: lldb-shell :: Minidump/breakpad-symbols.test (1319 of 2474)
PASS: lldb-unit :: Expression/./ExpressionTests/DiagnosticManagerTest.AppendMessageSubsequentDiags (1320 of 2474)
PASS: lldb-shell :: Reproducer/Functionalities/TestExpressionEvaluation.test (1321 of 2474)
PASS: lldb-unit :: Utility/./UtilityTests/DataExtractorTest.UncommonAddressSize (1322 of 2474)
PASS: lldb-api :: functionalities/data-formatter/data-formatter-objc/TestDataFormatterObjCCF.py (1323 of 2474)
UNSUPPORTED: lldb-shell :: SymbolFile/target-symbols-add-unwind.test (1324 of 2474)
PASS: lldb-api :: functionalities/breakpoint/breakpoint_ids/TestBreakpointIDs.py (1325 of 2474)
PASS: lldb-unit :: Utility/./UtilityTests/ArgsTest.TestAppendArg (1326 of 2474)
PASS: lldb-unit :: Process/Utility/./ProcessUtilityTests/ProcSMapTests/LinuxProcSMapsTestFixture.ParseSMapRegions/6 (1327 of 2474)
PASS: lldb-unit :: Utility/./UtilityTests/StreamTest.PutCString (1328 of 2474)
PASS: lldb-unit :: UnwindAssembly/x86/./UnwindAssemblyx86Tests/Testx86AssemblyInspectionEngine.TestPushR13 (1329 of 2474)
PASS: lldb-unit :: ObjectFile/ELF/./ObjectFileELFTests/ObjectFileELFTest.GetSymtab_NoSymEntryPointArmAddressClass (1330 of 2474)
PASS: lldb-unit :: SymbolFile/NativePDB/./SymbolFileNativePDBTests/PDBFPOProgramToDWARFExpressionTests.UnknownOp (1331 of 2474)
PASS: lldb-shell :: SymbolFile/NativePDB/ast-types.cpp (1332 of 2474)
PASS: lldb-api :: tools/lldb-server/TestGdbRemoteAttach.py (1333 of 2474)
PASS: lldb-unit :: Utility/./UtilityTests/VMRange.Comparison (1334 of 2474)
PASS: lldb-unit :: Process/gdb-remote/./ProcessGdbRemoteTests/GDBRemoteCommunicationClientTest.ReadMemoryTags (1335 of 2474)
PASS: lldb-api :: lang/c/blocks/TestBlocks.py (1336 of 2474)
PASS: lldb-unit :: Host/./HostTests/TerminalTest.SetCanonical (1337 of 2474)
PASS: lldb-unit :: Utility/./UtilityTests/FileSpecTest.CopyByAppendingPathComponent (1338 of 2474)
PASS: lldb-unit :: ObjectFile/ELF/./ObjectFileELFTests/ObjectFileELFTest.GetSymtab_NoSymEntryPointArmThumbAddressClass (1339 of 2474)
PASS: lldb-api :: functionalities/breakpoint/comp_dir_symlink/TestCompDirSymLink.py (1340 of 2474)
PASS: lldb-unit :: Expression/./ExpressionTests/DWARFExpression.DW_OP_implicit_value (1341 of 2474)
UNSUPPORTED: lldb-api :: functionalities/thread/break_after_join/TestBreakAfterJoin.py (1342 of 2474)
PASS: lldb-shell :: Register/Core/x86-32-freebsd-addr.test (1343 of 2474)
PASS: lldb-api :: lang/cpp/static_members/TestCPPStaticMembers.py (1344 of 2474)
PASS: lldb-unit :: Utility/./UtilityTests/StructuredDataTest.StringDump (1345 of 2474)
PASS: lldb-api :: functionalities/step-vrs-interrupt/TestStepVrsInterruptTimeout.py (1346 of 2474)
PASS: lldb-shell :: SymbolFile/DWARF/x86/dwarf5-debug_line-file-index.s (1347 of 2474)
UNSUPPORTED: lldb-api :: linux/aarch64/unwind_signal/TestUnwindSignal.py (1348 of 2474)
PASS: lldb-unit :: Utility/./UtilityTests/RangeTest.LessThanInvalid (1349 of 2474)
PASS: lldb-api :: functionalities/data-formatter/data-formatter-python-synth/TestDataFormatterPythonSynth.py (1350 of 2474)
PASS: lldb-unit :: Utility/./UtilityTests/StreamTest.PutNHex8 (1351 of 2474)
PASS: lldb-api :: functionalities/breakpoint/debugbreak/TestDebugBreak.py (1352 of 2474)
PASS: lldb-unit :: Utility/./UtilityTests/StreamTest.PutMaxHex64ByteOrderLittle (1353 of 2474)
UNSUPPORTED: lldb-shell :: SymbolFile/PDB/vbases.test (1354 of 2474)
PASS: lldb-unit :: ScriptInterpreter/Python/./ScriptInterpreterPythonTests/PythonDataObjectsTest.TestPythonDictionaryValueEquality (1355 of 2474)
PASS: lldb-api :: functionalities/breakpoint/step_over_breakpoint/TestStepOverBreakpoint.py (1356 of 2474)
PASS: lldb-api :: lang/objc/objc-new-syntax/TestObjCNewSyntaxArray.py (1357 of 2474)
PASS: lldb-unit :: Utility/./UtilityTests/DataExtractorTest.GetULEB128_bit63 (1358 of 2474)
PASS: lldb-api :: lang/objc/radar-9691614/TestObjCMethodReturningBOOL.py (1359 of 2474)
PASS: lldb-shell :: SymbolFile/NativePDB/function-types-calling-conv.cpp (1360 of 2474)
PASS: lldb-api :: commands/expression/scoped_enums/TestScopedEnumType.py (1361 of 2474)
PASS: lldb-unit :: Core/./LLDBCoreTests/FormatEntity.LookupAllEntriesInTree (1362 of 2474)
PASS: lldb-shell :: SymbolFile/DWARF/x86/DW_TAG_variable-DW_AT_const_value.s (1363 of 2474)
UNSUPPORTED: lldb-shell :: ScriptInterpreter/Lua/lua.test (1364 of 2474)
PASS: lldb-shell :: SymbolFile/DWARF/x86/debug-types-dwarf5.s (1365 of 2474)
PASS: lldb-unit :: Utility/./UtilityTests/RegularExpression.Match (1366 of 2474)
PASS: lldb-unit :: Utility/./UtilityTests/CompletionRequest.TryCompleteCurrentArgMode (1367 of 2474)
PASS: lldb-unit :: Language/Highlighting/./HighlighterTests/HighlighterTest.ClangStringLiterals (1368 of 2474)
PASS: lldb-unit :: Target/./TargetTests/MCBasedABI.MapRegisterName (1369 of 2474)
PASS: lldb-api :: functionalities/gdb_remote_client/TestRemoteRegNums.py (1370 of 2474)
PASS: lldb-unit :: Utility/./UtilityTests/StringListTest.ShiftCString (1371 of 2474)
PASS: lldb-api :: commands/settings/quoting/TestQuoting.py (1372 of 2474)
PASS: lldb-unit :: Process/minidump/./LLDBMinidumpTests/MinidumpParserTest.GetPidWindows (1373 of 2474)
PASS: lldb-unit :: Symbol/./SymbolTests/TestClangASTImporter.ImportInvalidType (1374 of 2474)
PASS: lldb-api :: tools/lldb-vscode/evaluate/TestVSCode_evaluate.py (1375 of 2474)
PASS: lldb-unit :: Host/./HostTests/MainLoopTest.TwoSignalCallbacks (1376 of 2474)
PASS: lldb-api :: lang/objc/objc-class-method/TestObjCClassMethod.py (1377 of 2474)
UNSUPPORTED: lldb-api :: lang/objc/ptr_refs/TestPtrRefsObjC.py (1378 of 2474)
PASS: lldb-shell :: ScriptInterpreter/Python/python.test (1379 of 2474)
PASS: lldb-unit :: Utility/./UtilityTests/RangeTest.Slide (1380 of 2474)
PASS: lldb-unit :: ScriptInterpreter/Python/./ScriptInterpreterPythonTests/PythonDataObjectsTest.TestPythonTupleSize (1381 of 2474)
PASS: lldb-api :: macosx/order/TestOrderFile.py (1382 of 2474)
PASS: lldb-shell :: Minidump/fb-dump.test (1383 of 2474)
UNSUPPORTED: lldb-api :: iohandler/unicode/TestUnicode.py (1384 of 2474)
PASS: lldb-unit :: Symbol/./SymbolTests/TestTypeSystemClang.TestOwningModule (1385 of 2474)
PASS: lldb-api :: functionalities/tail_call_frames/cross_object/TestCrossObjectTailCalls.py (1386 of 2474)
XFAIL: lldb-shell :: Register/x86-fp-write.test (1387 of 2474)
PASS: lldb-api :: sample_test/TestSampleInlineTest.py (1388 of 2474)
PASS: lldb-api :: functionalities/archives/TestBSDArchives.py (1389 of 2474)
PASS: lldb-unit :: Utility/./UtilityTests/StreamTeeTest.SetStreamAtIndexOverwrite (1390 of 2474)
PASS: lldb-unit :: Host/./HostTests/FileSystemTest.Readable (1391 of 2474)
PASS: lldb-unit :: Process/gdb-remote/./ProcessGdbRemoteTests/GDBRemoteCommunicationServerTest.SendErrorResponse_ErrorNumber (1392 of 2474)
PASS: lldb-unit :: Utility/./UtilityTests/ArchSpecTest.TestSetTriple (1393 of 2474)
PASS: lldb-unit :: Symbol/./SymbolTests/TestTypeSystemClang.TestFunctionTemplateInRecordConstruction (1394 of 2474)
PASS: lldb-unit :: UnwindAssembly/x86/./UnwindAssemblyx86Tests/Testx86AssemblyInspectionEngine.TestAddESP (1395 of 2474)
PASS: lldb-unit :: Symbol/./SymbolTests/PostfixExpression.ParseFPOProgram (1396 of 2474)
PASS: lldb-unit :: Utility/./UtilityTests/PassiveReplayTest.InstrumentedFoo (1397 of 2474)
PASS: lldb-shell :: SymbolFile/DWARF/x86/find-basic-type.cpp (1398 of 2474)
UNSUPPORTED: lldb-shell :: ScriptInterpreter/Lua/watchpoint_callback.test (1399 of 2474)
UNSUPPORTED: lldb-api :: terminal/TestEditline.py (1400 of 2474)
PASS: lldb-unit :: Utility/./UtilityTests/SerializationRountripTest.SerializeDeserializeCStringArrayNullptr (1401 of 2474)
PASS: lldb-shell :: Quit/TestQuitExitCode0.test (1402 of 2474)
PASS: lldb-unit :: Utility/./UtilityTests/PassiveReplayTest.InstrumentedBarPtr (1403 of 2474)
PASS: lldb-unit :: Language/Highlighting/./HighlighterTests/HighlighterTest.Keywords (1404 of 2474)
PASS: lldb-api :: commands/expression/char/TestExprsChar.py (1405 of 2474)
PASS: lldb-unit :: Process/Utility/./ProcessUtilityTests/ProcMapTests/LinuxProcMapsTestFixture.ParseMapRegions/3 (1406 of 2474)
PASS: lldb-shell :: SymbolFile/DWARF/x86/debug_loc-aslr.s (1407 of 2474)
PASS: lldb-shell :: SymbolFile/DWARF/x86/dir-separator-no-comp-dir-relative-name.s (1408 of 2474)
PASS: lldb-unit :: Host/./HostTests/SocketTests/SocketTest.TCPListen0GetPort/ipv6 (1409 of 2474)
PASS: lldb-unit :: Utility/./UtilityTests/StringListTest.AppendListCStringArrayEmpty (1410 of 2474)
PASS: lldb-unit :: Utility/./UtilityTests/ScalarTest.Getters (1411 of 2474)
PASS: lldb-shell :: ScriptInterpreter/Python/scripted_breakpoint_lua.test (1412 of 2474)
UNSUPPORTED: lldb-shell :: Unwind/basic-block-sections.test (1413 of 2474)
PASS: lldb-api :: functionalities/unwind/zeroth_frame/TestZerothFrame.py (1414 of 2474)
UNSUPPORTED: lldb-shell :: SymbolFile/DWARF/dwarf5-lazy-dwo.c (1415 of 2474)
PASS: lldb-unit :: Expression/./ExpressionTests/DiagnosticManagerTest.GetStringNoDiags (1416 of 2474)
PASS: lldb-unit :: Utility/./UtilityTests/ConstStringTest.FromMidOfBufferStringRef (1417 of 2474)
PASS: lldb-api :: python_api/symbol-context/TestSymbolContext.py (1418 of 2474)
PASS: lldb-unit :: debugserver/./debugserverTests/RNBSocket.LoopBackConnectIPv4 (1419 of 2474)
PASS: lldb-unit :: UnwindAssembly/x86/./UnwindAssemblyx86Tests/Testx86AssemblyInspectionEngine.TestPopEDI (1420 of 2474)
PASS: lldb-api :: commands/apropos/basic/TestApropos.py (1421 of 2474)
PASS: lldb-shell :: Subprocess/vfork-follow-parent.test (1422 of 2474)
PASS: lldb-unit :: Utility/./UtilityTests/StringListTest.GetMaxStringLengthIncreasingSize (1423 of 2474)
PASS: lldb-api :: arm/emulation/TestEmulations.py (1424 of 2474)
PASS: lldb-unit :: Core/./LLDBCoreTests/UniqueCStringMap.NoDefaultConstructor (1425 of 2474)
PASS: lldb-unit :: SymbolFile/DWARF/./SymbolFileDWARFTests/SymbolFileDWARFTests.TestAbbrevNullAttrValidForm (1426 of 2474)
PASS: lldb-api :: lang/cpp/overloaded-functions/TestOverloadedFunctions.py (1427 of 2474)
PASS: lldb-api :: functionalities/thread/concurrent_events/TestConcurrentManyCrash.py (1428 of 2474)
PASS: lldb-shell :: SymbolFile/DWARF/x86/inline-function-address-shared.test (1429 of 2474)
PASS: lldb-api :: functionalities/step-avoids-no-debug/TestStepNoDebug.py (1430 of 2474)
PASS: lldb-api :: lang/cpp/inlines/TestInlines.py (1431 of 2474)
PASS: lldb-shell :: Register/Core/x86-32-linux-fp.test (1432 of 2474)
PASS: lldb-unit :: Expression/./ExpressionTests/ClangExpressionDeclMapTest.TestUnknownIdentifierLookup (1433 of 2474)
PASS: lldb-api :: lang/cpp/limit-debug-info/TestWithLimitDebugInfo.py (1434 of 2474)
PASS: lldb-unit :: Utility/./UtilityTests/TimerTest.CategoryTimesStats (1435 of 2474)
PASS: lldb-unit :: UnwindAssembly/x86/./UnwindAssemblyx86Tests/Testx86AssemblyInspectionEngine.TestPopRBX (1436 of 2474)
UNSUPPORTED: lldb-api :: tools/lldb-vscode/disconnect/TestVSCode_disconnect.py (1437 of 2474)
PASS: lldb-unit :: Utility/./UtilityTests/StringExtractorTest.GetNameColonValueNoColon (1438 of 2474)
PASS: lldb-api :: python_api/interpreter/TestCommandInterpreterAPI.py (1439 of 2474)
PASS: lldb-shell :: SymbolFile/DWARF/x86/dir-separator-posix.s (1440 of 2474)
PASS: lldb-unit :: Process/Utility/./ProcessUtilityTests/ProcSMapTests/LinuxProcSMapsTestFixture.ParseSMapRegions/4 (1441 of 2474)
PASS: lldb-api :: lang/objc/real-definition/TestRealDefinition.py (1442 of 2474)
PASS: lldb-api :: functionalities/data-formatter/data-formatter-stl/libcxx/string/TestDataFormatterLibcxxString.py (1443 of 2474)
UNSUPPORTED: lldb-api :: linux/add-symbols/TestTargetSymbolsAddCommand.py (1444 of 2474)
PASS: lldb-unit :: Utility/./UtilityTests/BinaryStreamTest.PutULEB128ThreeBytes (1445 of 2474)
UNSUPPORTED: lldb-api :: tools/lldb-server/TestGdbRemoteFork.py (1446 of 2474)
PASS: lldb-unit :: Utility/./UtilityTests/BinaryStreamTest.PutSLEB128ThreeBytes (1447 of 2474)
PASS: lldb-api :: functionalities/data-formatter/data-formatter-stl/libcxx/unique_ptr/TestDataFormatterLibcxxUniquePtr.py (1448 of 2474)
PASS: lldb-unit :: Utility/./UtilityTests/ArgsTest.Yaml (1449 of 2474)
PASS: lldb-api :: functionalities/breakpoint/hardware_breakpoints/require_hw_breakpoints/TestRequireHWBreakpoints.py (1450 of 2474)
UNSUPPORTED: lldb-shell :: Register/arm-fp-read.test (1451 of 2474)
PASS: lldb-unit :: Host/./HostTests/FileSystemTest.GetByteSize (1452 of 2474)
PASS: lldb-api :: lang/cpp/scope/TestCppScope.py (1453 of 2474)
UNSUPPORTED: lldb-api :: tools/lldb-server/vCont-threads/TestGdbRemote_vContThreads.py (1454 of 2474)
PASS: lldb-api :: commands/expression/radar_9531204/TestPrintfAfterUp.py (1455 of 2474)
PASS: lldb-unit :: Utility/./UtilityTests/StreamTest.AddressPrefix (1456 of 2474)
UNSUPPORTED: lldb-shell :: Subprocess/clone-follow-parent-wp.test (1457 of 2474)
PASS: lldb-unit :: Process/Utility/./ProcessUtilityTests/ProcSMapTests/LinuxProcSMapsTestFixture.ParseSMapRegions/1 (1458 of 2474)
PASS: lldb-shell :: SymbolFile/DWARF/x86/module-ownership.mm (1459 of 2474)
UNSUPPORTED: lldb-api :: linux/mix-dwo-and-regular-objects/TestMixedDwarfBinary.py (1460 of 2474)
PASS: lldb-unit :: Utility/./UtilityTests/StringExtractorTest.GetHexU8_Underflow2 (1461 of 2474)
PASS: lldb-api :: functionalities/data-formatter/data-formatter-objc/TestDataFormatterObjCNSURL.py (1462 of 2474)
PASS: lldb-unit :: SymbolFile/NativePDB/./SymbolFileNativePDBTests/PDBFPOProgramToDWARFExpressionTests.DependencyChain (1463 of 2474)
UNSUPPORTED: lldb-api :: functionalities/asan/TestMemoryHistory.py (1464 of 2474)
UNSUPPORTED: lldb-shell :: SymbolFile/PDB/variables.test (1465 of 2474)
PASS: lldb-unit :: Core/./LLDBCoreTests/SourceLocationSpecTest.Compare (1466 of 2474)
PASS: lldb-api :: functionalities/data-formatter/data-formatter-named-summaries/TestDataFormatterNamedSummaries.py (1467 of 2474)
PASS: lldb-unit :: Process/minidump/./LLDBMinidumpTests/MinidumpParserTest.MinidumpDuplicateModuleSeparateCode (1468 of 2474)
PASS: lldb-shell :: Register/Core/x86-64-linux-gp.test (1469 of 2474)
PASS: lldb-unit :: Utility/./UtilityTests/ConstStringTest.format_provider (1470 of 2474)
PASS: lldb-unit :: Utility/./UtilityTests/ProcessInstanceInfo.DumpTable_invalidUID (1471 of 2474)
PASS: lldb-api :: lang/objc/modules-objc-property/TestModulesObjCProperty.py (1472 of 2474)
PASS: lldb-api :: macosx/find-dsym/deep-bundle/TestDeepBundle.py (1473 of 2474)
PASS: lldb-api :: lang/cpp/break-on-initializers/TestBreakOnCPP11Initializers.py (1474 of 2474)
PASS: lldb-unit :: Utility/./UtilityTests/StreamTest.Indent (1475 of 2474)
PASS: lldb-api :: commands/expression/import-std-module/queue/TestQueueFromStdModule.py (1476 of 2474)
PASS: lldb-unit :: Host/./HostTests/NativeProcessProtocolTest.ReadCStringFromMemory_CrossPageBoundary (1477 of 2474)
PASS: lldb-api :: commands/expression/static-initializers/TestStaticInitializers.py (1478 of 2474)
UNSUPPORTED: lldb-api :: lang/objc/objc-dynamic-value/TestObjCDynamicValue.py (1479 of 2474)
PASS: lldb-api :: functionalities/thread/concurrent_events/TestConcurrentDelayedCrashWithBreakpointWatchpoint.py (1480 of 2474)
PASS: lldb-unit :: Signals/./SignalsTests/UnixSignalsTest.VersionChange (1481 of 2474)
UNSUPPORTED: lldb-api :: commands/trace/TestTraceDumpInstructions.py (1482 of 2474)
PASS: lldb-api :: functionalities/data-formatter/data-formatter-stl/libcxx/vbool/TestDataFormatterLibcxxVBool.py (1483 of 2474)
PASS: lldb-api :: functionalities/dlopen_other_executable/TestDlopenOtherExecutable.py (1484 of 2474)
UNSUPPORTED: lldb-api :: functionalities/thread/create_during_step/TestCreateDuringStep.py (1485 of 2474)
PASS: lldb-api :: commands/expression/result_numbering/TestResultNumbering.py (1486 of 2474)
PASS: lldb-api :: macosx/thread_suspend/TestInternalThreadSuspension.py (1487 of 2474)
PASS: lldb-shell :: SymbolFile/DWARF/x86/childless-compile-unit.s (1488 of 2474)
PASS: lldb-unit :: Process/gdb-remote/./ProcessGdbRemoteTests/GDBRemoteCommunicationClientTest.GetModulesInfo (1489 of 2474)
PASS: lldb-api :: tools/lldb-vscode/breakpoint/TestVSCode_setFunctionBreakpoints.py (1490 of 2474)
PASS: lldb-unit :: UnwindAssembly/x86/./UnwindAssemblyx86Tests/Testx86AssemblyInspectionEngine.TestSimplex86_64Augmented (1491 of 2474)
PASS: lldb-shell :: Driver/TestTarget.test (1492 of 2474)
PASS: lldb-shell :: SymbolFile/DWARF/x86/DW_OP_piece-smaller-than-struct.s (1493 of 2474)
PASS: lldb-unit :: Utility/./UtilityTests/StreamTest.ShiftOperatorStrings (1494 of 2474)
PASS: lldb-shell :: ObjectFile/ELF/section-overlap.yaml (1495 of 2474)
PASS: lldb-shell :: Register/Core/x86-32-netbsd-gp.test (1496 of 2474)
PASS: lldb-shell :: Commands/command-backtrace-parser-1.test (1497 of 2474)
PASS: lldb-unit :: Utility/./UtilityTests/DataExtractorTest.GetMaxU64_unchecked (1498 of 2474)
PASS: lldb-api :: python_api/target/TestTargetAPI.py (1499 of 2474)
UNSUPPORTED: lldb-shell :: Subprocess/fork-follow-parent-softbp.test (1500 of 2474)
PASS: lldb-api :: functionalities/recursion/TestValueObjectRecursion.py (1501 of 2474)
PASS: lldb-unit :: UnwindAssembly/x86/./UnwindAssemblyx86Tests/Testx86AssemblyInspectionEngine.Test32bitFramelessBigStackFrame (1502 of 2474)
PASS: lldb-unit :: Utility/./UtilityTests/NameMatchesTest.Ignore (1503 of 2474)
PASS: lldb-api :: lang/objc/modules-auto-import/TestModulesAutoImport.py (1504 of 2474)
PASS: lldb-api :: commands/expression/import-std-module/forward_list-dbg-info-content/TestDbgInfoContentForwardListFromStdModule.py (1505 of 2474)
UNSUPPORTED: lldb-api :: functionalities/data-formatter/data-formatter-stl/libstdcpp/list/TestDataFormatterStdList.py (1506 of 2474)
PASS: lldb-api :: functionalities/gdb_remote_client/TestGDBRemoteDiskFileCompletion.py (1507 of 2474)
PASS: lldb-shell :: ObjectFile/ELF/PT_LOAD-overlap.yaml (1508 of 2474)
FAIL: lldb-api :: functionalities/scripted_process/TestScriptedProcess.py (1509 of 2474)
******************** TEST 'lldb-api :: functionalities/scripted_process/TestScriptedProcess.py' FAILED ********************
Script:
--
/Users/buildslave/jenkins/workspace/lldb-cmake-sanitized/lldb-build/lldb-test-build.noindex/copied-python /Users/buildslave/jenkins/workspace/lldb-cmake-sanitized/llvm-project/lldb/test/API/dotest.py -u CXXFLAGS -u CFLAGS --codesign-identity lldb_codesign --arch x86_64 --build-dir /Users/buildslave/jenkins/workspace/lldb-cmake-sanitized/lldb-build/lldb-test-build.noindex -t --env TERM=vt100 --env LLVM_LIBS_DIR=/Users/buildslave/jenkins/workspace/lldb-cmake-sanitized/lldb-build/./lib --inferior-env ASAN_OPTIONS=detect_stack_use_after_return=1 --inferior-env DYLD_INSERT_LIBRARIES=/Users/buildslave/jenkins/workspace/lldb-cmake-sanitized/host-compiler/lib/clang/14.0.99/lib/darwin/libclang_rt.asan_osx_dynamic.dylib --arch x86_64 --build-dir /Users/buildslave/jenkins/workspace/lldb-cmake-sanitized/lldb-build/lldb-test-build.noindex --lldb-module-cache-dir /Users/buildslave/jenkins/workspace/lldb-cmake-sanitized/lldb-build/lldb-test-build.noindex/module-cache-lldb/lldb-api --clang-module-cache-dir /Users/buildslave/jenkins/workspace/lldb-cmake-sanitized/lldb-build/lldb-test-build.noindex/module-cache-clang/lldb-api --executable /Users/buildslave/jenkins/workspace/lldb-cmake-sanitized/lldb-build/./bin/lldb --compiler /Users/buildslave/jenkins/workspace/lldb-cmake-sanitized/host-compiler/bin/clang --dsymutil /Users/buildslave/jenkins/workspace/lldb-cmake-sanitized/lldb-build/./bin/dsymutil --llvm-tools-dir /Users/buildslave/jenkins/workspace/lldb-cmake-sanitized/lldb-build/./bin --lldb-libs-dir /Users/buildslave/jenkins/workspace/lldb-cmake-sanitized/lldb-build/./lib /Users/buildslave/jenkins/workspace/lldb-cmake-sanitized/llvm-project/lldb/test/API/functionalities/scripted_process -p TestScriptedProcess.py
--
Exit Code: -6

Hide Details

Command Output (stdout): -- lldb version 14.0.99 (http://labmaster3.local/git/llvm-project.git revision e5a4d0f1498c51858ee9e6682b235389f500ed15) clang revision e5a4d0f1498c51858ee9e6682b235389f500ed15 llvm revision e5a4d0f1498c51858ee9e6682b235389f500ed15 Name of the class that will manage the scripted process: 'stack_core_scripted_process.StackCoreScriptedProcess' Saving 69632 bytes of data for memory region at 0x7ffeefbef000

Hide Details

-- Command Output (stderr): -- ================================================================= ==50116==ERROR: AddressSanitizer: heap-use-after-free on address 0x6160002508a0 at pc 0x000108d80a30 bp 0x7000022f0cf0 sp 0x7000022f04b8 READ of size 512 at 0x6160002508a0 thread T6 #0 0x108d80a2f in __asan_memcpy+0x1af (libclang_rt.asan_osx_dynamic.dylib:x86_64+0x44a2f) #1 0x1197c9498 in lldb_private::DataExtractor::CopyByteOrderedData(unsigned long long, unsigned long long, void*, unsigned long long, lldb::ByteOrder) const DataExtractor.cpp:742 #2 0x119d5622b in lldb_private::ScriptedProcess::DoReadMemory(unsigned long long, void*, unsigned long, lldb_private::Status&) ScriptedProcess.cpp:237 #3 0x1195ee6ec in lldb_private::Process::ReadMemoryFromInferior(unsigned long long, void*, unsigned long, lldb_private::Status&) Process.cpp:2047 #4 0x1195a6b5f in lldb_private::MemoryCache::Read(unsigned long long, void*, unsigned long, lldb_private::Status&) Memory.cpp:229 #5 0x11962fb41 in lldb_private::RegisterContext::ReadRegisterValueFromMemory(lldb_private::RegisterInfo const*, unsigned long long, unsigned int, lldb_private::RegisterValue&) RegisterContext.cpp:343 #6 0x119641866 in lldb_private::RegisterContextUnwind::ReadRegisterValueFromRegisterLocation(lldb_private::UnwindLLDB::RegisterLocation, lldb_private::RegisterInfo const*, lldb_private::RegisterValue&) RegisterContextUnwind.cpp:1138 #7 0x11963f1f3 in lldb_private::RegisterContextUnwind::ReadGPRValue(lldb::RegisterKind, unsigned int, unsigned long long&) RegisterContextUnwind.cpp:2143 #8 0x119633975 in lldb_private::RegisterContextUnwind::InitializeNonZerothFrame() RegisterContextUnwind.cpp:343 #9 0x119630ce0 in lldb_private::RegisterContextUnwind::RegisterContextUnwind(lldb_private::Thread&, std::__1::shared_ptr<lldb_private::RegisterContextUnwind> const&, lldb_private::SymbolContext&, unsigned int, lldb_private::UnwindLLDB&) RegisterContextUnwind.cpp:72 #10 0x11978b8d0 in lldb_private::UnwindLLDB::GetOneMoreFrame(lldb_private::ABI*) UnwindLLDB.cpp:128 #11 0x11978a539 in lldb_private::UnwindLLDB::AddOneMoreFrame(lldb_private::ABI*) UnwindLLDB.cpp:332 #12 0x11978b205 in lldb_private::UnwindLLDB::UpdateUnwindPlanForFirstFrameIfInvalid(lldb_private::ABI*) UnwindLLDB.cpp:305 #13 0x11978a09d in lldb_private::UnwindLLDB::AddFirstFrame() UnwindLLDB.cpp:99 #14 0x11978d38d in lldb_private::UnwindLLDB::DoGetFrameInfoAtIndex(unsigned int, unsigned long long&, unsigned long long&, bool&) UnwindLLDB.cpp:395 #15 0x11967bfca in lldb_private::Unwind::GetFrameInfoAtIndex(unsigned int, unsigned long long&, unsigned long long&, bool&) Unwind.h:53 #16 0x11967888c in lldb_private::StackFrameList::GetFramesUpTo(unsigned int) StackFrameList.cpp:484 #17 0x119676987 in lldb_private::StackFrameList::ResetCurrentInlinedDepth() StackFrameList.cpp:86 #18 0x1197167e3 in lldb_private::Thread::ShouldStop(lldb_private::Event*) Thread.cpp:805 #19 0x11972ffe8 in lldb_private::ThreadList::ShouldStop(lldb_private::Event*) ThreadList.cpp:330 #20 0x1195fc4b0 in lldb_private::Process::ShouldBroadcastEvent(lldb_private::Event*) Process.cpp:3405 #21 0x1195f33d4 in lldb_private::Process::HandlePrivateEvent(std::__1::shared_ptr<lldb_private::Event>&) Process.cpp:3630 #22 0x1195fe12a in lldb_private::Process::RunPrivateStateThread(bool) Process.cpp:3824 #23 0x1195fcadd in lldb_private::Process::PrivateStateThread(void*) Process.cpp:3722 #24 0x11935c3e0 in lldb_private::HostNativeThreadBase::ThreadCreateTrampoline(void*) HostNativeThreadBase.cpp:65 #25 0x7fff69c02108 in _pthread_start+0x93 (libsystem_pthread.dylib:x86_64+0x6108) #26 0x7fff69bfdb8a in thread_start+0xe (libsystem_pthread.dylib:x86_64+0x1b8a)

Hide Details

0x6160002508a0 is located 32 bytes inside of 545-byte region [0x616000250880,0x616000250aa1) freed by thread T6 here: #0 0x108d82ac9 in wrap_free+0xa9 (libclang_rt.asan_osx_dynamic.dylib:x86_64+0x46ac9) #1 0x109884af2 in frame_dealloc+0xa0 (Python:x86_64+0x2aaf2) #2 0x109873d2a in function_code_fastcall+0xf8 (Python:x86_64+0x19d2a) #3 0x109874624 in _PyObject_Call_Prepend+0x95 (Python:x86_64+0x1a624) #4 0x1098732d2 in _PyObject_FastCallDict+0x107 (Python:x86_64+0x192d2) #5 0x1098747d2 in _PyObject_CallFunctionVa+0xd0 (Python:x86_64+0x1a7d2) #6 0x109874a00 in PyObject_CallMethod+0xa8 (Python:x86_64+0x1aa00) #7 0x119eecbf0 in std::__1::shared_ptr<lldb_private::DataExtractor> lldb_private::ScriptedPythonInterface::Dispatch<std::__1::shared_ptr<lldb_private::DataExtractor>, unsigned long long, unsigned long>(llvm::StringRef, lldb_private::Status&, unsigned long long, unsigned long) ScriptedPythonInterface.h:93 #8 0x119eec044 in lldb_private::ScriptedProcessPythonInterface::ReadMemoryAtAddress(unsigned long long, unsigned long, lldb_private::Status&) ScriptedProcessPythonInterface.cpp:120 #9 0x119d56005 in lldb_private::ScriptedProcess::DoReadMemory(unsigned long long, void*, unsigned long, lldb_private::Status&) ScriptedProcess.cpp:232 #10 0x1195ee6ec in lldb_private::Process::ReadMemoryFromInferior(unsigned long long, void*, unsigned long, lldb_private::Status&) Process.cpp:2047 #11 0x1195a6b5f in lldb_private::MemoryCache::Read(unsigned long long, void*, unsigned long, lldb_private::Status&) Memory.cpp:229 #12 0x11962fb41 in lldb_private::RegisterContext::ReadRegisterValueFromMemory(lldb_private::RegisterInfo const*, unsigned long long, unsigned int, lldb_private::RegisterValue&) RegisterContext.cpp:343 #13 0x119641866 in lldb_private::RegisterContextUnwind::ReadRegisterValueFromRegisterLocation(lldb_private::UnwindLLDB::RegisterLocation, lldb_private::RegisterInfo const*, lldb_private::RegisterValue&) RegisterContextUnwind.cpp:1138 #14 0x11963f1f3 in lldb_private::RegisterContextUnwind::ReadGPRValue(lldb::RegisterKind, unsigned int, unsigned long long&) RegisterContextUnwind.cpp:2143 #15 0x119633975 in lldb_private::RegisterContextUnwind::InitializeNonZerothFrame() RegisterContextUnwind.cpp:343 #16 0x119630ce0 in lldb_private::RegisterContextUnwind::RegisterContextUnwind(lldb_private::Thread&, std::__1::shared_ptr<lldb_private::RegisterContextUnwind> const&, lldb_private::SymbolContext&, unsigned int, lldb_private::UnwindLLDB&) RegisterContextUnwind.cpp:72 #17 0x11978b8d0 in lldb_private::UnwindLLDB::GetOneMoreFrame(lldb_private::ABI*) UnwindLLDB.cpp:128 #18 0x11978a539 in lldb_private::UnwindLLDB::AddOneMoreFrame(lldb_private::ABI*) UnwindLLDB.cpp:332 #19 0x11978b205 in lldb_private::UnwindLLDB::UpdateUnwindPlanForFirstFrameIfInvalid(lldb_private::ABI*) UnwindLLDB.cpp:305 #20 0x11978a09d in lldb_private::UnwindLLDB::AddFirstFrame() UnwindLLDB.cpp:99 #21 0x11978d38d in lldb_private::UnwindLLDB::DoGetFrameInfoAtIndex(unsigned int, unsigned long long&, unsigned long long&, bool&) UnwindLLDB.cpp:395 #22 0x11967bfca in lldb_private::Unwind::GetFrameInfoAtIndex(unsigned int, unsigned long long&, unsigned long long&, bool&) Unwind.h:53 #23 0x11967888c in lldb_private::StackFrameList::GetFramesUpTo(unsigned int) StackFrameList.cpp:484 #24 0x119676987 in lldb_private::StackFrameList::ResetCurrentInlinedDepth() StackFrameList.cpp:86 #25 0x1197167e3 in lldb_private::Thread::ShouldStop(lldb_private::Event*) Thread.cpp:805 #26 0x11972ffe8 in lldb_private::ThreadList::ShouldStop(lldb_private::Event*) ThreadList.cpp:330 #27 0x1195fc4b0 in lldb_private::Process::ShouldBroadcastEvent(lldb_private::Event*) Process.cpp:3405 #28 0x1195f33d4 in lldb_private::Process::HandlePrivateEvent(std::__1::shared_ptr<lldb_private::Event>&) Process.cpp:3630 #29 0x1195fe12a in lldb_private::Process::RunPrivateStateThread(bool) Process.cpp:3824

Hide Details

previously allocated by thread T6 here: #0 0x108d82980 in wrap_malloc+0xa0 (libclang_rt.asan_osx_dynamic.dylib:x86_64+0x46980) #1 0x1098a228b in _PyObject_Malloc+0x37 (Python:x86_64+0x4828b) #2 0x10986becc in _PyBytes_FromSize+0x63 (Python:x86_64+0x11ecc) #3 0x10986be09 in PyBytes_FromStringAndSize+0x3d (Python:x86_64+0x11e09) #4 0x119e9e607 in lldb_private::python::PythonBytes::PythonBytes(unsigned char const*, unsigned long) PythonDataObjects.cpp:290 #5 0x118f25781 in _wrap_SBProcess_ReadMemory(_object*, _object*) LLDBWrapPython.cpp:45781 #6 0x109874226 in _PyMethodDef_RawFastCallKeywords+0xeb (Python:x86_64+0x1a226) #7 0x1098738c6 in _PyCFunction_FastCallKeywords+0x2b (Python:x86_64+0x198c6) #8 0x109909905 in call_function+0x1de (Python:x86_64+0xaf905) #9 0x1099025ee in _PyEval_EvalFrameDefault+0x1b51 (Python:x86_64+0xa85ee) #10 0x109873ca1 in function_code_fastcall+0x6f (Python:x86_64+0x19ca1) #11 0x10990997d in call_function+0x256 (Python:x86_64+0xaf97d) #12 0x1099025d5 in _PyEval_EvalFrameDefault+0x1b38 (Python:x86_64+0xa85d5) #13 0x109873ca1 in function_code_fastcall+0x6f (Python:x86_64+0x19ca1) #14 0x109874624 in _PyObject_Call_Prepend+0x95 (Python:x86_64+0x1a624) #15 0x1098732d2 in _PyObject_FastCallDict+0x107 (Python:x86_64+0x192d2) #16 0x1098747d2 in _PyObject_CallFunctionVa+0xd0 (Python:x86_64+0x1a7d2) #17 0x109874a00 in PyObject_CallMethod+0xa8 (Python:x86_64+0x1aa00) #18 0x119eecbf0 in std::__1::shared_ptr<lldb_private::DataExtractor> lldb_private::ScriptedPythonInterface::Dispatch<std::__1::shared_ptr<lldb_private::DataExtractor>, unsigned long long, unsigned long>(llvm::StringRef, lldb_private::Status&, unsigned long long, unsigned long) ScriptedPythonInterface.h:93 #19 0x119eec044 in lldb_private::ScriptedProcessPythonInterface::ReadMemoryAtAddress(unsigned long long, unsigned long, lldb_private::Status&) ScriptedProcessPythonInterface.cpp:120 #20 0x119d56005 in lldb_private::ScriptedProcess::DoReadMemory(unsigned long long, void*, unsigned long, lldb_private::Status&) ScriptedProcess.cpp:232 #21 0x1195ee6ec in lldb_private::Process::ReadMemoryFromInferior(unsigned long long, void*, unsigned long, lldb_private::Status&) Process.cpp:2047 #22 0x1195a6b5f in lldb_private::MemoryCache::Read(unsigned long long, void*, unsigned long, lldb_private::Status&) Memory.cpp:229 #23 0x11962fb41 in lldb_private::RegisterContext::ReadRegisterValueFromMemory(lldb_private::RegisterInfo const*, unsigned long long, unsigned int, lldb_private::RegisterValue&) RegisterContext.cpp:343 #24 0x119641866 in lldb_private::RegisterContextUnwind::ReadRegisterValueFromRegisterLocation(lldb_private::UnwindLLDB::RegisterLocation, lldb_private::RegisterInfo const*, lldb_private::RegisterValue&) RegisterContextUnwind.cpp:1138 #25 0x11963f1f3 in lldb_private::RegisterContextUnwind::ReadGPRValue(lldb::RegisterKind, unsigned int, unsigned long long&) RegisterContextUnwind.cpp:2143 #26 0x119633975 in lldb_private::RegisterContextUnwind::InitializeNonZerothFrame() RegisterContextUnwind.cpp:343 #27 0x119630ce0 in lldb_private::RegisterContextUnwind::RegisterContextUnwind(lldb_private::Thread&, std::__1::shared_ptr<lldb_private::RegisterContextUnwind> const&, lldb_private::SymbolContext&, unsigned int, lldb_private::UnwindLLDB&) RegisterContextUnwind.cpp:72 #28 0x11978b8d0 in lldb_private::UnwindLLDB::GetOneMoreFrame(lldb_private::ABI*) UnwindLLDB.cpp:128 #29 0x11978a539 in lldb_private::UnwindLLDB::AddOneMoreFrame(lldb_private::ABI*) UnwindLLDB.cpp:332

Hide Details

Thread T6 created by T0 here: #0 0x108d7c45c in wrap_pthread_create+0x5c (libclang_rt.asan_osx_dynamic.dylib:x86_64+0x4045c) #1 0x11937fe11 in lldb_private::ThreadLauncher::LaunchThread(llvm::StringRef, void* (*)(void*), void*, unsigned long) ThreadLauncher.cpp:65 #2 0x1195f535f in lldb_private::Process::StartPrivateStateThread(bool) Process.cpp:3501 #3 0x1195f4b5a in lldb_private::Process::Launch(lldb_private::ProcessLaunchInfo&) Process.cpp:2547 #4 0x1196d530b in lldb_private::Target::Launch(lldb_private::ProcessLaunchInfo&, lldb_private::Stream*) Target.cpp:3063 #5 0x118aa9380 in lldb::SBTarget::Launch(lldb::SBLaunchInfo&, lldb::SBError&) SBTarget.cpp:439 #6 0x118f635ba in _wrap_SBTarget_Launch(_object*, _object*) LLDBWrapPython.cpp:54084 #7 0x109873bda in PyCFunction_Call+0x140 (Python:x86_64+0x19bda) #8 0x1099029e2 in _PyEval_EvalFrameDefault+0x1f45 (Python:x86_64+0xa89e2) #9 0x10990a2da in _PyEval_EvalCodeWithName+0x72a (Python:x86_64+0xb02da) #10 0x10987388b in _PyFunction_FastCallKeywords+0xe0 (Python:x86_64+0x1988b) #11 0x10990997d in call_function+0x256 (Python:x86_64+0xaf97d) #12 0x1099025d5 in _PyEval_EvalFrameDefault+0x1b38 (Python:x86_64+0xa85d5) #13 0x109873ca1 in function_code_fastcall+0x6f (Python:x86_64+0x19ca1) #14 0x109902905 in _PyEval_EvalFrameDefault+0x1e68 (Python:x86_64+0xa8905) #15 0x10990a2da in _PyEval_EvalCodeWithName+0x72a (Python:x86_64+0xb02da) #16 0x1098734f4 in _PyFunction_FastCallDict+0x1b8 (Python:x86_64+0x194f4) #17 0x109902905 in _PyEval_EvalFrameDefault+0x1e68 (Python:x86_64+0xa8905) #18 0x10990a2da in _PyEval_EvalCodeWithName+0x72a (Python:x86_64+0xb02da) #19 0x10987388b in _PyFunction_FastCallKeywords+0xe0 (Python:x86_64+0x1988b) #20 0x10990997d in call_function+0x256 (Python:x86_64+0xaf97d) #21 0x10990268c in _PyEval_EvalFrameDefault+0x1bef (Python:x86_64+0xa868c) #22 0x10990a2da in _PyEval_EvalCodeWithName+0x72a (Python:x86_64+0xb02da) #23 0x10987388b in _PyFunction_FastCallKeywords+0xe0 (Python:x86_64+0x1988b) #24 0x10990997d in call_function+0x256 (Python:x86_64+0xaf97d) #25 0x10990268c in _PyEval_EvalFrameDefault+0x1bef (Python:x86_64+0xa868c) #26 0x109873ca1 in function_code_fastcall+0x6f (Python:x86_64+0x19ca1) #27 0x10990997d in call_function+0x256 (Python:x86_64+0xaf97d) #28 0x1099025d5 in _PyEval_EvalFrameDefault+0x1b38 (Python:x86_64+0xa85d5) #29 0x10990a2da in _PyEval_EvalCodeWithName+0x72a (Python:x86_64+0xb02da) #30 0x1098734f4 in _PyFunction_FastCallDict+0x1b8 (Python:x86_64+0x194f4) #31 0x109874624 in _PyObject_Call_Prepend+0x95 (Python:x86_64+0x1a624) #32 0x1098739d4 in PyObject_Call+0x87 (Python:x86_64+0x199d4) #33 0x109902905 in _PyEval_EvalFrameDefault+0x1e68 (Python:x86_64+0xa8905) #34 0x10990a2da in _PyEval_EvalCodeWithName+0x72a (Python:x86_64+0xb02da) #35 0x1098734f4 in _PyFunction_FastCallDict+0x1b8 (Python:x86_64+0x194f4) #36 0x109874624 in _PyObject_Call_Prepend+0x95 (Python:x86_64+0x1a624) #37 0x1098b14af in slot_tp_call+0x46 (Python:x86_64+0x574af) #38 0x10987372c in _PyObject_FastCallKeywords+0x166 (Python:x86_64+0x1972c) #39 0x109909976 in call_function+0x24f (Python:x86_64+0xaf976) #40 0x10990268c in _PyEval_EvalFrameDefault+0x1bef (Python:x86_64+0xa868c) #41 0x10990a2da in _PyEval_EvalCodeWithName+0x72a (Python:x86_64+0xb02da) #42 0x10987388b in _PyFunction_FastCallKeywords+0xe0 (Python:x86_64+0x1988b) #43 0x10990997d in call_function+0x256 (Python:x86_64+0xaf97d) #44 0x1099025d5 in _PyEval_EvalFrameDefault+0x1b38 (Python:x86_64+0xa85d5) #45 0x10990a2da in _PyEval_EvalCodeWithName+0x72a (Python:x86_64+0xb02da) #46 0x10987388b in _PyFunction_FastCallKeywords+0xe0 (Python:x86_64+0x1988b) #47 0x10990997d in call_function+0x256 (Python:x86_64+0xaf97d) #48 0x1099025d5 in _PyEval_EvalFrameDefault+0x1b38 (Python:x86_64+0xa85d5) #49 0x109873ca1 in function_code_fastcall+0x6f (Python:x86_64+0x19ca1) #50 0x109874624 in _PyObject_Call_Prepend+0x95 (Python:x86_64+0x1a624) #51 0x1098739d4 in PyObject_Call+0x87 (Python:x86_64+0x199d4) #52 0x109902905 in _PyEval_EvalFrameDefault+0x1e68 (Python:x86_64+0xa8905) #53 0x10990a2da in _PyEval_EvalCodeWithName+0x72a (Python:x86_64+0xb02da) #54 0x1098734f4 in _PyFunction_FastCallDict+0x1b8 (Python:x86_64+0x194f4) #55 0x109874624 in _PyObject_Call_Prepend+0x95 (Python:x86_64+0x1a624) #56 0x1098b14af in slot_tp_call+0x46 (Python:x86_64+0x574af) #57 0x10987372c in _PyObject_FastCallKeywords+0x166 (Python:x86_64+0x1972c) #58 0x109909976 in call_function+0x24f (Python:x86_64+0xaf976) #59 0x10990268c in _PyEval_EvalFrameDefault+0x1bef (Python:x86_64+0xa868c) #60 0x109873ca1 in function_code_fastcall+0x6f (Python:x86_64+0x19ca1) #61 0x10990997d in call_function+0x256 (Python:x86_64+0xaf97d) #62 0x1099025d5 in _PyEval_EvalFrameDefault+0x1b38 (Python:x86_64+0xa85d5) #63 0x109873ca1 in function_code_fastcall+0x6f (Python:x86_64+0x19ca1) #64 0x10990997d in call_function+0x256 (Python:x86_64+0xaf97d) #65 0x1099025ee in _PyEval_EvalFrameDefault+0x1b51 (Python:x86_64+0xa85ee) #66 0x10990a2da in _PyEval_EvalCodeWithName+0x72a (Python:x86_64+0xb02da) #67 0x109900a14 in PyEval_EvalCode+0x29 (Python:x86_64+0xa6a14) #68 0x10992f2aa in run_mod+0x35 (Python:x86_64+0xd52aa) #69 0x10992e2c5 in PyRun_FileExFlags+0xa3 (Python:x86_64+0xd42c5) #70 0x10992d9a4 in PyRun_SimpleFileExFlags+0x114 (Python:x86_64+0xd39a4) #71 0x109945010 in pymain_main+0x13de (Python:x86_64+0xeb010) #72 0x1099457b7 in _Py_UnixMain+0x67 (Python:x86_64+0xeb7b7) #73 0x7fff699f9cc8 in start+0x0 (libdyld.dylib:x86_64+0x1acc8)

Hide Details

SUMMARY: AddressSanitizer: heap-use-after-free (libclang_rt.asan_osx_dynamic.dylib:x86_64+0x44a2f) in __asan_memcpy+0x1af Shadow bytes around the buggy address: 0x1c2c0004a0c0: fd fd fd fd fd fd fd fd fd fd fd fd fd fd fd fd 0x1c2c0004a0d0: fd fd fd fd fd fd fd fd fd fd fd fd fd fd fd fd 0x1c2c0004a0e0: fd fd fd fd fd fd fd fd fd fd fd fd fd fd fd fd 0x1c2c0004a0f0: fd fd fd fd fd fd fd fd fa fa fa fa fa fa fa fa 0x1c2c0004a100: fa fa fa fa fa fa fa fa fa fa fa fa fa fa fa fa =>0x1c2c0004a110: fd fd fd fd[fd]fd fd fd fd fd fd fd fd fd fd fd 0x1c2c0004a120: fd fd fd fd fd fd fd fd fd fd fd fd fd fd fd fd 0x1c2c0004a130: fd fd fd fd fd fd fd fd fd fd fd fd fd fd fd fd 0x1c2c0004a140: fd fd fd fd fd fd fd fd fd fd fd fd fd fd fd fd 0x1c2c0004a150: fd fd fd fd fd fa fa fa fa fa fa fa fa fa fa fa 0x1c2c0004a160: fa fa fa fa fa fa fa fa fa fa fa fa fa fa fa fa Shadow byte legend (one shadow byte represents 8 application bytes): Addressable: 00 Partially addressable: 01 02 03 04 05 06 07 Heap left redzone: fa Freed heap region: fd Stack left redzone: f1 Stack mid redzone: f2 Stack right redzone: f3 Stack after return: f5 Stack use after scope: f8 Global redzone: f9 Global init order: f6 Poisoned by user: f7 Container overflow: fc Array cookie: ac Intra object redzone: bb ASan internal: fe Left alloca redzone: ca Right alloca redzone: cb ==50116==ABORTING Fatal Python error: Aborted

Hide Details

Thread 0x0000000118418dc0 (most recent call first): File "/Users/buildslave/jenkins/workspace/lldb-cmake-sanitized/lldb-build/lib/python3.7/site-packages/lldb/__init__.py", line 10301 in Launch File "/Users/buildslave/jenkins/workspace/lldb-cmake-sanitized/llvm-project/lldb/test/API/functionalities/scripted_process/TestScriptedProcess.py", line 149 in test_launch_scripted_process_stack_frames File "/Users/buildslave/jenkins/workspace/lldb-cmake-sanitized/llvm-project/lldb/packages/Python/lldbsuite/test/decorators.py", line 149 in wrapper File "/Users/buildslave/jenkins/workspace/lldb-cmake-sanitized/llvm-project/lldb/packages/Python/lldbsuite/test/decorators.py", line 149 in wrapper File "/Users/buildslave/jenkins/workspace/lldb-cmake-sanitized/llvm-project/lldb/packages/Python/lldbsuite/test/lldbtest.py", line 1715 in test_method File "/Users/buildslave/jenkins/workspace/lldb-cmake-sanitized/llvm-project/lldb/third_party/Python/module/unittest2/unittest2/case.py", line 413 in runMethod File "/Users/buildslave/jenkins/workspace/lldb-cmake-sanitized/llvm-project/lldb/third_party/Python/module/unittest2/unittest2/case.py", line 383 in run File "/Users/buildslave/jenkins/workspace/lldb-cmake-sanitized/llvm-project/lldb/third_party/Python/module/unittest2/unittest2/case.py", line 458 in __call__ File "/Users/buildslave/jenkins/workspace/lldb-cmake-sanitized/llvm-project/lldb/third_party/Python/module/unittest2/unittest2/suite.py", line 117 in _wrapped_run File "/Users/buildslave/jenkins/workspace/lldb-cmake-sanitized/llvm-project/lldb/third_party/Python/module/unittest2/unittest2/suite.py", line 115 in _wrapped_run File "/Users/buildslave/jenkins/workspace/lldb-cmake-sanitized/llvm-project/lldb/third_party/Python/module/unittest2/unittest2/suite.py", line 85 in run File "/Users/buildslave/jenkins/workspace/lldb-cmake-sanitized/llvm-project/lldb/third_party/Python/module/unittest2/unittest2/suite.py", line 66 in __call__ File "/Users/buildslave/jenkins/workspace/lldb-cmake-sanitized/llvm-project/lldb/third_party/Python/module/unittest2/unittest2/runner.py", line 165 in run File "/Users/buildslave/jenkins/workspace/lldb-cmake-sanitized/llvm-project/lldb/packages/Python/lldbsuite/test/dotest.py", line 996 in run_suite File "/Users/buildslave/jenkins/workspace/lldb-cmake-sanitized/llvm-project/lldb/test/API/dotest.py", line 7 in <module>

Hide Details

--

Hide Details

******************** UNSUPPORTED: lldb-shell :: SymbolFile/DWARF/split-dwarf-expression-eval-bug.cpp (1510 of 2474) PASS: lldb-unit :: Utility/./UtilityTests/StringExtractorTest.GetHexBytesAvail_Underflow (1511 of 2474) PASS: lldb-api :: commands/statistics/basic/TestStats.py (1512 of 2474) PASS: lldb-api :: commands/expression/rdar44436068/Test128BitsInteger.py (1513 of 2474) PASS: lldb-unit :: Utility/./UtilityTests/StringListTest.LongestCommonPrefixNoPrefix (1514 of 2474) PASS: lldb-unit :: Language/Highlighting/./HighlighterTests/HighlighterTest.DefaultHighlighterWithCursor (1515 of 2474) UNSUPPORTED: lldb-api :: commands/gui/expand-threads-tree/TestGuiExpandThreadsTree.py (1516 of 2474) UNSUPPORTED: lldb-shell :: SymbolFile/NativePDB/stack_unwinding01.cpp (1517 of 2474) PASS: lldb-api :: functionalities/fat_archives/TestFatArchives.py (1518 of 2474) PASS: lldb-unit :: Utility/./UtilityTests/BroadcasterTest.BroadcastEvent (1519 of 2474) PASS: lldb-unit :: Utility/./UtilityTests/StringListTest.GetMaxStringLengthEqualSize (1520 of 2474) PASS: lldb-shell :: ObjectFile/Breakpad/breakpad-identification.test (1521 of 2474) PASS: lldb-unit :: Utility/./UtilityTests/StreamTest.QuotedCString (1522 of 2474) PASS: lldb-shell :: SymbolFile/DWARF/x86/debug_line-relative_path.s (1523 of 2474) PASS: lldb-api :: functionalities/unwind/noreturn/TestNoreturnUnwind.py (1524 of 2474) PASS: lldb-api :: functionalities/thread_plan/TestThreadPlanCommands.py (1525 of 2474) PASS: lldb-shell :: Breakpoint/split-dwarf5-debug-stroffsets.test (1526 of 2474) PASS: lldb-api :: functionalities/data-formatter/data-formatter-stl/libcxx/variant/TestDataFormatterLibcxxVariant.py (1527 of 2474) PASS: lldb-api :: commands/expression/dont_allow_jit/TestAllowJIT.py (1528 of 2474) PASS: lldb-unit :: Symbol/./SymbolTests/TestClangASTImporter.DeportDeclTagDecl (1529 of 2474) PASS: lldb-unit :: Utility/./UtilityTests/RangeTest.SizeTypes (1530 of 2474) PASS: lldb-unit :: Utility/./UtilityTests/StringExtractorTest.GetHexU8_Exact (1531 of 2474) PASS: lldb-shell :: lldb-server/TestGdbserverPort.test (1532 of 2474) PASS: lldb-shell :: Reproducer/TestCrash.test (1533 of 2474) UNSUPPORTED: lldb-api :: commands/expression/completion-crash-invalid-iterator/TestInvalidIteratorCompletionCrash.py (1534 of 2474) PASS: lldb-unit :: Utility/./UtilityTests/AnsiTerminal.Twice (1535 of 2474) PASS: lldb-shell :: SymbolFile/DWARF/x86/win-i386-line-table.s (1536 of 2474) PASS: lldb-unit :: UnwindAssembly/x86/./UnwindAssemblyx86Tests/Testx86AssemblyInspectionEngine.TestPushR12 (1537 of 2474) PASS: lldb-unit :: Symbol/./SymbolTests/TestClangASTImporter.MetadataPropagationAfterCopying (1538 of 2474) PASS: lldb-shell :: ObjectFile/ELF/section-permissions.yaml (1539 of 2474) PASS: lldb-api :: functionalities/data-formatter/nssetsynth/TestNSSetSynthetic.py (1540 of 2474) PASS: lldb-unit :: Interpreter/./InterpreterTests/OptionArgParserTest.toChar (1541 of 2474) PASS: lldb-shell :: Settings/TestStopCommandSourceOnError.test (1542 of 2474) PASS: lldb-unit :: Core/./LLDBCoreTests/RichManglingContextTest.SwitchProvider (1543 of 2474) PASS: lldb-api :: commands/add-dsym/uuid/TestAddDsymCommand.py (1544 of 2474) PASS: lldb-shell :: SymbolFile/DWARF/x86/unused-inlined-params.test (1545 of 2474) PASS: lldb-unit :: Utility/./UtilityTests/RangeDataVector.FindEntryIndexesThatContain_Overlap (1546 of 2474) PASS: lldb-shell :: SymbolFile/NativePDB/load-pdb.cpp (1547 of 2474) UNSUPPORTED: lldb-shell :: SymbolFile/DWARF/x86/DW_TAG_GNU_call_site-DW_AT_low_pc.s (1548 of 2474) PASS: lldb-unit :: UnwindAssembly/x86/./UnwindAssemblyx86Tests/Testx86AssemblyInspectionEngine.Testi386IgnoredRegisters (1549 of 2474) PASS: lldb-api :: lang/cpp/accelerator-table/TestCPPAccelerator.py (1550 of 2474) PASS: lldb-unit :: Interpreter/./InterpreterTests/OptionValueString.DeepCopy (1551 of 2474) PASS: lldb-api :: python_api/watchpoint/TestWatchpointIgnoreCount.py (1552 of 2474) UNSUPPORTED: lldb-shell :: ObjectFile/ELF/minidebuginfo-set-and-hit-breakpoint.test (1553 of 2474) PASS: lldb-unit :: Utility/./UtilityTests/ScalarTest.ExtractBitfield (1554 of 2474) PASS: lldb-unit :: Language/Highlighting/./HighlighterTests/HighlighterTest.ClangCursorPosAfterOtherToken (1555 of 2474) PASS: lldb-unit :: Expression/./ExpressionTests/DWARFExpression.DW_OP_unknown (1556 of 2474) PASS: lldb-api :: lang/objc/objc-struct-argument/TestObjCStructArgument.py (1557 of 2474) PASS: lldb-api :: lang/cpp/call-function/TestCallCPPFunction.py (1558 of 2474) PASS: lldb-unit :: SymbolFile/DWARF/./SymbolFileDWARFTests/SymbolFileDWARFTests.TestAbbrevMissingTerminator (1559 of 2474) PASS: lldb-unit :: Language/Highlighting/./HighlighterTests/HighlighterTest.ClangCursorPos (1560 of 2474) PASS: lldb-unit :: Host/./HostTests/HostInfoTest.GetHostname (1561 of 2474) PASS: lldb-shell :: SymbolFile/DWARF/x86/dwarf5-debug_line.s (1562 of 2474) PASS: lldb-api :: functionalities/thread/step_until/TestStepUntil.py (1563 of 2474) PASS: lldb-unit :: Utility/./UtilityTests/StringListTest.LongestCommonPrefix (1564 of 2474) PASS: lldb-unit :: Core/./LLDBCoreTests/CommunicationTest.WriteAll (1565 of 2474) PASS: lldb-unit :: Utility/./UtilityTests/DataExtractorTest.GetDoubleUnaligned (1566 of 2474) PASS: lldb-shell :: ScriptInterpreter/Python/command_import.test (1567 of 2474) PASS: lldb-shell :: ObjectFile/wasm/unified-debug-sections.yaml (1568 of 2474) PASS: lldb-unit :: ObjectFile/PECOFF/./ObjectFilePECOFFTests/PECallFrameInfoTest.Frame_reg_eh (1569 of 2474) PASS: lldb-api :: commands/expression/import-std-module/array/TestArrayFromStdModule.py (1570 of 2474) PASS: lldb-unit :: Utility/./UtilityTests/BinaryStreamTest.PutSLEB128MaxValue (1571 of 2474) PASS: lldb-unit :: Symbol/./SymbolTests/LineEntryTest.GetSameLineContiguousAddressRangeNoInlines (1572 of 2474) PASS: lldb-api :: lang/objc/modules-non-objc-target/TestObjCModulesNonObjCTarget.py (1573 of 2474) PASS: lldb-unit :: Process/gdb-remote/./ProcessGdbRemoteTests/GDBRemoteClientBaseTest.SendPacketAndReceiveResponseWithOutputSupport (1574 of 2474) PASS: lldb-unit :: Process/minidump/./LLDBMinidumpTests/MinidumpParserTest.MinidumpDuplicateModuleMappedSecond (1575 of 2474) PASS: lldb-api :: lang/cpp/this_class_type_mixing/TestThisClassTypeMixing.py (1576 of 2474) PASS: lldb-api :: commands/expression/completion-crash-incomplete-record/TestCompletionCrashIncompleteRecord.py (1577 of 2474) PASS: lldb-unit :: Utility/./UtilityTests/StringExtractorTest.GetNameColonValueSuccess (1578 of 2474) PASS: lldb-api :: functionalities/jitloader_gdb/TestJITLoaderGDB.py (1579 of 2474) PASS: lldb-unit :: Host/./HostTests/TerminalTest.SaveRestoreRAII (1580 of 2474) PASS: lldb-unit :: Language/CPlusPlus/./LanguageCPlusPlusTests/CPlusPlusLanguage.CPlusPlusNameParser (1581 of 2474) PASS: lldb-shell :: Settings/TestSettingsSet.test (1582 of 2474) UNSUPPORTED: lldb-shell :: Breakpoint/ppc64-localentry.test (1583 of 2474) PASS: lldb-unit :: UnwindAssembly/x86/./UnwindAssemblyx86Tests/Testx86AssemblyInspectionEngine.TestPushEAX (1584 of 2474) PASS: lldb-shell :: SymbolFile/Breakpad/unwind-via-stack-cfi.test (1585 of 2474) UNSUPPORTED: lldb-api :: functionalities/thread/state/TestThreadStates.py (1586 of 2474) PASS: lldb-unit :: Host/./HostTests/TerminalTest.PipeIsNotATerminal (1587 of 2474) PASS: lldb-shell :: Driver/TestSingleQuote.test (1588 of 2474) PASS: lldb-unit :: ScriptInterpreter/Python/./ScriptInterpreterPythonTests/PythonDataObjectsTest.TestPythonByteArray (1589 of 2474) PASS: lldb-shell :: SymbolFile/DWARF/x86/debug_ranges.s (1590 of 2474) PASS: lldb-unit :: Process/gdb-remote/./ProcessGdbRemoteTests/PortMapTest.FreePort (1591 of 2474) PASS: lldb-api :: commands/expression/import-std-module/unique_ptr/TestUniquePtrFromStdModule.py (1592 of 2474) PASS: lldb-unit :: Host/./HostTests/TerminalTest.PtyIsATerminal (1593 of 2474) PASS: lldb-api :: commands/watchpoints/hello_watchpoint/TestMyFirstWatchpoint.py (1594 of 2474) UNSUPPORTED: lldb-api :: lang/objc/rdar-12408181/TestRdar12408181.py (1595 of 2474) UNSUPPORTED: lldb-shell :: ScriptInterpreter/Lua/bindings.test (1596 of 2474) PASS: lldb-shell :: Commands/CommandScriptImmediateOutput/CommandScriptImmediateOutputConsole.test (1597 of 2474) PASS: lldb-shell :: Process/Optimization.test (1598 of 2474) PASS: lldb-api :: lang/objc/ivar-IMP/TestObjCiVarIMP.py (1599 of 2474) PASS: lldb-unit :: Utility/./UtilityTests/NameMatchesTest.Equals (1600 of 2474) PASS: lldb-api :: commands/command/script/TestCommandScript.py (1601 of 2474) PASS: lldb-unit :: Utility/./UtilityTests/UriParserTest.SchemeHostSeparator4 (1602 of 2474) PASS: lldb-api :: commands/frame/language/TestGuessLanguage.py (1603 of 2474) PASS: lldb-unit :: Utility/./UtilityTests/StringLexerTest.GetUnlexed (1604 of 2474) PASS: lldb-api :: commands/expression/ir-interpreter-phi-nodes/TestIRInterpreterPHINodes.py (1605 of 2474) PASS: lldb-unit :: ObjectFile/ELF/./ObjectFileELFTests/ObjectFileELFTest.GetModuleSpecifications_EarlySectionHeaders (1606 of 2474) PASS: lldb-unit :: Utility/./UtilityTests/StreamTest.AddressRangeSize (1607 of 2474) PASS: lldb-api :: macosx/indirect_symbol/TestIndirectSymbols.py (1608 of 2474) PASS: lldb-shell :: Settings/TestSettingsWrite.test (1609 of 2474) UNSUPPORTED: lldb-shell :: Subprocess/vfork-follow-parent-wp.test (1610 of 2474) PASS: lldb-api :: functionalities/thread/backtrace_all/TestBacktraceAll.py (1611 of 2474) PASS: lldb-api :: functionalities/breakpoint/breakpoint_locations/TestBreakpointLocations.py (1612 of 2474) PASS: lldb-api :: commands/expression/test/TestExprs2.py (1613 of 2474) PASS: lldb-unit :: Host/./HostTests/SocketTests/SocketTest.TCPGetConnectURI/ipv6 (1614 of 2474) PASS: lldb-api :: functionalities/tail_call_frames/disambiguate_tail_call_seq/TestDisambiguateTailCallSeq.py (1615 of 2474) PASS: lldb-api :: functionalities/postmortem/elf-core/gcore/TestGCore.py (1616 of 2474) PASS: lldb-unit :: UnwindAssembly/x86/./UnwindAssemblyx86Tests/Testx86AssemblyInspectionEngine.TestPopR13 (1617 of 2474) PASS: lldb-unit :: Core/./LLDBCoreTests/CommunicationTest.SynchronizeWhileClosing (1618 of 2474) PASS: lldb-unit :: UnwindAssembly/x86/./UnwindAssemblyx86Tests/Testx86AssemblyInspectionEngine.TestPopRBP (1619 of 2474) PASS: lldb-shell :: SymbolFile/DWARF/x86/find-qualified-variable.cpp (1620 of 2474) PASS: lldb-api :: assert_messages_test/TestAssertMessages.py (1621 of 2474) PASS: lldb-unit :: Utility/./UtilityTests/XcodeSDKTest.SDKSupportsSwift (1622 of 2474) UNSUPPORTED: lldb-shell :: Unwind/unwind-plan-dwarf-dump.test (1623 of 2474) PASS: lldb-api :: commands/watchpoints/watchpoint_count/TestWatchpointCount.py (1624 of 2474) PASS: lldb-shell :: Reproducer/TestFileRepro.test (1625 of 2474) PASS: lldb-api :: commands/expression/class_template_specialization_empty_pack/TestClassTemplateSpecializationParametersHandling.py (1626 of 2474) PASS: lldb-api :: functionalities/unwind/noreturn/module-end/TestNoReturnModuleEnd.py (1627 of 2474) UNSUPPORTED: lldb-api :: lang/objc/foundation/TestFoundationDisassembly.py (1628 of 2474) PASS: lldb-unit :: Utility/./UtilityTests/FileSpecTest.EqualSeparator (1629 of 2474) PASS: lldb-api :: api/command-return-object/TestSBCommandReturnObject.py (1630 of 2474) PASS: lldb-shell :: SymbolFile/Breakpad/line-table.test (1631 of 2474) PASS: lldb-api :: commands/expression/context-object-objc/TestContextObjectObjc.py (1632 of 2474) PASS: lldb-unit :: Expression/./ExpressionTests/DWARFExpression.DW_OP_convert (1633 of 2474) PASS: lldb-api :: python_api/sbenvironment/TestSBEnvironment.py (1634 of 2474) PASS: lldb-shell :: SymbolFile/absolute-symbol.test (1635 of 2474) PASS: lldb-unit :: Symbol/./SymbolTests/DWARFCallFrameInfoTest.Basic_dwarf4 (1636 of 2474) PASS: lldb-unit :: Expression/./ExpressionTests/DiagnosticManagerTest.AddDiagnostic (1637 of 2474) PASS: lldb-api :: macosx/save_crashlog/TestSaveCrashlog.py (1638 of 2474) PASS: lldb-shell :: Minidump/memory-region-from-module.yaml (1639 of 2474) UNSUPPORTED: lldb-api :: benchmarks/expression/TestExpressionCmd.py (1640 of 2474) PASS: lldb-unit :: Language/Highlighting/./HighlighterTests/HighlighterTest.ClangPreserveNewLine (1641 of 2474) PASS: lldb-unit :: Utility/./UtilityTests/StreamTest.PutStringAsRawHex8 (1642 of 2474) UNSUPPORTED: lldb-shell :: Subprocess/clone-follow-child.test (1643 of 2474) PASS: lldb-api :: functionalities/gdb_remote_client/TestNestedRegDefinitions.py (1644 of 2474) PASS: lldb-unit :: Process/Utility/./ProcessUtilityTests/ProcMapTests/LinuxProcMapsTestFixture.ParseMapRegions/8 (1645 of 2474) PASS: lldb-api :: functionalities/thread/concurrent_events/TestConcurrentTwoBreakpointsOneSignal.py (1646 of 2474) PASS: lldb-api :: functionalities/data-formatter/nsarraysynth/TestNSArraySynthetic.py (1647 of 2474) PASS: lldb-api :: commands/watchpoints/watchpoint_commands/command/TestWatchpointCommandPython.py (1648 of 2474) PASS: lldb-api :: commands/expression/weak_symbols/TestWeakSymbols.py (1649 of 2474) PASS: lldb-api :: lang/c/calling-conventions/TestCCallingConventions.py (1650 of 2474) PASS: lldb-api :: commands/expression/import-std-module/weak_ptr/TestWeakPtrFromStdModule.py (1651 of 2474) PASS: lldb-shell :: Watchpoint/SetErrorCases.test (1652 of 2474) PASS: lldb-unit :: Symbol/./SymbolTests/LineEntryTest.GetAllExactLineMatchesWithoutColumn (1653 of 2474) PASS: lldb-shell :: Process/UnsupportedLanguage.test (1654 of 2474) PASS: lldb-unit :: Expression/./ExpressionTests/CppModuleConfigurationTest.AmbiguousLibCpp (1655 of 2474) PASS: lldb-unit :: Utility/./UtilityTests/StringListTest.AppendStringStdString (1656 of 2474) PASS: lldb-unit :: SymbolFile/NativePDB/./SymbolFileNativePDBTests/PDBFPOProgramToDWARFExpressionTests.UnresolvedDependentCyclicRegisterAssignmentReference (1657 of 2474) PASS: lldb-api :: lang/objc/objc-baseclass-sbtype/TestObjCBaseClassSBType.py (1658 of 2474) PASS: lldb-unit :: Utility/./UtilityTests/RegularExpression.Valid (1659 of 2474) PASS: lldb-unit :: Utility/./UtilityTests/ScalarTest.GetValue (1660 of 2474) PASS: lldb-api :: lang/cpp/default-template-args/TestDefaultTemplateArgs.py (1661 of 2474) PASS: lldb-unit :: Utility/./UtilityTests/StringLexerTest.NextIf (1662 of 2474) UNSUPPORTED: lldb-api :: linux/sepdebugsymlink/TestTargetSymbolsSepDebugSymlink.py (1663 of 2474) PASS: lldb-unit :: Utility/./UtilityTests/UUIDTest.SetFromStringRef (1664 of 2474) PASS: lldb-unit :: Utility/./UtilityTests/RangeTest.NotEqual (1665 of 2474) PASS: lldb-api :: tools/lldb-vscode/module/TestVSCode_module.py (1666 of 2474) PASS: lldb-api :: lang/c/modules/TestCModules.py (1667 of 2474) PASS: lldb-shell :: Driver/TestError.test (1668 of 2474) PASS: lldb-unit :: Utility/./UtilityTests/UriParserTest.BracketedHostname (1669 of 2474) UNSUPPORTED: lldb-shell :: Register/x86-fp-read.test (1670 of 2474) PASS: lldb-api :: functionalities/data-formatter/varscript_formatting/TestDataFormatterVarScriptFormatting.py (1671 of 2474) PASS: lldb-api :: functionalities/data-formatter/user-format-vs-summary/TestUserFormatVsSummary.py (1672 of 2474) PASS: lldb-api :: functionalities/data-formatter/data-formatter-objc/TestDataFormatterObjCExpr.py (1673 of 2474) PASS: lldb-unit :: Utility/./UtilityTests/VMRange.SetEndAddress (1674 of 2474) PASS: lldb-api :: python_api/sbstructureddata/TestStructuredDataAPI.py (1675 of 2474) PASS: lldb-shell :: Reproducer/TestDriverOptions.test (1676 of 2474) PASS: lldb-api :: lang/c/conflicting-symbol/TestConflictingSymbol.py (1677 of 2474) PASS: lldb-unit :: ScriptInterpreter/Python/./ScriptInterpreterPythonTests/PythonDataObjectsTest.TestPythonDictionaryManipulation (1678 of 2474) PASS: lldb-unit :: SymbolFile/NativePDB/./SymbolFileNativePDBTests/PDBFPOProgramToDWARFExpressionTests.MultipleIndependentAssignments (1679 of 2474) PASS: lldb-api :: functionalities/tail_call_frames/thread_step_out_or_return/TestSteppingOutWithArtificialFrames.py (1680 of 2474) PASS: lldb-shell :: ExecControl/StopHook/stop-hook.test (1681 of 2474) PASS: lldb-shell :: ObjectFile/Breakpad/sections.test (1682 of 2474) PASS: lldb-unit :: SymbolFile/DWARF/./SymbolFileDWARFTests/SymbolFileDWARFTests.ParseArangesSkipErrors (1683 of 2474) UNSUPPORTED: lldb-api :: commands/trace/TestTraceSchema.py (1684 of 2474) PASS: lldb-unit :: Host/./HostTests/SocketTests/SocketTest.DomainListenConnectAccept/ipv6 (1685 of 2474) PASS: lldb-api :: functionalities/thread/concurrent_events/TestConcurrentTwoBreakpointThreads.py (1686 of 2474) PASS: lldb-api :: functionalities/abbreviation/TestCommonShortSpellings.py (1687 of 2474) PASS: lldb-unit :: Host/./HostTests/TerminalTest.SetRaw (1688 of 2474) PASS: lldb-unit :: Utility/./UtilityTests/StringLexerTest.PutBack (1689 of 2474) PASS: lldb-api :: commands/expression/persist_objc_pointeetype/TestPersistObjCPointeeType.py (1690 of 2474) PASS: lldb-unit :: Core/./LLDBCoreTests/FormatEntityTest.DefinitionConstructionNameAndString (1691 of 2474) PASS: lldb-api :: lang/cpp/trivial_abi/TestTrivialABI.py (1692 of 2474) PASS: lldb-unit :: Symbol/./SymbolTests/DWARFCallFrameInfoTest.Basic_eh (1693 of 2474) PASS: lldb-api :: functionalities/data-formatter/data-formatter-stl/libcxx/deque/TestDataFormatterLibcxxDeque.py (1694 of 2474) PASS: lldb-shell :: SymbolFile/Breakpad/line-table-edgecases.test (1695 of 2474) PASS: lldb-unit :: Utility/./UtilityTests/SerializationRountripTest.SerializeDeserializePod (1696 of 2474) PASS: lldb-api :: commands/expression/top-level/TestTopLevelExprs.py (1697 of 2474) PASS: lldb-unit :: Utility/./UtilityTests/StreamTest.AddressNoSuffix (1698 of 2474) PASS: lldb-api :: lang/cpp/bitfields/TestCppBitfields.py (1699 of 2474) PASS: lldb-shell :: SymbolFile/DWARF/x86/find-method-local-struct.cpp (1700 of 2474) PASS: lldb-api :: commands/process/attach/TestProcessAttach.py (1701 of 2474) PASS: lldb-shell :: SymbolFile/DWARF/x86/debug_line-tombstone.s (1702 of 2474) PASS: lldb-unit :: UnwindAssembly/x86/./UnwindAssemblyx86Tests/Testx86AssemblyInspectionEngine.Test32bitFramelessSmallStackFrame (1703 of 2474) PASS: lldb-unit :: Utility/./UtilityTests/SerializationRountripTest.SerializeDeserializeCStringArray (1704 of 2474) PASS: lldb-api :: functionalities/show_location/TestShowLocationDwarf5.py (1705 of 2474) PASS: lldb-shell :: SymbolFile/DWARF/x86/find-basic-function.cpp (1706 of 2474) PASS: lldb-shell :: SymbolFile/NativePDB/locate-pdb.cpp (1707 of 2474) PASS: lldb-shell :: SymbolFile/DWARF/x86/dwarf5-split.s (1708 of 2474) PASS: lldb-api :: functionalities/data-formatter/data-formatter-objc/TestDataFormatterObjCNSDate.py (1709 of 2474) PASS: lldb-unit :: Utility/./UtilityTests/ConstStringTest.CompareStringRef (1710 of 2474) PASS: lldb-api :: lang/c/builtin-types/TestCBuiltinTypes.py (1711 of 2474) PASS: lldb-unit :: Process/gdb-remote/./ProcessGdbRemoteTests/PortMapTest.FreePortForProcess (1712 of 2474) UNSUPPORTED: lldb-api :: commands/register/register/aarch64_dynamic_regset/TestArm64DynamicRegsets.py (1713 of 2474) UNSUPPORTED: lldb-shell :: ScriptInterpreter/Lua/fail_breakpoint_oneline.test (1714 of 2474) PASS: lldb-unit :: Utility/./UtilityTests/ArgsTest.TestInsertArg (1715 of 2474) PASS: lldb-unit :: SymbolFile/DWARF/./SymbolFileDWARFTests/DWARFASTParserClangTests.TestCallingConventionParsing (1716 of 2474) PASS: lldb-api :: functionalities/data-formatter/data-formatter-stl/libcxx/iterator/TestDataFormatterLibccIterator.py (1717 of 2474) PASS: lldb-unit :: Process/Utility/./ProcessUtilityTests/MemoryTagManagerAArch64MTETest.RemoveNonAddressBits (1718 of 2474) PASS: lldb-shell :: SymbolFile/DWARF/x86/dwarf5_locations.s (1719 of 2474) PASS: lldb-api :: api/multiple-debuggers/TestMultipleDebuggers.py (1720 of 2474) PASS: lldb-unit :: Utility/./UtilityTests/RangeTest.ContainsAddr (1721 of 2474) PASS: lldb-unit :: Breakpoint/./LLDBBreakpointTests/BreakpointIDTest.StringIsBreakpointName (1722 of 2474) PASS: lldb-unit :: SymbolFile/DWARF/./SymbolFileDWARFTests/SymbolFileDWARFTests.TestAbbrevOrder1Start1 (1723 of 2474) PASS: lldb-unit :: ObjectFile/Breakpad/./ObjectFileBreakpadTests/Record.classify (1724 of 2474) PASS: lldb-api :: python_api/default-constructor/TestDefaultConstructorForAPIObjects.py (1725 of 2474) PASS: lldb-api :: functionalities/thread/step_out/TestThreadStepOut.py (1726 of 2474) PASS: lldb-shell :: ObjectFile/wasm/basic.yaml (1727 of 2474) PASS: lldb-api :: functionalities/data-formatter/data-formatter-stl/libcxx/optional/TestDataFormatterLibcxxOptional.py (1728 of 2474) PASS: lldb-unit :: Language/Highlighting/./HighlighterTests/HighlighterTest.ClangOperators (1729 of 2474) PASS: lldb-unit :: ObjectFile/Breakpad/./ObjectFileBreakpadTests/FuncRecord.parse (1730 of 2474) PASS: lldb-unit :: Utility/./UtilityTests/SerializationRountripTest.SerializeDeserializePodPointers (1731 of 2474) UNSUPPORTED: lldb-api :: commands/trace/multiple-threads/TestTraceStartStopMultipleThreads.py (1732 of 2474) PASS: lldb-unit :: Host/./HostTests/SocketTests/SocketTest.DecodeHostAndPort/ipv4 (1733 of 2474) PASS: lldb-api :: functionalities/gdb_remote_client/TestGDBRemoteClient.py (1734 of 2474) PASS: lldb-api :: python_api/frame/TestFrames.py (1735 of 2474) PASS: lldb-shell :: VSCode/TestOptions.test (1736 of 2474) PASS: lldb-unit :: Process/minidump/./LLDBMinidumpTests/MinidumpParserTest.GetMiscInfo_no_stream (1737 of 2474) PASS: lldb-unit :: Utility/./UtilityTests/FileSpecTest.PrependPathComponent (1738 of 2474) PASS: lldb-api :: commands/command/regex/TestRegexCommand.py (1739 of 2474) PASS: lldb-api :: commands/expression/po_verbosity/TestPoVerbosity.py (1740 of 2474) PASS: lldb-api :: functionalities/tail_call_frames/inlining_and_tail_calls/TestInliningAndTailCalls.py (1741 of 2474) PASS: lldb-api :: lang/cpp/modules-import/TestCXXModulesImport.py (1742 of 2474) PASS: lldb-unit :: Expression/./ExpressionTests/DiagnosticManagerTest.PutStringSeverities (1743 of 2474) PASS: lldb-api :: python_api/module_section/TestModuleAndSection.py (1744 of 2474) PASS: lldb-shell :: ObjectFile/ELF/null-jmprel.yaml (1745 of 2474) UNSUPPORTED: lldb-api :: functionalities/process_save_core/TestProcessSaveCore.py (1746 of 2474) PASS: lldb-shell :: SymbolFile/NativePDB/function-types-classes.cpp (1747 of 2474) UNSUPPORTED: lldb-api :: commands/trace/TestTraceDumpInfo.py (1748 of 2474) PASS: lldb-api :: python_api/debugger/TestDebuggerAPI.py (1749 of 2474) PASS: lldb-shell :: SymbolFile/DWARF/x86/DW_AT_data_bit_offset-DW_OP_stack_value.s (1750 of 2474) PASS: lldb-unit :: Utility/./UtilityTests/Flags.AllSet (1751 of 2474) PASS: lldb-shell :: Reproducer/TestHomeDir.test (1752 of 2474) PASS: lldb-unit :: Utility/./UtilityTests/ArgsTest.GetQuotedCommandString (1753 of 2474) PASS: lldb-api :: lang/cpp/class-template-parameter-pack/TestClassTemplateParameterPack.py (1754 of 2474) PASS: lldb-api :: functionalities/data-formatter/array_typedef/TestArrayTypedef.py (1755 of 2474) PASS: lldb-unit :: Utility/./UtilityTests/StringExtractorTest.GetHexU8_InvalidHex (1756 of 2474) PASS: lldb-unit :: Target/./TargetTests/MemoryRegionInfoTest.Formatv (1757 of 2474) PASS: lldb-unit :: Utility/./UtilityTests/RecordReplayTest.InstrumentedBarPtr (1758 of 2474) PASS: lldb-api :: lang/c/array_types/TestArrayTypes.py (1759 of 2474) PASS: lldb-unit :: Utility/./UtilityTests/AnsiTerminal.Empty (1760 of 2474) PASS: lldb-api :: functionalities/breakpoint/scripted_bkpt/TestScriptedResolver.py (1761 of 2474) PASS: lldb-shell :: ScriptInterpreter/Python/sb_address_exception.test (1762 of 2474) PASS: lldb-unit :: Utility/./UtilityTests/StringListTest.AppendListCStringArray (1763 of 2474) PASS: lldb-shell :: SymbolFile/DWARF/x86/DW_TAG_variable-invalid_location.s (1764 of 2474) PASS: lldb-unit :: SymbolFile/DWARF/./SymbolFileDWARFTests/SymbolFileDWARFTests.TestAbbrevOrder1Start5 (1765 of 2474) PASS: lldb-unit :: UnwindAssembly/x86/./UnwindAssemblyx86Tests/Testx86AssemblyInspectionEngine.TestSubESP (1766 of 2474) PASS: lldb-unit :: Platform/./LLDBPlatformTests/PlatformDarwinTest.GetCompatibleArchARMv7 (1767 of 2474) PASS: lldb-api :: commands/watchpoints/multiple_hits/TestMultipleHits.py (1768 of 2474) PASS: lldb-shell :: Reproducer/TestWorkingDir.test (1769 of 2474) PASS: lldb-unit :: Utility/./UtilityTests/FileSpecTest.RemoveLastPathComponent (1770 of 2474) UNSUPPORTED: lldb-shell :: Register/x86-gp-read.test (1771 of 2474) PASS: lldb-unit :: Host/./HostTests/SocketTests/SocketTest.DomainGetConnectURI/ipv4 (1772 of 2474) PASS: lldb-unit :: Symbol/./SymbolTests/TestTypeSystemClang.TestUnifyAccessSpecifiers (1773 of 2474) PASS: lldb-api :: functionalities/tail_call_frames/ambiguous_tail_call_seq2/TestAmbiguousTailCallSeq2.py (1774 of 2474) PASS: lldb-api :: tools/lldb-server/commandline/TestStubSetSID.py (1775 of 2474) PASS: lldb-unit :: Utility/./UtilityTests/UriParserTest.SchemeHostSeparator3 (1776 of 2474) PASS: lldb-unit :: Utility/./UtilityTests/OptionsWithRawTest.ArgsButNoDelimiter (1777 of 2474) PASS: lldb-api :: macosx/function-starts/TestFunctionStarts.py (1778 of 2474) PASS: lldb-unit :: Platform/./LLDBPlatformTests/PlatformDarwinTest.GetCompatibleArchARMv4 (1779 of 2474) PASS: lldb-shell :: Settings/TestFrameFormatMangling.test (1780 of 2474) PASS: lldb-unit :: Host/./HostTests/FileSystemTest.FileAndDirectoryComponents (1781 of 2474) PASS: lldb-unit :: API/./APITests/SBCommandInterpreterTest.SingleWordCommand (1782 of 2474) PASS: lldb-unit :: Utility/./UtilityTests/ArgsTest.TestQuotedUnknownEscape (1783 of 2474) UNSUPPORTED: lldb-api :: macosx/posix_spawn/TestLaunchProcessPosixSpawn.py (1784 of 2474) PASS: lldb-unit :: SymbolFile/DWARF/./SymbolFileDWARFTests/DWARFUnitTest.LLVMGCCProducer (1785 of 2474) UNSUPPORTED: lldb-api :: functionalities/tsan/cpp_global_location/TestTsanCPPGlobalLocation.py (1786 of 2474) PASS: lldb-unit :: Utility/./UtilityTests/StringListTest.InsertStringAtIndexStdString (1787 of 2474) PASS: lldb-api :: commands/expression/issue_11588/Test11588.py (1788 of 2474) PASS: lldb-api :: lang/cpp/const_this/TestConstThis.py (1789 of 2474) PASS: lldb-unit :: Utility/./UtilityTests/UriParserTest.TypicalPortPathIPv4 (1790 of 2474) PASS: lldb-api :: functionalities/dead-strip/TestDeadStrip.py (1791 of 2474) UNSUPPORTED: lldb-shell :: ObjectFile/ELF/minidebuginfo-no-lzma.yaml (1792 of 2474) PASS: lldb-shell :: ObjectFile/Breakpad/uuid-matching-mac.test (1793 of 2474) PASS: lldb-unit :: Symbol/./SymbolTests/TestTypeSystemClang.TestIsClangType (1794 of 2474) PASS: lldb-api :: commands/expression/context-object/TestContextObject.py (1795 of 2474) PASS: lldb-unit :: Host/./HostTests/NativeProcessProtocolTest.SetBreakpoint (1796 of 2474) PASS: lldb-unit :: Symbol/./SymbolTests/TestTypeSystemClang.GetFullyUnqualifiedType (1797 of 2474) PASS: lldb-api :: functionalities/pre_run_dylibs/TestPreRunDylibs.py (1798 of 2474) PASS: lldb-api :: functionalities/thread/concurrent_events/TestConcurrentSignalWatchBreak.py (1799 of 2474) PASS: lldb-api :: functionalities/conditional_break/TestConditionalBreak.py (1800 of 2474) PASS: lldb-api :: commands/expression/import-std-module/sysroot/TestStdModuleSysroot.py (1801 of 2474) UNSUPPORTED: lldb-api :: commands/watchpoints/variable_out_of_scope/TestWatchedVarHitWhenInScope.py (1802 of 2474) PASS: lldb-api :: lang/cpp/offsetof/TestOffsetofCpp.py (1803 of 2474) PASS: lldb-api :: commands/platform/basic/TestPlatformPython.py (1804 of 2474) PASS: lldb-unit :: Utility/./UtilityTests/RegularExpression.Empty (1805 of 2474) PASS: lldb-shell :: ObjectFile/ELF/PT_LOAD-overlap-PT_TLS.yaml (1806 of 2474) PASS: lldb-api :: commands/expression/function_template_specialization_temp_args/TestFunctionTemplateSpecializationTempArgs.py (1807 of 2474) PASS: lldb-api :: lang/c/local_variables/TestLocalVariables.py (1808 of 2474) PASS: lldb-shell :: SymbolFile/DWARF/x86/DW_AT_declaration-with-children.s (1809 of 2474) PASS: lldb-unit :: Target/./TargetTests/ModuleCacheTest.GetAndPutStrangeHostname (1810 of 2474) PASS: lldb-shell :: SymbolFile/DWARF/x86/array-sizes.s (1811 of 2474) PASS: lldb-api :: lang/cpp/typedef/TestCppTypedef.py (1812 of 2474) PASS: lldb-unit :: Core/./LLDBCoreTests/FormatEntityTest.DefinitionConstructionNameTypeChildren (1813 of 2474) PASS: lldb-api :: lang/objc/rdar-10967107/TestRdar10967107.py (1814 of 2474) PASS: lldb-api :: lang/objc/foundation/TestObjCMethodsNSError.py (1815 of 2474) PASS: lldb-api :: python_api/function_symbol/TestSymbolAPI.py (1816 of 2474) PASS: lldb-shell :: SymbolFile/NativePDB/source-list.cpp (1817 of 2474) PASS: lldb-unit :: Utility/./UtilityTests/StreamTest.PutCStringWithStringRef (1818 of 2474) PASS: lldb-api :: lang/objc/modules-inline-functions/TestModulesInlineFunctions.py (1819 of 2474) PASS: lldb-api :: lang/objc/objc-new-syntax/TestObjCNewSyntaxDictionary.py (1820 of 2474) PASS: lldb-api :: functionalities/inferior-crashing/recursive-inferior/TestRecursiveInferiorStep.py (1821 of 2474) PASS: lldb-shell :: SymbolFile/DWARF/x86/debug-line-basic.s (1822 of 2474) PASS: lldb-api :: commands/process/launch-with-shellexpand/TestLaunchWithShellExpand.py (1823 of 2474) XFAIL: lldb-shell :: Register/x86-64-write.test (1824 of 2474) PASS: lldb-api :: python_api/sbvalue_const_addrof/TestSBValueConstAddrOf.py (1825 of 2474) PASS: lldb-unit :: Utility/./UtilityTests/BroadcasterTest.EventTypeHasListeners (1826 of 2474) PASS: lldb-unit :: Expression/./ExpressionTests/DiagnosticManagerTest.GetStringMultiline (1827 of 2474) PASS: lldb-shell :: Register/Core/x86-32-linux-addr.test (1828 of 2474) PASS: lldb-unit :: Process/Utility/./ProcessUtilityTests/MemoryTagManagerAArch64MTETest.ExpandToGranule (1829 of 2474) PASS: lldb-unit :: Utility/./UtilityTests/RangeTest.ContainsEndInclusiveInvalid (1830 of 2474) PASS: lldb-unit :: Symbol/./SymbolTests/TestTypeSystemClang.OnlyPackName (1831 of 2474) PASS: lldb-unit :: Utility/./UtilityTests/Predicate.WaitForValueEqualTo (1832 of 2474) PASS: lldb-api :: commands/frame/diagnose/complicated-expression/TestComplicatedExpression.py (1833 of 2474) PASS: lldb-unit :: Utility/./UtilityTests/StreamTeeTest.GetStreamAtIndexOutOfBounds (1834 of 2474) PASS: lldb-unit :: Process/minidump/./LLDBMinidumpTests/MinidumpParserTest.MinidumpModuleOrder (1835 of 2474) PASS: lldb-api :: functionalities/gdb_remote_client/TestMultiprocess.py (1836 of 2474) PASS: lldb-unit :: UnwindAssembly/x86/./UnwindAssemblyx86Tests/Testx86AssemblyInspectionEngine.TestPushR15 (1837 of 2474) PASS: lldb-unit :: Utility/./UtilityTests/DataExtractorTest.GetSLEB128_bit63 (1838 of 2474) PASS: lldb-api :: lang/cpp/char8_t/TestCxxChar8_t.py (1839 of 2474) UNSUPPORTED: lldb-api :: commands/watchpoints/multi_watchpoint_slots/TestWatchpointMultipleSlots.py (1840 of 2474) PASS: lldb-api :: tools/lldb-server/TestGdbRemoteExitCode.py (1841 of 2474) PASS: lldb-unit :: Host/./HostTests/PipeTest.OpenAsReader (1842 of 2474) PASS: lldb-unit :: Utility/./UtilityTests/StreamTest.PutHex64ByteOrderLittle (1843 of 2474) PASS: lldb-shell :: SymbolFile/NativePDB/s_constant.cpp (1844 of 2474) PASS: lldb-shell :: Host/TestCustomShell.test (1845 of 2474) PASS: lldb-shell :: Reproducer/TestGDBRemoteRepro.test (1846 of 2474) PASS: lldb-api :: functionalities/inferior-crashing/TestInferiorCrashingStep.py (1847 of 2474) PASS: lldb-unit :: Utility/./UtilityTests/ReproducerTest.SetCapture (1848 of 2474) PASS: lldb-unit :: Language/Highlighting/./HighlighterTests/HighlighterTest.ClangScalarLiterals (1849 of 2474) PASS: lldb-shell :: Reproducer/Functionalities/TestStepping.test (1850 of 2474) PASS: lldb-unit :: UnwindAssembly/x86/./UnwindAssemblyx86Tests/Testx86AssemblyInspectionEngine.TestPopR15 (1851 of 2474) PASS: lldb-unit :: Process/minidump/./LLDBMinidumpTests/MinidumpParserTest.GetThreadsAndGetThreadContext (1852 of 2474) PASS: lldb-unit :: Utility/./UtilityTests/StringListTest.ForRangeEmpty (1853 of 2474) PASS: lldb-api :: macosx/load-kext/TestLoadKext.py (1854 of 2474) PASS: lldb-unit :: ScriptInterpreter/Python/./ScriptInterpreterPythonTests/PythonDataObjectsTest.TestPythonIntegerToStructuredInteger (1855 of 2474) PASS: lldb-unit :: Utility/./UtilityTests/ArgsTest.TestSingleArg (1856 of 2474) PASS: lldb-api :: python_api/watchpoint/condition/TestWatchpointConditionAPI.py (1857 of 2474) PASS: lldb-shell :: Breakpoint/debug_rnglist_basic.test (1858 of 2474) PASS: lldb-api :: lang/cpp/pointer_to_member_type_depending_on_parent_size/TestPointerToMemberTypeDependingOnParentSize.py (1859 of 2474) PASS: lldb-api :: lang/cpp/gmodules-templates/TestGModules.py (1860 of 2474) UNSUPPORTED: lldb-shell :: Register/x86-gp-write.test (1861 of 2474) PASS: lldb-api :: lang/objc/objc-dyn-sbtype/TestObjCDynamicSBType.py (1862 of 2474) UNSUPPORTED: lldb-api :: commands/expression/multiline-completion/TestMultilineCompletion.py (1863 of 2474) PASS: lldb-unit :: debugserver/./debugserverTests/RNBSocket.LoopBackListenIPv4 (1864 of 2474) PASS: lldb-api :: functionalities/reproducers/fs-case-sensitivity/TestReproducerFSCaseSensitivity.py (1865 of 2474) PASS: lldb-api :: commands/watchpoints/watchpoint_on_vectors/TestValueOfVectorVariable.py (1866 of 2474) PASS: lldb-api :: commands/expression/options/TestExprOptions.py (1867 of 2474) PASS: lldb-shell :: BuildScript/modes.test (1868 of 2474) PASS: lldb-api :: lang/c/enum_types/TestEnumTypes.py (1869 of 2474) PASS: lldb-unit :: ObjectFile/Breakpad/./ObjectFileBreakpadTests/InlineRecord.parse (1870 of 2474) UNSUPPORTED: lldb-api :: functionalities/thread/thread_specific_break_plus_condition/TestThreadSpecificBpPlusCondition.py (1871 of 2474) PASS: lldb-unit :: Platform/./LLDBPlatformTests/PlatformDarwinTest.GetCompatibleArchARMv6 (1872 of 2474) PASS: lldb-shell :: Driver/TestRepl.test (1873 of 2474) PASS: lldb-api :: types/TestRecursiveTypes.py (1874 of 2474) PASS: lldb-unit :: Utility/./UtilityTests/StringExtractorTest.GetU64BigEndian (1875 of 2474) PASS: lldb-unit :: ScriptInterpreter/Python/./ScriptInterpreterPythonTests/PythonDataObjectsTest.TestPythonBoolean (1876 of 2474) PASS: lldb-api :: lang/cpp/nested-class-other-compilation-unit/TestNestedClassWithParentInAnotherCU.py (1877 of 2474) PASS: lldb-api :: lang/cpp/class_static/TestStaticVariables.py (1878 of 2474) PASS: lldb-unit :: Core/./LLDBCoreTests/ModuleSpecTest.TestMachOFile (1879 of 2474) PASS: lldb-unit :: Utility/./UtilityTests/StreamTest.AddressSuffix (1880 of 2474) PASS: lldb-api :: functionalities/data-formatter/data-formatter-skip-summary/TestDataFormatterSkipSummary.py (1881 of 2474) PASS: lldb-unit :: UnwindAssembly/x86/./UnwindAssemblyx86Tests/Testx86AssemblyInspectionEngine.TestPushEBP (1882 of 2474) PASS: lldb-api :: types/TestFloatTypesExpr.py (1883 of 2474) PASS: lldb-unit :: Utility/./UtilityTests/OptionsWithRawTest.EmptySuffixSingleWhitespace (1884 of 2474) PASS: lldb-api :: functionalities/data-formatter/language_category_updates/TestDataFormatterLanguageCategoryUpdates.py (1885 of 2474) PASS: lldb-api :: functionalities/gdb_remote_client/TestThreadSelectionBug.py (1886 of 2474) PASS: lldb-api :: commands/expression/fixits/TestFixIts.py (1887 of 2474) PASS: lldb-api :: tools/lldb-server/TestGdbRemoteProcessInfo.py (1888 of 2474) PASS: lldb-api :: functionalities/gdb_remote_client/TestGDBServerTargetXML.py (1889 of 2474) UNSUPPORTED: lldb-shell :: Register/x86-db-read.test (1890 of 2474) PASS: lldb-unit :: UnwindAssembly/x86/./UnwindAssemblyx86Tests/Testx86AssemblyInspectionEngine.TestDisassemblyJunkBytes (1891 of 2474) PASS: lldb-shell :: ObjectFile/ELF/gnu-debuglink.yaml (1892 of 2474) PASS: lldb-api :: lang/objc/foundation/TestSymbolTable.py (1893 of 2474) PASS: lldb-unit :: Utility/./UtilityTests/AnsiTerminal.WhiteSpace (1894 of 2474) PASS: lldb-api :: functionalities/tail_call_frames/cross_dso/TestCrossDSOTailCalls.py (1895 of 2474) PASS: lldb-unit :: Utility/./UtilityTests/RangeDataVector.FindEntryIndexesThatContain (1896 of 2474) PASS: lldb-shell :: Commands/command-stop-hook-output.test (1897 of 2474) PASS: lldb-unit :: Host/./HostTests/SocketTests/SocketTest.TCPListen0ConnectAccept/ipv4 (1898 of 2474) PASS: lldb-shell :: Reproducer/TestFinalize.test (1899 of 2474) PASS: lldb-api :: functionalities/breakpoint/breakpoint_command/TestBreakpointCommand.py (1900 of 2474) PASS: lldb-api :: commands/reproducer/invalid-args/TestInvalidArgsReproducer.py (1901 of 2474) PASS: lldb-api :: commands/frame/select/TestFrameSelect.py (1902 of 2474) PASS: lldb-unit :: Language/CPlusPlus/./LanguageCPlusPlusTests/CPlusPlusLanguage.ExtractContextAndIdentifier (1903 of 2474) PASS: lldb-unit :: Utility/./UtilityTests/StringListTest.RemoveBlankLines (1904 of 2474) PASS: lldb-unit :: Utility/./UtilityTests/RangeTest.Copy (1905 of 2474) PASS: lldb-unit :: Expression/./ExpressionTests/DWARFExpressionMockProcessTest.DW_OP_deref (1906 of 2474) PASS: lldb-unit :: UnwindAssembly/x86/./UnwindAssemblyx86Tests/Testx86AssemblyInspectionEngine.TestLEAVE (1907 of 2474) PASS: lldb-unit :: Expression/./ExpressionTests/DiagnosticManagerTest.GetStringMultipleDiags (1908 of 2474) UNSUPPORTED: lldb-shell :: SymbolFile/PDB/ast-restore.test (1909 of 2474) PASS: lldb-api :: lang/cpp/bool/TestCPPBool.py (1910 of 2474) PASS: lldb-unit :: Utility/./UtilityTests/FileSpecTest.EqualDotsPosix (1911 of 2474) PASS: lldb-unit :: Utility/./UtilityTests/StreamTest.PutBytesAsRawHex8ToLittleEndian (1912 of 2474) PASS: lldb-unit :: Utility/./UtilityTests/StreamTest.PutBytesAsRawHex8ToBigEndian (1913 of 2474) PASS: lldb-shell :: ScriptInterpreter/Python/Crashlog/text.test (1914 of 2474) PASS: lldb-unit :: ScriptInterpreter/Python/./ScriptInterpreterPythonTests/PythonDataObjectsTest.TestTypeNameResolutionNoDot (1915 of 2474) PASS: lldb-shell :: SymbolFile/DWARF/x86/subprogram_ranges.test (1916 of 2474) PASS: lldb-api :: macosx/safe-to-func-call/TestSafeFuncCalls.py (1917 of 2474) UNSUPPORTED: lldb-api :: functionalities/ptrauth_diagnostics/brkC47x_x16_invalid/TestPtrauthBRKc47xX16Invalid.py (1918 of 2474) PASS: lldb-shell :: Breakpoint/debug_addrx.test (1919 of 2474) PASS: lldb-api :: functionalities/data-formatter/data-formatter-stl/generic/multiset/TestDataFormatterGenericMultiSet.py (1920 of 2474) PASS: lldb-api :: lang/cpp/rvalue-references/TestRvalueReferences.py (1921 of 2474) UNSUPPORTED: lldb-api :: benchmarks/continue/TestBenchmarkContinue.py (1922 of 2474) PASS: lldb-api :: commands/expression/call-function/TestCallUserDefinedFunction.py (1923 of 2474) PASS: lldb-api :: commands/session/save/TestSessionSave.py (1924 of 2474) PASS: lldb-api :: functionalities/thread/concurrent_events/TestConcurrentCrashWithWatchpointBreakpointSignal.py (1925 of 2474) PASS: lldb-shell :: ObjectFile/ELF/avr-basic-info.yaml (1926 of 2474) PASS: lldb-api :: functionalities/optimized_code/TestNoASanExceptionAfterEvalOP_piece.py (1927 of 2474) PASS: lldb-api :: functionalities/gdb_remote_client/TestPartialGPacket.py (1928 of 2474) PASS: lldb-unit :: Platform/./LLDBPlatformTests/PlatformDarwinTest.GetCompatibleArchARMv7m (1929 of 2474) PASS: lldb-unit :: Process/Utility/./ProcessUtilityTests/MemoryTagManagerAArch64MTETest.MakeTaggedRange (1930 of 2474) PASS: lldb-api :: lang/cpp/llvm-style/TestLLVMStyle.py (1931 of 2474) PASS: lldb-unit :: Utility/./UtilityTests/ArgsTest.TestMultipleArgs (1932 of 2474) UNSUPPORTED: lldb-shell :: SymbolFile/PDB/function-level-linking.test (1933 of 2474) UNSUPPORTED: lldb-api :: functionalities/tty/TestTerminal.py (1934 of 2474) PASS: lldb-unit :: Core/./LLDBCoreTests/DumpDataExtractorTest.BaseAddress (1935 of 2474) PASS: lldb-unit :: Utility/./UtilityTests/StringExtractorTest.GetHexBytes_Partial (1936 of 2474) PASS: lldb-unit :: Core/./LLDBCoreTests/StreamCallbackTest.Callback (1937 of 2474) PASS: lldb-api :: macosx/stack-corefile/TestStackCorefile.py (1938 of 2474) PASS: lldb-api :: functionalities/thread/concurrent_events/TestConcurrentCrashWithSignal.py (1939 of 2474) PASS: lldb-unit :: DataFormatter/./LLDBFormatterTests/TypeMatcherTests.GetMatchStringExactName (1940 of 2474) PASS: lldb-api :: lang/objc/foundation/TestObjCMethodsNSArray.py (1941 of 2474) PASS: lldb-api :: functionalities/postmortem/minidump/TestMiniDump.py (1942 of 2474) PASS: lldb-api :: commands/help/TestHelp.py (1943 of 2474) PASS: lldb-api :: lang/cpp/frame-var-anon-unions/TestFrameVariableAnonymousUnions.py (1944 of 2474) PASS: lldb-unit :: Utility/./UtilityTests/StreamTeeTest.Assignment (1945 of 2474) PASS: lldb-api :: tools/lldb-server/inferior-crash/TestGdbRemoteAbort.py (1946 of 2474) PASS: lldb-api :: functionalities/plugins/command_plugin/TestPluginCommands.py (1947 of 2474) PASS: lldb-api :: api/multithreaded/TestMultithreaded.py (1948 of 2474) UNSUPPORTED: lldb-api :: benchmarks/stepping/TestSteppingSpeed.py (1949 of 2474) PASS: lldb-shell :: Reproducer/TestDump.test (1950 of 2474) UNSUPPORTED: lldb-shell :: Register/x86-ymm-write.test (1951 of 2474) PASS: lldb-unit :: Utility/./UtilityTests/StreamTest.AddressSize (1952 of 2474) PASS: lldb-unit :: Utility/./UtilityTests/ArgsTest.EscapeLLDBCommandArgument (1953 of 2474) UNSUPPORTED: lldb-api :: tools/lldb-server/memory-tagging/TestGdbRemoteMemoryTagging.py (1954 of 2474) PASS: lldb-unit :: Utility/./UtilityTests/RangeTest.DoesIntersect (1955 of 2474) PASS: lldb-api :: lang/cpp/thread_local/TestThreadLocal.py (1956 of 2474) PASS: lldb-api :: lang/mixed/TestMixedLanguages.py (1957 of 2474) PASS: lldb-unit :: Utility/./UtilityTests/Flags.Clear (1958 of 2474) PASS: lldb-unit :: debugserver/./debugserverTests/RNBSocket.AnyListen (1959 of 2474) UNSUPPORTED: lldb-shell :: SymbolFile/NativePDB/local-variables.cpp (1960 of 2474) PASS: lldb-unit :: Process/gdb-remote/./ProcessGdbRemoteTests/PortMapTest.AllowPort (1961 of 2474) PASS: lldb-shell :: ObjectFile/PECOFF/basic-info-arm.yaml (1962 of 2474) PASS: lldb-unit :: Language/Highlighting/./HighlighterTests/HighlighterTest.ClangComments (1963 of 2474) PASS: lldb-unit :: Utility/./UtilityTests/DataExtractorTest.GetCStrAtNullOffset (1964 of 2474) PASS: lldb-api :: python_api/lldbutil/iter/TestRegistersIterator.py (1965 of 2474) PASS: lldb-api :: commands/expression/import-std-module/vector/TestVectorFromStdModule.py (1966 of 2474) PASS: lldb-unit :: Interpreter/./InterpreterTests/OptionValueArgs.DeepCopy (1967 of 2474) PASS: lldb-api :: functionalities/gdb_remote_client/TestArmRegisterDefinition.py (1968 of 2474) PASS: lldb-api :: functionalities/postmortem/minidump-new/TestMiniDumpNew.py (1969 of 2474) PASS: lldb-unit :: Utility/./UtilityTests/StringExtractorTest.GetHexU8_InvalidHex_NoEof (1970 of 2474) PASS: lldb-unit :: Utility/./UtilityTests/StringListTest.SetSize (1971 of 2474) PASS: lldb-unit :: Utility/./UtilityTests/BinaryStreamTest.PutULEB128Zero (1972 of 2474) PASS: lldb-api :: commands/watchpoints/watchpoint_size/TestWatchpointSizes.py (1973 of 2474) PASS: lldb-shell :: SymbolFile/DWARF/x86/dir-separator-windows.s (1974 of 2474) PASS: lldb-api :: commands/watchpoints/watchpoint_disable/TestWatchpointDisable.py (1975 of 2474) PASS: lldb-api :: python_api/frame/inlines/TestInlinedFrame.py (1976 of 2474) PASS: lldb-api :: commands/process/attach-resume/TestAttachResume.py (1977 of 2474) PASS: lldb-unit :: Host/./HostTests/TerminalTest.SetParityCheck (1978 of 2474) PASS: lldb-unit :: Utility/./UtilityTests/StatusTest.Formatv (1979 of 2474) PASS: lldb-api :: functionalities/data-formatter/data-formatter-stl/libcxx/queue/TestDataFormatterLibcxxQueue.py (1980 of 2474) UNSUPPORTED: lldb-api :: functionalities/data-formatter/data-formatter-stl/libstdcpp/vbool/TestDataFormatterStdVBool.py (1981 of 2474) PASS: lldb-api :: commands/expression/anonymous-struct/TestCallUserAnonTypedef.py (1982 of 2474) PASS: lldb-api :: functionalities/data-formatter/dump_dynamic/TestDumpDynamic.py (1983 of 2474) PASS: lldb-unit :: Utility/./UtilityTests/TimerTest.CategoryTimesNested (1984 of 2474) PASS: lldb-unit :: Editline/./EditlineTests/EditlineTestFixture.EditlineReceivesMultiLineText (1985 of 2474) PASS: lldb-unit :: Utility/./UtilityTests/StringListTest.JoinNonSpace (1986 of 2474) PASS: lldb-unit :: Host/./HostTests/FileSystemTest.MakeAbsolute (1987 of 2474) PASS: lldb-unit :: Utility/./UtilityTests/OptionsWithRawTest.EmptySuffix (1988 of 2474) PASS: lldb-shell :: Register/Core/x86-32-freebsd-multithread.test (1989 of 2474) PASS: lldb-shell :: ObjectFile/PECOFF/export-dllfunc.yaml (1990 of 2474) PASS: lldb-api :: lang/cpp/dynamic-value/TestDynamicValue.py (1991 of 2474) PASS: lldb-unit :: Process/./ProcessEventDataTests/ProcessEventDataTest.ShouldStop (1992 of 2474) PASS: lldb-unit :: Core/./LLDBCoreTests/DumpDataExtractorTest.FormatCharArray (1993 of 2474) PASS: lldb-api :: lang/cpp/nsimport/TestCppNsImport.py (1994 of 2474) PASS: lldb-api :: functionalities/data-formatter/data-formatter-disabling/TestDataFormatterDisabling.py (1995 of 2474) PASS: lldb-unit :: SymbolFile/DWARF/./SymbolFileDWARFTests/DWARFUnitTest.MissingSentinel (1996 of 2474) PASS: lldb-api :: lang/objc/foundation/TestObjCMethodsString.py (1997 of 2474) PASS: lldb-shell :: ObjectFile/MachO/subsections.yaml (1998 of 2474) PASS: lldb-shell :: SymbolFile/DWARF/x86/debug-types-dwo-cross-reference.cpp (1999 of 2474) PASS: lldb-unit :: Utility/./UtilityTests/StringListTest.PopBack (2000 of 2474) PASS: lldb-api :: commands/command/nested_alias/TestNestedAlias.py (2001 of 2474) PASS: lldb-api :: python_api/value_var_update/TestValueVarUpdate.py (2002 of 2474) PASS: lldb-unit :: Utility/./UtilityTests/StreamTest.PutPtr (2003 of 2474) PASS: lldb-unit :: Utility/./UtilityTests/BinaryStreamTest.PutULEB128FourBytes (2004 of 2474) PASS: lldb-shell :: Commands/command-regex-unalias.test (2005 of 2474) PASS: lldb-unit :: Utility/./UtilityTests/StringListTest.JoinThree (2006 of 2474) PASS: lldb-api :: lang/c/stepping/TestThreadStepInAvoidRegexp.py (2007 of 2474) PASS: lldb-api :: functionalities/thread/jump/TestThreadJump.py (2008 of 2474) PASS: lldb-shell :: Register/Core/x86-32-linux-multithread.test (2009 of 2474) UNSUPPORTED: lldb-api :: python_api/event/TestEvents.py (2010 of 2474) PASS: lldb-api :: types/TestCharType.py (2011 of 2474) PASS: lldb-api :: lang/objcxx/class-name-clash/TestNameClash.py (2012 of 2474) PASS: lldb-shell :: Register/Core/x86-64-freebsd-addr.test (2013 of 2474) UNSUPPORTED: lldb-api :: macosx/macCatalystAppMacOSFramework/TestMacCatalystAppWithMacOSFramework.py (2014 of 2474) PASS: lldb-unit :: Process/Utility/./ProcessUtilityTests/ProcMapTests/LinuxProcMapsTestFixture.ParseMapRegions/1 (2015 of 2474) PASS: lldb-api :: functionalities/step_scripted/TestStepScripted.py (2016 of 2474) PASS: lldb-api :: functionalities/dynamic_value_child_count/TestDynamicValueChildCount.py (2017 of 2474) UNSUPPORTED: lldb-api :: functionalities/exec/TestExec.py (2018 of 2474) PASS: lldb-shell :: Process/TestEnvironment.test (2019 of 2474) UNSUPPORTED: lldb-api :: functionalities/tsan/thread_leak/TestTsanThreadLeak.py (2020 of 2474) PASS: lldb-api :: functionalities/stats_api/TestStatisticsAPI.py (2021 of 2474) PASS: lldb-unit :: Utility/./UtilityTests/SerializationRountripTest.SerializeDeserializeObjectReference (2022 of 2474) PASS: lldb-api :: functionalities/gdb_remote_client/TestIOSSimulator.py (2023 of 2474) PASS: lldb-unit :: Utility/./UtilityTests/StringExtractorTest.DecodeHexU8_Underflow (2024 of 2474) PASS: lldb-api :: functionalities/wrong_commands/TestWrongCommands.py (2025 of 2474) PASS: lldb-api :: functionalities/thread/concurrent_events/TestConcurrentWatchBreakDelay.py (2026 of 2474) PASS: lldb-api :: commands/target/dump/TestTargetDumpTypeSystem.py (2027 of 2474) PASS: lldb-unit :: Utility/./UtilityTests/StringLexerTest.NextIfList (2028 of 2474) PASS: lldb-unit :: Thread/./ThreadTests/ThreadTest.GetPrivateStopInfo (2029 of 2474) PASS: lldb-shell :: SymbolFile/DWARF/x86/DW_TAG_basic_type_DW_ATE_UTF_nonC.ll (2030 of 2474) PASS: lldb-unit :: Utility/./UtilityTests/BinaryStreamTest.PutULEB128TwoBytes (2031 of 2474) PASS: lldb-api :: commands/expression/import-std-module/no-std-module/TestMissingStdModule.py (2032 of 2474) PASS: lldb-api :: lang/cpp/member-and-local-vars-with-same-name/TestMembersAndLocalsWithSameName.py (2033 of 2474) PASS: lldb-unit :: Utility/./UtilityTests/StringExtractorTest.GetHexBytes_OddPair2 (2034 of 2474) PASS: lldb-api :: functionalities/data-formatter/data-formatter-stl/libcxx/atomic/TestLibCxxAtomic.py (2035 of 2474) PASS: lldb-api :: functionalities/breakpoint/cpp/TestCPPBreakpointLocations.py (2036 of 2474) PASS: lldb-unit :: Host/./HostTests/NativeProcessProtocolTest.ReadCStringFromMemory (2037 of 2474) PASS: lldb-shell :: SymbolFile/NativePDB/lookup-by-address.cpp (2038 of 2474) PASS: lldb-api :: types/TestLongTypes.py (2039 of 2474) PASS: lldb-shell :: SymbolFile/DWARF/x86/dwarf5-implicit-const.s (2040 of 2474) PASS: lldb-api :: macosx/dyld-trie-symbols/TestDyldTrieSymbols.py (2041 of 2474) PASS: lldb-shell :: Minidump/memory-region.yaml (2042 of 2474) PASS: lldb-unit :: tools/lldb-server/tests/./LLDBServerTests/TestBase.LaunchModePreservesEnvironment (2043 of 2474) UNSUPPORTED: lldb-api :: benchmarks/turnaround/TestCompileRunToBreakpointTurnaround.py (2044 of 2474) PASS: lldb-api :: commands/expression/formatters/TestFormatters.py (2045 of 2474) PASS: lldb-unit :: Interpreter/./InterpreterTests/CompletionTest.DirCompletionUsername (2046 of 2474) PASS: lldb-api :: lang/cpp/virtual-functions/TestCppVirtualFunctions.py (2047 of 2474) PASS: lldb-api :: functionalities/data-formatter/cstring-utf8-summary/TestCstringUnicode.py (2048 of 2474) PASS: lldb-unit :: Utility/./UtilityTests/StringListTest.GetMaxStringLengthDecreasingSize (2049 of 2474) PASS: lldb-api :: commands/frame/diagnose/inheritance/TestDiagnoseInheritance.py (2050 of 2474) PASS: lldb-api :: python_api/breakpoint/TestBreakpointAPI.py (2051 of 2474) PASS: lldb-shell :: ObjectFile/PECOFF/invalid-export-table.yaml (2052 of 2474) PASS: lldb-unit :: Utility/./UtilityTests/SharedCluster.ClusterManager (2053 of 2474) PASS: lldb-shell :: ObjectFile/PECOFF/dep-modules.yaml (2054 of 2474) PASS: lldb-shell :: Minidump/no-process-id.yaml (2055 of 2474) PASS: lldb-unit :: Platform/./LLDBPlatformTests/PlatformDarwinTest.GetCompatibleArchARMv5 (2056 of 2474) PASS: lldb-unit :: Utility/./UtilityTests/StringListTest.SplitIntoLines (2057 of 2474) PASS: lldb-shell :: Expr/TestIRMemoryMap.test (2058 of 2474) PASS: lldb-unit :: Host/./HostTests/HostInfoTest.GetAugmentedArchSpec (2059 of 2474) PASS: lldb-api :: lang/objc/modules-compile-error/TestModulesCompileError.py (2060 of 2474) PASS: lldb-unit :: Utility/./UtilityTests/StatusTest.ErrorConstructor (2061 of 2474) UNSUPPORTED: lldb-api :: functionalities/ubsan/basic/TestUbsanBasic.py (2062 of 2474) PASS: lldb-unit :: API/./APITests/SBStructuredDataTest.NullImpl (2063 of 2474) PASS: lldb-api :: functionalities/data-formatter/data-formatter-script/TestDataFormatterScript.py (2064 of 2474) PASS: lldb-api :: python_api/get-value-32bit-int/TestGetValue32BitInt.py (2065 of 2474) UNSUPPORTED: lldb-shell :: ScriptInterpreter/Lua/convenience_variables.test (2066 of 2474) PASS: lldb-api :: lang/cpp/breakpoint_in_member_func_w_non_primitive_params/TestBreakpointInMemberFuncWNonPrimitiveParams.py (2067 of 2474) PASS: lldb-shell :: ObjectFile/ELF/PT_LOAD-empty.yaml (2068 of 2474) PASS: lldb-api :: lang/c/local_types/TestUseClosestType.py (2069 of 2474) PASS: lldb-unit :: Core/./LLDBCoreTests/ModuleSpecTest.TestELFFile (2070 of 2474) PASS: lldb-shell :: ScriptInterpreter/Python/fail_breakpoint_oneline.test (2071 of 2474) UNSUPPORTED: lldb-shell :: Breakpoint/case-insensitive.test (2072 of 2474) PASS: lldb-api :: commands/target/stop-hook/delete/TestTargetStopHookDelete.py (2073 of 2474) PASS: lldb-unit :: Thread/./ThreadTests/ThreadTest.SetStopInfo (2074 of 2474) PASS: lldb-api :: tools/lldb-server/TestGdbRemoteExpeditedRegisters.py (2075 of 2474) UNSUPPORTED: lldb-shell :: Register/aarch64-gp-read.test (2076 of 2474) PASS: lldb-api :: functionalities/stop-on-sharedlibrary-load/TestStopOnSharedlibraryEvents.py (2077 of 2474) PASS: lldb-api :: functionalities/thread/exit_during_break/TestExitDuringBreak.py (2078 of 2474) PASS: lldb-shell :: Commands/CommandScriptImmediateOutput/CommandScriptImmediateOutputFile.test (2079 of 2474) PASS: lldb-api :: functionalities/type_get_module/TestTypeGetModule.py (2080 of 2474) PASS: lldb-api :: tools/lldb-vscode/runInTerminal/TestVSCode_runInTerminal.py (2081 of 2474) UNSUPPORTED: lldb-api :: tools/lldb-vscode/completions/TestVSCode_completions.py (2082 of 2474) PASS: lldb-api :: lang/cpp/alignas_base_class/TestAlignAsBaseClass.py (2083 of 2474) PASS: lldb-unit :: Utility/./UtilityTests/VMRange.ContainsRange (2084 of 2474) PASS: lldb-api :: python_api/value/TestValueAPI.py (2085 of 2474) PASS: lldb-unit :: tools/lldb-server/tests/./LLDBServerTests/TestBase.DebugserverEnv (2086 of 2474) PASS: lldb-unit :: Utility/./UtilityTests/StreamTest.AddressRangeEmptyRange (2087 of 2474) PASS: lldb-api :: functionalities/load_unload/TestLoadUnload.py (2088 of 2474) PASS: lldb-api :: lang/c/cpp_keyword_identifiers/TestCppKeywordsAsCIdentifiers.py (2089 of 2474) PASS: lldb-unit :: Utility/./UtilityTests/StringListTest.CopyListEmpty (2090 of 2474) UNSUPPORTED: lldb-api :: commands/expression/import-std-module/pair/TestPairFromStdModule.py (2091 of 2474) PASS: lldb-unit :: Utility/./UtilityTests/PassiveReplayTest.InstrumentedBarRef (2092 of 2474) UNSUPPORTED: lldb-api :: benchmarks/libcxxlist/TestBenchmarkLibcxxList.py (2093 of 2474) UNSUPPORTED: lldb-api :: commands/expression/call-restarts/TestCallThatRestarts.py (2094 of 2474) PASS: lldb-shell :: Reproducer/TestRelativePath.test (2095 of 2474) PASS: lldb-unit :: Process/minidump/./LLDBMinidumpTests/MinidumpParserTest.GetMemoryRegionInfoLinuxMaps (2096 of 2474) PASS: lldb-api :: commands/expression/import-std-module/empty-module/TestEmptyStdModule.py (2097 of 2474) PASS: lldb-api :: functionalities/thread/concurrent_events/TestConcurrentBreakpointDelayBreakpointOneSignal.py (2098 of 2474) PASS: lldb-unit :: Host/./HostTests/MainLoopTest.UnmonitoredSignal (2099 of 2474) PASS: lldb-api :: functionalities/data-formatter/pyobjsynthprovider/TestPyObjSynthProvider.py (2100 of 2474) PASS: lldb-api :: functionalities/data-formatter/refpointer-recursion/TestDataFormatterRefPtrRecursion.py (2101 of 2474) PASS: lldb-api :: commands/gui/invalid-args/TestInvalidArgsGui.py (2102 of 2474) PASS: lldb-unit :: Core/./LLDBCoreTests/SourceLocationSpecTest.FileLineColumnComponents (2103 of 2474) PASS: lldb-unit :: Utility/./UtilityTests/ScalarTest.Comparison (2104 of 2474) PASS: lldb-shell :: Driver/TestFile.test (2105 of 2474) PASS: lldb-shell :: Register/Core/x86-64-freebsd-gp.test (2106 of 2474) PASS: lldb-unit :: Platform/./LLDBPlatformTests/PlatformDarwinTest.GetCompatibleArchARM64 (2107 of 2474) UNSUPPORTED: lldb-api :: functionalities/longjmp/TestLongjmp.py (2108 of 2474) PASS: lldb-api :: functionalities/data-formatter/data-formatter-stl/libcxx/function/TestLibCxxFunction.py (2109 of 2474) PASS: lldb-api :: sanity/TestSettingSkipping.py (2110 of 2474) PASS: lldb-unit :: DataFormatter/./LLDBFormatterTests/TypeMatcherTests.CreatedBySameMatchStringExactNamePrefixes (2111 of 2474) PASS: lldb-api :: lang/cpp/class-template-non-type-parameter-pack/TestClassTemplateNonTypeParameterPack.py (2112 of 2474) PASS: lldb-api :: lang/c/offsetof/TestOffsetof.py (2113 of 2474) PASS: lldb-api :: lang/c/const_variables/TestConstVariables.py (2114 of 2474) PASS: lldb-shell :: SymbolFile/DWARF/x86/DW_AT_location-DW_AT_const_value.s (2115 of 2474) PASS: lldb-api :: functionalities/gdb_remote_client/TestTargetXMLArch.py (2116 of 2474) PASS: lldb-unit :: Utility/./UtilityTests/StringExtractorTest.GetHexU8_Underflow (2117 of 2474) PASS: lldb-unit :: Utility/./UtilityTests/UriParserTest.PortOverflow (2118 of 2474) PASS: lldb-shell :: SymbolFile/symbol-binding.test (2119 of 2474) PASS: lldb-unit :: Utility/./UtilityTests/IndexToObjectTest.ObjectForIndex (2120 of 2474) PASS: lldb-unit :: Utility/./UtilityTests/StringExtractorTest.InitEmpty (2121 of 2474) PASS: lldb-api :: functionalities/postmortem/mach-core/TestMachCore.py (2122 of 2474) PASS: lldb-unit :: Process/Utility/./ProcessUtilityTests/RegisterContext_x86Test.AbridgedToFullTagWord (2123 of 2474) PASS: lldb-unit :: Utility/./UtilityTests/UriParserTest.BadPort2 (2124 of 2474) PASS: lldb-shell :: Register/Core/x86-32-freebsd-fp.test (2125 of 2474) PASS: lldb-unit :: Utility/./UtilityTests/RangeVector.CombineConsecutiveRanges (2126 of 2474) PASS: lldb-api :: functionalities/pointer_num_children/TestPointerNumChildren.py (2127 of 2474) PASS: lldb-api :: commands/expression/expr-in-syscall/TestExpressionInSyscall.py (2128 of 2474) PASS: lldb-api :: lang/cpp/covariant-return-types/TestCovariantReturnTypes.py (2129 of 2474) PASS: lldb-api :: lang/cpp/unicode-literals/TestUnicodeLiterals.py (2130 of 2474) PASS: lldb-api :: macosx/nslog/TestDarwinNSLogOutput.py (2131 of 2474) PASS: lldb-unit :: Process/minidump/./LLDBMinidumpTests/MinidumpParserTest.GetLinuxProcStatus_no_stream (2132 of 2474) PASS: lldb-unit :: Process/minidump/./LLDBMinidumpTests/MinidumpParserTest.MinidumpDuplicateModuleMappedFirst (2133 of 2474) PASS: lldb-unit :: Process/gdb-remote/./ProcessGdbRemoteTests/GDBRemoteCommunicationServerTest.SendErrorResponse_ErrorList (2134 of 2474) PASS: lldb-unit :: Utility/./UtilityTests/StringExtractorGDBRemoteTest.GetPidTid (2135 of 2474) PASS: lldb-api :: commands/expression/import-std-module/forward_list/TestForwardListFromStdModule.py (2136 of 2474) PASS: lldb-unit :: UnwindAssembly/x86/./UnwindAssemblyx86Tests/Testx86AssemblyInspectionEngine.TestPopEBX (2137 of 2474) PASS: lldb-unit :: Utility/./UtilityTests/StringExtractorTest.GetHexU8_Underflow2_NoEof (2138 of 2474) PASS: lldb-api :: commands/expression/xvalue/TestXValuePrinting.py (2139 of 2474) PASS: lldb-unit :: Utility/./UtilityTests/ScalarTest.SetValueFromData (2140 of 2474) PASS: lldb-unit :: DataFormatter/./LLDBFormatterTests/StringPrinterTests.CxxASCII (2141 of 2474) PASS: lldb-api :: functionalities/data-formatter/data-formatter-objc/TestDataFormatterObjCKVO.py (2142 of 2474) PASS: lldb-unit :: Utility/./UtilityTests/BinaryStreamTest.PutSLEB128FiveBytes (2143 of 2474) PASS: lldb-unit :: ScriptInterpreter/Python/./ScriptInterpreterPythonTests/PythonDataObjectsTest.TestPythonListToStructuredList (2144 of 2474) PASS: lldb-unit :: Host/./HostTests/NativeProcessProtocolTest.ReadMemoryWithoutTrap (2145 of 2474) PASS: lldb-shell :: SymbolFile/DWARF/x86/debug_loc.s (2146 of 2474) PASS: lldb-unit :: Utility/./UtilityTests/BinaryStreamTest.PutSLEB128FourBytes (2147 of 2474) PASS: lldb-unit :: Process/Utility/./ProcessUtilityTests/RegisterContext_x86Test.FullToAbridgedTagWord (2148 of 2474) PASS: lldb-api :: lang/objc/orderedset/TestOrderedSet.py (2149 of 2474) PASS: lldb-unit :: Utility/./UtilityTests/BinaryStreamTest.PutSLEB128OneByte (2150 of 2474) PASS: lldb-unit :: Utility/./UtilityTests/StreamTest.AddressRangeInvalidRange (2151 of 2474) PASS: lldb-unit :: Interpreter/./InterpreterTests/OptionArgParserTest.toBoolean (2152 of 2474) PASS: lldb-unit :: Utility/./UtilityTests/StringLexerTest.AdvanceIf (2153 of 2474) PASS: lldb-api :: lang/cpp/subst_template_type_param/TestSubstTemplateTypeParam.py (2154 of 2474) PASS: lldb-unit :: Utility/./UtilityTests/LogChannelEnabledTest.LLDB_LOG_ERROR (2155 of 2474) PASS: lldb-api :: functionalities/data-formatter/poarray/TestPrintObjectArray.py (2156 of 2474) PASS: lldb-shell :: BuildScript/toolchain-clang.test (2157 of 2474) PASS: lldb-unit :: Utility/./UtilityTests/ConstStringTest.CompareConstString (2158 of 2474) PASS: lldb-api :: python_api/findvalue_duplist/TestSBFrameFindValue.py (2159 of 2474) PASS: lldb-unit :: Language/Highlighting/./HighlighterTests/HighlighterTest.ClangCursorOutOfBounds (2160 of 2474) PASS: lldb-api :: types/TestIntegerTypeExpr.py (2161 of 2474) PASS: lldb-unit :: Utility/./UtilityTests/LogChannelTest.Enable (2162 of 2474) PASS: lldb-unit :: Interpreter/./InterpreterTests/CompletionTest.DirCompletionAbsolute (2163 of 2474) PASS: lldb-api :: functionalities/gdb_remote_client/TestRestartBug.py (2164 of 2474) PASS: lldb-api :: tools/lldb-vscode/console/TestVSCode_redirection_to_console.py (2165 of 2474) UNSUPPORTED: lldb-api :: tools/lldb-server/TestGdbRemoteModuleInfo.py (2166 of 2474) PASS: lldb-api :: tools/lldb-server/TestGdbRemoteAttachWait.py (2167 of 2474) PASS: lldb-shell :: SymbolFile/DWARF/x86/dwp.s (2168 of 2474) PASS: lldb-unit :: ObjectFile/Breakpad/./ObjectFileBreakpadTests/LineRecord.parse (2169 of 2474) PASS: lldb-api :: commands/expression/persistent_types/TestNestedPersistentTypes.py (2170 of 2474) PASS: lldb-shell :: Reproducer/Functionalities/TestImageList.test (2171 of 2474) PASS: lldb-unit :: UnwindAssembly/x86/./UnwindAssemblyx86Tests/Testx86AssemblyInspectionEngine.TestPushEBX (2172 of 2474) PASS: lldb-unit :: ScriptInterpreter/Python/./ScriptInterpreterPythonTests/PythonDataObjectsTest.TestPythonListManipulation (2173 of 2474) PASS: lldb-unit :: Target/./TargetTests/ExecutionContextTest.GetByteOrderProcess (2174 of 2474) PASS: lldb-unit :: UnwindAssembly/x86/./UnwindAssemblyx86Tests/Testx86AssemblyInspectionEngine.TestAddRSP (2175 of 2474) PASS: lldb-api :: functionalities/thread/concurrent_events/TestConcurrentManyWatchpoints.py (2176 of 2474) PASS: lldb-unit :: Utility/./UtilityTests/RecordReplayTest.InstrumentedFoo (2177 of 2474) PASS: lldb-api :: commands/expression/radar_8638051/Test8638051.py (2178 of 2474) PASS: lldb-unit :: Expression/./ExpressionTests/DWARFExpression.DW_OP_piece (2179 of 2474) PASS: lldb-unit :: Interpreter/./InterpreterTests/VerifyUserMultiwordCmdPathTest.TestErrors (2180 of 2474) PASS: lldb-api :: commands/process/launch/TestProcessLaunch.py (2181 of 2474) PASS: lldb-shell :: SymbolFile/DWARF/x86/DW_AT_low_pc-addrx.s (2182 of 2474) PASS: lldb-unit :: Utility/./UtilityTests/StringListTest.Assignment (2183 of 2474) PASS: lldb-unit :: Utility/./UtilityTests/UriParserTest.BracketedHostnameWithPortIPv6 (2184 of 2474) PASS: lldb-api :: functionalities/inferior-assert/TestInferiorAssert.py (2185 of 2474) PASS: lldb-unit :: Utility/./UtilityTests/GeneratorTest.Create (2186 of 2474) PASS: lldb-unit :: Utility/./UtilityTests/RangeDataVector.FindEntryThatContains (2187 of 2474) PASS: lldb-api :: commands/expression/ir-interpreter/TestIRInterpreter.py (2188 of 2474) PASS: lldb-unit :: UnwindAssembly/x86/./UnwindAssemblyx86Tests/Testx86AssemblyInspectionEngine.TestPopESI (2189 of 2474) PASS: lldb-api :: tools/lldb-vscode/launch/TestVSCode_launch.py (2190 of 2474) PASS: lldb-shell :: ObjectFile/ELF/build-id-case.yaml (2191 of 2474) PASS: lldb-api :: functionalities/breakpoint/breakpoint_names/TestBreakpointNames.py (2192 of 2474) PASS: lldb-unit :: Utility/./UtilityTests/FileSpecTest.GuessPathStyle (2193 of 2474) UNSUPPORTED: lldb-shell :: ScriptInterpreter/Lua/partial_statements.test (2194 of 2474) PASS: lldb-api :: lang/cpp/breakpoint-commands/TestCPPBreakpointCommands.py (2195 of 2474) PASS: lldb-api :: commands/expression/import-std-module/iterator/TestIteratorFromStdModule.py (2196 of 2474) PASS: lldb-shell :: SymbolFile/DWARF/x86/find-inline-method.s (2197 of 2474) PASS: lldb-shell :: SymbolFile/DWARF/x86/static_scope.s (2198 of 2474) PASS: lldb-api :: lang/objc/objc-stepping/TestObjCStepping.py (2199 of 2474) PASS: lldb-unit :: Utility/./UtilityTests/FileSpecTest.AppendPathComponent (2200 of 2474) PASS: lldb-shell :: ScriptInterpreter/Python/Crashlog/json.test (2201 of 2474) UNSUPPORTED: lldb-api :: tools/lldb-server/TestPtyServer.py (2202 of 2474) PASS: lldb-shell :: SymbolFile/DWARF/x86/DW_AT_loclists_base.s (2203 of 2474) PASS: lldb-api :: macosx/DBGSourcePathRemapping/TestDSYMSourcePathRemapping.py (2204 of 2474) PASS: lldb-api :: lang/cpp/namespace/TestNamespaceLookup.py (2205 of 2474) PASS: lldb-unit :: Utility/./UtilityTests/UriParserTest.BracketedHostnamePort (2206 of 2474) PASS: lldb-unit :: Utility/./UtilityTests/StringListTest.SplitIntoLinesEmpty (2207 of 2474) PASS: lldb-unit :: SymbolFile/NativePDB/./SymbolFileNativePDBTests/PDBFPOProgramToDWARFExpressionTests.MissingTargetRegister (2208 of 2474) PASS: lldb-unit :: Utility/./UtilityTests/ScalarTest.RightShiftOperator (2209 of 2474) PASS: lldb-api :: functionalities/data-formatter/data-formatter-stl/generic/forward_list/TestDataFormatterGenericForwardList.py (2210 of 2474) PASS: lldb-unit :: Utility/./UtilityTests/FileSpecTest.IsRelative (2211 of 2474) PASS: lldb-api :: lang/objc/modules-incomplete/TestIncompleteModules.py (2212 of 2474) PASS: lldb-api :: python_api/hello_world/TestHelloWorld.py (2213 of 2474) PASS: lldb-api :: lang/cpp/virtual-overload/TestVirtualOverload.py (2214 of 2474) PASS: lldb-api :: functionalities/breakpoint/serialize/TestBreakpointSerialization.py (2215 of 2474) PASS: lldb-unit :: Process/gdb-remote/./ProcessGdbRemoteTests/GDBRemoteCommunicationClientTest.SendSignalsToIgnore (2216 of 2474) PASS: lldb-shell :: Register/Core/x86-64-netbsd-addr.test (2217 of 2474) PASS: lldb-api :: lang/objc/modules-cache/TestClangModulesCache.py (2218 of 2474) PASS: lldb-shell :: Register/Core/x86-64-linux-multithread.test (2219 of 2474) PASS: lldb-shell :: Driver/TestPositionalArgs.test (2220 of 2474) PASS: lldb-api :: functionalities/data-formatter/data-formatter-stl/libcxx/tuple/TestDataFormatterLibcxxTuple.py (2221 of 2474) PASS: lldb-api :: tools/lldb-vscode/step/TestVSCode_step.py (2222 of 2474) PASS: lldb-api :: functionalities/data-formatter/data-formatter-globals/TestDataFormatterGlobals.py (2223 of 2474) PASS: lldb-api :: macosx/universal/TestUniversal.py (2224 of 2474) PASS: lldb-shell :: Minidump/disassemble-no-module.yaml (2225 of 2474) PASS: lldb-shell :: ObjectFile/ELF/PT_TLS-overlap-PT_LOAD.yaml (2226 of 2474) PASS: lldb-unit :: Utility/./UtilityTests/ArchSpecTest.TripleComponentsWereSpecified (2227 of 2474) XFAIL: lldb-shell :: Register/x86-64-fp-write.test (2228 of 2474) PASS: lldb-shell :: ObjectFile/PECOFF/basic-info-arm64.yaml (2229 of 2474) PASS: lldb-unit :: Symbol/./SymbolTests/Type.CompilerContextPattern (2230 of 2474) PASS: lldb-unit :: Signals/./SignalsTests/UnixSignalsTest.Iteration (2231 of 2474) PASS: lldb-unit :: Utility/./UtilityTests/BinaryStreamTest.PutSLEB128EightBytes (2232 of 2474) PASS: lldb-unit :: Core/./LLDBCoreTests/SourceFileCache.FindSourceFileFound (2233 of 2474) PASS: lldb-api :: functionalities/history/TestHistoryRecall.py (2234 of 2474) PASS: lldb-api :: functionalities/tail_call_frames/ambiguous_tail_call_seq1/TestAmbiguousTailCallSeq1.py (2235 of 2474) PASS: lldb-api :: functionalities/data-formatter/data-formatter-ptr-to-array/TestPtrToArrayFormatting.py (2236 of 2474) PASS: lldb-unit :: Process/gdb-remote/./ProcessGdbRemoteTests/GDBRemoteCommunicationClientTest.ReadRegister (2237 of 2474) PASS: lldb-unit :: Utility/./UtilityTests/RangeTest.Clear (2238 of 2474) PASS: lldb-shell :: Commands/command-regex-delete.test (2239 of 2474) PASS: lldb-unit :: Utility/./UtilityTests/StreamTest.PutCharWhitespace (2240 of 2474) PASS: lldb-shell :: Heap/heap-cstr.test (2241 of 2474) PASS: lldb-unit :: Host/./HostTests/File.GetWaitableHandleFileno (2242 of 2474) UNSUPPORTED: lldb-api :: commands/trace/TestTraceTimestampCounters.py (2243 of 2474) PASS: lldb-unit :: Expression/./ExpressionTests/DiagnosticManagerTest.HasFixits (2244 of 2474) PASS: lldb-unit :: Process/minidump/./LLDBMinidumpTests/MinidumpParserTest.GetFilteredModuleList (2245 of 2474) PASS: lldb-api :: tools/lldb-server/TestGdbRemoteAttachOrWait.py (2246 of 2474) PASS: lldb-unit :: Expression/./ExpressionTests/DiagnosticManagerTest.FixedExpression (2247 of 2474) PASS: lldb-shell :: ScriptInterpreter/Python/silent_command_script_import.test (2248 of 2474) PASS: lldb-api :: tools/lldb-server/TestGdbRemoteHostInfo.py (2249 of 2474) PASS: lldb-unit :: Utility/./UtilityTests/OptionsWithRawTest.LeadingSpaceArgs (2250 of 2474) PASS: lldb-api :: functionalities/plugins/python_os_plugin/stepping_plugin_threads/TestOSPluginStepping.py (2251 of 2474) PASS: lldb-api :: commands/platform/file/read/TestPlatformFileRead.py (2252 of 2474) PASS: lldb-api :: functionalities/data-formatter/synthcapping/TestSyntheticCapping.py (2253 of 2474) PASS: lldb-unit :: Utility/./UtilityTests/Flags.Reset (2254 of 2474) PASS: lldb-shell :: Settings/TestLineMarkerColor.test (2255 of 2474) PASS: lldb-api :: commands/expression/save_jit_objects/TestSaveJITObjects.py (2256 of 2474) PASS: lldb-unit :: Utility/./UtilityTests/AnsiTerminal.Unknown (2257 of 2474) PASS: lldb-api :: api/check_public_api_headers/TestPublicAPIHeaders.py (2258 of 2474) PASS: lldb-shell :: Quit/TestQuitExitCodeNonInt.test (2259 of 2474) PASS: lldb-api :: functionalities/breakpoint/breakpoint_ignore_count/TestBreakpointIgnoreCount.py (2260 of 2474) PASS: lldb-shell :: SymbolFile/Breakpad/inline-record.test (2261 of 2474) PASS: lldb-unit :: Utility/./UtilityTests/BinaryStreamTest.PutSLEB128TwoBytes (2262 of 2474) PASS: lldb-unit :: Utility/./UtilityTests/CompletionRequest.TryCompleteCurrentArgGood (2263 of 2474) PASS: lldb-unit :: Utility/./UtilityTests/SerializationRountripTest.SerializeDeserializeCStringArrayNullptrElem (2264 of 2474) PASS: lldb-api :: functionalities/postmortem/elf-core/thread_crash/TestLinuxCoreThreads.py (2265 of 2474) PASS: lldb-api :: commands/expression/two-files/TestObjCTypeQueryFromOtherCompileUnit.py (2266 of 2474) PASS: lldb-shell :: SymbolFile/DWARF/x86/DW_OP_piece-struct.s (2267 of 2474) PASS: lldb-unit :: Core/./LLDBCoreTests/RichManglingContextTest.FromCxxMethodName (2268 of 2474) UNSUPPORTED: lldb-api :: functionalities/asan/TestReportData.py (2269 of 2474) PASS: lldb-api :: lang/objc/bitfield_ivars/TestBitfieldIvars.py (2270 of 2474) PASS: lldb-shell :: SymbolFile/DWARF/x86/find-function-regex.cpp (2271 of 2474) PASS: lldb-unit :: DataFormatter/./LLDBFormatterTests/TypeMatcherTests.ExactName (2272 of 2474) UNSUPPORTED: lldb-api :: functionalities/thread/concurrent_events/TestConcurrentManySignals.py (2273 of 2474) PASS: lldb-unit :: Expression/./ExpressionTests/CppModuleConfigurationTest.UnrelatedLibrary (2274 of 2474) PASS: lldb-unit :: Utility/./UtilityTests/DataExtractorTest.GetFloatUnaligned (2275 of 2474) PASS: lldb-unit :: Utility/./UtilityTests/RangeDataVector.FindEntryThatContains_Overlap (2276 of 2474) PASS: lldb-unit :: Process/gdb-remote/./ProcessGdbRemoteTests/GDBRemoteClientBaseTest.SendContinueAndAsyncSignal (2277 of 2474) PASS: lldb-unit :: Language/Highlighting/./HighlighterTests/HighlighterTest.ClangTrailingBackslashWithWhitespace (2278 of 2474) PASS: lldb-unit :: Utility/./UtilityTests/StreamTest.PutHex16ByteOrderLittle (2279 of 2474) PASS: lldb-api :: lang/objc/foundation/TestConstStrings.py (2280 of 2474) PASS: lldb-unit :: SymbolFile/NativePDB/./SymbolFileNativePDBTests/PDBFPOProgramToDWARFExpressionTests.InvalidOpUnary (2281 of 2474) PASS: lldb-shell :: SymbolFile/Breakpad/symtab-macho.test (2282 of 2474) PASS: lldb-api :: lang/objc/blocks/TestObjCIvarsInBlocks.py (2283 of 2474) PASS: lldb-shell :: SymbolFile/DWARF/x86/DW_AT_decl_file-DW_AT_specification-crosscu.s (2284 of 2474) UNSUPPORTED: lldb-api :: lang/c/typedef/Testtypedef.py (2285 of 2474) PASS: lldb-shell :: SymbolFile/DWARF/x86/debug_rnglists-dwo.s (2286 of 2474) PASS: lldb-unit :: SymbolFile/DWARF/./SymbolFileDWARFTests/SymbolFileDWARFTests.ParseAranges (2287 of 2474) PASS: lldb-api :: lang/objc/foundation/TestObjCMethods2.py (2288 of 2474) UNSUPPORTED: lldb-api :: functionalities/data-formatter/data-formatter-stl/libstdcpp/string/TestDataFormatterStdString.py (2289 of 2474) PASS: lldb-api :: functionalities/breakpoint/auto_continue/TestBreakpointAutoContinue.py (2290 of 2474) PASS: lldb-unit :: Utility/./UtilityTests/ScalarTest.APIntConstructor (2291 of 2474) PASS: lldb-shell :: Reproducer/TestProcessList.test (2292 of 2474) PASS: lldb-unit :: SymbolFile/DWARF/./SymbolFileDWARFTests/SymbolFileDWARFTests.TestAbbrevInvalidNULLTag (2293 of 2474) PASS: lldb-api :: commands/expression/error-limit/TestExprErrorLimit.py (2294 of 2474) PASS: lldb-shell :: SymbolFile/DWARF/x86/debug-types-basic.test (2295 of 2474) PASS: lldb-api :: lang/cpp/enum_types/TestCPP11EnumTypes.py (2296 of 2474) XFAIL: lldb-shell :: Register/x86-64-fp-read.test (2297 of 2474) PASS: lldb-api :: commands/expression/namespace_local_var_same_name_obj_c/TestNamespaceLocalVarSameNameObjC.py (2298 of 2474) PASS: lldb-api :: functionalities/data-formatter/data-formatter-stl/libcxx/list/loop/TestDataFormatterLibcxxListLoop.py (2299 of 2474) UNSUPPORTED: lldb-shell :: ScriptInterpreter/Lua/print.test (2300 of 2474) PASS: lldb-unit :: Utility/./UtilityTests/UriParserTest.SchemeHostSeparator (2301 of 2474) PASS: lldb-api :: python_api/value/empty_class/TestValueAPIEmptyClass.py (2302 of 2474) PASS: lldb-unit :: Utility/./UtilityTests/StringListTest.JoinMultiCharSeparator (2303 of 2474) PASS: lldb-unit :: Utility/./UtilityTests/StreamTest.PutChar (2304 of 2474) PASS: lldb-shell :: SymbolFile/NativePDB/tag-types.cpp (2305 of 2474) PASS: lldb-shell :: SymbolFile/DWARF/x86/dead-code-filtering.yaml (2306 of 2474) PASS: lldb-api :: lang/objc/exceptions/TestObjCExceptions.py (2307 of 2474) UNSUPPORTED: lldb-api :: tools/lldb-server/TestGdbRemoteCompletion.py (2308 of 2474) UNSUPPORTED: lldb-api :: functionalities/tsan/thread_numbers/TestTsanThreadNumbers.py (2309 of 2474) PASS: lldb-unit :: Process/Utility/./ProcessUtilityTests/ProcSMapTests/LinuxProcSMapsTestFixture.ParseSMapRegions/5 (2310 of 2474) PASS: lldb-unit :: Host/./HostTests/FileSystemTest.EmptyTest (2311 of 2474) PASS: lldb-api :: python_api/lldbutil/frame/TestFrameUtils.py (2312 of 2474) PASS: lldb-unit :: Utility/./UtilityTests/CompletionRequest.TryCompleteCurrentArgBad (2313 of 2474) PASS: lldb-shell :: ObjectFile/ELF/section-types-edgecases.yaml (2314 of 2474) PASS: lldb-api :: lang/c/stepping/TestThreadStepping.py (2315 of 2474) PASS: lldb-unit :: Utility/./UtilityTests/StringListTest.CopyList (2316 of 2474) PASS: lldb-api :: functionalities/data-formatter/var-in-aggregate-misuse/TestVarInAggregateMisuse.py (2317 of 2474) PASS: lldb-api :: lang/c/vla/TestVLA.py (2318 of 2474) UNSUPPORTED: lldb-shell :: Reproducer/TestLuaImport.test (2319 of 2474) PASS: lldb-shell :: SymbolFile/NativePDB/disassembly.cpp (2320 of 2474) PASS: lldb-api :: lang/cpp/printf/TestPrintf.py (2321 of 2474) PASS: lldb-api :: lang/cpp/unsigned_types/TestUnsignedTypes.py (2322 of 2474) PASS: lldb-api :: lang/c/anonymous/TestAnonymous.py (2323 of 2474) PASS: lldb-api :: functionalities/breakpoint/breakpoint_by_line_and_column/TestBreakpointByLineAndColumn.py (2324 of 2474) PASS: lldb-api :: functionalities/thread/concurrent_events/TestConcurrentWatchpointDelayWatchpointOneBreakpoint.py (2325 of 2474) UNSUPPORTED: lldb-api :: commands/watchpoints/watch_tagged_addr/TestWatchTaggedAddress.py (2326 of 2474) PASS: lldb-unit :: Host/./HostTests/SocketTests/SocketTest.DecodeHostAndPort/ipv6 (2327 of 2474) PASS: lldb-api :: commands/expression/pr52257/TestExprCrash.py (2328 of 2474) PASS: lldb-unit :: Expression/./ExpressionTests/ClangHostTest.ComputeClangResourceDirectory (2329 of 2474) PASS: lldb-unit :: Utility/./UtilityTests/StringListTest.ShiftMove (2330 of 2474) PASS: lldb-api :: functionalities/thread/concurrent_events/TestConcurrentBreakpointsDelayedBreakpointOneWatchpoint.py (2331 of 2474) UNSUPPORTED: lldb-shell :: Unwind/eh-frame-small-fde.test (2332 of 2474) UNSUPPORTED: lldb-shell :: Register/x86-64-xmm16-write.test (2333 of 2474) UNSUPPORTED: lldb-shell :: SymbolFile/PDB/func-symbols.test (2334 of 2474) PASS: lldb-shell :: ScriptInterpreter/Python/command_relative_import.test (2335 of 2474) PASS: lldb-api :: types/TestFloatTypes.py (2336 of 2474) PASS: lldb-unit :: Utility/./UtilityTests/RangeTest.ContainsEndInclusive (2337 of 2474) PASS: lldb-unit :: Utility/./UtilityTests/OptionsWithRawTest.TerminatedQuote (2338 of 2474) PASS: lldb-api :: functionalities/breakpoint/global_constructor/TestBreakpointInGlobalConstructor.py (2339 of 2474) PASS: lldb-api :: commands/expression/import-std-module/forward_decl_from_module/TestForwardDeclFromStdModule.py (2340 of 2474) PASS: lldb-api :: api/log/TestAPILog.py (2341 of 2474) PASS: lldb-api :: lang/cpp/chained-calls/TestCppChainedCalls.py (2342 of 2474) PASS: lldb-unit :: DataFormatter/./LLDBFormatterTests/TypeMatcherTests.CreatedBySameMatchString (2343 of 2474) PASS: lldb-unit :: Process/Utility/./ProcessUtilityTests/ProcSMapTests/LinuxProcSMapsTestFixture.ParseSMapRegions/7 (2344 of 2474) PASS: lldb-api :: commands/log/invalid-args/TestInvalidArgsLog.py (2345 of 2474) PASS: lldb-api :: lang/cpp/crtp/TestCppCRTP.py (2346 of 2474) UNSUPPORTED: lldb-shell :: SymbolFile/DWARF/debug-types-expressions.test (2347 of 2474) PASS: lldb-api :: lang/objc/objc-static-method/TestObjCStaticMethod.py (2348 of 2474) PASS: lldb-api :: functionalities/inline-stepping/TestInlineStepping.py (2349 of 2474) PASS: lldb-unit :: Expression/./ExpressionTests/DiagnosticManagerTest.PutString (2350 of 2474) UNSUPPORTED: lldb-shell :: Subprocess/fork-follow-child-softbp.test (2351 of 2474) PASS: lldb-api :: commands/expression/import_base_class_when_class_has_derived_member/TestImportBaseClassWhenClassHasDerivedMember.py (2352 of 2474) PASS: lldb-api :: functionalities/gdb_remote_client/TestProcessConnect.py (2353 of 2474) XFAIL: lldb-shell :: Expr/nodefaultlib.cpp (2354 of 2474) PASS: lldb-unit :: Symbol/./SymbolTests/TestTypeSystemClang.TestGetEnumIntegerTypeUnexpectedType (2355 of 2474) PASS: lldb-api :: lang/cpp/constructors/TestCppConstructors.py (2356 of 2474) PASS: lldb-shell :: ObjectFile/PECOFF/uuid.yaml (2357 of 2474) PASS: lldb-shell :: SymbolFile/DWARF/x86/split-dwarf-multiple-cu.ll (2358 of 2474) PASS: lldb-shell :: Quit/TestQuitExitCodeTooManyArgs.test (2359 of 2474) PASS: lldb-shell :: Register/Core/x86-64-linux-addr.test (2360 of 2474) PASS: lldb-api :: lang/cpp/gmodules/TestWithModuleDebugging.py (2361 of 2474) PASS: lldb-api :: commands/expression/namespace_local_var_same_name_cpp_and_c/TestNamespaceLocalVarSameNameCppAndC.py (2362 of 2474) PASS: lldb-unit :: Platform/Android/./AdbClientTests/AdbClientTest.CreateByDeviceId (2363 of 2474) PASS: lldb-api :: tools/lldb-vscode/correct-thread/TestVSCode_correct_thread.py (2364 of 2474) PASS: lldb-unit :: Process/gdb-remote/./ProcessGdbRemoteTests/GDBRemoteCommunicationClientTest.GetMemoryRegionInfo (2365 of 2474) PASS: lldb-unit :: UnwindAssembly/x86/./UnwindAssemblyx86Tests/Testx86AssemblyInspectionEngine.TestSimple64bitFrameFunction (2366 of 2474) PASS: lldb-unit :: Utility/./UtilityTests/BinaryStreamTest.PutULEB128One (2367 of 2474) PASS: lldb-api :: python_api/signals/TestSignalsAPI.py (2368 of 2474) PASS: lldb-unit :: Language/Highlighting/./HighlighterTests/HighlighterTest.ClangTrailingBackslashMissingNewLine (2369 of 2474) PASS: lldb-unit :: API/./APITests/SBCommandInterpreterTest.MultiWordCommand (2370 of 2474) PASS: lldb-unit :: Process/minidump/./LLDBMinidumpTests/RegisterContextMinidump.ConvertMinidumpContext_x86_32 (2371 of 2474) PASS: lldb-unit :: Core/./LLDBCoreTests/SourceLocationSpecTest.Equal (2372 of 2474) PASS: lldb-api :: functionalities/paths/TestPaths.py (2373 of 2474) PASS: lldb-api :: python_api/process/io/TestProcessIO.py (2374 of 2474) PASS: lldb-shell :: SymbolFile/DWARF/x86/dir-separator-no-comp-dir.s (2375 of 2474) PASS: lldb-api :: functionalities/data-formatter/frameformat_smallstruct/TestFrameFormatSmallStruct.py (2376 of 2474) PASS: lldb-unit :: Host/./HostTests/MainLoopTest.Signal (2377 of 2474) PASS: lldb-unit :: Utility/./UtilityTests/RecordReplayTest.ValidSequence (2378 of 2474) PASS: lldb-api :: commands/target/stop-hooks/TestStopHooks.py (2379 of 2474) PASS: lldb-api :: commands/expression/completion-in-lambda-and-unnamed-class/TestCompletionInLambdaAndUnnamedClass.py (2380 of 2474) PASS: lldb-unit :: Core/./LLDBCoreTests/MangledTest.EmptyForInvalidName (2381 of 2474) PASS: lldb-unit :: Utility/./UtilityTests/BinaryStreamTest.PutSLEB128One (2382 of 2474) PASS: lldb-shell :: SymbolFile/DWARF/x86/dwo-type-in-main-file.s (2383 of 2474) PASS: lldb-api :: python_api/disassemble-raw-data/TestDisassembleRawData.py (2384 of 2474) PASS: lldb-api :: commands/register/register/register_command/TestRegisters.py (2385 of 2474) PASS: lldb-api :: commands/expression/cast_int_to_anonymous_enum/TestCastIntToAnonymousEnum.py (2386 of 2474) PASS: lldb-api :: commands/expression/rdar42038760/TestScalarURem.py (2387 of 2474) PASS: lldb-api :: lang/cpp/class-loading-via-member-typedef/TestClassLoadingViaMemberTypedef.py (2388 of 2474) PASS: lldb-api :: commands/expression/call-function/TestCallStdStringFunction.py (2389 of 2474) PASS: lldb-shell :: SymbolFile/DWARF/x86/gnu-style-compression.cpp (2390 of 2474) PASS: lldb-unit :: Utility/./UtilityTests/Flags.Test (2391 of 2474) PASS: lldb-unit :: Utility/./UtilityTests/StringListTest.ShiftStdString (2392 of 2474) PASS: lldb-unit :: Utility/./UtilityTests/CompletionRequest.ShiftArguments (2393 of 2474) PASS: lldb-api :: functionalities/tail_call_frames/unambiguous_sequence/TestUnambiguousTailCalls.py (2394 of 2474) PASS: lldb-unit :: Utility/./UtilityTests/StringListTest.AppendList (2395 of 2474) PASS: lldb-unit :: Utility/./UtilityTests/ArgsTest.StringListConstructor (2396 of 2474) PASS: lldb-api :: functionalities/data-formatter/ostypeformatting/TestFormattersOsType.py (2397 of 2474) PASS: lldb-shell :: SymbolFile/DWARF/x86/parallel-indexing-stress.s (2398 of 2474) PASS: lldb-api :: lang/cpp/namespace_conflicts/TestNamespaceConflicts.py (2399 of 2474) PASS: lldb-api :: macosx/add-dsym/TestAddDsymDownload.py (2400 of 2474) PASS: lldb-unit :: Utility/./UtilityTests/CompletionRequest.Constructor (2401 of 2474) PASS: lldb-api :: python_api/exprpath_synthetic/TestExprPathSynthetic.py (2402 of 2474) PASS: lldb-unit :: Utility/./UtilityTests/ScalarTest.SetValueFromCString (2403 of 2474) PASS: lldb-unit :: Symbol/./SymbolTests/TestTypeSystemClang.TestRecordHasFields (2404 of 2474) PASS: lldb-unit :: Utility/./UtilityTests/StringExtractorTest.InitMisc (2405 of 2474) UNSUPPORTED: lldb-api :: lang/cpp/function-template-parameter-pack/TestFunctionTemplateParameterPack.py (2406 of 2474) PASS: lldb-api :: lang/objc/objc_direct-methods/TestObjCDirectMethods.py (2407 of 2474) PASS: lldb-unit :: ObjectFile/Breakpad/./ObjectFileBreakpadTests/FileRecord.parse (2408 of 2474) PASS: lldb-shell :: Reproducer/TestSynchronous.test (2409 of 2474) UNSUPPORTED: lldb-api :: functionalities/data-formatter/data-formatter-stl/libstdcpp/unique_ptr/TestDataFormatterStdUniquePtr.py (2410 of 2474) PASS: lldb-unit :: Utility/./UtilityTests/StringListTest.Join (2411 of 2474) PASS: lldb-api :: python_api/section/TestSectionAPI.py (2412 of 2474) PASS: lldb-unit :: Utility/./UtilityTests/BinaryStreamTest.PutULEB128EightBytes (2413 of 2474) UNSUPPORTED: lldb-shell :: SymbolFile/PDB/compilands.test (2414 of 2474) PASS: lldb-unit :: Host/./HostTests/NativeProcessProtocolTest.SetBreakpointFailVerify (2415 of 2474) PASS: lldb-shell :: ScriptInterpreter/Python/eof.test (2416 of 2474) PASS: lldb-shell :: Reproducer/TestVersionCheck.test (2417 of 2474) PASS: lldb-api :: lang/c/global_variables/TestGlobalVariables.py (2418 of 2474) PASS: lldb-api :: functionalities/data-formatter/data-formatter-synth/TestDataFormatterSynth.py (2419 of 2474) UNSUPPORTED: lldb-api :: commands/gui/viewlarge/TestGuiViewLarge.py (2420 of 2474) PASS: lldb-unit :: Utility/./UtilityTests/ArchSpecTest.MergeFrom (2421 of 2474) UNSUPPORTED: lldb-api :: functionalities/ptrauth_diagnostics/LDRAA_error/TestPtrauthLDRAADiagnostic.py (2422 of 2474) UNSUPPORTED: lldb-api :: functionalities/data-formatter/data-formatter-stl/libstdcpp/smart_ptr/TestDataFormatterStdSmartPtr.py (2423 of 2474) PASS: lldb-shell :: SymbolFile/NativePDB/break-by-line.cpp (2424 of 2474) PASS: lldb-unit :: Utility/./UtilityTests/ArgsTest.ReplaceArgumentAtIndexFarOutOfRange (2425 of 2474) PASS: lldb-shell :: Minidump/dump-all.test (2426 of 2474) PASS: lldb-api :: commands/breakpoint/command/list/TestBreakpointCommandList.py (2427 of 2474) PASS: lldb-api :: functionalities/data-formatter/data-formatter-synthval/TestDataFormatterSynthVal.py (2428 of 2474) PASS: lldb-api :: lang/objc/objc-foundation-dictionary-empty/TestNSDictionary0.py (2429 of 2474) PASS: lldb-unit :: Utility/./UtilityTests/StringListTest.InsertStringAtIndexStart (2430 of 2474) PASS: lldb-unit :: Expression/./ExpressionTests/DWARFExpression.DW_OP_const (2431 of 2474) PASS: lldb-api :: sanity/TestModuleCacheSanity.py (2432 of 2474) PASS: lldb-api :: functionalities/thread/concurrent_events/TestConcurrentWatchpointWithDelayWatchpointThreads.py (2433 of 2474) PASS: lldb-unit :: Host/./HostTests/File.GetStreamFromDescriptor (2434 of 2474) PASS: lldb-api :: functionalities/data-formatter/type_summary_list_script/TestTypeSummaryListScript.py (2435 of 2474) PASS: lldb-unit :: ScriptInterpreter/Python/./ScriptInterpreterPythonTests/PythonDataObjectsTest.TestScript (2436 of 2474) PASS: lldb-api :: functionalities/postmortem/wow64_minidump/TestWow64MiniDump.py (2437 of 2474) PASS: lldb-api :: lang/c/complex/TestComplexC99.py (2438 of 2474) PASS: lldb-unit :: Process/Utility/./ProcessUtilityTests/MemoryTagManagerAArch64MTETest.RepeatTagsForRange (2439 of 2474) PASS: lldb-unit :: Utility/./UtilityTests/LogTest.Register (2440 of 2474) PASS: lldb-shell :: Driver/LocalLLDBInit.test (2441 of 2474) PASS: lldb-unit :: debugserver/./debugserverTests/RNBSocket.LoopBackConnectIPv6 (2442 of 2474) PASS: lldb-unit :: Target/./TargetTests/ModuleCacheTest.GetAndPut (2443 of 2474) PASS: lldb-api :: functionalities/data-formatter/data-formatter-stl/generic/bitset/TestDataFormatterGenericBitset.py (2444 of 2474) PASS: lldb-unit :: Core/./LLDBCoreTests/DumpDataExtractorTest.MultiLine (2445 of 2474) PASS: lldb-unit :: Utility/./UtilityTests/RangeTest.SlideZero (2446 of 2474) PASS: lldb-api :: functionalities/value_md5_crash/TestValueMD5Crash.py (2447 of 2474) PASS: lldb-api :: functionalities/breakpoint/breakpoint_by_file_colon_line/TestBreakpointByFileColonLine.py (2448 of 2474) PASS: lldb-api :: functionalities/breakpoint/breakpoint_language/TestBreakpointLanguage.py (2449 of 2474) PASS: lldb-shell :: Breakpoint/jit-loader_jitlink_elf.test (2450 of 2474) PASS: lldb-api :: lang/objc/cpp_keyword_identifiers/TestCppKeywordsAsObjCIdentifiers.py (2451 of 2474) PASS: lldb-api :: commands/frame/diagnose/virtual-method-call/TestDiagnoseDereferenceVirtualMethodCall.py (2452 of 2474) PASS: lldb-api :: lang/objc/objc-static-method-stripped/TestObjCStaticMethodStripped.py (2453 of 2474) UNSUPPORTED: lldb-shell :: Subprocess/vfork-follow-parent-softbp.test (2454 of 2474) PASS: lldb-unit :: SymbolFile/DWARF/./SymbolFileDWARFTests/SymbolFileDWARFTests.TestAbbrevOutOfOrder (2455 of 2474) PASS: lldb-shell :: Settings/TestFrameFormatNoColor.test (2456 of 2474) PASS: lldb-shell :: ObjectFile/PECOFF/section-types.yaml (2457 of 2474) PASS: lldb-unit :: Symbol/./SymbolTests/TestTypeSystemClang.TestNotDeletingUserCopyCstrDueToMoveCStr (2458 of 2474) PASS: lldb-unit :: Utility/./UtilityTests/ProcessInstanceInfo.Yaml (2459 of 2474) UNSUPPORTED: lldb-shell :: SymbolFile/NativePDB/ast-functions-msvc.cpp (2460 of 2474) PASS: lldb-unit :: Process/gdb-remote/./ProcessGdbRemoteTests/GDBRemoteClientBaseTest.SendContinueAndAsyncPacket (2461 of 2474) PASS: lldb-unit :: Utility/./UtilityTests/StringExtractorTest.GetHexBytes (2462 of 2474) PASS: lldb-unit :: ScriptInterpreter/Python/./ScriptInterpreterPythonTests/PythonDataObjectsTest.TestPythonDictionaryToStructuredDictionary (2463 of 2474) XFAIL: lldb-shell :: Register/x86-mm-xmm-read.test (2464 of 2474) PASS: lldb-api :: types/TestIntegerType.py (2465 of 2474) PASS: lldb-unit :: SymbolFile/NativePDB/./SymbolFileNativePDBTests/PDBFPOProgramToDWARFExpressionTests.UnresolvedRegisterReference (2466 of 2474) PASS: lldb-unit :: Utility/./UtilityTests/FileSpecTest.FormatFileSpec (2467 of 2474) PASS: lldb-api :: functionalities/data-formatter/format-propagation/TestFormatPropagation.py (2468 of 2474) UNSUPPORTED: lldb-api :: tools/lldb-server/registers-target-xml-reading/TestGdbRemoteTargetXmlPacket.py (2469 of 2474) PASS: lldb-unit :: Expression/./ExpressionTests/DiagnosticManagerTest.PutStringMultiple (2470 of 2474) PASS: lldb-shell :: SymbolFile/DWARF/x86/debug_loc_and_loclists.s (2471 of 2474) PASS: lldb-api :: functionalities/return-value/TestReturnValue.py (2472 of 2474) PASS: lldb-api :: lang/c/set_values/TestSetValues.py (2473 of 2474) PASS: lldb-api :: commands/expression/import-std-module/deque-basic/TestDequeFromStdModule.py (2474 of 2474) Slowest Tests: -------------------------------------------------------------------------- 267.70s: lldb-api :: tools/lldb-server/TestLldbGdbServer.py 207.89s: lldb-api :: functionalities/scripted_process/TestScriptedProcess.py 189.76s: lldb-api :: macosx/stack-corefile/TestStackCorefile.py 143.83s: lldb-api :: functionalities/memory-region/TestMemoryRegion.py 142.05s: lldb-api :: api/multithreaded/TestMultithreaded.py 131.20s: lldb-api :: macosx/skinny-corefile/TestSkinnyCorefile.py 91.31s: lldb-api :: functionalities/gdb_remote_client/TestWasm.py 87.09s: lldb-api :: lang/objc/objc-new-syntax/TestObjCNewSyntaxLiteral.py 84.74s: lldb-api :: types/TestLongTypesExpr.py 74.44s: lldb-api :: commands/expression/import-std-module/vector/TestVectorFromStdModule.py 73.18s: lldb-api :: lang/objc/exceptions/TestObjCExceptions.py 71.83s: lldb-api :: commands/expression/import-std-module/queue/TestQueueFromStdModule.py 71.01s: lldb-api :: commands/process/attach/TestProcessAttach.py 68.75s: lldb-api :: lang/cpp/namespace/TestNamespaceLookup.py 67.27s: lldb-api :: commands/expression/import-std-module/stack/TestStackFromStdModule.py 66.21s: lldb-api :: lang/objc/hidden-ivars/TestHiddenIvars.py 58.58s: lldb-api :: lang/objc/foundation/TestObjCMethods.py 54.03s: lldb-api :: types/TestIntegerTypeExpr.py 51.18s: lldb-api :: tools/lldb-server/TestGdbRemoteThreadsInStopReply.py 50.19s: lldb-api :: python_api/target/TestTargetAPI.py

Hide Details

Tests Times: -------------------------------------------------------------------------- [ Range ] :: [ Percentage ] :: [ Count ] -------------------------------------------------------------------------- [260s,280s) :: [ ] :: [ 1/2474] [240s,260s) :: [ ] :: [ 0/2474] [220s,240s) :: [ ] :: [ 0/2474] [200s,220s) :: [ ] :: [ 1/2474] [180s,200s) :: [ ] :: [ 1/2474] [160s,180s) :: [ ] :: [ 0/2474] [140s,160s) :: [ ] :: [ 2/2474] [120s,140s) :: [ ] :: [ 1/2474] [100s,120s) :: [ ] :: [ 0/2474] [ 80s,100s) :: [ ] :: [ 3/2474] [ 60s, 80s) :: [ ] :: [ 8/2474] [ 40s, 60s) :: [ ] :: [ 17/2474] [ 20s, 40s) :: [* ] :: [ 82/2474] [ 0s, 20s) :: [************************************** ] :: [2358/2474] -------------------------------------------------------------------------- ******************** Failed Tests (1): lldb-api :: functionalities/scripted_process/TestScriptedProcess.py

Hide Details

Hide Details

Testing Time: 2693.99s Unsupported : 232 Passed : 2231 Expectedly Failed: 10 Failed : 1 FAILED: tools/lldb/test/CMakeFiles/check-lldb cd /Users/buildslave/jenkins/workspace/lldb-cmake-sanitized/lldb-build/tools/lldb/test && /usr/local/Frameworks/Python.framework/Versions/3.7/bin/python3.7 /Users/buildslave/jenkins/workspace/lldb-cmake-sanitized/lldb-build/./bin/llvm-lit -v --time-tests --shuffle --xunit-xml-output=/Users/buildslave/jenkins/workspace/lldb-cmake-sanitized/test/results.xml -v -j 4 --timeout 1200 /Users/buildslave/jenkins/workspace/lldb-cmake-sanitized/lldb-build/tools/lldb/test ninja: build stopped: subcommand failed. Command failed: Command '['/usr/bin/env', 'TERM=vt100', '/usr/local/bin/ninja', '-v', 'check-lldb']' returned non-zero exit status 1. Command: ['/usr/bin/env', 'TERM=vt100', '/usr/local/bin/ninja', '-v', 'check-lldb'] [Pipeline] } [Pipeline] // timeout [Pipeline] } [Pipeline] // stage [Pipeline] stage [Pipeline] { (Declarative: Post Actions) [Pipeline] scanForIssues [Clang] Sleeping for 5 seconds due to JENKINS-32191... [Clang] Parsing console log (workspace: '/Users/buildslave/jenkins/workspace/lldb-cmake-sanitized') [Clang] -> found 0 issues (skipped 0 duplicates) [Clang] Parsing console log (workspace: '/Users/buildslave/jenkins/workspace/lldb-cmake-sanitized') [Clang] -> found 0 issues (skipped 0 duplicates) [Clang] Successfully parsed console log [Clang] -> found 0 issues (skipped 0 duplicates) [Clang] Parsing console log (workspace: '/Users/buildslave/jenkins/workspace/lldb-cmake-sanitized') [Clang] Skipping post processing [Clang] No filter has been set, publishing all 0 issues [Clang] Repository miner is not configured, skipping repository mining [Pipeline] junit Recording test results [Checks API] No suitable checks publisher found. [Pipeline] } [Pipeline] // stage [Pipeline] } [Pipeline] // withEnv [Pipeline] } [Pipeline] // node [Pipeline] End of Pipeline ERROR: script returned exit code 1 Finished: FAILURE