Regression

lldb-api.tools/lldb-server/commandline.TestStubSetSID.py (from lldb-api)

Failing for the past 1 build (Since #747 )
Took 31 sec.

Stacktrace

lldb version 11.0.99 (http://labmaster3.local/git/llvm-project.git revision c1b13a1b17719aebace1b3be7a6ac7f90b1901a6)
  clang revision 936483fb7dd2c8c6b014516ff3b3cd13740e0518
  llvm revision 936483fb7dd2c8c6b014516ff3b3cd13740e0518
LLDB library dir: /Users/buildslave/jenkins/workspace/lldb-cmake-sanitized/lldb-build/bin
LLDB import library dir: /Users/buildslave/jenkins/workspace/lldb-cmake-sanitized/lldb-build/bin
libstdcxx tests will not be run because: Don't know how to build with libstdcxx on macosx
Skipping following debug info categories: ['dwo']
setting set target.prefer-dynamic-value no-dynamic-values

Session logs for test failures/errors/unexpected successes will go into directory '/Users/buildslave/jenkins/workspace/lldb-cmake-sanitized/test/logs'
Command invoked: /Users/buildslave/jenkins/workspace/lldb-cmake-sanitized/llvm-project/lldb/test/API/dotest.py --arch x86_64 -s /Users/buildslave/jenkins/workspace/lldb-cmake-sanitized/lldb-build/lldb-test-traces -S nm -u CXXFLAGS -u CFLAGS --codesign-identity lldb_codesign --server /Users/buildslave/jenkins/workspace/lldb-cmake-sanitized/lldb-build/./bin/debugserver --arch x86_64 --build-dir /Users/buildslave/jenkins/workspace/lldb-cmake-sanitized/lldb-build/lldb-test-build.noindex -s=/Users/buildslave/jenkins/workspace/lldb-cmake-sanitized/test/logs -t --env TERM=vt100 --env LLVM_LIBS_DIR=/Users/buildslave/jenkins/workspace/lldb-cmake-sanitized/lldb-build/./lib --inferior-env ASAN_OPTIONS=detect_stack_use_after_return=1 --inferior-env DYLD_INSERT_LIBRARIES=/Users/buildslave/jenkins/workspace/lldb-cmake-sanitized/host-compiler/lib/clang/11.0.0/lib/darwin/libclang_rt.asan_osx_dynamic.dylib --build-dir /Users/buildslave/jenkins/workspace/lldb-cmake-sanitized/lldb-build/lldb-test-build.noindex --lldb-module-cache-dir /Users/buildslave/jenkins/workspace/lldb-cmake-sanitized/lldb-build/lldb-test-build.noindex/module-cache-lldb/lldb-api --clang-module-cache-dir /Users/buildslave/jenkins/workspace/lldb-cmake-sanitized/lldb-build/lldb-test-build.noindex/module-cache-clang/lldb-api --executable /Users/buildslave/jenkins/workspace/lldb-cmake-sanitized/lldb-build/./bin/lldb --compiler /Users/buildslave/jenkins/workspace/lldb-cmake-sanitized/lldb-build/./bin/clang --dsymutil /Users/buildslave/jenkins/workspace/lldb-cmake-sanitized/lldb-build/./bin/dsymutil --filecheck /Users/buildslave/jenkins/workspace/lldb-cmake-sanitized/lldb-build/./bin/FileCheck /Users/buildslave/jenkins/workspace/lldb-cmake-sanitized/llvm-project/lldb/packages/Python/lldbsuite/test/tools/lldb-server/commandline -p TestStubSetSID.py
Change dir to: /Users/buildslave/jenkins/workspace/lldb-cmake-sanitized/llvm-project/lldb/packages/Python/lldbsuite/test/tools/lldb-server/commandline
runCmd: settings set symbols.enable-external-lookup false
output: 

runCmd: settings set plugin.process.gdb-remote.packet-timeout 60
output: 

runCmd: settings set symbols.clang-modules-cache-path "/Users/buildslave/jenkins/workspace/lldb-cmake-sanitized/lldb-build/lldb-test-build.noindex/module-cache-lldb/lldb-api"
output: 

runCmd: settings set use-color false
output: 

runCmd: settings set target.env-vars ASAN_OPTIONS=detect_stack_use_after_return=1 DYLD_INSERT_LIBRARIES=/Users/buildslave/jenkins/workspace/lldb-cmake-sanitized/host-compiler/lib/clang/11.0.0/lib/darwin/libclang_rt.asan_osx_dynamic.dylib
output: 

Adding tearDown hook:         def shutdown_named_pipe():
            # Close the pipe.
            try:
                named_pipe.close()
            except:
                print("failed to close named pipe")
                None

            # Delete the pipe.
            try:
                os.remove(named_pipe_path)
            except:
                print("failed to delete named pipe: {}".format(named_pipe_path))
                None

            # Delete the temp directory.
            try:
                os.rmdir(temp_dir)
            except:
                print(
                    "failed to delete temp dir: {}, directory contents: '{}'".format(
                        temp_dir, os.listdir(temp_dir)))
                None


Adding tearDown hook:     def cleanupSubprocesses(self):
        # Ensure any subprocesses are cleaned up
        for p in self.subprocesses:
            p.terminate()
            del p
        del self.subprocesses[:]
        # Ensure any forked processes are cleaned up
        for pid in self.forkedProcessPids:
            if os.path.exists("/proc/" + str(pid)):
                os.kill(pid, signal.SIGTERM)


FAIL: LLDB (/Users/buildslave/jenkins/workspace/lldb-cmake-sanitized/lldb-build/bin/clang-10-x86_64) :: test_sid_is_different_with_S_debugserver (TestStubSetSID.TestStubSetSIDTestCase)
Executing tearDown hook:     def cleanupSubprocesses(self):
        # Ensure any subprocesses are cleaned up
        for p in self.subprocesses:
            p.terminate()
            del p
        del self.subprocesses[:]
        # Ensure any forked processes are cleaned up
        for pid in self.forkedProcessPids:
            if os.path.exists("/proc/" + str(pid)):
                os.kill(pid, signal.SIGTERM)


Executing tearDown hook:         def shutdown_named_pipe():
            # Close the pipe.
            try:
                named_pipe.close()
            except:
                print("failed to close named pipe")
                None

            # Delete the pipe.
            try:
                os.remove(named_pipe_path)
            except:
                print("failed to delete named pipe: {}".format(named_pipe_path))
                None

            # Delete the temp directory.
            try:
                os.rmdir(temp_dir)
            except:
                print(
                    "failed to delete temp dir: {}, directory contents: '{}'".format(
                        temp_dir, os.listdir(temp_dir)))
                None


runCmd: settings set symbols.enable-external-lookup false
output: 

runCmd: settings set plugin.process.gdb-remote.packet-timeout 60
output: 

runCmd: settings set symbols.clang-modules-cache-path "/Users/buildslave/jenkins/workspace/lldb-cmake-sanitized/lldb-build/lldb-test-build.noindex/module-cache-lldb/lldb-api"
output: 

runCmd: settings set use-color false
output: 

runCmd: settings set target.env-vars ASAN_OPTIONS=detect_stack_use_after_return=1 DYLD_INSERT_LIBRARIES=/Users/buildslave/jenkins/workspace/lldb-cmake-sanitized/host-compiler/lib/clang/11.0.0/lib/darwin/libclang_rt.asan_osx_dynamic.dylib
output: 

UNSUPPORTED: LLDB (/Users/buildslave/jenkins/workspace/lldb-cmake-sanitized/lldb-build/bin/clang-10-x86_64) :: test_sid_is_different_with_S_llgs (TestStubSetSID.TestStubSetSIDTestCase) (llgs tests) 
runCmd: settings set symbols.enable-external-lookup false
output: 

runCmd: settings set plugin.process.gdb-remote.packet-timeout 60
output: 

runCmd: settings set symbols.clang-modules-cache-path "/Users/buildslave/jenkins/workspace/lldb-cmake-sanitized/lldb-build/lldb-test-build.noindex/module-cache-lldb/lldb-api"
output: 

runCmd: settings set use-color false
output: 

runCmd: settings set target.env-vars ASAN_OPTIONS=detect_stack_use_after_return=1 DYLD_INSERT_LIBRARIES=/Users/buildslave/jenkins/workspace/lldb-cmake-sanitized/host-compiler/lib/clang/11.0.0/lib/darwin/libclang_rt.asan_osx_dynamic.dylib
output: 

Adding tearDown hook:         def shutdown_named_pipe():
            # Close the pipe.
            try:
                named_pipe.close()
            except:
                print("failed to close named pipe")
                None

            # Delete the pipe.
            try:
                os.remove(named_pipe_path)
            except:
                print("failed to delete named pipe: {}".format(named_pipe_path))
                None

            # Delete the temp directory.
            try:
                os.rmdir(temp_dir)
            except:
                print(
                    "failed to delete temp dir: {}, directory contents: '{}'".format(
                        temp_dir, os.listdir(temp_dir)))
                None


Adding tearDown hook:     def cleanupSubprocesses(self):
        # Ensure any subprocesses are cleaned up
        for p in self.subprocesses:
            p.terminate()
            del p
        del self.subprocesses[:]
        # Ensure any forked processes are cleaned up
        for pid in self.forkedProcessPids:
            if os.path.exists("/proc/" + str(pid)):
                os.kill(pid, signal.SIGTERM)


Executing tearDown hook:     def cleanupSubprocesses(self):
        # Ensure any subprocesses are cleaned up
        for p in self.subprocesses:
            p.terminate()
            del p
        del self.subprocesses[:]
        # Ensure any forked processes are cleaned up
        for pid in self.forkedProcessPids:
            if os.path.exists("/proc/" + str(pid)):
                os.kill(pid, signal.SIGTERM)


Executing tearDown hook:         def shutdown_named_pipe():
            # Close the pipe.
            try:
                named_pipe.close()
            except:
                print("failed to close named pipe")
                None

            # Delete the pipe.
            try:
                os.remove(named_pipe_path)
            except:
                print("failed to delete named pipe: {}".format(named_pipe_path))
                None

            # Delete the temp directory.
            try:
                os.rmdir(temp_dir)
            except:
                print(
                    "failed to delete temp dir: {}, directory contents: '{}'".format(
                        temp_dir, os.listdir(temp_dir)))
                None


PASS: LLDB (/Users/buildslave/jenkins/workspace/lldb-cmake-sanitized/lldb-build/bin/clang-10-x86_64) :: test_sid_is_different_with_setsid_debugserver (TestStubSetSID.TestStubSetSIDTestCase)
runCmd: settings set symbols.enable-external-lookup false
output: 

runCmd: settings set plugin.process.gdb-remote.packet-timeout 60
output: 

runCmd: settings set symbols.clang-modules-cache-path "/Users/buildslave/jenkins/workspace/lldb-cmake-sanitized/lldb-build/lldb-test-build.noindex/module-cache-lldb/lldb-api"
output: 

runCmd: settings set use-color false
output: 

runCmd: settings set target.env-vars ASAN_OPTIONS=detect_stack_use_after_return=1 DYLD_INSERT_LIBRARIES=/Users/buildslave/jenkins/workspace/lldb-cmake-sanitized/host-compiler/lib/clang/11.0.0/lib/darwin/libclang_rt.asan_osx_dynamic.dylib
output: 

UNSUPPORTED: LLDB (/Users/buildslave/jenkins/workspace/lldb-cmake-sanitized/lldb-build/bin/clang-10-x86_64) :: test_sid_is_different_with_setsid_llgs (TestStubSetSID.TestStubSetSIDTestCase) (llgs tests) 
runCmd: settings set symbols.enable-external-lookup false
output: 

runCmd: settings set plugin.process.gdb-remote.packet-timeout 60
output: 

runCmd: settings set symbols.clang-modules-cache-path "/Users/buildslave/jenkins/workspace/lldb-cmake-sanitized/lldb-build/lldb-test-build.noindex/module-cache-lldb/lldb-api"
output: 

runCmd: settings set use-color false
output: 

runCmd: settings set target.env-vars ASAN_OPTIONS=detect_stack_use_after_return=1 DYLD_INSERT_LIBRARIES=/Users/buildslave/jenkins/workspace/lldb-cmake-sanitized/host-compiler/lib/clang/11.0.0/lib/darwin/libclang_rt.asan_osx_dynamic.dylib
output: 

Adding tearDown hook:         def shutdown_named_pipe():
            # Close the pipe.
            try:
                named_pipe.close()
            except:
                print("failed to close named pipe")
                None

            # Delete the pipe.
            try:
                os.remove(named_pipe_path)
            except:
                print("failed to delete named pipe: {}".format(named_pipe_path))
                None

            # Delete the temp directory.
            try:
                os.rmdir(temp_dir)
            except:
                print(
                    "failed to delete temp dir: {}, directory contents: '{}'".format(
                        temp_dir, os.listdir(temp_dir)))
                None


Adding tearDown hook:     def cleanupSubprocesses(self):
        # Ensure any subprocesses are cleaned up
        for p in self.subprocesses:
            p.terminate()
            del p
        del self.subprocesses[:]
        # Ensure any forked processes are cleaned up
        for pid in self.forkedProcessPids:
            if os.path.exists("/proc/" + str(pid)):
                os.kill(pid, signal.SIGTERM)


Executing tearDown hook:     def cleanupSubprocesses(self):
        # Ensure any subprocesses are cleaned up
        for p in self.subprocesses:
            p.terminate()
            del p
        del self.subprocesses[:]
        # Ensure any forked processes are cleaned up
        for pid in self.forkedProcessPids:
            if os.path.exists("/proc/" + str(pid)):
                os.kill(pid, signal.SIGTERM)


Executing tearDown hook:         def shutdown_named_pipe():
            # Close the pipe.
            try:
                named_pipe.close()
            except:
                print("failed to close named pipe")
                None

            # Delete the pipe.
            try:
                os.remove(named_pipe_path)
            except:
                print("failed to delete named pipe: {}".format(named_pipe_path))
                None

            # Delete the temp directory.
            try:
                os.rmdir(temp_dir)
            except:
                print(
                    "failed to delete temp dir: {}, directory contents: '{}'".format(
                        temp_dir, os.listdir(temp_dir)))
                None


PASS: LLDB (/Users/buildslave/jenkins/workspace/lldb-cmake-sanitized/lldb-build/bin/clang-10-x86_64) :: test_sid_is_same_without_setsid_debugserver (TestStubSetSID.TestStubSetSIDTestCase)
runCmd: settings set symbols.enable-external-lookup false
output: 

runCmd: settings set plugin.process.gdb-remote.packet-timeout 60
output: 

runCmd: settings set symbols.clang-modules-cache-path "/Users/buildslave/jenkins/workspace/lldb-cmake-sanitized/lldb-build/lldb-test-build.noindex/module-cache-lldb/lldb-api"
output: 

runCmd: settings set use-color false
output: 

runCmd: settings set target.env-vars ASAN_OPTIONS=detect_stack_use_after_return=1 DYLD_INSERT_LIBRARIES=/Users/buildslave/jenkins/workspace/lldb-cmake-sanitized/host-compiler/lib/clang/11.0.0/lib/darwin/libclang_rt.asan_osx_dynamic.dylib
output: 

UNSUPPORTED: LLDB (/Users/buildslave/jenkins/workspace/lldb-cmake-sanitized/lldb-build/bin/clang-10-x86_64) :: test_sid_is_same_without_setsid_llgs (TestStubSetSID.TestStubSetSIDTestCase) (llgs tests) 
Restore dir to: /Users/buildslave/jenkins/workspace/lldb-cmake-sanitized/lldb-build/tools/lldb/test
======================================================================
FAIL: test_sid_is_different_with_S_debugserver (TestStubSetSID.TestStubSetSIDTestCase)
----------------------------------------------------------------------
Traceback (most recent call last):
  File "/Users/buildslave/jenkins/workspace/lldb-cmake-sanitized/llvm-project/lldb/packages/Python/lldbsuite/test/decorators.py", line 140, in wrapper
    func(*args, **kwargs)
  File "/Users/buildslave/jenkins/workspace/lldb-cmake-sanitized/llvm-project/lldb/packages/Python/lldbsuite/test/decorators.py", line 140, in wrapper
    func(*args, **kwargs)
  File "/Users/buildslave/jenkins/workspace/lldb-cmake-sanitized/llvm-project/lldb/packages/Python/lldbsuite/test/tools/lldb-server/commandline/TestStubSetSID.py", line 78, in test_sid_is_different_with_S_debugserver
    self.sid_is_different_with_S()
  File "/Users/buildslave/jenkins/workspace/lldb-cmake-sanitized/llvm-project/lldb/packages/Python/lldbsuite/test/tools/lldb-server/commandline/TestStubSetSID.py", line 39, in sid_is_different_with_S
    stub_sid = self.get_stub_sid(["-S"])
  File "/Users/buildslave/jenkins/workspace/lldb-cmake-sanitized/llvm-project/lldb/packages/Python/lldbsuite/test/tools/lldb-server/commandline/TestStubSetSID.py", line 25, in get_stub_sid
    server.pid, True))
AssertionError: False is not True
Config=x86_64-/Users/buildslave/jenkins/workspace/lldb-cmake-sanitized/lldb-build/bin/clang-10
----------------------------------------------------------------------
Ran 6 tests in 15.078s

RESULT: FAILED (2 passes, 1 failures, 0 errors, 3 skipped, 0 expected failures, 0 unexpected successes)