Console Output

Skipping 8,086 KB.. Full Log
PASS: lldb-shell :: Reproducer/TestDump.test (483 of 1898)
PASS: lldb-unit :: Symbol/./SymbolTests/TestClangASTImporter.MetadataPropagationIndirectImport (484 of 1898)
PASS: lldb-api :: commands/expression/import-std-module/vector-of-vectors/TestVectorOfVectors.py (485 of 1898)
PASS: lldb-shell :: SymbolFile/DWARF/apple-index-is-used.cpp (486 of 1898)
PASS: lldb-api :: functionalities/deleted-executable/TestDeletedExecutable.py (487 of 1898)
PASS: lldb-unit :: Utility/./UtilityTests/StringLexerTest.HasAtLeast (488 of 1898)
PASS: lldb-api :: commands/process/launch-with-shellexpand/TestLaunchWithShellExpand.py (489 of 1898)
PASS: lldb-api :: functionalities/data-formatter/data-formatter-script/TestDataFormatterScript.py (490 of 1898)
PASS: lldb-unit :: Process/minidump/./LLDBMinidumpTests/MinidumpParserTest.GetThreadContext_x86_64 (491 of 1898)
PASS: lldb-unit :: Process/gdb-remote/./ProcessGdbRemoteTests/GDBRemoteClientBaseTest.SendContinueAndAsyncPacket (492 of 1898)
UNSUPPORTED: lldb-api :: lang/objc/bitfield_ivars/TestBitfieldIvars.py (493 of 1898)
PASS: lldb-unit :: Process/minidump/./LLDBMinidumpTests/MinidumpParserTest.MinidumpModuleOrder (494 of 1898)
PASS: lldb-unit :: Host/./HostTests/SocketTest.TCPGetAddress (495 of 1898)
UNSUPPORTED: lldb-api :: functionalities/darwin_log/filter/exact_match/category/TestDarwinLogFilterMatchCategory.py (496 of 1898)
UNSUPPORTED: lldb-api :: functionalities/darwin_log/source/debug/TestDarwinLogSourceDebug.py (497 of 1898)
PASS: lldb-unit :: ScriptInterpreter/Python/./ScriptInterpreterPythonTests/PythonDataObjectsTest.TestGlobalNameResolutionWithDot (498 of 1898)
PASS: lldb-unit :: Utility/./UtilityTests/StreamTest.PutBytesAsRawHex8ToLittleEndian (499 of 1898)
UNSUPPORTED: lldb-api :: functionalities/darwin_log/filter/regex/activity-chain/TestDarwinLogFilterRegexActivityChain.py (500 of 1898)
PASS: lldb-api :: functionalities/data-formatter/refpointer-recursion/TestDataFormatterRefPtrRecursion.py (501 of 1898)
PASS: lldb-unit :: Utility/./UtilityTests/ArgsTest.ReplaceArgumentAtIndexEqual (502 of 1898)
PASS: lldb-api :: macosx/duplicate-archive-members/TestDuplicateMembers.py (503 of 1898)
PASS: lldb-unit :: Utility/./UtilityTests/ArgsTest.ReplaceArgumentAtIndexShort (504 of 1898)
PASS: lldb-api :: functionalities/data-formatter/data-formatter-stl/libcxx/optional/TestDataFormatterLibcxxOptional.py (505 of 1898)
PASS: lldb-api :: functionalities/thread/concurrent_events/TestConcurrentBreakpointDelayBreakpointOneSignal.py (506 of 1898)
PASS: lldb-unit :: Interpreter/./InterpreterTests/CompletionTest.FileCompletionAbsolute (507 of 1898)
PASS: lldb-unit :: Utility/./UtilityTests/BinaryStreamTest.PutULEB128MaxValue (508 of 1898)
PASS: lldb-unit :: Utility/./UtilityTests/UriParserTest.SchemeHostSeparator4 (509 of 1898)
PASS: lldb-unit :: ObjectFile/PECOFF/./ObjectFilePECOFFTests/PECallFrameInfoTest.Basic_eh (510 of 1898)
PASS: lldb-unit :: Host/./HostTests/SocketAddressTest.Set (511 of 1898)
PASS: lldb-unit :: Language/Highlighting/./HighlighterTests/HighlighterTest.ClangScalarLiterals (512 of 1898)
PASS: lldb-unit :: Utility/./UtilityTests/NameMatchesTest.EndsWith (513 of 1898)
UNSUPPORTED: lldb-api :: functionalities/thread/state/TestThreadStates.py (514 of 1898)
PASS: lldb-unit :: Symbol/./SymbolTests/PostfixExpression.ToDWARF (515 of 1898)
PASS: lldb-unit :: Utility/./UtilityTests/SerializationRountripTest.SerializeDeserializePod (516 of 1898)
PASS: lldb-api :: commands/watchpoints/watchpoint_commands/command/TestWatchpointCommandPython.py (517 of 1898)
UNSUPPORTED: lldb-shell :: SymbolFile/PDB/function-level-linking.test (518 of 1898)
PASS: lldb-unit :: Utility/./UtilityTests/ConstStringTest.FromMidOfBufferStringRef (519 of 1898)
PASS: lldb-api :: lang/cpp/bool/TestCPPBool.py (520 of 1898)
PASS: lldb-api :: lang/objc/objc-ivar-protocols/TestIvarProtocols.py (521 of 1898)
PASS: lldb-api :: functionalities/data-formatter/data-formatter-objc/TestDataFormatterObjNSException.py (522 of 1898)
PASS: lldb-shell :: SymbolFile/DWARF/debug_rnglists.s (523 of 1898)
UNSUPPORTED: lldb-api :: functionalities/data-formatter/data-formatter-stl/libstdcpp/list/TestDataFormatterStdList.py (524 of 1898)
PASS: lldb-unit :: ScriptInterpreter/Python/./ScriptInterpreterPythonTests/PythonDataObjectsTest.TestExceptions (525 of 1898)
PASS: lldb-unit :: Utility/./UtilityTests/RangeTest.NotEqual (526 of 1898)
PASS: lldb-unit :: Utility/./UtilityTests/StringExtractorTest.InitEmpty (527 of 1898)
PASS: lldb-unit :: ScriptInterpreter/Python/./ScriptInterpreterPythonTests/PythonDataObjectsTest.TestPythonFile (528 of 1898)
PASS: lldb-unit :: Utility/./UtilityTests/UriParserTest.Minimal (529 of 1898)
PASS: lldb-api :: lang/cpp/stl/TestStdCXXDisassembly.py (530 of 1898)
PASS: lldb-unit :: UnwindAssembly/x86/./UnwindAssemblyx86Tests/Testx86AssemblyInspectionEngine.TestPushRBX (531 of 1898)
PASS: lldb-api :: tools/lldb-server/TestGdbRemoteKill.py (532 of 1898)
PASS: lldb-unit :: Expression/./ExpressionTests/DiagnosticManagerTest.AppendMessageAttachToLastDiag (533 of 1898)
PASS: lldb-unit :: Utility/./UtilityTests/ArgsTest.TestTrailingBackslash (534 of 1898)
PASS: lldb-api :: lang/cpp/signed_types/TestSignedTypes.py (535 of 1898)
PASS: lldb-api :: commands/expression/persistent_types/TestPersistentTypes.py (536 of 1898)
PASS: lldb-api :: commands/watchpoints/watchpoint_size/TestWatchpointSizes.py (537 of 1898)
PASS: lldb-api :: commands/command/script/import/TestImport.py (538 of 1898)
PASS: lldb-api :: lang/objc/ivar-IMP/TestObjCiVarIMP.py (539 of 1898)
PASS: lldb-unit :: Utility/./UtilityTests/BinaryStreamTest.PutSLEB128FiveBytes (540 of 1898)
PASS: lldb-unit :: ObjectFile/Breakpad/./ObjectFileBreakpadTests/LineRecord.parse (541 of 1898)
PASS: lldb-api :: functionalities/gdb_remote_client/TestNestedRegDefinitions.py (542 of 1898)
PASS: lldb-api :: commands/process/launch/TestProcessLaunch.py (543 of 1898)
PASS: lldb-api :: functionalities/breakpoint/breakpoint_command/TestRegexpBreakCommand.py (544 of 1898)
PASS: lldb-shell :: ScriptInterpreter/Python/crashlog.test (545 of 1898)
PASS: lldb-unit :: Utility/./UtilityTests/TimeoutTest.Construction (546 of 1898)
PASS: lldb-api :: functionalities/inferior-crashing/recursive-inferior/TestRecursiveInferior.py (547 of 1898)
PASS: lldb-shell :: SymbolFile/DWARF/inline-function-address.ll (548 of 1898)
PASS: lldb-shell :: Reproducer/TestFileRepro.test (549 of 1898)
PASS: lldb-api :: commands/expression/import-std-module/weak_ptr-dbg-info-content/TestDbgInfoContentWeakPtr.py (550 of 1898)
PASS: lldb-unit :: Utility/./UtilityTests/RangeTest.ContainsAddrInvalid (551 of 1898)
PASS: lldb-api :: functionalities/signal/handle-abrt/TestHandleAbort.py (552 of 1898)
PASS: lldb-api :: python_api/watchpoint/TestWatchpointIter.py (553 of 1898)
PASS: lldb-api :: commands/reproducer/invalid-args/TestInvalidArgsReproducer.py (554 of 1898)
PASS: lldb-unit :: Symbol/./SymbolTests/TestClangASTContext.TestBuiltinTypeForEncodingAndBitSize (555 of 1898)
PASS: lldb-api :: types/TestCharType.py (556 of 1898)
PASS: lldb-unit :: Utility/./UtilityTests/BinaryStreamTest.PutSLEB128FourBytes (557 of 1898)
PASS: lldb-shell :: ObjectFile/ELF/PT_TLS-overlap-PT_LOAD.yaml (558 of 1898)
PASS: lldb-unit :: Expression/./ExpressionTests/DiagnosticManagerTest.GetStringSeverityLabels (559 of 1898)
PASS: lldb-api :: commands/expression/context-object-objc/TestContextObjectObjc.py (560 of 1898)
PASS: lldb-api :: lang/cpp/operators/TestCppOperators.py (561 of 1898)
PASS: lldb-api :: commands/process/attach-resume/TestAttachResume.py (562 of 1898)
PASS: lldb-unit :: Utility/./UtilityTests/BinaryStreamTest.PutSLEB128SevenBytes (563 of 1898)
PASS: lldb-shell :: Breakpoint/dummy-target.test (564 of 1898)
UNSUPPORTED: lldb-api :: functionalities/breakpoint/breakpoint_in_delayslot/TestAvoidBreakpointInDelaySlot.py (565 of 1898)
PASS: lldb-api :: tools/lldb-vscode/variables/TestVSCode_variables.py (566 of 1898)
UNSUPPORTED: lldb-api :: benchmarks/libcxxlist/TestBenchmarkLibcxxList.py (567 of 1898)
PASS: lldb-unit :: Utility/./UtilityTests/RecordReplayTest.InstrumentedFoo (568 of 1898)
PASS: lldb-unit :: Utility/./UtilityTests/StringExtractorTest.GetU64LittleEndian (569 of 1898)
PASS: lldb-api :: functionalities/gdb_remote_client/TestNoWatchpointSupportInfo.py (570 of 1898)
PASS: lldb-api :: functionalities/gdb_remote_client/TestWriteMemory.py (571 of 1898)
PASS: lldb-unit :: Utility/./UtilityTests/RangeTest.Copy (572 of 1898)
PASS: lldb-api :: lang/cpp/virtual/TestVirtual.py (573 of 1898)
PASS: lldb-unit :: Host/./HostTests/NativeProcessProtocolTest.SetBreakpointFailVerify (574 of 1898)
PASS: lldb-unit :: Symbol/./SymbolTests/LineEntryTest.GetSameLineContiguousAddressRangeOneInline (575 of 1898)
PASS: lldb-unit :: Language/Highlighting/./HighlighterTests/HighlighterTest.ClangTrailingBackslashMissingNewLine (576 of 1898)
PASS: lldb-unit :: Utility/./UtilityTests/CompletionRequest.DuplicateFilteringWithComments (577 of 1898)
PASS: lldb-unit :: Utility/./UtilityTests/StringListTest.LongestCommonPrefixSingleElement (578 of 1898)
PASS: lldb-api :: tools/lldb-server/TestGdbRemoteRegisterState.py (579 of 1898)
PASS: lldb-api :: functionalities/target-new-solib-notifications/TestModuleLoadedNotifys.py (580 of 1898)
PASS: lldb-api :: types/TestShortTypeExpr.py (581 of 1898)
PASS: lldb-shell :: SymbolFile/DWARF/debug-types-address-ranges.s (582 of 1898)
PASS: lldb-shell :: Unwind/trap_frame_sym_ctx.test (583 of 1898)
PASS: lldb-shell :: SymbolFile/DWARF/find-variable-file.cpp (584 of 1898)
PASS: lldb-unit :: Utility/./UtilityTests/RangeTest.SetRangeBase (585 of 1898)
PASS: lldb-unit :: Utility/./UtilityTests/RangeTest.Slide (586 of 1898)
PASS: lldb-api :: functionalities/data-formatter/data-formatter-objc/TestDataFormatterObjCNSData.py (587 of 1898)
PASS: lldb-unit :: Utility/./UtilityTests/StringExtractorTest.GetHexBytesAvail_Partial (588 of 1898)
UNSUPPORTED: lldb-shell :: Register/x86-gp-read.test (589 of 1898)
PASS: lldb-unit :: Utility/./UtilityTests/StringListTest.SplitIntoLinesEmpty (590 of 1898)
PASS: lldb-api :: functionalities/stats_api/TestStatisticsAPI.py (591 of 1898)
PASS: lldb-unit :: Language/Highlighting/./HighlighterTests/HighlighterTest.HighlighterSelectionPath (592 of 1898)
PASS: lldb-api :: commands/expression/formatters/TestFormatters.py (593 of 1898)
PASS: lldb-shell :: ObjectFile/ELF/minidebuginfo-corrupt-xz.yaml (594 of 1898)
PASS: lldb-unit :: Utility/./UtilityTests/DataExtractorTest.GetBitfield (595 of 1898)
PASS: lldb-api :: commands/frame/diagnose/local-variable/TestLocalVariable.py (596 of 1898)
PASS: lldb-unit :: SymbolFile/NativePDB/./SymbolFileNativePDBTests/PDBFPOProgramToDWARFExpressionTests.MissingTargetRegister (597 of 1898)
PASS: lldb-unit :: Expression/./ExpressionTests/ClangExpressionDeclMapTest.TestUnknownIdentifierLookup (598 of 1898)
PASS: lldb-shell :: Breakpoint/case-sensitive.test (599 of 1898)
PASS: lldb-unit :: Utility/./UtilityTests/DataExtractorTest.PeekData (600 of 1898)
UNSUPPORTED: lldb-shell :: SymbolFile/PDB/type-quals.test (601 of 1898)
PASS: lldb-unit :: Process/gdb-remote/./ProcessGdbRemoteTests/GDBRemoteCommunicationServerTest.SendErrorResponse_UnimplementedError (602 of 1898)
PASS: lldb-api :: commands/expression/codegen-crash-typedefdecl-not-in_declcontext/TestCodegenCrashTypedefDeclNotInDeclContext.py (603 of 1898)
PASS: lldb-unit :: Utility/./UtilityTests/StreamTeeTest.Flush (604 of 1898)
PASS: lldb-api :: commands/expression/cast_int_to_anonymous_enum/TestCastIntToAnonymousEnum.py (605 of 1898)
PASS: lldb-unit :: Utility/./UtilityTests/StringExtractorTest.GetHexBytesAvail_OddPair2 (606 of 1898)
PASS: lldb-unit :: Utility/./UtilityTests/ConstStringTest.format_provider (607 of 1898)
UNSUPPORTED: lldb-shell :: BuildScript/toolchain-clang-cl.test (608 of 1898)
PASS: lldb-api :: commands/expression/import-std-module/no-std-module/TestMissingStdModule.py (609 of 1898)
PASS: lldb-unit :: Utility/./UtilityTests/CompletionRequest.DuplicateFiltering (610 of 1898)
PASS: lldb-api :: lang/objc/rdar-10967107/TestRdar10967107.py (611 of 1898)
PASS: lldb-api :: commands/expression/completion-in-lambda-and-unnamed-class/TestCompletionInLambdaAndUnnamedClass.py (612 of 1898)
PASS: lldb-api :: commands/command/delete/TestCommandDelete.py (613 of 1898)
PASS: lldb-shell :: ObjectFile/ELF/section-types.yaml (614 of 1898)
PASS: lldb-unit :: Interpreter/./InterpreterTests/OptionArgParserTest.toScriptLanguage (615 of 1898)
PASS: lldb-api :: commands/expression/po_verbosity/TestPoVerbosity.py (616 of 1898)
PASS: lldb-unit :: UnwindAssembly/x86/./UnwindAssemblyx86Tests/Testx86AssemblyInspectionEngine.TestMovRSPtoRBP (617 of 1898)
UNSUPPORTED: lldb-api :: terminal/TestEditline.py (618 of 1898)
PASS: lldb-api :: python_api/interpreter/TestRunCommandInterpreterAPI.py (619 of 1898)
PASS: lldb-unit :: SymbolFile/NativePDB/./SymbolFileNativePDBTests/PDBFPOProgramToDWARFExpressionTests.UnresolvedRegisterAssignmentReference (620 of 1898)
PASS: lldb-api :: functionalities/data-formatter/data-formatter-objc/cmtime/TestDataFormatterCMTime.py (621 of 1898)
PASS: lldb-unit :: Expression/./ExpressionTests/DWARFExpression.DW_OP_convert (622 of 1898)
PASS: lldb-unit :: Language/Highlighting/./HighlighterTests/HighlighterTest.ClangIdentifiers (623 of 1898)
PASS: lldb-unit :: Language/Highlighting/./HighlighterTests/HighlighterTest.HighlighterSelectionType (624 of 1898)
PASS: lldb-unit :: Utility/./UtilityTests/ArgsTest.GetQuotedCommandString (625 of 1898)
PASS: lldb-unit :: UnwindAssembly/x86/./UnwindAssemblyx86Tests/Testx86AssemblyInspectionEngine.TestPopR13 (626 of 1898)
PASS: lldb-api :: lang/objc/objc-struct-return/TestObjCStructReturn.py (627 of 1898)
PASS: lldb-unit :: UnwindAssembly/x86/./UnwindAssemblyx86Tests/Testx86AssemblyInspectionEngine.Test64bitFramelessSmallStackFrame (628 of 1898)
PASS: lldb-shell :: ObjectFile/MachO/lc_build_version_notools.yaml (629 of 1898)
PASS: lldb-unit :: ScriptInterpreter/Python/./ScriptInterpreterPythonTests/PythonDataObjectsTest.TestPythonCallableInvoke (630 of 1898)
PASS: lldb-shell :: Commands/command-regex-unalias.test (631 of 1898)
PASS: lldb-api :: functionalities/breakpoint/global_constructor/TestBreakpointInGlobalConstructor.py (632 of 1898)
PASS: lldb-unit :: Utility/./UtilityTests/TimerTest.CategoryTimesNested (633 of 1898)
UNSUPPORTED: lldb-shell :: Register/x86-64-ymm16-read.test (634 of 1898)
PASS: lldb-api :: functionalities/dead-strip/TestDeadStrip.py (635 of 1898)
PASS: lldb-unit :: SymbolFile/DWARF/./SymbolFileDWARFTests/SymbolFileDWARFTests.TestAbbrevNullAttrValidForm (636 of 1898)
PASS: lldb-api :: functionalities/wrong_commands/TestWrongCommands.py (637 of 1898)
PASS: lldb-api :: tools/lldb-server/commandline/TestStubReverseConnect.py (638 of 1898)
PASS: lldb-unit :: Core/./LLDBCoreTests/MangledTest.NameIndexes_FindFunctionSymbols (639 of 1898)
PASS: lldb-api :: lang/objc/modules-app-update/TestClangModulesAppUpdate.py (640 of 1898)
PASS: lldb-unit :: Utility/./UtilityTests/ScalarTest.Division (641 of 1898)
PASS: lldb-unit :: Process/gdb-remote/./ProcessGdbRemoteTests/GDBRemoteCommunicationClientTest.GetModulesInfo (642 of 1898)
PASS: lldb-unit :: Utility/./UtilityTests/SerializationRountripTest.SerializeDeserializePodPointers (643 of 1898)
PASS: lldb-unit :: Utility/./UtilityTests/NameMatchesTest.Ignore (644 of 1898)
PASS: lldb-shell :: SymbolFile/DWARF/dir-separator-posix.s (645 of 1898)
UNSUPPORTED: lldb-api :: functionalities/ubsan/user-expression/TestUbsanUserExpression.py (646 of 1898)
PASS: lldb-unit :: Utility/./UtilityTests/UriParserTest.SchemeHostSeparator (647 of 1898)
PASS: lldb-api :: lang/cpp/scope/TestCppScope.py (648 of 1898)
PASS: lldb-shell :: ObjectFile/Breakpad/sections-trailing-func.test (649 of 1898)
PASS: lldb-unit :: Target/./TargetTests/ExecutionContextTest.GetByteOrderProcess (650 of 1898)
PASS: lldb-unit :: Host/./HostTests/Host.WaitStatusFormat (651 of 1898)
PASS: lldb-shell :: SymbolFile/DWARF/find-basic-type.cpp (652 of 1898)
UNSUPPORTED: lldb-api :: tools/lldb-server/TestGdbRemoteAuxvSupport.py (653 of 1898)
PASS: lldb-unit :: Utility/./UtilityTests/ListenerTest.GetEventWait (654 of 1898)
UNSUPPORTED: lldb-shell :: ScriptInterpreter/Lua/lua.test (655 of 1898)
PASS: lldb-api :: functionalities/inferior-changed/TestInferiorChanged.py (656 of 1898)
PASS: lldb-unit :: Host/./HostTests/File.GetStreamFromDescriptor (657 of 1898)
PASS: lldb-unit :: ScriptInterpreter/Python/./ScriptInterpreterPythonTests/PythonDataObjectsTest.TestPythonDictionaryToStructuredDictionary (658 of 1898)
PASS: lldb-unit :: Expression/./ExpressionTests/DWARFExpression.DW_OP_pick (659 of 1898)
UNSUPPORTED: lldb-api :: tools/lldb-server/libraries-svr4/TestGdbRemoteLibrariesSvr4Support.py (660 of 1898)
PASS: lldb-unit :: Utility/./UtilityTests/UUIDTest.SetFromStringRef (661 of 1898)
PASS: lldb-shell :: Driver/TestCommands.test (662 of 1898)
UNSUPPORTED: lldb-api :: functionalities/tsan/basic/TestTsanBasic.py (663 of 1898)
PASS: lldb-api :: functionalities/breakpoint/move_nearest/TestMoveNearest.py (664 of 1898)
PASS: lldb-api :: api/log/TestAPILog.py (665 of 1898)
PASS: lldb-unit :: Utility/./UtilityTests/UriParserTest.BracketedHostname (666 of 1898)
PASS: lldb-api :: lang/cpp/diamond/TestDiamond.py (667 of 1898)
PASS: lldb-shell :: SymbolFile/DWARF/debug-names-compressed.cpp (668 of 1898)
PASS: lldb-unit :: ScriptInterpreter/Python/./ScriptInterpreterPythonTests/PythonDataObjectsTest.TestOwnedReferences (669 of 1898)
PASS: lldb-api :: functionalities/unwind/sigtramp/TestSigtrampUnwind.py (670 of 1898)
PASS: lldb-unit :: SymbolFile/NativePDB/./SymbolFileNativePDBTests/PDBFPOProgramToDWARFExpressionTests.InvalidAssignmentMultiple (671 of 1898)
PASS: lldb-unit :: Utility/./UtilityTests/Flags.Reset (672 of 1898)
PASS: lldb-unit :: ScriptInterpreter/Python/./ScriptInterpreterPythonTests/PythonDataObjectsTest.TestPythonBytes (673 of 1898)
UNSUPPORTED: lldb-shell :: SymbolFile/PDB/udt-layout.test (674 of 1898)
UNSUPPORTED: lldb-api :: commands/gui/basic/TestGuiBasic.py (675 of 1898)
PASS: lldb-unit :: Core/./LLDBCoreTests/UniqueCStringMap.NoDefaultConstructor (676 of 1898)
PASS: lldb-unit :: Utility/./UtilityTests/StringListTest.GetSize (677 of 1898)
PASS: lldb-unit :: Symbol/./SymbolTests/PostfixExpression.ParseOneExpression (678 of 1898)
PASS: lldb-unit :: Utility/./UtilityTests/UriParserTest.BracketedHostnamePort (679 of 1898)
PASS: lldb-unit :: Process/gdb-remote/./ProcessGdbRemoteTests/GDBRemoteClientBaseTest.SendContinueAndWait (680 of 1898)
PASS: lldb-unit :: Utility/./UtilityTests/ScalarTest.Promotion (681 of 1898)
PASS: lldb-unit :: Utility/./UtilityTests/StreamTeeTest.Constructor1Stream (682 of 1898)
PASS: lldb-unit :: ScriptInterpreter/Python/./ScriptInterpreterPythonTests/PythonDataObjectsTest.TestPythonListToStructuredList (683 of 1898)
PASS: lldb-unit :: Utility/./UtilityTests/ArgsTest.BareSingleQuote (684 of 1898)
PASS: lldb-unit :: Utility/./UtilityTests/OptionsWithRawTest.ArgsButNoLeadingDash (685 of 1898)
PASS: lldb-unit :: Target/./TargetTests/PathMappingListTest.RemapRoot (686 of 1898)
PASS: lldb-shell :: SymbolFile/Breakpad/unwind-via-stack-cfi.test (687 of 1898)
PASS: lldb-unit :: Symbol/./SymbolTests/TestClangASTContext.TestFunctionTemplateConstruction (688 of 1898)
PASS: lldb-api :: functionalities/thread/concurrent_events/TestConcurrentWatchBreak.py (689 of 1898)
PASS: lldb-api :: lang/c/local_variables/TestLocalVariables.py (690 of 1898)
PASS: lldb-unit :: Utility/./UtilityTests/StringLexerTest.Next (691 of 1898)
PASS: lldb-unit :: ScriptInterpreter/Python/./ScriptInterpreterPythonTests/PythonDataObjectsTest.TestPythonListValueEquality (692 of 1898)
UNSUPPORTED: lldb-api :: commands/expression/call-restarts/TestCallThatRestarts.py (693 of 1898)
UNSUPPORTED: lldb-api :: benchmarks/frame_variable/TestFrameVariableResponse.py (694 of 1898)
PASS: lldb-api :: commands/expression/issue_11588/Test11588.py (695 of 1898)
PASS: lldb-api :: functionalities/source-map/TestTargetSourceMap.py (696 of 1898)
PASS: lldb-unit :: Utility/./UtilityTests/StringListTest.InsertStringAtIndexMove (697 of 1898)
PASS: lldb-api :: python_api/sbvalue_const_addrof/TestSBValueConstAddrOf.py (698 of 1898)
PASS: lldb-api :: commands/expression/import-std-module/list-dbg-info-content/TestDbgInfoContentList.py (699 of 1898)
PASS: lldb-api :: commands/expression/function_template_specialization_temp_args/TestFunctionTemplateSpecializationTempArgs.py (700 of 1898)
PASS: lldb-unit :: Symbol/./SymbolTests/SymbolsTest.LocateExecutableSymbolFileForUnknownExecutableAndMissingSymbolFile (701 of 1898)
PASS: lldb-unit :: Utility/./UtilityTests/ConstStringTest.CompareStringRef (702 of 1898)
PASS: lldb-api :: lang/cpp/stl/TestSTL.py (703 of 1898)
PASS: lldb-api :: lang/c/tls_globals/TestTlsGlobals.py (704 of 1898)
PASS: lldb-api :: functionalities/data-formatter/data-formatter-ptr-to-array/TestPtrToArrayFormatting.py (705 of 1898)
PASS: lldb-unit :: Expression/./ExpressionTests/DiagnosticManagerTest.GetStringNoDiags (706 of 1898)
UNSUPPORTED: lldb-shell :: SymbolFile/PDB/variables.test (707 of 1898)
PASS: lldb-unit :: Host/./HostTests/TaskPoolTest.TaskMap (708 of 1898)
PASS: lldb-unit :: Host/./HostTests/HostInfoTest.GetHostname (709 of 1898)
PASS: lldb-shell :: ObjectFile/PECOFF/basic-info-arm.yaml (710 of 1898)
PASS: lldb-unit :: Utility/./UtilityTests/StringLexerTest.NextIf (711 of 1898)
PASS: lldb-api :: commands/disassemble/basic/TestDisassembleBreakpoint.py (712 of 1898)
PASS: lldb-unit :: Utility/./UtilityTests/StringExtractorTest.GetHexU8_Underflow_NoEof (713 of 1898)
PASS: lldb-unit :: UnwindAssembly/x86/./UnwindAssemblyx86Tests/Testx86AssemblyInspectionEngine.TestPushR12 (714 of 1898)
PASS: lldb-api :: api/listeners/TestListener.py (715 of 1898)
PASS: lldb-api :: functionalities/breakpoint/breakpoint_command/TestBreakpointCommandsFromPython.py (716 of 1898)
PASS: lldb-unit :: Host/./HostTests/SocketAddressTest.GetAddressInfo (717 of 1898)
PASS: lldb-unit :: Utility/./UtilityTests/RangeTest.Clear (718 of 1898)
PASS: lldb-unit :: Utility/./UtilityTests/FileSpecTest.AppendPathComponent (719 of 1898)
PASS: lldb-api :: macosx/safe-to-func-call/TestSafeFuncCalls.py (720 of 1898)
PASS: lldb-api :: functionalities/thread/thread_specific_break/TestThreadSpecificBreakpoint.py (721 of 1898)
PASS: lldb-unit :: Utility/./UtilityTests/ConstStringTest.MangledCounterpart (722 of 1898)
PASS: lldb-api :: types/TestIntegerTypeExpr.py (723 of 1898)
PASS: lldb-shell :: Minidump/Windows/Sigsegv/sigsegv.test (724 of 1898)
PASS: lldb-unit :: ScriptInterpreter/Python/./ScriptInterpreterPythonTests/PythonDataObjectsTest.TestObjectAttributes (725 of 1898)
PASS: lldb-api :: commands/target/dump-symtab-demangle/TestDumpSymtabDemangle.py (726 of 1898)
PASS: lldb-shell :: ObjectFile/ELF/gnu-debuglink.yaml (727 of 1898)
PASS: lldb-unit :: Expression/./ExpressionTests/DiagnosticManagerTest.GetStringBasic (728 of 1898)
XFAIL: lldb-shell :: SymbolFile/DWARF/find-type-in-function.cpp (729 of 1898)
PASS: lldb-api :: functionalities/thread/concurrent_events/TestConcurrentSignalBreak.py (730 of 1898)
PASS: lldb-api :: lang/c/function_types/TestFunctionTypes.py (731 of 1898)
PASS: lldb-api :: tools/lldb-server/TestGdbRemoteHostInfo.py (732 of 1898)
PASS: lldb-unit :: Utility/./UtilityTests/ScalarTest.Scalar_512 (733 of 1898)
PASS: lldb-unit :: Language/Highlighting/./HighlighterTests/HighlighterTest.ClangPPDirectives (734 of 1898)
PASS: lldb-unit :: Utility/./UtilityTests/StringListTest.SplitIntoLines (735 of 1898)
UNSUPPORTED: lldb-api :: functionalities/tsan/thread_leak/TestTsanThreadLeak.py (736 of 1898)
PASS: lldb-api :: commands/target/stop-hooks/TestStopHooks.py (737 of 1898)
PASS: lldb-api :: lang/c/enum_types/TestEnumTypes.py (738 of 1898)
PASS: lldb-shell :: Quit/TestQuitExitCodeHex0.test (739 of 1898)
PASS: lldb-unit :: Utility/./UtilityTests/BinaryStreamTest.PutULEB128EightBytes (740 of 1898)
PASS: lldb-unit :: Utility/./UtilityTests/BinaryStreamTest.PutULEB128One (741 of 1898)
PASS: lldb-api :: lang/cpp/thread_local/TestThreadLocal.py (742 of 1898)
PASS: lldb-api :: functionalities/history/TestHistoryRecall.py (743 of 1898)
PASS: lldb-unit :: Utility/./UtilityTests/Flags.IsClear (744 of 1898)
PASS: lldb-api :: functionalities/breakpoint/breakpoint_hit_count/TestBreakpointHitCount.py (745 of 1898)
PASS: lldb-unit :: Process/minidump/./LLDBMinidumpTests/MinidumpParserTest.GetExceptionStream (746 of 1898)
PASS: lldb-unit :: Host/./HostTests/SocketTest.DomainListenConnectAccept (747 of 1898)
PASS: lldb-unit :: Process/gdb-remote/./ProcessGdbRemoteTests/GDBRemoteCommunicationServerTest.SendErrorResponse_Status (748 of 1898)
PASS: lldb-api :: macosx/order/TestOrderFile.py (749 of 1898)
PASS: lldb-shell :: SymbolFile/DWARF/find-variable-dwo.cpp (750 of 1898)
PASS: lldb-api :: tools/lldb-vscode/launch/TestVSCode_launch.py (751 of 1898)
PASS: lldb-api :: lang/cpp/modules-import/TestCXXModulesImport.py (752 of 1898)
PASS: lldb-api :: lang/objc/modules-incomplete/TestIncompleteModules.py (753 of 1898)
PASS: lldb-unit :: Utility/./UtilityTests/BinaryStreamTest.PutSLEB128SixBytes (754 of 1898)
PASS: lldb-unit :: Utility/./UtilityTests/VMRange.CollectionContains (755 of 1898)
UNSUPPORTED: lldb-shell :: Register/aarch64-gp-read.test (756 of 1898)
PASS: lldb-api :: lang/cpp/limit-debug-info/TestWithLimitDebugInfo.py (757 of 1898)
PASS: lldb-api :: lang/cpp/class_types/TestClassTypesDisassembly.py (758 of 1898)
PASS: lldb-api :: functionalities/pre_run_dylibs/TestPreRunDylibs.py (759 of 1898)
PASS: lldb-shell :: Minidump/fb-dump.test (760 of 1898)
PASS: lldb-api :: functionalities/thread/create_after_attach/TestCreateAfterAttach.py (761 of 1898)
PASS: lldb-unit :: Utility/./UtilityTests/UriParserTest.SchemeHostSeparator3 (762 of 1898)
PASS: lldb-api :: lang/objc/foundation/TestObjCMethods2.py (763 of 1898)
PASS: lldb-api :: lang/objc/objc-ivar-stripped/TestObjCIvarStripped.py (764 of 1898)
PASS: lldb-unit :: Utility/./UtilityTests/StreamTest.AddressRangeSize (765 of 1898)
PASS: lldb-api :: python_api/process/TestProcessAPI.py (766 of 1898)
PASS: lldb-unit :: Symbol/./SymbolTests/TestClangASTContext.TestRemoveFastQualifiers (767 of 1898)
PASS: lldb-api :: lang/c/step_over_no_deadlock/TestStepOverDoesntBlock.py (768 of 1898)
PASS: lldb-unit :: UnwindAssembly/x86/./UnwindAssemblyx86Tests/Testx86AssemblyInspectionEngine.TestPushEAX (769 of 1898)
PASS: lldb-unit :: Utility/./UtilityTests/StringLexerTest.AdvanceIf (770 of 1898)
PASS: lldb-api :: types/TestCharTypeExpr.py (771 of 1898)
PASS: lldb-unit :: Utility/./UtilityTests/StatusTest.ErrorConstructor (772 of 1898)
PASS: lldb-api :: functionalities/return-value/TestReturnValue.py (773 of 1898)
PASS: lldb-unit :: Utility/./UtilityTests/RangeTest.ClearWithStarAddress (774 of 1898)
PASS: lldb-unit :: Core/./LLDBCoreTests/RichManglingContextTest.Basic (775 of 1898)
PASS: lldb-unit :: Utility/./UtilityTests/StringListTest.LongestCommonPrefixDuplicateElement (776 of 1898)
PASS: lldb-api :: tools/lldb-server/TestGdbRemoteExpeditedRegisters.py (777 of 1898)
PASS: lldb-unit :: UnwindAssembly/x86/./UnwindAssemblyx86Tests/Testx86AssemblyInspectionEngine.TestPush0 (778 of 1898)
PASS: lldb-api :: lang/objc/objc-foundation-dictionary-empty/TestNSDictionary0.py (779 of 1898)
PASS: lldb-unit :: UnwindAssembly/x86/./UnwindAssemblyx86Tests/Testx86AssemblyInspectionEngine.TestPushEDI (780 of 1898)
PASS: lldb-unit :: Host/./HostTests/SocketTest.DecodeHostAndPort (781 of 1898)
PASS: lldb-api :: functionalities/memory-region/TestMemoryRegion.py (782 of 1898)
PASS: lldb-unit :: Utility/./UtilityTests/StreamTeeTest.DefaultConstructor (783 of 1898)
PASS: lldb-unit :: Utility/./UtilityTests/RecordReplayTest.InstrumentedFooSameThis (784 of 1898)
PASS: lldb-unit :: UnwindAssembly/x86/./UnwindAssemblyx86Tests/Testx86AssemblyInspectionEngine.TestSpillRegToStackViaMOVx86_64 (785 of 1898)
PASS: lldb-shell :: SymbolFile/DWARF/debug_ranges.s (786 of 1898)
PASS: lldb-unit :: Utility/./UtilityTests/StreamTest.PutMaxHex64ByteOrderLittle (787 of 1898)
PASS: lldb-api :: functionalities/data-formatter/data-formatter-enum-format/TestDataFormatterEnumFormat.py (788 of 1898)
PASS: lldb-api :: lang/objc/objc-super/TestObjCSuper.py (789 of 1898)
PASS: lldb-api :: functionalities/breakpoint/comp_dir_symlink/TestCompDirSymLink.py (790 of 1898)
PASS: lldb-shell :: Breakpoint/debug_addrx.test (791 of 1898)
PASS: lldb-unit :: Utility/./UtilityTests/AnsiTerminal.KnownPrefix (792 of 1898)
PASS: lldb-unit :: Utility/./UtilityTests/ProcessInstanceInfoMatch.Name (793 of 1898)
PASS: lldb-api :: macosx/queues/TestQueues.py (794 of 1898)
PASS: lldb-unit :: Interpreter/./InterpreterTests/CompletionTest.DirCompletionUsername (795 of 1898)
PASS: lldb-api :: tools/lldb-server/register-reading/TestGdbRemoteGPacket.py (796 of 1898)
UNSUPPORTED: lldb-shell :: SymbolFile/PDB/vbases.test (797 of 1898)
UNSUPPORTED: lldb-api :: functionalities/thread/thread_specific_break_plus_condition/TestThreadSpecificBpPlusCondition.py (798 of 1898)
UNSUPPORTED: lldb-api :: functionalities/darwin_log/filter/regex/subsystem/TestDarwinLogFilterRegexSubsystem.py (799 of 1898)
PASS: lldb-unit :: Utility/./UtilityTests/ConstStringTest.UpdateMangledCounterpart (800 of 1898)
PASS: lldb-api :: lang/cpp/trivial_abi/TestTrivialABI.py (801 of 1898)
PASS: lldb-shell :: ObjectFile/ELF/PT_LOAD-overlap-section.yaml (802 of 1898)
PASS: lldb-shell :: Commands/command-backtrace.test (803 of 1898)
PASS: lldb-api :: functionalities/tail_call_frames/disambiguate_call_site/TestDisambiguateCallSite.py (804 of 1898)
PASS: lldb-unit :: Utility/./UtilityTests/StringListTest.DefaultConstructor (805 of 1898)
PASS: lldb-unit :: Utility/./UtilityTests/ArchSpecTest.Compatibility (806 of 1898)
PASS: lldb-api :: functionalities/breakpoint/objc/TestObjCBreakpoints.py (807 of 1898)
PASS: lldb-unit :: ScriptInterpreter/Python/./ScriptInterpreterPythonTests/PythonDataObjectsTest.TestGlobalNameResolutionNoDot (808 of 1898)
PASS: lldb-unit :: Expression/./ExpressionTests/ClangExpressionDeclMapTest.TestPersistentDeclLookup (809 of 1898)
PASS: lldb-unit :: Utility/./UtilityTests/RegularExpression.Valid (810 of 1898)
PASS: lldb-api :: functionalities/thread/backtrace_limit/TestBacktraceLimit.py (811 of 1898)
PASS: lldb-api :: commands/frame/recognizer/TestFrameRecognizer.py (812 of 1898)
PASS: lldb-unit :: Symbol/./SymbolTests/LineEntryTest.GetSameLineContiguousAddressRangeNestedInline (813 of 1898)
PASS: lldb-api :: lang/objc/objc-ivar-offsets/TestObjCIvarOffsets.py (814 of 1898)
PASS: lldb-unit :: Process/gdb-remote/./ProcessGdbRemoteTests/GDBRemoteCommunicationClientTest.GetMemoryRegionInfo (815 of 1898)
PASS: lldb-api :: commands/expression/class_template_specialization_empty_pack/TestClassTemplateSpecializationParametersHandling.py (816 of 1898)
PASS: lldb-api :: lang/c/set_values/TestSetValues.py (817 of 1898)
PASS: lldb-shell :: SymbolFile/DWARF/debug-types-line-tables.s (818 of 1898)
PASS: lldb-api :: commands/expression/import-std-module/forward_list-basic/TestBasicForwardList.py (819 of 1898)
PASS: lldb-api :: functionalities/thread/concurrent_events/TestConcurrentCrashWithBreak.py (820 of 1898)
PASS: lldb-api :: commands/gui/invalid-args/TestInvalidArgsGui.py (821 of 1898)
PASS: lldb-api :: commands/expression/two-files/TestObjCTypeQueryFromOtherCompileUnit.py (822 of 1898)
XFAIL: lldb-shell :: Register/x86-64-write.test (823 of 1898)
PASS: lldb-shell :: SymbolFile/DWARF/debug-types-signature-loop.s (824 of 1898)
PASS: lldb-unit :: UnwindAssembly/x86/./UnwindAssemblyx86Tests/Testx86AssemblyInspectionEngine.TestPushEBP (825 of 1898)
UNSUPPORTED: lldb-api :: tools/lldb-vscode/completions/TestVSCode_completions.py (826 of 1898)
PASS: lldb-shell :: SymbolFile/DWARF/clang-ast-from-dwarf-unamed-and-anon-structs.cpp (827 of 1898)
PASS: lldb-api :: commands/expression/pr35310/TestExprsBug35310.py (828 of 1898)
PASS: lldb-unit :: Utility/./UtilityTests/SubsystemRAIITest.NormalSubsystem (829 of 1898)
PASS: lldb-unit :: Host/./HostTests/ProcessLaunchInfoTest.Constructor (830 of 1898)
UNSUPPORTED: lldb-api :: functionalities/thread/multi_break/TestMultipleBreakpoints.py (831 of 1898)
PASS: lldb-shell :: Reproducer/Functionalities/TestImageList.test (832 of 1898)
PASS: lldb-unit :: Utility/./UtilityTests/StringLexerTest.GetUnlexed (833 of 1898)
UNSUPPORTED: lldb-shell :: BuildScript/toolchain-msvc.test (834 of 1898)
PASS: lldb-api :: lang/c/step-target/TestStepTarget.py (835 of 1898)
PASS: lldb-unit :: Signals/./SignalsTests/UnixSignalsTest.Iteration (836 of 1898)
PASS: lldb-unit :: Utility/./UtilityTests/OptionsWithRawTest.WhitespaceInput (837 of 1898)
PASS: lldb-shell :: SymbolFile/NativePDB/globals-fundamental.cpp (838 of 1898)
PASS: lldb-api :: functionalities/thread/concurrent_events/TestConcurrentTwoBreakpointsOneWatchpoint.py (839 of 1898)
PASS: lldb-unit :: UnwindAssembly/x86/./UnwindAssemblyx86Tests/Testx86AssemblyInspectionEngine.TestPushR13 (840 of 1898)
PASS: lldb-api :: commands/expression/context-object/TestContextObject.py (841 of 1898)
PASS: lldb-api :: functionalities/breakpoint/auto_continue/TestBreakpointAutoContinue.py (842 of 1898)
PASS: lldb-unit :: Utility/./UtilityTests/ScalarTest.ExtractBitfield (843 of 1898)
PASS: lldb-unit :: ScriptInterpreter/Python/./ScriptInterpreterPythonTests/PythonDataObjectsTest.TestPythonStringToStructuredString (844 of 1898)
PASS: lldb-api :: tools/lldb-vscode/attach/TestVSCode_attach.py (845 of 1898)
PASS: lldb-api :: types/TestFloatTypesExpr.py (846 of 1898)
PASS: lldb-unit :: UnwindAssembly/x86/./UnwindAssemblyx86Tests/Testx86AssemblyInspectionEngine.TestSubESP (847 of 1898)
UNSUPPORTED: lldb-api :: linux/thread/create_during_instruction_step/TestCreateDuringInstructionStep.py (848 of 1898)
PASS: lldb-api :: lang/objc/print-obj/TestPrintObj.py (849 of 1898)
PASS: lldb-api :: functionalities/jitloader_gdb/TestJITLoaderGDB.py (850 of 1898)
PASS: lldb-unit :: Symbol/./SymbolTests/TestClangASTImporter.DeportDeclTagDecl (851 of 1898)
PASS: lldb-shell :: Process/TestEnvironment.test (852 of 1898)
PASS: lldb-unit :: Utility/./UtilityTests/OptionsWithRawTest.TerminatedQuote (853 of 1898)
PASS: lldb-api :: functionalities/thread/concurrent_events/TestConcurrentTwoWatchpointsOneSignal.py (854 of 1898)
PASS: lldb-api :: commands/expression/ir-interpreter/TestIRInterpreter.py (855 of 1898)
PASS: lldb-api :: lang/cpp/namespace_definitions/TestNamespaceDefinitions.py (856 of 1898)
PASS: lldb-api :: commands/expression/call-function/TestCallStdStringFunction.py (857 of 1898)
PASS: lldb-api :: functionalities/data-formatter/data-formatter-stl/libcxx/multimap/TestDataFormatterLibccMultiMap.py (858 of 1898)
PASS: lldb-api :: lang/cpp/std-function-step-into-callable/TestStdFunctionStepIntoCallable.py (859 of 1898)
PASS: lldb-api :: macosx/add-dsym/TestAddDsymMidExecutionCommand.py (860 of 1898)
PASS: lldb-api :: lang/cpp/extern_c/TestExternCSymbols.py (861 of 1898)
PASS: lldb-api :: functionalities/fat_archives/TestFatArchives.py (862 of 1898)
UNSUPPORTED: lldb-api :: functionalities/tsan/thread_numbers/TestTsanThreadNumbers.py (863 of 1898)
PASS: lldb-unit :: Utility/./UtilityTests/CompletionRequest.ShiftArguments (864 of 1898)
PASS: lldb-api :: lang/cpp/gmodules/TestWithModuleDebugging.py (865 of 1898)
PASS: lldb-unit :: Utility/./UtilityTests/DataExtractorTest.GetMaxU64 (866 of 1898)
PASS: lldb-shell :: Settings/TestEchoCommands.test (867 of 1898)
PASS: lldb-shell :: Commands/CommandScriptImmediateOutput/CommandScriptImmediateOutputConsole.test (868 of 1898)
PASS: lldb-api :: types/TestDoubleTypesExpr.py (869 of 1898)
PASS: lldb-unit :: Utility/./UtilityTests/StreamTest.PutChar (870 of 1898)
PASS: lldb-api :: types/TestLongTypesExpr.py (871 of 1898)
PASS: lldb-unit :: Expression/./ExpressionTests/DiagnosticManagerTest.FixedExpression (872 of 1898)
PASS: lldb-unit :: Symbol/./SymbolTests/TestClangASTContext.TestGetTypeClassTypeOfExpr (873 of 1898)
PASS: lldb-unit :: Utility/./UtilityTests/BroadcasterTest.EventTypeHasListeners (874 of 1898)
PASS: lldb-unit :: Utility/./UtilityTests/LogTest.Unregister (875 of 1898)
PASS: lldb-unit :: Host/./HostTests/TaskPoolTest.RunTasks (876 of 1898)
PASS: lldb-unit :: Host/./HostTests/FileSystemTest.MakeAbsolute (877 of 1898)
PASS: lldb-unit :: Utility/./UtilityTests/SerializationRountripTest.SerializeDeserializeCString (878 of 1898)
PASS: lldb-unit :: Process/gdb-remote/./ProcessGdbRemoteTests/GDBRemoteClientBaseTest.InterruptNoResponse (879 of 1898)
PASS: lldb-api :: functionalities/data-formatter/format-propagation/TestFormatPropagation.py (880 of 1898)
PASS: lldb-api :: commands/command/script/import/rdar-12586188/TestRdar12586188.py (881 of 1898)
PASS: lldb-unit :: Symbol/./SymbolTests/TestClangASTImporter.CanImportInvalidType (882 of 1898)
PASS: lldb-api :: functionalities/data-formatter/hexcaps/TestDataFormatterHexCaps.py (883 of 1898)
PASS: lldb-api :: functionalities/tail_call_frames/cross_object/TestCrossObjectTailCalls.py (884 of 1898)
PASS: lldb-unit :: Utility/./UtilityTests/CompletionRequest.Constructor (885 of 1898)
PASS: lldb-shell :: ObjectFile/ELF/PT_LOAD-overlap.yaml (886 of 1898)
PASS: lldb-api :: commands/expression/persistent_ptr_update/TestPersistentPtrUpdate.py (887 of 1898)
PASS: lldb-unit :: Host/./HostTests/SocketTest.DomainGetConnectURI (888 of 1898)
PASS: lldb-api :: lang/objc/objc-stepping/TestObjCStepping.py (889 of 1898)
PASS: lldb-unit :: Utility/./UtilityTests/StructuredDataTest.StringDump (890 of 1898)
PASS: lldb-unit :: Utility/./UtilityTests/RangeTest.Constructor (891 of 1898)
PASS: lldb-unit :: Utility/./UtilityTests/StreamTest.AddressSize (892 of 1898)
PASS: lldb-api :: functionalities/data-formatter/data-formatter-synth/TestDataFormatterSynth.py (893 of 1898)
PASS: lldb-unit :: Utility/./UtilityTests/FileSpecTest.GetPath (894 of 1898)
PASS: lldb-unit :: ObjectFile/Breakpad/./ObjectFileBreakpadTests/FuncRecord.parse (895 of 1898)
PASS: lldb-api :: functionalities/thread/concurrent_events/TestConcurrentManyWatchpoints.py (896 of 1898)
PASS: lldb-unit :: ObjectFile/PECOFF/./ObjectFilePECOFFTests/PECallFrameInfoTest.Chained_eh (897 of 1898)
PASS: lldb-api :: commands/command/script/TestCommandScript.py (898 of 1898)
PASS: lldb-api :: lang/objc/orderedset/TestOrderedSet.py (899 of 1898)
PASS: lldb-api :: functionalities/tail_call_frames/ambiguous_tail_call_seq2/TestAmbiguousTailCallSeq2.py (900 of 1898)
UNSUPPORTED: lldb-api :: functionalities/darwin_log/source/info/TestDarwinLogSourceInfo.py (901 of 1898)
PASS: lldb-api :: functionalities/data-formatter/synthcapping/TestSyntheticCapping.py (902 of 1898)
PASS: lldb-unit :: Utility/./UtilityTests/ConstStringTest.CompareConstString (903 of 1898)
PASS: lldb-unit :: Utility/./UtilityTests/ScalarTest.GetValue (904 of 1898)
PASS: lldb-unit :: Process/gdb-remote/./ProcessGdbRemoteTests/GDBRemoteCommunicationClientTest.SaveRestoreRegistersNoSuffix (905 of 1898)
PASS: lldb-shell :: Breakpoint/implicit_const_form_support.test (906 of 1898)
UNSUPPORTED: lldb-api :: functionalities/darwin_log/filter/regex/activity/TestDarwinLogFilterRegexActivity.py (907 of 1898)
PASS: lldb-unit :: Utility/./UtilityTests/TimerTest.CategoryTimesStats (908 of 1898)
PASS: lldb-api :: commands/expression/vector_of_enums/TestVectorOfEnums.py (909 of 1898)
UNSUPPORTED: lldb-shell :: Register/x86-64-zmm-read.test (910 of 1898)
PASS: lldb-unit :: Utility/./UtilityTests/StringListTest.GetMaxStringLengthDecreasingSize (911 of 1898)
UNSUPPORTED: lldb-shell :: SymbolFile/dissassemble-entry-point.s (912 of 1898)
PASS: lldb-unit :: debugserver/./debugserverTests/RNBSocket.LoopBackListenIPv4 (913 of 1898)
PASS: lldb-unit :: Process/minidump/./LLDBMinidumpTests/MinidumpParserTest.GetPidWindows (914 of 1898)
UNSUPPORTED: lldb-api :: benchmarks/libcxxmap/TestBenchmarkLibcxxMap.py (915 of 1898)
PASS: lldb-api :: functionalities/tail_call_frames/sbapi_support/TestTailCallFrameSBAPI.py (916 of 1898)
PASS: lldb-unit :: Core/./LLDBCoreTests/RichManglingContextTest.SwitchProvider (917 of 1898)
PASS: lldb-api :: commands/watchpoints/multiple_threads/TestWatchpointMultipleThreads.py (918 of 1898)
PASS: lldb-unit :: Process/gdb-remote/./ProcessGdbRemoteTests/GDBRemoteCommunicationServerTest.SendErrorResponse_ErrorList (919 of 1898)
PASS: lldb-shell :: Reproducer/TestDiscard.test (920 of 1898)
UNSUPPORTED: lldb-shell :: ScriptInterpreter/Lua/nested_sessions.test (921 of 1898)
PASS: lldb-api :: functionalities/data-formatter/data-formatter-objc/TestDataFormatterObjCNSBundle.py (922 of 1898)
PASS: lldb-api :: functionalities/data-formatter/data-formatter-stl/libcxx/function/TestLibCxxFunction.py (923 of 1898)
PASS: lldb-unit :: Utility/./UtilityTests/StringListTest.InsertStringAtIndexOutOfBounds (924 of 1898)
PASS: lldb-api :: functionalities/data-formatter/data-formatter-stl/libcxx/bitset/TestDataFormatterLibcxxBitset.py (925 of 1898)
PASS: lldb-unit :: UnwindAssembly/x86/./UnwindAssemblyx86Tests/Testx86AssemblyInspectionEngine.TestPopRBX (926 of 1898)
PASS: lldb-shell :: SymbolFile/DWARF/find-basic-namespace.cpp (927 of 1898)
PASS: lldb-unit :: Symbol/./SymbolTests/TestClangASTImporter.RecordLayout (928 of 1898)
PASS: lldb-api :: python_api/lldbutil/TestSwigVersion.py (929 of 1898)
PASS: lldb-api :: functionalities/data-formatter/data-formatter-objc/TestDataFormatterObjCNSDate.py (930 of 1898)
PASS: lldb-shell :: SymbolFile/DWARF/inline-function-address-shared.test (931 of 1898)
PASS: lldb-api :: lang/cpp/member-and-local-vars-with-same-name/TestMembersAndLocalsWithSameName.py (932 of 1898)
PASS: lldb-shell :: Quit/TestQuitExitCodeNonInt.test (933 of 1898)
PASS: lldb-unit :: Process/gdb-remote/./ProcessGdbRemoteTests/GDBRemoteCommunicationClientTest.GetMemoryRegionInfoInvalidResponse (934 of 1898)
PASS: lldb-unit :: Utility/./UtilityTests/FileSpecTest.EqualDotsPosix (935 of 1898)
PASS: lldb-shell :: SymbolFile/DWARF/dwarf5-index-is-used.cpp (936 of 1898)
PASS: lldb-shell :: SymbolFile/NativePDB/bitfields.cpp (937 of 1898)
PASS: lldb-unit :: Utility/./UtilityTests/StreamTest.AddressRange (938 of 1898)
PASS: lldb-shell :: SymbolFile/DWARF/split-dwarf-multiple-cu.ll (939 of 1898)
PASS: lldb-unit :: Utility/./UtilityTests/OptionsWithRawTest.EmptySuffixSingleWhitespace (940 of 1898)
PASS: lldb-api :: functionalities/gdb_remote_client/TestJLink6Armv7RegisterDefinition.py (941 of 1898)
PASS: lldb-api :: functionalities/tail_call_frames/inlining_and_tail_calls/TestInliningAndTailCalls.py (942 of 1898)
UNSUPPORTED: lldb-api :: functionalities/longjmp/TestLongjmp.py (943 of 1898)
PASS: lldb-unit :: Utility/./UtilityTests/RecordReplayTest.InstrumentedBarRef (944 of 1898)
UNSUPPORTED: lldb-api :: functionalities/data-formatter/data-formatter-stl/libstdcpp/vbool/TestDataFormatterStdVBool.py (945 of 1898)
PASS: lldb-api :: commands/target/create-no-such-arch/TestNoSuchArch.py (946 of 1898)
PASS: lldb-unit :: Process/minidump/./LLDBMinidumpTests/MinidumpParserTest.GetMemoryRegionInfoFromMemoryList (947 of 1898)
PASS: lldb-api :: functionalities/data-formatter/synthupdate/TestSyntheticFilterRecompute.py (948 of 1898)
PASS: lldb-unit :: Language/Highlighting/./HighlighterTests/HighlighterTest.ClangComments (949 of 1898)
PASS: lldb-api :: lang/c/unions/TestUnionMembers.py (950 of 1898)
PASS: lldb-unit :: Expression/./ExpressionTests/CppModuleConfigurationTest.UnrelatedLibrary (951 of 1898)
PASS: lldb-unit :: Target/./TargetTests/ModuleCacheTest.GetAndPut (952 of 1898)
PASS: lldb-shell :: SymbolFile/NativePDB/ast-types.cpp (953 of 1898)
PASS: lldb-unit :: Language/CPlusPlus/./LanguageCPlusPlusTests/CPlusPlusLanguage.MethodNameParsing (954 of 1898)
PASS: lldb-unit :: UnwindAssembly/x86/./UnwindAssemblyx86Tests/Testx86AssemblyInspectionEngine.Test32bitFramelessSmallStackFrame (955 of 1898)
PASS: lldb-api :: tools/lldb-server/TestGdbRemoteAttach.py (956 of 1898)
UNSUPPORTED: lldb-shell :: ScriptInterpreter/Lua/convenience_variables.test (957 of 1898)
PASS: lldb-unit :: UnwindAssembly/x86/./UnwindAssemblyx86Tests/Testx86AssemblyInspectionEngine.TestDisassemblyMidFunctionEpilogues (958 of 1898)
PASS: lldb-api :: functionalities/breakpoint/breakpoint_language/TestBreakpointLanguage.py (959 of 1898)
PASS: lldb-api :: lang/objc/self/TestObjCSelf.py (960 of 1898)
UNSUPPORTED: lldb-api :: functionalities/tty/TestTerminal.py (961 of 1898)
PASS: lldb-api :: functionalities/recursion/TestValueObjectRecursion.py (962 of 1898)
PASS: lldb-unit :: Utility/./UtilityTests/ArgsTest.TestSingleArg (963 of 1898)
PASS: lldb-api :: functionalities/data-formatter/typedef_array/TestTypedefArray.py (964 of 1898)
PASS: lldb-api :: commands/command/source/TestCommandSource.py (965 of 1898)
PASS: lldb-shell :: Driver/TestCore.test (966 of 1898)
PASS: lldb-unit :: Utility/./UtilityTests/FileSpecTest.Match (967 of 1898)
PASS: lldb-unit :: Utility/./UtilityTests/StreamTest.ShiftOperatorChars (968 of 1898)
PASS: lldb-api :: commands/expression/import-std-module/list-basic/TestBasicList.py (969 of 1898)
UNSUPPORTED: lldb-shell :: SymbolFile/DWARF/debug-types-expressions.test (970 of 1898)
PASS: lldb-unit :: Process/gdb-remote/./ProcessGdbRemoteTests/GDBRemoteCommunicationClientTest.SendGetDataPacket (971 of 1898)
PASS: lldb-shell :: ObjectFile/ELF/PT_LOAD-empty.yaml (972 of 1898)
PASS: lldb-unit :: Utility/./UtilityTests/StringListTest.AppendStringStdString (973 of 1898)
PASS: lldb-api :: lang/c/shared_lib/TestSharedLib.py (974 of 1898)
PASS: lldb-unit :: Expression/./ExpressionTests/DiagnosticManagerTest.PutStringSeverities (975 of 1898)
PASS: lldb-unit :: Utility/./UtilityTests/StringExtractorTest.GetHexBytes_OddPair (976 of 1898)
PASS: lldb-unit :: Language/Highlighting/./HighlighterTests/HighlighterTest.ClangBraces (977 of 1898)
PASS: lldb-unit :: Utility/./UtilityTests/StringExtractorTest.GetNameColonValueNoSemicolon (978 of 1898)
PASS: lldb-unit :: Host/./HostTests/MainLoopTest.UnmonitoredSignal (979 of 1898)
PASS: lldb-unit :: Utility/./UtilityTests/StringExtractorTest.GetHexBytesAvail_FullString (980 of 1898)
PASS: lldb-unit :: Symbol/./SymbolTests/PostfixExpression.ParseFPOProgram (981 of 1898)
PASS: lldb-api :: commands/expression/static-initializers/TestStaticInitializers.py (982 of 1898)
PASS: lldb-unit :: Utility/./UtilityTests/StreamTest.AddressPrefix (983 of 1898)
UNSUPPORTED: lldb-shell :: Breakpoint/case-insensitive.test (984 of 1898)
PASS: lldb-unit :: UnwindAssembly/x86/./UnwindAssemblyx86Tests/Testx86AssemblyInspectionEngine.TestPopR12 (985 of 1898)
PASS: lldb-unit :: Process/gdb-remote/./ProcessGdbRemoteTests/GDBRemoteCommunicationClientTest.SyncThreadState (986 of 1898)
PASS: lldb-api :: commands/platform/basic/TestPlatformCommand.py (987 of 1898)
PASS: lldb-api :: functionalities/type_lookup/TestTypeLookup.py (988 of 1898)
UNSUPPORTED: lldb-api :: api/multiple-debuggers/TestMultipleDebuggers.py (989 of 1898)
PASS: lldb-unit :: ScriptInterpreter/Python/./ScriptInterpreterPythonTests/PythonDataObjectsTest.TestPythonTupleInitializerList (990 of 1898)
PASS: lldb-unit :: Utility/./UtilityTests/ArgsTest.ReplaceArgumentAtIndexFarOutOfRange (991 of 1898)
PASS: lldb-api :: functionalities/thread/step_until/TestStepUntil.py (992 of 1898)
PASS: lldb-api :: commands/expression/import-std-module/deque-dbg-info-content/TestDbgInfoContentDeque.py (993 of 1898)
PASS: lldb-unit :: Process/minidump/./LLDBMinidumpTests/MinidumpParserTest.GetThreadsAndGetThreadContext (994 of 1898)
PASS: lldb-api :: functionalities/data-formatter/data-formatter-globals/TestDataFormatterGlobals.py (995 of 1898)
PASS: lldb-api :: functionalities/signal/TestSendSignal.py (996 of 1898)
PASS: lldb-unit :: Utility/./UtilityTests/StringListTest.SetSize (997 of 1898)
PASS: lldb-api :: commands/command/history/TestCommandHistory.py (998 of 1898)
PASS: lldb-unit :: Utility/./UtilityTests/StringListTest.InsertStringAtIndexStart (999 of 1898)
PASS: lldb-api :: types/TestRecursiveTypes.py (1000 of 1898)
PASS: lldb-unit :: UnwindAssembly/x86/./UnwindAssemblyx86Tests/Testx86AssemblyInspectionEngine.TestPopEDI (1001 of 1898)
PASS: lldb-shell :: SymbolFile/NativePDB/ast-methods.cpp (1002 of 1898)
PASS: lldb-shell :: SymbolFile/DWARF/find-basic-variable.cpp (1003 of 1898)
PASS: lldb-unit :: ScriptInterpreter/Python/./ScriptInterpreterPythonTests/PythonDataObjectsTest.TestPythonByteArray (1004 of 1898)
PASS: lldb-api :: commands/source/info/TestSourceInfo.py (1005 of 1898)
PASS: lldb-shell :: SymbolFile/DWARF/forward-declarations.s (1006 of 1898)
PASS: lldb-api :: macosx/DBGSourcePathRemapping/TestDSYMSourcePathRemapping.py (1007 of 1898)
UNSUPPORTED: lldb-api :: lang/cpp/static_members/TestCPPStaticMembers.py (1008 of 1898)
PASS: lldb-unit :: Utility/./UtilityTests/ArgsTest.TestOverwriteArgs (1009 of 1898)
PASS: lldb-unit :: Host/./HostTests/MainLoopTest.TerminatesImmediately (1010 of 1898)
PASS: lldb-api :: lang/objc/ptr_refs/TestPtrRefsObjC.py (1011 of 1898)
UNSUPPORTED: lldb-api :: linux/mix-dwo-and-regular-objects/TestMixedDwarfBinary.py (1012 of 1898)
PASS: lldb-unit :: Utility/./UtilityTests/StringExtractorTest.GetHexBytes_Partial (1013 of 1898)
PASS: lldb-unit :: Utility/./UtilityTests/DataExtractorTest.GetCStr (1014 of 1898)
UNSUPPORTED: lldb-shell :: SymbolFile/PDB/ast-restore.test (1015 of 1898)
PASS: lldb-api :: functionalities/data-formatter/data-formatter-stl/libcxx/list/loop/TestDataFormatterLibcxxListLoop.py (1016 of 1898)
PASS: lldb-unit :: Language/Highlighting/./HighlighterTests/HighlighterTest.ClangOperators (1017 of 1898)
PASS: lldb-api :: commands/expression/import-std-module/sysroot/TestStdModuleSysroot.py (1018 of 1898)
PASS: lldb-api :: commands/watchpoints/watchpoint_commands/condition/TestWatchpointConditionCmd.py (1019 of 1898)
PASS: lldb-api :: functionalities/abbreviation/TestAbbreviations.py (1020 of 1898)
PASS: lldb-api :: commands/watchpoints/watchpoint_on_vectors/TestValueOfVectorVariable.py (1021 of 1898)
PASS: lldb-unit :: Host/./HostTests/MainLoopTest.Signal (1022 of 1898)
PASS: lldb-unit :: Language/Highlighting/./HighlighterTests/HighlighterTest.ClangStringLiterals (1023 of 1898)
PASS: lldb-api :: commands/expression/call-function/TestCallStopAndContinue.py (1024 of 1898)
PASS: lldb-unit :: ObjectFile/Breakpad/./ObjectFileBreakpadTests/StackCFIRecord.parse (1025 of 1898)
PASS: lldb-shell :: SymbolFile/DWARF/win-i386-line-table.s (1026 of 1898)
PASS: lldb-api :: commands/expression/radar_9531204/TestPrintfAfterUp.py (1027 of 1898)
PASS: lldb-api :: sample_test/TestSampleTest.py (1028 of 1898)
PASS: lldb-unit :: UnwindAssembly/x86/./UnwindAssemblyx86Tests/Testx86AssemblyInspectionEngine.TestSimplei386ugmented (1029 of 1898)
PASS: lldb-api :: macosx/version_zero/TestGetVersionZeroVersion.py (1030 of 1898)
PASS: lldb-unit :: Utility/./UtilityTests/ArgsTest.GetArgumentArrayRef (1031 of 1898)
PASS: lldb-api :: python_api/process/io/TestProcessIO.py (1032 of 1898)
PASS: lldb-unit :: Language/Highlighting/./HighlighterTests/HighlighterTest.ClangCursorOutOfBounds (1033 of 1898)
PASS: lldb-unit :: Process/minidump/./LLDBMinidumpTests/MinidumpParserTest.GetMemory (1034 of 1898)
PASS: lldb-shell :: SymbolFile/DWARF/split-dwarf-inlining.cpp (1035 of 1898)
PASS: lldb-unit :: Utility/./UtilityTests/StreamTeeTest.AppendStream (1036 of 1898)
PASS: lldb-unit :: Utility/./UtilityTests/ArgsTest.TestInsertArg (1037 of 1898)
PASS: lldb-unit :: SymbolFile/NativePDB/./SymbolFileNativePDBTests/PDBFPOProgramToDWARFExpressionTests.InvalidAssignmentSingle (1038 of 1898)
PASS: lldb-api :: lang/cpp/template-function/TestTemplateFunctions.py (1039 of 1898)
PASS: lldb-shell :: SymbolFile/DWARF/debug_loc-aslr.s (1040 of 1898)
PASS: lldb-api :: python_api/value/empty_class/TestValueAPIEmptyClass.py (1041 of 1898)
UNSUPPORTED: lldb-api :: lang/cpp/printf/TestPrintf.py (1042 of 1898)
PASS: lldb-api :: functionalities/rerun/TestRerun.py (1043 of 1898)
FAIL: lldb-api :: functionalities/data-formatter/data-formatter-objc/TestDataFormatterObjCNSError.py (1044 of 1898)
******************** TEST 'lldb-api :: functionalities/data-formatter/data-formatter-objc/TestDataFormatterObjCNSError.py' FAILED ********************
lldb version 11.0.99 (http://labmaster3.local/git/llvm-project.git revision c1b13a1b17719aebace1b3be7a6ac7f90b1901a6)
  clang revision afb22d7c33a246967d5f21d5ab3c83c148178564
  llvm revision afb22d7c33a246967d5f21d5ab3c83c148178564
LLDB library dir: /Users/buildslave/jenkins/workspace/lldb-cmake-sanitized/lldb-build/bin
LLDB import library dir: /Users/buildslave/jenkins/workspace/lldb-cmake-sanitized/lldb-build/bin
libstdcxx tests will not be run because: Don't know how to build with libstdcxx on macosx
Skipping following debug info categories: ['dwo']
setting set target.prefer-dynamic-value no-dynamic-values
AddressSanitizer report breakpoint hit. Use 'thread info -s' to get extended information about the report.
AddressSanitizer report breakpoint hit. Use 'thread info -s' to get extended information about the report.
AddressSanitizer report breakpoint hit. Use 'thread info -s' to get extended information about the report.

Hide Details

Session logs for test failures/errors/unexpected successes will go into directory '/Users/buildslave/jenkins/workspace/lldb-cmake-sanitized/test/logs' Command invoked: /Users/buildslave/jenkins/workspace/lldb-cmake-sanitized/llvm-project/lldb/test/API/dotest.py --arch x86_64 -s /Users/buildslave/jenkins/workspace/lldb-cmake-sanitized/lldb-build/lldb-test-traces -S nm -u CXXFLAGS -u CFLAGS --codesign-identity lldb_codesign --server /Users/buildslave/jenkins/workspace/lldb-cmake-sanitized/lldb-build/./bin/debugserver --arch x86_64 --build-dir /Users/buildslave/jenkins/workspace/lldb-cmake-sanitized/lldb-build/lldb-test-build.noindex -s=/Users/buildslave/jenkins/workspace/lldb-cmake-sanitized/test/logs -t --env TERM=vt100 --env LLVM_LIBS_DIR=/Users/buildslave/jenkins/workspace/lldb-cmake-sanitized/lldb-build/./lib --inferior-env ASAN_OPTIONS=detect_stack_use_after_return=1 --inferior-env DYLD_INSERT_LIBRARIES=/Users/buildslave/jenkins/workspace/lldb-cmake-sanitized/host-compiler/lib/clang/11.0.0/lib/darwin/libclang_rt.asan_osx_dynamic.dylib --build-dir /Users/buildslave/jenkins/workspace/lldb-cmake-sanitized/lldb-build/lldb-test-build.noindex --lldb-module-cache-dir /Users/buildslave/jenkins/workspace/lldb-cmake-sanitized/lldb-build/lldb-test-build.noindex/module-cache-lldb/lldb-api --clang-module-cache-dir /Users/buildslave/jenkins/workspace/lldb-cmake-sanitized/lldb-build/lldb-test-build.noindex/module-cache-clang/lldb-api --executable /Users/buildslave/jenkins/workspace/lldb-cmake-sanitized/lldb-build/./bin/lldb --compiler /Users/buildslave/jenkins/workspace/lldb-cmake-sanitized/lldb-build/./bin/clang --dsymutil /Users/buildslave/jenkins/workspace/lldb-cmake-sanitized/lldb-build/./bin/dsymutil --filecheck /Users/buildslave/jenkins/workspace/lldb-cmake-sanitized/lldb-build/./bin/FileCheck /Users/buildslave/jenkins/workspace/lldb-cmake-sanitized/llvm-project/lldb/packages/Python/lldbsuite/test/functionalities/data-formatter/data-formatter-objc -p TestDataFormatterObjCNSError.py Change dir to: /Users/buildslave/jenkins/workspace/lldb-cmake-sanitized/llvm-project/lldb/packages/Python/lldbsuite/test/functionalities/data-formatter/data-formatter-objc runCmd: settings set symbols.enable-external-lookup false output:

Hide Details

runCmd: settings set plugin.process.gdb-remote.packet-timeout 60 output:

Hide Details

runCmd: settings set symbols.clang-modules-cache-path "/Users/buildslave/jenkins/workspace/lldb-cmake-sanitized/lldb-build/lldb-test-build.noindex/module-cache-lldb/lldb-api" output:

Hide Details

runCmd: settings set use-color false output:

Hide Details

runCmd: settings set target.env-vars ASAN_OPTIONS=detect_stack_use_after_return=1 DYLD_INSERT_LIBRARIES=/Users/buildslave/jenkins/workspace/lldb-cmake-sanitized/host-compiler/lib/clang/11.0.0/lib/darwin/libclang_rt.asan_osx_dynamic.dylib output:

Hide Details

runCmd: settings set target.env-vars ASAN_OPTIONS=detect_stack_use_after_return=1 DYLD_INSERT_LIBRARIES=/Users/buildslave/jenkins/workspace/lldb-cmake-sanitized/host-compiler/lib/clang/11.0.0/lib/darwin/libclang_rt.asan_osx_dynamic.dylib output:

Hide Details

FAIL: LLDB (/Users/buildslave/jenkins/workspace/lldb-cmake-sanitized/lldb-build/bin/clang-10-x86_64) :: test_nserror_with_run_command_dsym (TestDataFormatterObjCNSError.ObjCDataFormatterNSError) <bound method SBProcess.Kill of <lldb.SBProcess; proxy of <Swig Object of type 'lldb::SBProcess *' at 0x11ec30210> >>: success

Hide Details

runCmd: settings set symbols.enable-external-lookup false output:

Hide Details

runCmd: settings set plugin.process.gdb-remote.packet-timeout 60 output:

Hide Details

runCmd: settings set symbols.clang-modules-cache-path "/Users/buildslave/jenkins/workspace/lldb-cmake-sanitized/lldb-build/lldb-test-build.noindex/module-cache-lldb/lldb-api" output:

Hide Details

runCmd: settings set use-color false output:

Hide Details

runCmd: settings set target.env-vars ASAN_OPTIONS=detect_stack_use_after_return=1 DYLD_INSERT_LIBRARIES=/Users/buildslave/jenkins/workspace/lldb-cmake-sanitized/host-compiler/lib/clang/11.0.0/lib/darwin/libclang_rt.asan_osx_dynamic.dylib output:

Hide Details

runCmd: settings set target.env-vars ASAN_OPTIONS=detect_stack_use_after_return=1 DYLD_INSERT_LIBRARIES=/Users/buildslave/jenkins/workspace/lldb-cmake-sanitized/host-compiler/lib/clang/11.0.0/lib/darwin/libclang_rt.asan_osx_dynamic.dylib output:

Hide Details

FAIL: LLDB (/Users/buildslave/jenkins/workspace/lldb-cmake-sanitized/lldb-build/bin/clang-10-x86_64) :: test_nserror_with_run_command_dwarf (TestDataFormatterObjCNSError.ObjCDataFormatterNSError) <bound method SBProcess.Kill of <lldb.SBProcess; proxy of <Swig Object of type 'lldb::SBProcess *' at 0x10857a630> >>: success

Hide Details

UNSUPPORTED: LLDB (/Users/buildslave/jenkins/workspace/lldb-cmake-sanitized/lldb-build/bin/clang-10-x86_64) :: test_nserror_with_run_command_dwo (TestDataFormatterObjCNSError.ObjCDataFormatterNSError) (test case does not fall in any category of interest for this run) runCmd: settings set symbols.enable-external-lookup false output:

Hide Details

runCmd: settings set plugin.process.gdb-remote.packet-timeout 60 output:

Hide Details

runCmd: settings set symbols.clang-modules-cache-path "/Users/buildslave/jenkins/workspace/lldb-cmake-sanitized/lldb-build/lldb-test-build.noindex/module-cache-lldb/lldb-api" output:

Hide Details

runCmd: settings set use-color false output:

Hide Details

runCmd: settings set target.env-vars ASAN_OPTIONS=detect_stack_use_after_return=1 DYLD_INSERT_LIBRARIES=/Users/buildslave/jenkins/workspace/lldb-cmake-sanitized/host-compiler/lib/clang/11.0.0/lib/darwin/libclang_rt.asan_osx_dynamic.dylib output:

Hide Details

runCmd: settings set target.env-vars ASAN_OPTIONS=detect_stack_use_after_return=1 DYLD_INSERT_LIBRARIES=/Users/buildslave/jenkins/workspace/lldb-cmake-sanitized/host-compiler/lib/clang/11.0.0/lib/darwin/libclang_rt.asan_osx_dynamic.dylib output:

Hide Details

FAIL: LLDB (/Users/buildslave/jenkins/workspace/lldb-cmake-sanitized/lldb-build/bin/clang-10-x86_64) :: test_nserror_with_run_command_gmodules (TestDataFormatterObjCNSError.ObjCDataFormatterNSError) <bound method SBProcess.Kill of <lldb.SBProcess; proxy of <Swig Object of type 'lldb::SBProcess *' at 0x11ec30540> >>: success

Hide Details

Restore dir to: /Users/buildslave/jenkins/workspace/lldb-cmake-sanitized/lldb-build/tools/lldb/test ====================================================================== FAIL: test_nserror_with_run_command_dsym (TestDataFormatterObjCNSError.ObjCDataFormatterNSError) Test formatters for NSError. ---------------------------------------------------------------------- Traceback (most recent call last): File "/Users/buildslave/jenkins/workspace/lldb-cmake-sanitized/llvm-project/lldb/packages/Python/lldbsuite/test/lldbtest.py", line 1732, in test_method return attrvalue(self) File "/Users/buildslave/jenkins/workspace/lldb-cmake-sanitized/llvm-project/lldb/packages/Python/lldbsuite/test/functionalities/data-formatter/data-formatter-objc/TestDataFormatterObjCNSError.py", line 20, in test_nserror_with_run_command self.appkit_tester_impl(self.nserror_data_formatter_commands) File "/Users/buildslave/jenkins/workspace/lldb-cmake-sanitized/llvm-project/lldb/packages/Python/lldbsuite/test/functionalities/data-formatter/data-formatter-objc/ObjCDataFormatterTestCase.py", line 19, in appkit_tester_impl self.appkit_common_data_formatters_command() File "/Users/buildslave/jenkins/workspace/lldb-cmake-sanitized/llvm-project/lldb/packages/Python/lldbsuite/test/functionalities/data-formatter/data-formatter-objc/ObjCDataFormatterTestCase.py", line 26, in appkit_common_data_formatters_command lldb.SBFileSpec('main.m', False)) File "/Users/buildslave/jenkins/workspace/lldb-cmake-sanitized/llvm-project/lldb/packages/Python/lldbsuite/test/lldbutil.py", line 868, in run_to_source_breakpoint only_one_thread, extra_images) File "/Users/buildslave/jenkins/workspace/lldb-cmake-sanitized/llvm-project/lldb/packages/Python/lldbsuite/test/lldbutil.py", line 797, in run_to_breakpoint_do_run test.assertEqual(num_threads, 1, "Expected 1 thread to stop at breakpoint, %d did."%(num_threads)) AssertionError: 0 != 1 : Expected 1 thread to stop at breakpoint, 0 did. Config=x86_64-/Users/buildslave/jenkins/workspace/lldb-cmake-sanitized/lldb-build/bin/clang-10 ====================================================================== FAIL: test_nserror_with_run_command_dwarf (TestDataFormatterObjCNSError.ObjCDataFormatterNSError) Test formatters for NSError. ---------------------------------------------------------------------- Traceback (most recent call last): File "/Users/buildslave/jenkins/workspace/lldb-cmake-sanitized/llvm-project/lldb/packages/Python/lldbsuite/test/lldbtest.py", line 1732, in test_method return attrvalue(self) File "/Users/buildslave/jenkins/workspace/lldb-cmake-sanitized/llvm-project/lldb/packages/Python/lldbsuite/test/functionalities/data-formatter/data-formatter-objc/TestDataFormatterObjCNSError.py", line 20, in test_nserror_with_run_command self.appkit_tester_impl(self.nserror_data_formatter_commands) File "/Users/buildslave/jenkins/workspace/lldb-cmake-sanitized/llvm-project/lldb/packages/Python/lldbsuite/test/functionalities/data-formatter/data-formatter-objc/ObjCDataFormatterTestCase.py", line 19, in appkit_tester_impl self.appkit_common_data_formatters_command() File "/Users/buildslave/jenkins/workspace/lldb-cmake-sanitized/llvm-project/lldb/packages/Python/lldbsuite/test/functionalities/data-formatter/data-formatter-objc/ObjCDataFormatterTestCase.py", line 26, in appkit_common_data_formatters_command lldb.SBFileSpec('main.m', False)) File "/Users/buildslave/jenkins/workspace/lldb-cmake-sanitized/llvm-project/lldb/packages/Python/lldbsuite/test/lldbutil.py", line 868, in run_to_source_breakpoint only_one_thread, extra_images) File "/Users/buildslave/jenkins/workspace/lldb-cmake-sanitized/llvm-project/lldb/packages/Python/lldbsuite/test/lldbutil.py", line 797, in run_to_breakpoint_do_run test.assertEqual(num_threads, 1, "Expected 1 thread to stop at breakpoint, %d did."%(num_threads)) AssertionError: 0 != 1 : Expected 1 thread to stop at breakpoint, 0 did. Config=x86_64-/Users/buildslave/jenkins/workspace/lldb-cmake-sanitized/lldb-build/bin/clang-10 ====================================================================== FAIL: test_nserror_with_run_command_gmodules (TestDataFormatterObjCNSError.ObjCDataFormatterNSError) Test formatters for NSError. ---------------------------------------------------------------------- Traceback (most recent call last): File "/Users/buildslave/jenkins/workspace/lldb-cmake-sanitized/llvm-project/lldb/packages/Python/lldbsuite/test/lldbtest.py", line 1732, in test_method return attrvalue(self) File "/Users/buildslave/jenkins/workspace/lldb-cmake-sanitized/llvm-project/lldb/packages/Python/lldbsuite/test/functionalities/data-formatter/data-formatter-objc/TestDataFormatterObjCNSError.py", line 20, in test_nserror_with_run_command self.appkit_tester_impl(self.nserror_data_formatter_commands) File "/Users/buildslave/jenkins/workspace/lldb-cmake-sanitized/llvm-project/lldb/packages/Python/lldbsuite/test/functionalities/data-formatter/data-formatter-objc/ObjCDataFormatterTestCase.py", line 19, in appkit_tester_impl self.appkit_common_data_formatters_command() File "/Users/buildslave/jenkins/workspace/lldb-cmake-sanitized/llvm-project/lldb/packages/Python/lldbsuite/test/functionalities/data-formatter/data-formatter-objc/ObjCDataFormatterTestCase.py", line 26, in appkit_common_data_formatters_command lldb.SBFileSpec('main.m', False)) File "/Users/buildslave/jenkins/workspace/lldb-cmake-sanitized/llvm-project/lldb/packages/Python/lldbsuite/test/lldbutil.py", line 868, in run_to_source_breakpoint only_one_thread, extra_images) File "/Users/buildslave/jenkins/workspace/lldb-cmake-sanitized/llvm-project/lldb/packages/Python/lldbsuite/test/lldbutil.py", line 797, in run_to_breakpoint_do_run test.assertEqual(num_threads, 1, "Expected 1 thread to stop at breakpoint, %d did."%(num_threads)) AssertionError: 0 != 1 : Expected 1 thread to stop at breakpoint, 0 did. Config=x86_64-/Users/buildslave/jenkins/workspace/lldb-cmake-sanitized/lldb-build/bin/clang-10 ---------------------------------------------------------------------- Ran 4 tests in 40.512s

Hide Details

RESULT: FAILED (0 passes, 3 failures, 0 errors, 1 skipped, 0 expected failures, 0 unexpected successes)

Hide Details

******************** PASS: lldb-api :: lang/objc/modules-cache/TestClangModulesCache.py (1045 of 1898) PASS: lldb-api :: functionalities/thread/backtrace_all/TestBacktraceAll.py (1046 of 1898) UNSUPPORTED: lldb-shell :: SymbolFile/PDB/pointers.test (1047 of 1898) PASS: lldb-unit :: Utility/./UtilityTests/LogChannelEnabledTest.LogGetLogThread (1048 of 1898) PASS: lldb-unit :: Host/./HostTests/TaskPoolTest.AddTask (1049 of 1898) PASS: lldb-api :: api/check_public_api_headers/TestPublicAPIHeaders.py (1050 of 1898) UNSUPPORTED: lldb-shell :: ScriptInterpreter/Lua/watchpoint_callback.test (1051 of 1898) UNSUPPORTED: lldb-api :: functionalities/darwin_log/filter/exact_match/message/TestDarwinLogFilterMatchMessage.py (1052 of 1898) PASS: lldb-unit :: Utility/./UtilityTests/VASprintfTest.EncodingError (1053 of 1898) PASS: lldb-api :: functionalities/breakpoint/serialize/TestBreakpointSerialization.py (1054 of 1898) UNSUPPORTED: lldb-api :: functionalities/darwin_log/filter/regex/category/TestDarwinLogFilterRegexCategory.py (1055 of 1898) UNSUPPORTED: lldb-shell :: SymbolFile/PDB/compilands.test (1056 of 1898) PASS: lldb-api :: commands/frame/diagnose/virtual-method-call/TestDiagnoseDereferenceVirtualMethodCall.py (1057 of 1898) PASS: lldb-unit :: Utility/./UtilityTests/RangeTest.ContainsRange (1058 of 1898) PASS: lldb-unit :: Symbol/./SymbolTests/SymbolsTest.TerminateLocateExecutableSymbolFileForUnknownExecutableAndUnknownSymbolFile (1059 of 1898) PASS: lldb-unit :: UnwindAssembly/x86/./UnwindAssemblyx86Tests/Testx86AssemblyInspectionEngine.TestSpArithx86_64Augmented (1060 of 1898) PASS: lldb-api :: functionalities/breakpoint/breakpoint_by_line_and_column/TestBreakpointByLineAndColumn.py (1061 of 1898) PASS: lldb-unit :: ScriptInterpreter/Python/./ScriptInterpreterPythonTests/PythonDataObjectsTest.TestPythonIntegerToStructuredInteger (1062 of 1898) PASS: lldb-api :: commands/expression/import-std-module/shared_ptr-dbg-info-content/TestSharedPtrDbgInfoContent.py (1063 of 1898) PASS: lldb-api :: macosx/find-dsym/bundle-with-dot-in-filename/TestBundleWithDotInFilename.py (1064 of 1898) PASS: lldb-api :: functionalities/data-formatter/data-formatter-skip-summary/TestDataFormatterSkipSummary.py (1065 of 1898) PASS: lldb-api :: functionalities/data-formatter/summary-string-onfail/Test-rdar-9974002.py (1066 of 1898) PASS: lldb-api :: functionalities/thread/concurrent_events/TestConcurrentSignalWatchBreak.py (1067 of 1898) PASS: lldb-api :: lang/c/struct_types/TestStructTypes.py (1068 of 1898) PASS: lldb-api :: functionalities/data-formatter/data-formatter-synthtype/TestDataFormatterSynthType.py (1069 of 1898) UNSUPPORTED: lldb-api :: functionalities/asan/TestMemoryHistory.py (1070 of 1898) PASS: lldb-unit :: ScriptInterpreter/Python/./ScriptInterpreterPythonTests/PythonDataObjectsTest.TestResetting (1071 of 1898) PASS: lldb-shell :: SymbolFile/DWARF/DW_AT_loclists_base.s (1072 of 1898) PASS: lldb-shell :: Reproducer/Functionalities/TestDataFormatter.test (1073 of 1898) PASS: lldb-shell :: SymbolFile/DWARF/find-method.cpp (1074 of 1898) PASS: lldb-unit :: ScriptInterpreter/Python/./ScriptInterpreterPythonTests/PythonDataObjectsTest.TestTypeNameResolutionNoDot (1075 of 1898) PASS: lldb-api :: api/multiple-targets/TestMultipleTargets.py (1076 of 1898) PASS: lldb-unit :: Symbol/./SymbolTests/TestClangASTImporter.CopyDeclTagDecl (1077 of 1898) PASS: lldb-unit :: Process/gdb-remote/./ProcessGdbRemoteTests/GDBRemoteClientBaseTest.SendContinueAndLateInterrupt (1078 of 1898) PASS: lldb-unit :: Utility/./UtilityTests/BroadcasterTest.BroadcastEvent (1079 of 1898) PASS: lldb-api :: functionalities/data-formatter/data-formatter-stl/libcxx/map/TestDataFormatterLibccMap.py (1080 of 1898) PASS: lldb-api :: functionalities/data-formatter/data-formatter-stl/libcxx/iterator/TestDataFormatterLibccIterator.py (1081 of 1898) PASS: lldb-unit :: Utility/./UtilityTests/StreamTest.QuotedCString (1082 of 1898) PASS: lldb-unit :: Utility/./UtilityTests/Flags.Test (1083 of 1898) PASS: lldb-shell :: Minidump/Windows/broken-unwind.test (1084 of 1898) PASS: lldb-api :: commands/expression/completion/TestExprCompletion.py (1085 of 1898) PASS: lldb-unit :: Utility/./UtilityTests/StringListTest.AppendStringMove (1086 of 1898) PASS: lldb-unit :: Utility/./UtilityTests/Flags.AllClear (1087 of 1898) PASS: lldb-api :: functionalities/target_var/TestTargetVar.py (1088 of 1898) UNSUPPORTED: lldb-shell :: ObjectFile/ELF/minidebuginfo-no-lzma.yaml (1089 of 1898) PASS: lldb-shell :: ObjectFile/PECOFF/symbol.yaml (1090 of 1898) PASS: lldb-unit :: Utility/./UtilityTests/AnsiTerminal.Empty (1091 of 1898) PASS: lldb-unit :: Utility/./UtilityTests/GeneratorTest.GetOrCreate (1092 of 1898) PASS: lldb-shell :: SymbolFile/DWARF/debug_loc.s (1093 of 1898) PASS: lldb-api :: functionalities/param_entry_vals/basic_entry_values_x86_64/TestBasicEntryValuesX86_64.py (1094 of 1898) PASS: lldb-api :: lang/objc/objc-checker/TestObjCCheckers.py (1095 of 1898) UNSUPPORTED: lldb-api :: iohandler/completion/TestIOHandlerCompletion.py (1096 of 1898) PASS: lldb-api :: lang/objc/objc-runtime-ivars/TestRuntimeIvars.py (1097 of 1898) PASS: lldb-unit :: SymbolFile/DWARF/./SymbolFileDWARFTests/SymbolFileDWARFTests.TestAbbrevOrder1Start5 (1098 of 1898) PASS: lldb-unit :: Host/./HostTests/ConnectionFileDescriptorTest.TCPGetURIv6 (1099 of 1898) PASS: lldb-api :: commands/expression/test/TestExprs.py (1100 of 1898) PASS: lldb-shell :: SymbolFile/DWARF/debug_line-relative_path.s (1101 of 1898) PASS: lldb-api :: functionalities/plugins/python_os_plugin/TestPythonOSPlugin.py (1102 of 1898) UNSUPPORTED: lldb-api :: arm/breakpoint-thumb-codesection/TestBreakpointThumbCodesection.py (1103 of 1898) PASS: lldb-unit :: Utility/./UtilityTests/StringExtractorTest.GetHexU8_InvalidHex_NoEof (1104 of 1898) PASS: lldb-unit :: Utility/./UtilityTests/StringExtractorTest.GetHexU8_Extra_NoEof (1105 of 1898) PASS: lldb-shell :: Quit/TestQuitExitCode0.test (1106 of 1898) PASS: lldb-unit :: Language/CPlusPlus/./LanguageCPlusPlusTests/CPlusPlusLanguage.ExtractContextAndIdentifier (1107 of 1898) PASS: lldb-api :: functionalities/thread/crash_during_step/TestCrashDuringStep.py (1108 of 1898) PASS: lldb-unit :: Utility/./UtilityTests/LogChannelEnabledTest.LogVerboseThread (1109 of 1898) PASS: lldb-unit :: Process/minidump/./LLDBMinidumpTests/MinidumpParserTest.GetMiscInfo_no_stream (1110 of 1898) PASS: lldb-unit :: Utility/./UtilityTests/VMRange.Reset (1111 of 1898) PASS: lldb-api :: functionalities/object-file/TestImageListMultiArchitecture.py (1112 of 1898) PASS: lldb-api :: python_api/exprpath_synthetic/TestExprPathSynthetic.py (1113 of 1898) PASS: lldb-api :: python_api/hello_world/TestHelloWorld.py (1114 of 1898) PASS: lldb-api :: commands/watchpoints/hello_watchpoint/TestMyFirstWatchpoint.py (1115 of 1898) PASS: lldb-shell :: BuildScript/script-args.test (1116 of 1898) PASS: lldb-api :: functionalities/breakpoint/cpp/TestCPPBreakpointLocations.py (1117 of 1898) PASS: lldb-unit :: ScriptInterpreter/Python/./ScriptInterpreterPythonTests/PythonDataObjectsTest.TestPythonTupleInitializerList2 (1118 of 1898) PASS: lldb-unit :: Utility/./UtilityTests/StreamTeeTest.Assignment (1119 of 1898) UNSUPPORTED: lldb-api :: iohandler/unicode/TestUnicode.py (1120 of 1898) PASS: lldb-api :: tools/lldb-vscode/stackTrace/TestVSCode_stackTrace.py (1121 of 1898) PASS: lldb-shell :: SymbolFile/NativePDB/function-types-classes.cpp (1122 of 1898) PASS: lldb-shell :: SymbolFile/DWARF/debug-line-basic.s (1123 of 1898) PASS: lldb-unit :: Utility/./UtilityTests/ArchSpecTest.MergeFrom (1124 of 1898) PASS: lldb-unit :: Utility/./UtilityTests/StringExtractorTest.GetHexBytesAvail_Underflow (1125 of 1898) PASS: lldb-shell :: SymbolFile/DWARF/debug-types-missing-signature.test (1126 of 1898) PASS: lldb-unit :: Utility/./UtilityTests/EnvironmentTest.EnvpConversion (1127 of 1898) PASS: lldb-api :: functionalities/breakpoint/debugbreak/TestDebugBreak.py (1128 of 1898) PASS: lldb-api :: functionalities/thread/exit_during_break/TestExitDuringBreak.py (1129 of 1898) PASS: lldb-unit :: Utility/./UtilityTests/FileSpecTest.Equal (1130 of 1898) PASS: lldb-api :: lang/objc/objc-struct-argument/TestObjCStructArgument.py (1131 of 1898) PASS: lldb-api :: functionalities/data-formatter/nssetsynth/TestNSSetSynthetic.py (1132 of 1898) PASS: lldb-unit :: tools/lldb-server/tests/./LLDBServerTests/TestBase.DebugserverEnv (1133 of 1898) PASS: lldb-shell :: SymbolFile/DWARF/find-qualified-variable.cpp (1134 of 1898) PASS: lldb-unit :: Utility/./UtilityTests/FileSpecTest.IsRelative (1135 of 1898) PASS: lldb-api :: lang/cpp/dynamic-value/TestDynamicValue.py (1136 of 1898) PASS: lldb-shell :: SymbolFile/NativePDB/ast-functions.cpp (1137 of 1898) PASS: lldb-api :: lang/cpp/global_operators/TestCppGlobalOperators.py (1138 of 1898) PASS: lldb-shell :: Reproducer/TestVersionCheck.test (1139 of 1898) PASS: lldb-unit :: Breakpoint/./LLDBBreakpointTests/BreakpointIDTest.StringIsBreakpointName (1140 of 1898) PASS: lldb-api :: functionalities/unwind/noreturn/module-end/TestNoReturnModuleEnd.py (1141 of 1898) UNSUPPORTED: lldb-shell :: Register/x86-ymm-read.test (1142 of 1898) PASS: lldb-unit :: Process/minidump/./LLDBMinidumpTests/MinidumpParserTest.GetMemoryRegionInfo (1143 of 1898) PASS: lldb-unit :: Language/Highlighting/./HighlighterTests/HighlighterTest.ClangCursorPosAfterOtherToken (1144 of 1898) PASS: lldb-api :: commands/expression/unicode-in-variable/TestUnicodeInVariable.py (1145 of 1898) UNSUPPORTED: lldb-api :: functionalities/breakpoint/hardware_breakpoints/hardware_breakpoint_on_multiple_threads/TestHWBreakMultiThread.py (1146 of 1898) PASS: lldb-api :: commands/expression/import-std-module/empty-module/TestEmptyStdModule.py (1147 of 1898) PASS: lldb-unit :: Utility/./UtilityTests/StreamTest.PutCStringWithStringRef (1148 of 1898) PASS: lldb-shell :: SymbolFile/DWARF/debug_loclists-dwo.s (1149 of 1898) PASS: lldb-api :: lang/c/shared_lib_stripped_symbols/TestSharedLibStrippedSymbols.py (1150 of 1898) UNSUPPORTED: lldb-shell :: ExecControl/StopHook/stop-hook-threads.test (1151 of 1898) PASS: lldb-api :: lang/c/bitfields/TestBitfields.py (1152 of 1898) PASS: lldb-unit :: UnwindAssembly/x86/./UnwindAssemblyx86Tests/Testx86AssemblyInspectionEngine.TestSpillRegToStackViaMOVi386 (1153 of 1898) PASS: lldb-unit :: Utility/./UtilityTests/RegularExpression.Match (1154 of 1898) PASS: lldb-unit :: Process/gdb-remote/./ProcessGdbRemoteTests/GDBRemoteCommunicationTest.ReadPacket_checksum (1155 of 1898) PASS: lldb-unit :: Utility/./UtilityTests/ArchSpecTest.TestParseMachCPUDashSubtypeTripleSimple (1156 of 1898) PASS: lldb-api :: tools/lldb-server/TestGdbRemote_qThreadStopInfo.py (1157 of 1898) PASS: lldb-api :: functionalities/breakpoint/breakpoint_locations/TestBreakpointLocations.py (1158 of 1898) PASS: lldb-unit :: tools/lldb-server/tests/./LLDBServerTests/StandardStartupTest.TestStopReplyContainsThreadPcs (1159 of 1898) PASS: lldb-unit :: Utility/./UtilityTests/StringListTest.RemoveBlankLines (1160 of 1898) UNSUPPORTED: lldb-api :: linux/sepdebugsymlink/TestTargetSymbolsSepDebugSymlink.py (1161 of 1898) PASS: lldb-api :: commands/expression/expr-in-syscall/TestExpressionInSyscall.py (1162 of 1898) PASS: lldb-api :: functionalities/gdb_remote_client/TestStopPCs.py (1163 of 1898) PASS: lldb-api :: functionalities/data-formatter/type_summary_list_script/TestTypeSummaryListScript.py (1164 of 1898) PASS: lldb-unit :: Language/Highlighting/./HighlighterTests/HighlighterTest.ClangTrailingBackslashBeforeNewline (1165 of 1898) UNSUPPORTED: lldb-shell :: SymbolFile/PDB/expressions.test (1166 of 1898) UNSUPPORTED: lldb-api :: python_api/disassemble-raw-data/TestDisassemble_VST1_64.py (1167 of 1898) PASS: lldb-api :: functionalities/show_location/TestShowLocationDwarf5.py (1168 of 1898) PASS: lldb-unit :: Expression/./ExpressionTests/ClangHostTest.ComputeClangResourceDirectory (1169 of 1898) PASS: lldb-api :: functionalities/data-formatter/data-formatter-smart-array/TestDataFormatterSmartArray.py (1170 of 1898) PASS: lldb-api :: functionalities/data-formatter/data-formatter-stl/libcxx/queue/TestDataFormatterLibcxxQueue.py (1171 of 1898) PASS: lldb-unit :: SymbolFile/NativePDB/./SymbolFileNativePDBTests/PDBFPOProgramToDWARFExpressionTests.UnsupportedRASearch (1172 of 1898) PASS: lldb-api :: functionalities/data-formatter/data-formatter-objc/TestDataFormatterObjCCF.py (1173 of 1898) PASS: lldb-api :: python_api/lldbutil/iter/TestRegistersIterator.py (1174 of 1898) PASS: lldb-api :: python_api/objc_type/TestObjCType.py (1175 of 1898) PASS: lldb-shell :: ObjectFile/ELF/section-addresses.yaml (1176 of 1898) PASS: lldb-api :: lang/cpp/enum_types/TestCPP11EnumTypes.py (1177 of 1898) PASS: lldb-unit :: ScriptInterpreter/Python/./ScriptInterpreterPythonTests/PythonDataObjectsTest.TestCallable (1178 of 1898) PASS: lldb-api :: commands/expression/unwind_expression/TestUnwindExpression.py (1179 of 1898) PASS: lldb-api :: lang/c/const_variables/TestConstVariables.py (1180 of 1898) PASS: lldb-api :: commands/expression/import-std-module/stack/TestStack.py (1181 of 1898) PASS: lldb-api :: functionalities/data-formatter/data-formatter-stl/libstdcpp/unique_ptr/invalid/TestDataFormatterInvalidStdUniquePtr.py (1182 of 1898) PASS: lldb-api :: tools/lldb-vscode/breakpoint/TestVSCode_setFunctionBreakpoints.py (1183 of 1898) PASS: lldb-unit :: Expression/./ExpressionTests/DiagnosticManagerTest.GetStringMultiline (1184 of 1898) PASS: lldb-unit :: UnwindAssembly/x86/./UnwindAssemblyx86Tests/Testx86AssemblyInspectionEngine.TestSimple32bitFrameFunction (1185 of 1898) PASS: lldb-api :: lang/objc/objc-new-syntax/TestObjCNewSyntaxDictionary.py (1186 of 1898) PASS: lldb-api :: lang/cpp/offsetof/TestOffsetofCpp.py (1187 of 1898) PASS: lldb-unit :: debugserver/./debugserverTests/JSON.Parse (1188 of 1898) PASS: lldb-unit :: Utility/./UtilityTests/UriParserTest.Empty (1189 of 1898) PASS: lldb-unit :: Utility/./UtilityTests/StreamTest.PutBytesAsRawHex8ToMixedEndian (1190 of 1898) PASS: lldb-unit :: Utility/./UtilityTests/StringListTest.ShiftStdString (1191 of 1898) PASS: lldb-api :: commands/expression/dollar-in-variable/TestDollarInVariable.py (1192 of 1898) PASS: lldb-unit :: Symbol/./SymbolTests/TestClangASTContext.TestGetBasicTypeFromName (1193 of 1898) PASS: lldb-unit :: SymbolFile/NativePDB/./SymbolFileNativePDBTests/PDBFPOProgramToDWARFExpressionTests.UnresolvedRegisterReference (1194 of 1898) PASS: lldb-unit :: ScriptInterpreter/Python/./ScriptInterpreterPythonTests/PythonDataObjectsTest.TestScript (1195 of 1898) PASS: lldb-unit :: Symbol/./SymbolTests/TestClangASTContext.TestGetBasicTypeFromEnum (1196 of 1898) PASS: lldb-api :: functionalities/lazy-loading/TestLazyLoading.py (1197 of 1898) PASS: lldb-api :: commands/expression/weak_symbols/TestWeakSymbols.py (1198 of 1898) PASS: lldb-unit :: Language/Highlighting/./HighlighterTests/HighlighterTest.ClangEmptyInput (1199 of 1898) PASS: lldb-shell :: Reproducer/TestCaptureEnvOverride.test (1200 of 1898) PASS: lldb-shell :: Register/x86-64-gp-read.test (1201 of 1898) UNSUPPORTED: lldb-api :: macosx/macabi/TestMacABImacOSFramework.py (1202 of 1898) PASS: lldb-unit :: Utility/./UtilityTests/BinaryStreamTest.PutULEB128TwoBytes (1203 of 1898) UNSUPPORTED: lldb-api :: functionalities/data-formatter/data-formatter-stl/libstdcpp/string/TestDataFormatterStdString.py (1204 of 1898) PASS: lldb-shell :: Quit/TestQuitExitCode30.test (1205 of 1898) PASS: lldb-unit :: Host/./HostTests/FileActionTest.Open (1206 of 1898) PASS: lldb-api :: functionalities/data-formatter/data-formatter-stl/libcxx/vector/TestDataFormatterLibcxxVector.py (1207 of 1898) PASS: lldb-unit :: ObjectFile/Breakpad/./ObjectFileBreakpadTests/FileRecord.parse (1208 of 1898) PASS: lldb-api :: lang/objc/modules/TestObjCModules.py (1209 of 1898) PASS: lldb-unit :: SymbolFile/NativePDB/./SymbolFileNativePDBTests/PDBFPOProgramToDWARFExpressionTests.MultipleIndependentAssignments (1210 of 1898) PASS: lldb-unit :: Host/./HostTests/FileSystemTest.FileAndDirectoryComponents (1211 of 1898) PASS: lldb-unit :: Symbol/./SymbolTests/Type.CompilerContextPattern (1212 of 1898) PASS: lldb-unit :: Host/./HostTests/FileSystemTest.GetPermissions (1213 of 1898) PASS: lldb-unit :: Utility/./UtilityTests/ArgsTest.StringListConstructor (1214 of 1898) PASS: lldb-unit :: Host/./HostTests/FileSystemTest.EnumerateDirectory (1215 of 1898) PASS: lldb-unit :: Utility/./UtilityTests/StreamTest.AddressRangeEmptyRange (1216 of 1898) PASS: lldb-unit :: Process/minidump/./LLDBMinidumpTests/MinidumpParserTest.GetMemoryRegionInfoFromMemory64List (1217 of 1898) PASS: lldb-unit :: Utility/./UtilityTests/ReproducerTest.SetReplay (1218 of 1898) PASS: lldb-api :: tools/lldb-server/TestGdbRemote_vCont.py (1219 of 1898) PASS: lldb-unit :: Utility/./UtilityTests/OptionsWithRawTest.WhitespaceSuffix (1220 of 1898) PASS: lldb-shell :: ObjectFile/MachO/lc_build_version.yaml (1221 of 1898) PASS: lldb-shell :: Watchpoint/SetErrorCases.test (1222 of 1898) PASS: lldb-unit :: SymbolFile/NativePDB/./SymbolFileNativePDBTests/PDBFPOProgramToDWARFExpressionTests.UnresolvedCyclicRegisterAssignmentReference (1223 of 1898) PASS: lldb-unit :: ScriptInterpreter/Python/./ScriptInterpreterPythonTests/PythonDataObjectsTest.TestPythonTupleToStructuredList (1224 of 1898) PASS: lldb-unit :: UnwindAssembly/x86/./UnwindAssemblyx86Tests/Testx86AssemblyInspectionEngine.TestSubRSP (1225 of 1898) PASS: lldb-api :: functionalities/signal/raise/TestRaise.py (1226 of 1898) UNSUPPORTED: lldb-api :: tools/lldb-server/platform-process-connect/TestPlatformProcessConnect.py (1227 of 1898) PASS: lldb-api :: functionalities/data-formatter/data-formatter-objc/nsindexpath/TestDataFormatterNSIndexPath.py (1228 of 1898) PASS: lldb-api :: functionalities/thread/jump/TestThreadJump.py (1229 of 1898) PASS: lldb-api :: lang/cpp/rvalue-references/TestRvalueReferences.py (1230 of 1898) PASS: lldb-unit :: Utility/./UtilityTests/StringListTest.SplitIntoLinesSingleTrailingCR (1231 of 1898) UNSUPPORTED: lldb-shell :: SymbolFile/PDB/variables-locations.test (1232 of 1898) PASS: lldb-unit :: Signals/./SignalsTests/UnixSignalsTest.VersionChange (1233 of 1898) PASS: lldb-unit :: Utility/./UtilityTests/StreamTest.PutMaxHex64ByteOrderBig (1234 of 1898) UNSUPPORTED: lldb-shell :: Register/x86-64-xmm16-write.test (1235 of 1898) PASS: lldb-unit :: Process/gdb-remote/./ProcessGdbRemoteTests/GDBRemoteCommunicationClientTest.SendStopTracePacket (1236 of 1898) PASS: lldb-api :: functionalities/gdb_remote_client/TestNoGPacketSupported.py (1237 of 1898) PASS: lldb-unit :: Utility/./UtilityTests/ArchSpecTest.TestParseMachCPUDashSubtypeTripleExtra (1238 of 1898) PASS: lldb-unit :: Utility/./UtilityTests/DataExtractorTest.GetCStrUnterminated (1239 of 1898) PASS: lldb-api :: lang/c/stepping/TestThreadStepping.py (1240 of 1898) PASS: lldb-unit :: ScriptInterpreter/Python/./ScriptInterpreterPythonTests/PythonDataObjectsTest.TestRun (1241 of 1898) PASS: lldb-unit :: Utility/./UtilityTests/ProcessInstanceInfo.DumpTable (1242 of 1898) PASS: lldb-api :: lang/cpp/function_refs/TestFunctionRefs.py (1243 of 1898) PASS: lldb-unit :: Utility/./UtilityTests/StringListTest.LongestCommonPrefix (1244 of 1898) PASS: lldb-shell :: Settings/TestFrameFormatMangling.test (1245 of 1898) PASS: lldb-shell :: Minidump/memory-region-from-module.yaml (1246 of 1898) PASS: lldb-api :: functionalities/breakpoint/dummy_target_breakpoints/TestBreakpointsWithNoTargets.py (1247 of 1898) PASS: lldb-api :: commands/frame/diagnose/dereference-argument/TestDiagnoseDereferenceArgument.py (1248 of 1898) UNSUPPORTED: lldb-shell :: SymbolFile/PDB/function-nested-block.test (1249 of 1898) PASS: lldb-api :: commands/expression/char/TestExprsChar.py (1250 of 1898) PASS: lldb-api :: functionalities/breakpoint/breakpoint_ignore_count/TestBreakpointIgnoreCount.py (1251 of 1898) PASS: lldb-unit :: Utility/./UtilityTests/StreamTest.PutRawBytesToBigEndian (1252 of 1898) PASS: lldb-unit :: Utility/./UtilityTests/StateTest.Formatv (1253 of 1898) PASS: lldb-api :: types/TestFloatTypes.py (1254 of 1898) PASS: lldb-api :: lang/cpp/symbols/TestSymbols.py (1255 of 1898) PASS: lldb-api :: functionalities/data-formatter/data-formatter-stl/libcxx/multiset/TestDataFormatterLibcxxMultiSet.py (1256 of 1898) PASS: lldb-shell :: ObjectFile/PECOFF/export-dllfunc.yaml (1257 of 1898) UNSUPPORTED: lldb-api :: commands/watchpoints/multi_watchpoint_slots/TestWatchpointMultipleSlots.py (1258 of 1898) PASS: lldb-unit :: ScriptInterpreter/Python/./ScriptInterpreterPythonTests/PythonDataObjectsTest.TestPythonTupleValues (1259 of 1898) PASS: lldb-api :: lang/objc/objc-property/TestObjCProperty.py (1260 of 1898) PASS: lldb-api :: macosx/load-kext/TestLoadKext.py (1261 of 1898) PASS: lldb-unit :: Utility/./UtilityTests/UriParserTest.LongPath (1262 of 1898) PASS: lldb-api :: python_api/frame/TestFrames.py (1263 of 1898) PASS: lldb-api :: lang/c/array_types/TestArrayTypes.py (1264 of 1898) PASS: lldb-api :: lang/cpp/llvm-style/TestLLVMStyle.py (1265 of 1898) PASS: lldb-api :: python_api/type/TestTypeList.py (1266 of 1898) PASS: lldb-shell :: ObjectFile/ELF/minidebuginfo-find-symbols.yaml (1267 of 1898) PASS: lldb-shell :: SymbolFile/DWARF/anon_class_w_and_wo_export_symbols.ll (1268 of 1898) PASS: lldb-api :: python_api/sbstructureddata/TestStructuredDataAPI.py (1269 of 1898) PASS: lldb-unit :: Symbol/./SymbolTests/LineEntryTest.GetSameLineContiguousAddressRangeNoInlines (1270 of 1898) UNSUPPORTED: lldb-api :: commands/expression/completion-crash1/TestCompletionCrash1.py (1271 of 1898) PASS: lldb-shell :: ObjectFile/Breakpad/discontiguous-sections.test (1272 of 1898) PASS: lldb-unit :: debugserver/./debugserverTests/RNBSocket.LoopBackListenIPv6 (1273 of 1898) PASS: lldb-api :: lang/objc/foundation/TestObjCMethodsNSArray.py (1274 of 1898) PASS: lldb-unit :: Process/gdb-remote/./ProcessGdbRemoteTests/GDBRemoteClientBaseTest.SendContinueAndAsyncSignal (1275 of 1898) PASS: lldb-api :: commands/register/register/register_command/TestRegisters.py (1276 of 1898) PASS: lldb-shell :: Driver/TestConvenienceVariables.test (1277 of 1898) PASS: lldb-api :: functionalities/data-formatter/data-formatter-stl/libcxx/unordered/TestDataFormatterUnordered.py (1278 of 1898) PASS: lldb-api :: functionalities/data-formatter/array_typedef/TestArrayTypedef.py (1279 of 1898) PASS: lldb-unit :: Symbol/./SymbolTests/Type.GetTypeScopeAndBasename (1280 of 1898) PASS: lldb-api :: lang/objc/blocks/TestObjCIvarsInBlocks.py (1281 of 1898) PASS: lldb-api :: terminal/TestSTTYBeforeAndAfter.py (1282 of 1898) PASS: lldb-api :: lang/objc/single-entry-dictionary/TestObjCSingleEntryDictionary.py (1283 of 1898) PASS: lldb-api :: commands/expression/rdar42038760/TestScalarURem.py (1284 of 1898) PASS: lldb-api :: functionalities/data-formatter/data-formatter-named-summaries/TestDataFormatterNamedSummaries.py (1285 of 1898) UNSUPPORTED: lldb-shell :: SymbolFile/PDB/class-layout.test (1286 of 1898) UNSUPPORTED: lldb-shell :: Register/x86-64-gp-write.test (1287 of 1898) PASS: lldb-api :: commands/expression/test/TestExprs2.py (1288 of 1898) UNSUPPORTED: lldb-api :: commands/watchpoints/variable_out_of_scope/TestWatchedVarHitWhenInScope.py (1289 of 1898) PASS: lldb-api :: functionalities/non-overlapping-index-variable-i/TestIndexVariable.py (1290 of 1898) PASS: lldb-shell :: Driver/TestProcessAttach.test (1291 of 1898) UNSUPPORTED: lldb-api :: functionalities/darwin_log/basic/TestDarwinLogBasic.py (1292 of 1898) PASS: lldb-api :: functionalities/data-formatter/data-formatter-python-synth/TestDataFormatterPythonSynth.py (1293 of 1898) PASS: lldb-api :: python_api/watchpoint/condition/TestWatchpointConditionAPI.py (1294 of 1898) PASS: lldb-shell :: Commands/command-regex-delete.test (1295 of 1898) PASS: lldb-shell :: Expr/TestIRMemoryMap.test (1296 of 1898) PASS: lldb-unit :: Utility/./UtilityTests/StringListTest.AppendList (1297 of 1898) PASS: lldb-unit :: Utility/./UtilityTests/BinaryStreamTest.PutULEB128Zero (1298 of 1898) PASS: lldb-unit :: Utility/./UtilityTests/StringExtractorTest.DecodeHexU8_InvalidHex2 (1299 of 1898) PASS: lldb-unit :: Utility/./UtilityTests/BinaryStreamTest.PutSLEB128MaxValue (1300 of 1898) PASS: lldb-unit :: Utility/./UtilityTests/UriParserTest.BadPort2 (1301 of 1898) PASS: lldb-api :: python_api/watchpoint/TestSetWatchpoint.py (1302 of 1898) PASS: lldb-unit :: Process/gdb-remote/./ProcessGdbRemoteTests/GDBRemoteCommunicationClientTest.TestPacketSpeedJSON (1303 of 1898) PASS: lldb-unit :: Expression/./ExpressionTests/CppModuleConfigurationTest.AmbiguousCLib (1304 of 1898) PASS: lldb-shell :: SymbolFile/NativePDB/break-by-function.cpp (1305 of 1898) PASS: lldb-unit :: Utility/./UtilityTests/BinaryStreamTest.PutULEB128ThreeBytes (1306 of 1898) PASS: lldb-unit :: Process/minidump/./LLDBMinidumpTests/RegisterContextMinidump.CheckRegisterContextMinidump_ARM (1307 of 1898) UNSUPPORTED: lldb-api :: commands/expression/multiline-completion/TestMultilineCompletion.py (1308 of 1898) PASS: lldb-unit :: Utility/./UtilityTests/StreamTest.PutHex32ByteOrderLittle (1309 of 1898) PASS: lldb-api :: lang/objc/forward-decl/TestForwardDecl.py (1310 of 1898) PASS: lldb-unit :: Utility/./UtilityTests/UriParserTest.BracketedHostnameWithColon (1311 of 1898) PASS: lldb-shell :: ObjectFile/wasm/stripped-debug-sections.yaml (1312 of 1898) PASS: lldb-api :: python_api/value/linked_list/TestValueAPILinkedList.py (1313 of 1898) PASS: lldb-unit :: Symbol/./SymbolTests/TestClangASTImporter.CopyTypeTagDecl (1314 of 1898) PASS: lldb-unit :: Process/minidump/./LLDBMinidumpTests/MinidumpParserTest.GetLinuxProcStatus (1315 of 1898) PASS: lldb-api :: lang/objc/conflicting-definition/TestConflictingDefinition.py (1316 of 1898) PASS: lldb-unit :: Target/./TargetTests/PathMappingListTest.RelativeTests (1317 of 1898) UNSUPPORTED: lldb-shell :: SymbolFile/PDB/enums-layout.test (1318 of 1898) PASS: lldb-unit :: UnwindAssembly/x86/./UnwindAssemblyx86Tests/Testx86AssemblyInspectionEngine.TestDisassemblyJunkBytes (1319 of 1898) PASS: lldb-api :: commands/expression/options/TestExprOptions.py (1320 of 1898) PASS: lldb-unit :: Utility/./UtilityTests/NameMatchesTest.Equals (1321 of 1898) PASS: lldb-unit :: Utility/./UtilityTests/StringExtractorTest.GetU64BigEndian (1322 of 1898) PASS: lldb-api :: tools/lldb-server/TestGdbRemoteSingleStep.py (1323 of 1898) PASS: lldb-unit :: Utility/./UtilityTests/StringListTest.ShiftCString (1324 of 1898) PASS: lldb-unit :: Expression/./ExpressionTests/CppModuleConfigurationTest.LinuxLocalLibCpp (1325 of 1898) UNSUPPORTED: lldb-api :: functionalities/darwin_log/filter/exact_match/subsystem/TestDarwinLogFilterMatchSubsystem.py (1326 of 1898) PASS: lldb-api :: tools/lldb-server/TestGdbRemoteProcessInfo.py (1327 of 1898) PASS: lldb-unit :: Utility/./UtilityTests/LogTest.Register (1328 of 1898) PASS: lldb-shell :: ObjectFile/ELF/base-address.yaml (1329 of 1898) PASS: lldb-shell :: ObjectFile/Breakpad/uuid-matching-mac.test (1330 of 1898) PASS: lldb-api :: lang/objc/foundation/TestObjCMethodsNSError.py (1331 of 1898) PASS: lldb-unit :: Utility/./UtilityTests/OptionsWithRawTest.UnterminatedQuote (1332 of 1898) PASS: lldb-shell :: Quit/TestQuitExitCodeHexA.test (1333 of 1898) PASS: lldb-api :: functionalities/postmortem/elf-core/thread_crash/TestLinuxCoreThreads.py (1334 of 1898) PASS: lldb-api :: macosx/lc-note/kern-ver-str/TestKernVerStrLCNOTE.py (1335 of 1898) PASS: lldb-unit :: Utility/./UtilityTests/ScalarTest.RightShiftOperator (1336 of 1898) PASS: lldb-unit :: ScriptInterpreter/Python/./ScriptInterpreterPythonTests/PythonDataObjectsTest.TestPythonListManipulation (1337 of 1898) PASS: lldb-api :: lang/cpp/unicode-literals/TestUnicodeLiterals.py (1338 of 1898) PASS: lldb-unit :: ScriptInterpreter/Python/./ScriptInterpreterPythonTests/PythonDataObjectsTest.TestBorrowedReferences (1339 of 1898) PASS: lldb-shell :: ObjectFile/ELF/PT_LOAD-overlap-PT_TLS.yaml (1340 of 1898) PASS: lldb-shell :: Reproducer/TestCrash.test (1341 of 1898) PASS: lldb-api :: commands/frame/var-scope/TestFrameVariableScope.py (1342 of 1898) PASS: lldb-shell :: Breakpoint/split-dwarf-5-addrbase.test (1343 of 1898) UNSUPPORTED: lldb-api :: functionalities/exec/TestExec.py (1344 of 1898) PASS: lldb-api :: commands/expression/import-std-module/conflicts/TestStdModuleWithConflicts.py (1345 of 1898) PASS: lldb-shell :: SymbolFile/Breakpad/symtab-macho.test (1346 of 1898) PASS: lldb-unit :: SymbolFile/NativePDB/./SymbolFileNativePDBTests/PDBFPOProgramToDWARFExpressionTests.UnresolvedDependentCyclicRegisterAssignmentReference (1347 of 1898) PASS: lldb-api :: lang/objc/unicode-string/TestUnicodeString.py (1348 of 1898) PASS: lldb-api :: commands/disassemble/basic/TestFrameDisassemble.py (1349 of 1898) PASS: lldb-shell :: SymbolFile/NativePDB/s_constant.cpp (1350 of 1898) PASS: lldb-unit :: Utility/./UtilityTests/ArgsTest.EscapeLLDBCommandArgument (1351 of 1898) PASS: lldb-api :: commands/quit/TestQuit.py (1352 of 1898) PASS: lldb-unit :: Utility/./UtilityTests/ArchSpecTest.MergeFromMachOUnknown (1353 of 1898) PASS: lldb-api :: commands/expression/import-std-module/vector-basic/TestBasicVector.py (1354 of 1898) PASS: lldb-unit :: Utility/./UtilityTests/BinaryStreamTest.PutSLEB128One (1355 of 1898) PASS: lldb-shell :: BuildScript/compiler-full-path.test (1356 of 1898) UNSUPPORTED: lldb-api :: lang/objc/rdar-12408181/TestRdar12408181.py (1357 of 1898) PASS: lldb-api :: commands/platform/process/TestProcessList.py (1358 of 1898) PASS: lldb-unit :: Host/./HostTests/Host.GetEnvironment (1359 of 1898) PASS: lldb-api :: lang/cpp/wchar_t/TestCxxWCharT.py (1360 of 1898) PASS: lldb-shell :: Breakpoint/debug_rnglist_basic.test (1361 of 1898) PASS: lldb-unit :: Process/minidump/./LLDBMinidumpTests/MinidumpParserTest.GetPidWow64 (1362 of 1898) PASS: lldb-api :: lang/objc/objc-new-syntax/TestObjCNewSyntaxArray.py (1363 of 1898) PASS: lldb-unit :: Symbol/./SymbolTests/TestClangASTContext.TestUnifyAccessSpecifiers (1364 of 1898) PASS: lldb-api :: lang/c/vla/TestVLA.py (1365 of 1898) UNSUPPORTED: lldb-api :: lang/objc/objc-dynamic-value/TestObjCDynamicValue.py (1366 of 1898) PASS: lldb-unit :: UnwindAssembly/x86/./UnwindAssemblyx86Tests/Testx86AssemblyInspectionEngine.TestPopEBX (1367 of 1898) PASS: lldb-unit :: Core/./LLDBCoreTests/MangledTest.ResultForValidName (1368 of 1898) PASS: lldb-unit :: Utility/./UtilityTests/StringExtractorTest.GetNameColonValueNoColon (1369 of 1898) PASS: lldb-unit :: Utility/./UtilityTests/StringLexerTest.Peek (1370 of 1898) PASS: lldb-unit :: Utility/./UtilityTests/StringExtractorTest.GetNameColonValueSuccess (1371 of 1898) PASS: lldb-unit :: Utility/./UtilityTests/UriParserTest.SchemeHostSeparator2 (1372 of 1898) PASS: lldb-unit :: Utility/./UtilityTests/StreamTest.PutStringAsRawHex8 (1373 of 1898) PASS: lldb-shell :: SymbolFile/DWARF/debug_loc_and_loclists.s (1374 of 1898) PASS: lldb-unit :: Utility/./UtilityTests/StringLexerTest.NextIfList (1375 of 1898) PASS: lldb-api :: lang/objc/objc-static-method-stripped/TestObjCStaticMethodStripped.py (1376 of 1898) PASS: lldb-api :: commands/command/invalid-args/TestInvalidArgsCommand.py (1377 of 1898) PASS: lldb-unit :: Utility/./UtilityTests/SubsystemRAIITest.SubsystemWithErrorSuccess (1378 of 1898) PASS: lldb-unit :: Utility/./UtilityTests/UriParserTest.PortOverflow (1379 of 1898) PASS: lldb-api :: python_api/watchpoint/watchlocation/TestTargetWatchAddress.py (1380 of 1898) UNSUPPORTED: lldb-shell :: SymbolFile/target-symbols-add-unwind.test (1381 of 1898) PASS: lldb-shell :: SymbolFile/NativePDB/function-types-calling-conv.cpp (1382 of 1898) PASS: lldb-unit :: Utility/./UtilityTests/BinaryStreamTest.PutULEB128FourBytes (1383 of 1898) PASS: lldb-unit :: Host/./HostTests/SocketTest.TCPGetConnectURI (1384 of 1898) PASS: lldb-unit :: Utility/./UtilityTests/LogTest.LLDB_LOG_nullptr (1385 of 1898) PASS: lldb-unit :: Process/minidump/./LLDBMinidumpTests/MinidumpParserTest.FindMemoryRange (1386 of 1898) PASS: lldb-api :: tools/lldb-server/TestGdbRemoteThreadsInStopReply.py (1387 of 1898) PASS: lldb-shell :: SymbolFile/DWARF/gnu-style-compression.cpp (1388 of 1898) PASS: lldb-unit :: Utility/./UtilityTests/RangeTest.LessThan (1389 of 1898) PASS: lldb-api :: functionalities/inferior-crashing/recursive-inferior/TestRecursiveInferiorStep.py (1390 of 1898) PASS: lldb-unit :: Utility/./UtilityTests/StreamTeeTest.CopyConstructor (1391 of 1898) PASS: lldb-shell :: SymbolFile/DWARF/clang-ast-from-dwarf-objc-property.m (1392 of 1898) PASS: lldb-unit :: Interpreter/./InterpreterTests/OptionArgParserTest.toChar (1393 of 1898) PASS: lldb-unit :: Utility/./UtilityTests/Flags.Clear (1394 of 1898) PASS: lldb-api :: functionalities/postmortem/wow64_minidump/TestWow64MiniDump.py (1395 of 1898) PASS: lldb-unit :: SymbolFile/DWARF/./SymbolFileDWARFTests/SymbolFileDWARFTests.TestAbbrevMissingTerminator (1396 of 1898) UNSUPPORTED: lldb-api :: commands/register/register/intel_xtended_registers/mpx_offset_intersection/TestMPXOffsetIntersection.py (1397 of 1898) PASS: lldb-api :: functionalities/memory/cache/TestMemoryCache.py (1398 of 1898) UNSUPPORTED: lldb-shell :: SymbolFile/PDB/func-symbols.test (1399 of 1898) PASS: lldb-api :: commands/expression/import-std-module/unique_ptr/TestUniquePtr.py (1400 of 1898) PASS: lldb-unit :: Utility/./UtilityTests/NameMatchesTest.RegularExpression (1401 of 1898) XFAIL: lldb-shell :: Register/x86-64-ymm-write.test (1402 of 1898) PASS: lldb-unit :: Utility/./UtilityTests/UUIDTest.Validity (1403 of 1898) PASS: lldb-unit :: Utility/./UtilityTests/RegisterValueTest.GetSet8 (1404 of 1898) PASS: lldb-api :: lang/cpp/class_static/TestStaticVariables.py (1405 of 1898) PASS: lldb-api :: commands/expression/anonymous-struct/TestCallUserAnonTypedef.py (1406 of 1898) PASS: lldb-unit :: Symbol/./SymbolTests/TestClangASTContext.TestGetTypeClassDeclType (1407 of 1898) PASS: lldb-unit :: ScriptInterpreter/Python/./ScriptInterpreterPythonTests/PythonDataObjectsTest.TestPythonDictionaryValueEquality (1408 of 1898) PASS: lldb-shell :: Register/x86-64-ymm-read.test (1409 of 1898) PASS: lldb-unit :: Utility/./UtilityTests/CompletionRequest.TryCompleteCurrentArgGood (1410 of 1898) PASS: lldb-shell :: BuildScript/modes.test (1411 of 1898) PASS: lldb-api :: lang/objc/objc-static-method/TestObjCStaticMethod.py (1412 of 1898) PASS: lldb-api :: functionalities/breakpoint/require_hw_breakpoints/TestRequireHWBreakpoints.py (1413 of 1898) PASS: lldb-unit :: Utility/./UtilityTests/ArgsTest.AppendArguments (1414 of 1898) PASS: lldb-unit :: Utility/./UtilityTests/ArgsTest.DoubleQuotedItem (1415 of 1898) PASS: lldb-api :: commands/expression/dont_allow_jit/TestAllowJIT.py (1416 of 1898) PASS: lldb-api :: commands/expression/timeout/TestCallWithTimeout.py (1417 of 1898) PASS: lldb-unit :: Process/gdb-remote/./ProcessGdbRemoteTests/GDBRemoteClientBaseTest.SendContinueDelegateStructuredDataReceipt (1418 of 1898) PASS: lldb-unit :: Utility/./UtilityTests/StreamTest.ShiftOperatorPtr (1419 of 1898) UNSUPPORTED: lldb-api :: functionalities/data-formatter/data-formatter-stl/libstdcpp/unique_ptr/TestDataFormatterStdUniquePtr.py (1420 of 1898) PASS: lldb-unit :: Utility/./UtilityTests/StreamTest.AddressNoSuffix (1421 of 1898) PASS: lldb-unit :: Utility/./UtilityTests/OptionsWithRawTest.SingleWordSuffix (1422 of 1898) PASS: lldb-api :: functionalities/data-formatter/data-formatter-stl/libcxx/tuple/TestDataFormatterLibcxxTuple.py (1423 of 1898) PASS: lldb-api :: commands/process/attach/TestProcessAttach.py (1424 of 1898) PASS: lldb-shell :: ObjectFile/MachO/symtab.yaml (1425 of 1898) PASS: lldb-unit :: Utility/./UtilityTests/BinaryStreamTest.PutSLEB128OneByte (1426 of 1898) PASS: lldb-api :: functionalities/data-formatter/ptr_ref_typedef/TestPtrRef2Typedef.py (1427 of 1898) UNSUPPORTED: lldb-api :: functionalities/signal/handle-segv/TestHandleSegv.py (1428 of 1898) PASS: lldb-unit :: Utility/./UtilityTests/OptionsWithRawTest.QuotedSuffix (1429 of 1898) PASS: lldb-api :: functionalities/data-formatter/data-formatter-disabling/TestDataFormatterDisabling.py (1430 of 1898) PASS: lldb-api :: functionalities/ptr_refs/TestPtrRefs.py (1431 of 1898) PASS: lldb-unit :: Utility/./UtilityTests/SerializationRountripTest.SerializeDeserializePodReferences (1432 of 1898) PASS: lldb-unit :: Expression/./ExpressionTests/CppModuleConfigurationTest.MissingLibCpp (1433 of 1898) PASS: lldb-shell :: Driver/TestSingleQuote.test (1434 of 1898) PASS: lldb-api :: lang/cpp/unsigned_types/TestUnsignedTypes.py (1435 of 1898) PASS: lldb-unit :: Utility/./UtilityTests/FileSpecTest.RemoveLastPathComponent (1436 of 1898) UNSUPPORTED: lldb-api :: functionalities/tsan/multiple/TestTsanMultiple.py (1437 of 1898) PASS: lldb-shell :: ObjectFile/PECOFF/basic-info.yaml (1438 of 1898) PASS: lldb-api :: functionalities/breakpoint/address_breakpoints/TestAddressBreakpoints.py (1439 of 1898) PASS: lldb-unit :: Process/gdb-remote/./ProcessGdbRemoteTests/GDBRemoteCommunicationClientTest.GetModulesInfo_UUID20 (1440 of 1898) PASS: lldb-shell :: Heap/heap-cstr.test (1441 of 1898) PASS: lldb-api :: macosx/indirect_symbol/TestIndirectSymbols.py (1442 of 1898) PASS: lldb-unit :: UnwindAssembly/x86/./UnwindAssemblyx86Tests/Testx86AssemblyInspectionEngine.TestPushEDX (1443 of 1898) PASS: lldb-api :: functionalities/data-formatter/data-formatter-stl/libcxx/set/TestDataFormatterLibcxxSet.py (1444 of 1898) PASS: lldb-api :: commands/expression/no-deadlock/TestExprDoesntBlock.py (1445 of 1898) PASS: lldb-api :: functionalities/step-avoids-no-debug/TestStepNoDebug.py (1446 of 1898) UNSUPPORTED: lldb-shell :: SymbolFile/NativePDB/ast-functions-msvc.cpp (1447 of 1898) PASS: lldb-api :: lang/cpp/chained-calls/TestCppChainedCalls.py (1448 of 1898) PASS: lldb-unit :: Host/./HostTests/FileSystemTest.Exists (1449 of 1898) PASS: lldb-unit :: UnwindAssembly/x86/./UnwindAssemblyx86Tests/Testx86AssemblyInspectionEngine.Testi386IgnoredRegisters (1450 of 1898) PASS: lldb-unit :: SymbolFile/NativePDB/./SymbolFileNativePDBTests/PDBFPOProgramToDWARFExpressionTests.UnknownOp (1451 of 1898) PASS: lldb-unit :: Utility/./UtilityTests/CompletionRequest.FakeLastArg (1452 of 1898) PASS: lldb-unit :: Language/Highlighting/./HighlighterTests/HighlighterTest.DefaultHighlighterWithCursorOutOfBounds (1453 of 1898) PASS: lldb-unit :: Interpreter/./InterpreterTests/OptionArgParserTest.toBoolean (1454 of 1898) PASS: lldb-shell :: SymbolFile/NativePDB/function-types-builtins.cpp (1455 of 1898) PASS: lldb-unit :: UnwindAssembly/x86/./UnwindAssemblyx86Tests/Testx86AssemblyInspectionEngine.TestReturnDetect (1456 of 1898) UNSUPPORTED: lldb-shell :: Breakpoint/ppc64-localentry.test (1457 of 1898) PASS: lldb-api :: lang/objc/modules-update/TestClangModulesUpdate.py (1458 of 1898) PASS: lldb-unit :: Utility/./UtilityTests/BinaryStreamTest.PutULEB128FiveBytes (1459 of 1898) PASS: lldb-unit :: UnwindAssembly/x86/./UnwindAssemblyx86Tests/Testx86AssemblyInspectionEngine.TestLEAVE (1460 of 1898) PASS: lldb-unit :: ObjectFile/ELF/./ObjectFileELFTests/ObjectFileELFTest.GetSymtab_NoSymEntryPointArmAddressClass (1461 of 1898) PASS: lldb-api :: functionalities/data-formatter/data-formatter-stl/libcxx/forward_list/TestDataFormatterLibcxxForwardList.py (1462 of 1898) PASS: lldb-unit :: Utility/./UtilityTests/OptionsWithRawTest.MultiWordSuffix (1463 of 1898) PASS: lldb-api :: commands/log/invalid-args/TestInvalidArgsLog.py (1464 of 1898) PASS: lldb-api :: commands/frame/var/TestFrameVar.py (1465 of 1898) PASS: lldb-unit :: SymbolFile/DWARF/./SymbolFileDWARFTests/SymbolFileDWARFTests.TestAbbrevOutOfOrder (1466 of 1898) PASS: lldb-api :: functionalities/data-formatter/ostypeformatting/TestFormattersOsType.py (1467 of 1898) PASS: lldb-api :: lang/c/stepping/TestStepAndBreakpoints.py (1468 of 1898) PASS: lldb-unit :: Utility/./UtilityTests/StreamTest.PutCString (1469 of 1898) PASS: lldb-api :: lang/cpp/inlines/TestInlines.py (1470 of 1898) PASS: lldb-api :: python_api/function_symbol/TestDisasmAPI.py (1471 of 1898) UNSUPPORTED: lldb-api :: functionalities/data-formatter/data-formatter-stl/libstdcpp/smart_ptr/TestDataFormatterStdSmartPtr.py (1472 of 1898) UNSUPPORTED: lldb-api :: functionalities/darwin_log/filter/regex/message/TestDarwinLogFilterRegexMessage.py (1473 of 1898) PASS: lldb-shell :: Breakpoint/debug_rnglistx_rlex.test (1474 of 1898) PASS: lldb-shell :: SymbolFile/DWARF/parallel-indexing-stress.s (1475 of 1898) PASS: lldb-unit :: Utility/./UtilityTests/StringLexerTest.PutBack (1476 of 1898) PASS: lldb-api :: types/TestLongTypes.py (1477 of 1898) PASS: lldb-unit :: Language/Highlighting/./HighlighterTests/HighlighterTest.ClangSquareBrackets (1478 of 1898) PASS: lldb-api :: commands/expression/call-overridden-method/TestCallOverriddenMethod.py (1479 of 1898) PASS: lldb-api :: commands/expression/call-function/TestCallBuiltinFunction.py (1480 of 1898) PASS: lldb-unit :: SymbolFile/DWARF/./SymbolFileDWARFTests/SymbolFileDWARFTests.TestAbilitiesForDWARF (1481 of 1898) PASS: lldb-shell :: ObjectFile/PECOFF/section-types.yaml (1482 of 1898) PASS: lldb-api :: functionalities/thread/concurrent_events/TestConcurrentTwoBreakpointThreads.py (1483 of 1898) PASS: lldb-api :: tools/lldb-server/commandline/TestStubSetSID.py (1484 of 1898) PASS: lldb-unit :: Utility/./UtilityTests/RangeTest.ContainsRangeStartingFromZero (1485 of 1898) PASS: lldb-api :: commands/expression/scoped_enums/TestScopedEnumType.py (1486 of 1898) PASS: lldb-unit :: Utility/./UtilityTests/UriParserTest.TypicalPortPath (1487 of 1898) PASS: lldb-unit :: Utility/./UtilityTests/ConstStringTest.NullAndEmptyStates (1488 of 1898) PASS: lldb-api :: commands/statistics/basic/TestStats.py (1489 of 1898) PASS: lldb-api :: lang/cpp/call-function/TestCallCPPFunction.py (1490 of 1898) PASS: lldb-unit :: Process/minidump/./LLDBMinidumpTests/RegisterContextMinidump.ConvertMinidumpContext_x86_64 (1491 of 1898) PASS: lldb-api :: lang/cpp/template/TestTemplateArgs.py (1492 of 1898) PASS: lldb-api :: lang/objc/objc-class-method/TestObjCClassMethod.py (1493 of 1898) PASS: lldb-api :: functionalities/thread/thread_exit/TestThreadExit.py (1494 of 1898) PASS: lldb-unit :: Utility/./UtilityTests/ArgsTest.TestQuotedUnknownEscape (1495 of 1898) PASS: lldb-api :: functionalities/breakpoint/breakpoint_options/TestBreakpointOptions.py (1496 of 1898) PASS: lldb-unit :: Utility/./UtilityTests/StringListTest.Assignment (1497 of 1898) PASS: lldb-api :: python_api/interpreter/TestCommandInterpreterAPI.py (1498 of 1898) PASS: lldb-shell :: Reproducer/TestRelativePath.test (1499 of 1898) PASS: lldb-api :: python_api/lldbutil/process/TestPrintStackTraces.py (1500 of 1898) PASS: lldb-shell :: Reproducer/TestReuseDirectory.test (1501 of 1898) PASS: lldb-unit :: Utility/./UtilityTests/OptionsWithRawTest.EmptySuffix (1502 of 1898) PASS: lldb-unit :: Expression/./ExpressionTests/CppModuleConfigurationTest.Sysroot (1503 of 1898) PASS: lldb-unit :: Utility/./UtilityTests/ArgsTest.ReplaceArgumentAtIndexOutOfRange (1504 of 1898) PASS: lldb-shell :: Minidump/disassemble-no-module.yaml (1505 of 1898) PASS: lldb-api :: functionalities/thread/step_out/TestThreadStepOut.py (1506 of 1898) PASS: lldb-unit :: DataFormatter/./LLDBFormatterTests/FormatManagerTests.CompatibleLangs (1507 of 1898) PASS: lldb-unit :: Utility/./UtilityTests/StreamTeeTest.Write (1508 of 1898) PASS: lldb-api :: commands/expression/regression-access-function-template-in-record/TestRegressionAccessFunctionTemplateInRecord.py (1509 of 1898) PASS: lldb-api :: commands/watchpoints/watchpoint_commands/command/TestWatchpointCommandLLDB.py (1510 of 1898) PASS: lldb-unit :: Utility/./UtilityTests/StringListTest.LongestCommonPrefixEmpty (1511 of 1898) PASS: lldb-shell :: SymbolFile/DWARF/dir-separator-no-comp-dir-relative-name.s (1512 of 1898) PASS: lldb-api :: commands/expression/import-std-module/vector-dbg-info-content/TestDbgInfoContentVector.py (1513 of 1898) PASS: lldb-unit :: Utility/./UtilityTests/StreamTeeTest.SetStreamAtIndexOutOfBounds (1514 of 1898) UNSUPPORTED: lldb-api :: tools/lldb-server/thread-name/TestGdbRemoteThreadName.py (1515 of 1898) PASS: lldb-api :: lang/objcxx/class-name-clash/TestNameClash.py (1516 of 1898) PASS: lldb-shell :: Breakpoint/single-file-split-dwarf.test (1517 of 1898) PASS: lldb-shell :: Breakpoint/debug_rnglist_rlestartend.test (1518 of 1898) PASS: lldb-api :: functionalities/thread/concurrent_events/TestConcurrentWatchpointWithDelayWatchpointThreads.py (1519 of 1898) UNSUPPORTED: lldb-api :: functionalities/thread/break_after_join/TestBreakAfterJoin.py (1520 of 1898) PASS: lldb-api :: functionalities/postmortem/minidump-new/TestMiniDumpUUID.py (1521 of 1898) PASS: lldb-api :: functionalities/thread/concurrent_events/TestConcurrentNWatchNBreak.py (1522 of 1898) PASS: lldb-shell :: Reproducer/TestMultipleTargets.test (1523 of 1898) PASS: lldb-unit :: Core/./LLDBCoreTests/MangledTest.ResultForBlockInvocation (1524 of 1898) UNSUPPORTED: lldb-shell :: ScriptInterpreter/Lua/command_script_import.test (1525 of 1898) PASS: lldb-unit :: Interpreter/./InterpreterTests/CompletionTest.DirCompletionAbsolute (1526 of 1898) PASS: lldb-api :: functionalities/set-data/TestSetData.py (1527 of 1898) PASS: lldb-api :: functionalities/thread/concurrent_events/TestConcurrentSignalDelayWatch.py (1528 of 1898) PASS: lldb-unit :: Expression/./ExpressionTests/CppModuleConfigurationTest.Xcode (1529 of 1898) PASS: lldb-unit :: ObjectFile/PECOFF/./ObjectFilePECOFFTests/PECallFrameInfoTest.Frame_reg_eh (1530 of 1898) PASS: lldb-unit :: Symbol/./SymbolTests/DWARFCallFrameInfoTest.Basic_eh (1531 of 1898) UNSUPPORTED: lldb-shell :: SymbolFile/PDB/typedefs.test (1532 of 1898) PASS: lldb-unit :: Utility/./UtilityTests/Flags.AnyClear (1533 of 1898) PASS: lldb-shell :: Expr/TestMultilineExpr.test (1534 of 1898) PASS: lldb-api :: python_api/value_var_update/TestValueVarUpdate.py (1535 of 1898) PASS: lldb-shell :: ObjectFile/ELF/basic-info.yaml (1536 of 1898) PASS: lldb-api :: functionalities/load_unload/TestLoadUnload.py (1537 of 1898) PASS: lldb-unit :: Utility/./UtilityTests/ProcessInfoTest.Constructor (1538 of 1898) PASS: lldb-api :: sanity/TestModuleCacheSanity.py (1539 of 1898) PASS: lldb-unit :: Utility/./UtilityTests/StringListTest.CopyList (1540 of 1898) PASS: lldb-api :: lang/cpp/auto/TestCPPAuto.py (1541 of 1898) PASS: lldb-unit :: Utility/./UtilityTests/StreamTest.PutRawBytesToLittleEndian (1542 of 1898) PASS: lldb-api :: commands/expression/call-throws/TestCallThatThrows.py (1543 of 1898) PASS: lldb-shell :: Commands/command-script-import.test (1544 of 1898) PASS: lldb-api :: functionalities/breakpoint/scripted_bkpt/TestScriptedResolver.py (1545 of 1898) PASS: lldb-shell :: Settings/TestSettingsWrite.test (1546 of 1898) PASS: lldb-api :: lang/cpp/exceptions/TestCPPExceptionBreakpoints.py (1547 of 1898) PASS: lldb-api :: functionalities/data-formatter/setvaluefromcstring/TestSetValueFromCString.py (1548 of 1898) PASS: lldb-unit :: Host/./HostTests/NativeProcessProtocolTest.ReadMemoryWithoutTrap (1549 of 1898) PASS: lldb-unit :: Utility/./UtilityTests/OptionsWithRawTest.EmptyInput (1550 of 1898) PASS: lldb-unit :: Utility/./UtilityTests/StringExtractorTest.DecodeHexU8_Underflow2 (1551 of 1898) PASS: lldb-api :: sample_test/TestSampleInlineTest.py (1552 of 1898) PASS: lldb-unit :: Language/Highlighting/./HighlighterTests/HighlighterTest.ClangCursorPosEndOfLine (1553 of 1898) PASS: lldb-api :: functionalities/breakpoint/breakpoint_set_restart/TestBreakpointSetRestart.py (1554 of 1898) PASS: lldb-api :: functionalities/breakpoint/inlined_breakpoints/TestInlinedBreakpoints.py (1555 of 1898) PASS: lldb-api :: functionalities/data-formatter/type_summary_list_arg/TestTypeSummaryListArg.py (1556 of 1898) PASS: lldb-unit :: Utility/./UtilityTests/LogChannelTest.Enable (1557 of 1898) PASS: lldb-api :: functionalities/data-formatter/data-formatter-synthval/TestDataFormatterSynthVal.py (1558 of 1898) PASS: lldb-api :: tools/lldb-server/inferior-crash/TestGdbRemoteSegFault.py (1559 of 1898) PASS: lldb-shell :: ScriptInterpreter/Python/scripted_breakpoint.test (1560 of 1898) PASS: lldb-unit :: UnwindAssembly/x86/./UnwindAssemblyx86Tests/Testx86AssemblyInspectionEngine.TestCALLNextInsn (1561 of 1898) PASS: lldb-api :: functionalities/data-formatter/nsarraysynth/TestNSArraySynthetic.py (1562 of 1898) PASS: lldb-unit :: UnwindAssembly/x86/./UnwindAssemblyx86Tests/Testx86AssemblyInspectionEngine.TestStackRealignMSVC_i386 (1563 of 1898) PASS: lldb-shell :: SymbolFile/DWARF/find-basic-function.cpp (1564 of 1898) PASS: lldb-unit :: Host/./HostTests/FileSystemTest.OpenErrno (1565 of 1898) UNSUPPORTED: lldb-api :: functionalities/ubsan/basic/TestUbsanBasic.py (1566 of 1898) PASS: lldb-shell :: Settings/TestDisassemblyFormat.test (1567 of 1898) PASS: lldb-unit :: Utility/./UtilityTests/DataExtractorTest.GetMaxU64_unchecked (1568 of 1898) PASS: lldb-api :: commands/expression/calculator_mode/TestCalculatorMode.py (1569 of 1898) PASS: lldb-unit :: Utility/./UtilityTests/OptionsWithRawTest.EmptyArgsOnlySuffix (1570 of 1898) PASS: lldb-api :: functionalities/data-formatter/data-formatter-objc/nsstring/TestDataFormatterNSString.py (1571 of 1898) PASS: lldb-unit :: Host/./HostTests/SocketTest.TCPListen0GetPort (1572 of 1898) PASS: lldb-shell :: ObjectFile/ELF/netbsd-core-amd64.test (1573 of 1898) PASS: lldb-unit :: ScriptInterpreter/Python/./ScriptInterpreterPythonTests/PythonDataObjectsTest.TestPythonTupleSize (1574 of 1898) PASS: lldb-unit :: Process/gdb-remote/./ProcessGdbRemoteTests/GDBRemoteCommunicationClientTest.WriteRegister (1575 of 1898) PASS: lldb-unit :: Expression/./ExpressionTests/ClangHostTest.MacOSX (1576 of 1898) PASS: lldb-api :: commands/apropos/with-process/TestAproposWithProcess.py (1577 of 1898) PASS: lldb-unit :: Utility/./UtilityTests/GeneratorTest.Get (1578 of 1898) PASS: lldb-api :: lang/objc/global_ptrs/TestGlobalObjects.py (1579 of 1898) PASS: lldb-shell :: Minidump/breakpad-symbols.test (1580 of 1898) PASS: lldb-api :: tools/lldb-vscode/breakpoint/TestVSCode_setBreakpoints.py (1581 of 1898) UNSUPPORTED: lldb-api :: functionalities/darwin_log/filter/exact_match/activity-chain/TestDarwinLogFilterMatchActivityChain.py (1582 of 1898) PASS: lldb-unit :: Language/Highlighting/./HighlighterTests/HighlighterTest.ClangCursorPosInOtherToken (1583 of 1898) UNSUPPORTED: lldb-shell :: Unwind/unwind-plan-dwarf-dump.test (1584 of 1898) PASS: lldb-unit :: SymbolFile/DWARF/./SymbolFileDWARFTests/SymbolFileDWARFTests.TestAbbrevValidAttrNullForm (1585 of 1898) UNSUPPORTED: lldb-shell :: Register/x86-64-ymm16-write.test (1586 of 1898) PASS: lldb-unit :: Process/minidump/./LLDBMinidumpTests/MinidumpParserTest.InvalidMinidump (1587 of 1898) PASS: lldb-shell :: ObjectFile/ELF/section-types-edgecases.yaml (1588 of 1898) PASS: lldb-api :: functionalities/thread/concurrent_events/TestConcurrentTwoBreakpointsOneDelaySignal.py (1589 of 1898) PASS: lldb-unit :: Signals/./SignalsTests/UnixSignalsTest.GetFilteredSignals (1590 of 1898) PASS: lldb-api :: commands/watchpoints/watchpoint_disable/TestWatchpointDisable.py (1591 of 1898) PASS: lldb-api :: functionalities/data-formatter/data-formatter-stl/libcxx/variant/TestDataFormatterLibcxxVariant.py (1592 of 1898) PASS: lldb-shell :: SymbolFile/DWARF/compilercontext.ll (1593 of 1898) PASS: lldb-api :: commands/frame/language/TestGuessLanguage.py (1594 of 1898) PASS: lldb-api :: lang/c/anonymous/TestAnonymous.py (1595 of 1898) PASS: lldb-unit :: SymbolFile/NativePDB/./SymbolFileNativePDBTests/PDBFPOProgramToDWARFExpressionTests.MultipleDependentAssignments (1596 of 1898) PASS: lldb-unit :: Host/./HostTests/MainLoopTest.DetectsEOF (1597 of 1898) PASS: lldb-unit :: Utility/./UtilityTests/RangeTest.LessThanInvalid (1598 of 1898) PASS: lldb-api :: functionalities/tail_call_frames/ambiguous_tail_call_seq1/TestAmbiguousTailCallSeq1.py (1599 of 1898) PASS: lldb-api :: functionalities/thread/concurrent_events/TestConcurrentBreakpointsDelayedBreakpointOneWatchpoint.py (1600 of 1898) PASS: lldb-api :: lang/objc/objc-baseclass-sbtype/TestObjCBaseClassSBType.py (1601 of 1898) PASS: lldb-shell :: SymbolFile/Breakpad/symtab.test (1602 of 1898) UNSUPPORTED: lldb-api :: functionalities/data-formatter/data-formatter-stl/libstdcpp/map/TestDataFormatterStdMap.py (1603 of 1898) PASS: lldb-unit :: Utility/./UtilityTests/LogChannelEnabledTest.LogThread (1604 of 1898) PASS: lldb-api :: python_api/formatters/TestFormattersSBAPI.py (1605 of 1898) UNSUPPORTED: lldb-api :: functionalities/process_save_core/TestProcessSaveCore.py (1606 of 1898) PASS: lldb-unit :: Process/gdb-remote/./ProcessGdbRemoteTests/GDBRemoteCommunicationServerTest.SendErrorResponse_StringError (1607 of 1898) PASS: lldb-unit :: Utility/./UtilityTests/LogChannelTest.List (1608 of 1898) PASS: lldb-api :: python_api/thread/TestThreadAPI.py (1609 of 1898) PASS: lldb-unit :: Symbol/./SymbolTests/TestClangASTContext.TestGetTypeClassNested (1610 of 1898) PASS: lldb-unit :: Expression/./ExpressionTests/DiagnosticManagerTest.AddDiagnostic (1611 of 1898) PASS: lldb-shell :: Driver/TestRepl.test (1612 of 1898) PASS: lldb-api :: functionalities/data-formatter/stringprinter/TestStringPrinter.py (1613 of 1898) PASS: lldb-shell :: SymbolFile/NativePDB/break-by-line.cpp (1614 of 1898) PASS: lldb-unit :: Utility/./UtilityTests/StringExtractorTest.GetHexU8_Underflow2 (1615 of 1898) PASS: lldb-api :: functionalities/breakpoint/address_breakpoints/TestBadAddressBreakpoints.py (1616 of 1898) PASS: lldb-shell :: SymbolFile/Breakpad/line-table-mixed-path-styles.test (1617 of 1898) PASS: lldb-unit :: Utility/./UtilityTests/BinaryStreamTest.PutULEB128SevenBytes (1618 of 1898) PASS: lldb-unit :: Language/Highlighting/./HighlighterTests/HighlighterTest.DefaultHighlighter (1619 of 1898) PASS: lldb-api :: python_api/function_symbol/TestSymbolAPI.py (1620 of 1898) PASS: lldb-api :: lang/c/modules/TestCModules.py (1621 of 1898) PASS: lldb-api :: commands/expression/inline-namespace/TestInlineNamespace.py (1622 of 1898) PASS: lldb-unit :: Process/gdb-remote/./ProcessGdbRemoteTests/GDBRemoteClientBaseTest.SendContinueAndInterrupt (1623 of 1898) PASS: lldb-shell :: Driver/TestTarget.test (1624 of 1898) PASS: lldb-unit :: Utility/./UtilityTests/ScalarTest.GetBytes (1625 of 1898) PASS: lldb-api :: functionalities/data-formatter/parray/TestPrintArray.py (1626 of 1898) PASS: lldb-api :: lang/c/conflicting-symbol/TestConflictingSymbol.py (1627 of 1898) PASS: lldb-unit :: Utility/./UtilityTests/DataExtractorTest.GetMaxS64 (1628 of 1898) PASS: lldb-api :: lang/cpp/char1632_t/TestChar1632T.py (1629 of 1898) PASS: lldb-unit :: Utility/./UtilityTests/UserIDResolver.GetUserName (1630 of 1898) UNSUPPORTED: lldb-api :: tools/lldb-server/TestGdbRemoteModuleInfo.py (1631 of 1898) PASS: lldb-shell :: ObjectFile/ELF/duplicate-section.yaml (1632 of 1898) PASS: lldb-api :: functionalities/thread/concurrent_events/TestConcurrentWatchpointDelayWatchpointOneBreakpoint.py (1633 of 1898) PASS: lldb-api :: functionalities/data-formatter/data-formatter-proper-plurals/TestFormattersOneIsSingular.py (1634 of 1898) PASS: lldb-api :: functionalities/data-formatter/data-formatter-stl/libcxx/vbool/TestDataFormatterLibcxxVBool.py (1635 of 1898) PASS: lldb-api :: commands/frame/diagnose/dereference-this/TestDiagnoseDereferenceThis.py (1636 of 1898) PASS: lldb-api :: functionalities/data-formatter/compactvectors/TestCompactVectors.py (1637 of 1898) PASS: lldb-unit :: Expression/./ExpressionTests/DiagnosticManagerTest.PutStringMultiple (1638 of 1898) PASS: lldb-api :: api/multithreaded/TestMultithreaded.py (1639 of 1898) PASS: lldb-api :: commands/breakpoint/command/list/TestBreakpointCommandList.py (1640 of 1898) PASS: lldb-unit :: Utility/./UtilityTests/RecordReplayTest.InstrumentedBar (1641 of 1898) PASS: lldb-unit :: Process/gdb-remote/./ProcessGdbRemoteTests/GDBRemoteCommunicationClientTest.SendGetMetaDataPacket (1642 of 1898) PASS: lldb-api :: commands/version/TestVersion.py (1643 of 1898) PASS: lldb-unit :: Utility/./UtilityTests/VMRange.IsValid (1644 of 1898) PASS: lldb-unit :: Utility/./UtilityTests/RangeTest.NotEqualInvalid (1645 of 1898) PASS: lldb-api :: commands/process/attach/attach_denied/TestAttachDenied.py (1646 of 1898) PASS: lldb-unit :: Utility/./UtilityTests/VMRange.Comparison (1647 of 1898) PASS: lldb-unit :: Utility/./UtilityTests/CompletionRequest.TryCompleteCurrentArgBad (1648 of 1898) PASS: lldb-unit :: Symbol/./SymbolTests/TestClangASTContext.TestGetTypeClassTypeOf (1649 of 1898) PASS: lldb-unit :: Utility/./UtilityTests/RangeTest.SlideZero (1650 of 1898) PASS: lldb-shell :: Settings/TestDisableColor.test (1651 of 1898) PASS: lldb-api :: commands/settings/quoting/TestQuoting.py (1652 of 1898) PASS: lldb-shell :: SymbolFile/DWARF/debug-types-dwarf5.s (1653 of 1898) PASS: lldb-shell :: SymbolFile/DWARF/DW_AT_low_pc-addrx.s (1654 of 1898) PASS: lldb-unit :: Utility/./UtilityTests/ScalarTest.Equality (1655 of 1898) UNSUPPORTED: lldb-api :: benchmarks/continue/TestBenchmarkContinue.py (1656 of 1898) PASS: lldb-shell :: SymbolFile/Breakpad/unwind-via-stack-win.test (1657 of 1898) PASS: lldb-shell :: SymbolFile/DWARF/DW_OP_piece-struct.s (1658 of 1898) PASS: lldb-api :: functionalities/testid/TestTestId.py (1659 of 1898) PASS: lldb-api :: functionalities/unwind/noreturn/TestNoreturnUnwind.py (1660 of 1898) PASS: lldb-unit :: Utility/./UtilityTests/StreamTeeTest.GetStreamAtIndexOutOfBoundsEmpty (1661 of 1898) PASS: lldb-api :: lang/cpp/nested-class-other-compilation-unit/TestNestedClassWithParentInAnotherCU.py (1662 of 1898) UNSUPPORTED: lldb-api :: functionalities/data-formatter/data-formatter-stl/libstdcpp/tuple/TestDataFormatterStdTuple.py (1663 of 1898) PASS: lldb-api :: python_api/watchpoint/TestWatchpointIgnoreCount.py (1664 of 1898) PASS: lldb-unit :: Utility/./UtilityTests/StringListTest.ForRange (1665 of 1898) PASS: lldb-api :: lang/objc/objc-new-syntax/TestObjCNewSyntaxLiteral.py (1666 of 1898) PASS: lldb-shell :: SymbolFile/DWARF/dwarf5-atomic.s (1667 of 1898) PASS: lldb-shell :: SymbolFile/DWARF/dwarf5-debug_line.s (1668 of 1898) PASS: lldb-api :: lang/objc/objc-optimized/TestObjcOptimized.py (1669 of 1898) PASS: lldb-api :: commands/expression/rdar44436068/Test128BitsInteger.py (1670 of 1898) PASS: lldb-unit :: Utility/./UtilityTests/RangeTest.ContainsEndInclusiveInvalid (1671 of 1898) PASS: lldb-unit :: Host/./HostTests/NativeProcessProtocolTest.SetBreakpointFailRead (1672 of 1898) PASS: lldb-shell :: Quit/TestQuitExitCodeImplicit0.test (1673 of 1898) PASS: lldb-unit :: Utility/./UtilityTests/LogChannelEnabledTest.log_options (1674 of 1898) PASS: lldb-unit :: Process/minidump/./LLDBMinidumpTests/RegisterContextMinidump.ConvertMinidumpContext_x86_32 (1675 of 1898) PASS: lldb-api :: lang/cpp/const_this/TestConstThis.py (1676 of 1898) PASS: lldb-shell :: Breakpoint/jitbp_elf.test (1677 of 1898) PASS: lldb-unit :: SymbolFile/DWARF/./SymbolFileDWARFTests/SymbolFileDWARFTests.TestAbbrevOrder1Start1 (1678 of 1898) PASS: lldb-unit :: Expression/./ExpressionTests/DiagnosticManagerTest.GetStringPreserveOrder (1679 of 1898) PASS: lldb-unit :: Utility/./UtilityTests/AnsiTerminal.Incomplete (1680 of 1898) PASS: lldb-unit :: Host/./HostTests/NativeProcessProtocolTest.ReadCStringFromMemory_MaxSize (1681 of 1898) PASS: lldb-api :: lang/objcxx/hide-runtime-values/TestObjCXXHideRuntimeValues.py (1682 of 1898) PASS: lldb-unit :: Utility/./UtilityTests/ProcessInstanceInfo.DumpTable_invalidUID (1683 of 1898) UNSUPPORTED: lldb-shell :: Register/x86-64-xmm16-read.test (1684 of 1898) PASS: lldb-unit :: ScriptInterpreter/Python/./ScriptInterpreterPythonTests/PythonDataObjectsTest.TestPythonCallableCheck (1685 of 1898) PASS: lldb-api :: functionalities/dynamic_value_child_count/TestDynamicValueChildCount.py (1686 of 1898) PASS: lldb-shell :: Driver/TestNoUseColor.test (1687 of 1898) PASS: lldb-unit :: SymbolFile/NativePDB/./SymbolFileNativePDBTests/PDBFPOProgramToDWARFExpressionTests.SingleAssignmentRegisterRef (1688 of 1898) PASS: lldb-unit :: Utility/./UtilityTests/StreamTest.PutSLEB128 (1689 of 1898) PASS: lldb-api :: lang/objcxx/cxx-bridged-po/TestObjCXXBridgedPO.py (1690 of 1898) PASS: lldb-unit :: Host/./HostTests/ConnectionFileDescriptorTest.TCPGetURIv4 (1691 of 1898) PASS: lldb-unit :: Utility/./UtilityTests/LogChannelTest.EnableOptions (1692 of 1898) PASS: lldb-api :: functionalities/data-formatter/data-formatter-advanced/TestDataFormatterAdv.py (1693 of 1898) PASS: lldb-shell :: Quit/TestQuitExitCodeTooManyArgs.test (1694 of 1898) PASS: lldb-unit :: Utility/./UtilityTests/SubsystemRAIITest.SubsystemWithErrorFailure (1695 of 1898) UNSUPPORTED: lldb-api :: functionalities/tsan/global_location/TestTsanGlobalLocation.py (1696 of 1898) PASS: lldb-api :: commands/watchpoints/watchpoint_events/TestWatchpointEvents.py (1697 of 1898) PASS: lldb-api :: python_api/target/TestTargetAPI.py (1698 of 1898) PASS: lldb-unit :: SymbolFile/DWARF/./SymbolFileDWARFTests/SymbolFileDWARFTests.TestAbbrevInvalidNULLTag (1699 of 1898) PASS: lldb-shell :: SymbolFile/DWARF/array-sizes.s (1700 of 1898) PASS: lldb-api :: lang/objc/objc-dyn-sbtype/TestObjCDynamicSBType.py (1701 of 1898) PASS: lldb-api :: functionalities/data-formatter/user-format-vs-summary/TestUserFormatVsSummary.py (1702 of 1898) PASS: lldb-api :: functionalities/thread/concurrent_events/TestConcurrentTwoWatchpointThreads.py (1703 of 1898) PASS: lldb-api :: commands/command/nested_alias/TestNestedAlias.py (1704 of 1898) PASS: lldb-unit :: Host/./HostTests/FileSystemTest.Resolve (1705 of 1898) PASS: lldb-shell :: Settings/TestSettingsSet.test (1706 of 1898) PASS: lldb-unit :: UnwindAssembly/x86/./UnwindAssemblyx86Tests/Testx86AssemblyInspectionEngine.TestPopESI (1707 of 1898) PASS: lldb-api :: functionalities/thread/concurrent_events/TestConcurrentCrashWithSignal.py (1708 of 1898) UNSUPPORTED: lldb-shell :: Register/arm-fp-read.test (1709 of 1898) UNSUPPORTED: lldb-api :: python_api/event/TestEvents.py (1710 of 1898) PASS: lldb-unit :: Process/minidump/./LLDBMinidumpTests/MinidumpParserTest.GetFilteredModuleList (1711 of 1898) PASS: lldb-unit :: Utility/./UtilityTests/RecordReplayTest.InstrumentedBarPtr (1712 of 1898) PASS: lldb-shell :: SymbolFile/Breakpad/stack-cfi-parsing.test (1713 of 1898) PASS: lldb-unit :: Utility/./UtilityTests/StringListTest.AppendStringCString (1714 of 1898) PASS: lldb-api :: functionalities/type_completion/TestTypeCompletion.py (1715 of 1898) PASS: lldb-shell :: SymbolFile/NativePDB/tag-types.cpp (1716 of 1898) XFAIL: lldb-shell :: Register/x86-mm-xmm-read.test (1717 of 1898) PASS: lldb-unit :: Utility/./UtilityTests/StreamTeeTest.Constructor2Streams (1718 of 1898) PASS: lldb-shell :: Expr/TestTypeOfDeclTypeExpr.test (1719 of 1898) PASS: lldb-api :: functionalities/thread/concurrent_events/TestConcurrentDelayedCrashWithBreakpointSignal.py (1720 of 1898) PASS: lldb-unit :: Utility/./UtilityTests/UUIDTest.RelationalOperators (1721 of 1898) PASS: lldb-unit :: SymbolFile/DWARF/./SymbolFileDWARFTests/DWARFASTParserClangTests.EnsureAllDIEsInDeclContextHaveBeenParsedParsesOnlyMatchingEntries (1722 of 1898) PASS: lldb-api :: functionalities/completion/TestCompletion.py (1723 of 1898) PASS: lldb-shell :: ObjectFile/PECOFF/sections.yaml (1724 of 1898) PASS: lldb-unit :: UnwindAssembly/x86/./UnwindAssemblyx86Tests/Testx86AssemblyInspectionEngine.Test32BitOnlyInstruction (1725 of 1898) PASS: lldb-unit :: Utility/./UtilityTests/UriParserTest.MinimalPath (1726 of 1898) XFAIL: lldb-shell :: Unwind/prefer-debug-over-eh-frame.test (1727 of 1898) PASS: lldb-api :: lang/cpp/type_lookup/TestCppTypeLookup.py (1728 of 1898) PASS: lldb-unit :: Process/minidump/./LLDBMinidumpTests/MinidumpParserTest.GetPid (1729 of 1898) PASS: lldb-api :: lang/objc/rdar-11355592/TestRdar11355592.py (1730 of 1898) PASS: lldb-unit :: Utility/./UtilityTests/StringListTest.JoinMultiCharSeparator (1731 of 1898) PASS: lldb-api :: commands/expression/persistent_variables/TestPersistentVariables.py (1732 of 1898) PASS: lldb-unit :: Language/Highlighting/./HighlighterTests/HighlighterTest.ClangUnterminatedString (1733 of 1898) UNSUPPORTED: lldb-api :: commands/expression/multiline-navigation/TestMultilineNavigation.py (1734 of 1898) PASS: lldb-api :: functionalities/archives/TestBSDArchives.py (1735 of 1898) PASS: lldb-unit :: Utility/./UtilityTests/StringExtractorTest.GetHexBytesAvail (1736 of 1898) PASS: lldb-api :: lang/cpp/class_types/TestClassTypes.py (1737 of 1898) PASS: lldb-unit :: Target/./TargetTests/ExecutionContextTest.GetByteOrderTarget (1738 of 1898) PASS: lldb-api :: functionalities/data-formatter/data-formatter-stl/libcxx/atomic/TestLibCxxAtomic.py (1739 of 1898) PASS: lldb-unit :: Utility/./UtilityTests/StringListTest.LongestCommonPrefixNoPrefix (1740 of 1898) PASS: lldb-unit :: Process/gdb-remote/./ProcessGdbRemoteTests/GDBRemoteCommunicationClientTest.ReadRegister (1741 of 1898) PASS: lldb-api :: lang/cpp/operator-overload/TestOperatorOverload.py (1742 of 1898) PASS: lldb-shell :: SymbolFile/NativePDB/disassembly.cpp (1743 of 1898) PASS: lldb-unit :: Expression/./ExpressionTests/DiagnosticManagerTest.GetStringMultipleDiags (1744 of 1898) PASS: lldb-unit :: UnwindAssembly/x86/./UnwindAssemblyx86Tests/Testx86AssemblyInspectionEngine.TestPushEBX (1745 of 1898) PASS: lldb-unit :: Utility/./UtilityTests/FileSpecTest.PrependPathComponent (1746 of 1898) PASS: lldb-api :: functionalities/gdb_remote_client/TestRecognizeBreakpoint.py (1747 of 1898) PASS: lldb-api :: python_api/findvalue_duplist/TestSBFrameFindValue.py (1748 of 1898) PASS: lldb-unit :: Host/./HostTests/File.GetWaitableHandleFileno (1749 of 1898) PASS: lldb-api :: functionalities/inferior-assert/TestInferiorAssert.py (1750 of 1898) PASS: lldb-api :: python_api/sbdata/TestSBData.py (1751 of 1898) PASS: lldb-unit :: Utility/./UtilityTests/StreamTest.PutHex16ByteOrderBig (1752 of 1898) PASS: lldb-unit :: Utility/./UtilityTests/StringListTest.JoinSingle (1753 of 1898) PASS: lldb-api :: functionalities/data-formatter/data-formatter-objc/TestDataFormatterObjCKVO.py (1754 of 1898) UNSUPPORTED: lldb-shell :: ScriptInterpreter/Lua/persistent_state.test (1755 of 1898) PASS: lldb-api :: commands/watchpoints/watchpoint_commands/TestWatchpointCommands.py (1756 of 1898) PASS: lldb-shell :: ObjectFile/MachO/lc_version_min.yaml (1757 of 1898) PASS: lldb-api :: functionalities/memory/find/TestMemoryFind.py (1758 of 1898) PASS: lldb-unit :: Utility/./UtilityTests/StreamTeeTest.SetStreamAtIndexOverwrite (1759 of 1898) PASS: lldb-api :: lang/cpp/namespace/TestNamespaceLookup.py (1760 of 1898) PASS: lldb-unit :: Utility/./UtilityTests/BinaryStreamTest.PutULEB128OneByte (1761 of 1898) PASS: lldb-shell :: Breakpoint/debug_rnglist_offset_pair.test (1762 of 1898) PASS: lldb-unit :: UnwindAssembly/x86/./UnwindAssemblyx86Tests/Testx86AssemblyInspectionEngine.TestPushR14 (1763 of 1898) PASS: lldb-unit :: Core/./LLDBCoreTests/StreamCallbackTest.Callback (1764 of 1898) PASS: lldb-unit :: Expression/./ExpressionTests/CppModuleConfigurationTest.Linux (1765 of 1898) PASS: lldb-unit :: Utility/./UtilityTests/StringListTest.AppendListCStringArray (1766 of 1898) PASS: lldb-unit :: Utility/./UtilityTests/StreamTest.PutHex8 (1767 of 1898) PASS: lldb-unit :: Utility/./UtilityTests/StringExtractorTest.DecodeHexU8_Extra (1768 of 1898) PASS: lldb-unit :: Utility/./UtilityTests/StringListTest.GetMaxStringLengthEqualSize (1769 of 1898) PASS: lldb-unit :: ObjectFile/ELF/./ObjectFileELFTests/ObjectFileELFTest.GetSymtab_NoSymEntryPointArmThumbAddressClass (1770 of 1898) PASS: lldb-api :: functionalities/var_path/TestVarPath.py (1771 of 1898) PASS: lldb-shell :: Settings/TestStopCommandSourceOnError.test (1772 of 1898) PASS: lldb-api :: lang/objc/modules-auto-import/TestModulesAutoImport.py (1773 of 1898) PASS: lldb-unit :: Utility/./UtilityTests/FileSpecTest.EqualDotsWindows (1774 of 1898) PASS: lldb-unit :: ScriptInterpreter/Python/./ScriptInterpreterPythonTests/PythonDataObjectsTest.TestPythonString (1775 of 1898) PASS: lldb-api :: functionalities/breakpoint/breakpoint_conditions/TestBreakpointConditions.py (1776 of 1898) PASS: lldb-api :: commands/expression/namespace_local_var_same_name_cpp_and_c/TestNamespaceLocalVarSameNameCppAndC.py (1777 of 1898) PASS: lldb-unit :: ScriptInterpreter/Python/./ScriptInterpreterPythonTests/PythonDataObjectsTest.TestInstanceNameResolutionNoDot (1778 of 1898) PASS: lldb-shell :: SymbolFile/DWARF/childless-compile-unit.s (1779 of 1898) PASS: lldb-unit :: Utility/./UtilityTests/OptionsWithRawTest.LeadingSpaceArgs (1780 of 1898) PASS: lldb-unit :: Utility/./UtilityTests/StreamTest.AddressRangeInvalidRange (1781 of 1898) PASS: lldb-unit :: Utility/./UtilityTests/VMRange.SetEndAddress (1782 of 1898) PASS: lldb-unit :: Utility/./UtilityTests/BinaryStreamTest.PutSLEB128TwoBytes (1783 of 1898) PASS: lldb-unit :: Signals/./SignalsTests/UnixSignalsTest.GetInfo (1784 of 1898) UNSUPPORTED: lldb-api :: android/platform/TestDefaultCacheLineSize.py (1785 of 1898) PASS: lldb-api :: macosx/function-starts/TestFunctionStarts.py (1786 of 1898) PASS: lldb-unit :: Utility/./UtilityTests/VMRange.ContainsRange (1787 of 1898) PASS: lldb-api :: functionalities/thread/num_threads/TestNumThreads.py (1788 of 1898) UNSUPPORTED: lldb-api :: benchmarks/expression/TestExpressionCmd.py (1789 of 1898) UNSUPPORTED: lldb-api :: lang/cpp/function-template-parameter-pack/TestFunctionTemplateParameterPack.py (1790 of 1898) PASS: lldb-unit :: Target/./TargetTests/ModuleCacheTest.GetAndPutUuidExists (1791 of 1898) PASS: lldb-api :: lang/c/blocks/TestBlocks.py (1792 of 1898) PASS: lldb-api :: functionalities/gdb_remote_client/TestPlatformClient.py (1793 of 1898) PASS: lldb-shell :: SymbolFile/DWARF/debug_rnglists-dwo.s (1794 of 1898) PASS: lldb-unit :: Process/gdb-remote/./ProcessGdbRemoteTests/GDBRemoteCommunicationClientTest.SendSignalsToIgnore (1795 of 1898) PASS: lldb-unit :: Utility/./UtilityTests/DeserializerTest.HasData (1796 of 1898) PASS: lldb-api :: lang/cpp/incomplete-types/TestCppIncompleteTypes.py (1797 of 1898) PASS: lldb-unit :: Utility/./UtilityTests/StringExtractorTest.GetU32LittleEndian (1798 of 1898) PASS: lldb-unit :: Utility/./UtilityTests/StreamTest.AddressSuffix (1799 of 1898) PASS: lldb-api :: macosx/find-app-in-bundle/TestFindAppInBundle.py (1800 of 1898) PASS: lldb-unit :: Language/Highlighting/./HighlighterTests/HighlighterTest.DefaultHighlighterWithCursor (1801 of 1898) PASS: lldb-api :: functionalities/tail_call_frames/disambiguate_paths_to_common_sink/TestDisambiguatePathsToCommonSink.py (1802 of 1898) PASS: lldb-api :: functionalities/data-formatter/vector-types/TestVectorTypesFormatting.py (1803 of 1898) PASS: lldb-unit :: Utility/./UtilityTests/VASprintfTest.BufferResize (1804 of 1898) PASS: lldb-shell :: SymbolFile/NativePDB/nested-types.cpp (1805 of 1898) PASS: lldb-api :: lang/objc/real-definition/TestRealDefinition.py (1806 of 1898) PASS: lldb-unit :: Process/gdb-remote/./ProcessGdbRemoteTests/GDBRemoteClientBaseTest.SendContinueDelegateInterface (1807 of 1898) PASS: lldb-api :: commands/expression/import-std-module/shared_ptr/TestSharedPtr.py (1808 of 1898) PASS: lldb-unit :: Utility/./UtilityTests/FileSpecTest.GuessPathStyle (1809 of 1898) PASS: lldb-api :: macosx/universal/TestUniversal.py (1810 of 1898) PASS: lldb-api :: lang/cpp/dynamic-value-same-basename/TestDynamicValueSameBase.py (1811 of 1898) PASS: lldb-shell :: SymbolFile/Breakpad/unwind-via-raSearch.test (1812 of 1898) PASS: lldb-unit :: Utility/./UtilityTests/RangeTest.ContainsAddr (1813 of 1898) PASS: lldb-unit :: Host/./HostTests/FileSystemTest.Readable (1814 of 1898) PASS: lldb-unit :: Utility/./UtilityTests/VMRange.Ordering (1815 of 1898) PASS: lldb-api :: lang/objc/foundation/TestObjCMethodsString.py (1816 of 1898) PASS: lldb-api :: functionalities/data-formatter/data-formatter-categories/TestDataFormatterCategories.py (1817 of 1898) PASS: lldb-unit :: Utility/./UtilityTests/StringListTest.Join (1818 of 1898) PASS: lldb-api :: functionalities/memory/read/TestMemoryRead.py (1819 of 1898) PASS: lldb-unit :: Utility/./UtilityTests/ArgsTest.TestAppendArg (1820 of 1898) PASS: lldb-api :: functionalities/breakpoint/breakpoint_names/TestBreakpointNames.py (1821 of 1898) PASS: lldb-api :: python_api/section/TestSectionAPI.py (1822 of 1898) PASS: lldb-api :: macosx/nslog/TestDarwinNSLogOutput.py (1823 of 1898) PASS: lldb-unit :: Language/Highlighting/./HighlighterTests/HighlighterTest.Keywords (1824 of 1898) PASS: lldb-unit :: Platform/./LLDBPlatformTests/PlatformDarwinTest.TestParseVersionBuildDir (1825 of 1898) PASS: lldb-unit :: Utility/./UtilityTests/StringListTest.GetMaxStringLengthIncreasingSize (1826 of 1898) PASS: lldb-unit :: Utility/./UtilityTests/SerializationRountripTest.SerializeDeserializeObjectReference (1827 of 1898) PASS: lldb-unit :: Utility/./UtilityTests/StreamTest.ChangingByteOrder (1828 of 1898) PASS: lldb-shell :: ObjectFile/Breakpad/breakpad-identification.test (1829 of 1898) PASS: lldb-unit :: Language/CPlusPlus/./LanguageCPlusPlusTests/CPlusPlusLanguage.FindAlternateFunctionManglings (1830 of 1898) PASS: lldb-unit :: Utility/./UtilityTests/BinaryStreamTest.PutSLEB128ThreeBytes (1831 of 1898) UNSUPPORTED: lldb-shell :: ObjectFile/PECOFF/disassemble-thumb.yaml (1832 of 1898) PASS: lldb-api :: commands/expression/entry-bp/TestExprEntryBP.py (1833 of 1898) PASS: lldb-api :: lang/objc/modules-inline-functions/TestModulesInlineFunctions.py (1834 of 1898) PASS: lldb-api :: lang/cpp/virtual-overload/TestVirtualOverload.py (1835 of 1898) PASS: lldb-shell :: ObjectFile/wasm/embedded-debug-sections.yaml (1836 of 1898) PASS: lldb-unit :: Utility/./UtilityTests/TimeoutTest.Format (1837 of 1898) PASS: lldb-unit :: Utility/./UtilityTests/ScalarTest.APIntConstructor (1838 of 1898) PASS: lldb-api :: functionalities/plugins/command_plugin/TestPluginCommands.py (1839 of 1898) PASS: lldb-shell :: Reproducer/TestWorkingDir.test (1840 of 1898) PASS: lldb-api :: types/TestShortType.py (1841 of 1898) PASS: lldb-unit :: Utility/./UtilityTests/RangeTest.DoesIntersect (1842 of 1898) PASS: lldb-api :: functionalities/backticks/TestBackticksWithoutATarget.py (1843 of 1898) PASS: lldb-shell :: ObjectFile/ELF/build-id-case.yaml (1844 of 1898) PASS: lldb-api :: python_api/frame/get-variables/TestGetVariables.py (1845 of 1898) PASS: lldb-api :: python_api/value/TestValueAPI.py (1846 of 1898) PASS: lldb-unit :: Utility/./UtilityTests/StringExtractorTest.DecodeHexU8_Underflow (1847 of 1898) PASS: lldb-shell :: Reproducer/Modules/TestModuleCXX.test (1848 of 1898) PASS: lldb-shell :: SymbolFile/DWARF/debug_aranges-empty-section.s (1849 of 1898) PASS: lldb-unit :: Utility/./UtilityTests/ArchSpecTest.OperatorBool (1850 of 1898) PASS: lldb-unit :: Utility/./UtilityTests/VASprintfTest.NoBufferResize (1851 of 1898) PASS: lldb-unit :: ScriptInterpreter/Python/./ScriptInterpreterPythonTests/PythonDataObjectsTest.TestPythonIntegerToStr (1852 of 1898) PASS: lldb-unit :: Utility/./UtilityTests/TimerTest.CategoryTimes2 (1853 of 1898) UNSUPPORTED: lldb-shell :: Register/aarch64-fp-read.test (1854 of 1898) PASS: lldb-shell :: ObjectFile/ELF/netbsd-exec-8.99.30-amd64.yaml (1855 of 1898) PASS: lldb-shell :: Settings/TestFrameFormatNoColor.test (1856 of 1898) PASS: lldb-api :: functionalities/thread/concurrent_events/TestConcurrentDelaySignalBreak.py (1857 of 1898) PASS: lldb-api :: lang/cpp/breakpoint-commands/TestCPPBreakpointCommands.py (1858 of 1898) PASS: lldb-unit :: Symbol/./SymbolTests/TestClangASTContext.TestRecordHasFields (1859 of 1898) PASS: lldb-unit :: Utility/./UtilityTests/StringExtractorTest.GetHexBytes_OddPair2 (1860 of 1898) PASS: lldb-unit :: Utility/./UtilityTests/StringListTest.GetMaxStringLengthEmpty (1861 of 1898) PASS: lldb-api :: lang/cpp/dynamic-value/TestCppValueCast.py (1862 of 1898) PASS: lldb-api :: functionalities/avoids-fd-leak/TestFdLeak.py (1863 of 1898) PASS: lldb-api :: functionalities/gdb_remote_client/TestRegDefinitionInParts.py (1864 of 1898) PASS: lldb-unit :: Expression/./ExpressionTests/DiagnosticManagerTest.HasFixits (1865 of 1898) PASS: lldb-unit :: Core/./LLDBCoreTests/RichManglingContextTest.IPDRealloc (1866 of 1898) PASS: lldb-unit :: Utility/./UtilityTests/RangeDataVector.FindEntryThatContains_Overlap (1867 of 1898) UNSUPPORTED: lldb-shell :: ScriptInterpreter/Lua/bindings.test (1868 of 1898) PASS: lldb-shell :: ObjectFile/Breakpad/sections.test (1869 of 1898) PASS: lldb-api :: functionalities/data-formatter/data-formatter-stl/libcxx/list/TestDataFormatterLibcxxList.py (1870 of 1898) PASS: lldb-shell :: ObjectFile/ELF/section-overlap.yaml (1871 of 1898) PASS: lldb-api :: tools/lldb-server/inferior-crash/TestGdbRemoteAbort.py (1872 of 1898) PASS: lldb-unit :: UnwindAssembly/x86/./UnwindAssemblyx86Tests/Testx86AssemblyInspectionEngine.Test32bitFramelessBigStackFrame (1873 of 1898) PASS: lldb-unit :: Language/Highlighting/./HighlighterTests/HighlighterTest.ClangTrailingBackslashWithWhitespace (1874 of 1898) PASS: lldb-unit :: Utility/./UtilityTests/StringExtractorTest.GetNameColonValueContainsColon (1875 of 1898) PASS: lldb-unit :: Utility/./UtilityTests/StringExtractorTest.GetHexU8_Exact (1876 of 1898) UNSUPPORTED: lldb-api :: linux/add-symbols/TestTargetSymbolsAddCommand.py (1877 of 1898) UNSUPPORTED: lldb-shell :: Register/x86-zmm-read.test (1878 of 1898) PASS: lldb-api :: commands/platform/basic/TestPlatformPython.py (1879 of 1898) PASS: lldb-api :: lang/cpp/namespace/TestNamespace.py (1880 of 1898) PASS: lldb-api :: functionalities/gdb_remote_client/TestGDBRemoteClient.py (1881 of 1898) PASS: lldb-shell :: SymbolFile/DWARF/dwarf5-partial-index.cpp (1882 of 1898) PASS: lldb-unit :: Host/./HostTests/NativeProcessProtocolTest.SetBreakpointFailWrite (1883 of 1898) UNSUPPORTED: lldb-shell :: SymbolFile/NativePDB/local-variables.cpp (1884 of 1898) PASS: lldb-api :: functionalities/load_using_paths/TestLoadUsingPaths.py (1885 of 1898) PASS: lldb-api :: functionalities/postmortem/netbsd-core/TestNetBSDCore.py (1886 of 1898) PASS: lldb-api :: lang/objcxx/objcxx-ivar-vector/TestIvarVector.py (1887 of 1898) PASS: lldb-unit :: ScriptInterpreter/Python/./ScriptInterpreterPythonTests/PythonDataObjectsTest.TestPythonStringToStr (1888 of 1898) PASS: lldb-unit :: Editline/./EditlineTests/EditlineTestFixture.EditlineReceivesMultiLineText (1889 of 1898) PASS: lldb-shell :: SymbolFile/DWARF/dwarf5_locations.s (1890 of 1898) PASS: lldb-api :: commands/expression/import-std-module/weak_ptr/TestWeakPtr.py (1891 of 1898) PASS: lldb-api :: python_api/default-constructor/TestDefaultConstructorForAPIObjects.py (1892 of 1898) PASS: lldb-shell :: ObjectFile/ELF/short-build-id.yaml (1893 of 1898) PASS: lldb-unit :: Host/./HostTests/SocketTest.UDPConnect (1894 of 1898) PASS: lldb-api :: functionalities/thread/concurrent_events/TestConcurrentTwoWatchpointsOneBreakpoint.py (1895 of 1898) PASS: lldb-shell :: Breakpoint/split-dwarf5-debug-stroffsets.test (1896 of 1898) PASS: lldb-api :: functionalities/inferior-crashing/TestInferiorCrashing.py (1897 of 1898) PASS: lldb-api :: lang/objc/foundation/TestObjCMethods.py (1898 of 1898)

Hide Details

Testing Time: 4261.03s ******************** Failing Tests (2): lldb-api :: functionalities/data-formatter/data-formatter-objc/TestDataFormatterObjCNSContainer.py lldb-api :: functionalities/data-formatter/data-formatter-objc/TestDataFormatterObjCNSError.py

Hide Details

Hide Details

Slowest Tests: -------------------------------------------------------------------------- 83.69s: lldb-api :: types/TestIntegerTypeExpr.py 89.48s: lldb-api :: functionalities/data-formatter/compactvectors/TestCompactVectors.py 97.05s: lldb-api :: types/TestLongTypes.py 105.59s: lldb-api :: python_api/lldbutil/iter/TestLLDBIterator.py 105.63s: lldb-api :: lang/objc/foundation/TestObjCMethodsNSError.py 109.06s: lldb-api :: lang/objc/objc-new-syntax/TestObjCNewSyntaxArray.py 114.02s: lldb-api :: lang/objc/objc-new-syntax/TestObjCNewSyntaxDictionary.py 114.56s: lldb-api :: lang/objc/foundation/TestObjCMethodsString.py 120.24s: lldb-api :: tools/lldb-server/TestGdbRemote_qThreadStopInfo.py 132.24s: lldb-api :: types/TestLongTypesExpr.py 136.29s: lldb-api :: lang/objc/exceptions/TestObjCExceptions.py 139.36s: lldb-api :: lang/objc/real-definition/TestRealDefinition.py 150.80s: lldb-api :: lang/objc/objc-new-syntax/TestObjCNewSyntaxLiteral.py 165.10s: lldb-api :: lang/cpp/namespace/TestNamespaceLookup.py 194.85s: lldb-api :: lang/objc/foundation/TestObjCMethods.py 240.17s: lldb-api :: lang/objc/hidden-ivars/TestHiddenIvars.py 248.19s: lldb-api :: tools/lldb-server/TestGdbRemoteThreadsInStopReply.py 252.74s: lldb-api :: api/multithreaded/TestMultithreaded.py 269.87s: lldb-api :: lang/cpp/enum_types/TestCPP11EnumTypes.py 363.12s: lldb-api :: tools/lldb-server/TestLldbGdbServer.py

Hide Details

Tests Times: -------------------------------------------------------------------------- [ Range ] :: [ Percentage ] :: [ Count ] -------------------------------------------------------------------------- [ 0s, 20s) :: [********************************** ] :: [1652/1898] [ 20s, 40s) :: [** ] :: [ 120/1898] [ 40s, 60s) :: [* ] :: [ 74/1898] [ 60s, 80s) :: [ ] :: [ 28/1898] [ 80s,100s) :: [ ] :: [ 6/1898] [100s,120s) :: [ ] :: [ 6/1898] [120s,140s) :: [ ] :: [ 2/1898] [140s,160s) :: [ ] :: [ 3/1898] [160s,180s) :: [ ] :: [ 1/1898] [180s,200s) :: [ ] :: [ 0/1898] [200s,220s) :: [ ] :: [ 1/1898] [220s,240s) :: [ ] :: [ 0/1898] [240s,260s) :: [ ] :: [ 2/1898] [260s,280s) :: [ ] :: [ 1/1898] [280s,300s) :: [ ] :: [ 1/1898] [300s,320s) :: [ ] :: [ 0/1898] [320s,340s) :: [ ] :: [ 0/1898] [340s,360s) :: [ ] :: [ 0/1898] [360s,380s) :: [ ] :: [ 1/1898] Expected Passes : 1728 Expected Failures : 6 Unsupported Tests : 162 Unexpected Failures: 2 FAILED: tools/lldb/test/CMakeFiles/check-lldb-lit cd /Users/buildslave/jenkins/workspace/lldb-cmake-sanitized/lldb-build/tools/lldb/test && /usr/local/bin/python /Users/buildslave/jenkins/workspace/lldb-cmake-sanitized/lldb-build/./bin/llvm-lit -v --time-tests --shuffle --xunit-xml-output=/Users/buildslave/jenkins/workspace/lldb-cmake-sanitized/test/results.xml -v -j 4 --timeout 1200 /Users/buildslave/jenkins/workspace/lldb-cmake-sanitized/lldb-build/tools/lldb/test ninja: build stopped: subcommand failed. Command failed: Command '['/usr/bin/env', 'TERM=vt100', '/usr/local/bin/ninja', '-v', 'check-lldb']' returned non-zero exit status 1. Command: ['/usr/bin/env', 'TERM=vt100', '/usr/local/bin/ninja', '-v', 'check-lldb'] [Pipeline] } [Pipeline] // timeout [Pipeline] } [Pipeline] // stage [Pipeline] stage [Pipeline] { (Declarative: Post Actions) [Pipeline] scanForIssues No credentials specified [Clang (LLVM based)] Sleeping for 5 seconds due to JENKINS-32191... [Clang (LLVM based)] Parsing console log (workspace: '/Users/buildslave/jenkins/workspace/lldb-cmake-sanitized') [Pipeline] junit Recording test results [Pipeline] } [Pipeline] // stage [Pipeline] } [Pipeline] // withEnv [Pipeline] } [Pipeline] // node [Pipeline] End of Pipeline ERROR: script returned exit code 1 Finished: FAILURE