Started 1 yr 6 mo ago
Took 36 min

Build clang-d360278-gce6f0303df5-t12673-b12673.tar.gz (Jul 14, 2020 2:21:04 PM)


Found 3 issues:
Ninja target: matrix-types-spec.cpp.o
[4527/7672] : && /Users/buildslave/jenkins/workspace/test-suite-verify-machineinstrs-x86_64-O0-g/test-suite-build/tools/timeit --summary SingleSource/Benchmarks/Misc-C++-EH/ /Users/buildslave/jenkins/workspace/test-suite-verify-machineinstrs-x86_64-O0-g/compiler/bin/clang++  -B /Applications/    -Wno-unused-command-line-argument -mllvm -verify-machineinstrs -O0 -g -arch x86_64 -isysroot /Applications/ -Wl,-search_paths_first -Wl,-headerpad_max_install_names -B /Applications/ SingleSource/Benchmarks/Misc-C++-EH/CMakeFiles/spirit.dir/spirit.cpp.o  -o SingleSource/Benchmarks/Misc-C++-EH/spirit  -Wl,-no_pie -lm -lstdc++ -pthread && cd /Users/buildslave/jenkins/workspace/test-suite-verify-machineinstrs-x86_64-O0-g/test-suite-build/SingleSource/Benchmarks/Misc-C++-EH && /usr/local/Cellar/cmake/3.17.2/bin/cmake -E create_symlink /Users/buildslave/jenkins/workspace/test-suite-verify-machineinstrs-x86_64-O0-g/test-suite/SingleSource/Benchmarks/Misc-C++-EH/spirit.reference_output /Users/buildslave/jenkins/workspace/test-suite-verify-machineinstrs-x86_64-O0-g/test-suite-build/SingleSource/Benchmarks/Misc-C++-EH/spirit.reference_output
[4528/7672] : && /Users/buildslave/jenkins/workspace/test-suite-verify-machineinstrs-x86_64-O0-g/test-suite-build/tools/timeit --summary SingleSource/UnitTests/C++11/ /Users/buildslave/jenkins/workspace/test-suite-verify-machineinstrs-x86_64-O0-g/compiler/bin/clang++  -B /Applications/    -Wno-unused-command-line-argument -mllvm -verify-machineinstrs -O0 -g -arch x86_64 -isysroot /Applications/ -Wl,-search_paths_first -Wl,-headerpad_max_install_names -B /Applications/ SingleSource/UnitTests/C++11/CMakeFiles/stdthreadbug.dir/stdthreadbug.cpp.o  -o SingleSource/UnitTests/C++11/stdthreadbug  -Wl,-no_pie -lstdc++ -pthread && cd /Users/buildslave/jenkins/workspace/test-suite-verify-machineinstrs-x86_64-O0-g/test-suite-build/SingleSource/UnitTests/C++11 && /usr/local/Cellar/cmake/3.17.2/bin/cmake -E create_symlink /Users/buildslave/jenkins/workspace/test-suite-verify-machineinstrs-x86_64-O0-g/test-suite/SingleSource/UnitTests/C++11/stdthreadbug.reference_output /Users/buildslave/jenkins/workspace/test-suite-verify-machineinstrs-x86_64-O0-g/test-suite-build/SingleSource/UnitTests/C++11/stdthreadbug.reference_output
[4529/7672] /Users/buildslave/jenkins/workspace/test-suite-verify-machineinstrs-x86_64-O0-g/test-suite-build/tools/timeit --summary SingleSource/UnitTests/ObjC/CMakeFiles/dot-syntax-2.dir/dot-syntax-2.m.o.time /Users/buildslave/jenkins/workspace/test-suite-verify-machineinstrs-x86_64-O0-g/compiler/bin/clang -DNDEBUG  -B /Applications/    -Wno-unused-command-line-argument -mllvm -verify-machineinstrs -O0 -g -arch x86_64 -isysroot /Applications/   -w -Werror=date-time -MD -MT SingleSource/UnitTests/ObjC/CMakeFiles/dot-syntax-2.dir/dot-syntax-2.m.o -MF SingleSource/UnitTests/ObjC/CMakeFiles/dot-syntax-2.dir/dot-syntax-2.m.o.d -o SingleSource/UnitTests/ObjC/CMakeFiles/dot-syntax-2.dir/dot-syntax-2.m.o   -c /Users/buildslave/jenkins/workspace/test-suite-verify-machineinstrs-x86_64-O0-g/test-suite/SingleSource/UnitTests/ObjC/dot-syntax-2.m
[4530/7672] : && /Users/buildslave/jenkins/workspace/test-suite-verify-machineinstrs-x86_64-O0-g/test-suite-build/tools/timeit --summary SingleSource/UnitTests/ObjC/ /Users/buildslave/jenkins/workspace/test-suite-verify-machineinstrs-x86_64-O0-g/compiler/bin/clang -B /Applications/    -Wno-unused-command-line-argument -mllvm -verify-machineinstrs -O0 -g -arch x86_64 -isysroot /Applications/ -Wl,-search_paths_first -Wl,-headerpad_max_install_names -B /Applications/ SingleSource/UnitTests/ObjC/CMakeFiles/dot-syntax-2.dir/dot-syntax-2.m.o  -o SingleSource/UnitTests/ObjC/dot-syntax-2  -Wl,-no_pie -lobjc -framework Foundation && cd /Users/buildslave/jenkins/workspace/test-suite-verify-machineinstrs-x86_64-O0-g/test-suite-build/SingleSource/UnitTests/ObjC && /usr/local/Cellar/cmake/3.17.2/bin/cmake -E create_symlink /Users/buildslave/jenkins/workspace/test-suite-verify-machineinstrs-x86_64-O0-g/test-suite/SingleSource/UnitTests/ObjC/dot-syntax-2.reference_output /Users/buildslave/jenkins/workspace/test-suite-verify-machineinstrs-x86_64-O0-g/test-suite-build/SingleSource/UnitTests/ObjC/dot-syntax-2.reference_output
[4531/7672] /Users/buildslave/jenkins/workspace/test-suite-verify-machineinstrs-x86_64-O0-g/test-suite-build/tools/timeit --summary SingleSource/UnitTests/CMakeFiles/matrix-types-spec.dir/matrix-types-spec.cpp.o.time /Users/buildslave/jenkins/workspace/test-suite-verify-machineinstrs-x86_64-O0-g/compiler/bin/clang++  -DNDEBUG  -B /Applications/    -Wno-unused-command-line-argument -mllvm -verify-machineinstrs -O0 -g -arch x86_64 -isysroot /Applications/   -w -Werror=date-time -fenable-matrix -MD -MT SingleSource/UnitTests/CMakeFiles/matrix-types-spec.dir/matrix-types-spec.cpp.o -MF SingleSource/UnitTests/CMakeFiles/matrix-types-spec.dir/matrix-types-spec.cpp.o.d -o SingleSource/UnitTests/CMakeFiles/matrix-types-spec.dir/matrix-types-spec.cpp.o -c /Users/buildslave/jenkins/workspace/test-suite-verify-machineinstrs-x86_64-O0-g/test-suite/SingleSource/UnitTests/matrix-types-spec.cpp
FAILED: SingleSource/UnitTests/CMakeFiles/matrix-types-spec.dir/matrix-types-spec.cpp.o 
/Users/buildslave/jenkins/workspace/test-suite-verify-machineinstrs-x86_64-O0-g/test-suite-build/tools/timeit --summary SingleSource/UnitTests/CMakeFiles/matrix-types-spec.dir/matrix-types-spec.cpp.o.time /Users/buildslave/jenkins/workspace/test-suite-verify-machineinstrs-x86_64-O0-g/compiler/bin/clang++  -DNDEBUG  -B /Applications/    -Wno-unused-command-line-argument -mllvm -verify-machineinstrs -O0 -g -arch x86_64 -isysroot /Applications/   -w -Werror=date-time -fenable-matrix -MD -MT SingleSource/UnitTests/CMakeFiles/matrix-types-spec.dir/matrix-types-spec.cpp.o -MF SingleSource/UnitTests/CMakeFiles/matrix-types-spec.dir/matrix-types-spec.cpp.o.d -o SingleSource/UnitTests/CMakeFiles/matrix-types-spec.dir/matrix-types-spec.cpp.o -c /Users/buildslave/jenkins/workspace/test-suite-verify-machineinstrs-x86_64-O0-g/test-suite/SingleSource/UnitTests/matrix-types-spec.cpp
Intrinsic name not mangled correctly for type arguments! Should be: llvm.matrix.column.major.load.v9f64
Fatal Error: error in backend: Broken function found, compilation aborted!
Intrinsic name not mangled correctly for type arguments! Should be: llvm.matrix.column.major.load.v9f64
<9 x double> (double*, i64, i1, i32, i32)* @llvm.matrix.column.major.load.v9f64.p0f64
Intrinsic name not mangled correctly for type arguments! Should be:
void (<9 x double>, double*, i64, i1, i32, i32)*
in function _Z13transposeSpecIdLj3ELj3EEvPT_S1_
fatal error: error in backend: Broken function found, compilation aborted!
PLEASE submit a bug report to and include the crash backtrace, preprocessed source, and associated run script.
Stack dump:
Error: clang frontend command failed with exit code 70 (use -v to see invocation)
25 clang++       0x00000001034e6d4d clang::driver::Compilation::ExecuteJobs(clang::driver::JobList const&, llvm::SmallVectorImpl<std::__1::pair<int, clang::driver::Command const*> >&) const + 125
26 clang++       0x00000001034fb20c clang::driver::Driver::ExecuteCompilation(clang::driver::Compilation&, llvm::SmallVectorImpl<std::__1::pair<int, clang::driver::Command const*> >&) + 204
27 clang++       0x000000010108cb25 main + 10389
28 libdyld.dylib 0x00007fff696f7cc9 start + 1
29 libdyld.dylib 0x0000000000000019 start + 18446603338747249489
clang-11: error: clang frontend command failed with exit code 70 (use -v to see invocation)
clang version 11.0.0 ( ce6f0303df51667f42a2a63eb292ab7c0c125eea)
Target: x86_64-apple-darwin19.5.0

Build Log

  1. [libc++] Fix test failure in C++03 mode (details)
  2. [libc++] Move the stdlib Lit parameter to the DSL (details)
  3. [libc++] Move the long_tests Lit feature to the DSL (details)
  4. Merge TableGen files used for clang options (details)
  5. [ValueLattice] Simplify canTrackGlobalVariableInterprocedurally (NFC). (details)
  6. [Function] Lock the function when parsing call site info (details)
  7. [lldb/Function] Reflow doxygen comments for member variables, NFC (details)
  8. [libc++] Clean up some outdated documentation about running libc++ tests (details)
  9. [PowerPC] Fix test case from beb52b12cb17 (details)
  10. [X86] Directly emit X86ISD::BLENDV instead of VSELECT in a few places that were emitting sign bit tests. (details)
  11. [PGO][PGSO] Add profile guided size optimization to X86 ISel Lowering. (details)
  12. Remove unnecessary 'rm' in llvm-reduce tests (details)
  13. [X86] Immediately call LowerShift from lowerBuildVectorToBitOp. (details)
  14. [libc++] Move the enable_experimental Lit param to the DSL (details)
  15. [InstSimplify] Don't fold vectors of partial undef in SimplifySelectInst if the non-undef element value might produce poison (details)
  16. Fix [-Werror,-Wsign-compare] warnings arising from subsection symbols patch. (details)
  17. [libc++] The enable_experimental Lit feature should be False by default (details)
  18. [OPENMP50] extend array section for stride (Parsing/Sema/AST) (details)
  19. [NFC][test] Adding fastcc test case for promoted 16-bit integer bitcasts. (details)
  20. [lldb/Reproducers] Rename developer-oriented reproducer flags. (details)
  21. [LLDB/Reproducers] Add flag to avoid installing the signal handler. (details)
  22. [NFC][AArch64] Refactor getArgumentPopSize (details)
  23. [AST][test] Add regression test forPointerExprEvaluator::VisitCXXNewExpr (details)
  24. [MLIR] IR changes to add yield semantics for affine.if and affine.parallel (details)
  25. [Clang][Driver] Recognize the AIX OBJECT_MODE environment setting (details)
  26. [libc++] Get rid of the %{libcxx_src_root} substitution (details)
  27. [InstSimplify] Re-enable select ?, undef, X -> X transform when X is provably not poison (details)
  28. [SVE] Remove calls to VectorType::getNumElements from CodeGen (details)
  29. [LPM] Port CGProfilePass from NPM to LPM (details)
  30. [CMake][Fuchsia] Support for building with MSVC (details)
  31. Revert "[InstCombine] Lower infinite combine loop detection thresholds" (details)
  32. [Docs] CodingStandards: for_each is discouraged (details)
  33. [NFCI][llvm-reduce] OperandBundleCounter: drop pointless constructor (details)
  34. [NFC][llvm-reduce] Purify for_each usage in Operand Bundles into range-based for loop (details)
  35. [llvm-reduce] Reducing attributes (details)
  36. [CallGraph] Ignore callback uses (details)
  37. Revert D83013 "[LPM] Port CGProfilePass from NPM to LPM" (details)
  38. Temporarily Revert "[PowerPC] Split s34imm into two types" (details)
  39. Temporarily Revert "Fix [-Werror,-Wsign-compare] warnings arising from subsection symbols patch." (details)
  40. Revert "[CallGraph] Ignore callback uses" (details)
  41. [PredicateInfo] Print RenamedOp (NFC) (details)
  42. [DAGCombiner] add helper function to manage list of consecutive stores; NFC (details)
  43. [DAGCombiner] add helper function for store merging of constants; NFC (details)
  44. [DAGCombiner] add helper function for store merging of extracts; NFC (details)
  45. [DAGCombiner] add helper function for store merging of loaded values; NFC (details)
  46. [DAGCombiner] convert if-chain in store merging to switch; NFC (details)
  47. [AMDGPU] Return restricted number of regs from TTI (details)
  48. Recommit "[X86] Merge the FEATURE_64BIT and FEATURE_EM64T bits in X86TargetParser.def." (details)
  49. [FileCheck] Improve -dump-input documentation (details)
  50. [PowerPC][Power10] Add Instruction definition/MC Tests for Load/Store Rightmost VSX Vector (details)
  51. [Lexer] Fix missing coverage line after #endif (details)
  52. Switch to using -debug-info-kind=constructor as default (from =limited) (details)
  53. [flang] Fix a crash when creating generics from a copy (details)
  54. Revert "[Lexer] Fix missing coverage line after #endif" (details)
  55. [flang] Fix frontend build with -DBUILD_SHARED_LIBS=On (details)
  56. [flang] ifdef to avoid warning about supposedly dead function (details)
  57. [AArch64][SVE] Add lowering for llvm.fma. (details)
  58. Initial boiler-plate for python bindings. (details)
  59. [NFC] Extract the code to write instr profile into function writeInstrProfile (details)
  60. [NFC] Change getEntryForPercentile to be a static function in ProfileSummaryBuilder. (details)
  61. [NFC] Derive from PassInfoMixin for no-op/printing passes (details)
  62. [AArch64][GlobalISel] Add more specific debug info tests for 613f12dd8e2403f5630ab299d2a1bb2cb111ead1. (details)
  63. [MLIR][SPIRV] Support two memory access attributes in OpCopyMemory. (details)
  64. Move default argument instantiation to SemaTemplateInstantiateDecl.cpp. (details)
  65. Push parameters into the local instantiation scope before instantiating (details)
  66. PR46648: Do not eagerly instantiate default arguments for a generic (details)
  67. [Sanitizer] Update macOS version checking (details)
  68. [StackSafety,NFC] Reduce FunctionSummary size (details)
  69. [lldb] Declare extern template instantiation to fix linking issues. (details)
  70. [SCEV][IndVarSimplify] insert point should not be block front. (details)
  71. CrashTracer: clang at clang: llvm::BitstreamWriter::ExitBlock (details)
  72. [demangler] Don't allow the template parameters from the <encoding> in a (details)
  73. Add Python bindings guide. (details)
  74. [CMake][Fuchsia] Move runtimes to outer scope (details)
  75. [demangler] More properly save and restore the template parameter state (details)
  76. [NFC] Separate bitcode reading for FUNC_CODE_INST_CMPXCHG(_OLD) (details)
  77. [llvm-symbolizer][test] Fix options-from-env.test (details)
  78. [CodeMoverUtils] Move OrderedInstructions to CodeMoverUtils (details)
  79. [clangd] Factor out some helper functions related to heuristic resolution in TargetFinder (details)
  80. [RISCV] Refactor FeatureRVCHints to make ProcessorModel more intuitive (details)
  81. Add diagnostic option backing field for -fansi-escape-codes (details)
  82. [LLDB] Update AArch64 Dwarf and EH frame register numbers (details)
  83. [CodeGen] Replace calls to getVectorNumElements() in SelectionDAG::SplitVector (details)
  84. [MLIR][SPIRVToLLVM] Conversion of SPIR-V struct type without offset (details)
  85. [WebAssembly][NFC] Simplify vector shift lowering and add tests (details)
  86. [CodeGen] Replace calls to getVectorNumElements() in DAGTypeLegalizer::SetSplitVector (details)
  87. [BDCE] SExt -> ZExt when no sign bits is used and instruction has multiple uses (details)
  88. [builtins] Optimize udivmodti4 for many platforms. (details)
  89. [analyzer][tests] Measure peak memory consumption for every project (details)
  90. [analyzer][tests] Make test interruption safe (details)
  91. [analyzer][tests] Fix zip unpacking (details)
  92. [X86][AVX] Attempt to fold PACK(SHUFFLE(X,Y),SHUFFLE(X,Y)) -> SHUFFLE(PACK(X,Y)). (details)
  93. Fix check-all with -DLLVM_USE_SANITIZER=Address (details)
  94. extractConstantWithoutWrapping - use const APInt& returned by SCEVConstant::getAPInt() (details)
  95. [AMDGPU][GlobalISel] Fix G_AMDGPU_TBUFFER_STORE_FORMAT mapping (details)
  96. [LV] Pick vector loop body as insert point for SCEV expansion. (details)
  97. [clang-tidy] More strict on matching the standard memset function in memset-usage check. (details)
  98. [lldb/pecoff] Use a different llvm createBinary overload for parsing (details)
  99. [SVE] Code generation for fixed length vector truncates. (details)
  100. [NFC] Change isFPPredicate comparison to ignore lower bound (details)
  101. [X86][SSE] Use shouldUseHorizontalOp helper to determine whether to use (F)HADD. NFCI. (details)
  102. StackSafetyAnalysis.cpp - pass ConstantRange arg as const reference. (details)
  103. [clang-tidy] Use Options priority in enum options where it was missing (details)
  104. DomTreeUpdater::dump() - use const auto& iterator in for-range-loop. (details)
  105. [ABI] Handle C++20 [[no_unique_address]] attribute (details)
  106. [PowerPC] Implement R_PPC64_REL24_NOTOC calls, callee also has no TOC (details)
  107. [clangd] Config: If.PathExclude (details)
  108. Revert "[BasicAA] Enable -basic-aa-recphi by default" (details)
  109. Reland "[FPEnv][Clang][Driver] Disable constrained floating point on targets lacking support." (details)
  110. Normalize default value for -triple correctly (details)
  111. [mlir][Vector] Fold chains of ExtractOp (details)
  112. [clangd] Fix hover crash on InitListExpr. (details)
  113. [mlir][Linalg] Generalize Vectorization of Linalg contractions (details)
  114. [FPEnv][Clang][Driver] Disable constrained floating point on targets lacking support." (details)
  115. [NFCI][InstCombine] PR46661: multiple stores eligible for merging into successor - worklist issue (details)
  116. [InstCombine] After merging store into successor, queue prev. store to be visited (PR46661) (details)
  117. Reland "[InstCombine] Lower infinite combine loop detection thresholds"" (details)
  118. [clangd] Update semanticTokens support to reflect latest LSP draft (details)
  119. [PDB] Fix out-of-bounds acces when sorting GSI buckets (details)
  120. [FileCheck] Implement -dump-input-context (details)
  121. [FileCheck] In input dump, elide only if ellipsis is shorter (details)
  122. [FileCheck] Implement -dump-input-filter (details)
  123. [mlir][Vector] Add ExtractOp folding when fed by a TransposeOp (details)
  124. [DAGCombiner] move/rename variables for readability; NFC (details)
  125. [AArch64][x86] add tests for rotated store merge; NFC (details)
  126. [ARM] Add test with tcreturn and debug value. (details)
  127. [DomTreeUpdater] Use const auto * when iterating over pointers (NFC). (details)
  128. [Attributor][NFC] Update tests after recent changes (details)
  129. [ARM] Pass -verify-machineinstr to test and XFAIL until fixed. (details)
  130. Delete, since it should have happened in D82574 (details)
  131. Revert "[OpenMPOpt] ICV Tracking" (details)
  132. [LPM] Port CGProfilePass from NPM to LPM (details)
  133. [Lexer] Fix missing coverage line after #endif (details)
  134. [NFC][PowerPC] Add a new MIR file to test mi-peephole pass (details)
  135. Fix crash on `user defined literals` (details)
  136. Add kinded UDL for raw literal operator and  numeric literal operator template (details)
  137. Use FileRange::text instead of Lexer::getSpelling (details)
  138. repair standalone clang builds (details)
  139. Remove clang options that were added back when merging the TableGen files (details)
  140. Revert "[compiler-rt] [test] Use the parent process env as base env in tests" (details)
  141. [CGProfile] Fix layering, IPO depends in Instrumentation. (details)
  142. [ARM] Add Cortex-A78 and Cortex-X1 Support for Clang and LLVM (details)
  143. [IR] Disable select ? C : undef -> C fold in ConstantFoldSelectInstruction unless we know C isn't poison. (details)
  144. Re-land [CodeView] Add full repro to LF_BUILDINFO record (details)
  145. [OpenCL] Fixed typo for ctor stub name in UsersManual (details)
  146. This is a refinement on 96601ec28b7efe5abf3479a1aa91bcedb235bbbd. The intent of that change was to do the same work for the computation of the locations of the children of ValueObjectVariable as was done for the root ValueObjectVariable. This original patch did that by moving the computation from ValueObjectVariable to ValueObject. That fixed the problem but caused a handful of swift-lldb testsuite failures and a crash or two. (details)
  147. Revert "[NFC] Derive from PassInfoMixin for no-op/printing passes" (details)
  148. [PowerPC] Enable default support of quad precision operations (details)
  149. [libc] Add strchr implementation. Fixes bug in memchr. (details)
  150. [NFC] Separate Peeling Properties into its own struct (re-land after minor fix) (details)
  151. [PredicateInfo] Add test for multiple branches on same condition (NFC) (details)
  152. [Sema] Emit a -Wformat warning for printf("%s", (void*)p) (details)
  153. [lldb] on s390x fix override issue (details)
  154. AArch64: Fix unused variables (details)
  155. [mlir] [VectorOps] Allow AXPY to be expressed as special case of OUTERPRODUCT (details)
  156. [AST][ObjC] Fix crash when printing invalid objc categories (details)
  157. [ldb/Reproducers] Add YamlRecorder and MultiProvider (details)
  158. Reland [NFC] Derive from PassInfoMixin for no-op/printing passes (details)
  159. Change behavior with zero-sized static array extents (details)
  160. [mlir] [VectorOps] Merge OUTER/AXPY vector.contract lowering into single case (details)
  161. [analyzer] Silence a warning. (details)
  162. [mlir][Vector]  Add folding for vector.transfer ops (details)
  163. [FileCheck] Fix up -dump-input* docs (details)
  164. [clang-shlib] Don't link with static clang libraries (details)
  165. [Polly] Fix -polly-opt-isl -analyze (details)
  166. [Polly] Fix prevectorization of fused loops. (details)
  167. [mlir][linalg] Improve aliasing approximation for hoisting transfer read/write (details)
  168. [X86] Add isel patterns for matching broadcast vpternlog if the ternlog and the broadcast have different types. (details)
  169. AMDGPU: Remove .value_type from kernel metadata (details)
  170. Temporarily revert "[NFC] Separate bitcode reading for FUNC_CODE_INST_CMPXCHG(_OLD)" (details)
  171. [docs] LLVM Security Group and Process (details)
  172. [PDB] Attempt fix for debug-info-codeview-buildinfo.c test (details)
  173. Remove unnecessary/erroneous "static" from function templates in headers (details)
  174. [libc] [Obvious] Remove unneeded header in strchr. (details)
  175. Revert "Re-land [CodeView] Add full repro to LF_BUILDINFO record" (details)
  176. [Sanitizers] Change protoent test to check for IPv6 instead of RDP (details)
  177. [lldb-vscode] Add Support for Module Event (details)
  178. [lldb-vscode] Add Compile Unit List to Modules View (details)
  179. [lldb-vscode] Fix TestVSCode_module (details)
  180. [OpenMP] Use __OPENMP_NVPTX__ instead of _OPENMP in wrapper headers (details)
  181. [BPI] Compile time improvement when erasing blocks (NFC) (details)
  182. Revert "[lldb-vscode] Fix TestVSCode_module" (details)
  183. [COFF] Add cg_profile directive and section (details)
  184. [OpenMP][NFC] Remove unused and untested code from the device runtime (details)
  185. [openmp] Remove OMPConstants.cpp and replace it by OMP.cpp generated by tablegen (details)
  186. Fix nesting of #ifdef (details)
  187. [InstSimplify] add tests for maxnum (PR46627); NFC (details)
  188. [CodeGen] Store the return value of the target function call to the (details)
  189. Reland "[OpenMPOpt] ICV Tracking" (details)
  190. Fix build error (details)
  191. Create TestReducer pass (details)
  192. [openmp] Fix warning in generated OMP.cpp (details)
  193. [WebAssembly] Prefer v128.const for constant splats (details)
  194. Summary: [clang] Provide a way for WhileStmt to report the location of its LParen and RParen. (details)
  195. [RISCV][test] Add a test for (mul (add x, c1), c2) -> (add (mul x, c2), c1*c2) transformation (details)
  196. [PowerPC][MachinePipeliner] Enable pipeliner if hasInstrSchedModel (details)
  197. [X86][MMX] Optimize MMX shift intrinsics. (details)
  198. [HIP] Fix rocm detection (details)
  199. [lldb/Test] Fix missing yaml2obj in Xcode standalone build. (details)
  200. [OpenMP][CUDA] Fix std::complex in GPU regions (details)
  201. Fix signed vs unsigned comparison warnings a different way. (details)
  202. [OpenMP][NFC] Remove unused (always fixed) arguments (details)
  203. [OpenMP][NFC] Fix some typos (details)
  204. [OpenMP][NFC] Add convenient helper and early exit check (details)
  205. [OpenMP] Identify GPU kernels (aka. OpenMP target regions) (details)
  206. [OpenMP] Compute a proper module slice for the CGSCCC pass (details)
  207. [OpenMP] Replace function pointer uses in GPU state machine (details)
  208. Remove unused variable `KMPC_KERNEL_PARALLEL_WORK_FN_PTR_ARG_NO` (NFC) (details)
  209. [OpenMP][FIX] remove unused variable and long if-else chain (details)
  210. [clang-tidy] Reworked enum options handling(again) (details)
  211. Fix gn builds after 943660fd1 (details)
  212. Revert "Fix gn builds after 943660fd1" (details)
  213. Reland Fix gn build after 943660f (details)
  214. [gn build] (manually) merge 943660fd15f193 (details)
  215. Revert "Reland "[InstCombine] Lower infinite combine loop detection thresholds""" (details)
  216. [TRE] allow TRE for non-capturing calls. (details)
  217. [AMDGPU] Move LowerSwitch pass to CodeGenPrepare. (details)
  218. [Attributor][NFC] Add more debug output for deleted functions (details)
  219. [fix-irreducible] Skip unreachable predecessors. (details)
  220. Fix `-Wunused-variable` warnings. NFC. (details)
  221. [MLIR] Parallelize affine.for op to 1-D affine.parallel op (details)
  222. [flang][openmp] Check clauses allowed semantic with tablegen generated map (details)
  223. Fix regression due to test hip-version.hip (details)
  224. [OpenMP] Silence unused symbol warning with proper ifdefs (details)
  225. [openmp] Remove unused variable in DirectiveEmitter (details)
  226. [examples] fix ExceptionDemo (details)
  227. [X86] Add test cases for missed opportunities to use vpternlog due to a bitcast between the logic ops. (details)
  228. Fix some memory leak in MLIRContext with respect to registered types/attributes interfaces (details)
  229. Fix one memory leak in the MLIRParser by using std::unique_ptr to hold the new block pointer (details)
  230. Fix `-Wreturn-type` warning. NFC. (details)
  231. [NewGVN] Regenerate test checks (NFC) (details)
  232. [Attributor] Introudce attribute seed allow list. (details)
  233. [llvm-objdump][test] Move tests after dc4a6f5db4f0178bae43ef615cc8902c759d6195 (details)
  234. [COFF] Fix endianness of section data (details)
  235. [SCCP] Add test for predicate info condition handling (NFC) (details)
  236. [Windows SEH] Fix the frame-ptr of a nested-filter within a _finally (details)
  237. [DAGCombiner] tighten fast-math constraints for fma fold (details)
  238. [NFC] Fix comment style in MLIR unittests to conform to LLVM coding standards. (details)
  239. [AVRInstPrinter] printOperand: support llvm-objdump --print-imm-hex (details)
  240. [SCCP] Extend nonnull metadata test (NFC) (details)
  241. [LLD][ELF][AVR] Implement the missing relocation types (details)
  242. BPF: permit .maps section variables with typedef type (details)
  243. [LV] Fixing versioning-for-unit-stide of loops with small trip count (details)
  244. [clang-format] PR46609 clang-format does not obey `PointerAlignment: Right` for ellipsis in declarator for pack (details)
  245. [X86] Fix two places that appear to misuse peekThroughOneUseBitcasts (details)
  246. [X86] Consistently use 128 as the PSHUFB/VPPERM index for zero (details)
  247. [polly] NFC clang-format change following D83564 (details)
  248. [Matrix] Tighten LangRef definitions and Verifier checks. (details)
  249. Revert "[Matrix] Tighten LangRef definitions and Verifier checks." (details)
  250. [InstCombine] fold mul of zext/sext bools to 'and' (details)
  251. [X86] Add CPU name strings to getIntelProcessorTypeAndSubtype and getAMDProcessorTypeAndSubtype in compiler-rt. (details)
  252. [X86] Add CPU string output to getIntelProcessorTypeAndSubtype/getAMDProcessorTypeAndSubtype in Host.cpp (details)
  253. [X86] Remove model number based detection for 'pentiumpro', 'pentium2', 'pentium3', 'pentium-m', and 'yonah' from getHostCPUName. (details)
  254. [mlir][ODS] Add support for specifying the namespace of an interface. (details)
  255. Revert "[TRE] allow TRE for non-capturing calls." (details)
  256. Bump the default target CPU for i386-freebsd to i686 (details)
  257. [Attributor] Add AAValueSimplifyCallSiteArgument::manifest (details)
  258. [clang] Add -Wsuggest-override (details)
  259. [X86] Rename X86_CPU_TYPE_COMPAT_ALIAS/X86_CPU_TYPE_COMPAT/X86_CPU_SUBTYPE_COMPAT macros. NFC (details)
  260. Rename/refactor isIntegerConstantExpression to getIntegerConstantExpression (details)
  261. Revert "Rename/refactor isIntegerConstantExpression to getIntegerConstantExpression" (details)
  262. [OpenMP] Add firstprivate as a default data-sharing attribute to clang (details)
  263. [MC][RISCV] Set UseIntegratedAssembler to true (details)
  264. [PowerPC] Support constrained conversion in SPE target (details)
  265. [PowerPC] Enhance tests for D83276. NFC. (details)
  266. [InstCombine] Improve select -> phi canonicalization: consider more blocks (details)
  267. [clangd] Fix tests build for GCC5 (details)
  268. [MLIR][Shape] Lower `shape.any` (details)
  269. [GlobalISel][InlineAsm] Fix buildCopy for inputs (details)
  270. Fix bad doxygen result for class clang::ento::CallEvent and its derived classes (details)
  271. [clangd] Add metrics for recovery-expr type propagation. (details)
  272. [clang][RecoveryExpr] Clarify the dependence-bits documentation. (details)
  273. [SVE][Codegen] Add a helper function for pointer increment logic (details)
  274. [clang] Include type specifiers in typo correction when checking isCXXDeclarationSpecifiers. (details)
  275. [AMDGPU][GlobalISel] Select llvm.amdgcn.ballot (details)
  276. [mlir][VectorOps] Lower vector.fma to llvm.fmuladd instead of llvm.fma (details)
  277. [OpenCL] Defer addr space deduction for dependent type. (details)
  278. [LLD][ELF] -  Allow relocation sections to appear before their target sections. (details)
  279. [LLD][ELF][Windows] small improvement to D82567 (details)
  280. [libc][benchmark] Add display option to render.py3 (details)
  281. [lldb][NFC] Remove misleading class_language variable in DWARFASTParserClang (details)
  282. [SVE] Ensure fixed length vector fptrunc operations bigger than NEON are not considered legal. (details)
  283. [lldb][NFC] Early-exit in DWARFASTParserClang::ParseSingleMember (details)
  284. [llvm-readobj] - Add a generic test for --dyn-relocations and fix an issue. (details)
  285. [AMDGPU][GlobalISel] Fix subregister index for EXEC register in selectBallot. (details)
  286. [COFF] Error on unexpected .pdata size (details)
  287. [LLD][ELF] - Fix the test after llvm-readelf output change. (details)
  288. [analyzer] ctu-on-demand-parsing tests: replace linux -> system-linux (details)
  289. [ARM][MVE] Refactor option -disable-mve-tail-predication (details)
  290. [DAGCombiner] allow load/store merging if pairs can be rotated into place (details)
  291. Revert "[DAGCombiner] allow load/store merging if pairs can be rotated into place" (details)
  292. [DAGCombiner] allow load/store merging if pairs can be rotated into place (details)
  293. [clangd] Fix DocumentSymbol ranges (details)
  294. [lldb][NFC] Refactor instruction dumping out of DumpDataExtractor (details)
  295. [yaml2obj] - Refactor header-sh-fields.yaml test. (details)
  296. Fix crash when getVFABIMappings is called with an indirect call instruction (details)
  297. Pre-commit tests (details)
  298. [SLPVectorizer] handle vectorizeable library functions (details)
  299. [NFC] rename to reflect F is not necessarily an Intrinsic (details)
  300. [lldb/dotest] Remove the "xunit" result formatter (details)
  301. [ms] [llvm-ml] Improve MASM STRUCT field accessor support (details)
  302. [ms] [llvm-ml] Fix MASM support for nested unnamed STRUCTs and UNIONs (details)
  303. [compiler-rt][CMake] Pass down LLVM_LIT_ARGS in runtime build (details)
  304. [ms] [llvm-ml] Add support for MASM STRUCT casting field accessors: (<TYPE> PTR <value>).<field> (details)
  305. [lldb/Utility] Rewrite Scalar::SetValueFromCString (details)
  306. [ms] [llvm-ml] Restore omitted changes requested by reviewer (details)
  307. [OPENMP]Fix compiler crash for target data directive without actual target codegen. (details)
  308. [flang][openmp] libc++ unordered_map build fix in flang openmp static analysis (details)
  309. Fix llvm-test-suite failure introduced by D82550/D83122 (details)
  310. [ADT] Make Load(AP)IntFromMemory pointer argument const (details)
  311. [llvm-ar][test][AIX] Unsupport error-opening-directory.test on AIX (details)
  312. [ARM][NFC] More detailed vbsl checks in ARM & Thumb2 tests. (details)
  313. [x86] add tests for bswap/rotate; NFC (details)
  314. [DAGCombiner] rot i16 X, 8 --> bswap X (details)
  315. [PGO][PGSO] Add profile guided size optimization to the X86 LEA fixup. (details)
  316. [llvm] Native size estimator for training -Oz inliner (details)
  317. [JITLink] Add a synchronous version of finalize for convenience. (details)
  318. [ORC] Generalize emit re-entry, stub, etc. APIs for working addr != link addr. (details)
  319. [gn build] Port 83080a294ad (details)
  320. [PGO][PGSO] Add profile guided size optimization to X86ISelDAGToDAG. (details)
  321. [libc++] Implement P0551 (details)
  322. RISCV: Avoid GlobalISel build break in a future patch (details)
  323. TableGen/GlobalISel: Emit enum names for reg class ID instead of value (details)
  324. [llvm][NFC] ML Policies: changed the saved_model protobuf to text (details)
  325. AMDGPU/GlobalISel: Add tests for 96-bit add/sub/mul (details)
  326. [AST] Fix potential nullptr dereference in Expr::HasSideEffects (details)
  327. [gn build] Port fdb69539bcd (details)
  328. [NewPM][opt] Translate -foo-analysis to require<foo-analysis> (details)
  329. Fix HexagonGenExtract return status (details)
  330. [NFC] Remove unused header include (details)
  331. [clangd] Remove const_cast. NFC (details)
  332. AMDGPU/GlobalISel: Add baseline add/sub sat legalization tests (details)
  333. GlobalISel: Implement widenScalar for saturating add/sub (details)
  334. GlobalISel: Implement fewerElementsVector for saturating add/sub (details)
  335. GlobalISel: Define equivalent nodes for saturating add/sub (details)
  336. [JITLink] Apply MSVCPError workaround to a1fc26030a42. (details)
  337. [NewGVN] Rename xfail tests (NFC) (details)
  338. [NewGVN] Separate passing assume tests (NFC) (details)
  339. [PredicateInfo] Place predicate info after assume (details)
  340. [flang] Use octal escapes for character literals in modfiles (details)
  341. [llvm][NFC] Factored the default inlining advice (details)
  342. [ORC] Remove a spurious reinterpret_cast. (details)
  343. [lldb] Fix a CMake warning typo. NFC. (details)
  344. Add a decorator to skip tests when running under Rosetta (details)
  345. Revert "[llvm] Native size estimator for training -Oz inliner" (details)
  346. [mlir][StandardToSPIRV] Fix conversion for signed remainder (details)
  347. [gn build] Port 9908a3b9f52 (details)
  348. [mlir] Support operations with multiple results in slicing (details)
  349. [flang] Extended the flang driver options to include gfortran equivalents to pgf90 specific options. (details)
  350. [MLIR] Change ODS collective params build method to provide an empty default value for named attributes (details)
  351. [lldb] Remove unused argument (NFC) (details)
  352. Retry ""[lldb-vscode] Fix TestVSCode_module"" (details)
  353. [ADT] Specialize std::swap() for SetVector (details)
  354. [mlir] Add alignment attribute to LLVM memory ops and use in vector.transfer (details)
  355. [MC/AsmParser] layout-interdependency.s depends on having a proper triple (details)
  356. [debugify] Add targeted test for 2fa656c, NFC (details)
  357. [analyzer] Inline StringSet that's defined in a header (details)
  358. [ubsan] Check implicit casts in ObjC for-in statements (details)
  359. [Sanitizers] Implement getcpuclockid interceptor (details)
  360. [compiler-rt][MSAN][test] Update buffersize for UTF-8 to C convert (details)
  361. Check output in test/CodeGen/Generic/MIRStripDebug/no-metadata-present.mir, NFC (details)
  362. Revert "[InstCombine] Drop debug loc in TryToSinkInstruction (reland)" (details)
  363. [InstCombine] Erase attribute lists for simplified libcalls (details)
  364. [compiler-rt] Fix compiler warnings and runtime errors in sanitizer RT strxfrm(_l) test cases. (details)
  365. Update for D71491 (details)
  366. Lowering of OpenMP Parallel operation to LLVM IR 1/n (details)
  367. Fold the opt size check into the assert to silence an unused variable warning. (details)
  368. [AssumeBundles] Use operand bundles to encode alignment assumptions (details)
  369. [Sanitizers] Ensure clock_getcpuclockid interceptor <= 80 chars (details)
  370. [ORC] Fix typo in parameter name. (details)
  371. Reapply "[llvm] Native size estimator for training -Oz inliner" (details)
  372. [llvm][NFC] ML InlineAdvisor: Factored CHECKs in common test (details)
  373. MemorySanitizer: If a field is marked noundef, check init at call site (details)
  374. Fix a missing update that C compiles default to gnu17. (details)
  375. [gn build] Port caf395ee8c2 (details)
  376. [builtins][Android] Define HAS_80_BIT_LONG_DOUBLE to 0 (details)
  377. [builtins] Cleanup generic-file filtering (details)
  378. [compiler-rt][Android] Stop using detect_target_arch (details)
  379. [builtins][ARM] Replace call_apsr.S with inline asm (details)
  380. [PowerPC] Fix combineVectorShuffle regression after D77448 (details)
  381. Basic support for flexible array members in constant evaluation. (details)
  382. [llvm][NFC] Removed unused CHECKs in a ml test (details)
  383. [MSAN] Implement experimental vector reduction intrinsics (details)
  384. [flang][openacc] OpenACC 3.0 parser (details)
  385. [lldb-vscode] Fix TestVSCode_module (details)
  386. [flang][openacc] Add Support library for error handling (details)
  387. [lldb-vscode] Fix TestVSCode_setBreakpoints (details)
  388. Fix undefined behavior in DWARF emission (details)
  389. [GVN] add early exit to ConstantFoldLoadThroughBitcast [NFC] (details)
  390. [VNCoercion] avoid creating bitcast for zero offsets [NFCI] (details)
  391. [GVN] teach ConstantFolding correct handling of non-integral addrspace casts (details)
  392. Add LINK_COMPONENTS Support (details)
  393. Revert "[flang][openacc] OpenACC 3.0 parser" (details)
  394. [PowerPC] Generate CFI directives when probing in prologue (details)
  395. [DWARFYAML] Replace Is64bit with Is64BitAddrSize. NFC. (details)
  396. [AArch64][GlobalISel] Add post-legalize combine for sext_inreg(trunc(sextload)) -> copy (details)
  397. [PowerPC][Power10] Implement Test LSB by Byte Builtins in LLVM/Clang (details)
  398. [AMDGPU] Propagate dead flag during pre-RA exec mask optimizations (details)
  399. [deadargelim] Attach dbg info to the insert/extractvalue instructions (details)
  400. [AMDGPU][NFC] Tidy sgpr-control-flow.ll whitespace (details)
  401. [SVE][CodeGen] Fix implicit TypeSize->uint64_t conversion in TransformFPLoadStorePair (details)
  402. [SVE] Fix implicit TypeSize->uint64_t conversion getCastInstrCost (details)
  403. [clangd] Implement textDocument/foldingRange (details)
  404. [SVE][CodeGen] Add README for SVE-related warnings in tests (details)
  405. [NFCI][InstCombine] Move store merging from `visitStoreInst()` into `visitUnconditionalBranchInst()` (details)
  406. Double check that passes correctly set their Modified status (details)
  407. [AMDGPU] Avoid using s_cmpk when src0 is not register (details)
  408. Revert "[compiler-rt] [test] Allow expanding lit substitutions recursively" (details)
  409. [AArch64][SVE] Remove erroneous assert in resolveFrameOffsetReference (details)
  410. Revert "Revert "[compiler-rt] [test] Use the parent process env as base env in tests"" (details)
  411. [analyzer][tests] Introduce analyzer benchmarking framework (details)
  412. [analyzer][tests] Add 5 more projects for testing (details)
  413. [ARM][MVE] Only tail-fold integer add reductions (details)
  414. [AMDGPU] Fix typos in performCtlz_CttzCombine() (details)
  415. [DebugInfo] Add unit test for compact expression printer (details)
  416. [llvm-objdump] Add simple memory expressions to variable display (details)
  417. [llvm-objdump] Add entry_value and stack_value opcodes (details)
  418. [llvm][unittests] Fix ProgramEnvTest.TestExecuteAndWaitStatistics on Solaris (details)
  419. [gn build] Port c15e04ee5e4 (details)
  420. [ELF] Do not leave undefined symbols (specified by -init and -fini) if they are defined in non-fetched archive members (details)
  421. [DebugInfo] Add unit tests for DWARFListTableHeader::length(). (details)
  422. [DebugInfo] Fix a possible crash when reading a malformed .debug_*lists section. (details)
  423. [gn build] Port dd6faf13d8e (details)
  424. [AArch64][AsmParser] Add rcpc support in .arch_extension (details)
  425. [MLIR][Standard] Add `assert` operation to the standard dialect (details)
  426. [MLIR][Standard] Erase redundant assertions `std.assert` (details)
  427. [NFC][ARM] Add SimplifyCFG tests (details)
  428. Revert "[RISCV] Avoid Splitting MBB in RISCVExpandPseudo" (details)
  429. [yaml2obj] - Add a syntax to override e_phoff, e_phentsize and e_phnum fields. (details)
  430. [compiler-rt][sanitizers] Fix GetPcSpBp determination of SP on 32-bit Solaris/x86 (details)
  431. [DWARFYAML] Add support for emitting value forms of strx, addrx, etc. (details)
  432. [lldb/test] Avoid globbing in log file handling code (details)
  433. [SelectionDAG] Prevent warnings when extracting fixed length vector from scalable. (details)
  434. [llvm-readobj] - Stop using unwrapOrError() for all program_headers() calls. (details)
  435. [test/Object][llvm-objdump] - llvm-objdump: don't abort() when the e_phoff field is invalid and refine testing. (details)
  436. [InstCombine][InstSimplify] add tests for sign of maxnum; NFC (details)
  437. [ValueTracking] fix miscompile in maxnum case of cannotBeOrderedLessThanZeroImpl (PR46627) (details)
  438. [yaml2obj] - Refine handling of the NoHeaders key. (details)
  439. [lldb] Refactor character printing in DumpDataExtractor (details)
  440. Revert "[SCEV][IndVarSimplify] insert point should not be block front." (details)
  441. [flang][OpenMP] upstream OpenMP lowering (details)
  442. [NFC][RISCV] Test for D81805 (details)
  443. [RISCV] Fix isStoreToStackSlot (details)
  444. Prohibit use of _ExtInt in atomic intrinsic (details)
  445. [AMDGPU] Simplify AMDGPUSubtarget::getWavesPerEU. NFC. (details)
  446. [clangd] Add library to semantically strip flags by name. (details)
  447. Fix test for the hasExternalFormalLinkage matcher (details)
  448. [ods] Enable getting forward decls allow (details)
  449. [libc++] Use a proper CMake target to represent libc++ headers (details)
  450. [utils] New script `` (details)
  451. [clangd] Config: CompileFlags.Remove (details)
  452. [InstSimplify] add test with nobuiltin attribute (PR46627); NFC (details)
  453. [ValueTracking] fix library to intrinsic mapping to respect 'nobuiltin' attribute (details)
  454. [clangd] Cache config files for 5 seconds, without revalidating with stat. (details)
  455. [clangd] Add missing link dep after 8eb8c92eb46908e (details)
  456. [lldb] Make `process connect` blocking in synchronous mode. (details)
  457. [lldb/Module] Allow for the creation of memory-only modules (details)
  458. [libc++] Fix building the benchmarks after introducing a target for cxx-headers (details)
  459. [clang][NFC] Add 'override' keyword to virtual function overrides (details)
  460. [docs] Update llvm.loop metadata documentation. (details)
  461. [MLIR] [TableGen] Avoid generating an assert which is always true. (details)
  462. [AIX] Remove diff -a option on llvm-cov.test (details)
  463. [MLIR] Add argument related API to Region (details)
  464. [clang] Add 'override' to virtual function overrides generated by ClangAttrEmitter (details)
  465. [NFC] Add 'override' keyword where missing in include/ and lib/. (details)
  466. Fix merging of two arity-only pack deductions. (details)
  467. [clangd] Config: Index.Background (details)
  468. [lldb/Test] Skip on Windows (details)
  469. [flang] Turn off FLANG_ENABLE_WERROR by default (details)
  470. [lit] Prevent hang when lit sees non-ASCII characters (details)
  471. [lldb] lldbinline and lldbtest gardening (NFC) (details)
  472. [lldb] Use runBuildCommands from buildGModules (details)
  473. [clang][aarch64] Generate preprocessor macros for -march=armv8.6a+sve. (details)
  474. [ORC] Don't take ownership of the trampoline pool in LazyReexportsManager. (details)
  475. Update for D71491 (second try) (details)
  476. [MLIR] [NFC] Buffer placement pass - clang tidy warnings (details)
  477. [ObjC] Wrap namespace-global structs in an anonymous namespace to avoid ODR violations (details)
  478. TableGen/GlobalISel: Partially fix nontrivial, custom predicates (details)
  479. [flang][openacc] OpenACC 3.0 parser (details)
  480. Desugar class type for iterator lookup. (details)
  481. [clangd] Make config::Provider::combine non-owning. NFC (details)
  482. [MLIR][StdToSPIRV] Fixed a typo in ops conversion tests (details)
  483. [Matrix] Intrinsic descriptions (details)
  484. [flang] Change the default F18_FC to gfortran (details)
  485. Restore "[WPD/LowerTypeTests] Delay lowering/removal of type tests until after ICP" (details)
  486. llvm-link: Add support for archive files as inputs (details)
  487. Fix a -Wunused-variable warning. (details)
  488. [clangd] Config: on by default (details)
  489. [NFC] Add debug and stat counters to assume queries and assume builder (details)
  490. Call Frame Information (CFI) Handling for Basic Block Sections (details)
  491. [mlir][DialectConversion] Emit an error if an operation marked as erased has live users after conversion (details)
  492. [CallGraph] Ignore callback uses (details)
  493. [mlir] Add support for parsing optional Attribute values. (details)
  494. [flang] Tuning up binary->decimal conversion (details)
  1. Use md5 -q for, to show only the checksum. (details / githubweb)
  2. Add matrix types extension tests. (details / githubweb)

Started by upstream project relay-test-suite-verify-machineinstrs build number 8343
originally caused by:

This run spent:

  • 7.4 sec waiting;
  • 36 min build duration;
  • 36 min total from scheduled to completion.
Revision: a5b58cdd800d0d45b1bdd1f7fe058db6acbfd918
  • refs/remotes/origin/master
Revision: ce6f0303df51667f42a2a63eb292ab7c0c125eea
Repository: http://labmaster3.local/git/llvm-project.git
  • detached
Revision: 4c57b004f148dffc6db199890d91fc3e6e578972
  • refs/remotes/origin/master
Revision: 60cfbf7833b8039b938ce679bed89c738b519e1d
  • refs/remotes/origin/master

Identified problems

Ninja target failed

Below is a link to the first failed ninja target.
Indication 1

Compile Error

This build failed because of a compile error. Below is a list of all errors in the build log:
Indication 2