Started 1 yr 3 mo ago
Took 2 hr 9 min

Build clang-d390805-gf0a68bbc967a-t21558-b21558.tar.gz (Jun 11, 2021 3:02:15 AM)

Issues

Found 9 issues:
Ninja target: block.c.o
[1880/7685] /Users/buildslave/jenkins/workspace/test-suite-verify-machineinstrs-x86_64-O3/test-suite-build/tools/timeit --summary MultiSource/Applications/JM/ldecod/CMakeFiles/ldecod.dir/erc_do_i.c.o.time /Users/buildslave/jenkins/workspace/test-suite-verify-machineinstrs-x86_64-O3/compiler/bin/clang -DNDEBUG  -B /Applications/Xcode.app/Contents/Developer/Toolchains/XcodeDefault.xctoolchain/usr/bin    -Wno-unused-command-line-argument -mllvm -verify-machineinstrs -O3 -arch x86_64 -isysroot /Applications/Xcode.app/Contents/Developer/Platforms/MacOSX.platform/Developer/SDKs/MacOSX10.15.sdk   -w -Werror=date-time -fcommon -D__USE_LARGEFILE64 -D_FILE_OFFSET_BITS=64 -MD -MT MultiSource/Applications/JM/ldecod/CMakeFiles/ldecod.dir/erc_do_i.c.o -MF MultiSource/Applications/JM/ldecod/CMakeFiles/ldecod.dir/erc_do_i.c.o.d -o MultiSource/Applications/JM/ldecod/CMakeFiles/ldecod.dir/erc_do_i.c.o   -c /Users/buildslave/jenkins/workspace/test-suite-verify-machineinstrs-x86_64-O3/test-suite/MultiSource/Applications/JM/ldecod/erc_do_i.c
[1881/7685] /Users/buildslave/jenkins/workspace/test-suite-verify-machineinstrs-x86_64-O3/test-suite-build/tools/timeit --summary MultiSource/Applications/JM/ldecod/CMakeFiles/ldecod.dir/fmo.c.o.time /Users/buildslave/jenkins/workspace/test-suite-verify-machineinstrs-x86_64-O3/compiler/bin/clang -DNDEBUG  -B /Applications/Xcode.app/Contents/Developer/Toolchains/XcodeDefault.xctoolchain/usr/bin    -Wno-unused-command-line-argument -mllvm -verify-machineinstrs -O3 -arch x86_64 -isysroot /Applications/Xcode.app/Contents/Developer/Platforms/MacOSX.platform/Developer/SDKs/MacOSX10.15.sdk   -w -Werror=date-time -fcommon -D__USE_LARGEFILE64 -D_FILE_OFFSET_BITS=64 -MD -MT MultiSource/Applications/JM/ldecod/CMakeFiles/ldecod.dir/fmo.c.o -MF MultiSource/Applications/JM/ldecod/CMakeFiles/ldecod.dir/fmo.c.o.d -o MultiSource/Applications/JM/ldecod/CMakeFiles/ldecod.dir/fmo.c.o   -c /Users/buildslave/jenkins/workspace/test-suite-verify-machineinstrs-x86_64-O3/test-suite/MultiSource/Applications/JM/ldecod/fmo.c
[1882/7685] /Users/buildslave/jenkins/workspace/test-suite-verify-machineinstrs-x86_64-O3/test-suite-build/tools/timeit --summary MultiSource/Applications/JM/ldecod/CMakeFiles/ldecod.dir/leaky_bucket.c.o.time /Users/buildslave/jenkins/workspace/test-suite-verify-machineinstrs-x86_64-O3/compiler/bin/clang -DNDEBUG  -B /Applications/Xcode.app/Contents/Developer/Toolchains/XcodeDefault.xctoolchain/usr/bin    -Wno-unused-command-line-argument -mllvm -verify-machineinstrs -O3 -arch x86_64 -isysroot /Applications/Xcode.app/Contents/Developer/Platforms/MacOSX.platform/Developer/SDKs/MacOSX10.15.sdk   -w -Werror=date-time -fcommon -D__USE_LARGEFILE64 -D_FILE_OFFSET_BITS=64 -MD -MT MultiSource/Applications/JM/ldecod/CMakeFiles/ldecod.dir/leaky_bucket.c.o -MF MultiSource/Applications/JM/ldecod/CMakeFiles/ldecod.dir/leaky_bucket.c.o.d -o MultiSource/Applications/JM/ldecod/CMakeFiles/ldecod.dir/leaky_bucket.c.o   -c /Users/buildslave/jenkins/workspace/test-suite-verify-machineinstrs-x86_64-O3/test-suite/MultiSource/Applications/JM/ldecod/leaky_bucket.c
[1883/7685] /Users/buildslave/jenkins/workspace/test-suite-verify-machineinstrs-x86_64-O3/test-suite-build/tools/timeit --summary MultiSource/Applications/JM/ldecod/CMakeFiles/ldecod.dir/header.c.o.time /Users/buildslave/jenkins/workspace/test-suite-verify-machineinstrs-x86_64-O3/compiler/bin/clang -DNDEBUG  -B /Applications/Xcode.app/Contents/Developer/Toolchains/XcodeDefault.xctoolchain/usr/bin    -Wno-unused-command-line-argument -mllvm -verify-machineinstrs -O3 -arch x86_64 -isysroot /Applications/Xcode.app/Contents/Developer/Platforms/MacOSX.platform/Developer/SDKs/MacOSX10.15.sdk   -w -Werror=date-time -fcommon -D__USE_LARGEFILE64 -D_FILE_OFFSET_BITS=64 -MD -MT MultiSource/Applications/JM/ldecod/CMakeFiles/ldecod.dir/header.c.o -MF MultiSource/Applications/JM/ldecod/CMakeFiles/ldecod.dir/header.c.o.d -o MultiSource/Applications/JM/ldecod/CMakeFiles/ldecod.dir/header.c.o   -c /Users/buildslave/jenkins/workspace/test-suite-verify-machineinstrs-x86_64-O3/test-suite/MultiSource/Applications/JM/ldecod/header.c
[1884/7685] /Users/buildslave/jenkins/workspace/test-suite-verify-machineinstrs-x86_64-O3/test-suite-build/tools/timeit --summary MultiSource/Applications/JM/ldecod/CMakeFiles/ldecod.dir/block.c.o.time /Users/buildslave/jenkins/workspace/test-suite-verify-machineinstrs-x86_64-O3/compiler/bin/clang -DNDEBUG  -B /Applications/Xcode.app/Contents/Developer/Toolchains/XcodeDefault.xctoolchain/usr/bin    -Wno-unused-command-line-argument -mllvm -verify-machineinstrs -O3 -arch x86_64 -isysroot /Applications/Xcode.app/Contents/Developer/Platforms/MacOSX.platform/Developer/SDKs/MacOSX10.15.sdk   -w -Werror=date-time -fcommon -D__USE_LARGEFILE64 -D_FILE_OFFSET_BITS=64 -MD -MT MultiSource/Applications/JM/ldecod/CMakeFiles/ldecod.dir/block.c.o -MF MultiSource/Applications/JM/ldecod/CMakeFiles/ldecod.dir/block.c.o.d -o MultiSource/Applications/JM/ldecod/CMakeFiles/ldecod.dir/block.c.o   -c /Users/buildslave/jenkins/workspace/test-suite-verify-machineinstrs-x86_64-O3/test-suite/MultiSource/Applications/JM/ldecod/block.c
FAILED: MultiSource/Applications/JM/ldecod/CMakeFiles/ldecod.dir/block.c.o 
/Users/buildslave/jenkins/workspace/test-suite-verify-machineinstrs-x86_64-O3/test-suite-build/tools/timeit --summary MultiSource/Applications/JM/ldecod/CMakeFiles/ldecod.dir/block.c.o.time /Users/buildslave/jenkins/workspace/test-suite-verify-machineinstrs-x86_64-O3/compiler/bin/clang -DNDEBUG  -B /Applications/Xcode.app/Contents/Developer/Toolchains/XcodeDefault.xctoolchain/usr/bin    -Wno-unused-command-line-argument -mllvm -verify-machineinstrs -O3 -arch x86_64 -isysroot /Applications/Xcode.app/Contents/Developer/Platforms/MacOSX.platform/Developer/SDKs/MacOSX10.15.sdk   -w -Werror=date-time -fcommon -D__USE_LARGEFILE64 -D_FILE_OFFSET_BITS=64 -MD -MT MultiSource/Applications/JM/ldecod/CMakeFiles/ldecod.dir/block.c.o -MF MultiSource/Applications/JM/ldecod/CMakeFiles/ldecod.dir/block.c.o.d -o MultiSource/Applications/JM/ldecod/CMakeFiles/ldecod.dir/block.c.o   -c /Users/buildslave/jenkins/workspace/test-suite-verify-machineinstrs-x86_64-O3/test-suite/MultiSource/Applications/JM/ldecod/block.c
Fatal Error: error in backend: Found 2 machine code errors.
*** Bad machine code: Using an undefined physical register ***
- function:    itrans_sp
- basic block: %bb.0 entry (0x7fe93e957ac8)
- instruction: $ecx = SUB32rr $ecx(tied-def 0), $esi, implicit-def dead $eflags
- operand 2:   $esi
fatal error: error in backend: Found 2 machine code errors.
PLEASE submit a bug report to https://bugs.llvm.org/ and include the crash backtrace, preprocessed source, and associated run script.
Stack dump:
Error: clang frontend command failed with exit code 70 (use -v to see invocation)
25 clang         0x000000011115a63d clang::driver::Compilation::ExecuteCommand(clang::driver::Command const&, clang::driver::Command const*&) const + 221
26 clang         0x000000011115ab9d clang::driver::Compilation::ExecuteJobs(clang::driver::JobList const&, llvm::SmallVectorImpl<std::__1::pair<int, clang::driver::Command const*> >&) const + 125
27 clang         0x00000001111715ec clang::driver::Driver::ExecuteCompilation(clang::driver::Compilation&, llvm::SmallVectorImpl<std::__1::pair<int, clang::driver::Command const*> >&) + 204
28 clang         0x000000010e89a145 main + 10309
29 libdyld.dylib 0x00007fff67a6fcc9 start + 1
clang-13: error: clang frontend command failed with exit code 70 (use -v to see invocation)
clang version 13.0.0 (https://github.com/llvm/llvm-project.git f0a68bbc967ab851e9b678feaf9015a2bfadb12e)
Target: x86_64-apple-darwin19.5.0
Ninja target: oggenc.c.o
[2484/7685] /Users/buildslave/jenkins/workspace/test-suite-verify-machineinstrs-x86_64-O3/test-suite-build/tools/timeit --summary MultiSource/Applications/kimwitu++/CMakeFiles/kc.dir/abs.cc.o.time /Users/buildslave/jenkins/workspace/test-suite-verify-machineinstrs-x86_64-O3/compiler/bin/clang++  -DNDEBUG  -B /Applications/Xcode.app/Contents/Developer/Toolchains/XcodeDefault.xctoolchain/usr/bin    -Wno-unused-command-line-argument -mllvm -verify-machineinstrs -O3 -arch x86_64 -isysroot /Applications/Xcode.app/Contents/Developer/Platforms/MacOSX.platform/Developer/SDKs/MacOSX10.15.sdk   -w -Werror=date-time -I/Users/buildslave/jenkins/workspace/test-suite-verify-machineinstrs-x86_64-O3/test-suite/MultiSource/Applications/kimwitu++ -DYYDEBUG=1 -MD -MT MultiSource/Applications/kimwitu++/CMakeFiles/kc.dir/abs.cc.o -MF MultiSource/Applications/kimwitu++/CMakeFiles/kc.dir/abs.cc.o.d -o MultiSource/Applications/kimwitu++/CMakeFiles/kc.dir/abs.cc.o -c /Users/buildslave/jenkins/workspace/test-suite-verify-machineinstrs-x86_64-O3/test-suite/MultiSource/Applications/kimwitu++/abs.cc
[2485/7685] /Users/buildslave/jenkins/workspace/test-suite-verify-machineinstrs-x86_64-O3/test-suite-build/tools/timeit --summary MultiSource/Applications/kimwitu++/CMakeFiles/kc.dir/gen.cc.o.time /Users/buildslave/jenkins/workspace/test-suite-verify-machineinstrs-x86_64-O3/compiler/bin/clang++  -DNDEBUG  -B /Applications/Xcode.app/Contents/Developer/Toolchains/XcodeDefault.xctoolchain/usr/bin    -Wno-unused-command-line-argument -mllvm -verify-machineinstrs -O3 -arch x86_64 -isysroot /Applications/Xcode.app/Contents/Developer/Platforms/MacOSX.platform/Developer/SDKs/MacOSX10.15.sdk   -w -Werror=date-time -I/Users/buildslave/jenkins/workspace/test-suite-verify-machineinstrs-x86_64-O3/test-suite/MultiSource/Applications/kimwitu++ -DYYDEBUG=1 -MD -MT MultiSource/Applications/kimwitu++/CMakeFiles/kc.dir/gen.cc.o -MF MultiSource/Applications/kimwitu++/CMakeFiles/kc.dir/gen.cc.o.d -o MultiSource/Applications/kimwitu++/CMakeFiles/kc.dir/gen.cc.o -c /Users/buildslave/jenkins/workspace/test-suite-verify-machineinstrs-x86_64-O3/test-suite/MultiSource/Applications/kimwitu++/gen.cc
[2486/7685] /Users/buildslave/jenkins/workspace/test-suite-verify-machineinstrs-x86_64-O3/test-suite-build/tools/timeit --summary MultiSource/Applications/kimwitu++/CMakeFiles/kc.dir/error.cc.o.time /Users/buildslave/jenkins/workspace/test-suite-verify-machineinstrs-x86_64-O3/compiler/bin/clang++  -DNDEBUG  -B /Applications/Xcode.app/Contents/Developer/Toolchains/XcodeDefault.xctoolchain/usr/bin    -Wno-unused-command-line-argument -mllvm -verify-machineinstrs -O3 -arch x86_64 -isysroot /Applications/Xcode.app/Contents/Developer/Platforms/MacOSX.platform/Developer/SDKs/MacOSX10.15.sdk   -w -Werror=date-time -I/Users/buildslave/jenkins/workspace/test-suite-verify-machineinstrs-x86_64-O3/test-suite/MultiSource/Applications/kimwitu++ -DYYDEBUG=1 -MD -MT MultiSource/Applications/kimwitu++/CMakeFiles/kc.dir/error.cc.o -MF MultiSource/Applications/kimwitu++/CMakeFiles/kc.dir/error.cc.o.d -o MultiSource/Applications/kimwitu++/CMakeFiles/kc.dir/error.cc.o -c /Users/buildslave/jenkins/workspace/test-suite-verify-machineinstrs-x86_64-O3/test-suite/MultiSource/Applications/kimwitu++/error.cc
[2487/7685] /Users/buildslave/jenkins/workspace/test-suite-verify-machineinstrs-x86_64-O3/test-suite-build/tools/timeit --summary MultiSource/Applications/kimwitu++/CMakeFiles/kc.dir/gutil.cc.o.time /Users/buildslave/jenkins/workspace/test-suite-verify-machineinstrs-x86_64-O3/compiler/bin/clang++  -DNDEBUG  -B /Applications/Xcode.app/Contents/Developer/Toolchains/XcodeDefault.xctoolchain/usr/bin    -Wno-unused-command-line-argument -mllvm -verify-machineinstrs -O3 -arch x86_64 -isysroot /Applications/Xcode.app/Contents/Developer/Platforms/MacOSX.platform/Developer/SDKs/MacOSX10.15.sdk   -w -Werror=date-time -I/Users/buildslave/jenkins/workspace/test-suite-verify-machineinstrs-x86_64-O3/test-suite/MultiSource/Applications/kimwitu++ -DYYDEBUG=1 -MD -MT MultiSource/Applications/kimwitu++/CMakeFiles/kc.dir/gutil.cc.o -MF MultiSource/Applications/kimwitu++/CMakeFiles/kc.dir/gutil.cc.o.d -o MultiSource/Applications/kimwitu++/CMakeFiles/kc.dir/gutil.cc.o -c /Users/buildslave/jenkins/workspace/test-suite-verify-machineinstrs-x86_64-O3/test-suite/MultiSource/Applications/kimwitu++/gutil.cc
[2488/7685] /Users/buildslave/jenkins/workspace/test-suite-verify-machineinstrs-x86_64-O3/test-suite-build/tools/timeit --summary MultiSource/Applications/oggenc/CMakeFiles/oggenc.dir/oggenc.c.o.time /Users/buildslave/jenkins/workspace/test-suite-verify-machineinstrs-x86_64-O3/compiler/bin/clang -DNDEBUG  -B /Applications/Xcode.app/Contents/Developer/Toolchains/XcodeDefault.xctoolchain/usr/bin    -Wno-unused-command-line-argument -mllvm -verify-machineinstrs -O3 -arch x86_64 -isysroot /Applications/Xcode.app/Contents/Developer/Platforms/MacOSX.platform/Developer/SDKs/MacOSX10.15.sdk   -w -Werror=date-time -fno-strict-aliasing -ffp-contract=off -DFMA_DISABLED=1 -ffp-contract=off -DFMA_DISABLED=1 -MD -MT MultiSource/Applications/oggenc/CMakeFiles/oggenc.dir/oggenc.c.o -MF MultiSource/Applications/oggenc/CMakeFiles/oggenc.dir/oggenc.c.o.d -o MultiSource/Applications/oggenc/CMakeFiles/oggenc.dir/oggenc.c.o   -c /Users/buildslave/jenkins/workspace/test-suite-verify-machineinstrs-x86_64-O3/test-suite/MultiSource/Applications/oggenc/oggenc.c
FAILED: MultiSource/Applications/oggenc/CMakeFiles/oggenc.dir/oggenc.c.o 
/Users/buildslave/jenkins/workspace/test-suite-verify-machineinstrs-x86_64-O3/test-suite-build/tools/timeit --summary MultiSource/Applications/oggenc/CMakeFiles/oggenc.dir/oggenc.c.o.time /Users/buildslave/jenkins/workspace/test-suite-verify-machineinstrs-x86_64-O3/compiler/bin/clang -DNDEBUG  -B /Applications/Xcode.app/Contents/Developer/Toolchains/XcodeDefault.xctoolchain/usr/bin    -Wno-unused-command-line-argument -mllvm -verify-machineinstrs -O3 -arch x86_64 -isysroot /Applications/Xcode.app/Contents/Developer/Platforms/MacOSX.platform/Developer/SDKs/MacOSX10.15.sdk   -w -Werror=date-time -fno-strict-aliasing -ffp-contract=off -DFMA_DISABLED=1 -ffp-contract=off -DFMA_DISABLED=1 -MD -MT MultiSource/Applications/oggenc/CMakeFiles/oggenc.dir/oggenc.c.o -MF MultiSource/Applications/oggenc/CMakeFiles/oggenc.dir/oggenc.c.o.d -o MultiSource/Applications/oggenc/CMakeFiles/oggenc.dir/oggenc.c.o   -c /Users/buildslave/jenkins/workspace/test-suite-verify-machineinstrs-x86_64-O3/test-suite/MultiSource/Applications/oggenc/oggenc.c
Fatal Error: error in backend: Found 2 machine code errors.
*** Bad machine code: Using an undefined physical register ***
- function:    vorbis_analysis_blockout
- basic block: %bb.17 if.end.i (0x7ff097f42e80)
- instruction: $rax = SUB64rr $rax(tied-def 0), $rcx, implicit-def dead $eflags
- operand 2:   $rcx
fatal error: error in backend: Found 2 machine code errors.
PLEASE submit a bug report to https://bugs.llvm.org/ and include the crash backtrace, preprocessed source, and associated run script.
Stack dump:
Error: clang frontend command failed with exit code 70 (use -v to see invocation)
25 clang         0x000000010a99b63d clang::driver::Compilation::ExecuteCommand(clang::driver::Command const&, clang::driver::Command const*&) const + 221
26 clang         0x000000010a99bb9d clang::driver::Compilation::ExecuteJobs(clang::driver::JobList const&, llvm::SmallVectorImpl<std::__1::pair<int, clang::driver::Command const*> >&) const + 125
27 clang         0x000000010a9b25ec clang::driver::Driver::ExecuteCompilation(clang::driver::Compilation&, llvm::SmallVectorImpl<std::__1::pair<int, clang::driver::Command const*> >&) + 204
28 clang         0x00000001080db145 main + 10309
29 libdyld.dylib 0x00007fff67a6fcc9 start + 1
clang-13: error: clang frontend command failed with exit code 70 (use -v to see invocation)
clang version 13.0.0 (https://github.com/llvm/llvm-project.git f0a68bbc967ab851e9b678feaf9015a2bfadb12e)
Target: x86_64-apple-darwin19.5.0
Ninja target: machine.c.o
[3183/7685] /Users/buildslave/jenkins/workspace/test-suite-verify-machineinstrs-x86_64-O3/test-suite-build/tools/timeit --summary MultiSource/Benchmarks/Prolangs-C/unix-tbl/CMakeFiles/unix-tbl.dir/t0.c.o.time /Users/buildslave/jenkins/workspace/test-suite-verify-machineinstrs-x86_64-O3/compiler/bin/clang -DNDEBUG  -B /Applications/Xcode.app/Contents/Developer/Toolchains/XcodeDefault.xctoolchain/usr/bin    -Wno-unused-command-line-argument -mllvm -verify-machineinstrs -O3 -arch x86_64 -isysroot /Applications/Xcode.app/Contents/Developer/Platforms/MacOSX.platform/Developer/SDKs/MacOSX10.15.sdk   -w -Werror=date-time -MD -MT MultiSource/Benchmarks/Prolangs-C/unix-tbl/CMakeFiles/unix-tbl.dir/t0.c.o -MF MultiSource/Benchmarks/Prolangs-C/unix-tbl/CMakeFiles/unix-tbl.dir/t0.c.o.d -o MultiSource/Benchmarks/Prolangs-C/unix-tbl/CMakeFiles/unix-tbl.dir/t0.c.o   -c /Users/buildslave/jenkins/workspace/test-suite-verify-machineinstrs-x86_64-O3/test-suite/MultiSource/Benchmarks/Prolangs-C/unix-tbl/t0.c
[3184/7685] /Users/buildslave/jenkins/workspace/test-suite-verify-machineinstrs-x86_64-O3/test-suite-build/tools/timeit --summary MultiSource/Benchmarks/Prolangs-C/unix-tbl/CMakeFiles/unix-tbl.dir/t2.c.o.time /Users/buildslave/jenkins/workspace/test-suite-verify-machineinstrs-x86_64-O3/compiler/bin/clang -DNDEBUG  -B /Applications/Xcode.app/Contents/Developer/Toolchains/XcodeDefault.xctoolchain/usr/bin    -Wno-unused-command-line-argument -mllvm -verify-machineinstrs -O3 -arch x86_64 -isysroot /Applications/Xcode.app/Contents/Developer/Platforms/MacOSX.platform/Developer/SDKs/MacOSX10.15.sdk   -w -Werror=date-time -MD -MT MultiSource/Benchmarks/Prolangs-C/unix-tbl/CMakeFiles/unix-tbl.dir/t2.c.o -MF MultiSource/Benchmarks/Prolangs-C/unix-tbl/CMakeFiles/unix-tbl.dir/t2.c.o.d -o MultiSource/Benchmarks/Prolangs-C/unix-tbl/CMakeFiles/unix-tbl.dir/t2.c.o   -c /Users/buildslave/jenkins/workspace/test-suite-verify-machineinstrs-x86_64-O3/test-suite/MultiSource/Benchmarks/Prolangs-C/unix-tbl/t2.c
[3185/7685] /Users/buildslave/jenkins/workspace/test-suite-verify-machineinstrs-x86_64-O3/test-suite-build/tools/timeit --summary MultiSource/Benchmarks/Prolangs-C/unix-tbl/CMakeFiles/unix-tbl.dir/t1.c.o.time /Users/buildslave/jenkins/workspace/test-suite-verify-machineinstrs-x86_64-O3/compiler/bin/clang -DNDEBUG  -B /Applications/Xcode.app/Contents/Developer/Toolchains/XcodeDefault.xctoolchain/usr/bin    -Wno-unused-command-line-argument -mllvm -verify-machineinstrs -O3 -arch x86_64 -isysroot /Applications/Xcode.app/Contents/Developer/Platforms/MacOSX.platform/Developer/SDKs/MacOSX10.15.sdk   -w -Werror=date-time -MD -MT MultiSource/Benchmarks/Prolangs-C/unix-tbl/CMakeFiles/unix-tbl.dir/t1.c.o -MF MultiSource/Benchmarks/Prolangs-C/unix-tbl/CMakeFiles/unix-tbl.dir/t1.c.o.d -o MultiSource/Benchmarks/Prolangs-C/unix-tbl/CMakeFiles/unix-tbl.dir/t1.c.o   -c /Users/buildslave/jenkins/workspace/test-suite-verify-machineinstrs-x86_64-O3/test-suite/MultiSource/Benchmarks/Prolangs-C/unix-tbl/t1.c
[3186/7685] /Users/buildslave/jenkins/workspace/test-suite-verify-machineinstrs-x86_64-O3/test-suite-build/tools/timeit --summary MultiSource/Benchmarks/Prolangs-C/unix-tbl/CMakeFiles/unix-tbl.dir/t3.c.o.time /Users/buildslave/jenkins/workspace/test-suite-verify-machineinstrs-x86_64-O3/compiler/bin/clang -DNDEBUG  -B /Applications/Xcode.app/Contents/Developer/Toolchains/XcodeDefault.xctoolchain/usr/bin    -Wno-unused-command-line-argument -mllvm -verify-machineinstrs -O3 -arch x86_64 -isysroot /Applications/Xcode.app/Contents/Developer/Platforms/MacOSX.platform/Developer/SDKs/MacOSX10.15.sdk   -w -Werror=date-time -MD -MT MultiSource/Benchmarks/Prolangs-C/unix-tbl/CMakeFiles/unix-tbl.dir/t3.c.o -MF MultiSource/Benchmarks/Prolangs-C/unix-tbl/CMakeFiles/unix-tbl.dir/t3.c.o.d -o MultiSource/Benchmarks/Prolangs-C/unix-tbl/CMakeFiles/unix-tbl.dir/t3.c.o   -c /Users/buildslave/jenkins/workspace/test-suite-verify-machineinstrs-x86_64-O3/test-suite/MultiSource/Benchmarks/Prolangs-C/unix-tbl/t3.c
[3187/7685] /Users/buildslave/jenkins/workspace/test-suite-verify-machineinstrs-x86_64-O3/test-suite-build/tools/timeit --summary MultiSource/Benchmarks/Prolangs-C/simulator/CMakeFiles/simulator.dir/machine.c.o.time /Users/buildslave/jenkins/workspace/test-suite-verify-machineinstrs-x86_64-O3/compiler/bin/clang -DNDEBUG  -B /Applications/Xcode.app/Contents/Developer/Toolchains/XcodeDefault.xctoolchain/usr/bin    -Wno-unused-command-line-argument -mllvm -verify-machineinstrs -O3 -arch x86_64 -isysroot /Applications/Xcode.app/Contents/Developer/Platforms/MacOSX.platform/Developer/SDKs/MacOSX10.15.sdk   -w -Werror=date-time -fcommon -MD -MT MultiSource/Benchmarks/Prolangs-C/simulator/CMakeFiles/simulator.dir/machine.c.o -MF MultiSource/Benchmarks/Prolangs-C/simulator/CMakeFiles/simulator.dir/machine.c.o.d -o MultiSource/Benchmarks/Prolangs-C/simulator/CMakeFiles/simulator.dir/machine.c.o   -c /Users/buildslave/jenkins/workspace/test-suite-verify-machineinstrs-x86_64-O3/test-suite/MultiSource/Benchmarks/Prolangs-C/simulator/machine.c
FAILED: MultiSource/Benchmarks/Prolangs-C/simulator/CMakeFiles/simulator.dir/machine.c.o 
/Users/buildslave/jenkins/workspace/test-suite-verify-machineinstrs-x86_64-O3/test-suite-build/tools/timeit --summary MultiSource/Benchmarks/Prolangs-C/simulator/CMakeFiles/simulator.dir/machine.c.o.time /Users/buildslave/jenkins/workspace/test-suite-verify-machineinstrs-x86_64-O3/compiler/bin/clang -DNDEBUG  -B /Applications/Xcode.app/Contents/Developer/Toolchains/XcodeDefault.xctoolchain/usr/bin    -Wno-unused-command-line-argument -mllvm -verify-machineinstrs -O3 -arch x86_64 -isysroot /Applications/Xcode.app/Contents/Developer/Platforms/MacOSX.platform/Developer/SDKs/MacOSX10.15.sdk   -w -Werror=date-time -fcommon -MD -MT MultiSource/Benchmarks/Prolangs-C/simulator/CMakeFiles/simulator.dir/machine.c.o -MF MultiSource/Benchmarks/Prolangs-C/simulator/CMakeFiles/simulator.dir/machine.c.o.d -o MultiSource/Benchmarks/Prolangs-C/simulator/CMakeFiles/simulator.dir/machine.c.o   -c /Users/buildslave/jenkins/workspace/test-suite-verify-machineinstrs-x86_64-O3/test-suite/MultiSource/Benchmarks/Prolangs-C/simulator/machine.c
Fatal Error: error in backend: Found 4 machine code errors.
*** Bad machine code: Using an undefined physical register ***
- function:    SET_CC
- basic block: %bb.1 if.then (0x7fb135896da8)
- instruction: $esi = SUB32rr $esi(tied-def 0), $r13d, implicit-def dead $eflags
- operand 2:   $r13d
fatal error: error in backend: Found 4 machine code errors.
PLEASE submit a bug report to https://bugs.llvm.org/ and include the crash backtrace, preprocessed source, and associated run script.
Stack dump:
Error: clang frontend command failed with exit code 70 (use -v to see invocation)
26 clang         0x00000001098a4b9d clang::driver::Compilation::ExecuteJobs(clang::driver::JobList const&, llvm::SmallVectorImpl<std::__1::pair<int, clang::driver::Command const*> >&) const + 125
27 clang         0x00000001098bb5ec clang::driver::Driver::ExecuteCompilation(clang::driver::Compilation&, llvm::SmallVectorImpl<std::__1::pair<int, clang::driver::Command const*> >&) + 204
28 clang         0x0000000106fe4145 main + 10309
29 libdyld.dylib 0x00007fff67a6fcc9 start + 1
30 libdyld.dylib 0x0000000000000018 start + 18446603338777166672
clang-13: error: clang frontend command failed with exit code 70 (use -v to see invocation)
clang version 13.0.0 (https://github.com/llvm/llvm-project.git f0a68bbc967ab851e9b678feaf9015a2bfadb12e)
Target: x86_64-apple-darwin19.5.0

Build Log

Changes
  1. [lldb] Move once_flags in HostInfoLinux so the internal state struct (details)
  2. [PowerPC] Relax register superclasses for paired memops (details)
  3. [lldb] Fix leak in test (details)
  4. Revert "[CMake] Don't use libc++ by default on Windows yet" (details)
  5. Revert "[Driver] Support libc++ in MSVC" (details)
  6. Function Specialization Pass (details)
  7. [gn build] Port c4a0969b9c14 (details)
  8. [mlir] Refactor ComplexOps.td [NFC] (details)
  9. [clang-tidy] LIT test fix for Remark diagnostic (details)
  10. [compiler-rt] [builtins] [AArch64] Add missing AArch64 data synchronization barrier (dsb) to __clear_cache (details)
  11. [OpenCL][NFC] Reorganize ClangOpenCLBuiltinEmitter comments (details)
  12. Fix implicit dependency on <string> header. NFCI. (details)
  13. [Analysis] Pass RecurrenceDescriptor as const reference. NFCI. (details)
  14. SampleProf.h - fix spelling mistake in assert message. NFC. (details)

Started by upstream project relay-test-suite-verify-machineinstrs build number 10036
originally caused by:

This run spent:

  • 1 hr 39 min waiting;
  • 2 hr 9 min build duration;
  • 2 hr 9 min total from scheduled to completion.
Revision: d631fe591d8ff09edb895ef124e8370875d8d523
Repository: https://github.com/llvm/llvm-zorg.git
  • refs/remotes/origin/main
Revision: f0a68bbc967ab851e9b678feaf9015a2bfadb12e
Repository: http://labmaster3.local/git/llvm-project.git
  • detached
Revision: f48d431f44610e339d00a33d57564c6029c4ff43
Repository: https://github.com/llvm/llvm-lnt.git
  • refs/remotes/origin/main
Revision: ccc86f938839d02de3a6564b2d80fb47a60aa069
Repository: https://github.com/llvm/llvm-test-suite.git
  • refs/remotes/origin/main

Identified problems

Compile Error

This build failed because of a compile error. Below is a list of all errors in the build log:
Indication 1

Ninja target failed

Below is a link to the first failed ninja target.
Indication 2