Started 4 mo 17 days ago
Took 2 hr 32 min

Build clang-d390453-g7c4e9a68264f-t21473-b21473.tar.gz (Jun 7, 2021 11:45:53 PM)

Issues

Found 9 issues:
Ninja target: machine.c.o
[228/7685] /Users/buildslave/jenkins/workspace/test-suite-verify-machineinstrs-x86_64h-O3/test-suite-build/tools/timeit --summary MultiSource/Benchmarks/Prolangs-C/unix-tbl/CMakeFiles/unix-tbl.dir/t2.c.o.time /Users/buildslave/jenkins/workspace/test-suite-verify-machineinstrs-x86_64h-O3/compiler/bin/clang -DNDEBUG  -B /Applications/Xcode.app/Contents/Developer/Toolchains/XcodeDefault.xctoolchain/usr/bin    -Wno-unused-command-line-argument -mllvm -verify-machineinstrs -O3 -arch x86_64h -isysroot /Applications/Xcode.app/Contents/Developer/Platforms/MacOSX.platform/Developer/SDKs/MacOSX10.15.sdk   -w -Werror=date-time -MD -MT MultiSource/Benchmarks/Prolangs-C/unix-tbl/CMakeFiles/unix-tbl.dir/t2.c.o -MF MultiSource/Benchmarks/Prolangs-C/unix-tbl/CMakeFiles/unix-tbl.dir/t2.c.o.d -o MultiSource/Benchmarks/Prolangs-C/unix-tbl/CMakeFiles/unix-tbl.dir/t2.c.o   -c /Users/buildslave/jenkins/workspace/test-suite-verify-machineinstrs-x86_64h-O3/test-suite/MultiSource/Benchmarks/Prolangs-C/unix-tbl/t2.c
[229/7685] /Users/buildslave/jenkins/workspace/test-suite-verify-machineinstrs-x86_64h-O3/test-suite-build/tools/timeit --summary MultiSource/Benchmarks/Prolangs-C/unix-tbl/CMakeFiles/unix-tbl.dir/t1.c.o.time /Users/buildslave/jenkins/workspace/test-suite-verify-machineinstrs-x86_64h-O3/compiler/bin/clang -DNDEBUG  -B /Applications/Xcode.app/Contents/Developer/Toolchains/XcodeDefault.xctoolchain/usr/bin    -Wno-unused-command-line-argument -mllvm -verify-machineinstrs -O3 -arch x86_64h -isysroot /Applications/Xcode.app/Contents/Developer/Platforms/MacOSX.platform/Developer/SDKs/MacOSX10.15.sdk   -w -Werror=date-time -MD -MT MultiSource/Benchmarks/Prolangs-C/unix-tbl/CMakeFiles/unix-tbl.dir/t1.c.o -MF MultiSource/Benchmarks/Prolangs-C/unix-tbl/CMakeFiles/unix-tbl.dir/t1.c.o.d -o MultiSource/Benchmarks/Prolangs-C/unix-tbl/CMakeFiles/unix-tbl.dir/t1.c.o   -c /Users/buildslave/jenkins/workspace/test-suite-verify-machineinstrs-x86_64h-O3/test-suite/MultiSource/Benchmarks/Prolangs-C/unix-tbl/t1.c
[230/7685] /Users/buildslave/jenkins/workspace/test-suite-verify-machineinstrs-x86_64h-O3/test-suite-build/tools/timeit --summary MultiSource/Benchmarks/Prolangs-C/simulator/CMakeFiles/simulator.dir/debugger.c.o.time /Users/buildslave/jenkins/workspace/test-suite-verify-machineinstrs-x86_64h-O3/compiler/bin/clang -DNDEBUG  -B /Applications/Xcode.app/Contents/Developer/Toolchains/XcodeDefault.xctoolchain/usr/bin    -Wno-unused-command-line-argument -mllvm -verify-machineinstrs -O3 -arch x86_64h -isysroot /Applications/Xcode.app/Contents/Developer/Platforms/MacOSX.platform/Developer/SDKs/MacOSX10.15.sdk   -w -Werror=date-time -fcommon -MD -MT MultiSource/Benchmarks/Prolangs-C/simulator/CMakeFiles/simulator.dir/debugger.c.o -MF MultiSource/Benchmarks/Prolangs-C/simulator/CMakeFiles/simulator.dir/debugger.c.o.d -o MultiSource/Benchmarks/Prolangs-C/simulator/CMakeFiles/simulator.dir/debugger.c.o   -c /Users/buildslave/jenkins/workspace/test-suite-verify-machineinstrs-x86_64h-O3/test-suite/MultiSource/Benchmarks/Prolangs-C/simulator/debugger.c
[231/7685] /Users/buildslave/jenkins/workspace/test-suite-verify-machineinstrs-x86_64h-O3/test-suite-build/tools/timeit --summary MultiSource/Benchmarks/Prolangs-C/unix-tbl/CMakeFiles/unix-tbl.dir/t3.c.o.time /Users/buildslave/jenkins/workspace/test-suite-verify-machineinstrs-x86_64h-O3/compiler/bin/clang -DNDEBUG  -B /Applications/Xcode.app/Contents/Developer/Toolchains/XcodeDefault.xctoolchain/usr/bin    -Wno-unused-command-line-argument -mllvm -verify-machineinstrs -O3 -arch x86_64h -isysroot /Applications/Xcode.app/Contents/Developer/Platforms/MacOSX.platform/Developer/SDKs/MacOSX10.15.sdk   -w -Werror=date-time -MD -MT MultiSource/Benchmarks/Prolangs-C/unix-tbl/CMakeFiles/unix-tbl.dir/t3.c.o -MF MultiSource/Benchmarks/Prolangs-C/unix-tbl/CMakeFiles/unix-tbl.dir/t3.c.o.d -o MultiSource/Benchmarks/Prolangs-C/unix-tbl/CMakeFiles/unix-tbl.dir/t3.c.o   -c /Users/buildslave/jenkins/workspace/test-suite-verify-machineinstrs-x86_64h-O3/test-suite/MultiSource/Benchmarks/Prolangs-C/unix-tbl/t3.c
[232/7685] /Users/buildslave/jenkins/workspace/test-suite-verify-machineinstrs-x86_64h-O3/test-suite-build/tools/timeit --summary MultiSource/Benchmarks/Prolangs-C/simulator/CMakeFiles/simulator.dir/machine.c.o.time /Users/buildslave/jenkins/workspace/test-suite-verify-machineinstrs-x86_64h-O3/compiler/bin/clang -DNDEBUG  -B /Applications/Xcode.app/Contents/Developer/Toolchains/XcodeDefault.xctoolchain/usr/bin    -Wno-unused-command-line-argument -mllvm -verify-machineinstrs -O3 -arch x86_64h -isysroot /Applications/Xcode.app/Contents/Developer/Platforms/MacOSX.platform/Developer/SDKs/MacOSX10.15.sdk   -w -Werror=date-time -fcommon -MD -MT MultiSource/Benchmarks/Prolangs-C/simulator/CMakeFiles/simulator.dir/machine.c.o -MF MultiSource/Benchmarks/Prolangs-C/simulator/CMakeFiles/simulator.dir/machine.c.o.d -o MultiSource/Benchmarks/Prolangs-C/simulator/CMakeFiles/simulator.dir/machine.c.o   -c /Users/buildslave/jenkins/workspace/test-suite-verify-machineinstrs-x86_64h-O3/test-suite/MultiSource/Benchmarks/Prolangs-C/simulator/machine.c
FAILED: MultiSource/Benchmarks/Prolangs-C/simulator/CMakeFiles/simulator.dir/machine.c.o 
/Users/buildslave/jenkins/workspace/test-suite-verify-machineinstrs-x86_64h-O3/test-suite-build/tools/timeit --summary MultiSource/Benchmarks/Prolangs-C/simulator/CMakeFiles/simulator.dir/machine.c.o.time /Users/buildslave/jenkins/workspace/test-suite-verify-machineinstrs-x86_64h-O3/compiler/bin/clang -DNDEBUG  -B /Applications/Xcode.app/Contents/Developer/Toolchains/XcodeDefault.xctoolchain/usr/bin    -Wno-unused-command-line-argument -mllvm -verify-machineinstrs -O3 -arch x86_64h -isysroot /Applications/Xcode.app/Contents/Developer/Platforms/MacOSX.platform/Developer/SDKs/MacOSX10.15.sdk   -w -Werror=date-time -fcommon -MD -MT MultiSource/Benchmarks/Prolangs-C/simulator/CMakeFiles/simulator.dir/machine.c.o -MF MultiSource/Benchmarks/Prolangs-C/simulator/CMakeFiles/simulator.dir/machine.c.o.d -o MultiSource/Benchmarks/Prolangs-C/simulator/CMakeFiles/simulator.dir/machine.c.o   -c /Users/buildslave/jenkins/workspace/test-suite-verify-machineinstrs-x86_64h-O3/test-suite/MultiSource/Benchmarks/Prolangs-C/simulator/machine.c
Fatal Error: error in backend: Found 4 machine code errors.
*** Bad machine code: Using an undefined physical register ***
- function:    SET_CC
- basic block: %bb.1 if.then (0x7fba5497efa8)
- instruction: $esi = SUB32rr $esi(tied-def 0), $r13d, implicit-def dead $eflags
- operand 2:   $r13d
fatal error: error in backend: Found 4 machine code errors.
PLEASE submit a bug report to https://bugs.llvm.org/ and include the crash backtrace, preprocessed source, and associated run script.
Stack dump:
Error: clang frontend command failed with exit code 70 (use -v to see invocation)
25 clang         0x00000001108cf07d clang::driver::Compilation::ExecuteCommand(clang::driver::Command const&, clang::driver::Command const*&) const + 221
26 clang         0x00000001108cf5dd clang::driver::Compilation::ExecuteJobs(clang::driver::JobList const&, llvm::SmallVectorImpl<std::__1::pair<int, clang::driver::Command const*> >&) const + 125
27 clang         0x00000001108e5fbc clang::driver::Driver::ExecuteCompilation(clang::driver::Compilation&, llvm::SmallVectorImpl<std::__1::pair<int, clang::driver::Command const*> >&) + 204
28 clang         0x000000010e01ae35 main + 10309
29 libdyld.dylib 0x00007fff67a6fcc9 start + 1
clang-13: error: clang frontend command failed with exit code 70 (use -v to see invocation)
clang version 13.0.0 (https://github.com/llvm/llvm-project.git 7c4e9a68264ffeef6178865be76c45c4fb6390af)
Target: x86_64h-apple-darwin19.5.0
Ninja target: block.c.o
[2572/7685] /Users/buildslave/jenkins/workspace/test-suite-verify-machineinstrs-x86_64h-O3/test-suite-build/tools/timeit --summary MultiSource/Applications/JM/ldecod/CMakeFiles/ldecod.dir/fmo.c.o.time /Users/buildslave/jenkins/workspace/test-suite-verify-machineinstrs-x86_64h-O3/compiler/bin/clang -DNDEBUG  -B /Applications/Xcode.app/Contents/Developer/Toolchains/XcodeDefault.xctoolchain/usr/bin    -Wno-unused-command-line-argument -mllvm -verify-machineinstrs -O3 -arch x86_64h -isysroot /Applications/Xcode.app/Contents/Developer/Platforms/MacOSX.platform/Developer/SDKs/MacOSX10.15.sdk   -w -Werror=date-time -fcommon -D__USE_LARGEFILE64 -D_FILE_OFFSET_BITS=64 -MD -MT MultiSource/Applications/JM/ldecod/CMakeFiles/ldecod.dir/fmo.c.o -MF MultiSource/Applications/JM/ldecod/CMakeFiles/ldecod.dir/fmo.c.o.d -o MultiSource/Applications/JM/ldecod/CMakeFiles/ldecod.dir/fmo.c.o   -c /Users/buildslave/jenkins/workspace/test-suite-verify-machineinstrs-x86_64h-O3/test-suite/MultiSource/Applications/JM/ldecod/fmo.c
[2573/7685] /Users/buildslave/jenkins/workspace/test-suite-verify-machineinstrs-x86_64h-O3/test-suite-build/tools/timeit --summary MicroBenchmarks/LCALS/SubsetCLambdaLoops/CMakeFiles/lcalsCLambda.dir/__/LCALSSuite.cxx.o.time /Users/buildslave/jenkins/workspace/test-suite-verify-machineinstrs-x86_64h-O3/compiler/bin/clang++  -DNDEBUG -I/Users/buildslave/jenkins/workspace/test-suite-verify-machineinstrs-x86_64h-O3/test-suite/MicroBenchmarks/libs/benchmark/src/../include -B /Applications/Xcode.app/Contents/Developer/Toolchains/XcodeDefault.xctoolchain/usr/bin    -Wno-unused-command-line-argument -mllvm -verify-machineinstrs -O3 -arch x86_64h -isysroot /Applications/Xcode.app/Contents/Developer/Platforms/MacOSX.platform/Developer/SDKs/MacOSX10.15.sdk   -w -Werror=date-time -std=c++11 -DLCALS_USE_DOUBLE -DLCALS_USE_RESTRICT_PTR -DLCALS_VERIFY_CHECKSUM -DLCALS_USE_CLOCK -DLCALS_COMPILER_CLANG -MD -MT MicroBenchmarks/LCALS/SubsetCLambdaLoops/CMakeFiles/lcalsCLambda.dir/__/LCALSSuite.cxx.o -MF MicroBenchmarks/LCALS/SubsetCLambdaLoops/CMakeFiles/lcalsCLambda.dir/__/LCALSSuite.cxx.o.d -o MicroBenchmarks/LCALS/SubsetCLambdaLoops/CMakeFiles/lcalsCLambda.dir/__/LCALSSuite.cxx.o -c /Users/buildslave/jenkins/workspace/test-suite-verify-machineinstrs-x86_64h-O3/test-suite/MicroBenchmarks/LCALS/LCALSSuite.cxx
[2574/7685] : && /Users/buildslave/jenkins/workspace/test-suite-verify-machineinstrs-x86_64h-O3/test-suite-build/tools/timeit --summary MicroBenchmarks/LCALS/SubsetCLambdaLoops/lcalsCLambda.link.time /Users/buildslave/jenkins/workspace/test-suite-verify-machineinstrs-x86_64h-O3/compiler/bin/clang++  -B /Applications/Xcode.app/Contents/Developer/Toolchains/XcodeDefault.xctoolchain/usr/bin    -Wno-unused-command-line-argument -mllvm -verify-machineinstrs -O3 -arch x86_64h -isysroot /Applications/Xcode.app/Contents/Developer/Platforms/MacOSX.platform/Developer/SDKs/MacOSX10.15.sdk -Wl,-search_paths_first -Wl,-headerpad_max_install_names -B /Applications/Xcode.app/Contents/Developer/Toolchains/XcodeDefault.xctoolchain/usr/bin MicroBenchmarks/LCALS/SubsetCLambdaLoops/CMakeFiles/lcalsCLambda.dir/__/main.cxx.o MicroBenchmarks/LCALS/SubsetCLambdaLoops/CMakeFiles/lcalsCLambda.dir/LambdaSubsetCbenchmarks.cxx.o MicroBenchmarks/LCALS/SubsetCLambdaLoops/CMakeFiles/lcalsCLambda.dir/__/LCALSStats.cxx.o MicroBenchmarks/LCALS/SubsetCLambdaLoops/CMakeFiles/lcalsCLambda.dir/__/LCALSSuite.cxx.o MicroBenchmarks/LCALS/SubsetCLambdaLoops/CMakeFiles/lcalsCLambda.dir/__/LCALSTraversalMethods.cxx.o MicroBenchmarks/LCALS/SubsetCLambdaLoops/CMakeFiles/lcalsCLambda.dir/__/runReferenceLoops.cxx.o  -o MicroBenchmarks/LCALS/SubsetCLambdaLoops/lcalsCLambda  -Wl,-no_pie  MicroBenchmarks/libs/benchmark/src/libbenchmark.a && :
[2575/7685] /Users/buildslave/jenkins/workspace/test-suite-verify-machineinstrs-x86_64h-O3/test-suite-build/tools/timeit --summary MultiSource/Applications/JM/ldecod/CMakeFiles/ldecod.dir/header.c.o.time /Users/buildslave/jenkins/workspace/test-suite-verify-machineinstrs-x86_64h-O3/compiler/bin/clang -DNDEBUG  -B /Applications/Xcode.app/Contents/Developer/Toolchains/XcodeDefault.xctoolchain/usr/bin    -Wno-unused-command-line-argument -mllvm -verify-machineinstrs -O3 -arch x86_64h -isysroot /Applications/Xcode.app/Contents/Developer/Platforms/MacOSX.platform/Developer/SDKs/MacOSX10.15.sdk   -w -Werror=date-time -fcommon -D__USE_LARGEFILE64 -D_FILE_OFFSET_BITS=64 -MD -MT MultiSource/Applications/JM/ldecod/CMakeFiles/ldecod.dir/header.c.o -MF MultiSource/Applications/JM/ldecod/CMakeFiles/ldecod.dir/header.c.o.d -o MultiSource/Applications/JM/ldecod/CMakeFiles/ldecod.dir/header.c.o   -c /Users/buildslave/jenkins/workspace/test-suite-verify-machineinstrs-x86_64h-O3/test-suite/MultiSource/Applications/JM/ldecod/header.c
[2576/7685] /Users/buildslave/jenkins/workspace/test-suite-verify-machineinstrs-x86_64h-O3/test-suite-build/tools/timeit --summary MultiSource/Applications/JM/ldecod/CMakeFiles/ldecod.dir/block.c.o.time /Users/buildslave/jenkins/workspace/test-suite-verify-machineinstrs-x86_64h-O3/compiler/bin/clang -DNDEBUG  -B /Applications/Xcode.app/Contents/Developer/Toolchains/XcodeDefault.xctoolchain/usr/bin    -Wno-unused-command-line-argument -mllvm -verify-machineinstrs -O3 -arch x86_64h -isysroot /Applications/Xcode.app/Contents/Developer/Platforms/MacOSX.platform/Developer/SDKs/MacOSX10.15.sdk   -w -Werror=date-time -fcommon -D__USE_LARGEFILE64 -D_FILE_OFFSET_BITS=64 -MD -MT MultiSource/Applications/JM/ldecod/CMakeFiles/ldecod.dir/block.c.o -MF MultiSource/Applications/JM/ldecod/CMakeFiles/ldecod.dir/block.c.o.d -o MultiSource/Applications/JM/ldecod/CMakeFiles/ldecod.dir/block.c.o   -c /Users/buildslave/jenkins/workspace/test-suite-verify-machineinstrs-x86_64h-O3/test-suite/MultiSource/Applications/JM/ldecod/block.c
FAILED: MultiSource/Applications/JM/ldecod/CMakeFiles/ldecod.dir/block.c.o 
/Users/buildslave/jenkins/workspace/test-suite-verify-machineinstrs-x86_64h-O3/test-suite-build/tools/timeit --summary MultiSource/Applications/JM/ldecod/CMakeFiles/ldecod.dir/block.c.o.time /Users/buildslave/jenkins/workspace/test-suite-verify-machineinstrs-x86_64h-O3/compiler/bin/clang -DNDEBUG  -B /Applications/Xcode.app/Contents/Developer/Toolchains/XcodeDefault.xctoolchain/usr/bin    -Wno-unused-command-line-argument -mllvm -verify-machineinstrs -O3 -arch x86_64h -isysroot /Applications/Xcode.app/Contents/Developer/Platforms/MacOSX.platform/Developer/SDKs/MacOSX10.15.sdk   -w -Werror=date-time -fcommon -D__USE_LARGEFILE64 -D_FILE_OFFSET_BITS=64 -MD -MT MultiSource/Applications/JM/ldecod/CMakeFiles/ldecod.dir/block.c.o -MF MultiSource/Applications/JM/ldecod/CMakeFiles/ldecod.dir/block.c.o.d -o MultiSource/Applications/JM/ldecod/CMakeFiles/ldecod.dir/block.c.o   -c /Users/buildslave/jenkins/workspace/test-suite-verify-machineinstrs-x86_64h-O3/test-suite/MultiSource/Applications/JM/ldecod/block.c
Fatal Error: error in backend: Found 2 machine code errors.
*** Bad machine code: Using an undefined physical register ***
- function:    itrans_sp
- basic block: %bb.0 entry (0x7f9d330bfec8)
- instruction: $r13d = SUB32rr $r13d(tied-def 0), $r10d, implicit-def dead $eflags
- operand 2:   $r10d
fatal error: error in backend: Found 2 machine code errors.
PLEASE submit a bug report to https://bugs.llvm.org/ and include the crash backtrace, preprocessed source, and associated run script.
Stack dump:
Error: clang frontend command failed with exit code 70 (use -v to see invocation)
25 clang         0x0000000108ed407d clang::driver::Compilation::ExecuteCommand(clang::driver::Command const&, clang::driver::Command const*&) const + 221
26 clang         0x0000000108ed45dd clang::driver::Compilation::ExecuteJobs(clang::driver::JobList const&, llvm::SmallVectorImpl<std::__1::pair<int, clang::driver::Command const*> >&) const + 125
27 clang         0x0000000108eeafbc clang::driver::Driver::ExecuteCompilation(clang::driver::Compilation&, llvm::SmallVectorImpl<std::__1::pair<int, clang::driver::Command const*> >&) + 204
28 clang         0x000000010661fe35 main + 10309
29 libdyld.dylib 0x00007fff67a6fcc9 start + 1
clang-13: error: clang frontend command failed with exit code 70 (use -v to see invocation)
clang version 13.0.0 (https://github.com/llvm/llvm-project.git 7c4e9a68264ffeef6178865be76c45c4fb6390af)
Target: x86_64h-apple-darwin19.5.0
Ninja target: oggenc.c.o
[2814/7685] /Users/buildslave/jenkins/workspace/test-suite-verify-machineinstrs-x86_64h-O3/test-suite-build/tools/timeit --summary MultiSource/Applications/kimwitu++/CMakeFiles/kc.dir/abs.cc.o.time /Users/buildslave/jenkins/workspace/test-suite-verify-machineinstrs-x86_64h-O3/compiler/bin/clang++  -DNDEBUG  -B /Applications/Xcode.app/Contents/Developer/Toolchains/XcodeDefault.xctoolchain/usr/bin    -Wno-unused-command-line-argument -mllvm -verify-machineinstrs -O3 -arch x86_64h -isysroot /Applications/Xcode.app/Contents/Developer/Platforms/MacOSX.platform/Developer/SDKs/MacOSX10.15.sdk   -w -Werror=date-time -I/Users/buildslave/jenkins/workspace/test-suite-verify-machineinstrs-x86_64h-O3/test-suite/MultiSource/Applications/kimwitu++ -DYYDEBUG=1 -MD -MT MultiSource/Applications/kimwitu++/CMakeFiles/kc.dir/abs.cc.o -MF MultiSource/Applications/kimwitu++/CMakeFiles/kc.dir/abs.cc.o.d -o MultiSource/Applications/kimwitu++/CMakeFiles/kc.dir/abs.cc.o -c /Users/buildslave/jenkins/workspace/test-suite-verify-machineinstrs-x86_64h-O3/test-suite/MultiSource/Applications/kimwitu++/abs.cc
[2815/7685] /Users/buildslave/jenkins/workspace/test-suite-verify-machineinstrs-x86_64h-O3/test-suite-build/tools/timeit --summary MultiSource/Applications/kimwitu++/CMakeFiles/kc.dir/gen.cc.o.time /Users/buildslave/jenkins/workspace/test-suite-verify-machineinstrs-x86_64h-O3/compiler/bin/clang++  -DNDEBUG  -B /Applications/Xcode.app/Contents/Developer/Toolchains/XcodeDefault.xctoolchain/usr/bin    -Wno-unused-command-line-argument -mllvm -verify-machineinstrs -O3 -arch x86_64h -isysroot /Applications/Xcode.app/Contents/Developer/Platforms/MacOSX.platform/Developer/SDKs/MacOSX10.15.sdk   -w -Werror=date-time -I/Users/buildslave/jenkins/workspace/test-suite-verify-machineinstrs-x86_64h-O3/test-suite/MultiSource/Applications/kimwitu++ -DYYDEBUG=1 -MD -MT MultiSource/Applications/kimwitu++/CMakeFiles/kc.dir/gen.cc.o -MF MultiSource/Applications/kimwitu++/CMakeFiles/kc.dir/gen.cc.o.d -o MultiSource/Applications/kimwitu++/CMakeFiles/kc.dir/gen.cc.o -c /Users/buildslave/jenkins/workspace/test-suite-verify-machineinstrs-x86_64h-O3/test-suite/MultiSource/Applications/kimwitu++/gen.cc
[2816/7685] /Users/buildslave/jenkins/workspace/test-suite-verify-machineinstrs-x86_64h-O3/test-suite-build/tools/timeit --summary MultiSource/Applications/kimwitu++/CMakeFiles/kc.dir/error.cc.o.time /Users/buildslave/jenkins/workspace/test-suite-verify-machineinstrs-x86_64h-O3/compiler/bin/clang++  -DNDEBUG  -B /Applications/Xcode.app/Contents/Developer/Toolchains/XcodeDefault.xctoolchain/usr/bin    -Wno-unused-command-line-argument -mllvm -verify-machineinstrs -O3 -arch x86_64h -isysroot /Applications/Xcode.app/Contents/Developer/Platforms/MacOSX.platform/Developer/SDKs/MacOSX10.15.sdk   -w -Werror=date-time -I/Users/buildslave/jenkins/workspace/test-suite-verify-machineinstrs-x86_64h-O3/test-suite/MultiSource/Applications/kimwitu++ -DYYDEBUG=1 -MD -MT MultiSource/Applications/kimwitu++/CMakeFiles/kc.dir/error.cc.o -MF MultiSource/Applications/kimwitu++/CMakeFiles/kc.dir/error.cc.o.d -o MultiSource/Applications/kimwitu++/CMakeFiles/kc.dir/error.cc.o -c /Users/buildslave/jenkins/workspace/test-suite-verify-machineinstrs-x86_64h-O3/test-suite/MultiSource/Applications/kimwitu++/error.cc
[2817/7685] /Users/buildslave/jenkins/workspace/test-suite-verify-machineinstrs-x86_64h-O3/test-suite-build/tools/timeit --summary MultiSource/Applications/kimwitu++/CMakeFiles/kc.dir/gutil.cc.o.time /Users/buildslave/jenkins/workspace/test-suite-verify-machineinstrs-x86_64h-O3/compiler/bin/clang++  -DNDEBUG  -B /Applications/Xcode.app/Contents/Developer/Toolchains/XcodeDefault.xctoolchain/usr/bin    -Wno-unused-command-line-argument -mllvm -verify-machineinstrs -O3 -arch x86_64h -isysroot /Applications/Xcode.app/Contents/Developer/Platforms/MacOSX.platform/Developer/SDKs/MacOSX10.15.sdk   -w -Werror=date-time -I/Users/buildslave/jenkins/workspace/test-suite-verify-machineinstrs-x86_64h-O3/test-suite/MultiSource/Applications/kimwitu++ -DYYDEBUG=1 -MD -MT MultiSource/Applications/kimwitu++/CMakeFiles/kc.dir/gutil.cc.o -MF MultiSource/Applications/kimwitu++/CMakeFiles/kc.dir/gutil.cc.o.d -o MultiSource/Applications/kimwitu++/CMakeFiles/kc.dir/gutil.cc.o -c /Users/buildslave/jenkins/workspace/test-suite-verify-machineinstrs-x86_64h-O3/test-suite/MultiSource/Applications/kimwitu++/gutil.cc
[2818/7685] /Users/buildslave/jenkins/workspace/test-suite-verify-machineinstrs-x86_64h-O3/test-suite-build/tools/timeit --summary MultiSource/Applications/oggenc/CMakeFiles/oggenc.dir/oggenc.c.o.time /Users/buildslave/jenkins/workspace/test-suite-verify-machineinstrs-x86_64h-O3/compiler/bin/clang -DNDEBUG  -B /Applications/Xcode.app/Contents/Developer/Toolchains/XcodeDefault.xctoolchain/usr/bin    -Wno-unused-command-line-argument -mllvm -verify-machineinstrs -O3 -arch x86_64h -isysroot /Applications/Xcode.app/Contents/Developer/Platforms/MacOSX.platform/Developer/SDKs/MacOSX10.15.sdk   -w -Werror=date-time -fno-strict-aliasing -ffp-contract=off -DFMA_DISABLED=1 -ffp-contract=off -DFMA_DISABLED=1 -MD -MT MultiSource/Applications/oggenc/CMakeFiles/oggenc.dir/oggenc.c.o -MF MultiSource/Applications/oggenc/CMakeFiles/oggenc.dir/oggenc.c.o.d -o MultiSource/Applications/oggenc/CMakeFiles/oggenc.dir/oggenc.c.o   -c /Users/buildslave/jenkins/workspace/test-suite-verify-machineinstrs-x86_64h-O3/test-suite/MultiSource/Applications/oggenc/oggenc.c
FAILED: MultiSource/Applications/oggenc/CMakeFiles/oggenc.dir/oggenc.c.o 
/Users/buildslave/jenkins/workspace/test-suite-verify-machineinstrs-x86_64h-O3/test-suite-build/tools/timeit --summary MultiSource/Applications/oggenc/CMakeFiles/oggenc.dir/oggenc.c.o.time /Users/buildslave/jenkins/workspace/test-suite-verify-machineinstrs-x86_64h-O3/compiler/bin/clang -DNDEBUG  -B /Applications/Xcode.app/Contents/Developer/Toolchains/XcodeDefault.xctoolchain/usr/bin    -Wno-unused-command-line-argument -mllvm -verify-machineinstrs -O3 -arch x86_64h -isysroot /Applications/Xcode.app/Contents/Developer/Platforms/MacOSX.platform/Developer/SDKs/MacOSX10.15.sdk   -w -Werror=date-time -fno-strict-aliasing -ffp-contract=off -DFMA_DISABLED=1 -ffp-contract=off -DFMA_DISABLED=1 -MD -MT MultiSource/Applications/oggenc/CMakeFiles/oggenc.dir/oggenc.c.o -MF MultiSource/Applications/oggenc/CMakeFiles/oggenc.dir/oggenc.c.o.d -o MultiSource/Applications/oggenc/CMakeFiles/oggenc.dir/oggenc.c.o   -c /Users/buildslave/jenkins/workspace/test-suite-verify-machineinstrs-x86_64h-O3/test-suite/MultiSource/Applications/oggenc/oggenc.c
Fatal Error: error in backend: Found 2 machine code errors.
*** Bad machine code: Using an undefined physical register ***
- function:    vorbis_analysis_blockout
- basic block: %bb.17 if.end.i (0x7f7f0239de80)
- instruction: $rax = SUB64rr $rax(tied-def 0), $rcx, implicit-def dead $eflags
- operand 2:   $rcx
fatal error: error in backend: Found 2 machine code errors.
PLEASE submit a bug report to https://bugs.llvm.org/ and include the crash backtrace, preprocessed source, and associated run script.
Stack dump:
Error: clang frontend command failed with exit code 70 (use -v to see invocation)
25 clang         0x000000010a51e07d clang::driver::Compilation::ExecuteCommand(clang::driver::Command const&, clang::driver::Command const*&) const + 221
26 clang         0x000000010a51e5dd clang::driver::Compilation::ExecuteJobs(clang::driver::JobList const&, llvm::SmallVectorImpl<std::__1::pair<int, clang::driver::Command const*> >&) const + 125
27 clang         0x000000010a534fbc clang::driver::Driver::ExecuteCompilation(clang::driver::Compilation&, llvm::SmallVectorImpl<std::__1::pair<int, clang::driver::Command const*> >&) + 204
28 clang         0x0000000107c69e35 main + 10309
29 libdyld.dylib 0x00007fff67a6fcc9 start + 1
clang-13: error: clang frontend command failed with exit code 70 (use -v to see invocation)
clang version 13.0.0 (https://github.com/llvm/llvm-project.git 7c4e9a68264ffeef6178865be76c45c4fb6390af)
Target: x86_64h-apple-darwin19.5.0

Build Log

Changes
  1. [lld-macho] Implement cstring deduplication (details)
  2. [lld-macho] Implement -force_load_swift_libs (details)
  3. BPF: fix relocation types in lib/Object/RelocationResolver.cpp (details)
  4. [RISCV] Use AVL Operand instead of GPR for tied mask pseudo for vwadd.wv and similar. (details)
  5. [RISCV] Masked compares should use a tail agnostic policy. (details)
  6. [RISCV] Use 0 for Log2SEW for vle1/vse1 intrinsics to enable vsetvli optimization. (details)

Started by upstream project relay-test-suite-verify-machineinstrs build number 10013
originally caused by:

This run spent:

  • 2 hr 7 min waiting;
  • 2 hr 32 min build duration;
  • 2 hr 32 min total from scheduled to completion.
Revision: c24b5268477630cb2efd8bf2f7fb3945343e7d03
Repository: https://github.com/llvm/llvm-zorg.git
  • refs/remotes/origin/main
Revision: 7c4e9a68264ffeef6178865be76c45c4fb6390af
Repository: http://labmaster3.local/git/llvm-project.git
  • detached
Revision: f48d431f44610e339d00a33d57564c6029c4ff43
Repository: https://github.com/llvm/llvm-lnt.git
  • refs/remotes/origin/main
Revision: ccc86f938839d02de3a6564b2d80fb47a60aa069
Repository: https://github.com/llvm/llvm-test-suite.git
  • refs/remotes/origin/main

Identified problems

Compile Error

This build failed because of a compile error. Below is a list of all errors in the build log:
Indication 1

Ninja target failed

Below is a link to the first failed ninja target.
Indication 2