Started 3 mo 12 days ago
Took 1 hr 59 min

Build clang-d390467-gb889c6ee9911-t21477-b21477.tar.gz (Jun 8, 2021 2:42:40 AM)

Issues

Found 9 issues:
Ninja target: machine.c.o
[1895/7685] /Users/buildslave/jenkins/workspace/test-suite-verify-machineinstrs-x86_64h-O3/test-suite-build/tools/timeit --summary MultiSource/Benchmarks/Prolangs-C/unix-tbl/CMakeFiles/unix-tbl.dir/t2.c.o.time /Users/buildslave/jenkins/workspace/test-suite-verify-machineinstrs-x86_64h-O3/compiler/bin/clang -DNDEBUG  -B /Applications/Xcode.app/Contents/Developer/Toolchains/XcodeDefault.xctoolchain/usr/bin    -Wno-unused-command-line-argument -mllvm -verify-machineinstrs -O3 -arch x86_64h -isysroot /Applications/Xcode.app/Contents/Developer/Platforms/MacOSX.platform/Developer/SDKs/MacOSX10.15.sdk   -w -Werror=date-time -MD -MT MultiSource/Benchmarks/Prolangs-C/unix-tbl/CMakeFiles/unix-tbl.dir/t2.c.o -MF MultiSource/Benchmarks/Prolangs-C/unix-tbl/CMakeFiles/unix-tbl.dir/t2.c.o.d -o MultiSource/Benchmarks/Prolangs-C/unix-tbl/CMakeFiles/unix-tbl.dir/t2.c.o   -c /Users/buildslave/jenkins/workspace/test-suite-verify-machineinstrs-x86_64h-O3/test-suite/MultiSource/Benchmarks/Prolangs-C/unix-tbl/t2.c
[1896/7685] /Users/buildslave/jenkins/workspace/test-suite-verify-machineinstrs-x86_64h-O3/test-suite-build/tools/timeit --summary MultiSource/Benchmarks/Prolangs-C/unix-tbl/CMakeFiles/unix-tbl.dir/t1.c.o.time /Users/buildslave/jenkins/workspace/test-suite-verify-machineinstrs-x86_64h-O3/compiler/bin/clang -DNDEBUG  -B /Applications/Xcode.app/Contents/Developer/Toolchains/XcodeDefault.xctoolchain/usr/bin    -Wno-unused-command-line-argument -mllvm -verify-machineinstrs -O3 -arch x86_64h -isysroot /Applications/Xcode.app/Contents/Developer/Platforms/MacOSX.platform/Developer/SDKs/MacOSX10.15.sdk   -w -Werror=date-time -MD -MT MultiSource/Benchmarks/Prolangs-C/unix-tbl/CMakeFiles/unix-tbl.dir/t1.c.o -MF MultiSource/Benchmarks/Prolangs-C/unix-tbl/CMakeFiles/unix-tbl.dir/t1.c.o.d -o MultiSource/Benchmarks/Prolangs-C/unix-tbl/CMakeFiles/unix-tbl.dir/t1.c.o   -c /Users/buildslave/jenkins/workspace/test-suite-verify-machineinstrs-x86_64h-O3/test-suite/MultiSource/Benchmarks/Prolangs-C/unix-tbl/t1.c
[1897/7685] /Users/buildslave/jenkins/workspace/test-suite-verify-machineinstrs-x86_64h-O3/test-suite-build/tools/timeit --summary MultiSource/Benchmarks/Prolangs-C/simulator/CMakeFiles/simulator.dir/debugger.c.o.time /Users/buildslave/jenkins/workspace/test-suite-verify-machineinstrs-x86_64h-O3/compiler/bin/clang -DNDEBUG  -B /Applications/Xcode.app/Contents/Developer/Toolchains/XcodeDefault.xctoolchain/usr/bin    -Wno-unused-command-line-argument -mllvm -verify-machineinstrs -O3 -arch x86_64h -isysroot /Applications/Xcode.app/Contents/Developer/Platforms/MacOSX.platform/Developer/SDKs/MacOSX10.15.sdk   -w -Werror=date-time -fcommon -MD -MT MultiSource/Benchmarks/Prolangs-C/simulator/CMakeFiles/simulator.dir/debugger.c.o -MF MultiSource/Benchmarks/Prolangs-C/simulator/CMakeFiles/simulator.dir/debugger.c.o.d -o MultiSource/Benchmarks/Prolangs-C/simulator/CMakeFiles/simulator.dir/debugger.c.o   -c /Users/buildslave/jenkins/workspace/test-suite-verify-machineinstrs-x86_64h-O3/test-suite/MultiSource/Benchmarks/Prolangs-C/simulator/debugger.c
[1898/7685] /Users/buildslave/jenkins/workspace/test-suite-verify-machineinstrs-x86_64h-O3/test-suite-build/tools/timeit --summary MultiSource/Benchmarks/Prolangs-C/unix-tbl/CMakeFiles/unix-tbl.dir/t3.c.o.time /Users/buildslave/jenkins/workspace/test-suite-verify-machineinstrs-x86_64h-O3/compiler/bin/clang -DNDEBUG  -B /Applications/Xcode.app/Contents/Developer/Toolchains/XcodeDefault.xctoolchain/usr/bin    -Wno-unused-command-line-argument -mllvm -verify-machineinstrs -O3 -arch x86_64h -isysroot /Applications/Xcode.app/Contents/Developer/Platforms/MacOSX.platform/Developer/SDKs/MacOSX10.15.sdk   -w -Werror=date-time -MD -MT MultiSource/Benchmarks/Prolangs-C/unix-tbl/CMakeFiles/unix-tbl.dir/t3.c.o -MF MultiSource/Benchmarks/Prolangs-C/unix-tbl/CMakeFiles/unix-tbl.dir/t3.c.o.d -o MultiSource/Benchmarks/Prolangs-C/unix-tbl/CMakeFiles/unix-tbl.dir/t3.c.o   -c /Users/buildslave/jenkins/workspace/test-suite-verify-machineinstrs-x86_64h-O3/test-suite/MultiSource/Benchmarks/Prolangs-C/unix-tbl/t3.c
[1899/7685] /Users/buildslave/jenkins/workspace/test-suite-verify-machineinstrs-x86_64h-O3/test-suite-build/tools/timeit --summary MultiSource/Benchmarks/Prolangs-C/simulator/CMakeFiles/simulator.dir/machine.c.o.time /Users/buildslave/jenkins/workspace/test-suite-verify-machineinstrs-x86_64h-O3/compiler/bin/clang -DNDEBUG  -B /Applications/Xcode.app/Contents/Developer/Toolchains/XcodeDefault.xctoolchain/usr/bin    -Wno-unused-command-line-argument -mllvm -verify-machineinstrs -O3 -arch x86_64h -isysroot /Applications/Xcode.app/Contents/Developer/Platforms/MacOSX.platform/Developer/SDKs/MacOSX10.15.sdk   -w -Werror=date-time -fcommon -MD -MT MultiSource/Benchmarks/Prolangs-C/simulator/CMakeFiles/simulator.dir/machine.c.o -MF MultiSource/Benchmarks/Prolangs-C/simulator/CMakeFiles/simulator.dir/machine.c.o.d -o MultiSource/Benchmarks/Prolangs-C/simulator/CMakeFiles/simulator.dir/machine.c.o   -c /Users/buildslave/jenkins/workspace/test-suite-verify-machineinstrs-x86_64h-O3/test-suite/MultiSource/Benchmarks/Prolangs-C/simulator/machine.c
FAILED: MultiSource/Benchmarks/Prolangs-C/simulator/CMakeFiles/simulator.dir/machine.c.o 
/Users/buildslave/jenkins/workspace/test-suite-verify-machineinstrs-x86_64h-O3/test-suite-build/tools/timeit --summary MultiSource/Benchmarks/Prolangs-C/simulator/CMakeFiles/simulator.dir/machine.c.o.time /Users/buildslave/jenkins/workspace/test-suite-verify-machineinstrs-x86_64h-O3/compiler/bin/clang -DNDEBUG  -B /Applications/Xcode.app/Contents/Developer/Toolchains/XcodeDefault.xctoolchain/usr/bin    -Wno-unused-command-line-argument -mllvm -verify-machineinstrs -O3 -arch x86_64h -isysroot /Applications/Xcode.app/Contents/Developer/Platforms/MacOSX.platform/Developer/SDKs/MacOSX10.15.sdk   -w -Werror=date-time -fcommon -MD -MT MultiSource/Benchmarks/Prolangs-C/simulator/CMakeFiles/simulator.dir/machine.c.o -MF MultiSource/Benchmarks/Prolangs-C/simulator/CMakeFiles/simulator.dir/machine.c.o.d -o MultiSource/Benchmarks/Prolangs-C/simulator/CMakeFiles/simulator.dir/machine.c.o   -c /Users/buildslave/jenkins/workspace/test-suite-verify-machineinstrs-x86_64h-O3/test-suite/MultiSource/Benchmarks/Prolangs-C/simulator/machine.c
Fatal Error: error in backend: Found 4 machine code errors.
*** Bad machine code: Using an undefined physical register ***
- function:    SET_CC
- basic block: %bb.1 if.then (0x7ffc85039fa8)
- instruction: $esi = SUB32rr $esi(tied-def 0), $r13d, implicit-def dead $eflags
- operand 2:   $r13d
fatal error: error in backend: Found 4 machine code errors.
PLEASE submit a bug report to https://bugs.llvm.org/ and include the crash backtrace, preprocessed source, and associated run script.
Stack dump:
Error: clang frontend command failed with exit code 70 (use -v to see invocation)
25 clang         0x0000000107d889ed clang::driver::Compilation::ExecuteCommand(clang::driver::Command const&, clang::driver::Command const*&) const + 221
26 clang         0x0000000107d88f4d clang::driver::Compilation::ExecuteJobs(clang::driver::JobList const&, llvm::SmallVectorImpl<std::__1::pair<int, clang::driver::Command const*> >&) const + 125
27 clang         0x0000000107d9f92c clang::driver::Driver::ExecuteCompilation(clang::driver::Compilation&, llvm::SmallVectorImpl<std::__1::pair<int, clang::driver::Command const*> >&) + 204
28 clang         0x00000001054d4775 main + 10309
29 libdyld.dylib 0x00007fff67a6fcc9 start + 1
clang-13: error: clang frontend command failed with exit code 70 (use -v to see invocation)
clang version 13.0.0 (https://github.com/llvm/llvm-project.git b889c6ee9911b72a58986d528f42dd18cbdf92d7)
Target: x86_64h-apple-darwin19.5.0
Ninja target: block.c.o
[2657/7685] /Users/buildslave/jenkins/workspace/test-suite-verify-machineinstrs-x86_64h-O3/test-suite-build/tools/timeit --summary MultiSource/Applications/JM/ldecod/CMakeFiles/ldecod.dir/filehandle.c.o.time /Users/buildslave/jenkins/workspace/test-suite-verify-machineinstrs-x86_64h-O3/compiler/bin/clang -DNDEBUG  -B /Applications/Xcode.app/Contents/Developer/Toolchains/XcodeDefault.xctoolchain/usr/bin    -Wno-unused-command-line-argument -mllvm -verify-machineinstrs -O3 -arch x86_64h -isysroot /Applications/Xcode.app/Contents/Developer/Platforms/MacOSX.platform/Developer/SDKs/MacOSX10.15.sdk   -w -Werror=date-time -fcommon -D__USE_LARGEFILE64 -D_FILE_OFFSET_BITS=64 -MD -MT MultiSource/Applications/JM/ldecod/CMakeFiles/ldecod.dir/filehandle.c.o -MF MultiSource/Applications/JM/ldecod/CMakeFiles/ldecod.dir/filehandle.c.o.d -o MultiSource/Applications/JM/ldecod/CMakeFiles/ldecod.dir/filehandle.c.o   -c /Users/buildslave/jenkins/workspace/test-suite-verify-machineinstrs-x86_64h-O3/test-suite/MultiSource/Applications/JM/ldecod/filehandle.c
[2658/7685] /Users/buildslave/jenkins/workspace/test-suite-verify-machineinstrs-x86_64h-O3/test-suite-build/tools/timeit --summary MicroBenchmarks/LCALS/SubsetCLambdaLoops/CMakeFiles/lcalsCLambda.dir/__/LCALSSuite.cxx.o.time /Users/buildslave/jenkins/workspace/test-suite-verify-machineinstrs-x86_64h-O3/compiler/bin/clang++  -DNDEBUG -I/Users/buildslave/jenkins/workspace/test-suite-verify-machineinstrs-x86_64h-O3/test-suite/MicroBenchmarks/libs/benchmark/src/../include -B /Applications/Xcode.app/Contents/Developer/Toolchains/XcodeDefault.xctoolchain/usr/bin    -Wno-unused-command-line-argument -mllvm -verify-machineinstrs -O3 -arch x86_64h -isysroot /Applications/Xcode.app/Contents/Developer/Platforms/MacOSX.platform/Developer/SDKs/MacOSX10.15.sdk   -w -Werror=date-time -std=c++11 -DLCALS_USE_DOUBLE -DLCALS_USE_RESTRICT_PTR -DLCALS_VERIFY_CHECKSUM -DLCALS_USE_CLOCK -DLCALS_COMPILER_CLANG -MD -MT MicroBenchmarks/LCALS/SubsetCLambdaLoops/CMakeFiles/lcalsCLambda.dir/__/LCALSSuite.cxx.o -MF MicroBenchmarks/LCALS/SubsetCLambdaLoops/CMakeFiles/lcalsCLambda.dir/__/LCALSSuite.cxx.o.d -o MicroBenchmarks/LCALS/SubsetCLambdaLoops/CMakeFiles/lcalsCLambda.dir/__/LCALSSuite.cxx.o -c /Users/buildslave/jenkins/workspace/test-suite-verify-machineinstrs-x86_64h-O3/test-suite/MicroBenchmarks/LCALS/LCALSSuite.cxx
[2659/7685] : && /Users/buildslave/jenkins/workspace/test-suite-verify-machineinstrs-x86_64h-O3/test-suite-build/tools/timeit --summary MicroBenchmarks/LCALS/SubsetCLambdaLoops/lcalsCLambda.link.time /Users/buildslave/jenkins/workspace/test-suite-verify-machineinstrs-x86_64h-O3/compiler/bin/clang++  -B /Applications/Xcode.app/Contents/Developer/Toolchains/XcodeDefault.xctoolchain/usr/bin    -Wno-unused-command-line-argument -mllvm -verify-machineinstrs -O3 -arch x86_64h -isysroot /Applications/Xcode.app/Contents/Developer/Platforms/MacOSX.platform/Developer/SDKs/MacOSX10.15.sdk -Wl,-search_paths_first -Wl,-headerpad_max_install_names -B /Applications/Xcode.app/Contents/Developer/Toolchains/XcodeDefault.xctoolchain/usr/bin MicroBenchmarks/LCALS/SubsetCLambdaLoops/CMakeFiles/lcalsCLambda.dir/__/main.cxx.o MicroBenchmarks/LCALS/SubsetCLambdaLoops/CMakeFiles/lcalsCLambda.dir/LambdaSubsetCbenchmarks.cxx.o MicroBenchmarks/LCALS/SubsetCLambdaLoops/CMakeFiles/lcalsCLambda.dir/__/LCALSStats.cxx.o MicroBenchmarks/LCALS/SubsetCLambdaLoops/CMakeFiles/lcalsCLambda.dir/__/LCALSSuite.cxx.o MicroBenchmarks/LCALS/SubsetCLambdaLoops/CMakeFiles/lcalsCLambda.dir/__/LCALSTraversalMethods.cxx.o MicroBenchmarks/LCALS/SubsetCLambdaLoops/CMakeFiles/lcalsCLambda.dir/__/runReferenceLoops.cxx.o  -o MicroBenchmarks/LCALS/SubsetCLambdaLoops/lcalsCLambda  -Wl,-no_pie  MicroBenchmarks/libs/benchmark/src/libbenchmark.a && :
[2660/7685] /Users/buildslave/jenkins/workspace/test-suite-verify-machineinstrs-x86_64h-O3/test-suite-build/tools/timeit --summary MultiSource/Applications/JM/ldecod/CMakeFiles/ldecod.dir/fmo.c.o.time /Users/buildslave/jenkins/workspace/test-suite-verify-machineinstrs-x86_64h-O3/compiler/bin/clang -DNDEBUG  -B /Applications/Xcode.app/Contents/Developer/Toolchains/XcodeDefault.xctoolchain/usr/bin    -Wno-unused-command-line-argument -mllvm -verify-machineinstrs -O3 -arch x86_64h -isysroot /Applications/Xcode.app/Contents/Developer/Platforms/MacOSX.platform/Developer/SDKs/MacOSX10.15.sdk   -w -Werror=date-time -fcommon -D__USE_LARGEFILE64 -D_FILE_OFFSET_BITS=64 -MD -MT MultiSource/Applications/JM/ldecod/CMakeFiles/ldecod.dir/fmo.c.o -MF MultiSource/Applications/JM/ldecod/CMakeFiles/ldecod.dir/fmo.c.o.d -o MultiSource/Applications/JM/ldecod/CMakeFiles/ldecod.dir/fmo.c.o   -c /Users/buildslave/jenkins/workspace/test-suite-verify-machineinstrs-x86_64h-O3/test-suite/MultiSource/Applications/JM/ldecod/fmo.c
[2661/7685] /Users/buildslave/jenkins/workspace/test-suite-verify-machineinstrs-x86_64h-O3/test-suite-build/tools/timeit --summary MultiSource/Applications/JM/ldecod/CMakeFiles/ldecod.dir/block.c.o.time /Users/buildslave/jenkins/workspace/test-suite-verify-machineinstrs-x86_64h-O3/compiler/bin/clang -DNDEBUG  -B /Applications/Xcode.app/Contents/Developer/Toolchains/XcodeDefault.xctoolchain/usr/bin    -Wno-unused-command-line-argument -mllvm -verify-machineinstrs -O3 -arch x86_64h -isysroot /Applications/Xcode.app/Contents/Developer/Platforms/MacOSX.platform/Developer/SDKs/MacOSX10.15.sdk   -w -Werror=date-time -fcommon -D__USE_LARGEFILE64 -D_FILE_OFFSET_BITS=64 -MD -MT MultiSource/Applications/JM/ldecod/CMakeFiles/ldecod.dir/block.c.o -MF MultiSource/Applications/JM/ldecod/CMakeFiles/ldecod.dir/block.c.o.d -o MultiSource/Applications/JM/ldecod/CMakeFiles/ldecod.dir/block.c.o   -c /Users/buildslave/jenkins/workspace/test-suite-verify-machineinstrs-x86_64h-O3/test-suite/MultiSource/Applications/JM/ldecod/block.c
FAILED: MultiSource/Applications/JM/ldecod/CMakeFiles/ldecod.dir/block.c.o 
/Users/buildslave/jenkins/workspace/test-suite-verify-machineinstrs-x86_64h-O3/test-suite-build/tools/timeit --summary MultiSource/Applications/JM/ldecod/CMakeFiles/ldecod.dir/block.c.o.time /Users/buildslave/jenkins/workspace/test-suite-verify-machineinstrs-x86_64h-O3/compiler/bin/clang -DNDEBUG  -B /Applications/Xcode.app/Contents/Developer/Toolchains/XcodeDefault.xctoolchain/usr/bin    -Wno-unused-command-line-argument -mllvm -verify-machineinstrs -O3 -arch x86_64h -isysroot /Applications/Xcode.app/Contents/Developer/Platforms/MacOSX.platform/Developer/SDKs/MacOSX10.15.sdk   -w -Werror=date-time -fcommon -D__USE_LARGEFILE64 -D_FILE_OFFSET_BITS=64 -MD -MT MultiSource/Applications/JM/ldecod/CMakeFiles/ldecod.dir/block.c.o -MF MultiSource/Applications/JM/ldecod/CMakeFiles/ldecod.dir/block.c.o.d -o MultiSource/Applications/JM/ldecod/CMakeFiles/ldecod.dir/block.c.o   -c /Users/buildslave/jenkins/workspace/test-suite-verify-machineinstrs-x86_64h-O3/test-suite/MultiSource/Applications/JM/ldecod/block.c
Fatal Error: error in backend: Found 2 machine code errors.
*** Bad machine code: Using an undefined physical register ***
- function:    itrans_sp
- basic block: %bb.0 entry (0x7fc9488196c8)
- instruction: $r13d = SUB32rr $r13d(tied-def 0), $r10d, implicit-def dead $eflags
- operand 2:   $r10d
fatal error: error in backend: Found 2 machine code errors.
PLEASE submit a bug report to https://bugs.llvm.org/ and include the crash backtrace, preprocessed source, and associated run script.
Stack dump:
Error: clang frontend command failed with exit code 70 (use -v to see invocation)
25 clang         0x000000010ec3b9ed clang::driver::Compilation::ExecuteCommand(clang::driver::Command const&, clang::driver::Command const*&) const + 221
26 clang         0x000000010ec3bf4d clang::driver::Compilation::ExecuteJobs(clang::driver::JobList const&, llvm::SmallVectorImpl<std::__1::pair<int, clang::driver::Command const*> >&) const + 125
27 clang         0x000000010ec5292c clang::driver::Driver::ExecuteCompilation(clang::driver::Compilation&, llvm::SmallVectorImpl<std::__1::pair<int, clang::driver::Command const*> >&) + 204
28 clang         0x000000010c387775 main + 10309
29 libdyld.dylib 0x00007fff67a6fcc9 start + 1
clang-13: error: clang frontend command failed with exit code 70 (use -v to see invocation)
clang version 13.0.0 (https://github.com/llvm/llvm-project.git b889c6ee9911b72a58986d528f42dd18cbdf92d7)
Target: x86_64h-apple-darwin19.5.0
Ninja target: oggenc.c.o
[2900/7685] /Users/buildslave/jenkins/workspace/test-suite-verify-machineinstrs-x86_64h-O3/test-suite-build/tools/timeit --summary MultiSource/Applications/kimwitu++/CMakeFiles/kc.dir/abs.cc.o.time /Users/buildslave/jenkins/workspace/test-suite-verify-machineinstrs-x86_64h-O3/compiler/bin/clang++  -DNDEBUG  -B /Applications/Xcode.app/Contents/Developer/Toolchains/XcodeDefault.xctoolchain/usr/bin    -Wno-unused-command-line-argument -mllvm -verify-machineinstrs -O3 -arch x86_64h -isysroot /Applications/Xcode.app/Contents/Developer/Platforms/MacOSX.platform/Developer/SDKs/MacOSX10.15.sdk   -w -Werror=date-time -I/Users/buildslave/jenkins/workspace/test-suite-verify-machineinstrs-x86_64h-O3/test-suite/MultiSource/Applications/kimwitu++ -DYYDEBUG=1 -MD -MT MultiSource/Applications/kimwitu++/CMakeFiles/kc.dir/abs.cc.o -MF MultiSource/Applications/kimwitu++/CMakeFiles/kc.dir/abs.cc.o.d -o MultiSource/Applications/kimwitu++/CMakeFiles/kc.dir/abs.cc.o -c /Users/buildslave/jenkins/workspace/test-suite-verify-machineinstrs-x86_64h-O3/test-suite/MultiSource/Applications/kimwitu++/abs.cc
[2901/7685] /Users/buildslave/jenkins/workspace/test-suite-verify-machineinstrs-x86_64h-O3/test-suite-build/tools/timeit --summary MultiSource/Applications/kimwitu++/CMakeFiles/kc.dir/gen.cc.o.time /Users/buildslave/jenkins/workspace/test-suite-verify-machineinstrs-x86_64h-O3/compiler/bin/clang++  -DNDEBUG  -B /Applications/Xcode.app/Contents/Developer/Toolchains/XcodeDefault.xctoolchain/usr/bin    -Wno-unused-command-line-argument -mllvm -verify-machineinstrs -O3 -arch x86_64h -isysroot /Applications/Xcode.app/Contents/Developer/Platforms/MacOSX.platform/Developer/SDKs/MacOSX10.15.sdk   -w -Werror=date-time -I/Users/buildslave/jenkins/workspace/test-suite-verify-machineinstrs-x86_64h-O3/test-suite/MultiSource/Applications/kimwitu++ -DYYDEBUG=1 -MD -MT MultiSource/Applications/kimwitu++/CMakeFiles/kc.dir/gen.cc.o -MF MultiSource/Applications/kimwitu++/CMakeFiles/kc.dir/gen.cc.o.d -o MultiSource/Applications/kimwitu++/CMakeFiles/kc.dir/gen.cc.o -c /Users/buildslave/jenkins/workspace/test-suite-verify-machineinstrs-x86_64h-O3/test-suite/MultiSource/Applications/kimwitu++/gen.cc
[2902/7685] /Users/buildslave/jenkins/workspace/test-suite-verify-machineinstrs-x86_64h-O3/test-suite-build/tools/timeit --summary MultiSource/Applications/kimwitu++/CMakeFiles/kc.dir/error.cc.o.time /Users/buildslave/jenkins/workspace/test-suite-verify-machineinstrs-x86_64h-O3/compiler/bin/clang++  -DNDEBUG  -B /Applications/Xcode.app/Contents/Developer/Toolchains/XcodeDefault.xctoolchain/usr/bin    -Wno-unused-command-line-argument -mllvm -verify-machineinstrs -O3 -arch x86_64h -isysroot /Applications/Xcode.app/Contents/Developer/Platforms/MacOSX.platform/Developer/SDKs/MacOSX10.15.sdk   -w -Werror=date-time -I/Users/buildslave/jenkins/workspace/test-suite-verify-machineinstrs-x86_64h-O3/test-suite/MultiSource/Applications/kimwitu++ -DYYDEBUG=1 -MD -MT MultiSource/Applications/kimwitu++/CMakeFiles/kc.dir/error.cc.o -MF MultiSource/Applications/kimwitu++/CMakeFiles/kc.dir/error.cc.o.d -o MultiSource/Applications/kimwitu++/CMakeFiles/kc.dir/error.cc.o -c /Users/buildslave/jenkins/workspace/test-suite-verify-machineinstrs-x86_64h-O3/test-suite/MultiSource/Applications/kimwitu++/error.cc
[2903/7685] /Users/buildslave/jenkins/workspace/test-suite-verify-machineinstrs-x86_64h-O3/test-suite-build/tools/timeit --summary MultiSource/Applications/kimwitu++/CMakeFiles/kc.dir/gutil.cc.o.time /Users/buildslave/jenkins/workspace/test-suite-verify-machineinstrs-x86_64h-O3/compiler/bin/clang++  -DNDEBUG  -B /Applications/Xcode.app/Contents/Developer/Toolchains/XcodeDefault.xctoolchain/usr/bin    -Wno-unused-command-line-argument -mllvm -verify-machineinstrs -O3 -arch x86_64h -isysroot /Applications/Xcode.app/Contents/Developer/Platforms/MacOSX.platform/Developer/SDKs/MacOSX10.15.sdk   -w -Werror=date-time -I/Users/buildslave/jenkins/workspace/test-suite-verify-machineinstrs-x86_64h-O3/test-suite/MultiSource/Applications/kimwitu++ -DYYDEBUG=1 -MD -MT MultiSource/Applications/kimwitu++/CMakeFiles/kc.dir/gutil.cc.o -MF MultiSource/Applications/kimwitu++/CMakeFiles/kc.dir/gutil.cc.o.d -o MultiSource/Applications/kimwitu++/CMakeFiles/kc.dir/gutil.cc.o -c /Users/buildslave/jenkins/workspace/test-suite-verify-machineinstrs-x86_64h-O3/test-suite/MultiSource/Applications/kimwitu++/gutil.cc
[2904/7685] /Users/buildslave/jenkins/workspace/test-suite-verify-machineinstrs-x86_64h-O3/test-suite-build/tools/timeit --summary MultiSource/Applications/oggenc/CMakeFiles/oggenc.dir/oggenc.c.o.time /Users/buildslave/jenkins/workspace/test-suite-verify-machineinstrs-x86_64h-O3/compiler/bin/clang -DNDEBUG  -B /Applications/Xcode.app/Contents/Developer/Toolchains/XcodeDefault.xctoolchain/usr/bin    -Wno-unused-command-line-argument -mllvm -verify-machineinstrs -O3 -arch x86_64h -isysroot /Applications/Xcode.app/Contents/Developer/Platforms/MacOSX.platform/Developer/SDKs/MacOSX10.15.sdk   -w -Werror=date-time -fno-strict-aliasing -ffp-contract=off -DFMA_DISABLED=1 -ffp-contract=off -DFMA_DISABLED=1 -MD -MT MultiSource/Applications/oggenc/CMakeFiles/oggenc.dir/oggenc.c.o -MF MultiSource/Applications/oggenc/CMakeFiles/oggenc.dir/oggenc.c.o.d -o MultiSource/Applications/oggenc/CMakeFiles/oggenc.dir/oggenc.c.o   -c /Users/buildslave/jenkins/workspace/test-suite-verify-machineinstrs-x86_64h-O3/test-suite/MultiSource/Applications/oggenc/oggenc.c
FAILED: MultiSource/Applications/oggenc/CMakeFiles/oggenc.dir/oggenc.c.o 
/Users/buildslave/jenkins/workspace/test-suite-verify-machineinstrs-x86_64h-O3/test-suite-build/tools/timeit --summary MultiSource/Applications/oggenc/CMakeFiles/oggenc.dir/oggenc.c.o.time /Users/buildslave/jenkins/workspace/test-suite-verify-machineinstrs-x86_64h-O3/compiler/bin/clang -DNDEBUG  -B /Applications/Xcode.app/Contents/Developer/Toolchains/XcodeDefault.xctoolchain/usr/bin    -Wno-unused-command-line-argument -mllvm -verify-machineinstrs -O3 -arch x86_64h -isysroot /Applications/Xcode.app/Contents/Developer/Platforms/MacOSX.platform/Developer/SDKs/MacOSX10.15.sdk   -w -Werror=date-time -fno-strict-aliasing -ffp-contract=off -DFMA_DISABLED=1 -ffp-contract=off -DFMA_DISABLED=1 -MD -MT MultiSource/Applications/oggenc/CMakeFiles/oggenc.dir/oggenc.c.o -MF MultiSource/Applications/oggenc/CMakeFiles/oggenc.dir/oggenc.c.o.d -o MultiSource/Applications/oggenc/CMakeFiles/oggenc.dir/oggenc.c.o   -c /Users/buildslave/jenkins/workspace/test-suite-verify-machineinstrs-x86_64h-O3/test-suite/MultiSource/Applications/oggenc/oggenc.c
Fatal Error: error in backend: Found 2 machine code errors.
*** Bad machine code: Using an undefined physical register ***
- function:    vorbis_analysis_blockout
- basic block: %bb.17 if.end.i (0x7ff6487a2480)
- instruction: $rax = SUB64rr $rax(tied-def 0), $rcx, implicit-def dead $eflags
- operand 2:   $rcx
fatal error: error in backend: Found 2 machine code errors.
PLEASE submit a bug report to https://bugs.llvm.org/ and include the crash backtrace, preprocessed source, and associated run script.
Stack dump:
Error: clang frontend command failed with exit code 70 (use -v to see invocation)
25 clang         0x000000010c7ef9ed clang::driver::Compilation::ExecuteCommand(clang::driver::Command const&, clang::driver::Command const*&) const + 221
26 clang         0x000000010c7eff4d clang::driver::Compilation::ExecuteJobs(clang::driver::JobList const&, llvm::SmallVectorImpl<std::__1::pair<int, clang::driver::Command const*> >&) const + 125
27 clang         0x000000010c80692c clang::driver::Driver::ExecuteCompilation(clang::driver::Compilation&, llvm::SmallVectorImpl<std::__1::pair<int, clang::driver::Command const*> >&) + 204
28 clang         0x0000000109f3b775 main + 10309
29 libdyld.dylib 0x00007fff67a6fcc9 start + 1
clang-13: error: clang frontend command failed with exit code 70 (use -v to see invocation)
clang version 13.0.0 (https://github.com/llvm/llvm-project.git b889c6ee9911b72a58986d528f42dd18cbdf92d7)
Target: x86_64h-apple-darwin19.5.0

Build Log

Changes
  1. [VE] disable cmake caches until resolved (details / githubweb)
  2. Enable retry on failed git operations (details / githubweb)
Changes
  1. [Driver] Support libc++ in MSVC (details)
  2. [analyzer]  [NFC] Implement a wrapper SValBuilder::getCastedMemRegionVal for similar functionality on region cast (details)
  3. [mlir][ArmSVE] Add basic mask generation operations (details)
  4. [Demangle][Rust] Parse path backreferences (details)
  5. [Demangle][Rust] Parse type backreferences (details)
  6. [Demangle][Rust] Parse const backreferences (details)
  7. [lldb] Set return status to failed when adding a command error (details)
  8. [JITLink] Clarify LinkGraph::splitBlock contract in comment. (details)
  9. Revert "[mlir][ArmSVE] Add basic mask generation operations" (details)
  10. [mlir] fix integer type mismatch in alloc conversion to LLVM (details)
  11. [mlir] Make MemRef element type extensible (details)
  12. [mlir] support memref of memref in standard-to-llvm conversion (details)
  13. [clang] Apply MS ABI details on __builtin_ms_va_list on non-windows platforms on x86_64 (details)
  14. [DAG] Allow isNullOrNullSplat to see truncated zeroes (details)

Started by upstream project relay-test-suite-verify-machineinstrs build number 10014
originally caused by:

This run spent:

  • 1 hr 32 min waiting;
  • 1 hr 59 min build duration;
  • 1 hr 59 min total from scheduled to completion.
Revision: b83568a0e50fe1d8fd419721f67e82c4bda5eaf0
Repository: https://github.com/llvm/llvm-zorg.git
  • refs/remotes/origin/main
Revision: b889c6ee9911b72a58986d528f42dd18cbdf92d7
Repository: http://labmaster3.local/git/llvm-project.git
  • detached
Revision: f48d431f44610e339d00a33d57564c6029c4ff43
Repository: https://github.com/llvm/llvm-lnt.git
  • refs/remotes/origin/main
Revision: ccc86f938839d02de3a6564b2d80fb47a60aa069
Repository: https://github.com/llvm/llvm-test-suite.git
  • refs/remotes/origin/main

Identified problems

Compile Error

This build failed because of a compile error. Below is a list of all errors in the build log:
Indication 1

Ninja target failed

Below is a link to the first failed ninja target.
Indication 2