Console Output

Skipping 685 KB.. Full Log

Hide Details

=== BUILD TARGET lldb-server OF PROJECT lldb WITH CONFIGURATION Release ===

Hide Details

Check dependencies

Hide Details

=== BUILD TARGET lit-cpuid OF PROJECT lldb WITH CONFIGURATION Release ===

Hide Details

Check dependencies

Hide Details

=== BUILD AGGREGATE TARGET ALL_BUILD OF PROJECT lldb WITH CONFIGURATION Release ===

Hide Details

Check dependencies

Hide Details

Write auxiliary files write-file /Users/buildslave/jenkins/workspace/lldb-cmake-standalone/lldb-xcode-build/lldb.build/Release/ALL_BUILD.build/Script-2E2F187AA4DE49C28872199D.sh chmod 0755 /Users/buildslave/jenkins/workspace/lldb-cmake-standalone/lldb-xcode-build/lldb.build/Release/ALL_BUILD.build/Script-2E2F187AA4DE49C28872199D.sh

Hide Details

PhaseScriptExecution CMake\ Rules /Users/buildslave/jenkins/workspace/lldb-cmake-standalone/lldb-xcode-build/lldb.build/Release/ALL_BUILD.build/Script-2E2F187AA4DE49C28872199D.sh cd /Users/buildslave/jenkins/workspace/lldb-cmake-standalone/llvm-project/lldb /bin/sh -c /Users/buildslave/jenkins/workspace/lldb-cmake-standalone/lldb-xcode-build/lldb.build/Release/ALL_BUILD.build/Script-2E2F187AA4DE49C28872199D.sh echo ""

Hide Details

echo Build\ all\ projects Build all projects

Hide Details

** BUILD SUCCEEDED **

Hide Details

Completed at: 2021-10-16T20:18:38 @@@@@@ [Pipeline] } [Pipeline] // timeout [Pipeline] } [Pipeline] // stage [Pipeline] stage [Pipeline] { (Xcode Standalone Test (build tree)) [Pipeline] timeout Timeout set to expire in 30 min [Pipeline] { [Pipeline] sh + set -u + export PATH=/usr/local/bin:/usr/local/sbin:/usr/bin:/bin:/usr/sbin:/sbin:/usr/bin:/usr/local/bin + PATH=/usr/local/bin:/usr/local/sbin:/usr/bin:/bin:/usr/sbin:/sbin:/usr/bin:/usr/local/bin + python /Users/buildslave/jenkins/workspace/lldb-cmake-standalone/llvm-zorg/zorg/jenkins/monorepo_build.py lldb-cmake-xcode test --assertions --cmake-type=Release
Clean

Hide Details

@@@ Clean @@@ Completed at: 2021-10-16T20:18:40 @@@@@@
Run Tests

Hide Details

@@@ Run Tests @@@ cd /Users/buildslave/jenkins/workspace/lldb-cmake-standalone/lldb-xcode-build '/usr/bin/env' 'TERM=vt100' '/usr/local/bin/cmake' '--build' '.' '--config' 'Release' '--target' 'check-lldb' Command line invocation: /Applications/Xcode.app/Contents/Developer/usr/bin/xcodebuild -project lldb.xcodeproj build -target check-lldb -configuration Release -hideShellScriptEnvironment

Hide Details

User defaults from command line: HideShellScriptEnvironment = YES

Hide Details

Prepare build note: Using legacy build system === BUILD AGGREGATE TARGET ZERO_CHECK OF PROJECT lldb WITH CONFIGURATION Release ===

Hide Details

Check dependencies

Hide Details

PhaseScriptExecution CMake\ Rules /Users/buildslave/jenkins/workspace/lldb-cmake-standalone/lldb-xcode-build/lldb.build/Release/ZERO_CHECK.build/Script-C9DDAC9D3D154E44A054F974.sh cd /Users/buildslave/jenkins/workspace/lldb-cmake-standalone/llvm-project/lldb /bin/sh -c /Users/buildslave/jenkins/workspace/lldb-cmake-standalone/lldb-xcode-build/lldb.build/Release/ZERO_CHECK.build/Script-C9DDAC9D3D154E44A054F974.sh echo ""

Hide Details

make -f /Users/buildslave/jenkins/workspace/lldb-cmake-standalone/lldb-xcode-build/CMakeScripts/ReRunCMake.make make[1]: `/Users/buildslave/jenkins/workspace/lldb-cmake-standalone/lldb-xcode-build/CMakeFiles/cmake.check_cache' is up to date.

Hide Details

=== BUILD AGGREGATE TARGET swig_wrapper_python OF PROJECT lldb WITH CONFIGURATION Release ===

Hide Details

Check dependencies

Hide Details

PhaseScriptExecution CMake\ Rules /Users/buildslave/jenkins/workspace/lldb-cmake-standalone/lldb-xcode-build/bindings/python/lldb.build/Release/swig_wrapper_python.build/Script-28CFF4FF55FE4D9D8589E07E.sh cd /Users/buildslave/jenkins/workspace/lldb-cmake-standalone/llvm-project/lldb /bin/sh -c /Users/buildslave/jenkins/workspace/lldb-cmake-standalone/lldb-xcode-build/bindings/python/lldb.build/Release/swig_wrapper_python.build/Script-28CFF4FF55FE4D9D8589E07E.sh make: Nothing to be done for `all'.

Hide Details

=== BUILD TARGET lldbBase OF PROJECT lldb WITH CONFIGURATION Release ===

Hide Details

Check dependencies

Hide Details

PhaseScriptExecution CMake\ Rules /Users/buildslave/jenkins/workspace/lldb-cmake-standalone/lldb-xcode-build/source/lldb.build/Release/lldbBase.build/Script-8965F6D69B504EBDA50CEF89.sh cd /Users/buildslave/jenkins/workspace/lldb-cmake-standalone/llvm-project/lldb /bin/sh -c /Users/buildslave/jenkins/workspace/lldb-cmake-standalone/lldb-xcode-build/source/lldb.build/Release/lldbBase.build/Script-8965F6D69B504EBDA50CEF89.sh make: Nothing to be done for `all'.

Hide Details

=== BUILD AGGREGATE TARGET clang-tablegen-targets OF PROJECT lldb WITH CONFIGURATION Release ===

Hide Details

Check dependencies

Hide Details

=== BUILD AGGREGATE TARGET intrinsics_gen OF PROJECT lldb WITH CONFIGURATION Release ===

Hide Details

Check dependencies

Hide Details

=== BUILD TARGET lldb-tblgen OF PROJECT lldb WITH CONFIGURATION Release ===

Hide Details

Check dependencies

Hide Details

=== BUILD AGGREGATE TARGET LLDBOptionsGen OF PROJECT lldb WITH CONFIGURATION Release ===

Hide Details

Check dependencies

Hide Details

PhaseScriptExecution CMake\ Rules /Users/buildslave/jenkins/workspace/lldb-cmake-standalone/lldb-xcode-build/source/Commands/lldb.build/Release/LLDBOptionsGen.build/Script-172B8FFCFB374FE493C5D24A.sh cd /Users/buildslave/jenkins/workspace/lldb-cmake-standalone/llvm-project/lldb /bin/sh -c /Users/buildslave/jenkins/workspace/lldb-cmake-standalone/lldb-xcode-build/source/Commands/lldb.build/Release/LLDBOptionsGen.build/Script-172B8FFCFB374FE493C5D24A.sh echo "Building CommandOptions.inc..." Building CommandOptions.inc... /Users/buildslave/jenkins/workspace/lldb-cmake-standalone/lldb-xcode-build/Release/bin/lldb-tblgen -gen-lldb-option-defs -I /Users/buildslave/jenkins/workspace/lldb-cmake-standalone/llvm-project/lldb/source/Commands -I/Users/buildslave/jenkins/workspace/lldb-cmake-standalone/lldb-xcode-build/source -I/Users/buildslave/jenkins/workspace/lldb-cmake-standalone/llvm-project/lldb/include -I/Users/buildslave/jenkins/workspace/lldb-cmake-standalone/lldb-xcode-build/include -I/Users/buildslave/jenkins/workspace/lldb-cmake-standalone/lldb-xcode-build/include -I/Users/buildslave/jenkins/workspace/lldb-cmake-standalone/llvm-project/llvm/include -I/Users/buildslave/jenkins/workspace/lldb-cmake-standalone/clang-build/include -I/Users/buildslave/jenkins/workspace/lldb-cmake-standalone/llvm-project/clang/include -I/Users/buildslave/jenkins/workspace/lldb-cmake-standalone/clang-build/tools/clang/include -I/usr/local/Cellar/python/3.7.0/Frameworks/Python.framework/Versions/3.7/include/python3.7m -I/Users/buildslave/jenkins/workspace/lldb-cmake-standalone/llvm-project/lldb/tools/clang/include -I/Users/buildslave/jenkins/workspace/lldb-cmake-standalone/lldb-xcode-build/../clang/include -I/usr/local/include -I/Applications/Xcode.app/Contents/Developer/Platforms/MacOSX.platform/Developer/SDKs/MacOSX10.15.sdk/usr/include/libxml2 -I/Applications/Xcode.app/Contents/Developer/Platforms/MacOSX.platform/Developer/SDKs/MacOSX10.15.sdk/usr/include/libxml2 -I/Users/buildslave/jenkins/workspace/lldb-cmake-standalone/llvm-project/lldb/source/. /Users/buildslave/jenkins/workspace/lldb-cmake-standalone/llvm-project/lldb/source/Commands/Options.td --write-if-changed -o /Users/buildslave/jenkins/workspace/lldb-cmake-standalone/lldb-xcode-build/source/Commands/CommandOptions.inc

Hide Details

=== BUILD AGGREGATE TARGET LLDBCorePropertiesEnumGen OF PROJECT lldb WITH CONFIGURATION Release ===

Hide Details

Check dependencies

Hide Details

PhaseScriptExecution CMake\ Rules /Users/buildslave/jenkins/workspace/lldb-cmake-standalone/lldb-xcode-build/source/Core/lldb.build/Release/LLDBCorePropertiesEnumGen.build/Script-14B822E63F814ADD8EA315C0.sh cd /Users/buildslave/jenkins/workspace/lldb-cmake-standalone/llvm-project/lldb /bin/sh -c /Users/buildslave/jenkins/workspace/lldb-cmake-standalone/lldb-xcode-build/source/Core/lldb.build/Release/LLDBCorePropertiesEnumGen.build/Script-14B822E63F814ADD8EA315C0.sh echo "Building CorePropertiesEnum.inc..." Building CorePropertiesEnum.inc... /Users/buildslave/jenkins/workspace/lldb-cmake-standalone/lldb-xcode-build/Release/bin/lldb-tblgen -gen-lldb-property-enum-defs -I /Users/buildslave/jenkins/workspace/lldb-cmake-standalone/llvm-project/lldb/source/Core -I/Users/buildslave/jenkins/workspace/lldb-cmake-standalone/lldb-xcode-build/source -I/Users/buildslave/jenkins/workspace/lldb-cmake-standalone/llvm-project/lldb/include -I/Users/buildslave/jenkins/workspace/lldb-cmake-standalone/lldb-xcode-build/include -I/Users/buildslave/jenkins/workspace/lldb-cmake-standalone/lldb-xcode-build/include -I/Users/buildslave/jenkins/workspace/lldb-cmake-standalone/llvm-project/llvm/include -I/Users/buildslave/jenkins/workspace/lldb-cmake-standalone/clang-build/include -I/Users/buildslave/jenkins/workspace/lldb-cmake-standalone/llvm-project/clang/include -I/Users/buildslave/jenkins/workspace/lldb-cmake-standalone/clang-build/tools/clang/include -I/usr/local/Cellar/python/3.7.0/Frameworks/Python.framework/Versions/3.7/include/python3.7m -I/Users/buildslave/jenkins/workspace/lldb-cmake-standalone/llvm-project/lldb/tools/clang/include -I/Users/buildslave/jenkins/workspace/lldb-cmake-standalone/lldb-xcode-build/../clang/include -I/usr/local/include -I/Applications/Xcode.app/Contents/Developer/Platforms/MacOSX.platform/Developer/SDKs/MacOSX10.15.sdk/usr/include/libxml2 -I/Applications/Xcode.app/Contents/Developer/Platforms/MacOSX.platform/Developer/SDKs/MacOSX10.15.sdk/usr/include/libxml2 -I/Users/buildslave/jenkins/workspace/lldb-cmake-standalone/llvm-project/lldb/source/. /Users/buildslave/jenkins/workspace/lldb-cmake-standalone/llvm-project/lldb/source/Core/CoreProperties.td --write-if-changed -o /Users/buildslave/jenkins/workspace/lldb-cmake-standalone/lldb-xcode-build/source/Core/CorePropertiesEnum.inc

Hide Details

=== BUILD AGGREGATE TARGET LLDBCorePropertiesGen OF PROJECT lldb WITH CONFIGURATION Release ===

Hide Details

Check dependencies

Hide Details

PhaseScriptExecution CMake\ Rules /Users/buildslave/jenkins/workspace/lldb-cmake-standalone/lldb-xcode-build/source/Core/lldb.build/Release/LLDBCorePropertiesGen.build/Script-12A93F9F9EE940BB88F5E50E.sh cd /Users/buildslave/jenkins/workspace/lldb-cmake-standalone/llvm-project/lldb /bin/sh -c /Users/buildslave/jenkins/workspace/lldb-cmake-standalone/lldb-xcode-build/source/Core/lldb.build/Release/LLDBCorePropertiesGen.build/Script-12A93F9F9EE940BB88F5E50E.sh echo "Building CoreProperties.inc..." Building CoreProperties.inc... /Users/buildslave/jenkins/workspace/lldb-cmake-standalone/lldb-xcode-build/Release/bin/lldb-tblgen -gen-lldb-property-defs -I /Users/buildslave/jenkins/workspace/lldb-cmake-standalone/llvm-project/lldb/source/Core -I/Users/buildslave/jenkins/workspace/lldb-cmake-standalone/lldb-xcode-build/source -I/Users/buildslave/jenkins/workspace/lldb-cmake-standalone/llvm-project/lldb/include -I/Users/buildslave/jenkins/workspace/lldb-cmake-standalone/lldb-xcode-build/include -I/Users/buildslave/jenkins/workspace/lldb-cmake-standalone/lldb-xcode-build/include -I/Users/buildslave/jenkins/workspace/lldb-cmake-standalone/llvm-project/llvm/include -I/Users/buildslave/jenkins/workspace/lldb-cmake-standalone/clang-build/include -I/Users/buildslave/jenkins/workspace/lldb-cmake-standalone/llvm-project/clang/include -I/Users/buildslave/jenkins/workspace/lldb-cmake-standalone/clang-build/tools/clang/include -I/usr/local/Cellar/python/3.7.0/Frameworks/Python.framework/Versions/3.7/include/python3.7m -I/Users/buildslave/jenkins/workspace/lldb-cmake-standalone/llvm-project/lldb/tools/clang/include -I/Users/buildslave/jenkins/workspace/lldb-cmake-standalone/lldb-xcode-build/../clang/include -I/usr/local/include -I/Applications/Xcode.app/Contents/Developer/Platforms/MacOSX.platform/Developer/SDKs/MacOSX10.15.sdk/usr/include/libxml2 -I/Applications/Xcode.app/Contents/Developer/Platforms/MacOSX.platform/Developer/SDKs/MacOSX10.15.sdk/usr/include/libxml2 -I/Users/buildslave/jenkins/workspace/lldb-cmake-standalone/llvm-project/lldb/source/. /Users/buildslave/jenkins/workspace/lldb-cmake-standalone/llvm-project/lldb/source/Core/CoreProperties.td --write-if-changed -o /Users/buildslave/jenkins/workspace/lldb-cmake-standalone/lldb-xcode-build/source/Core/CoreProperties.inc

Hide Details

=== BUILD TARGET lldbUtility OF PROJECT lldb WITH CONFIGURATION Release ===

Hide Details

Check dependencies

Hide Details

=== BUILD TARGET lldbHostMacOSXObjCXX OF PROJECT lldb WITH CONFIGURATION Release ===

Hide Details

Check dependencies

Hide Details

=== BUILD TARGET lldbHost OF PROJECT lldb WITH CONFIGURATION Release ===

Hide Details

Check dependencies

Hide Details

=== BUILD AGGREGATE TARGET LLDBInterpreterPropertiesEnumGen OF PROJECT lldb WITH CONFIGURATION Release ===

Hide Details

Check dependencies

Hide Details

PhaseScriptExecution CMake\ Rules /Users/buildslave/jenkins/workspace/lldb-cmake-standalone/lldb-xcode-build/source/Interpreter/lldb.build/Release/LLDBInterpreterPropertiesEnumGen.build/Script-DEFE309AC22D4A88B00AA99B.sh cd /Users/buildslave/jenkins/workspace/lldb-cmake-standalone/llvm-project/lldb /bin/sh -c /Users/buildslave/jenkins/workspace/lldb-cmake-standalone/lldb-xcode-build/source/Interpreter/lldb.build/Release/LLDBInterpreterPropertiesEnumGen.build/Script-DEFE309AC22D4A88B00AA99B.sh echo "Building InterpreterPropertiesEnum.inc..." Building InterpreterPropertiesEnum.inc... /Users/buildslave/jenkins/workspace/lldb-cmake-standalone/lldb-xcode-build/Release/bin/lldb-tblgen -gen-lldb-property-enum-defs -I /Users/buildslave/jenkins/workspace/lldb-cmake-standalone/llvm-project/lldb/source/Interpreter -I/Users/buildslave/jenkins/workspace/lldb-cmake-standalone/lldb-xcode-build/source -I/Users/buildslave/jenkins/workspace/lldb-cmake-standalone/llvm-project/lldb/include -I/Users/buildslave/jenkins/workspace/lldb-cmake-standalone/lldb-xcode-build/include -I/Users/buildslave/jenkins/workspace/lldb-cmake-standalone/lldb-xcode-build/include -I/Users/buildslave/jenkins/workspace/lldb-cmake-standalone/llvm-project/llvm/include -I/Users/buildslave/jenkins/workspace/lldb-cmake-standalone/clang-build/include -I/Users/buildslave/jenkins/workspace/lldb-cmake-standalone/llvm-project/clang/include -I/Users/buildslave/jenkins/workspace/lldb-cmake-standalone/clang-build/tools/clang/include -I/usr/local/Cellar/python/3.7.0/Frameworks/Python.framework/Versions/3.7/include/python3.7m -I/Users/buildslave/jenkins/workspace/lldb-cmake-standalone/llvm-project/lldb/tools/clang/include -I/Users/buildslave/jenkins/workspace/lldb-cmake-standalone/lldb-xcode-build/../clang/include -I/usr/local/include -I/Applications/Xcode.app/Contents/Developer/Platforms/MacOSX.platform/Developer/SDKs/MacOSX10.15.sdk/usr/include/libxml2 -I/Applications/Xcode.app/Contents/Developer/Platforms/MacOSX.platform/Developer/SDKs/MacOSX10.15.sdk/usr/include/libxml2 -I/Users/buildslave/jenkins/workspace/lldb-cmake-standalone/llvm-project/lldb/source/. /Users/buildslave/jenkins/workspace/lldb-cmake-standalone/llvm-project/lldb/source/Interpreter/InterpreterProperties.td --write-if-changed -o /Users/buildslave/jenkins/workspace/lldb-cmake-standalone/lldb-xcode-build/source/Interpreter/InterpreterPropertiesEnum.inc

Hide Details

=== BUILD AGGREGATE TARGET LLDBInterpreterPropertiesGen OF PROJECT lldb WITH CONFIGURATION Release ===

Hide Details

Check dependencies

Hide Details

PhaseScriptExecution CMake\ Rules /Users/buildslave/jenkins/workspace/lldb-cmake-standalone/lldb-xcode-build/source/Interpreter/lldb.build/Release/LLDBInterpreterPropertiesGen.build/Script-D4A4C19A985A4C30A007F823.sh cd /Users/buildslave/jenkins/workspace/lldb-cmake-standalone/llvm-project/lldb /bin/sh -c /Users/buildslave/jenkins/workspace/lldb-cmake-standalone/lldb-xcode-build/source/Interpreter/lldb.build/Release/LLDBInterpreterPropertiesGen.build/Script-D4A4C19A985A4C30A007F823.sh echo "Building InterpreterProperties.inc..." Building InterpreterProperties.inc... /Users/buildslave/jenkins/workspace/lldb-cmake-standalone/lldb-xcode-build/Release/bin/lldb-tblgen -gen-lldb-property-defs -I /Users/buildslave/jenkins/workspace/lldb-cmake-standalone/llvm-project/lldb/source/Interpreter -I/Users/buildslave/jenkins/workspace/lldb-cmake-standalone/lldb-xcode-build/source -I/Users/buildslave/jenkins/workspace/lldb-cmake-standalone/llvm-project/lldb/include -I/Users/buildslave/jenkins/workspace/lldb-cmake-standalone/lldb-xcode-build/include -I/Users/buildslave/jenkins/workspace/lldb-cmake-standalone/lldb-xcode-build/include -I/Users/buildslave/jenkins/workspace/lldb-cmake-standalone/llvm-project/llvm/include -I/Users/buildslave/jenkins/workspace/lldb-cmake-standalone/clang-build/include -I/Users/buildslave/jenkins/workspace/lldb-cmake-standalone/llvm-project/clang/include -I/Users/buildslave/jenkins/workspace/lldb-cmake-standalone/clang-build/tools/clang/include -I/usr/local/Cellar/python/3.7.0/Frameworks/Python.framework/Versions/3.7/include/python3.7m -I/Users/buildslave/jenkins/workspace/lldb-cmake-standalone/llvm-project/lldb/tools/clang/include -I/Users/buildslave/jenkins/workspace/lldb-cmake-standalone/lldb-xcode-build/../clang/include -I/usr/local/include -I/Applications/Xcode.app/Contents/Developer/Platforms/MacOSX.platform/Developer/SDKs/MacOSX10.15.sdk/usr/include/libxml2 -I/Applications/Xcode.app/Contents/Developer/Platforms/MacOSX.platform/Developer/SDKs/MacOSX10.15.sdk/usr/include/libxml2 -I/Users/buildslave/jenkins/workspace/lldb-cmake-standalone/llvm-project/lldb/source/. /Users/buildslave/jenkins/workspace/lldb-cmake-standalone/llvm-project/lldb/source/Interpreter/InterpreterProperties.td --write-if-changed -o /Users/buildslave/jenkins/workspace/lldb-cmake-standalone/lldb-xcode-build/source/Interpreter/InterpreterProperties.inc

Hide Details

=== BUILD AGGREGATE TARGET LLDBPluginSymbolFileDWARFPropertiesEnumGen OF PROJECT lldb WITH CONFIGURATION Release ===

Hide Details

Check dependencies

Hide Details

PhaseScriptExecution CMake\ Rules /Users/buildslave/jenkins/workspace/lldb-cmake-standalone/lldb-xcode-build/source/Plugins/SymbolFile/DWARF/lldb.build/Release/LLDBPluginSymbolFileDWARFPropertiesEnumGen.build/Script-A21DCC7D9CC948A0A0C43303.sh cd /Users/buildslave/jenkins/workspace/lldb-cmake-standalone/llvm-project/lldb /bin/sh -c /Users/buildslave/jenkins/workspace/lldb-cmake-standalone/lldb-xcode-build/source/Plugins/SymbolFile/DWARF/lldb.build/Release/LLDBPluginSymbolFileDWARFPropertiesEnumGen.build/Script-A21DCC7D9CC948A0A0C43303.sh echo "Building SymbolFileDWARFPropertiesEnum.inc..." Building SymbolFileDWARFPropertiesEnum.inc... /Users/buildslave/jenkins/workspace/lldb-cmake-standalone/lldb-xcode-build/Release/bin/lldb-tblgen -gen-lldb-property-enum-defs -I /Users/buildslave/jenkins/workspace/lldb-cmake-standalone/llvm-project/lldb/source/Plugins/SymbolFile/DWARF -I/Users/buildslave/jenkins/workspace/lldb-cmake-standalone/lldb-xcode-build/source -I/Users/buildslave/jenkins/workspace/lldb-cmake-standalone/llvm-project/lldb/include -I/Users/buildslave/jenkins/workspace/lldb-cmake-standalone/lldb-xcode-build/include -I/Users/buildslave/jenkins/workspace/lldb-cmake-standalone/lldb-xcode-build/include -I/Users/buildslave/jenkins/workspace/lldb-cmake-standalone/llvm-project/llvm/include -I/Users/buildslave/jenkins/workspace/lldb-cmake-standalone/clang-build/include -I/Users/buildslave/jenkins/workspace/lldb-cmake-standalone/llvm-project/clang/include -I/Users/buildslave/jenkins/workspace/lldb-cmake-standalone/clang-build/tools/clang/include -I/usr/local/Cellar/python/3.7.0/Frameworks/Python.framework/Versions/3.7/include/python3.7m -I/Users/buildslave/jenkins/workspace/lldb-cmake-standalone/llvm-project/lldb/tools/clang/include -I/Users/buildslave/jenkins/workspace/lldb-cmake-standalone/lldb-xcode-build/../clang/include -I/usr/local/include -I/Applications/Xcode.app/Contents/Developer/Platforms/MacOSX.platform/Developer/SDKs/MacOSX10.15.sdk/usr/include/libxml2 -I/Applications/Xcode.app/Contents/Developer/Platforms/MacOSX.platform/Developer/SDKs/MacOSX10.15.sdk/usr/include/libxml2 -I/Users/buildslave/jenkins/workspace/lldb-cmake-standalone/llvm-project/lldb/source/. /Users/buildslave/jenkins/workspace/lldb-cmake-standalone/llvm-project/lldb/source/Plugins/SymbolFile/DWARF/SymbolFileDWARFProperties.td --write-if-changed -o /Users/buildslave/jenkins/workspace/lldb-cmake-standalone/lldb-xcode-build/source/Plugins/SymbolFile/DWARF/SymbolFileDWARFPropertiesEnum.inc

Hide Details

=== BUILD AGGREGATE TARGET LLDBPluginSymbolFileDWARFPropertiesGen OF PROJECT lldb WITH CONFIGURATION Release ===

Hide Details

Check dependencies

Hide Details

PhaseScriptExecution CMake\ Rules /Users/buildslave/jenkins/workspace/lldb-cmake-standalone/lldb-xcode-build/source/Plugins/SymbolFile/DWARF/lldb.build/Release/LLDBPluginSymbolFileDWARFPropertiesGen.build/Script-E2C46574499D418581F10979.sh cd /Users/buildslave/jenkins/workspace/lldb-cmake-standalone/llvm-project/lldb /bin/sh -c /Users/buildslave/jenkins/workspace/lldb-cmake-standalone/lldb-xcode-build/source/Plugins/SymbolFile/DWARF/lldb.build/Release/LLDBPluginSymbolFileDWARFPropertiesGen.build/Script-E2C46574499D418581F10979.sh echo "Building SymbolFileDWARFProperties.inc..." Building SymbolFileDWARFProperties.inc... /Users/buildslave/jenkins/workspace/lldb-cmake-standalone/lldb-xcode-build/Release/bin/lldb-tblgen -gen-lldb-property-defs -I /Users/buildslave/jenkins/workspace/lldb-cmake-standalone/llvm-project/lldb/source/Plugins/SymbolFile/DWARF -I/Users/buildslave/jenkins/workspace/lldb-cmake-standalone/lldb-xcode-build/source -I/Users/buildslave/jenkins/workspace/lldb-cmake-standalone/llvm-project/lldb/include -I/Users/buildslave/jenkins/workspace/lldb-cmake-standalone/lldb-xcode-build/include -I/Users/buildslave/jenkins/workspace/lldb-cmake-standalone/lldb-xcode-build/include -I/Users/buildslave/jenkins/workspace/lldb-cmake-standalone/llvm-project/llvm/include -I/Users/buildslave/jenkins/workspace/lldb-cmake-standalone/clang-build/include -I/Users/buildslave/jenkins/workspace/lldb-cmake-standalone/llvm-project/clang/include -I/Users/buildslave/jenkins/workspace/lldb-cmake-standalone/clang-build/tools/clang/include -I/usr/local/Cellar/python/3.7.0/Frameworks/Python.framework/Versions/3.7/include/python3.7m -I/Users/buildslave/jenkins/workspace/lldb-cmake-standalone/llvm-project/lldb/tools/clang/include -I/Users/buildslave/jenkins/workspace/lldb-cmake-standalone/lldb-xcode-build/../clang/include -I/usr/local/include -I/Applications/Xcode.app/Contents/Developer/Platforms/MacOSX.platform/Developer/SDKs/MacOSX10.15.sdk/usr/include/libxml2 -I/Applications/Xcode.app/Contents/Developer/Platforms/MacOSX.platform/Developer/SDKs/MacOSX10.15.sdk/usr/include/libxml2 -I/Users/buildslave/jenkins/workspace/lldb-cmake-standalone/llvm-project/lldb/source/. /Users/buildslave/jenkins/workspace/lldb-cmake-standalone/llvm-project/lldb/source/Plugins/SymbolFile/DWARF/SymbolFileDWARFProperties.td --write-if-changed -o /Users/buildslave/jenkins/workspace/lldb-cmake-standalone/lldb-xcode-build/source/Plugins/SymbolFile/DWARF/SymbolFileDWARFProperties.inc

Hide Details

=== BUILD AGGREGATE TARGET LLDBTargetPropertiesEnumGen OF PROJECT lldb WITH CONFIGURATION Release ===

Hide Details

Check dependencies

Hide Details

PhaseScriptExecution CMake\ Rules /Users/buildslave/jenkins/workspace/lldb-cmake-standalone/lldb-xcode-build/source/Target/lldb.build/Release/LLDBTargetPropertiesEnumGen.build/Script-F9807659E567490182A5418F.sh cd /Users/buildslave/jenkins/workspace/lldb-cmake-standalone/llvm-project/lldb /bin/sh -c /Users/buildslave/jenkins/workspace/lldb-cmake-standalone/lldb-xcode-build/source/Target/lldb.build/Release/LLDBTargetPropertiesEnumGen.build/Script-F9807659E567490182A5418F.sh echo "Building TargetPropertiesEnum.inc..." Building TargetPropertiesEnum.inc... /Users/buildslave/jenkins/workspace/lldb-cmake-standalone/lldb-xcode-build/Release/bin/lldb-tblgen -gen-lldb-property-enum-defs -I /Users/buildslave/jenkins/workspace/lldb-cmake-standalone/llvm-project/lldb/source/Target -I/Users/buildslave/jenkins/workspace/lldb-cmake-standalone/lldb-xcode-build/source -I/Users/buildslave/jenkins/workspace/lldb-cmake-standalone/llvm-project/lldb/include -I/Users/buildslave/jenkins/workspace/lldb-cmake-standalone/lldb-xcode-build/include -I/Users/buildslave/jenkins/workspace/lldb-cmake-standalone/lldb-xcode-build/include -I/Users/buildslave/jenkins/workspace/lldb-cmake-standalone/llvm-project/llvm/include -I/Users/buildslave/jenkins/workspace/lldb-cmake-standalone/clang-build/include -I/Users/buildslave/jenkins/workspace/lldb-cmake-standalone/llvm-project/clang/include -I/Users/buildslave/jenkins/workspace/lldb-cmake-standalone/clang-build/tools/clang/include -I/usr/local/Cellar/python/3.7.0/Frameworks/Python.framework/Versions/3.7/include/python3.7m -I/Users/buildslave/jenkins/workspace/lldb-cmake-standalone/llvm-project/lldb/tools/clang/include -I/Users/buildslave/jenkins/workspace/lldb-cmake-standalone/lldb-xcode-build/../clang/include -I/usr/local/include -I/Applications/Xcode.app/Contents/Developer/Platforms/MacOSX.platform/Developer/SDKs/MacOSX10.15.sdk/usr/include/libxml2 -I/Applications/Xcode.app/Contents/Developer/Platforms/MacOSX.platform/Developer/SDKs/MacOSX10.15.sdk/usr/include/libxml2 -I/Users/buildslave/jenkins/workspace/lldb-cmake-standalone/llvm-project/lldb/source/. /Users/buildslave/jenkins/workspace/lldb-cmake-standalone/llvm-project/lldb/source/Target/TargetProperties.td --write-if-changed -o /Users/buildslave/jenkins/workspace/lldb-cmake-standalone/lldb-xcode-build/source/Target/TargetPropertiesEnum.inc

Hide Details

=== BUILD AGGREGATE TARGET LLDBTargetPropertiesGen OF PROJECT lldb WITH CONFIGURATION Release ===

Hide Details

Check dependencies

Hide Details

PhaseScriptExecution CMake\ Rules /Users/buildslave/jenkins/workspace/lldb-cmake-standalone/lldb-xcode-build/source/Target/lldb.build/Release/LLDBTargetPropertiesGen.build/Script-9266951A9A824EF994CED37E.sh cd /Users/buildslave/jenkins/workspace/lldb-cmake-standalone/llvm-project/lldb /bin/sh -c /Users/buildslave/jenkins/workspace/lldb-cmake-standalone/lldb-xcode-build/source/Target/lldb.build/Release/LLDBTargetPropertiesGen.build/Script-9266951A9A824EF994CED37E.sh echo "Building TargetProperties.inc..." Building TargetProperties.inc... /Users/buildslave/jenkins/workspace/lldb-cmake-standalone/lldb-xcode-build/Release/bin/lldb-tblgen -gen-lldb-property-defs -I /Users/buildslave/jenkins/workspace/lldb-cmake-standalone/llvm-project/lldb/source/Target -I/Users/buildslave/jenkins/workspace/lldb-cmake-standalone/lldb-xcode-build/source -I/Users/buildslave/jenkins/workspace/lldb-cmake-standalone/llvm-project/lldb/include -I/Users/buildslave/jenkins/workspace/lldb-cmake-standalone/lldb-xcode-build/include -I/Users/buildslave/jenkins/workspace/lldb-cmake-standalone/lldb-xcode-build/include -I/Users/buildslave/jenkins/workspace/lldb-cmake-standalone/llvm-project/llvm/include -I/Users/buildslave/jenkins/workspace/lldb-cmake-standalone/clang-build/include -I/Users/buildslave/jenkins/workspace/lldb-cmake-standalone/llvm-project/clang/include -I/Users/buildslave/jenkins/workspace/lldb-cmake-standalone/clang-build/tools/clang/include -I/usr/local/Cellar/python/3.7.0/Frameworks/Python.framework/Versions/3.7/include/python3.7m -I/Users/buildslave/jenkins/workspace/lldb-cmake-standalone/llvm-project/lldb/tools/clang/include -I/Users/buildslave/jenkins/workspace/lldb-cmake-standalone/lldb-xcode-build/../clang/include -I/usr/local/include -I/Applications/Xcode.app/Contents/Developer/Platforms/MacOSX.platform/Developer/SDKs/MacOSX10.15.sdk/usr/include/libxml2 -I/Applications/Xcode.app/Contents/Developer/Platforms/MacOSX.platform/Developer/SDKs/MacOSX10.15.sdk/usr/include/libxml2 -I/Users/buildslave/jenkins/workspace/lldb-cmake-standalone/llvm-project/lldb/source/. /Users/buildslave/jenkins/workspace/lldb-cmake-standalone/llvm-project/lldb/source/Target/TargetProperties.td --write-if-changed -o /Users/buildslave/jenkins/workspace/lldb-cmake-standalone/lldb-xcode-build/source/Target/TargetProperties.inc

Hide Details

=== BUILD TARGET lldbTarget OF PROJECT lldb WITH CONFIGURATION Release ===

Hide Details

Check dependencies

Hide Details

=== BUILD TARGET lldbSymbol OF PROJECT lldb WITH CONFIGURATION Release ===

Hide Details

Check dependencies

Hide Details

=== BUILD TARGET lldbPluginTypeSystemClang OF PROJECT lldb WITH CONFIGURATION Release ===

Hide Details

Check dependencies

Hide Details

=== BUILD TARGET lldbPluginSymbolFilePDB OF PROJECT lldb WITH CONFIGURATION Release ===

Hide Details

Check dependencies

Hide Details

=== BUILD TARGET lldbPluginSymbolFileNativePDB OF PROJECT lldb WITH CONFIGURATION Release ===

Hide Details

Check dependencies

Hide Details

=== BUILD TARGET lldbPluginSymbolFileDWARF OF PROJECT lldb WITH CONFIGURATION Release ===

Hide Details

Check dependencies

Hide Details

=== BUILD TARGET lldbPluginProcessUtility OF PROJECT lldb WITH CONFIGURATION Release ===

Hide Details

Check dependencies

Hide Details

=== BUILD TARGET lldbPluginObjectFilePDB OF PROJECT lldb WITH CONFIGURATION Release ===

Hide Details

Check dependencies

Hide Details

=== BUILD TARGET lldbPluginObjectFileJIT OF PROJECT lldb WITH CONFIGURATION Release ===

Hide Details

Check dependencies

Hide Details

=== BUILD TARGET lldbPluginRenderScriptRuntime OF PROJECT lldb WITH CONFIGURATION Release ===

Hide Details

Check dependencies

Hide Details

=== BUILD TARGET lldbPluginAppleObjCRuntime OF PROJECT lldb WITH CONFIGURATION Release ===

Hide Details

Check dependencies

Hide Details

=== BUILD TARGET lldbPluginObjCRuntime OF PROJECT lldb WITH CONFIGURATION Release ===

Hide Details

Check dependencies

Hide Details

=== BUILD TARGET lldbPluginCPPRuntime OF PROJECT lldb WITH CONFIGURATION Release ===

Hide Details

Check dependencies

Hide Details

=== BUILD TARGET lldbPluginObjCLanguage OF PROJECT lldb WITH CONFIGURATION Release ===

Hide Details

Check dependencies

Hide Details

=== BUILD TARGET lldbPluginCPlusPlusLanguage OF PROJECT lldb WITH CONFIGURATION Release ===

Hide Details

Check dependencies

Hide Details

=== BUILD TARGET lldbPluginClangCommon OF PROJECT lldb WITH CONFIGURATION Release ===

Hide Details

Check dependencies

Hide Details

=== BUILD TARGET lldbPluginExpressionParserClang OF PROJECT lldb WITH CONFIGURATION Release ===

Hide Details

Check dependencies

Hide Details

=== BUILD TARGET lldbInterpreter OF PROJECT lldb WITH CONFIGURATION Release ===

Hide Details

Check dependencies

Hide Details

=== BUILD TARGET lldbExpression OF PROJECT lldb WITH CONFIGURATION Release ===

Hide Details

Check dependencies

Hide Details

=== BUILD TARGET lldbDataFormatters OF PROJECT lldb WITH CONFIGURATION Release ===

Hide Details

Check dependencies

Hide Details

=== BUILD TARGET lldbCore OF PROJECT lldb WITH CONFIGURATION Release ===

Hide Details

Check dependencies

Hide Details

=== BUILD TARGET lldbCommands OF PROJECT lldb WITH CONFIGURATION Release ===

Hide Details

Check dependencies

Hide Details

=== BUILD TARGET lldbBreakpoint OF PROJECT lldb WITH CONFIGURATION Release ===

Hide Details

Check dependencies

Hide Details

=== BUILD AGGREGATE TARGET LLDBPluginPlatformMacOSXPropertiesEnumGen OF PROJECT lldb WITH CONFIGURATION Release ===

Hide Details

Check dependencies

Hide Details

PhaseScriptExecution CMake\ Rules /Users/buildslave/jenkins/workspace/lldb-cmake-standalone/lldb-xcode-build/source/Plugins/Platform/MacOSX/lldb.build/Release/LLDBPluginPlatformMacOSXPropertiesEnumGen.build/Script-8D5C12B3DE0949C686C3C146.sh cd /Users/buildslave/jenkins/workspace/lldb-cmake-standalone/llvm-project/lldb /bin/sh -c /Users/buildslave/jenkins/workspace/lldb-cmake-standalone/lldb-xcode-build/source/Plugins/Platform/MacOSX/lldb.build/Release/LLDBPluginPlatformMacOSXPropertiesEnumGen.build/Script-8D5C12B3DE0949C686C3C146.sh echo "Building PlatformMacOSXPropertiesEnum.inc..." Building PlatformMacOSXPropertiesEnum.inc... /Users/buildslave/jenkins/workspace/lldb-cmake-standalone/lldb-xcode-build/Release/bin/lldb-tblgen -gen-lldb-property-enum-defs -I /Users/buildslave/jenkins/workspace/lldb-cmake-standalone/llvm-project/lldb/source/Plugins/Platform/MacOSX -I/Users/buildslave/jenkins/workspace/lldb-cmake-standalone/lldb-xcode-build/source -I/Users/buildslave/jenkins/workspace/lldb-cmake-standalone/llvm-project/lldb/include -I/Users/buildslave/jenkins/workspace/lldb-cmake-standalone/lldb-xcode-build/include -I/Users/buildslave/jenkins/workspace/lldb-cmake-standalone/lldb-xcode-build/include -I/Users/buildslave/jenkins/workspace/lldb-cmake-standalone/llvm-project/llvm/include -I/Users/buildslave/jenkins/workspace/lldb-cmake-standalone/clang-build/include -I/Users/buildslave/jenkins/workspace/lldb-cmake-standalone/llvm-project/clang/include -I/Users/buildslave/jenkins/workspace/lldb-cmake-standalone/clang-build/tools/clang/include -I/usr/local/Cellar/python/3.7.0/Frameworks/Python.framework/Versions/3.7/include/python3.7m -I/Users/buildslave/jenkins/workspace/lldb-cmake-standalone/llvm-project/lldb/tools/clang/include -I/Users/buildslave/jenkins/workspace/lldb-cmake-standalone/lldb-xcode-build/../clang/include -I/usr/local/include -I/Applications/Xcode.app/Contents/Developer/Platforms/MacOSX.platform/Developer/SDKs/MacOSX10.15.sdk/usr/include/libxml2 -I/Applications/Xcode.app/Contents/Developer/Platforms/MacOSX.platform/Developer/SDKs/MacOSX10.15.sdk/usr/include/libxml2 -I/Users/buildslave/jenkins/workspace/lldb-cmake-standalone/llvm-project/lldb/source/. /Users/buildslave/jenkins/workspace/lldb-cmake-standalone/llvm-project/lldb/source/Plugins/Platform/MacOSX/PlatformMacOSXProperties.td --write-if-changed -o /Users/buildslave/jenkins/workspace/lldb-cmake-standalone/lldb-xcode-build/source/Plugins/Platform/MacOSX/PlatformMacOSXPropertiesEnum.inc

Hide Details

=== BUILD AGGREGATE TARGET LLDBPluginPlatformMacOSXPropertiesGen OF PROJECT lldb WITH CONFIGURATION Release ===

Hide Details

Check dependencies

Hide Details

PhaseScriptExecution CMake\ Rules /Users/buildslave/jenkins/workspace/lldb-cmake-standalone/lldb-xcode-build/source/Plugins/Platform/MacOSX/lldb.build/Release/LLDBPluginPlatformMacOSXPropertiesGen.build/Script-A9561045093F49D99ACF2C54.sh cd /Users/buildslave/jenkins/workspace/lldb-cmake-standalone/llvm-project/lldb /bin/sh -c /Users/buildslave/jenkins/workspace/lldb-cmake-standalone/lldb-xcode-build/source/Plugins/Platform/MacOSX/lldb.build/Release/LLDBPluginPlatformMacOSXPropertiesGen.build/Script-A9561045093F49D99ACF2C54.sh echo "Building PlatformMacOSXProperties.inc..." Building PlatformMacOSXProperties.inc... /Users/buildslave/jenkins/workspace/lldb-cmake-standalone/lldb-xcode-build/Release/bin/lldb-tblgen -gen-lldb-property-defs -I /Users/buildslave/jenkins/workspace/lldb-cmake-standalone/llvm-project/lldb/source/Plugins/Platform/MacOSX -I/Users/buildslave/jenkins/workspace/lldb-cmake-standalone/lldb-xcode-build/source -I/Users/buildslave/jenkins/workspace/lldb-cmake-standalone/llvm-project/lldb/include -I/Users/buildslave/jenkins/workspace/lldb-cmake-standalone/lldb-xcode-build/include -I/Users/buildslave/jenkins/workspace/lldb-cmake-standalone/lldb-xcode-build/include -I/Users/buildslave/jenkins/workspace/lldb-cmake-standalone/llvm-project/llvm/include -I/Users/buildslave/jenkins/workspace/lldb-cmake-standalone/clang-build/include -I/Users/buildslave/jenkins/workspace/lldb-cmake-standalone/llvm-project/clang/include -I/Users/buildslave/jenkins/workspace/lldb-cmake-standalone/clang-build/tools/clang/include -I/usr/local/Cellar/python/3.7.0/Frameworks/Python.framework/Versions/3.7/include/python3.7m -I/Users/buildslave/jenkins/workspace/lldb-cmake-standalone/llvm-project/lldb/tools/clang/include -I/Users/buildslave/jenkins/workspace/lldb-cmake-standalone/lldb-xcode-build/../clang/include -I/usr/local/include -I/Applications/Xcode.app/Contents/Developer/Platforms/MacOSX.platform/Developer/SDKs/MacOSX10.15.sdk/usr/include/libxml2 -I/Applications/Xcode.app/Contents/Developer/Platforms/MacOSX.platform/Developer/SDKs/MacOSX10.15.sdk/usr/include/libxml2 -I/Users/buildslave/jenkins/workspace/lldb-cmake-standalone/llvm-project/lldb/source/. /Users/buildslave/jenkins/workspace/lldb-cmake-standalone/llvm-project/lldb/source/Plugins/Platform/MacOSX/PlatformMacOSXProperties.td --write-if-changed -o /Users/buildslave/jenkins/workspace/lldb-cmake-standalone/lldb-xcode-build/source/Plugins/Platform/MacOSX/PlatformMacOSXProperties.inc

Hide Details

=== BUILD TARGET lldbPluginPlatformMacOSXObjCXX OF PROJECT lldb WITH CONFIGURATION Release ===

Hide Details

Check dependencies

Hide Details

=== BUILD TARGET lldbPluginPlatformPOSIX OF PROJECT lldb WITH CONFIGURATION Release ===

Hide Details

Check dependencies

Hide Details

=== BUILD TARGET lldbPluginPlatformMacOSX OF PROJECT lldb WITH CONFIGURATION Release ===

Hide Details

Check dependencies

Hide Details

=== BUILD AGGREGATE TARGET LLDBPluginProcessGDBRemotePropertiesEnumGen OF PROJECT lldb WITH CONFIGURATION Release ===

Hide Details

Check dependencies

Hide Details

PhaseScriptExecution CMake\ Rules /Users/buildslave/jenkins/workspace/lldb-cmake-standalone/lldb-xcode-build/source/Plugins/Process/gdb-remote/lldb.build/Release/LLDBPluginProcessGDBRemotePropertiesEnumGen.build/Script-09695A1A0F724818A46688B8.sh cd /Users/buildslave/jenkins/workspace/lldb-cmake-standalone/llvm-project/lldb /bin/sh -c /Users/buildslave/jenkins/workspace/lldb-cmake-standalone/lldb-xcode-build/source/Plugins/Process/gdb-remote/lldb.build/Release/LLDBPluginProcessGDBRemotePropertiesEnumGen.build/Script-09695A1A0F724818A46688B8.sh echo "Building ProcessGDBRemotePropertiesEnum.inc..." Building ProcessGDBRemotePropertiesEnum.inc... /Users/buildslave/jenkins/workspace/lldb-cmake-standalone/lldb-xcode-build/Release/bin/lldb-tblgen -gen-lldb-property-enum-defs -I /Users/buildslave/jenkins/workspace/lldb-cmake-standalone/llvm-project/lldb/source/Plugins/Process/gdb-remote -I/Users/buildslave/jenkins/workspace/lldb-cmake-standalone/lldb-xcode-build/source -I/Users/buildslave/jenkins/workspace/lldb-cmake-standalone/llvm-project/lldb/include -I/Users/buildslave/jenkins/workspace/lldb-cmake-standalone/lldb-xcode-build/include -I/Users/buildslave/jenkins/workspace/lldb-cmake-standalone/lldb-xcode-build/include -I/Users/buildslave/jenkins/workspace/lldb-cmake-standalone/llvm-project/llvm/include -I/Users/buildslave/jenkins/workspace/lldb-cmake-standalone/clang-build/include -I/Users/buildslave/jenkins/workspace/lldb-cmake-standalone/llvm-project/clang/include -I/Users/buildslave/jenkins/workspace/lldb-cmake-standalone/clang-build/tools/clang/include -I/usr/local/Cellar/python/3.7.0/Frameworks/Python.framework/Versions/3.7/include/python3.7m -I/Users/buildslave/jenkins/workspace/lldb-cmake-standalone/llvm-project/lldb/tools/clang/include -I/Users/buildslave/jenkins/workspace/lldb-cmake-standalone/lldb-xcode-build/../clang/include -I/usr/local/include -I/Applications/Xcode.app/Contents/Developer/Platforms/MacOSX.platform/Developer/SDKs/MacOSX10.15.sdk/usr/include/libxml2 -I/Applications/Xcode.app/Contents/Developer/Platforms/MacOSX.platform/Developer/SDKs/MacOSX10.15.sdk/usr/include/libxml2 -I/Users/buildslave/jenkins/workspace/lldb-cmake-standalone/llvm-project/lldb/source/. /Users/buildslave/jenkins/workspace/lldb-cmake-standalone/llvm-project/lldb/source/Plugins/Process/gdb-remote/ProcessGDBRemoteProperties.td --write-if-changed -o /Users/buildslave/jenkins/workspace/lldb-cmake-standalone/lldb-xcode-build/source/Plugins/Process/gdb-remote/ProcessGDBRemotePropertiesEnum.inc

Hide Details

=== BUILD AGGREGATE TARGET LLDBPluginProcessGDBRemotePropertiesGen OF PROJECT lldb WITH CONFIGURATION Release ===

Hide Details

Check dependencies

Hide Details

PhaseScriptExecution CMake\ Rules /Users/buildslave/jenkins/workspace/lldb-cmake-standalone/lldb-xcode-build/source/Plugins/Process/gdb-remote/lldb.build/Release/LLDBPluginProcessGDBRemotePropertiesGen.build/Script-90B1CF49C0504ACEA4A5ED87.sh cd /Users/buildslave/jenkins/workspace/lldb-cmake-standalone/llvm-project/lldb /bin/sh -c /Users/buildslave/jenkins/workspace/lldb-cmake-standalone/lldb-xcode-build/source/Plugins/Process/gdb-remote/lldb.build/Release/LLDBPluginProcessGDBRemotePropertiesGen.build/Script-90B1CF49C0504ACEA4A5ED87.sh echo "Building ProcessGDBRemoteProperties.inc..." Building ProcessGDBRemoteProperties.inc... /Users/buildslave/jenkins/workspace/lldb-cmake-standalone/lldb-xcode-build/Release/bin/lldb-tblgen -gen-lldb-property-defs -I /Users/buildslave/jenkins/workspace/lldb-cmake-standalone/llvm-project/lldb/source/Plugins/Process/gdb-remote -I/Users/buildslave/jenkins/workspace/lldb-cmake-standalone/lldb-xcode-build/source -I/Users/buildslave/jenkins/workspace/lldb-cmake-standalone/llvm-project/lldb/include -I/Users/buildslave/jenkins/workspace/lldb-cmake-standalone/lldb-xcode-build/include -I/Users/buildslave/jenkins/workspace/lldb-cmake-standalone/lldb-xcode-build/include -I/Users/buildslave/jenkins/workspace/lldb-cmake-standalone/llvm-project/llvm/include -I/Users/buildslave/jenkins/workspace/lldb-cmake-standalone/clang-build/include -I/Users/buildslave/jenkins/workspace/lldb-cmake-standalone/llvm-project/clang/include -I/Users/buildslave/jenkins/workspace/lldb-cmake-standalone/clang-build/tools/clang/include -I/usr/local/Cellar/python/3.7.0/Frameworks/Python.framework/Versions/3.7/include/python3.7m -I/Users/buildslave/jenkins/workspace/lldb-cmake-standalone/llvm-project/lldb/tools/clang/include -I/Users/buildslave/jenkins/workspace/lldb-cmake-standalone/lldb-xcode-build/../clang/include -I/usr/local/include -I/Applications/Xcode.app/Contents/Developer/Platforms/MacOSX.platform/Developer/SDKs/MacOSX10.15.sdk/usr/include/libxml2 -I/Applications/Xcode.app/Contents/Developer/Platforms/MacOSX.platform/Developer/SDKs/MacOSX10.15.sdk/usr/include/libxml2 -I/Users/buildslave/jenkins/workspace/lldb-cmake-standalone/llvm-project/lldb/source/. /Users/buildslave/jenkins/workspace/lldb-cmake-standalone/llvm-project/lldb/source/Plugins/Process/gdb-remote/ProcessGDBRemoteProperties.td --write-if-changed -o /Users/buildslave/jenkins/workspace/lldb-cmake-standalone/lldb-xcode-build/source/Plugins/Process/gdb-remote/ProcessGDBRemoteProperties.inc

Hide Details

=== BUILD TARGET lldbPluginProcessGDBRemote OF PROJECT lldb WITH CONFIGURATION Release ===

Hide Details

Check dependencies

Hide Details

=== BUILD TARGET lldbInitialization OF PROJECT lldb WITH CONFIGURATION Release ===

Hide Details

Check dependencies

Hide Details

=== BUILD TARGET lldbPluginABIX86 OF PROJECT lldb WITH CONFIGURATION Release ===

Hide Details

Check dependencies

Hide Details

=== BUILD TARGET lldbPluginArchitectureArm OF PROJECT lldb WITH CONFIGURATION Release ===

Hide Details

Check dependencies

Hide Details

=== BUILD TARGET lldbPluginArchitectureMips OF PROJECT lldb WITH CONFIGURATION Release ===

Hide Details

Check dependencies

Hide Details

=== BUILD TARGET lldbPluginArchitecturePPC64 OF PROJECT lldb WITH CONFIGURATION Release ===

Hide Details

Check dependencies

Hide Details

=== BUILD TARGET lldbPluginArchitectureAArch64 OF PROJECT lldb WITH CONFIGURATION Release ===

Hide Details

Check dependencies

Hide Details

=== BUILD TARGET lldbPluginDisassemblerLLVMC OF PROJECT lldb WITH CONFIGURATION Release ===

Hide Details

Check dependencies

Hide Details

=== BUILD AGGREGATE TARGET LLDBPluginDynamicLoaderDarwinKernelPropertiesEnumGen OF PROJECT lldb WITH CONFIGURATION Release ===

Hide Details

Check dependencies

Hide Details

PhaseScriptExecution CMake\ Rules /Users/buildslave/jenkins/workspace/lldb-cmake-standalone/lldb-xcode-build/source/Plugins/DynamicLoader/Darwin-Kernel/lldb.build/Release/LLDBPluginDynamicLoaderDarwinKernelPropertiesEnumGen.build/Script-D0742C837A744B0DAC5CD95F.sh cd /Users/buildslave/jenkins/workspace/lldb-cmake-standalone/llvm-project/lldb /bin/sh -c /Users/buildslave/jenkins/workspace/lldb-cmake-standalone/lldb-xcode-build/source/Plugins/DynamicLoader/Darwin-Kernel/lldb.build/Release/LLDBPluginDynamicLoaderDarwinKernelPropertiesEnumGen.build/Script-D0742C837A744B0DAC5CD95F.sh echo "Building DynamicLoaderDarwinKernelPropertiesEnum.inc..." Building DynamicLoaderDarwinKernelPropertiesEnum.inc... /Users/buildslave/jenkins/workspace/lldb-cmake-standalone/lldb-xcode-build/Release/bin/lldb-tblgen -gen-lldb-property-enum-defs -I /Users/buildslave/jenkins/workspace/lldb-cmake-standalone/llvm-project/lldb/source/Plugins/DynamicLoader/Darwin-Kernel -I/Users/buildslave/jenkins/workspace/lldb-cmake-standalone/lldb-xcode-build/source -I/Users/buildslave/jenkins/workspace/lldb-cmake-standalone/llvm-project/lldb/include -I/Users/buildslave/jenkins/workspace/lldb-cmake-standalone/lldb-xcode-build/include -I/Users/buildslave/jenkins/workspace/lldb-cmake-standalone/lldb-xcode-build/include -I/Users/buildslave/jenkins/workspace/lldb-cmake-standalone/llvm-project/llvm/include -I/Users/buildslave/jenkins/workspace/lldb-cmake-standalone/clang-build/include -I/Users/buildslave/jenkins/workspace/lldb-cmake-standalone/llvm-project/clang/include -I/Users/buildslave/jenkins/workspace/lldb-cmake-standalone/clang-build/tools/clang/include -I/usr/local/Cellar/python/3.7.0/Frameworks/Python.framework/Versions/3.7/include/python3.7m -I/Users/buildslave/jenkins/workspace/lldb-cmake-standalone/llvm-project/lldb/tools/clang/include -I/Users/buildslave/jenkins/workspace/lldb-cmake-standalone/lldb-xcode-build/../clang/include -I/usr/local/include -I/Applications/Xcode.app/Contents/Developer/Platforms/MacOSX.platform/Developer/SDKs/MacOSX10.15.sdk/usr/include/libxml2 -I/Applications/Xcode.app/Contents/Developer/Platforms/MacOSX.platform/Developer/SDKs/MacOSX10.15.sdk/usr/include/libxml2 -I/Users/buildslave/jenkins/workspace/lldb-cmake-standalone/llvm-project/lldb/source/. /Users/buildslave/jenkins/workspace/lldb-cmake-standalone/llvm-project/lldb/source/Plugins/DynamicLoader/Darwin-Kernel/DynamicLoaderDarwinKernelProperties.td --write-if-changed -o /Users/buildslave/jenkins/workspace/lldb-cmake-standalone/lldb-xcode-build/source/Plugins/DynamicLoader/Darwin-Kernel/DynamicLoaderDarwinKernelPropertiesEnum.inc

Hide Details

=== BUILD AGGREGATE TARGET LLDBPluginDynamicLoaderDarwinKernelPropertiesGen OF PROJECT lldb WITH CONFIGURATION Release ===

Hide Details

Check dependencies

Hide Details

PhaseScriptExecution CMake\ Rules /Users/buildslave/jenkins/workspace/lldb-cmake-standalone/lldb-xcode-build/source/Plugins/DynamicLoader/Darwin-Kernel/lldb.build/Release/LLDBPluginDynamicLoaderDarwinKernelPropertiesGen.build/Script-95EB11EA041747E88F50B693.sh cd /Users/buildslave/jenkins/workspace/lldb-cmake-standalone/llvm-project/lldb /bin/sh -c /Users/buildslave/jenkins/workspace/lldb-cmake-standalone/lldb-xcode-build/source/Plugins/DynamicLoader/Darwin-Kernel/lldb.build/Release/LLDBPluginDynamicLoaderDarwinKernelPropertiesGen.build/Script-95EB11EA041747E88F50B693.sh echo "Building DynamicLoaderDarwinKernelProperties.inc..." Building DynamicLoaderDarwinKernelProperties.inc... /Users/buildslave/jenkins/workspace/lldb-cmake-standalone/lldb-xcode-build/Release/bin/lldb-tblgen -gen-lldb-property-defs -I /Users/buildslave/jenkins/workspace/lldb-cmake-standalone/llvm-project/lldb/source/Plugins/DynamicLoader/Darwin-Kernel -I/Users/buildslave/jenkins/workspace/lldb-cmake-standalone/lldb-xcode-build/source -I/Users/buildslave/jenkins/workspace/lldb-cmake-standalone/llvm-project/lldb/include -I/Users/buildslave/jenkins/workspace/lldb-cmake-standalone/lldb-xcode-build/include -I/Users/buildslave/jenkins/workspace/lldb-cmake-standalone/lldb-xcode-build/include -I/Users/buildslave/jenkins/workspace/lldb-cmake-standalone/llvm-project/llvm/include -I/Users/buildslave/jenkins/workspace/lldb-cmake-standalone/clang-build/include -I/Users/buildslave/jenkins/workspace/lldb-cmake-standalone/llvm-project/clang/include -I/Users/buildslave/jenkins/workspace/lldb-cmake-standalone/clang-build/tools/clang/include -I/usr/local/Cellar/python/3.7.0/Frameworks/Python.framework/Versions/3.7/include/python3.7m -I/Users/buildslave/jenkins/workspace/lldb-cmake-standalone/llvm-project/lldb/tools/clang/include -I/Users/buildslave/jenkins/workspace/lldb-cmake-standalone/lldb-xcode-build/../clang/include -I/usr/local/include -I/Applications/Xcode.app/Contents/Developer/Platforms/MacOSX.platform/Developer/SDKs/MacOSX10.15.sdk/usr/include/libxml2 -I/Applications/Xcode.app/Contents/Developer/Platforms/MacOSX.platform/Developer/SDKs/MacOSX10.15.sdk/usr/include/libxml2 -I/Users/buildslave/jenkins/workspace/lldb-cmake-standalone/llvm-project/lldb/source/. /Users/buildslave/jenkins/workspace/lldb-cmake-standalone/llvm-project/lldb/source/Plugins/DynamicLoader/Darwin-Kernel/DynamicLoaderDarwinKernelProperties.td --write-if-changed -o /Users/buildslave/jenkins/workspace/lldb-cmake-standalone/lldb-xcode-build/source/Plugins/DynamicLoader/Darwin-Kernel/DynamicLoaderDarwinKernelProperties.inc

Hide Details

=== BUILD TARGET lldbPluginDynamicLoaderDarwinKernel OF PROJECT lldb WITH CONFIGURATION Release ===

Hide Details

Check dependencies

Hide Details

=== BUILD TARGET lldbPluginDynamicLoaderMacOSXDYLD OF PROJECT lldb WITH CONFIGURATION Release ===

Hide Details

Check dependencies

Hide Details

=== BUILD TARGET lldbPluginObjectFileELF OF PROJECT lldb WITH CONFIGURATION Release ===

Hide Details

Check dependencies

Hide Details

=== BUILD TARGET lldbPluginProcessElfCore OF PROJECT lldb WITH CONFIGURATION Release ===

Hide Details

Check dependencies

Hide Details

=== BUILD TARGET lldbPluginDynamicLoaderPosixDYLD OF PROJECT lldb WITH CONFIGURATION Release ===

Hide Details

Check dependencies

Hide Details

=== BUILD TARGET lldbPluginDynamicLoaderStatic OF PROJECT lldb WITH CONFIGURATION Release ===

Hide Details

Check dependencies

Hide Details

=== BUILD TARGET lldbPluginDynamicLoaderHexagonDYLD OF PROJECT lldb WITH CONFIGURATION Release ===

Hide Details

Check dependencies

Hide Details

=== BUILD TARGET lldbPluginDynamicLoaderWindowsDYLD OF PROJECT lldb WITH CONFIGURATION Release ===

Hide Details

Check dependencies

Hide Details

=== BUILD TARGET lldbPluginDynamicLoaderWasmDYLD OF PROJECT lldb WITH CONFIGURATION Release ===

Hide Details

Check dependencies

Hide Details

=== BUILD TARGET lldbPluginInstructionARM OF PROJECT lldb WITH CONFIGURATION Release ===

Hide Details

Check dependencies

Hide Details

=== BUILD TARGET lldbPluginInstructionARM64 OF PROJECT lldb WITH CONFIGURATION Release ===

Hide Details

Check dependencies

Hide Details

=== BUILD TARGET lldbPluginInstructionMIPS OF PROJECT lldb WITH CONFIGURATION Release ===

Hide Details

Check dependencies

Hide Details

=== BUILD TARGET lldbPluginInstructionMIPS64 OF PROJECT lldb WITH CONFIGURATION Release ===

Hide Details

Check dependencies

Hide Details

=== BUILD TARGET lldbPluginInstructionPPC64 OF PROJECT lldb WITH CONFIGURATION Release ===

Hide Details

Check dependencies

Hide Details

=== BUILD TARGET lldbPluginInstrumentationRuntimeASan OF PROJECT lldb WITH CONFIGURATION Release ===

Hide Details

Check dependencies

Hide Details

=== BUILD TARGET lldbPluginInstrumentationRuntimeMainThreadChecker OF PROJECT lldb WITH CONFIGURATION Release ===

Hide Details

Check dependencies

Hide Details

=== BUILD TARGET lldbPluginInstrumentationRuntimeTSan OF PROJECT lldb WITH CONFIGURATION Release ===

Hide Details

Check dependencies

Hide Details

=== BUILD TARGET lldbPluginInstrumentationRuntimeUBSan OF PROJECT lldb WITH CONFIGURATION Release ===

Hide Details

Check dependencies

Hide Details

=== BUILD AGGREGATE TARGET LLDBPluginJITLoaderGDBPropertiesEnumGen OF PROJECT lldb WITH CONFIGURATION Release ===

Hide Details

Check dependencies

Hide Details

PhaseScriptExecution CMake\ Rules /Users/buildslave/jenkins/workspace/lldb-cmake-standalone/lldb-xcode-build/source/Plugins/JITLoader/GDB/lldb.build/Release/LLDBPluginJITLoaderGDBPropertiesEnumGen.build/Script-F8346C59F9EA4BC4B9AB2E15.sh cd /Users/buildslave/jenkins/workspace/lldb-cmake-standalone/llvm-project/lldb /bin/sh -c /Users/buildslave/jenkins/workspace/lldb-cmake-standalone/lldb-xcode-build/source/Plugins/JITLoader/GDB/lldb.build/Release/LLDBPluginJITLoaderGDBPropertiesEnumGen.build/Script-F8346C59F9EA4BC4B9AB2E15.sh echo "Building JITLoaderGDBPropertiesEnum.inc..." Building JITLoaderGDBPropertiesEnum.inc... /Users/buildslave/jenkins/workspace/lldb-cmake-standalone/lldb-xcode-build/Release/bin/lldb-tblgen -gen-lldb-property-enum-defs -I /Users/buildslave/jenkins/workspace/lldb-cmake-standalone/llvm-project/lldb/source/Plugins/JITLoader/GDB -I/Users/buildslave/jenkins/workspace/lldb-cmake-standalone/lldb-xcode-build/source -I/Users/buildslave/jenkins/workspace/lldb-cmake-standalone/llvm-project/lldb/include -I/Users/buildslave/jenkins/workspace/lldb-cmake-standalone/lldb-xcode-build/include -I/Users/buildslave/jenkins/workspace/lldb-cmake-standalone/lldb-xcode-build/include -I/Users/buildslave/jenkins/workspace/lldb-cmake-standalone/llvm-project/llvm/include -I/Users/buildslave/jenkins/workspace/lldb-cmake-standalone/clang-build/include -I/Users/buildslave/jenkins/workspace/lldb-cmake-standalone/llvm-project/clang/include -I/Users/buildslave/jenkins/workspace/lldb-cmake-standalone/clang-build/tools/clang/include -I/usr/local/Cellar/python/3.7.0/Frameworks/Python.framework/Versions/3.7/include/python3.7m -I/Users/buildslave/jenkins/workspace/lldb-cmake-standalone/llvm-project/lldb/tools/clang/include -I/Users/buildslave/jenkins/workspace/lldb-cmake-standalone/lldb-xcode-build/../clang/include -I/usr/local/include -I/Applications/Xcode.app/Contents/Developer/Platforms/MacOSX.platform/Developer/SDKs/MacOSX10.15.sdk/usr/include/libxml2 -I/Applications/Xcode.app/Contents/Developer/Platforms/MacOSX.platform/Developer/SDKs/MacOSX10.15.sdk/usr/include/libxml2 -I/Users/buildslave/jenkins/workspace/lldb-cmake-standalone/llvm-project/lldb/source/. /Users/buildslave/jenkins/workspace/lldb-cmake-standalone/llvm-project/lldb/source/Plugins/JITLoader/GDB/JITLoaderGDBProperties.td --write-if-changed -o /Users/buildslave/jenkins/workspace/lldb-cmake-standalone/lldb-xcode-build/source/Plugins/JITLoader/GDB/JITLoaderGDBPropertiesEnum.inc

Hide Details

=== BUILD AGGREGATE TARGET LLDBPluginJITLoaderGDBPropertiesGen OF PROJECT lldb WITH CONFIGURATION Release ===

Hide Details

Check dependencies

Hide Details

PhaseScriptExecution CMake\ Rules /Users/buildslave/jenkins/workspace/lldb-cmake-standalone/lldb-xcode-build/source/Plugins/JITLoader/GDB/lldb.build/Release/LLDBPluginJITLoaderGDBPropertiesGen.build/Script-5549FD161DAD467192CEC5B4.sh cd /Users/buildslave/jenkins/workspace/lldb-cmake-standalone/llvm-project/lldb /bin/sh -c /Users/buildslave/jenkins/workspace/lldb-cmake-standalone/lldb-xcode-build/source/Plugins/JITLoader/GDB/lldb.build/Release/LLDBPluginJITLoaderGDBPropertiesGen.build/Script-5549FD161DAD467192CEC5B4.sh echo "Building JITLoaderGDBProperties.inc..." Building JITLoaderGDBProperties.inc... /Users/buildslave/jenkins/workspace/lldb-cmake-standalone/lldb-xcode-build/Release/bin/lldb-tblgen -gen-lldb-property-defs -I /Users/buildslave/jenkins/workspace/lldb-cmake-standalone/llvm-project/lldb/source/Plugins/JITLoader/GDB -I/Users/buildslave/jenkins/workspace/lldb-cmake-standalone/lldb-xcode-build/source -I/Users/buildslave/jenkins/workspace/lldb-cmake-standalone/llvm-project/lldb/include -I/Users/buildslave/jenkins/workspace/lldb-cmake-standalone/lldb-xcode-build/include -I/Users/buildslave/jenkins/workspace/lldb-cmake-standalone/lldb-xcode-build/include -I/Users/buildslave/jenkins/workspace/lldb-cmake-standalone/llvm-project/llvm/include -I/Users/buildslave/jenkins/workspace/lldb-cmake-standalone/clang-build/include -I/Users/buildslave/jenkins/workspace/lldb-cmake-standalone/llvm-project/clang/include -I/Users/buildslave/jenkins/workspace/lldb-cmake-standalone/clang-build/tools/clang/include -I/usr/local/Cellar/python/3.7.0/Frameworks/Python.framework/Versions/3.7/include/python3.7m -I/Users/buildslave/jenkins/workspace/lldb-cmake-standalone/llvm-project/lldb/tools/clang/include -I/Users/buildslave/jenkins/workspace/lldb-cmake-standalone/lldb-xcode-build/../clang/include -I/usr/local/include -I/Applications/Xcode.app/Contents/Developer/Platforms/MacOSX.platform/Developer/SDKs/MacOSX10.15.sdk/usr/include/libxml2 -I/Applications/Xcode.app/Contents/Developer/Platforms/MacOSX.platform/Developer/SDKs/MacOSX10.15.sdk/usr/include/libxml2 -I/Users/buildslave/jenkins/workspace/lldb-cmake-standalone/llvm-project/lldb/source/. /Users/buildslave/jenkins/workspace/lldb-cmake-standalone/llvm-project/lldb/source/Plugins/JITLoader/GDB/JITLoaderGDBProperties.td --write-if-changed -o /Users/buildslave/jenkins/workspace/lldb-cmake-standalone/lldb-xcode-build/source/Plugins/JITLoader/GDB/JITLoaderGDBProperties.inc

Hide Details

=== BUILD TARGET lldbPluginObjectFileMachO OF PROJECT lldb WITH CONFIGURATION Release ===

Hide Details

Check dependencies

Hide Details

=== BUILD TARGET lldbPluginJITLoaderGDB OF PROJECT lldb WITH CONFIGURATION Release ===

Hide Details

Check dependencies

Hide Details

=== BUILD TARGET lldbPluginObjCPlusPlusLanguage OF PROJECT lldb WITH CONFIGURATION Release ===

Hide Details

Check dependencies

Hide Details

=== BUILD TARGET lldbPluginCXXItaniumABI OF PROJECT lldb WITH CONFIGURATION Release ===

Hide Details

Check dependencies

Hide Details

=== BUILD TARGET lldbPluginMemoryHistoryASan OF PROJECT lldb WITH CONFIGURATION Release ===

Hide Details

Check dependencies

Hide Details

=== BUILD TARGET lldbPluginObjectContainerBSDArchive OF PROJECT lldb WITH CONFIGURATION Release ===

Hide Details

Check dependencies

Hide Details

=== BUILD TARGET lldbPluginObjectContainerMachOArchive OF PROJECT lldb WITH CONFIGURATION Release ===

Hide Details

Check dependencies

Hide Details

=== BUILD TARGET lldbPluginObjectFileBreakpad OF PROJECT lldb WITH CONFIGURATION Release ===

Hide Details

Check dependencies

Hide Details

=== BUILD TARGET lldbPluginObjectFileMinidump OF PROJECT lldb WITH CONFIGURATION Release ===

Hide Details

Check dependencies

Hide Details

=== BUILD TARGET lldbPluginObjectFilePECOFF OF PROJECT lldb WITH CONFIGURATION Release ===

Hide Details

Check dependencies

Hide Details

=== BUILD TARGET lldbPluginObjectFileWasm OF PROJECT lldb WITH CONFIGURATION Release ===

Hide Details

Check dependencies

Hide Details

=== BUILD TARGET lldbPluginOperatingSystemPython OF PROJECT lldb WITH CONFIGURATION Release ===

Hide Details

Check dependencies

Hide Details

=== BUILD TARGET lldbPluginPlatformGDB OF PROJECT lldb WITH CONFIGURATION Release ===

Hide Details

Check dependencies

Hide Details

=== BUILD TARGET lldbPluginPlatformLinux OF PROJECT lldb WITH CONFIGURATION Release ===

Hide Details

Check dependencies

Hide Details

=== BUILD TARGET lldbPluginPlatformAndroid OF PROJECT lldb WITH CONFIGURATION Release ===

Hide Details

Check dependencies

Hide Details

=== BUILD TARGET lldbPluginPlatformFreeBSD OF PROJECT lldb WITH CONFIGURATION Release ===

Hide Details

Check dependencies

Hide Details

=== BUILD TARGET lldbPluginPlatformNetBSD OF PROJECT lldb WITH CONFIGURATION Release ===

Hide Details

Check dependencies

Hide Details

=== BUILD TARGET lldbPluginPlatformOpenBSD OF PROJECT lldb WITH CONFIGURATION Release ===

Hide Details

Check dependencies

Hide Details

=== BUILD TARGET lldbPluginPlatformWindows OF PROJECT lldb WITH CONFIGURATION Release ===

Hide Details

Check dependencies

Hide Details

=== BUILD AGGREGATE TARGET LLDBPluginProcessMacOSXKernelPropertiesEnumGen OF PROJECT lldb WITH CONFIGURATION Release ===

Hide Details

Check dependencies

Hide Details

PhaseScriptExecution CMake\ Rules /Users/buildslave/jenkins/workspace/lldb-cmake-standalone/lldb-xcode-build/source/Plugins/Process/MacOSX-Kernel/lldb.build/Release/LLDBPluginProcessMacOSXKernelPropertiesEnumGen.build/Script-1F1539BCAAF84CEFB5A18981.sh cd /Users/buildslave/jenkins/workspace/lldb-cmake-standalone/llvm-project/lldb /bin/sh -c /Users/buildslave/jenkins/workspace/lldb-cmake-standalone/lldb-xcode-build/source/Plugins/Process/MacOSX-Kernel/lldb.build/Release/LLDBPluginProcessMacOSXKernelPropertiesEnumGen.build/Script-1F1539BCAAF84CEFB5A18981.sh echo "Building ProcessKDPPropertiesEnum.inc..." Building ProcessKDPPropertiesEnum.inc... /Users/buildslave/jenkins/workspace/lldb-cmake-standalone/lldb-xcode-build/Release/bin/lldb-tblgen -gen-lldb-property-enum-defs -I /Users/buildslave/jenkins/workspace/lldb-cmake-standalone/llvm-project/lldb/source/Plugins/Process/MacOSX-Kernel -I/Users/buildslave/jenkins/workspace/lldb-cmake-standalone/lldb-xcode-build/source -I/Users/buildslave/jenkins/workspace/lldb-cmake-standalone/llvm-project/lldb/include -I/Users/buildslave/jenkins/workspace/lldb-cmake-standalone/lldb-xcode-build/include -I/Users/buildslave/jenkins/workspace/lldb-cmake-standalone/lldb-xcode-build/include -I/Users/buildslave/jenkins/workspace/lldb-cmake-standalone/llvm-project/llvm/include -I/Users/buildslave/jenkins/workspace/lldb-cmake-standalone/clang-build/include -I/Users/buildslave/jenkins/workspace/lldb-cmake-standalone/llvm-project/clang/include -I/Users/buildslave/jenkins/workspace/lldb-cmake-standalone/clang-build/tools/clang/include -I/usr/local/Cellar/python/3.7.0/Frameworks/Python.framework/Versions/3.7/include/python3.7m -I/Users/buildslave/jenkins/workspace/lldb-cmake-standalone/llvm-project/lldb/tools/clang/include -I/Users/buildslave/jenkins/workspace/lldb-cmake-standalone/lldb-xcode-build/../clang/include -I/usr/local/include -I/Applications/Xcode.app/Contents/Developer/Platforms/MacOSX.platform/Developer/SDKs/MacOSX10.15.sdk/usr/include/libxml2 -I/Applications/Xcode.app/Contents/Developer/Platforms/MacOSX.platform/Developer/SDKs/MacOSX10.15.sdk/usr/include/libxml2 -I/Users/buildslave/jenkins/workspace/lldb-cmake-standalone/llvm-project/lldb/source/. /Users/buildslave/jenkins/workspace/lldb-cmake-standalone/llvm-project/lldb/source/Plugins/Process/MacOSX-Kernel/ProcessKDPProperties.td --write-if-changed -o /Users/buildslave/jenkins/workspace/lldb-cmake-standalone/lldb-xcode-build/source/Plugins/Process/MacOSX-Kernel/ProcessKDPPropertiesEnum.inc

Hide Details

=== BUILD AGGREGATE TARGET LLDBPluginProcessMacOSXKernelPropertiesGen OF PROJECT lldb WITH CONFIGURATION Release ===

Hide Details

Check dependencies

Hide Details

PhaseScriptExecution CMake\ Rules /Users/buildslave/jenkins/workspace/lldb-cmake-standalone/lldb-xcode-build/source/Plugins/Process/MacOSX-Kernel/lldb.build/Release/LLDBPluginProcessMacOSXKernelPropertiesGen.build/Script-9A4D47BBE0964869A1CA4932.sh cd /Users/buildslave/jenkins/workspace/lldb-cmake-standalone/llvm-project/lldb /bin/sh -c /Users/buildslave/jenkins/workspace/lldb-cmake-standalone/lldb-xcode-build/source/Plugins/Process/MacOSX-Kernel/lldb.build/Release/LLDBPluginProcessMacOSXKernelPropertiesGen.build/Script-9A4D47BBE0964869A1CA4932.sh echo "Building ProcessKDPProperties.inc..." Building ProcessKDPProperties.inc... /Users/buildslave/jenkins/workspace/lldb-cmake-standalone/lldb-xcode-build/Release/bin/lldb-tblgen -gen-lldb-property-defs -I /Users/buildslave/jenkins/workspace/lldb-cmake-standalone/llvm-project/lldb/source/Plugins/Process/MacOSX-Kernel -I/Users/buildslave/jenkins/workspace/lldb-cmake-standalone/lldb-xcode-build/source -I/Users/buildslave/jenkins/workspace/lldb-cmake-standalone/llvm-project/lldb/include -I/Users/buildslave/jenkins/workspace/lldb-cmake-standalone/lldb-xcode-build/include -I/Users/buildslave/jenkins/workspace/lldb-cmake-standalone/lldb-xcode-build/include -I/Users/buildslave/jenkins/workspace/lldb-cmake-standalone/llvm-project/llvm/include -I/Users/buildslave/jenkins/workspace/lldb-cmake-standalone/clang-build/include -I/Users/buildslave/jenkins/workspace/lldb-cmake-standalone/llvm-project/clang/include -I/Users/buildslave/jenkins/workspace/lldb-cmake-standalone/clang-build/tools/clang/include -I/usr/local/Cellar/python/3.7.0/Frameworks/Python.framework/Versions/3.7/include/python3.7m -I/Users/buildslave/jenkins/workspace/lldb-cmake-standalone/llvm-project/lldb/tools/clang/include -I/Users/buildslave/jenkins/workspace/lldb-cmake-standalone/lldb-xcode-build/../clang/include -I/usr/local/include -I/Applications/Xcode.app/Contents/Developer/Platforms/MacOSX.platform/Developer/SDKs/MacOSX10.15.sdk/usr/include/libxml2 -I/Applications/Xcode.app/Contents/Developer/Platforms/MacOSX.platform/Developer/SDKs/MacOSX10.15.sdk/usr/include/libxml2 -I/Users/buildslave/jenkins/workspace/lldb-cmake-standalone/llvm-project/lldb/source/. /Users/buildslave/jenkins/workspace/lldb-cmake-standalone/llvm-project/lldb/source/Plugins/Process/MacOSX-Kernel/ProcessKDPProperties.td --write-if-changed -o /Users/buildslave/jenkins/workspace/lldb-cmake-standalone/lldb-xcode-build/source/Plugins/Process/MacOSX-Kernel/ProcessKDPProperties.inc

Hide Details

=== BUILD TARGET lldbPluginProcessMacOSXKernel OF PROJECT lldb WITH CONFIGURATION Release ===

Hide Details

Check dependencies

Hide Details

=== BUILD TARGET lldbPluginScriptedProcess OF PROJECT lldb WITH CONFIGURATION Release ===

Hide Details

Check dependencies

Hide Details

=== BUILD TARGET lldbPluginProcessMachCore OF PROJECT lldb WITH CONFIGURATION Release ===

Hide Details

Check dependencies

Hide Details

=== BUILD TARGET lldbPluginProcessMinidump OF PROJECT lldb WITH CONFIGURATION Release ===

Hide Details

Check dependencies

Hide Details

=== BUILD TARGET lldbPluginClangREPL OF PROJECT lldb WITH CONFIGURATION Release ===

Hide Details

Check dependencies

Hide Details

=== BUILD TARGET lldbPluginScriptInterpreterNone OF PROJECT lldb WITH CONFIGURATION Release ===

Hide Details

Check dependencies

Hide Details

=== BUILD TARGET lldbPluginScriptInterpreterPython OF PROJECT lldb WITH CONFIGURATION Release ===

Hide Details

Check dependencies

Hide Details

=== BUILD AGGREGATE TARGET LLDBPluginStructuredDataDarwinLogPropertiesEnumGen OF PROJECT lldb WITH CONFIGURATION Release ===

Hide Details

Check dependencies

Hide Details

PhaseScriptExecution CMake\ Rules /Users/buildslave/jenkins/workspace/lldb-cmake-standalone/lldb-xcode-build/source/Plugins/StructuredData/DarwinLog/lldb.build/Release/LLDBPluginStructuredDataDarwinLogPropertiesEnumGen.build/Script-F9699FE717B34AF79DF34A46.sh cd /Users/buildslave/jenkins/workspace/lldb-cmake-standalone/llvm-project/lldb /bin/sh -c /Users/buildslave/jenkins/workspace/lldb-cmake-standalone/lldb-xcode-build/source/Plugins/StructuredData/DarwinLog/lldb.build/Release/LLDBPluginStructuredDataDarwinLogPropertiesEnumGen.build/Script-F9699FE717B34AF79DF34A46.sh echo "Building StructuredDataDarwinLogPropertiesEnum.inc..." Building StructuredDataDarwinLogPropertiesEnum.inc... /Users/buildslave/jenkins/workspace/lldb-cmake-standalone/lldb-xcode-build/Release/bin/lldb-tblgen -gen-lldb-property-enum-defs -I /Users/buildslave/jenkins/workspace/lldb-cmake-standalone/llvm-project/lldb/source/Plugins/StructuredData/DarwinLog -I/Users/buildslave/jenkins/workspace/lldb-cmake-standalone/lldb-xcode-build/source -I/Users/buildslave/jenkins/workspace/lldb-cmake-standalone/llvm-project/lldb/include -I/Users/buildslave/jenkins/workspace/lldb-cmake-standalone/lldb-xcode-build/include -I/Users/buildslave/jenkins/workspace/lldb-cmake-standalone/lldb-xcode-build/include -I/Users/buildslave/jenkins/workspace/lldb-cmake-standalone/llvm-project/llvm/include -I/Users/buildslave/jenkins/workspace/lldb-cmake-standalone/clang-build/include -I/Users/buildslave/jenkins/workspace/lldb-cmake-standalone/llvm-project/clang/include -I/Users/buildslave/jenkins/workspace/lldb-cmake-standalone/clang-build/tools/clang/include -I/usr/local/Cellar/python/3.7.0/Frameworks/Python.framework/Versions/3.7/include/python3.7m -I/Users/buildslave/jenkins/workspace/lldb-cmake-standalone/llvm-project/lldb/tools/clang/include -I/Users/buildslave/jenkins/workspace/lldb-cmake-standalone/lldb-xcode-build/../clang/include -I/usr/local/include -I/Applications/Xcode.app/Contents/Developer/Platforms/MacOSX.platform/Developer/SDKs/MacOSX10.15.sdk/usr/include/libxml2 -I/Applications/Xcode.app/Contents/Developer/Platforms/MacOSX.platform/Developer/SDKs/MacOSX10.15.sdk/usr/include/libxml2 -I/Users/buildslave/jenkins/workspace/lldb-cmake-standalone/llvm-project/lldb/source/. /Users/buildslave/jenkins/workspace/lldb-cmake-standalone/llvm-project/lldb/source/Plugins/StructuredData/DarwinLog/StructuredDataDarwinLogProperties.td --write-if-changed -o /Users/buildslave/jenkins/workspace/lldb-cmake-standalone/lldb-xcode-build/source/Plugins/StructuredData/DarwinLog/StructuredDataDarwinLogPropertiesEnum.inc

Hide Details

=== BUILD AGGREGATE TARGET LLDBPluginStructuredDataDarwinLogPropertiesGen OF PROJECT lldb WITH CONFIGURATION Release ===

Hide Details

Check dependencies

Hide Details

PhaseScriptExecution CMake\ Rules /Users/buildslave/jenkins/workspace/lldb-cmake-standalone/lldb-xcode-build/source/Plugins/StructuredData/DarwinLog/lldb.build/Release/LLDBPluginStructuredDataDarwinLogPropertiesGen.build/Script-33318489239E429CA3340EA2.sh cd /Users/buildslave/jenkins/workspace/lldb-cmake-standalone/llvm-project/lldb /bin/sh -c /Users/buildslave/jenkins/workspace/lldb-cmake-standalone/lldb-xcode-build/source/Plugins/StructuredData/DarwinLog/lldb.build/Release/LLDBPluginStructuredDataDarwinLogPropertiesGen.build/Script-33318489239E429CA3340EA2.sh echo "Building StructuredDataDarwinLogProperties.inc..." Building StructuredDataDarwinLogProperties.inc... /Users/buildslave/jenkins/workspace/lldb-cmake-standalone/lldb-xcode-build/Release/bin/lldb-tblgen -gen-lldb-property-defs -I /Users/buildslave/jenkins/workspace/lldb-cmake-standalone/llvm-project/lldb/source/Plugins/StructuredData/DarwinLog -I/Users/buildslave/jenkins/workspace/lldb-cmake-standalone/lldb-xcode-build/source -I/Users/buildslave/jenkins/workspace/lldb-cmake-standalone/llvm-project/lldb/include -I/Users/buildslave/jenkins/workspace/lldb-cmake-standalone/lldb-xcode-build/include -I/Users/buildslave/jenkins/workspace/lldb-cmake-standalone/lldb-xcode-build/include -I/Users/buildslave/jenkins/workspace/lldb-cmake-standalone/llvm-project/llvm/include -I/Users/buildslave/jenkins/workspace/lldb-cmake-standalone/clang-build/include -I/Users/buildslave/jenkins/workspace/lldb-cmake-standalone/llvm-project/clang/include -I/Users/buildslave/jenkins/workspace/lldb-cmake-standalone/clang-build/tools/clang/include -I/usr/local/Cellar/python/3.7.0/Frameworks/Python.framework/Versions/3.7/include/python3.7m -I/Users/buildslave/jenkins/workspace/lldb-cmake-standalone/llvm-project/lldb/tools/clang/include -I/Users/buildslave/jenkins/workspace/lldb-cmake-standalone/lldb-xcode-build/../clang/include -I/usr/local/include -I/Applications/Xcode.app/Contents/Developer/Platforms/MacOSX.platform/Developer/SDKs/MacOSX10.15.sdk/usr/include/libxml2 -I/Applications/Xcode.app/Contents/Developer/Platforms/MacOSX.platform/Developer/SDKs/MacOSX10.15.sdk/usr/include/libxml2 -I/Users/buildslave/jenkins/workspace/lldb-cmake-standalone/llvm-project/lldb/source/. /Users/buildslave/jenkins/workspace/lldb-cmake-standalone/llvm-project/lldb/source/Plugins/StructuredData/DarwinLog/StructuredDataDarwinLogProperties.td --write-if-changed -o /Users/buildslave/jenkins/workspace/lldb-cmake-standalone/lldb-xcode-build/source/Plugins/StructuredData/DarwinLog/StructuredDataDarwinLogProperties.inc

Hide Details

=== BUILD TARGET lldbPluginStructuredDataDarwinLog OF PROJECT lldb WITH CONFIGURATION Release ===

Hide Details

Check dependencies

Hide Details

=== BUILD TARGET lldbPluginSymbolFileBreakpad OF PROJECT lldb WITH CONFIGURATION Release ===

Hide Details

Check dependencies

Hide Details

=== BUILD TARGET lldbPluginSymbolFileSymtab OF PROJECT lldb WITH CONFIGURATION Release ===

Hide Details

Check dependencies

Hide Details

=== BUILD TARGET lldbPluginSystemRuntimeMacOSX OF PROJECT lldb WITH CONFIGURATION Release ===

Hide Details

Check dependencies

Hide Details

=== BUILD TARGET lldbPluginSymbolVendorELF OF PROJECT lldb WITH CONFIGURATION Release ===

Hide Details

Check dependencies

Hide Details

=== BUILD TARGET lldbPluginSymbolVendorMacOSX OF PROJECT lldb WITH CONFIGURATION Release ===

Hide Details

Check dependencies

Hide Details

=== BUILD TARGET lldbPluginSymbolVendorWasm OF PROJECT lldb WITH CONFIGURATION Release ===

Hide Details

Check dependencies

Hide Details

=== BUILD TARGET lldbPluginTraceExporterCommon OF PROJECT lldb WITH CONFIGURATION Release ===

Hide Details

Check dependencies

Hide Details

=== BUILD AGGREGATE TARGET TraceExporterCTFOptionsGen OF PROJECT lldb WITH CONFIGURATION Release ===

Hide Details

Check dependencies

Hide Details

PhaseScriptExecution CMake\ Rules /Users/buildslave/jenkins/workspace/lldb-cmake-standalone/lldb-xcode-build/source/Plugins/TraceExporter/ctf/lldb.build/Release/TraceExporterCTFOptionsGen.build/Script-3F3375291A6543CFA8F9CCFF.sh cd /Users/buildslave/jenkins/workspace/lldb-cmake-standalone/llvm-project/lldb /bin/sh -c /Users/buildslave/jenkins/workspace/lldb-cmake-standalone/lldb-xcode-build/source/Plugins/TraceExporter/ctf/lldb.build/Release/TraceExporterCTFOptionsGen.build/Script-3F3375291A6543CFA8F9CCFF.sh echo "Building TraceExporterCTFCommandOptions.inc..." Building TraceExporterCTFCommandOptions.inc... /Users/buildslave/jenkins/workspace/lldb-cmake-standalone/lldb-xcode-build/Release/bin/lldb-tblgen -gen-lldb-option-defs -I /Users/buildslave/jenkins/workspace/lldb-cmake-standalone/llvm-project/lldb/source/Plugins/TraceExporter/ctf -I/Users/buildslave/jenkins/workspace/lldb-cmake-standalone/lldb-xcode-build/source -I/Users/buildslave/jenkins/workspace/lldb-cmake-standalone/llvm-project/lldb/include -I/Users/buildslave/jenkins/workspace/lldb-cmake-standalone/lldb-xcode-build/include -I/Users/buildslave/jenkins/workspace/lldb-cmake-standalone/lldb-xcode-build/include -I/Users/buildslave/jenkins/workspace/lldb-cmake-standalone/llvm-project/llvm/include -I/Users/buildslave/jenkins/workspace/lldb-cmake-standalone/clang-build/include -I/Users/buildslave/jenkins/workspace/lldb-cmake-standalone/llvm-project/clang/include -I/Users/buildslave/jenkins/workspace/lldb-cmake-standalone/clang-build/tools/clang/include -I/usr/local/Cellar/python/3.7.0/Frameworks/Python.framework/Versions/3.7/include/python3.7m -I/Users/buildslave/jenkins/workspace/lldb-cmake-standalone/llvm-project/lldb/tools/clang/include -I/Users/buildslave/jenkins/workspace/lldb-cmake-standalone/lldb-xcode-build/../clang/include -I/usr/local/include -I/Applications/Xcode.app/Contents/Developer/Platforms/MacOSX.platform/Developer/SDKs/MacOSX10.15.sdk/usr/include/libxml2 -I/Applications/Xcode.app/Contents/Developer/Platforms/MacOSX.platform/Developer/SDKs/MacOSX10.15.sdk/usr/include/libxml2 -I/Users/buildslave/jenkins/workspace/lldb-cmake-standalone/llvm-project/lldb/source/. /Users/buildslave/jenkins/workspace/lldb-cmake-standalone/llvm-project/lldb/source/Plugins/TraceExporter/ctf/TraceExporterCTFOptions.td --write-if-changed -o /Users/buildslave/jenkins/workspace/lldb-cmake-standalone/lldb-xcode-build/source/Plugins/TraceExporter/ctf/TraceExporterCTFCommandOptions.inc

Hide Details

=== BUILD TARGET lldbPluginTraceExporterCTF OF PROJECT lldb WITH CONFIGURATION Release ===

Hide Details

Check dependencies

Hide Details

=== BUILD TARGET lldbPluginUnwindAssemblyInstEmulation OF PROJECT lldb WITH CONFIGURATION Release ===

Hide Details

Check dependencies

Hide Details

=== BUILD TARGET lldbPluginUnwindAssemblyX86 OF PROJECT lldb WITH CONFIGURATION Release ===

Hide Details

Check dependencies

Hide Details

=== BUILD AGGREGATE TARGET liblldb-resource-headers OF PROJECT lldb WITH CONFIGURATION Release ===

Hide Details

Check dependencies

Hide Details

PhaseScriptExecution CMake\ Rules /Users/buildslave/jenkins/workspace/lldb-cmake-standalone/lldb-xcode-build/source/API/lldb.build/Release/liblldb-resource-headers.build/Script-D911393A3CD0407B86B1C20C.sh cd /Users/buildslave/jenkins/workspace/lldb-cmake-standalone/llvm-project/lldb /bin/sh -c /Users/buildslave/jenkins/workspace/lldb-cmake-standalone/lldb-xcode-build/source/API/lldb.build/Release/liblldb-resource-headers.build/Script-D911393A3CD0407B86B1C20C.sh make: Nothing to be done for `all'.

Hide Details

=== BUILD AGGREGATE TARGET liblldb_exports OF PROJECT lldb WITH CONFIGURATION Release ===

Hide Details

Check dependencies

Hide Details

PhaseScriptExecution CMake\ Rules /Users/buildslave/jenkins/workspace/lldb-cmake-standalone/lldb-xcode-build/source/API/lldb.build/Release/liblldb_exports.build/Script-F8AEB3414F864747B2E96058.sh cd /Users/buildslave/jenkins/workspace/lldb-cmake-standalone/llvm-project/lldb /bin/sh -c /Users/buildslave/jenkins/workspace/lldb-cmake-standalone/lldb-xcode-build/source/API/lldb.build/Release/liblldb_exports.build/Script-F8AEB3414F864747B2E96058.sh make: Nothing to be done for `all'.

Hide Details

=== BUILD TARGET lldb-argdumper OF PROJECT lldb WITH CONFIGURATION Release ===

Hide Details

Check dependencies

Hide Details

PhaseScriptExecution CMake\ PostBuild\ Rules /Users/buildslave/jenkins/workspace/lldb-cmake-standalone/lldb-xcode-build/tools/argdumper/lldb.build/Release/lldb-argdumper.build/Script-28AA913228344D98BD0FF712.sh cd /Users/buildslave/jenkins/workspace/lldb-cmake-standalone/llvm-project/lldb /bin/sh -c /Users/buildslave/jenkins/workspace/lldb-cmake-standalone/lldb-xcode-build/tools/argdumper/lldb.build/Release/lldb-argdumper.build/Script-28AA913228344D98BD0FF712.sh echo "Copy lldb-argdumper to /Users/buildslave/jenkins/workspace/lldb-cmake-standalone/lldb-xcode-build/Release/bin/LLDB.framework/Versions/A/Resources/\$<TARGET_FILE_NAME:lldb-argdumper>" Copy lldb-argdumper to /Users/buildslave/jenkins/workspace/lldb-cmake-standalone/lldb-xcode-build/Release/bin/LLDB.framework/Versions/A/Resources/$<TARGET_FILE_NAME:lldb-argdumper> /usr/local/Cellar/cmake/3.17.2/bin/cmake -E copy /Users/buildslave/jenkins/workspace/lldb-cmake-standalone/lldb-xcode-build/Release/bin/lldb-argdumper /Users/buildslave/jenkins/workspace/lldb-cmake-standalone/lldb-xcode-build/Release/bin/LLDB.framework/Versions/A/Resources/lldb-argdumper

Hide Details

=== BUILD TARGET liblldb OF PROJECT lldb WITH CONFIGURATION Release ===

Hide Details

Check dependencies

Hide Details

PhaseScriptExecution CMake\ PostBuild\ Rules /Users/buildslave/jenkins/workspace/lldb-cmake-standalone/lldb-xcode-build/source/API/lldb.build/Release/liblldb.build/Script-91801E35DF474949905764B8.sh cd /Users/buildslave/jenkins/workspace/lldb-cmake-standalone/llvm-project/lldb /bin/sh -c /Users/buildslave/jenkins/workspace/lldb-cmake-standalone/lldb-xcode-build/source/API/lldb.build/Release/liblldb.build/Script-91801E35DF474949905764B8.sh echo "LLDB.framework: create Headers symlink" LLDB.framework: create Headers symlink /usr/local/Cellar/cmake/3.17.2/bin/cmake -E create_symlink Versions/Current/Headers /Users/buildslave/jenkins/workspace/lldb-cmake-standalone/lldb-xcode-build/Release/bin/LLDB.framework/Headers echo "LLDB.framework: copy framework headers" LLDB.framework: copy framework headers /usr/local/Cellar/cmake/3.17.2/bin/cmake -E copy_directory /Users/buildslave/jenkins/workspace/lldb-cmake-standalone/lldb-xcode-build/source/API/FrameworkHeaders /Users/buildslave/jenkins/workspace/lldb-cmake-standalone/lldb-xcode-build/Release/bin/LLDB.framework/Versions/A/Headers /Users/buildslave/jenkins/workspace/lldb-cmake-standalone/llvm-project/lldb/scripts/framework-header-fix.sh /Users/buildslave/jenkins/workspace/lldb-cmake-standalone/lldb-xcode-build/Release/bin/LLDB.framework/Versions/A/Headers 14.0.0git echo "LLDB.framework: copy clang vendor-specific headers" LLDB.framework: copy clang vendor-specific headers /usr/local/Cellar/cmake/3.17.2/bin/cmake -E copy_directory /Users/buildslave/jenkins/workspace/lldb-cmake-standalone/clang-build/lib/cmake/clang/../../clang/14.0.0/include /Users/buildslave/jenkins/workspace/lldb-cmake-standalone/lldb-xcode-build/Release/bin/LLDB.framework/Versions/A/Resources/Clang/include

Hide Details

=== BUILD AGGREGATE TARGET lldb-python OF PROJECT lldb WITH CONFIGURATION Release ===

Hide Details

Check dependencies

Hide Details

PhaseScriptExecution CMake\ Rules /Users/buildslave/jenkins/workspace/lldb-cmake-standalone/lldb-xcode-build/lldb.build/Release/lldb-python.build/Script-975174B599A94FE29E54994D.sh cd /Users/buildslave/jenkins/workspace/lldb-cmake-standalone/llvm-project/lldb /bin/sh -c /Users/buildslave/jenkins/workspace/lldb-cmake-standalone/lldb-xcode-build/lldb.build/Release/lldb-python.build/Script-975174B599A94FE29E54994D.sh echo "Python script sym-linking LLDB Python API" Python script sym-linking LLDB Python API /usr/local/Cellar/cmake/3.17.2/bin/cmake -E make_directory /Users/buildslave/jenkins/workspace/lldb-cmake-standalone/lldb-xcode-build/Release/bin/LLDB.framework/Resources/Python/lldb

Hide Details

PhaseScriptExecution CMake\ PostBuild\ Rules /Users/buildslave/jenkins/workspace/lldb-cmake-standalone/lldb-xcode-build/lldb.build/Release/lldb-python.build/Script-9EA23DDE7A574A46A2834B37.sh cd /Users/buildslave/jenkins/workspace/lldb-cmake-standalone/llvm-project/lldb /bin/sh -c /Users/buildslave/jenkins/workspace/lldb-cmake-standalone/lldb-xcode-build/lldb.build/Release/lldb-python.build/Script-9EA23DDE7A574A46A2834B37.sh /usr/local/Cellar/cmake/3.17.2/bin/cmake -E copy /Users/buildslave/jenkins/workspace/lldb-cmake-standalone/llvm-project/lldb/third_party/Python/module/six/six.py /Users/buildslave/jenkins/workspace/lldb-cmake-standalone/lldb-xcode-build/Release/bin/LLDB.framework/Resources/Python/lldb/../six.py /usr/local/Cellar/cmake/3.17.2/bin/cmake -E copy /Users/buildslave/jenkins/workspace/lldb-cmake-standalone/lldb-xcode-build/bindings/python/lldb.py /Users/buildslave/jenkins/workspace/lldb-cmake-standalone/lldb-xcode-build/Release/bin/LLDB.framework/Resources/Python/lldb/__init__.py /usr/local/Cellar/cmake/3.17.2/bin/cmake -E copy /Users/buildslave/jenkins/workspace/lldb-cmake-standalone/llvm-project/lldb/source/Interpreter/embedded_interpreter.py /Users/buildslave/jenkins/workspace/lldb-cmake-standalone/lldb-xcode-build/Release/bin/LLDB.framework/Resources/Python/lldb cd /Users/buildslave/jenkins/workspace/lldb-cmake-standalone/lldb-xcode-build/Release/bin/LLDB.framework/Resources/Python/lldb && /usr/local/Cellar/cmake/3.17.2/bin/cmake -E make_directory formatters/cpp cd /Users/buildslave/jenkins/workspace/lldb-cmake-standalone/lldb-xcode-build/Release/bin/LLDB.framework/Resources/Python/lldb && /usr/local/Cellar/cmake/3.17.2/bin/cmake -E copy /Users/buildslave/jenkins/workspace/lldb-cmake-standalone/llvm-project/lldb/examples/synthetic/gnu_libstdcpp.py /Users/buildslave/jenkins/workspace/lldb-cmake-standalone/llvm-project/lldb/examples/synthetic/libcxx.py formatters/cpp cd /Users/buildslave/jenkins/workspace/lldb-cmake-standalone/lldb-xcode-build/Release/bin/LLDB.framework/Resources/Python/lldb && /usr/local/Frameworks/Python.framework/Versions/3.7/bin/python3.7 /Users/buildslave/jenkins/workspace/lldb-cmake-standalone/llvm-project/lldb/bindings/python/createPythonInit.py formatters/cpp /Users/buildslave/jenkins/workspace/lldb-cmake-standalone/llvm-project/lldb/examples/synthetic/gnu_libstdcpp.py /Users/buildslave/jenkins/workspace/lldb-cmake-standalone/llvm-project/lldb/examples/synthetic/libcxx.py cd /Users/buildslave/jenkins/workspace/lldb-cmake-standalone/lldb-xcode-build/Release/bin/LLDB.framework/Resources/Python/lldb && /usr/local/Cellar/cmake/3.17.2/bin/cmake -E make_directory formatters cd /Users/buildslave/jenkins/workspace/lldb-cmake-standalone/lldb-xcode-build/Release/bin/LLDB.framework/Resources/Python/lldb && /usr/local/Cellar/cmake/3.17.2/bin/cmake -E copy /Users/buildslave/jenkins/workspace/lldb-cmake-standalone/llvm-project/lldb/examples/summaries/cocoa/cache.py /Users/buildslave/jenkins/workspace/lldb-cmake-standalone/llvm-project/lldb/examples/summaries/synth.py /Users/buildslave/jenkins/workspace/lldb-cmake-standalone/llvm-project/lldb/examples/summaries/cocoa/metrics.py /Users/buildslave/jenkins/workspace/lldb-cmake-standalone/llvm-project/lldb/examples/summaries/cocoa/attrib_fromdict.py /Users/buildslave/jenkins/workspace/lldb-cmake-standalone/llvm-project/lldb/examples/summaries/cocoa/Logger.py formatters cd /Users/buildslave/jenkins/workspace/lldb-cmake-standalone/lldb-xcode-build/Release/bin/LLDB.framework/Resources/Python/lldb && /usr/local/Frameworks/Python.framework/Versions/3.7/bin/python3.7 /Users/buildslave/jenkins/workspace/lldb-cmake-standalone/llvm-project/lldb/bindings/python/createPythonInit.py formatters /Users/buildslave/jenkins/workspace/lldb-cmake-standalone/llvm-project/lldb/examples/summaries/cocoa/cache.py /Users/buildslave/jenkins/workspace/lldb-cmake-standalone/llvm-project/lldb/examples/summaries/synth.py /Users/buildslave/jenkins/workspace/lldb-cmake-standalone/llvm-project/lldb/examples/summaries/cocoa/metrics.py /Users/buildslave/jenkins/workspace/lldb-cmake-standalone/llvm-project/lldb/examples/summaries/cocoa/attrib_fromdict.py /Users/buildslave/jenkins/workspace/lldb-cmake-standalone/llvm-project/lldb/examples/summaries/cocoa/Logger.py cd /Users/buildslave/jenkins/workspace/lldb-cmake-standalone/lldb-xcode-build/Release/bin/LLDB.framework/Resources/Python/lldb && /usr/local/Cellar/cmake/3.17.2/bin/cmake -E make_directory utils cd /Users/buildslave/jenkins/workspace/lldb-cmake-standalone/lldb-xcode-build/Release/bin/LLDB.framework/Resources/Python/lldb && /usr/local/Cellar/cmake/3.17.2/bin/cmake -E copy /Users/buildslave/jenkins/workspace/lldb-cmake-standalone/llvm-project/lldb/examples/python/in_call_stack.py /Users/buildslave/jenkins/workspace/lldb-cmake-standalone/llvm-project/lldb/examples/python/symbolication.py utils cd /Users/buildslave/jenkins/workspace/lldb-cmake-standalone/lldb-xcode-build/Release/bin/LLDB.framework/Resources/Python/lldb && /usr/local/Frameworks/Python.framework/Versions/3.7/bin/python3.7 /Users/buildslave/jenkins/workspace/lldb-cmake-standalone/llvm-project/lldb/bindings/python/createPythonInit.py utils /Users/buildslave/jenkins/workspace/lldb-cmake-standalone/llvm-project/lldb/examples/python/in_call_stack.py /Users/buildslave/jenkins/workspace/lldb-cmake-standalone/llvm-project/lldb/examples/python/symbolication.py cd /Users/buildslave/jenkins/workspace/lldb-cmake-standalone/lldb-xcode-build/Release/bin/LLDB.framework/Resources/Python/lldb && /usr/local/Cellar/cmake/3.17.2/bin/cmake -E make_directory plugins cd /Users/buildslave/jenkins/workspace/lldb-cmake-standalone/lldb-xcode-build/Release/bin/LLDB.framework/Resources/Python/lldb && /usr/local/Cellar/cmake/3.17.2/bin/cmake -E copy /Users/buildslave/jenkins/workspace/lldb-cmake-standalone/llvm-project/lldb/examples/python/scripted_process/scripted_process.py plugins cd /Users/buildslave/jenkins/workspace/lldb-cmake-standalone/lldb-xcode-build/Release/bin/LLDB.framework/Resources/Python/lldb && /usr/local/Frameworks/Python.framework/Versions/3.7/bin/python3.7 /Users/buildslave/jenkins/workspace/lldb-cmake-standalone/llvm-project/lldb/bindings/python/createPythonInit.py plugins /Users/buildslave/jenkins/workspace/lldb-cmake-standalone/llvm-project/lldb/examples/python/scripted_process/scripted_process.py cd /Users/buildslave/jenkins/workspace/lldb-cmake-standalone/lldb-xcode-build/Release/bin/LLDB.framework/Resources/Python/lldb && /usr/local/Cellar/cmake/3.17.2/bin/cmake -E make_directory macosx cd /Users/buildslave/jenkins/workspace/lldb-cmake-standalone/lldb-xcode-build/Release/bin/LLDB.framework/Resources/Python/lldb && /usr/local/Cellar/cmake/3.17.2/bin/cmake -E copy /Users/buildslave/jenkins/workspace/lldb-cmake-standalone/llvm-project/lldb/examples/python/crashlog.py /Users/buildslave/jenkins/workspace/lldb-cmake-standalone/llvm-project/lldb/examples/darwin/heap_find/heap.py macosx cd /Users/buildslave/jenkins/workspace/lldb-cmake-standalone/lldb-xcode-build/Release/bin/LLDB.framework/Resources/Python/lldb && /usr/local/Frameworks/Python.framework/Versions/3.7/bin/python3.7 /Users/buildslave/jenkins/workspace/lldb-cmake-standalone/llvm-project/lldb/bindings/python/createPythonInit.py macosx /Users/buildslave/jenkins/workspace/lldb-cmake-standalone/llvm-project/lldb/examples/python/crashlog.py /Users/buildslave/jenkins/workspace/lldb-cmake-standalone/llvm-project/lldb/examples/darwin/heap_find/heap.py cd /Users/buildslave/jenkins/workspace/lldb-cmake-standalone/lldb-xcode-build/Release/bin/LLDB.framework/Resources/Python/lldb && /usr/local/Cellar/cmake/3.17.2/bin/cmake -E make_directory macosx/heap cd /Users/buildslave/jenkins/workspace/lldb-cmake-standalone/lldb-xcode-build/Release/bin/LLDB.framework/Resources/Python/lldb && /usr/local/Cellar/cmake/3.17.2/bin/cmake -E copy /Users/buildslave/jenkins/workspace/lldb-cmake-standalone/llvm-project/lldb/examples/darwin/heap_find/heap/heap_find.cpp /Users/buildslave/jenkins/workspace/lldb-cmake-standalone/llvm-project/lldb/examples/darwin/heap_find/heap/Makefile macosx/heap cd /Users/buildslave/jenkins/workspace/lldb-cmake-standalone/lldb-xcode-build/Release/bin/LLDB.framework/Resources/Python/lldb && /usr/local/Cellar/cmake/3.17.2/bin/cmake -E make_directory diagnose cd /Users/buildslave/jenkins/workspace/lldb-cmake-standalone/lldb-xcode-build/Release/bin/LLDB.framework/Resources/Python/lldb && /usr/local/Cellar/cmake/3.17.2/bin/cmake -E copy /Users/buildslave/jenkins/workspace/lldb-cmake-standalone/llvm-project/lldb/examples/python/diagnose_unwind.py /Users/buildslave/jenkins/workspace/lldb-cmake-standalone/llvm-project/lldb/examples/python/diagnose_nsstring.py diagnose cd /Users/buildslave/jenkins/workspace/lldb-cmake-standalone/lldb-xcode-build/Release/bin/LLDB.framework/Resources/Python/lldb && /usr/local/Frameworks/Python.framework/Versions/3.7/bin/python3.7 /Users/buildslave/jenkins/workspace/lldb-cmake-standalone/llvm-project/lldb/bindings/python/createPythonInit.py diagnose /Users/buildslave/jenkins/workspace/lldb-cmake-standalone/llvm-project/lldb/examples/python/diagnose_unwind.py /Users/buildslave/jenkins/workspace/lldb-cmake-standalone/llvm-project/lldb/examples/python/diagnose_nsstring.py cd /Users/buildslave/jenkins/workspace/lldb-cmake-standalone/lldb-xcode-build/Release/bin/LLDB.framework/Resources/Python/lldb && /usr/local/Cellar/cmake/3.17.2/bin/cmake -E create_symlink ../../../LLDB _lldb.so

Hide Details

=== BUILD AGGREGATE TARGET LLDBOptionsTableGen OF PROJECT lldb WITH CONFIGURATION Release ===

Hide Details

Check dependencies

Hide Details

PhaseScriptExecution CMake\ Rules /Users/buildslave/jenkins/workspace/lldb-cmake-standalone/lldb-xcode-build/tools/driver/lldb.build/Release/LLDBOptionsTableGen.build/Script-ABFD42C5DC3E463AB905D840.sh cd /Users/buildslave/jenkins/workspace/lldb-cmake-standalone/llvm-project/lldb /bin/sh -c /Users/buildslave/jenkins/workspace/lldb-cmake-standalone/lldb-xcode-build/tools/driver/lldb.build/Release/LLDBOptionsTableGen.build/Script-ABFD42C5DC3E463AB905D840.sh echo "Building Options.inc..." Building Options.inc... /Users/buildslave/jenkins/workspace/lldb-cmake-standalone/clang-build/bin/llvm-tblgen -gen-opt-parser-defs -I /Users/buildslave/jenkins/workspace/lldb-cmake-standalone/llvm-project/lldb/tools/driver -I/Users/buildslave/jenkins/workspace/lldb-cmake-standalone/llvm-project/lldb/include -I/Users/buildslave/jenkins/workspace/lldb-cmake-standalone/lldb-xcode-build/include -I/Users/buildslave/jenkins/workspace/lldb-cmake-standalone/lldb-xcode-build/include -I/Users/buildslave/jenkins/workspace/lldb-cmake-standalone/llvm-project/llvm/include -I/Users/buildslave/jenkins/workspace/lldb-cmake-standalone/clang-build/include -I/Users/buildslave/jenkins/workspace/lldb-cmake-standalone/llvm-project/clang/include -I/Users/buildslave/jenkins/workspace/lldb-cmake-standalone/clang-build/tools/clang/include -I/usr/local/Cellar/python/3.7.0/Frameworks/Python.framework/Versions/3.7/include/python3.7m -I/Users/buildslave/jenkins/workspace/lldb-cmake-standalone/llvm-project/lldb/tools/clang/include -I/Users/buildslave/jenkins/workspace/lldb-cmake-standalone/lldb-xcode-build/../clang/include -I/usr/local/include -I/Applications/Xcode.app/Contents/Developer/Platforms/MacOSX.platform/Developer/SDKs/MacOSX10.15.sdk/usr/include/libxml2 -I/Applications/Xcode.app/Contents/Developer/Platforms/MacOSX.platform/Developer/SDKs/MacOSX10.15.sdk/usr/include/libxml2 /Users/buildslave/jenkins/workspace/lldb-cmake-standalone/llvm-project/lldb/tools/driver/Options.td --write-if-changed -o /Users/buildslave/jenkins/workspace/lldb-cmake-standalone/lldb-xcode-build/tools/driver/Options.inc

Hide Details

=== BUILD TARGET lldb OF PROJECT lldb WITH CONFIGURATION Release ===

Hide Details

Check dependencies

Hide Details

=== BUILD TARGET lldb-test OF PROJECT lldb WITH CONFIGURATION Release ===

Hide Details

Check dependencies

Hide Details

=== BUILD TARGET lldb-instr OF PROJECT lldb WITH CONFIGURATION Release ===

Hide Details

Check dependencies

Hide Details

=== BUILD AGGREGATE TARGET LLDBVSCodeOptionsTableGen OF PROJECT lldb WITH CONFIGURATION Release ===

Hide Details

Check dependencies

Hide Details

PhaseScriptExecution CMake\ Rules /Users/buildslave/jenkins/workspace/lldb-cmake-standalone/lldb-xcode-build/tools/lldb-vscode/lldb.build/Release/LLDBVSCodeOptionsTableGen.build/Script-330F483EDD044C2D87878F31.sh cd /Users/buildslave/jenkins/workspace/lldb-cmake-standalone/llvm-project/lldb /bin/sh -c /Users/buildslave/jenkins/workspace/lldb-cmake-standalone/lldb-xcode-build/tools/lldb-vscode/lldb.build/Release/LLDBVSCodeOptionsTableGen.build/Script-330F483EDD044C2D87878F31.sh echo "Building Options.inc..." Building Options.inc... /Users/buildslave/jenkins/workspace/lldb-cmake-standalone/clang-build/bin/llvm-tblgen -gen-opt-parser-defs -I /Users/buildslave/jenkins/workspace/lldb-cmake-standalone/llvm-project/lldb/tools/lldb-vscode -I/Users/buildslave/jenkins/workspace/lldb-cmake-standalone/llvm-project/lldb/include -I/Users/buildslave/jenkins/workspace/lldb-cmake-standalone/lldb-xcode-build/include -I/Users/buildslave/jenkins/workspace/lldb-cmake-standalone/lldb-xcode-build/include -I/Users/buildslave/jenkins/workspace/lldb-cmake-standalone/llvm-project/llvm/include -I/Users/buildslave/jenkins/workspace/lldb-cmake-standalone/clang-build/include -I/Users/buildslave/jenkins/workspace/lldb-cmake-standalone/llvm-project/clang/include -I/Users/buildslave/jenkins/workspace/lldb-cmake-standalone/clang-build/tools/clang/include -I/usr/local/Cellar/python/3.7.0/Frameworks/Python.framework/Versions/3.7/include/python3.7m -I/Users/buildslave/jenkins/workspace/lldb-cmake-standalone/llvm-project/lldb/tools/clang/include -I/Users/buildslave/jenkins/workspace/lldb-cmake-standalone/lldb-xcode-build/../clang/include -I/usr/local/include -I/Applications/Xcode.app/Contents/Developer/Platforms/MacOSX.platform/Developer/SDKs/MacOSX10.15.sdk/usr/include/libxml2 -I/Applications/Xcode.app/Contents/Developer/Platforms/MacOSX.platform/Developer/SDKs/MacOSX10.15.sdk/usr/include/libxml2 /Users/buildslave/jenkins/workspace/lldb-cmake-standalone/llvm-project/lldb/tools/lldb-vscode/Options.td --write-if-changed -o /Users/buildslave/jenkins/workspace/lldb-cmake-standalone/lldb-xcode-build/tools/lldb-vscode/Options.inc

Hide Details

=== BUILD TARGET lldb-vscode OF PROJECT lldb WITH CONFIGURATION Release ===

Hide Details

Check dependencies

Hide Details

=== BUILD TARGET darwin-debug OF PROJECT lldb WITH CONFIGURATION Release ===

Hide Details

Check dependencies

Hide Details

PhaseScriptExecution CMake\ PostBuild\ Rules /Users/buildslave/jenkins/workspace/lldb-cmake-standalone/lldb-xcode-build/tools/darwin-debug/lldb.build/Release/darwin-debug.build/Script-1353178634C941E4A67EBEC7.sh cd /Users/buildslave/jenkins/workspace/lldb-cmake-standalone/llvm-project/lldb /bin/sh -c /Users/buildslave/jenkins/workspace/lldb-cmake-standalone/lldb-xcode-build/tools/darwin-debug/lldb.build/Release/darwin-debug.build/Script-1353178634C941E4A67EBEC7.sh echo "Copy darwin-debug to /Users/buildslave/jenkins/workspace/lldb-cmake-standalone/lldb-xcode-build/Release/bin/LLDB.framework/Versions/A/Resources/\$<TARGET_FILE_NAME:darwin-debug>" Copy darwin-debug to /Users/buildslave/jenkins/workspace/lldb-cmake-standalone/lldb-xcode-build/Release/bin/LLDB.framework/Versions/A/Resources/$<TARGET_FILE_NAME:darwin-debug> /usr/local/Cellar/cmake/3.17.2/bin/cmake -E copy /Users/buildslave/jenkins/workspace/lldb-cmake-standalone/lldb-xcode-build/Release/bin/darwin-debug /Users/buildslave/jenkins/workspace/lldb-cmake-standalone/lldb-xcode-build/Release/bin/LLDB.framework/Versions/A/Resources/darwin-debug

Hide Details

=== BUILD TARGET lldbDebugserverCommon OF PROJECT lldb WITH CONFIGURATION Release ===

Hide Details

Check dependencies

Hide Details

PhaseScriptExecution CMake\ Rules /Users/buildslave/jenkins/workspace/lldb-cmake-standalone/lldb-xcode-build/tools/debugserver/source/lldb.build/Release/lldbDebugserverCommon.build/Script-5514A8748591415F9D044477.sh cd /Users/buildslave/jenkins/workspace/lldb-cmake-standalone/llvm-project/lldb /bin/sh -c /Users/buildslave/jenkins/workspace/lldb-cmake-standalone/lldb-xcode-build/tools/debugserver/source/lldb.build/Release/lldbDebugserverCommon.build/Script-5514A8748591415F9D044477.sh make: Nothing to be done for `all'.

Hide Details

=== BUILD TARGET lldbDebugserverArchSupport OF PROJECT lldb WITH CONFIGURATION Release ===

Hide Details

Check dependencies

Hide Details

=== BUILD TARGET debugserver OF PROJECT lldb WITH CONFIGURATION Release ===

Hide Details

Check dependencies

Hide Details

PhaseScriptExecution CMake\ PostBuild\ Rules /Users/buildslave/jenkins/workspace/lldb-cmake-standalone/lldb-xcode-build/tools/debugserver/source/lldb.build/Release/debugserver.build/Script-4440F4C403534290AC1F37CE.sh cd /Users/buildslave/jenkins/workspace/lldb-cmake-standalone/llvm-project/lldb /bin/sh -c /Users/buildslave/jenkins/workspace/lldb-cmake-standalone/lldb-xcode-build/tools/debugserver/source/lldb.build/Release/debugserver.build/Script-4440F4C403534290AC1F37CE.sh echo "Copy debugserver to /Users/buildslave/jenkins/workspace/lldb-cmake-standalone/lldb-xcode-build/Release/bin/LLDB.framework/Versions/A/Resources/\$<TARGET_FILE_NAME:debugserver>" Copy debugserver to /Users/buildslave/jenkins/workspace/lldb-cmake-standalone/lldb-xcode-build/Release/bin/LLDB.framework/Versions/A/Resources/$<TARGET_FILE_NAME:debugserver> /usr/local/Cellar/cmake/3.17.2/bin/cmake -E copy /Users/buildslave/jenkins/workspace/lldb-cmake-standalone/lldb-xcode-build/Release/bin/debugserver /Users/buildslave/jenkins/workspace/lldb-cmake-standalone/lldb-xcode-build/Release/bin/LLDB.framework/Versions/A/Resources/debugserver echo "Code-sign debugserver copy in the build-tree framework: /Users/buildslave/jenkins/workspace/lldb-cmake-standalone/lldb-xcode-build/Release/bin/LLDB.framework/Versions/A/Resources/debugserver" Code-sign debugserver copy in the build-tree framework: /Users/buildslave/jenkins/workspace/lldb-cmake-standalone/lldb-xcode-build/Release/bin/LLDB.framework/Versions/A/Resources/debugserver /usr/local/Cellar/cmake/3.17.2/bin/cmake -E env CODESIGN_ALLOCATE=/Applications/Xcode.app/Contents/Developer/Toolchains/XcodeDefault.xctoolchain/usr/bin/codesign_allocate xcrun codesign -f -s lldb_codesign --entitlements /Users/buildslave/jenkins/workspace/lldb-cmake-standalone/llvm-project/lldb/tools/debugserver/source/../resources/debugserver-macosx-entitlements.plist /Users/buildslave/jenkins/workspace/lldb-cmake-standalone/lldb-xcode-build/Release/bin/LLDB.framework/Versions/A/Resources/debugserver /Users/buildslave/jenkins/workspace/lldb-cmake-standalone/lldb-xcode-build/Release/bin/LLDB.framework/Versions/A/Resources/debugserver: replacing existing signature

Hide Details

=== BUILD AGGREGATE TARGET LLGSOptionsTableGen OF PROJECT lldb WITH CONFIGURATION Release ===

Hide Details

Check dependencies

Hide Details

PhaseScriptExecution CMake\ Rules /Users/buildslave/jenkins/workspace/lldb-cmake-standalone/lldb-xcode-build/tools/lldb-server/lldb.build/Release/LLGSOptionsTableGen.build/Script-65BDE49F6274429D9D9F553B.sh cd /Users/buildslave/jenkins/workspace/lldb-cmake-standalone/llvm-project/lldb /bin/sh -c /Users/buildslave/jenkins/workspace/lldb-cmake-standalone/lldb-xcode-build/tools/lldb-server/lldb.build/Release/LLGSOptionsTableGen.build/Script-65BDE49F6274429D9D9F553B.sh echo "Building LLGSOptions.inc..." Building LLGSOptions.inc... /Users/buildslave/jenkins/workspace/lldb-cmake-standalone/clang-build/bin/llvm-tblgen -gen-opt-parser-defs -I /Users/buildslave/jenkins/workspace/lldb-cmake-standalone/llvm-project/lldb/tools/lldb-server -I/Users/buildslave/jenkins/workspace/lldb-cmake-standalone/llvm-project/lldb/include -I/Users/buildslave/jenkins/workspace/lldb-cmake-standalone/lldb-xcode-build/include -I/Users/buildslave/jenkins/workspace/lldb-cmake-standalone/lldb-xcode-build/include -I/Users/buildslave/jenkins/workspace/lldb-cmake-standalone/llvm-project/llvm/include -I/Users/buildslave/jenkins/workspace/lldb-cmake-standalone/clang-build/include -I/Users/buildslave/jenkins/workspace/lldb-cmake-standalone/llvm-project/clang/include -I/Users/buildslave/jenkins/workspace/lldb-cmake-standalone/clang-build/tools/clang/include -I/usr/local/Cellar/python/3.7.0/Frameworks/Python.framework/Versions/3.7/include/python3.7m -I/Users/buildslave/jenkins/workspace/lldb-cmake-standalone/llvm-project/lldb/tools/clang/include -I/Users/buildslave/jenkins/workspace/lldb-cmake-standalone/lldb-xcode-build/../clang/include -I/usr/local/include -I/Applications/Xcode.app/Contents/Developer/Platforms/MacOSX.platform/Developer/SDKs/MacOSX10.15.sdk/usr/include/libxml2 -I/Applications/Xcode.app/Contents/Developer/Platforms/MacOSX.platform/Developer/SDKs/MacOSX10.15.sdk/usr/include/libxml2 /Users/buildslave/jenkins/workspace/lldb-cmake-standalone/llvm-project/lldb/tools/lldb-server/LLGSOptions.td --write-if-changed -o /Users/buildslave/jenkins/workspace/lldb-cmake-standalone/lldb-xcode-build/tools/lldb-server/LLGSOptions.inc

Hide Details

=== BUILD TARGET lldb-server OF PROJECT lldb WITH CONFIGURATION Release ===

Hide Details

Check dependencies

Hide Details

=== BUILD TARGET lit-cpuid OF PROJECT lldb WITH CONFIGURATION Release ===

Hide Details

Check dependencies

Hide Details

=== BUILD AGGREGATE TARGET lldb-test-depends OF PROJECT lldb WITH CONFIGURATION Release ===

Hide Details

Check dependencies

Hide Details

=== BUILD AGGREGATE TARGET lldb-api-test-deps OF PROJECT lldb WITH CONFIGURATION Release ===

Hide Details

Check dependencies

Hide Details

=== BUILD AGGREGATE TARGET lldb-shell-test-deps OF PROJECT lldb WITH CONFIGURATION Release ===

Hide Details

Check dependencies

Hide Details

=== BUILD TARGET APITests OF PROJECT lldb WITH CONFIGURATION Release ===

Hide Details

Check dependencies

Hide Details

Write auxiliary files write-file /Users/buildslave/jenkins/workspace/lldb-cmake-standalone/lldb-xcode-build/unittests/API/lldb.build/Release/APITests.build/Script-48997EC9CE76463783AB3CC3.sh chmod 0755 /Users/buildslave/jenkins/workspace/lldb-cmake-standalone/lldb-xcode-build/unittests/API/lldb.build/Release/APITests.build/Script-48997EC9CE76463783AB3CC3.sh

Hide Details

PhaseScriptExecution CMake\ PostBuild\ Rules /Users/buildslave/jenkins/workspace/lldb-cmake-standalone/lldb-xcode-build/unittests/API/lldb.build/Release/APITests.build/Script-48997EC9CE76463783AB3CC3.sh cd /Users/buildslave/jenkins/workspace/lldb-cmake-standalone/llvm-project/lldb /bin/sh -c /Users/buildslave/jenkins/workspace/lldb-cmake-standalone/lldb-xcode-build/unittests/API/lldb.build/Release/APITests.build/Script-48997EC9CE76463783AB3CC3.sh /usr/local/Cellar/cmake/3.17.2/bin/cmake -E make_directory /Users/buildslave/jenkins/workspace/lldb-cmake-standalone/lldb-xcode-build/unittests/API/Release/Inputs

Hide Details

=== BUILD TARGET LLDBBreakpointTests OF PROJECT lldb WITH CONFIGURATION Release ===

Hide Details

Check dependencies

Hide Details

Write auxiliary files write-file /Users/buildslave/jenkins/workspace/lldb-cmake-standalone/lldb-xcode-build/unittests/Breakpoint/lldb.build/Release/LLDBBreakpointTests.build/Script-2B54AE3901EE4984B64409F6.sh chmod 0755 /Users/buildslave/jenkins/workspace/lldb-cmake-standalone/lldb-xcode-build/unittests/Breakpoint/lldb.build/Release/LLDBBreakpointTests.build/Script-2B54AE3901EE4984B64409F6.sh

Hide Details

PhaseScriptExecution CMake\ PostBuild\ Rules /Users/buildslave/jenkins/workspace/lldb-cmake-standalone/lldb-xcode-build/unittests/Breakpoint/lldb.build/Release/LLDBBreakpointTests.build/Script-2B54AE3901EE4984B64409F6.sh cd /Users/buildslave/jenkins/workspace/lldb-cmake-standalone/llvm-project/lldb /bin/sh -c /Users/buildslave/jenkins/workspace/lldb-cmake-standalone/lldb-xcode-build/unittests/Breakpoint/lldb.build/Release/LLDBBreakpointTests.build/Script-2B54AE3901EE4984B64409F6.sh /usr/local/Cellar/cmake/3.17.2/bin/cmake -E make_directory /Users/buildslave/jenkins/workspace/lldb-cmake-standalone/lldb-xcode-build/unittests/Breakpoint/Release/Inputs

Hide Details

=== BUILD TARGET lldbUtilityHelpers OF PROJECT lldb WITH CONFIGURATION Release ===

Hide Details

Check dependencies

Hide Details

=== BUILD TARGET LLDBCoreTests OF PROJECT lldb WITH CONFIGURATION Release ===

Hide Details

Check dependencies

Hide Details

Write auxiliary files write-file /Users/buildslave/jenkins/workspace/lldb-cmake-standalone/lldb-xcode-build/unittests/Core/lldb.build/Release/LLDBCoreTests.build/Script-81F5A738BB834DB39A08C01E.sh chmod 0755 /Users/buildslave/jenkins/workspace/lldb-cmake-standalone/lldb-xcode-build/unittests/Core/lldb.build/Release/LLDBCoreTests.build/Script-81F5A738BB834DB39A08C01E.sh

Hide Details

PhaseScriptExecution CMake\ PostBuild\ Rules /Users/buildslave/jenkins/workspace/lldb-cmake-standalone/lldb-xcode-build/unittests/Core/lldb.build/Release/LLDBCoreTests.build/Script-81F5A738BB834DB39A08C01E.sh cd /Users/buildslave/jenkins/workspace/lldb-cmake-standalone/llvm-project/lldb /bin/sh -c /Users/buildslave/jenkins/workspace/lldb-cmake-standalone/lldb-xcode-build/unittests/Core/lldb.build/Release/LLDBCoreTests.build/Script-81F5A738BB834DB39A08C01E.sh /usr/local/Cellar/cmake/3.17.2/bin/cmake -E make_directory /Users/buildslave/jenkins/workspace/lldb-cmake-standalone/lldb-xcode-build/unittests/Core/Release/Inputs

Hide Details

=== BUILD TARGET LLDBFormatterTests OF PROJECT lldb WITH CONFIGURATION Release ===

Hide Details

Check dependencies

Hide Details

Write auxiliary files write-file /Users/buildslave/jenkins/workspace/lldb-cmake-standalone/lldb-xcode-build/unittests/DataFormatter/lldb.build/Release/LLDBFormatterTests.build/Script-9AABA95C56C94FDD9C8B924B.sh chmod 0755 /Users/buildslave/jenkins/workspace/lldb-cmake-standalone/lldb-xcode-build/unittests/DataFormatter/lldb.build/Release/LLDBFormatterTests.build/Script-9AABA95C56C94FDD9C8B924B.sh

Hide Details

PhaseScriptExecution CMake\ PostBuild\ Rules /Users/buildslave/jenkins/workspace/lldb-cmake-standalone/lldb-xcode-build/unittests/DataFormatter/lldb.build/Release/LLDBFormatterTests.build/Script-9AABA95C56C94FDD9C8B924B.sh cd /Users/buildslave/jenkins/workspace/lldb-cmake-standalone/llvm-project/lldb /bin/sh -c /Users/buildslave/jenkins/workspace/lldb-cmake-standalone/lldb-xcode-build/unittests/DataFormatter/lldb.build/Release/LLDBFormatterTests.build/Script-9AABA95C56C94FDD9C8B924B.sh /usr/local/Cellar/cmake/3.17.2/bin/cmake -E make_directory /Users/buildslave/jenkins/workspace/lldb-cmake-standalone/lldb-xcode-build/unittests/DataFormatter/Release/Inputs

Hide Details

=== BUILD TARGET EditlineTests OF PROJECT lldb WITH CONFIGURATION Release ===

Hide Details

Check dependencies

Hide Details

Write auxiliary files write-file /Users/buildslave/jenkins/workspace/lldb-cmake-standalone/lldb-xcode-build/unittests/Editline/lldb.build/Release/EditlineTests.build/Script-854F764145A24D9898A12A1F.sh chmod 0755 /Users/buildslave/jenkins/workspace/lldb-cmake-standalone/lldb-xcode-build/unittests/Editline/lldb.build/Release/EditlineTests.build/Script-854F764145A24D9898A12A1F.sh

Hide Details

PhaseScriptExecution CMake\ PostBuild\ Rules /Users/buildslave/jenkins/workspace/lldb-cmake-standalone/lldb-xcode-build/unittests/Editline/lldb.build/Release/EditlineTests.build/Script-854F764145A24D9898A12A1F.sh cd /Users/buildslave/jenkins/workspace/lldb-cmake-standalone/llvm-project/lldb /bin/sh -c /Users/buildslave/jenkins/workspace/lldb-cmake-standalone/lldb-xcode-build/unittests/Editline/lldb.build/Release/EditlineTests.build/Script-854F764145A24D9898A12A1F.sh /usr/local/Cellar/cmake/3.17.2/bin/cmake -E make_directory /Users/buildslave/jenkins/workspace/lldb-cmake-standalone/lldb-xcode-build/unittests/Editline/Release/Inputs

Hide Details

=== BUILD TARGET lldbSymbolHelpers OF PROJECT lldb WITH CONFIGURATION Release ===

Hide Details

Check dependencies

Hide Details

=== BUILD TARGET ExpressionTests OF PROJECT lldb WITH CONFIGURATION Release ===

Hide Details

Check dependencies

Hide Details

Write auxiliary files write-file /Users/buildslave/jenkins/workspace/lldb-cmake-standalone/lldb-xcode-build/unittests/Expression/lldb.build/Release/ExpressionTests.build/Script-D0FA59E090A24BA9B580045F.sh chmod 0755 /Users/buildslave/jenkins/workspace/lldb-cmake-standalone/lldb-xcode-build/unittests/Expression/lldb.build/Release/ExpressionTests.build/Script-D0FA59E090A24BA9B580045F.sh

Hide Details

PhaseScriptExecution CMake\ PostBuild\ Rules /Users/buildslave/jenkins/workspace/lldb-cmake-standalone/lldb-xcode-build/unittests/Expression/lldb.build/Release/ExpressionTests.build/Script-D0FA59E090A24BA9B580045F.sh cd /Users/buildslave/jenkins/workspace/lldb-cmake-standalone/llvm-project/lldb /bin/sh -c /Users/buildslave/jenkins/workspace/lldb-cmake-standalone/lldb-xcode-build/unittests/Expression/lldb.build/Release/ExpressionTests.build/Script-D0FA59E090A24BA9B580045F.sh /usr/local/Cellar/cmake/3.17.2/bin/cmake -E make_directory /Users/buildslave/jenkins/workspace/lldb-cmake-standalone/lldb-xcode-build/unittests/Expression/Release/Inputs

Hide Details

=== BUILD TARGET HostTests OF PROJECT lldb WITH CONFIGURATION Release ===

Hide Details

Check dependencies

Hide Details

Write auxiliary files write-file /Users/buildslave/jenkins/workspace/lldb-cmake-standalone/lldb-xcode-build/unittests/Host/lldb.build/Release/HostTests.build/Script-1874DA889D0C429AB712B549.sh chmod 0755 /Users/buildslave/jenkins/workspace/lldb-cmake-standalone/lldb-xcode-build/unittests/Host/lldb.build/Release/HostTests.build/Script-1874DA889D0C429AB712B549.sh

Hide Details

PhaseScriptExecution CMake\ PostBuild\ Rules /Users/buildslave/jenkins/workspace/lldb-cmake-standalone/lldb-xcode-build/unittests/Host/lldb.build/Release/HostTests.build/Script-1874DA889D0C429AB712B549.sh cd /Users/buildslave/jenkins/workspace/lldb-cmake-standalone/llvm-project/lldb /bin/sh -c /Users/buildslave/jenkins/workspace/lldb-cmake-standalone/lldb-xcode-build/unittests/Host/lldb.build/Release/HostTests.build/Script-1874DA889D0C429AB712B549.sh /usr/local/Cellar/cmake/3.17.2/bin/cmake -E make_directory /Users/buildslave/jenkins/workspace/lldb-cmake-standalone/lldb-xcode-build/unittests/Host/Release/Inputs

Hide Details

=== BUILD TARGET InterpreterTests OF PROJECT lldb WITH CONFIGURATION Release ===

Hide Details

Check dependencies

Hide Details

Write auxiliary files write-file /Users/buildslave/jenkins/workspace/lldb-cmake-standalone/lldb-xcode-build/unittests/Interpreter/lldb.build/Release/InterpreterTests.build/Script-52843741791C48F2A75F8CF3.sh chmod 0755 /Users/buildslave/jenkins/workspace/lldb-cmake-standalone/lldb-xcode-build/unittests/Interpreter/lldb.build/Release/InterpreterTests.build/Script-52843741791C48F2A75F8CF3.sh

Hide Details

PhaseScriptExecution CMake\ PostBuild\ Rules /Users/buildslave/jenkins/workspace/lldb-cmake-standalone/lldb-xcode-build/unittests/Interpreter/lldb.build/Release/InterpreterTests.build/Script-52843741791C48F2A75F8CF3.sh cd /Users/buildslave/jenkins/workspace/lldb-cmake-standalone/llvm-project/lldb /bin/sh -c /Users/buildslave/jenkins/workspace/lldb-cmake-standalone/lldb-xcode-build/unittests/Interpreter/lldb.build/Release/InterpreterTests.build/Script-52843741791C48F2A75F8CF3.sh /usr/local/Cellar/cmake/3.17.2/bin/cmake -E make_directory /Users/buildslave/jenkins/workspace/lldb-cmake-standalone/lldb-xcode-build/unittests/Interpreter/Release/Inputs

Hide Details

=== BUILD TARGET LanguageCPlusPlusTests OF PROJECT lldb WITH CONFIGURATION Release ===

Hide Details

Check dependencies

Hide Details

Write auxiliary files write-file /Users/buildslave/jenkins/workspace/lldb-cmake-standalone/lldb-xcode-build/unittests/Language/CPlusPlus/lldb.build/Release/LanguageCPlusPlusTests.build/Script-4676880CF99343D98EDF2ED1.sh chmod 0755 /Users/buildslave/jenkins/workspace/lldb-cmake-standalone/lldb-xcode-build/unittests/Language/CPlusPlus/lldb.build/Release/LanguageCPlusPlusTests.build/Script-4676880CF99343D98EDF2ED1.sh

Hide Details

PhaseScriptExecution CMake\ PostBuild\ Rules /Users/buildslave/jenkins/workspace/lldb-cmake-standalone/lldb-xcode-build/unittests/Language/CPlusPlus/lldb.build/Release/LanguageCPlusPlusTests.build/Script-4676880CF99343D98EDF2ED1.sh cd /Users/buildslave/jenkins/workspace/lldb-cmake-standalone/llvm-project/lldb /bin/sh -c /Users/buildslave/jenkins/workspace/lldb-cmake-standalone/lldb-xcode-build/unittests/Language/CPlusPlus/lldb.build/Release/LanguageCPlusPlusTests.build/Script-4676880CF99343D98EDF2ED1.sh /usr/local/Cellar/cmake/3.17.2/bin/cmake -E make_directory /Users/buildslave/jenkins/workspace/lldb-cmake-standalone/lldb-xcode-build/unittests/Language/CPlusPlus/Release/Inputs

Hide Details

=== BUILD TARGET LanguageCLanguagesTests OF PROJECT lldb WITH CONFIGURATION Release ===

Hide Details

Check dependencies

Hide Details

Write auxiliary files write-file /Users/buildslave/jenkins/workspace/lldb-cmake-standalone/lldb-xcode-build/unittests/Language/CLanguages/lldb.build/Release/LanguageCLanguagesTests.build/Script-E2D3C99825704A0EB2D581F2.sh chmod 0755 /Users/buildslave/jenkins/workspace/lldb-cmake-standalone/lldb-xcode-build/unittests/Language/CLanguages/lldb.build/Release/LanguageCLanguagesTests.build/Script-E2D3C99825704A0EB2D581F2.sh

Hide Details

PhaseScriptExecution CMake\ PostBuild\ Rules /Users/buildslave/jenkins/workspace/lldb-cmake-standalone/lldb-xcode-build/unittests/Language/CLanguages/lldb.build/Release/LanguageCLanguagesTests.build/Script-E2D3C99825704A0EB2D581F2.sh cd /Users/buildslave/jenkins/workspace/lldb-cmake-standalone/llvm-project/lldb /bin/sh -c /Users/buildslave/jenkins/workspace/lldb-cmake-standalone/lldb-xcode-build/unittests/Language/CLanguages/lldb.build/Release/LanguageCLanguagesTests.build/Script-E2D3C99825704A0EB2D581F2.sh /usr/local/Cellar/cmake/3.17.2/bin/cmake -E make_directory /Users/buildslave/jenkins/workspace/lldb-cmake-standalone/lldb-xcode-build/unittests/Language/CLanguages/Release/Inputs

Hide Details

=== BUILD TARGET HighlighterTests OF PROJECT lldb WITH CONFIGURATION Release ===

Hide Details

Check dependencies

Hide Details

Write auxiliary files write-file /Users/buildslave/jenkins/workspace/lldb-cmake-standalone/lldb-xcode-build/unittests/Language/Highlighting/lldb.build/Release/HighlighterTests.build/Script-3E2F743259E2486F841D9509.sh chmod 0755 /Users/buildslave/jenkins/workspace/lldb-cmake-standalone/lldb-xcode-build/unittests/Language/Highlighting/lldb.build/Release/HighlighterTests.build/Script-3E2F743259E2486F841D9509.sh

Hide Details

PhaseScriptExecution CMake\ PostBuild\ Rules /Users/buildslave/jenkins/workspace/lldb-cmake-standalone/lldb-xcode-build/unittests/Language/Highlighting/lldb.build/Release/HighlighterTests.build/Script-3E2F743259E2486F841D9509.sh cd /Users/buildslave/jenkins/workspace/lldb-cmake-standalone/llvm-project/lldb /bin/sh -c /Users/buildslave/jenkins/workspace/lldb-cmake-standalone/lldb-xcode-build/unittests/Language/Highlighting/lldb.build/Release/HighlighterTests.build/Script-3E2F743259E2486F841D9509.sh /usr/local/Cellar/cmake/3.17.2/bin/cmake -E make_directory /Users/buildslave/jenkins/workspace/lldb-cmake-standalone/lldb-xcode-build/unittests/Language/Highlighting/Release/Inputs

Hide Details

=== BUILD TARGET ObjectFileBreakpadTests OF PROJECT lldb WITH CONFIGURATION Release ===

Hide Details

Check dependencies

Hide Details

Write auxiliary files write-file /Users/buildslave/jenkins/workspace/lldb-cmake-standalone/lldb-xcode-build/unittests/ObjectFile/Breakpad/lldb.build/Release/ObjectFileBreakpadTests.build/Script-693E289620BD411985807BCD.sh chmod 0755 /Users/buildslave/jenkins/workspace/lldb-cmake-standalone/lldb-xcode-build/unittests/ObjectFile/Breakpad/lldb.build/Release/ObjectFileBreakpadTests.build/Script-693E289620BD411985807BCD.sh

Hide Details

PhaseScriptExecution CMake\ PostBuild\ Rules /Users/buildslave/jenkins/workspace/lldb-cmake-standalone/lldb-xcode-build/unittests/ObjectFile/Breakpad/lldb.build/Release/ObjectFileBreakpadTests.build/Script-693E289620BD411985807BCD.sh cd /Users/buildslave/jenkins/workspace/lldb-cmake-standalone/llvm-project/lldb /bin/sh -c /Users/buildslave/jenkins/workspace/lldb-cmake-standalone/lldb-xcode-build/unittests/ObjectFile/Breakpad/lldb.build/Release/ObjectFileBreakpadTests.build/Script-693E289620BD411985807BCD.sh /usr/local/Cellar/cmake/3.17.2/bin/cmake -E make_directory /Users/buildslave/jenkins/workspace/lldb-cmake-standalone/lldb-xcode-build/unittests/ObjectFile/Breakpad/Release/Inputs

Hide Details

=== BUILD TARGET ObjectFileELFTests OF PROJECT lldb WITH CONFIGURATION Release ===

Hide Details

Check dependencies

Hide Details

Write auxiliary files write-file /Users/buildslave/jenkins/workspace/lldb-cmake-standalone/lldb-xcode-build/unittests/ObjectFile/ELF/lldb.build/Release/ObjectFileELFTests.build/Script-B8C21A4B730C4E248A297588.sh chmod 0755 /Users/buildslave/jenkins/workspace/lldb-cmake-standalone/lldb-xcode-build/unittests/ObjectFile/ELF/lldb.build/Release/ObjectFileELFTests.build/Script-B8C21A4B730C4E248A297588.sh

Hide Details

PhaseScriptExecution CMake\ PostBuild\ Rules /Users/buildslave/jenkins/workspace/lldb-cmake-standalone/lldb-xcode-build/unittests/ObjectFile/ELF/lldb.build/Release/ObjectFileELFTests.build/Script-B8C21A4B730C4E248A297588.sh cd /Users/buildslave/jenkins/workspace/lldb-cmake-standalone/llvm-project/lldb /bin/sh -c /Users/buildslave/jenkins/workspace/lldb-cmake-standalone/lldb-xcode-build/unittests/ObjectFile/ELF/lldb.build/Release/ObjectFileELFTests.build/Script-B8C21A4B730C4E248A297588.sh /usr/local/Cellar/cmake/3.17.2/bin/cmake -E make_directory /Users/buildslave/jenkins/workspace/lldb-cmake-standalone/lldb-xcode-build/unittests/ObjectFile/ELF/Release/Inputs echo "Copying early-section-headers.so to binary directory." Copying early-section-headers.so to binary directory. /usr/local/Cellar/cmake/3.17.2/bin/cmake -E copy /Users/buildslave/jenkins/workspace/lldb-cmake-standalone/llvm-project/lldb/unittests/ObjectFile/ELF/Inputs/early-section-headers.so /Users/buildslave/jenkins/workspace/lldb-cmake-standalone/lldb-xcode-build/unittests/ObjectFile/ELF/Release/Inputs

Hide Details

=== BUILD TARGET ObjectFileMachOTests OF PROJECT lldb WITH CONFIGURATION Release ===

Hide Details

Check dependencies

Hide Details

Write auxiliary files write-file /Users/buildslave/jenkins/workspace/lldb-cmake-standalone/lldb-xcode-build/unittests/ObjectFile/MachO/lldb.build/Release/ObjectFileMachOTests.build/Script-895C192D95F94132B16C9312.sh chmod 0755 /Users/buildslave/jenkins/workspace/lldb-cmake-standalone/lldb-xcode-build/unittests/ObjectFile/MachO/lldb.build/Release/ObjectFileMachOTests.build/Script-895C192D95F94132B16C9312.sh

Hide Details

PhaseScriptExecution CMake\ PostBuild\ Rules /Users/buildslave/jenkins/workspace/lldb-cmake-standalone/lldb-xcode-build/unittests/ObjectFile/MachO/lldb.build/Release/ObjectFileMachOTests.build/Script-895C192D95F94132B16C9312.sh cd /Users/buildslave/jenkins/workspace/lldb-cmake-standalone/llvm-project/lldb /bin/sh -c /Users/buildslave/jenkins/workspace/lldb-cmake-standalone/lldb-xcode-build/unittests/ObjectFile/MachO/lldb.build/Release/ObjectFileMachOTests.build/Script-895C192D95F94132B16C9312.sh /usr/local/Cellar/cmake/3.17.2/bin/cmake -E make_directory /Users/buildslave/jenkins/workspace/lldb-cmake-standalone/lldb-xcode-build/unittests/ObjectFile/MachO/Release/Inputs

Hide Details

=== BUILD TARGET ObjectFilePECOFFTests OF PROJECT lldb WITH CONFIGURATION Release ===

Hide Details

Check dependencies

Hide Details

Write auxiliary files write-file /Users/buildslave/jenkins/workspace/lldb-cmake-standalone/lldb-xcode-build/unittests/ObjectFile/PECOFF/lldb.build/Release/ObjectFilePECOFFTests.build/Script-30ACB491062E404F969BF7D0.sh chmod 0755 /Users/buildslave/jenkins/workspace/lldb-cmake-standalone/lldb-xcode-build/unittests/ObjectFile/PECOFF/lldb.build/Release/ObjectFilePECOFFTests.build/Script-30ACB491062E404F969BF7D0.sh

Hide Details

PhaseScriptExecution CMake\ PostBuild\ Rules /Users/buildslave/jenkins/workspace/lldb-cmake-standalone/lldb-xcode-build/unittests/ObjectFile/PECOFF/lldb.build/Release/ObjectFilePECOFFTests.build/Script-30ACB491062E404F969BF7D0.sh cd /Users/buildslave/jenkins/workspace/lldb-cmake-standalone/llvm-project/lldb /bin/sh -c /Users/buildslave/jenkins/workspace/lldb-cmake-standalone/lldb-xcode-build/unittests/ObjectFile/PECOFF/lldb.build/Release/ObjectFilePECOFFTests.build/Script-30ACB491062E404F969BF7D0.sh /usr/local/Cellar/cmake/3.17.2/bin/cmake -E make_directory /Users/buildslave/jenkins/workspace/lldb-cmake-standalone/lldb-xcode-build/unittests/ObjectFile/PECOFF/Release/Inputs

Hide Details

=== BUILD TARGET LLDBPlatformTests OF PROJECT lldb WITH CONFIGURATION Release ===

Hide Details

Check dependencies

Hide Details

Write auxiliary files write-file /Users/buildslave/jenkins/workspace/lldb-cmake-standalone/lldb-xcode-build/unittests/Platform/lldb.build/Release/LLDBPlatformTests.build/Script-22158C5999BB4621A89A9E32.sh chmod 0755 /Users/buildslave/jenkins/workspace/lldb-cmake-standalone/lldb-xcode-build/unittests/Platform/lldb.build/Release/LLDBPlatformTests.build/Script-22158C5999BB4621A89A9E32.sh

Hide Details

PhaseScriptExecution CMake\ PostBuild\ Rules /Users/buildslave/jenkins/workspace/lldb-cmake-standalone/lldb-xcode-build/unittests/Platform/lldb.build/Release/LLDBPlatformTests.build/Script-22158C5999BB4621A89A9E32.sh cd /Users/buildslave/jenkins/workspace/lldb-cmake-standalone/llvm-project/lldb /bin/sh -c /Users/buildslave/jenkins/workspace/lldb-cmake-standalone/lldb-xcode-build/unittests/Platform/lldb.build/Release/LLDBPlatformTests.build/Script-22158C5999BB4621A89A9E32.sh /usr/local/Cellar/cmake/3.17.2/bin/cmake -E make_directory /Users/buildslave/jenkins/workspace/lldb-cmake-standalone/lldb-xcode-build/unittests/Platform/Release/Inputs

Hide Details

=== BUILD TARGET AdbClientTests OF PROJECT lldb WITH CONFIGURATION Release ===

Hide Details

Check dependencies

Hide Details

Write auxiliary files write-file /Users/buildslave/jenkins/workspace/lldb-cmake-standalone/lldb-xcode-build/unittests/Platform/Android/lldb.build/Release/AdbClientTests.build/Script-AA41AB64F42B48C0918FB1DD.sh chmod 0755 /Users/buildslave/jenkins/workspace/lldb-cmake-standalone/lldb-xcode-build/unittests/Platform/Android/lldb.build/Release/AdbClientTests.build/Script-AA41AB64F42B48C0918FB1DD.sh

Hide Details

PhaseScriptExecution CMake\ PostBuild\ Rules /Users/buildslave/jenkins/workspace/lldb-cmake-standalone/lldb-xcode-build/unittests/Platform/Android/lldb.build/Release/AdbClientTests.build/Script-AA41AB64F42B48C0918FB1DD.sh cd /Users/buildslave/jenkins/workspace/lldb-cmake-standalone/llvm-project/lldb /bin/sh -c /Users/buildslave/jenkins/workspace/lldb-cmake-standalone/lldb-xcode-build/unittests/Platform/Android/lldb.build/Release/AdbClientTests.build/Script-AA41AB64F42B48C0918FB1DD.sh /usr/local/Cellar/cmake/3.17.2/bin/cmake -E make_directory /Users/buildslave/jenkins/workspace/lldb-cmake-standalone/lldb-xcode-build/unittests/Platform/Android/Release/Inputs

Hide Details

=== BUILD TARGET ProcessEventDataTests OF PROJECT lldb WITH CONFIGURATION Release ===

Hide Details

Check dependencies

Hide Details

Write auxiliary files write-file /Users/buildslave/jenkins/workspace/lldb-cmake-standalone/lldb-xcode-build/unittests/Process/lldb.build/Release/ProcessEventDataTests.build/Script-FC668537CAED4F2DB57CC9D4.sh chmod 0755 /Users/buildslave/jenkins/workspace/lldb-cmake-standalone/lldb-xcode-build/unittests/Process/lldb.build/Release/ProcessEventDataTests.build/Script-FC668537CAED4F2DB57CC9D4.sh

Hide Details

PhaseScriptExecution CMake\ PostBuild\ Rules /Users/buildslave/jenkins/workspace/lldb-cmake-standalone/lldb-xcode-build/unittests/Process/lldb.build/Release/ProcessEventDataTests.build/Script-FC668537CAED4F2DB57CC9D4.sh cd /Users/buildslave/jenkins/workspace/lldb-cmake-standalone/llvm-project/lldb /bin/sh -c /Users/buildslave/jenkins/workspace/lldb-cmake-standalone/lldb-xcode-build/unittests/Process/lldb.build/Release/ProcessEventDataTests.build/Script-FC668537CAED4F2DB57CC9D4.sh /usr/local/Cellar/cmake/3.17.2/bin/cmake -E make_directory /Users/buildslave/jenkins/workspace/lldb-cmake-standalone/lldb-xcode-build/unittests/Process/Release/Inputs

Hide Details

=== BUILD TARGET ProcessGdbRemoteTests OF PROJECT lldb WITH CONFIGURATION Release ===

Hide Details

Check dependencies

Hide Details

Write auxiliary files write-file /Users/buildslave/jenkins/workspace/lldb-cmake-standalone/lldb-xcode-build/unittests/Process/gdb-remote/lldb.build/Release/ProcessGdbRemoteTests.build/Script-F7B54EEAEC134F58B673760E.sh chmod 0755 /Users/buildslave/jenkins/workspace/lldb-cmake-standalone/lldb-xcode-build/unittests/Process/gdb-remote/lldb.build/Release/ProcessGdbRemoteTests.build/Script-F7B54EEAEC134F58B673760E.sh

Hide Details

PhaseScriptExecution CMake\ PostBuild\ Rules /Users/buildslave/jenkins/workspace/lldb-cmake-standalone/lldb-xcode-build/unittests/Process/gdb-remote/lldb.build/Release/ProcessGdbRemoteTests.build/Script-F7B54EEAEC134F58B673760E.sh cd /Users/buildslave/jenkins/workspace/lldb-cmake-standalone/llvm-project/lldb /bin/sh -c /Users/buildslave/jenkins/workspace/lldb-cmake-standalone/lldb-xcode-build/unittests/Process/gdb-remote/lldb.build/Release/ProcessGdbRemoteTests.build/Script-F7B54EEAEC134F58B673760E.sh /usr/local/Cellar/cmake/3.17.2/bin/cmake -E make_directory /Users/buildslave/jenkins/workspace/lldb-cmake-standalone/lldb-xcode-build/unittests/Process/gdb-remote/Release/Inputs

Hide Details

=== BUILD TARGET ProcessUtilityTests OF PROJECT lldb WITH CONFIGURATION Release ===

Hide Details

Check dependencies

Hide Details

Write auxiliary files write-file /Users/buildslave/jenkins/workspace/lldb-cmake-standalone/lldb-xcode-build/unittests/Process/Utility/lldb.build/Release/ProcessUtilityTests.build/Script-AB04C4DA26EC482D8E5BD3E3.sh chmod 0755 /Users/buildslave/jenkins/workspace/lldb-cmake-standalone/lldb-xcode-build/unittests/Process/Utility/lldb.build/Release/ProcessUtilityTests.build/Script-AB04C4DA26EC482D8E5BD3E3.sh

Hide Details

PhaseScriptExecution CMake\ PostBuild\ Rules /Users/buildslave/jenkins/workspace/lldb-cmake-standalone/lldb-xcode-build/unittests/Process/Utility/lldb.build/Release/ProcessUtilityTests.build/Script-AB04C4DA26EC482D8E5BD3E3.sh cd /Users/buildslave/jenkins/workspace/lldb-cmake-standalone/llvm-project/lldb /bin/sh -c /Users/buildslave/jenkins/workspace/lldb-cmake-standalone/lldb-xcode-build/unittests/Process/Utility/lldb.build/Release/ProcessUtilityTests.build/Script-AB04C4DA26EC482D8E5BD3E3.sh /usr/local/Cellar/cmake/3.17.2/bin/cmake -E make_directory /Users/buildslave/jenkins/workspace/lldb-cmake-standalone/lldb-xcode-build/unittests/Process/Utility/Release/Inputs

Hide Details

=== BUILD TARGET LLDBMinidumpTests OF PROJECT lldb WITH CONFIGURATION Release ===

Hide Details

Check dependencies

Hide Details

Write auxiliary files write-file /Users/buildslave/jenkins/workspace/lldb-cmake-standalone/lldb-xcode-build/unittests/Process/minidump/lldb.build/Release/LLDBMinidumpTests.build/Script-9833E0EFA3B948948EC2BBD3.sh chmod 0755 /Users/buildslave/jenkins/workspace/lldb-cmake-standalone/lldb-xcode-build/unittests/Process/minidump/lldb.build/Release/LLDBMinidumpTests.build/Script-9833E0EFA3B948948EC2BBD3.sh

Hide Details

PhaseScriptExecution CMake\ PostBuild\ Rules /Users/buildslave/jenkins/workspace/lldb-cmake-standalone/lldb-xcode-build/unittests/Process/minidump/lldb.build/Release/LLDBMinidumpTests.build/Script-9833E0EFA3B948948EC2BBD3.sh cd /Users/buildslave/jenkins/workspace/lldb-cmake-standalone/llvm-project/lldb /bin/sh -c /Users/buildslave/jenkins/workspace/lldb-cmake-standalone/lldb-xcode-build/unittests/Process/minidump/lldb.build/Release/LLDBMinidumpTests.build/Script-9833E0EFA3B948948EC2BBD3.sh /usr/local/Cellar/cmake/3.17.2/bin/cmake -E make_directory /Users/buildslave/jenkins/workspace/lldb-cmake-standalone/lldb-xcode-build/unittests/Process/minidump/Release/Inputs echo "Copying fizzbuzz_no_heap.dmp to binary directory." Copying fizzbuzz_no_heap.dmp to binary directory. /usr/local/Cellar/cmake/3.17.2/bin/cmake -E copy /Users/buildslave/jenkins/workspace/lldb-cmake-standalone/llvm-project/lldb/unittests/Process/minidump/Inputs/fizzbuzz_no_heap.dmp /Users/buildslave/jenkins/workspace/lldb-cmake-standalone/lldb-xcode-build/unittests/Process/minidump/Release/Inputs echo "Copying fizzbuzz_wow64.dmp to binary directory." Copying fizzbuzz_wow64.dmp to binary directory. /usr/local/Cellar/cmake/3.17.2/bin/cmake -E copy /Users/buildslave/jenkins/workspace/lldb-cmake-standalone/llvm-project/lldb/unittests/Process/minidump/Inputs/fizzbuzz_wow64.dmp /Users/buildslave/jenkins/workspace/lldb-cmake-standalone/lldb-xcode-build/unittests/Process/minidump/Release/Inputs echo "Copying linux-x86_64.dmp to binary directory." Copying linux-x86_64.dmp to binary directory. /usr/local/Cellar/cmake/3.17.2/bin/cmake -E copy /Users/buildslave/jenkins/workspace/lldb-cmake-standalone/llvm-project/lldb/unittests/Process/minidump/Inputs/linux-x86_64.dmp /Users/buildslave/jenkins/workspace/lldb-cmake-standalone/lldb-xcode-build/unittests/Process/minidump/Release/Inputs echo "Copying regions-memlist64.dmp to binary directory." Copying regions-memlist64.dmp to binary directory. /usr/local/Cellar/cmake/3.17.2/bin/cmake -E copy /Users/buildslave/jenkins/workspace/lldb-cmake-standalone/llvm-project/lldb/unittests/Process/minidump/Inputs/regions-memlist64.dmp /Users/buildslave/jenkins/workspace/lldb-cmake-standalone/lldb-xcode-build/unittests/Process/minidump/Release/Inputs

Hide Details

=== BUILD TARGET ScriptInterpreterPythonTests OF PROJECT lldb WITH CONFIGURATION Release ===

Hide Details

Check dependencies

Hide Details

Write auxiliary files write-file /Users/buildslave/jenkins/workspace/lldb-cmake-standalone/lldb-xcode-build/unittests/ScriptInterpreter/Python/lldb.build/Release/ScriptInterpreterPythonTests.build/Script-77C6B6DB80234C48A3DB01A4.sh chmod 0755 /Users/buildslave/jenkins/workspace/lldb-cmake-standalone/lldb-xcode-build/unittests/ScriptInterpreter/Python/lldb.build/Release/ScriptInterpreterPythonTests.build/Script-77C6B6DB80234C48A3DB01A4.sh

Hide Details

PhaseScriptExecution CMake\ PostBuild\ Rules /Users/buildslave/jenkins/workspace/lldb-cmake-standalone/lldb-xcode-build/unittests/ScriptInterpreter/Python/lldb.build/Release/ScriptInterpreterPythonTests.build/Script-77C6B6DB80234C48A3DB01A4.sh cd /Users/buildslave/jenkins/workspace/lldb-cmake-standalone/llvm-project/lldb /bin/sh -c /Users/buildslave/jenkins/workspace/lldb-cmake-standalone/lldb-xcode-build/unittests/ScriptInterpreter/Python/lldb.build/Release/ScriptInterpreterPythonTests.build/Script-77C6B6DB80234C48A3DB01A4.sh /usr/local/Cellar/cmake/3.17.2/bin/cmake -E make_directory /Users/buildslave/jenkins/workspace/lldb-cmake-standalone/lldb-xcode-build/unittests/ScriptInterpreter/Python/Release/Inputs

Hide Details

=== BUILD TARGET SignalsTests OF PROJECT lldb WITH CONFIGURATION Release ===

Hide Details

Check dependencies

Hide Details

Write auxiliary files write-file /Users/buildslave/jenkins/workspace/lldb-cmake-standalone/lldb-xcode-build/unittests/Signals/lldb.build/Release/SignalsTests.build/Script-F8109D27945F46F49E001F94.sh chmod 0755 /Users/buildslave/jenkins/workspace/lldb-cmake-standalone/lldb-xcode-build/unittests/Signals/lldb.build/Release/SignalsTests.build/Script-F8109D27945F46F49E001F94.sh

Hide Details

PhaseScriptExecution CMake\ PostBuild\ Rules /Users/buildslave/jenkins/workspace/lldb-cmake-standalone/lldb-xcode-build/unittests/Signals/lldb.build/Release/SignalsTests.build/Script-F8109D27945F46F49E001F94.sh cd /Users/buildslave/jenkins/workspace/lldb-cmake-standalone/llvm-project/lldb /bin/sh -c /Users/buildslave/jenkins/workspace/lldb-cmake-standalone/lldb-xcode-build/unittests/Signals/lldb.build/Release/SignalsTests.build/Script-F8109D27945F46F49E001F94.sh /usr/local/Cellar/cmake/3.17.2/bin/cmake -E make_directory /Users/buildslave/jenkins/workspace/lldb-cmake-standalone/lldb-xcode-build/unittests/Signals/Release/Inputs

Hide Details

=== BUILD TARGET SymbolTests OF PROJECT lldb WITH CONFIGURATION Release ===

Hide Details

Check dependencies

Hide Details

Write auxiliary files write-file /Users/buildslave/jenkins/workspace/lldb-cmake-standalone/lldb-xcode-build/unittests/Symbol/lldb.build/Release/SymbolTests.build/Script-009A96C7859244758D698A09.sh chmod 0755 /Users/buildslave/jenkins/workspace/lldb-cmake-standalone/lldb-xcode-build/unittests/Symbol/lldb.build/Release/SymbolTests.build/Script-009A96C7859244758D698A09.sh

Hide Details

PhaseScriptExecution CMake\ PostBuild\ Rules /Users/buildslave/jenkins/workspace/lldb-cmake-standalone/lldb-xcode-build/unittests/Symbol/lldb.build/Release/SymbolTests.build/Script-009A96C7859244758D698A09.sh cd /Users/buildslave/jenkins/workspace/lldb-cmake-standalone/llvm-project/lldb /bin/sh -c /Users/buildslave/jenkins/workspace/lldb-cmake-standalone/lldb-xcode-build/unittests/Symbol/lldb.build/Release/SymbolTests.build/Script-009A96C7859244758D698A09.sh /usr/local/Cellar/cmake/3.17.2/bin/cmake -E make_directory /Users/buildslave/jenkins/workspace/lldb-cmake-standalone/lldb-xcode-build/unittests/Symbol/Release/Inputs echo "Copying inlined-functions.yaml to binary directory." Copying inlined-functions.yaml to binary directory. /usr/local/Cellar/cmake/3.17.2/bin/cmake -E copy /Users/buildslave/jenkins/workspace/lldb-cmake-standalone/llvm-project/lldb/unittests/Symbol/Inputs/inlined-functions.yaml /Users/buildslave/jenkins/workspace/lldb-cmake-standalone/lldb-xcode-build/unittests/Symbol/Release/Inputs

Hide Details

=== BUILD TARGET SymbolFileDWARFTests OF PROJECT lldb WITH CONFIGURATION Release ===

Hide Details

Check dependencies

Hide Details

Write auxiliary files write-file /Users/buildslave/jenkins/workspace/lldb-cmake-standalone/lldb-xcode-build/unittests/SymbolFile/DWARF/lldb.build/Release/SymbolFileDWARFTests.build/Script-77880B51C1D443188F31925A.sh chmod 0755 /Users/buildslave/jenkins/workspace/lldb-cmake-standalone/lldb-xcode-build/unittests/SymbolFile/DWARF/lldb.build/Release/SymbolFileDWARFTests.build/Script-77880B51C1D443188F31925A.sh

Hide Details

PhaseScriptExecution CMake\ PostBuild\ Rules /Users/buildslave/jenkins/workspace/lldb-cmake-standalone/lldb-xcode-build/unittests/SymbolFile/DWARF/lldb.build/Release/SymbolFileDWARFTests.build/Script-77880B51C1D443188F31925A.sh cd /Users/buildslave/jenkins/workspace/lldb-cmake-standalone/llvm-project/lldb /bin/sh -c /Users/buildslave/jenkins/workspace/lldb-cmake-standalone/lldb-xcode-build/unittests/SymbolFile/DWARF/lldb.build/Release/SymbolFileDWARFTests.build/Script-77880B51C1D443188F31925A.sh /usr/local/Cellar/cmake/3.17.2/bin/cmake -E make_directory /Users/buildslave/jenkins/workspace/lldb-cmake-standalone/lldb-xcode-build/unittests/SymbolFile/DWARF/Release/Inputs echo "Copying test-dwarf.exe to binary directory." Copying test-dwarf.exe to binary directory. /usr/local/Cellar/cmake/3.17.2/bin/cmake -E copy /Users/buildslave/jenkins/workspace/lldb-cmake-standalone/llvm-project/lldb/unittests/SymbolFile/DWARF/Inputs/test-dwarf.exe /Users/buildslave/jenkins/workspace/lldb-cmake-standalone/lldb-xcode-build/unittests/SymbolFile/DWARF/Release/Inputs

Hide Details

=== BUILD TARGET SymbolFileNativePDBTests OF PROJECT lldb WITH CONFIGURATION Release ===

Hide Details

Check dependencies

Hide Details

Write auxiliary files write-file /Users/buildslave/jenkins/workspace/lldb-cmake-standalone/lldb-xcode-build/unittests/SymbolFile/NativePDB/lldb.build/Release/SymbolFileNativePDBTests.build/Script-911AAD43F95D4DDAB797633D.sh chmod 0755 /Users/buildslave/jenkins/workspace/lldb-cmake-standalone/lldb-xcode-build/unittests/SymbolFile/NativePDB/lldb.build/Release/SymbolFileNativePDBTests.build/Script-911AAD43F95D4DDAB797633D.sh

Hide Details

PhaseScriptExecution CMake\ PostBuild\ Rules /Users/buildslave/jenkins/workspace/lldb-cmake-standalone/lldb-xcode-build/unittests/SymbolFile/NativePDB/lldb.build/Release/SymbolFileNativePDBTests.build/Script-911AAD43F95D4DDAB797633D.sh cd /Users/buildslave/jenkins/workspace/lldb-cmake-standalone/llvm-project/lldb /bin/sh -c /Users/buildslave/jenkins/workspace/lldb-cmake-standalone/lldb-xcode-build/unittests/SymbolFile/NativePDB/lldb.build/Release/SymbolFileNativePDBTests.build/Script-911AAD43F95D4DDAB797633D.sh /usr/local/Cellar/cmake/3.17.2/bin/cmake -E make_directory /Users/buildslave/jenkins/workspace/lldb-cmake-standalone/lldb-xcode-build/unittests/SymbolFile/NativePDB/Release/Inputs

Hide Details

=== BUILD TARGET TargetTests OF PROJECT lldb WITH CONFIGURATION Release ===

Hide Details

Check dependencies

Hide Details

Write auxiliary files write-file /Users/buildslave/jenkins/workspace/lldb-cmake-standalone/lldb-xcode-build/unittests/Target/lldb.build/Release/TargetTests.build/Script-C8D0578A181F4FDE965A23C6.sh chmod 0755 /Users/buildslave/jenkins/workspace/lldb-cmake-standalone/lldb-xcode-build/unittests/Target/lldb.build/Release/TargetTests.build/Script-C8D0578A181F4FDE965A23C6.sh

Hide Details

PhaseScriptExecution CMake\ PostBuild\ Rules /Users/buildslave/jenkins/workspace/lldb-cmake-standalone/lldb-xcode-build/unittests/Target/lldb.build/Release/TargetTests.build/Script-C8D0578A181F4FDE965A23C6.sh cd /Users/buildslave/jenkins/workspace/lldb-cmake-standalone/llvm-project/lldb /bin/sh -c /Users/buildslave/jenkins/workspace/lldb-cmake-standalone/lldb-xcode-build/unittests/Target/lldb.build/Release/TargetTests.build/Script-C8D0578A181F4FDE965A23C6.sh /usr/local/Cellar/cmake/3.17.2/bin/cmake -E make_directory /Users/buildslave/jenkins/workspace/lldb-cmake-standalone/lldb-xcode-build/unittests/Target/Release/Inputs echo "Copying TestModule.so to binary directory." Copying TestModule.so to binary directory. /usr/local/Cellar/cmake/3.17.2/bin/cmake -E copy /Users/buildslave/jenkins/workspace/lldb-cmake-standalone/llvm-project/lldb/unittests/Target/Inputs/TestModule.so /Users/buildslave/jenkins/workspace/lldb-cmake-standalone/lldb-xcode-build/unittests/Target/Release/Inputs

Hide Details

=== BUILD TARGET environment_check OF PROJECT lldb WITH CONFIGURATION Release ===

Hide Details

Check dependencies

Hide Details

=== BUILD TARGET thread_inferior OF PROJECT lldb WITH CONFIGURATION Release ===

Hide Details

Check dependencies

Hide Details

=== BUILD TARGET LLDBServerTests OF PROJECT lldb WITH CONFIGURATION Release ===

Hide Details

Check dependencies

Hide Details

Write auxiliary files write-file /Users/buildslave/jenkins/workspace/lldb-cmake-standalone/lldb-xcode-build/unittests/tools/lldb-server/tests/lldb.build/Release/LLDBServerTests.build/Script-092945544A1743A394800445.sh chmod 0755 /Users/buildslave/jenkins/workspace/lldb-cmake-standalone/lldb-xcode-build/unittests/tools/lldb-server/tests/lldb.build/Release/LLDBServerTests.build/Script-092945544A1743A394800445.sh

Hide Details

PhaseScriptExecution CMake\ PostBuild\ Rules /Users/buildslave/jenkins/workspace/lldb-cmake-standalone/lldb-xcode-build/unittests/tools/lldb-server/tests/lldb.build/Release/LLDBServerTests.build/Script-092945544A1743A394800445.sh cd /Users/buildslave/jenkins/workspace/lldb-cmake-standalone/llvm-project/lldb /bin/sh -c /Users/buildslave/jenkins/workspace/lldb-cmake-standalone/lldb-xcode-build/unittests/tools/lldb-server/tests/lldb.build/Release/LLDBServerTests.build/Script-092945544A1743A394800445.sh /usr/local/Cellar/cmake/3.17.2/bin/cmake -E make_directory /Users/buildslave/jenkins/workspace/lldb-cmake-standalone/lldb-xcode-build/unittests/tools/lldb-server/tests/Release/Inputs

Hide Details

=== BUILD TARGET UnwindAssemblyx86Tests OF PROJECT lldb WITH CONFIGURATION Release ===

Hide Details

Check dependencies

Hide Details

Write auxiliary files write-file /Users/buildslave/jenkins/workspace/lldb-cmake-standalone/lldb-xcode-build/unittests/UnwindAssembly/x86/lldb.build/Release/UnwindAssemblyx86Tests.build/Script-87AC172193D6449FB64CAEB1.sh chmod 0755 /Users/buildslave/jenkins/workspace/lldb-cmake-standalone/lldb-xcode-build/unittests/UnwindAssembly/x86/lldb.build/Release/UnwindAssemblyx86Tests.build/Script-87AC172193D6449FB64CAEB1.sh

Hide Details

PhaseScriptExecution CMake\ PostBuild\ Rules /Users/buildslave/jenkins/workspace/lldb-cmake-standalone/lldb-xcode-build/unittests/UnwindAssembly/x86/lldb.build/Release/UnwindAssemblyx86Tests.build/Script-87AC172193D6449FB64CAEB1.sh cd /Users/buildslave/jenkins/workspace/lldb-cmake-standalone/llvm-project/lldb /bin/sh -c /Users/buildslave/jenkins/workspace/lldb-cmake-standalone/lldb-xcode-build/unittests/UnwindAssembly/x86/lldb.build/Release/UnwindAssemblyx86Tests.build/Script-87AC172193D6449FB64CAEB1.sh /usr/local/Cellar/cmake/3.17.2/bin/cmake -E make_directory /Users/buildslave/jenkins/workspace/lldb-cmake-standalone/lldb-xcode-build/unittests/UnwindAssembly/x86/Release/Inputs

Hide Details

=== BUILD TARGET UtilityTests OF PROJECT lldb WITH CONFIGURATION Release ===

Hide Details

Check dependencies

Hide Details

Write auxiliary files write-file /Users/buildslave/jenkins/workspace/lldb-cmake-standalone/lldb-xcode-build/unittests/Utility/lldb.build/Release/UtilityTests.build/Script-4B0B0652ECA94718A1CFB4D0.sh chmod 0755 /Users/buildslave/jenkins/workspace/lldb-cmake-standalone/lldb-xcode-build/unittests/Utility/lldb.build/Release/UtilityTests.build/Script-4B0B0652ECA94718A1CFB4D0.sh

Hide Details

PhaseScriptExecution CMake\ PostBuild\ Rules /Users/buildslave/jenkins/workspace/lldb-cmake-standalone/lldb-xcode-build/unittests/Utility/lldb.build/Release/UtilityTests.build/Script-4B0B0652ECA94718A1CFB4D0.sh cd /Users/buildslave/jenkins/workspace/lldb-cmake-standalone/llvm-project/lldb /bin/sh -c /Users/buildslave/jenkins/workspace/lldb-cmake-standalone/lldb-xcode-build/unittests/Utility/lldb.build/Release/UtilityTests.build/Script-4B0B0652ECA94718A1CFB4D0.sh /usr/local/Cellar/cmake/3.17.2/bin/cmake -E make_directory /Users/buildslave/jenkins/workspace/lldb-cmake-standalone/lldb-xcode-build/unittests/Utility/Release/Inputs echo "Copying StructuredData-basic.json to binary directory." Copying StructuredData-basic.json to binary directory. /usr/local/Cellar/cmake/3.17.2/bin/cmake -E copy /Users/buildslave/jenkins/workspace/lldb-cmake-standalone/llvm-project/lldb/unittests/Utility/Inputs/StructuredData-basic.json /Users/buildslave/jenkins/workspace/lldb-cmake-standalone/lldb-xcode-build/unittests/Utility/Release/Inputs

Hide Details

=== BUILD TARGET ThreadTests OF PROJECT lldb WITH CONFIGURATION Release ===

Hide Details

Check dependencies

Hide Details

Write auxiliary files write-file /Users/buildslave/jenkins/workspace/lldb-cmake-standalone/lldb-xcode-build/unittests/Thread/lldb.build/Release/ThreadTests.build/Script-C07AAA77FB944CF4B36440F0.sh chmod 0755 /Users/buildslave/jenkins/workspace/lldb-cmake-standalone/lldb-xcode-build/unittests/Thread/lldb.build/Release/ThreadTests.build/Script-C07AAA77FB944CF4B36440F0.sh

Hide Details

PhaseScriptExecution CMake\ PostBuild\ Rules /Users/buildslave/jenkins/workspace/lldb-cmake-standalone/lldb-xcode-build/unittests/Thread/lldb.build/Release/ThreadTests.build/Script-C07AAA77FB944CF4B36440F0.sh cd /Users/buildslave/jenkins/workspace/lldb-cmake-standalone/llvm-project/lldb /bin/sh -c /Users/buildslave/jenkins/workspace/lldb-cmake-standalone/lldb-xcode-build/unittests/Thread/lldb.build/Release/ThreadTests.build/Script-C07AAA77FB944CF4B36440F0.sh /usr/local/Cellar/cmake/3.17.2/bin/cmake -E make_directory /Users/buildslave/jenkins/workspace/lldb-cmake-standalone/lldb-xcode-build/unittests/Thread/Release/Inputs

Hide Details

=== BUILD TARGET debugserverTests OF PROJECT lldb WITH CONFIGURATION Release ===

Hide Details

Check dependencies

Hide Details

Write auxiliary files write-file /Users/buildslave/jenkins/workspace/lldb-cmake-standalone/lldb-xcode-build/unittests/debugserver/lldb.build/Release/debugserverTests.build/Script-F8B6050A96164BD5B907D010.sh chmod 0755 /Users/buildslave/jenkins/workspace/lldb-cmake-standalone/lldb-xcode-build/unittests/debugserver/lldb.build/Release/debugserverTests.build/Script-F8B6050A96164BD5B907D010.sh

Hide Details

PhaseScriptExecution CMake\ PostBuild\ Rules /Users/buildslave/jenkins/workspace/lldb-cmake-standalone/lldb-xcode-build/unittests/debugserver/lldb.build/Release/debugserverTests.build/Script-F8B6050A96164BD5B907D010.sh cd /Users/buildslave/jenkins/workspace/lldb-cmake-standalone/llvm-project/lldb /bin/sh -c /Users/buildslave/jenkins/workspace/lldb-cmake-standalone/lldb-xcode-build/unittests/debugserver/lldb.build/Release/debugserverTests.build/Script-F8B6050A96164BD5B907D010.sh /usr/local/Cellar/cmake/3.17.2/bin/cmake -E make_directory /Users/buildslave/jenkins/workspace/lldb-cmake-standalone/lldb-xcode-build/unittests/debugserver/Release/Inputs

Hide Details

=== BUILD AGGREGATE TARGET LLDBUnitTests OF PROJECT lldb WITH CONFIGURATION Release ===

Hide Details

Check dependencies

Hide Details

=== BUILD AGGREGATE TARGET lldb-unit-test-deps OF PROJECT lldb WITH CONFIGURATION Release ===

Hide Details

Check dependencies

Hide Details

=== BUILD AGGREGATE TARGET check-lldb OF PROJECT lldb WITH CONFIGURATION Release ===

Hide Details

Check dependencies

Hide Details

Write auxiliary files write-file /Users/buildslave/jenkins/workspace/lldb-cmake-standalone/lldb-xcode-build/test/lldb.build/Release/check-lldb.build/Script-44F892D55BA94959A26475F2.sh chmod 0755 /Users/buildslave/jenkins/workspace/lldb-cmake-standalone/lldb-xcode-build/test/lldb.build/Release/check-lldb.build/Script-44F892D55BA94959A26475F2.sh

Hide Details

PhaseScriptExecution CMake\ Rules /Users/buildslave/jenkins/workspace/lldb-cmake-standalone/lldb-xcode-build/test/lldb.build/Release/check-lldb.build/Script-44F892D55BA94959A26475F2.sh cd /Users/buildslave/jenkins/workspace/lldb-cmake-standalone/llvm-project/lldb /bin/sh -c /Users/buildslave/jenkins/workspace/lldb-cmake-standalone/lldb-xcode-build/test/lldb.build/Release/check-lldb.build/Script-44F892D55BA94959A26475F2.sh echo "Running lldb lit test suite" Running lldb lit test suite /usr/local/Frameworks/Python.framework/Versions/3.7/bin/python3.7 /Users/buildslave/jenkins/workspace/lldb-cmake-standalone/lldb-xcode-build/Release/bin/llvm-lit --xunit-xml-output=testresults.xunit.xml -v -vv --timeout=600 --param build_mode=Release /Users/buildslave/jenkins/workspace/lldb-cmake-standalone/lldb-xcode-build/test Deleting module cache at /Users/buildslave/jenkins/workspace/lldb-cmake-standalone/lldb-xcode-build/lldb-test-build.noindex/module-cache-lldb/lldb-api. Deleting module cache at /Users/buildslave/jenkins/workspace/lldb-cmake-standalone/lldb-xcode-build/lldb-test-build.noindex/module-cache-clang/lldb-api. -- Testing: 2428 tests, 16 workers -- llvm-lit: /Users/buildslave/jenkins/workspace/lldb-cmake-standalone/llvm-project/lldb/test/Shell/helper/toolchain.py:129: note: using SDKROOT: '/Applications/Xcode.app/Contents/Developer/Platforms/MacOSX.platform/Developer/SDKs/MacOSX10.15.sdk' llvm-lit: /Users/buildslave/jenkins/workspace/lldb-cmake-standalone/llvm-project/llvm/utils/lit/lit/llvm/config.py:436: note: using clang: /Users/buildslave/jenkins/workspace/lldb-cmake-standalone/clang-build/bin/clang PASS: lldb-api :: functionalities/inferior-crashing/TestInferiorCrashingStep.py (1 of 2428) PASS: lldb-api :: commands/target/basic/TestTargetCommand.py (2 of 2428) PASS: lldb-api :: functionalities/completion/TestCompletion.py (3 of 2428) PASS: lldb-api :: types/TestLongTypes.py (4 of 2428) PASS: lldb-api :: python_api/target/TestTargetAPI.py (5 of 2428) PASS: lldb-api :: lang/objc/foundation/TestObjCMethods.py (6 of 2428) UNSUPPORTED: lldb-api :: tools/lldb-server/vCont-threads/TestGdbRemote_vContThreads.py (7 of 2428) PASS: lldb-api :: lang/objc/objc-new-syntax/TestObjCNewSyntaxLiteral.py (8 of 2428) PASS: lldb-api :: lang/cpp/namespace/TestNamespaceLookup.py (9 of 2428) PASS: lldb-api :: types/TestLongTypesExpr.py (10 of 2428) PASS: lldb-api :: types/TestIntegerTypeExpr.py (11 of 2428) PASS: lldb-api :: lang/objc/hidden-ivars/TestHiddenIvars.py (12 of 2428) PASS: lldb-api :: lang/objc/exceptions/TestObjCExceptions.py (13 of 2428) PASS: lldb-api :: lang/objc/foundation/TestFoundationDisassembly.py (14 of 2428) make: *** [/Users/buildslave/jenkins/workspace/lldb-cmake-standalone/lldb-xcode-build/test/CMakeFiles/check-lldb] Hangup: 1

Hide Details

** BUILD FAILED **

Hide Details

Hide Details

The following build commands failed: PhaseScriptExecution CMake\ Rules /Users/buildslave/jenkins/workspace/lldb-cmake-standalone/lldb-xcode-build/test/lldb.build/Release/check-lldb.build/Script-44F892D55BA94959A26475F2.sh (1 failure) Command failed: Command '['/usr/bin/env', 'TERM=vt100', '/usr/local/bin/cmake', '--build', '.', '--config', 'Release', '--target', 'check-lldb']' returned non-zero exit status 65. Command: ['/usr/bin/env', 'TERM=vt100', '/usr/local/bin/cmake', '--build', '.', '--config', 'Release', '--target', 'check-lldb'] [Pipeline] } [Pipeline] // timeout [Pipeline] } [Pipeline] // stage [Pipeline] stage [Pipeline] { (Declarative: Post Actions) [Pipeline] emailext

Hide Details

Begin Pre-Send Script... java.lang.NullPointerException: Cannot invoke method size() on null object at org.codehaus.groovy.runtime.NullObject.invokeMethod(NullObject.java:91) at org.codehaus.groovy.runtime.callsite.PogoMetaClassSite.call(PogoMetaClassSite.java:48) at org.codehaus.groovy.runtime.callsite.CallSiteArray.defaultCall(CallSiteArray.java:48) at org.codehaus.groovy.runtime.callsite.NullCallSite.call(NullCallSite.java:35) at org.codehaus.groovy.runtime.callsite.CallSiteArray.defaultCall(CallSiteArray.java:48) at org.codehaus.groovy.runtime.callsite.AbstractCallSite.call(AbstractCallSite.java:113) at org.codehaus.groovy.runtime.callsite.AbstractCallSite.call(AbstractCallSite.java:117) at Script1.run(Script1.groovy:62) at hudson.plugins.emailext.ExtendedEmailPublisher.executeScript(ExtendedEmailPublisher.java:691) at hudson.plugins.emailext.ExtendedEmailPublisher.executePresendScript(ExtendedEmailPublisher.java:649) at hudson.plugins.emailext.ExtendedEmailPublisher.sendMail(ExtendedEmailPublisher.java:513) at hudson.plugins.emailext.EmailExtStep$EmailExtStepExecution.run(EmailExtStep.java:250) at hudson.plugins.emailext.EmailExtStep$EmailExtStepExecution.run(EmailExtStep.java:183) at org.jenkinsci.plugins.workflow.steps.SynchronousNonBlockingStepExecution.lambda$start$0(SynchronousNonBlockingStepExecution.java:47) at java.util.concurrent.Executors$RunnableAdapter.call(Executors.java:511) at java.util.concurrent.FutureTask.run(FutureTask.java:266) at java.util.concurrent.ThreadPoolExecutor.runWorker(ThreadPoolExecutor.java:1149) at java.util.concurrent.ThreadPoolExecutor$Worker.run(ThreadPoolExecutor.java:624) at java.lang.Thread.run(Thread.java:748)

Hide Details

An attempt to send an e-mail to empty list of recipients, ignored.
[Pipeline] } [Pipeline] // stage [Pipeline] } [Pipeline] // withEnv [Pipeline] } [Pipeline] // node [Pipeline] End of Pipeline ERROR: script returned exit code 1 Finished: FAILURE