Started by upstream project "relay-lnt-ctmark" build number 13207 originally caused by: Started by upstream project "clang-stage1-RA" build number 24285 originally caused by: Started by an SCM change Started by an SCM change Started by an SCM change Started by an SCM change Started by an SCM change Started by an SCM change Started by an SCM change Started by an SCM change Started by an SCM change Started by upstream project "clang-stage1-RA" build number 24286 originally caused by: Started by an SCM change Started by an SCM change Started by an SCM change Started by an SCM change Started by an SCM change Started by an SCM change Started by an SCM change Started by an SCM change Started by upstream project "clang-stage1-RA" build number 24287 originally caused by: Started by an SCM change Started by an SCM change Started by an SCM change Started by an SCM change Started by an SCM change Started by an SCM change Started by an SCM change Started by an SCM change Started by an SCM change Started by an SCM change Started by an SCM change Started by an SCM change Started by an SCM change Started by an SCM change Started by an SCM change Started by upstream project "clang-stage1-RA" build number 24288 originally caused by: Started by an SCM change Started by an SCM change Started by an SCM change Started by an SCM change Started by an SCM change Started by an SCM change Started by an SCM change Started by an SCM change Started by an SCM change Started by an SCM change Started by an SCM change Started by an SCM change Started by upstream project "clang-stage1-RA" build number 24289 originally caused by: Started by an SCM change Started by an SCM change Started by an SCM change Started by an SCM change Started by an SCM change Started by an SCM change Started by an SCM change Started by an SCM change Obtained zorg/jenkins/jobs/jobs/lnt-ctmark-aarch64-Oz from git https://github.com/llvm/llvm-zorg.git Resume disabled by user, switching to high-performance, low-durability mode. [Pipeline] Start of Pipeline [Pipeline] readTrusted Obtained zorg/jenkins/common.groovy from git https://github.com/llvm/llvm-zorg.git [Pipeline] properties [Pipeline] node Still waiting to schedule task Waiting for next available executor on ‘green-dragon-12’ Running on green-dragon-12 in /Users/buildslave/jenkins/workspace/lnt-ctmark-aarch64-Oz [Pipeline] { [Pipeline] stage [Pipeline] { (main) [Pipeline] dir Running in /Users/buildslave/jenkins/workspace/lnt-ctmark-aarch64-Oz/config [Pipeline] { [Pipeline] git The recommended git tool is: git No credentials specified Fetching changes from the remote Git repository Checking out Revision 512e47aa79d5211fef741116b8cbd25ceb73e5b9 (refs/remotes/origin/main) Commit message: "Add a llvm-x86_64-debian-dylib mail notifier" > git rev-parse --resolve-git-dir /Users/buildslave/jenkins/workspace/lnt-ctmark-aarch64-Oz/config/.git # timeout=10 > git config remote.origin.url https://github.com/llvm/llvm-zorg.git # timeout=10 Fetching upstream changes from https://github.com/llvm/llvm-zorg.git > git --version # timeout=10 > git --version # 'git version 2.24.3 (Apple Git-128)' > git fetch --tags --force --progress -- https://github.com/llvm/llvm-zorg.git +refs/heads/*:refs/remotes/origin/* # timeout=10 > git rev-parse refs/remotes/origin/main^{commit} # timeout=10 > git config core.sparsecheckout # timeout=10 > git checkout -f 512e47aa79d5211fef741116b8cbd25ceb73e5b9 # timeout=10 > git branch -a -v --no-abbrev # timeout=10 > git branch -D main # timeout=10 > git checkout -b main 512e47aa79d5211fef741116b8cbd25ceb73e5b9 # timeout=10 > git rev-list --no-walk 512e47aa79d5211fef741116b8cbd25ceb73e5b9 # timeout=10 [Pipeline] } [Pipeline] // dir [Pipeline] dir Running in /Users/buildslave/jenkins/workspace/lnt-ctmark-aarch64-Oz/pseudo-checkout-llvm-project [Pipeline] { [Pipeline] checkout The recommended git tool is: NONE No credentials specified Cloning the remote Git repository Cloning repository http://labmaster3.local/git/llvm-project.git > git init /Users/buildslave/jenkins/workspace/lnt-ctmark-aarch64-Oz/pseudo-checkout-llvm-project # timeout=10 Fetching upstream changes from http://labmaster3.local/git/llvm-project.git > git --version # timeout=10 > git --version # 'git version 2.24.3 (Apple Git-128)' > git fetch --tags --force --progress -- http://labmaster3.local/git/llvm-project.git +refs/heads/*:refs/remotes/origin/* # timeout=10 Avoid second fetch Checking out Revision 9324cc2ca951fe5fe11c85470cb08e699c59499c (detached) > git config remote.origin.url http://labmaster3.local/git/llvm-project.git # timeout=10 > git config --add remote.origin.fetch +refs/heads/*:refs/remotes/origin/* # timeout=10 > git rev-parse 9324cc2ca951^{commit} # timeout=10 > git config core.sparsecheckout # timeout=10 > git checkout -f 9324cc2ca951fe5fe11c85470cb08e699c59499c # timeout=10 Commit message: "Change __builtin_sycl_unique_stable_name to just use an Itanium mangling" > git rev-list --no-walk 5aa4c74c9a2ee3c4e6e87adfa2ef218c5aeed1d6 # timeout=10 [Pipeline] } [Pipeline] // dir [Pipeline] dir Running in /Users/buildslave/jenkins/workspace/lnt-ctmark-aarch64-Oz/lnt [Pipeline] { [Pipeline] git The recommended git tool is: NONE No credentials specified Fetching changes from the remote Git repository Checking out Revision b4db71089b2ab669e4071dc6cdc3c60959ddc1d5 (refs/remotes/origin/main) Commit message: "Added missed spaces in log messages, NFC" > git rev-parse --resolve-git-dir /Users/buildslave/jenkins/workspace/lnt-ctmark-aarch64-Oz/lnt/.git # timeout=10 > git config remote.origin.url https://github.com/llvm/llvm-lnt.git # timeout=10 Fetching upstream changes from https://github.com/llvm/llvm-lnt.git > git --version # timeout=10 > git --version # 'git version 2.24.3 (Apple Git-128)' > git fetch --tags --force --progress -- https://github.com/llvm/llvm-lnt.git +refs/heads/*:refs/remotes/origin/* # timeout=10 > git rev-parse refs/remotes/origin/main^{commit} # timeout=10 > git config core.sparsecheckout # timeout=10 > git checkout -f b4db71089b2ab669e4071dc6cdc3c60959ddc1d5 # timeout=10 > git branch -a -v --no-abbrev # timeout=10 > git branch -D main # timeout=10 > git checkout -b main b4db71089b2ab669e4071dc6cdc3c60959ddc1d5 # timeout=10 > git rev-list --no-walk b4db71089b2ab669e4071dc6cdc3c60959ddc1d5 # timeout=10 [Pipeline] } [Pipeline] // dir [Pipeline] dir Running in /Users/buildslave/jenkins/workspace/lnt-ctmark-aarch64-Oz/test-suite [Pipeline] { [Pipeline] git The recommended git tool is: NONE No credentials specified Fetching changes from the remote Git repository Checking out Revision b983131b7e46d34f0eb2be399baf6c2e48d5734c (refs/remotes/origin/main) > git rev-parse --resolve-git-dir /Users/buildslave/jenkins/workspace/lnt-ctmark-aarch64-Oz/test-suite/.git # timeout=10 > git config remote.origin.url https://github.com/llvm/llvm-test-suite.git # timeout=10 Fetching upstream changes from https://github.com/llvm/llvm-test-suite.git > git --version # timeout=10 > git --version # 'git version 2.24.3 (Apple Git-128)' > git fetch --tags --force --progress -- https://github.com/llvm/llvm-test-suite.git +refs/heads/*:refs/remotes/origin/* # timeout=10 > git rev-parse refs/remotes/origin/main^{commit} # timeout=10 > git config core.sparsecheckout # timeout=10 > git checkout -f b983131b7e46d34f0eb2be399baf6c2e48d5734c # timeout=10 Commit message: "[test-suite] Add tests for FP classification intrinsics" > git branch -a -v --no-abbrev # timeout=10 > git branch -D main # timeout=10 > git checkout -b main b983131b7e46d34f0eb2be399baf6c2e48d5734c # timeout=10 > git rev-list --no-walk b983131b7e46d34f0eb2be399baf6c2e48d5734c # timeout=10 [Pipeline] } [Pipeline] // dir [Pipeline] timeout Timeout set to expire in 30 min [Pipeline] { [Pipeline] sh + LNT_FLAGS+=' -C config/tasks/cmake/caches/target-arm64-iphoneos.cmake' + LNT_FLAGS+=' -C config/tasks/cmake/caches/opt-Oz.cmake' + config/tasks/task jenkinsrun config/tasks/lnt-ctmark.sh -a compiler=http://labmaster2.local/artifacts/clang-stage1-RA/clang-d400152-g9324cc2ca951-t24289-b24289.tar.gz -D 'LNT_FLAGS= -C config/tasks/cmake/caches/target-arm64-iphoneos.cmake -C config/tasks/cmake/caches/opt-Oz.cmake' + export PATH=/Users/buildslave/jenkins/workspace/lnt-ctmark-aarch64-Oz/config/tasks/bin:/usr/local/bin:/usr/local/sbin:/usr/bin:/bin:/usr/sbin:/sbin + PATH=/Users/buildslave/jenkins/workspace/lnt-ctmark-aarch64-Oz/config/tasks/bin:/usr/local/bin:/usr/local/sbin:/usr/bin:/bin:/usr/sbin:/sbin + build clean ...removing 'lnt-sandbox' ...removing 'venv' ...removing 'pseudo-checkout-llvm-project' ...removing 'result' ...removing 'a.out' ...removing 'log_summary.html' ...removing 'compiler' ++ build arg --optional SUBMIT_URL + SUBMIT_URL= ++ build arg --optional SUBMIT_NAME + SUBMIT_NAME= ++ build arg --optional SUBMIT_ORDER + SUBMIT_ORDER= ++ build arg --optional LNT_FLAGS + LNT_FLAGS=' -C config/tasks/cmake/caches/target-arm64-iphoneos.cmake -C config/tasks/cmake/caches/opt-Oz.cmake' + : http://104.154.54.203/db_default/v4/nts/submitRun + : green-dragon-12_lnt-ctmark-aarch64-Oz + : 400152 + build get compiler + build get test-suite + build get lnt + DEPENDENCY_FILES=/Users/buildslave/jenkins/workspace/lnt-ctmark-aarch64-Oz/config/tasks/lnt-testsuite.dep + . /Users/buildslave/jenkins/workspace/lnt-ctmark-aarch64-Oz/config/tasks/utils/check_dependencies.sh ++ python /Users/buildslave/jenkins/workspace/lnt-ctmark-aarch64-Oz/config/tasks/../dep/dep.py verify /Users/buildslave/jenkins/workspace/lnt-ctmark-aarch64-Oz/config/tasks/lnt-testsuite.dep You are using pip version 18.1, however version 20.3.4 is available. You should consider upgrading via the 'pip install --upgrade pip' command. Dependency met os_version v10.11.6 Dependency met brew cmake v3.6.0 Dependency met pip virtualenv v15.1.0 + . /Users/buildslave/jenkins/workspace/lnt-ctmark-aarch64-Oz/config/tasks/utils/normalize_compiler.sh ++ cd compiler ++ '[' -d Applications/Xcode.app/Contents/Developer/Toolchains/XcodeDefault.xctoolchain/usr ']' ++ '[' -d '*/bin' ']' ++ cd /Users/buildslave/jenkins/workspace/lnt-ctmark-aarch64-Oz ++ /Users/buildslave/jenkins/workspace/lnt-ctmark-aarch64-Oz/compiler/bin/clang -v clang version 14.0.0 (https://github.com/llvm/llvm-project.git 9324cc2ca951fe5fe11c85470cb08e699c59499c) Target: x86_64-apple-darwin19.5.0 Thread model: posix InstalledDir: /Users/buildslave/jenkins/workspace/lnt-ctmark-aarch64-Oz/compiler/bin + . /Users/buildslave/jenkins/workspace/lnt-ctmark-aarch64-Oz/config/tasks/utils/venv.sh ++ echo '@@@ LNT VirtualEnv @@@'
LNT VirtualEnv

Hide Details

@@@ LNT VirtualEnv @@@ ++ /usr/local/bin/virtualenv --python=python3 venv Using base prefix '/usr/local/Cellar/python/3.7.1/Frameworks/Python.framework/Versions/3.7' New python executable in /Users/buildslave/jenkins/workspace/lnt-ctmark-aarch64-Oz/venv/bin/python3.7 Also creating executable in /Users/buildslave/jenkins/workspace/lnt-ctmark-aarch64-Oz/venv/bin/python Installing setuptools, pip, wheel... done. Running virtualenv with interpreter /usr/local/bin/python3 ++ set +u ++ . venv/bin/activate +++ deactivate nondestructive +++ unset -f pydoc +++ '[' -z '' ']' +++ '[' -z '' ']' +++ '[' -n /bin/sh ']' +++ hash -r +++ '[' -z '' ']' +++ unset VIRTUAL_ENV +++ '[' '!' nondestructive = nondestructive ']' +++ VIRTUAL_ENV=/Users/buildslave/jenkins/workspace/lnt-ctmark-aarch64-Oz/venv +++ export VIRTUAL_ENV +++ _OLD_VIRTUAL_PATH=/Users/buildslave/jenkins/workspace/lnt-ctmark-aarch64-Oz/config/tasks/bin:/usr/local/bin:/usr/local/sbin:/usr/bin:/bin:/usr/sbin:/sbin +++ PATH=/Users/buildslave/jenkins/workspace/lnt-ctmark-aarch64-Oz/venv/bin:/Users/buildslave/jenkins/workspace/lnt-ctmark-aarch64-Oz/config/tasks/bin:/usr/local/bin:/usr/local/sbin:/usr/bin:/bin:/usr/sbin:/sbin +++ export PATH +++ '[' -z '' ']' +++ '[' -z '' ']' +++ _OLD_VIRTUAL_PS1= +++ '[' x '!=' x ']' ++++ basename /Users/buildslave/jenkins/workspace/lnt-ctmark-aarch64-Oz/venv +++ PS1='(venv) ' +++ export PS1 +++ alias pydoc +++ '[' -n /bin/sh ']' +++ hash -r ++ set -u ++ echo @@@@@@@ @@@@@@@ + . /Users/buildslave/jenkins/workspace/lnt-ctmark-aarch64-Oz/config/tasks/utils/venv_lit.sh ++ echo '@@@ Install VirtualEnv Lit @@@'
Install VirtualEnv Lit

Hide Details

@@@ Install VirtualEnv Lit @@@ ++ . /Users/buildslave/jenkins/workspace/lnt-ctmark-aarch64-Oz/config/tasks/utils/pip_install.sh lit +++ pip install lit Collecting lit Using cached lit-12.0.1-py3-none-any.whl Installing collected packages: lit Successfully installed lit-12.0.1 ++ echo @@@@@@ @@@@@@
+ . /Users/buildslave/jenkins/workspace/lnt-ctmark-aarch64-Oz/config/tasks/utils/venv_lnt.sh ++ echo '@@@ Install VirtualEnv LNT @@@'
Install VirtualEnv LNT

Hide Details

@@@ Install VirtualEnv LNT @@@ ++ . /Users/buildslave/jenkins/workspace/lnt-ctmark-aarch64-Oz/config/tasks/utils/pip_install.sh lnt/ +++ pip install lnt/ Processing ./lnt DEPRECATION: A future pip version will change local packages to be built in-place without first copying to a temporary directory. We recommend you use --use-feature=in-tree-build to test your packages with this new behavior before it becomes the default. pip 21.3 will remove support for this functionality. You can find discussion regarding this at https://github.com/pypa/pip/issues/7555. Collecting six Using cached six-1.16.0-py2.py3-none-any.whl (11 kB) Collecting aniso8601==1.2.0 Using cached aniso8601-1.2.0-py3-none-any.whl Collecting Flask==0.12.2 Using cached Flask-0.12.2-py2.py3-none-any.whl (83 kB) Collecting Flask-RESTful==0.3.4 Using cached Flask_RESTful-0.3.4-py2.py3-none-any.whl (24 kB) Collecting Jinja2==2.7.2 Using cached Jinja2-2.7.2-py3-none-any.whl Collecting MarkupSafe==0.23 Using cached MarkupSafe-0.23-cp37-cp37m-macosx_10_14_x86_64.whl Collecting SQLAlchemy==1.2.19 Using cached SQLAlchemy-1.2.19-cp37-cp37m-macosx_10_14_x86_64.whl Collecting Werkzeug==0.12.2 Using cached Werkzeug-0.12.2-py2.py3-none-any.whl (312 kB) Collecting itsdangerous==0.24 Using cached itsdangerous-0.24-py3-none-any.whl Collecting python-gnupg==0.3.7 Using cached python_gnupg-0.3.7-py3-none-any.whl Collecting pytz==2016.10 Using cached pytz-2016.10-py2.py3-none-any.whl (483 kB) Collecting WTForms==2.0.2 Using cached WTForms-2.0.2-py2.py3-none-any.whl (128 kB) Collecting Flask-WTF==0.12 Using cached Flask_WTF-0.12-py3-none-any.whl Collecting typing Using cached typing-3.7.4.3-py3-none-any.whl Collecting click==6.7 Using cached click-6.7-py2.py3-none-any.whl (71 kB) Collecting pyyaml==5.1.2 Using cached PyYAML-5.1.2-cp37-cp37m-macosx_10_14_x86_64.whl Collecting requests Using cached requests-2.26.0-py2.py3-none-any.whl (62 kB) Collecting future Using cached future-0.18.2-py3-none-any.whl Collecting lit==0.11.1 Using cached lit-0.11.1-py3-none-any.whl (81 kB) Collecting certifi Using cached certifi-2021.5.30-py2.py3-none-any.whl (145 kB) Collecting python-dateutil Using cached python_dateutil-2.8.2-py2.py3-none-any.whl (247 kB) Collecting charset-normalizer~=2.0.0 Using cached charset_normalizer-2.0.6-py3-none-any.whl (37 kB) Collecting urllib3<1.27,>=1.21.1 Using cached urllib3-1.26.7-py2.py3-none-any.whl (138 kB) Collecting idna<4,>=2.5 Using cached idna-3.2-py3-none-any.whl (59 kB) Building wheels for collected packages: LNT Building wheel for LNT (setup.py): started Building wheel for LNT (setup.py): finished with status 'done' Created wheel for LNT: filename=LNT-0.4.2.dev0-cp37-cp37m-macosx_10_14_x86_64.whl size=634994 sha256=9214be7782ef94701440a895f4037e69c3d06f2c88e78d58ceeb821923dc4db9 Stored in directory: /private/var/folders/09/r4vw4v8n5kb67jl66zvlbljw0000gn/T/pip-ephem-wheel-cache-2tp78yfv/wheels/97/b7/7b/c7ab2349e05f58114b44e8ab7bad91929b1db77d8836e24df6 Successfully built LNT Installing collected packages: six, MarkupSafe, Werkzeug, python-dateutil, Jinja2, itsdangerous, click, WTForms, urllib3, pytz, idna, Flask, charset-normalizer, certifi, aniso8601, typing, SQLAlchemy, requests, pyyaml, python-gnupg, lit, future, Flask-WTF, Flask-RESTful, LNT Attempting uninstall: lit Found existing installation: lit 12.0.1 Uninstalling lit-12.0.1: Successfully uninstalled lit-12.0.1 Successfully installed Flask-0.12.2 Flask-RESTful-0.3.4 Flask-WTF-0.12 Jinja2-2.7.2 LNT-0.4.2.dev0 MarkupSafe-0.23 SQLAlchemy-1.2.19 WTForms-2.0.2 Werkzeug-0.12.2 aniso8601-1.2.0 certifi-2021.5.30 charset-normalizer-2.0.6 click-6.7 future-0.18.2 idna-3.2 itsdangerous-0.24 lit-0.11.1 python-dateutil-2.8.2 python-gnupg-0.3.7 pytz-2016.10 pyyaml-5.1.2 requests-2.26.0 six-1.16.0 typing-3.7.4.3 urllib3-1.26.7 ++ echo @@@@@@ @@@@@@
+ LNT_FLAGS+=' --cmake-define TEST_SUITE_RUN_BENCHMARKS=Off' + LNT_FLAGS+=' --build-threads 1' + LNT_FLAGS+=' --cmake-define TEST_SUITE_SUBDIRS="CTMark"' + . /Users/buildslave/jenkins/workspace/lnt-ctmark-aarch64-Oz/config/tasks/utils/lnt_test_suite.sh ++ echo '@@@ LNT @@@'
LNT

Hide Details

@@@ LNT @@@ ++ mkdir lnt-sandbox ++ LNT_FLAGS+=' --sandbox /Users/buildslave/jenkins/workspace/lnt-ctmark-aarch64-Oz/lnt-sandbox' ++ LNT_FLAGS+=' --no-timestamp' ++ LNT_FLAGS+=' --use-lit=lit' ++ LNT_FLAGS+=' --cc /Users/buildslave/jenkins/workspace/lnt-ctmark-aarch64-Oz/compiler/bin/clang' ++ LNT_FLAGS+=' --cxx /Users/buildslave/jenkins/workspace/lnt-ctmark-aarch64-Oz/compiler/bin/clang++' ++ LNT_FLAGS+=' --test-suite=/Users/buildslave/jenkins/workspace/lnt-ctmark-aarch64-Oz/test-suite' ++ LNT_FLAGS+=' --cmake-define TEST_SUITE_BENCHMARKING_ONLY=On' ++ LNT_FLAGS+=' --output "/Users/buildslave/jenkins/workspace/lnt-ctmark-aarch64-Oz/lnt-sandbox/report.json"' ++ '[' -n green-dragon-12_lnt-ctmark-aarch64-Oz ']' ++ LNT_FLAGS+=' --no-auto-name '\''green-dragon-12_lnt-ctmark-aarch64-Oz'\''' ++ test -n 400152 ++ LNT_FLAGS+=' --run-order "400152"' ++ eval lnt runtest test-suite -C config/tasks/cmake/caches/target-arm64-iphoneos.cmake -C config/tasks/cmake/caches/opt-Oz.cmake --cmake-define TEST_SUITE_RUN_BENCHMARKS=Off --build-threads 1 --cmake-define 'TEST_SUITE_SUBDIRS="CTMark"' --sandbox /Users/buildslave/jenkins/workspace/lnt-ctmark-aarch64-Oz/lnt-sandbox --no-timestamp --use-lit=lit --cc /Users/buildslave/jenkins/workspace/lnt-ctmark-aarch64-Oz/compiler/bin/clang --cxx /Users/buildslave/jenkins/workspace/lnt-ctmark-aarch64-Oz/compiler/bin/clang++ --test-suite=/Users/buildslave/jenkins/workspace/lnt-ctmark-aarch64-Oz/test-suite --cmake-define TEST_SUITE_BENCHMARKING_ONLY=On --output '"/Users/buildslave/jenkins/workspace/lnt-ctmark-aarch64-Oz/lnt-sandbox/report.json"' --no-auto-name ''\''green-dragon-12_lnt-ctmark-aarch64-Oz'\''' --run-order '"400152"' +++ lnt runtest test-suite -C config/tasks/cmake/caches/target-arm64-iphoneos.cmake -C config/tasks/cmake/caches/opt-Oz.cmake --cmake-define TEST_SUITE_RUN_BENCHMARKS=Off --build-threads 1 --cmake-define TEST_SUITE_SUBDIRS=CTMark --sandbox /Users/buildslave/jenkins/workspace/lnt-ctmark-aarch64-Oz/lnt-sandbox --no-timestamp --use-lit=lit --cc /Users/buildslave/jenkins/workspace/lnt-ctmark-aarch64-Oz/compiler/bin/clang --cxx /Users/buildslave/jenkins/workspace/lnt-ctmark-aarch64-Oz/compiler/bin/clang++ --test-suite=/Users/buildslave/jenkins/workspace/lnt-ctmark-aarch64-Oz/test-suite --cmake-define TEST_SUITE_BENCHMARKING_ONLY=On --output /Users/buildslave/jenkins/workspace/lnt-ctmark-aarch64-Oz/lnt-sandbox/report.json --no-auto-name green-dragon-12_lnt-ctmark-aarch64-Oz --run-order 400152 2021-09-28 11:05:27 INFO: resolved command 'cmake' to path '/Users/buildslave/jenkins/workspace/lnt-ctmark-aarch64-Oz/config/tasks/bin/cmake' 2021-09-28 11:05:27 INFO: resolved command 'make' to path '/usr/bin/make' 2021-09-28 11:05:27 INFO: resolved command 'lit' to path '/Users/buildslave/jenkins/workspace/lnt-ctmark-aarch64-Oz/venv/bin/lit' 2021-09-28 11:05:27 INFO: Configuring with { 2021-09-28 11:05:27 INFO: CMAKE_CXX_COMPILER:FILEPATH: '/Users/buildslave/jenkins/workspace/lnt-ctmark-aarch64-Oz/compiler/bin/clang++' 2021-09-28 11:05:27 INFO: CMAKE_C_COMPILER:FILEPATH: '/Users/buildslave/jenkins/workspace/lnt-ctmark-aarch64-Oz/compiler/bin/clang' 2021-09-28 11:05:27 INFO: TEST_SUITE_BENCHMARKING_ONLY: 'On' 2021-09-28 11:05:27 INFO: TEST_SUITE_RUN_BENCHMARKS: 'Off' 2021-09-28 11:05:27 INFO: TEST_SUITE_SUBDIRS: 'CTMark' 2021-09-28 11:05:27 INFO: } 2021-09-28 11:05:27 INFO: Execute: /Users/buildslave/jenkins/workspace/lnt-ctmark-aarch64-Oz/config/tasks/bin/cmake -DCMAKE_C_COMPILER:FILEPATH=/Users/buildslave/jenkins/workspace/lnt-ctmark-aarch64-Oz/compiler/bin/clang -DCMAKE_CXX_COMPILER:FILEPATH=/Users/buildslave/jenkins/workspace/lnt-ctmark-aarch64-Oz/compiler/bin/clang++ -C /Users/buildslave/jenkins/workspace/lnt-ctmark-aarch64-Oz/config/tasks/cmake/caches/target-arm64-iphoneos.cmake -C /Users/buildslave/jenkins/workspace/lnt-ctmark-aarch64-Oz/config/tasks/cmake/caches/opt-Oz.cmake /Users/buildslave/jenkins/workspace/lnt-ctmark-aarch64-Oz/test-suite -DTEST_SUITE_RUN_BENCHMARKS=Off -DTEST_SUITE_SUBDIRS=CTMark -DTEST_SUITE_BENCHMARKING_ONLY=On 2021-09-28 11:05:27 INFO: (In /Users/buildslave/jenkins/workspace/lnt-ctmark-aarch64-Oz/lnt-sandbox/build) loading initial cache file /Users/buildslave/jenkins/workspace/lnt-ctmark-aarch64-Oz/config/tasks/cmake/caches/target-arm64-iphoneos.cmake loading initial cache file /Users/buildslave/jenkins/workspace/lnt-ctmark-aarch64-Oz/config/tasks/cmake/caches/opt-Oz.cmake -- The C compiler identification is Clang 14.0.0 -- The CXX compiler identification is Clang 14.0.0 -- Check for working C compiler: /Users/buildslave/jenkins/workspace/lnt-ctmark-aarch64-Oz/compiler/bin/clang -- Check for working C compiler: /Users/buildslave/jenkins/workspace/lnt-ctmark-aarch64-Oz/compiler/bin/clang - works -- Detecting C compiler ABI info -- Detecting C compiler ABI info - done -- Detecting C compile features -- Detecting C compile features - done -- Check for working CXX compiler: /Users/buildslave/jenkins/workspace/lnt-ctmark-aarch64-Oz/compiler/bin/clang++ -- Check for working CXX compiler: /Users/buildslave/jenkins/workspace/lnt-ctmark-aarch64-Oz/compiler/bin/clang++ - works -- Detecting CXX compiler ABI info -- Detecting CXX compiler ABI info - done -- Detecting CXX compile features -- Detecting CXX compile features - done -- Could NOT find OpenMP_C (missing: OpenMP_C_FLAGS OpenMP_C_LIB_NAMES) -- Could NOT find OpenMP_CXX (missing: OpenMP_CXX_FLAGS OpenMP_CXX_LIB_NAMES) -- Could NOT find OpenMP (missing: OpenMP_C_FOUND OpenMP_CXX_FOUND) -- Check target operating system - Darwin -- Check target system architecture: AArch64 -- Check if the system is big endian -- Searching 16 bit integer -- Looking for sys/types.h -- Looking for sys/types.h - found -- Looking for stdint.h -- Looking for stdint.h - found -- Looking for stddef.h -- Looking for stddef.h - found -- Check size of unsigned short -- Check size of unsigned short - done -- Searching 16 bit integer - Using unsigned short -- Check if the system is big endian - little endian -- Adding directory CTMark CMake Warning (dev) at /usr/local/Cellar/cmake/3.17.2/share/cmake/Modules/FindPackageHandleStandardArgs.cmake:272 (message): The package name passed to `find_package_handle_standard_args` (Tclsh) does not match the name of the calling package (TCL). This can lead to problems in calling code that expects `find_package` result variables (e.g., `_FOUND`) to follow a certain pattern. Call Stack (most recent call first): /usr/local/Cellar/cmake/3.17.2/share/cmake/Modules/FindTclsh.cmake:95 (FIND_PACKAGE_HANDLE_STANDARD_ARGS) /usr/local/Cellar/cmake/3.17.2/share/cmake/Modules/FindTCL.cmake:49 (include) CTMark/sqlite3/CMakeLists.txt:11 (find_package) This warning is for project developers. Use -Wno-dev to suppress it.

Hide Details

-- Found Tclsh: /usr/bin/tclsh (found version "8.5") -- Could NOT find TCL (missing: TCL_INCLUDE_PATH) -- Could NOT find TCLTK (missing: TCL_INCLUDE_PATH TK_INCLUDE_PATH) -- Could NOT find TK (missing: TK_INCLUDE_PATH) -- Configuring done -- Generating done -- Build files have been written to: /Users/buildslave/jenkins/workspace/lnt-ctmark-aarch64-Oz/lnt-sandbox/build 2021-09-28 11:05:31 INFO: Execute: /usr/bin/make clean 2021-09-28 11:05:31 INFO: (In /Users/buildslave/jenkins/workspace/lnt-ctmark-aarch64-Oz/lnt-sandbox/build) 2021-09-28 11:05:31 INFO: Execute: /Users/buildslave/jenkins/workspace/lnt-ctmark-aarch64-Oz/config/tasks/bin/cmake -LAH -N /Users/buildslave/jenkins/workspace/lnt-ctmark-aarch64-Oz/lnt-sandbox/build -- Cache values // Path to a program. CMAKE_ADDR2LINE:FILEPATH=/Users/buildslave/jenkins/workspace/lnt-ctmark-aarch64-Oz/compiler/bin/llvm-addr2line

Hide Details

// CMAKE_AR:STRING=/Users/buildslave/jenkins/workspace/lnt-ctmark-aarch64-Oz/lnt-sandbox/build/ar

Hide Details

// CMAKE_BUILD_TYPE:STRING=Release

Hide Details

// Enable/Disable color output during build. CMAKE_COLOR_MAKEFILE:BOOL=ON

Hide Details

// No help, variable specified on the command line. CMAKE_CXX_COMPILER:FILEPATH=/Users/buildslave/jenkins/workspace/lnt-ctmark-aarch64-Oz/compiler/bin/clang++

Hide Details

// LLVM archiver CMAKE_CXX_COMPILER_AR:FILEPATH=/Users/buildslave/jenkins/workspace/lnt-ctmark-aarch64-Oz/compiler/bin/llvm-ar

Hide Details

// Generate index for LLVM archive CMAKE_CXX_COMPILER_RANLIB:FILEPATH=/Users/buildslave/jenkins/workspace/lnt-ctmark-aarch64-Oz/compiler/bin/llvm-ranlib

Hide Details

// Flags used by the CXX compiler during all build types. CMAKE_CXX_FLAGS:STRING=

Hide Details

// Flags used by the CXX compiler during DEBUG builds. CMAKE_CXX_FLAGS_DEBUG:STRING=-g

Hide Details

// Flags used by the CXX compiler during MINSIZEREL builds. CMAKE_CXX_FLAGS_MINSIZEREL:STRING=-Os -DNDEBUG

Hide Details

// CMAKE_CXX_FLAGS_RELEASE:STRING= -Oz

Hide Details

// Flags used by the CXX compiler during RELWITHDEBINFO builds. CMAKE_CXX_FLAGS_RELWITHDEBINFO:STRING=-O2 -g -DNDEBUG

Hide Details

// No help, variable specified on the command line. CMAKE_C_COMPILER:FILEPATH=/Users/buildslave/jenkins/workspace/lnt-ctmark-aarch64-Oz/compiler/bin/clang

Hide Details

// LLVM archiver CMAKE_C_COMPILER_AR:FILEPATH=/Users/buildslave/jenkins/workspace/lnt-ctmark-aarch64-Oz/compiler/bin/llvm-ar

Hide Details

// Generate index for LLVM archive CMAKE_C_COMPILER_RANLIB:FILEPATH=/Users/buildslave/jenkins/workspace/lnt-ctmark-aarch64-Oz/compiler/bin/llvm-ranlib

Hide Details

// Flags used by the C compiler during all build types. CMAKE_C_FLAGS:STRING=

Hide Details

// Flags used by the C compiler during DEBUG builds. CMAKE_C_FLAGS_DEBUG:STRING=-g

Hide Details

// Flags used by the C compiler during MINSIZEREL builds. CMAKE_C_FLAGS_MINSIZEREL:STRING=-Os -DNDEBUG

Hide Details

// CMAKE_C_FLAGS_RELEASE:STRING= -Oz

Hide Details

// Flags used by the C compiler during RELWITHDEBINFO builds. CMAKE_C_FLAGS_RELWITHDEBINFO:STRING=-O2 -g -DNDEBUG

Hide Details

// Path to a program. CMAKE_DLLTOOL:FILEPATH=/Users/buildslave/jenkins/workspace/lnt-ctmark-aarch64-Oz/compiler/bin/llvm-dlltool

Hide Details

// Executable file format CMAKE_EXECUTABLE_FORMAT:STRING=MACHO

Hide Details

// Flags used by the linker during all build types. CMAKE_EXE_LINKER_FLAGS:STRING=

Hide Details

// Flags used by the linker during DEBUG builds. CMAKE_EXE_LINKER_FLAGS_DEBUG:STRING=

Hide Details

// Flags used by the linker during MINSIZEREL builds. CMAKE_EXE_LINKER_FLAGS_MINSIZEREL:STRING=

Hide Details

// Flags used by the linker during RELEASE builds. CMAKE_EXE_LINKER_FLAGS_RELEASE:STRING=

Hide Details

// Flags used by the linker during RELWITHDEBINFO builds. CMAKE_EXE_LINKER_FLAGS_RELWITHDEBINFO:STRING=

Hide Details

// Enable/Disable output of compile commands during generation. CMAKE_EXPORT_COMPILE_COMMANDS:BOOL=

Hide Details

// Path to a program. CMAKE_INSTALL_NAME_TOOL:FILEPATH=/usr/bin/install_name_tool

Hide Details

// Install path prefix, prepended onto install directories. CMAKE_INSTALL_PREFIX:PATH=/usr/local

Hide Details

// CMAKE_LINKER:STRING=/Applications/Xcode.app/Contents/Developer/Toolchains/XcodeDefault.xctoolchain/usr/bin/ld

Hide Details

// Path to a program. CMAKE_MAKE_PROGRAM:FILEPATH=/usr/bin/make

Hide Details

// Flags used by the linker during the creation of modules during all build types. CMAKE_MODULE_LINKER_FLAGS:STRING=

Hide Details

// Flags used by the linker during the creation of modules during DEBUG builds. CMAKE_MODULE_LINKER_FLAGS_DEBUG:STRING=

Hide Details

// Flags used by the linker during the creation of modules during MINSIZEREL builds. CMAKE_MODULE_LINKER_FLAGS_MINSIZEREL:STRING=

Hide Details

// Flags used by the linker during the creation of modules during RELEASE builds. CMAKE_MODULE_LINKER_FLAGS_RELEASE:STRING=

Hide Details

// Flags used by the linker during the creation of modules during RELWITHDEBINFO builds. CMAKE_MODULE_LINKER_FLAGS_RELWITHDEBINFO:STRING=

Hide Details

// CMAKE_NM:STRING=/Users/buildslave/jenkins/workspace/lnt-ctmark-aarch64-Oz/lnt-sandbox/build/nm

Hide Details

// Path to a program. CMAKE_OBJCOPY:FILEPATH=/Users/buildslave/jenkins/workspace/lnt-ctmark-aarch64-Oz/compiler/bin/llvm-objcopy

Hide Details

// Path to a program. CMAKE_OBJDUMP:FILEPATH=/usr/bin/objdump

Hide Details

// CMAKE_OSX_ARCHITECTURES:STRING=arm64

Hide Details

// Minimum OS X version to target for deployment (at runtime); newer APIs weak linked. Set to empty string for default value. CMAKE_OSX_DEPLOYMENT_TARGET:STRING=

Hide Details

// CMAKE_OSX_SYSROOT:STRING=/Applications/Xcode.app/Contents/Developer/Platforms/iPhoneOS.platform/Developer/SDKs/iPhoneOS13.5.sdk

Hide Details

// CMAKE_RANLIB:STRING=/Users/buildslave/jenkins/workspace/lnt-ctmark-aarch64-Oz/lnt-sandbox/build/ranlib

Hide Details

// Path to a program. CMAKE_READELF:FILEPATH=/Users/buildslave/jenkins/workspace/lnt-ctmark-aarch64-Oz/compiler/bin/llvm-readelf

Hide Details

// Flags used by the linker during the creation of shared libraries during all build types. CMAKE_SHARED_LINKER_FLAGS:STRING=

Hide Details

// Flags used by the linker during the creation of shared libraries during DEBUG builds. CMAKE_SHARED_LINKER_FLAGS_DEBUG:STRING=

Hide Details

// Flags used by the linker during the creation of shared libraries during MINSIZEREL builds. CMAKE_SHARED_LINKER_FLAGS_MINSIZEREL:STRING=

Hide Details

// Flags used by the linker during the creation of shared libraries during RELEASE builds. CMAKE_SHARED_LINKER_FLAGS_RELEASE:STRING=

Hide Details

// Flags used by the linker during the creation of shared libraries during RELWITHDEBINFO builds. CMAKE_SHARED_LINKER_FLAGS_RELWITHDEBINFO:STRING=

Hide Details

// If set, runtime paths are not added when installing shared libraries, but are added when building. CMAKE_SKIP_INSTALL_RPATH:BOOL=NO

Hide Details

// If set, runtime paths are not added when using shared libraries. CMAKE_SKIP_RPATH:BOOL=NO

Hide Details

// Flags used by the linker during the creation of static libraries during all build types. CMAKE_STATIC_LINKER_FLAGS:STRING=

Hide Details

// Flags used by the linker during the creation of static libraries during DEBUG builds. CMAKE_STATIC_LINKER_FLAGS_DEBUG:STRING=

Hide Details

// Flags used by the linker during the creation of static libraries during MINSIZEREL builds. CMAKE_STATIC_LINKER_FLAGS_MINSIZEREL:STRING=

Hide Details

// Flags used by the linker during the creation of static libraries during RELEASE builds. CMAKE_STATIC_LINKER_FLAGS_RELEASE:STRING=

Hide Details

// Flags used by the linker during the creation of static libraries during RELWITHDEBINFO builds. CMAKE_STATIC_LINKER_FLAGS_RELWITHDEBINFO:STRING=

Hide Details

// CMAKE_STRIP:STRING=/Users/buildslave/jenkins/workspace/lnt-ctmark-aarch64-Oz/lnt-sandbox/build/strip

Hide Details

// The CMake toolchain file CMAKE_TOOLCHAIN_FILE:FILEPATH=/Users/buildslave/jenkins/workspace/lnt-ctmark-aarch64-Oz/config/tasks/cmake/caches/util/arch_flags_toolchain.cmake

Hide Details

// CMAKE_TRY_COMPILE_PLATFORM_VARIABLES:STRING=TEST_SUITE_ARCH_FLAGS_FORWARD

Hide Details

// CMAKE_TRY_COMPILE_TARGET_TYPE:STRING=STATIC_LIBRARY

Hide Details

// If this value is on, makefiles will be generated without the .SILENT directive, and all commands will be echoed to the console during the make. This is useful for debugging only. With Visual Studio IDE projects all commands are done without /nologo. CMAKE_VERBOSE_MAKEFILE:BOOL=FALSE

Hide Details

// NO HAVE_RE_COMP:BOOL=

Hide Details

// Sign executables and dylibs with the given identity or skip if empty (Darwin Only) LLVM_CODESIGNING_IDENTITY:STRING=

Hide Details

// CXX compiler flags for OpenMP parallelization OpenMP_CXX_FLAGS:STRING=NOTFOUND

Hide Details

// CXX compiler libraries for OpenMP parallelization OpenMP_CXX_LIB_NAMES:STRING=NOTFOUND

Hide Details

// C compiler flags for OpenMP parallelization OpenMP_C_FLAGS:STRING=NOTFOUND

Hide Details

// C compiler libraries for OpenMP parallelization OpenMP_C_LIB_NAMES:STRING=NOTFOUND

Hide Details

// SDK_RANLIB:STRING=/Applications/Xcode.app/Contents/Developer/Toolchains/XcodeDefault.xctoolchain/usr/bin/ranlib

Hide Details

// Path to a file. TCL_INCLUDE_PATH:PATH=TCL_INCLUDE_PATH-NOTFOUND

Hide Details

// Path to a library. TCL_LIBRARY:FILEPATH=/usr/lib/libtcl.dylib

Hide Details

// Path to a program. TCL_TCLSH:FILEPATH=/usr/bin/tclsh

Hide Details

// TEST_SUITE_ARCH_FLAGS:STRING= -B /Applications/Xcode.app/Contents/Developer/Toolchains/XcodeDefault.xctoolchain/usr/bin

Hide Details

// TEST_SUITE_ARCH_FLAGS_FORWARD:STRING= -B /Applications/Xcode.app/Contents/Developer/Toolchains/XcodeDefault.xctoolchain/usr/bin

Hide Details

// Only run the benchmarking only subset TEST_SUITE_BENCHMARKING_ONLY:BOOL=On

Hide Details

// Measure code size of binaries TEST_SUITE_COLLECT_CODE_SIZE:BOOL=ON

Hide Details

// Measure compile time by wrapping compiler invocations in timeit TEST_SUITE_COLLECT_COMPILE_TIME:BOOL=ON

Hide Details

// Collect LLVM statistics TEST_SUITE_COLLECT_STATS:BOOL=OFF

Hide Details

// Always copy benchmark data to builddir TEST_SUITE_COPY_DATA:BOOL=OFF

Hide Details

// Extra flags appended to CMAKE_C_FLAGS + CMAKE_CXX_FLAGS + CMAKE_Fortran_FLAGS TEST_SUITE_DIAGNOSE_FLAGS:STRING=

Hide Details

// Extra flags appended to CMAKE_EXE_LINKER_FLAGS TEST_SUITE_DIAGNOSE_LINKER_FLAGS:STRING=

Hide Details

// Disable position independent executables and ASLR TEST_SUITE_DISABLE_PIE:BOOL=ON

Hide Details

// Extra flags for CMAKE_CXX_FLAGS TEST_SUITE_EXTRA_CXX_FLAGS:STRING=

Hide Details

// Extra flags for CMAKE_C_FLAGS TEST_SUITE_EXTRA_C_FLAGS:STRING=

Hide Details

// Extra flags for CMAKE_EXE_LINKER_FLAGS TEST_SUITE_EXTRA_EXE_LINKER_FLAGS:STRING=

Hide Details

// Semicolon separated list of extra lit modules in use TEST_SUITE_EXTRA_LIT_MODULES:STRING=

Hide Details

// Enable Fortran test suite TEST_SUITE_FORTRAN:BOOL=OFF

Hide Details

// C compiler targetting the host TEST_SUITE_HOST_CC:STRING=cc

Hide Details

// Path to a program. TEST_SUITE_LIT:FILEPATH=/Users/buildslave/jenkins/workspace/lnt-ctmark-aarch64-Oz/venv/bin/lit

Hide Details

// Flags used when running lit TEST_SUITE_LIT_FLAGS:STRING=-sv

Hide Details

// Path to a program. TEST_SUITE_LLVM_SIZE:FILEPATH=/Users/buildslave/jenkins/workspace/lnt-ctmark-aarch64-Oz/compiler/bin/llvm-size

Hide Details

// Enable lit profile generate mode TEST_SUITE_PROFILE_GENERATE:BOOL=OFF

Hide Details

// Add apropriate -fprofile-instr-use to CFLAGS/CXXFLAGS for each benchmark TEST_SUITE_PROFILE_USE:BOOL=OFF

Hide Details

// Remote execution client TEST_SUITE_REMOTE_CLIENT:STRING=ssh

Hide Details

// Remote execution host TEST_SUITE_REMOTE_HOST:STRING=

Hide Details

// Actually run the benchmarks in lit TEST_SUITE_RUN_BENCHMARKS:BOOL=Off

Hide Details

// Type of benchmark inputs (may be test,train or ref) TEST_SUITE_RUN_TYPE:STRING=train

Hide Details

// RunSafely.sh run-under (-u) parameter TEST_SUITE_RUN_UNDER:STRING=

Hide Details

// Semicolon separated list of directories with CMakeLists.txt to include TEST_SUITE_SUBDIRS:STRING=CTMark

Hide Details

// Suppress all warnings TEST_SUITE_SUPPRESS_WARNINGS:BOOL=ON

Hide Details

// RUN_UNDER is used to run tests under emulation. TEST_SUITE_USER_MODE_EMULATION:BOOL=NO

Hide Details

// Use IR PGO instrumentation (requires TEST_SUITE_PROFILE_GENERATE) TEST_SUITE_USE_IR_PGO:BOOL=OFF

Hide Details

// Use perf (timeit.sh) instead of timeit.c TEST_SUITE_USE_PERF:BOOL=OFF

Hide Details

// Path to a file. TK_INCLUDE_PATH:PATH=TK_INCLUDE_PATH-NOTFOUND

Hide Details

// Path to a library. TK_LIBRARY:FILEPATH=/usr/lib/libtk.dylib

Hide Details

// Path to a program. TK_WISH:FILEPATH=/usr/bin/wish

Hide Details

2021-09-28 11:05:31 INFO: Using nickname: 'green-dragon-12_lnt-ctmark-aarch64-Oz' 2021-09-28 11:05:31 INFO: Building... 2021-09-28 11:05:31 INFO: Execute: /usr/bin/make -k -j 1 VERBOSE=1 all 2021-09-28 11:05:31 INFO: (In /Users/buildslave/jenkins/workspace/lnt-ctmark-aarch64-Oz/lnt-sandbox/build) /usr/local/Cellar/cmake/3.17.2/bin/cmake -S/Users/buildslave/jenkins/workspace/lnt-ctmark-aarch64-Oz/test-suite -B/Users/buildslave/jenkins/workspace/lnt-ctmark-aarch64-Oz/lnt-sandbox/build --check-build-system CMakeFiles/Makefile.cmake 0 /usr/local/Cellar/cmake/3.17.2/bin/cmake -E cmake_progress_start /Users/buildslave/jenkins/workspace/lnt-ctmark-aarch64-Oz/lnt-sandbox/build/CMakeFiles /Users/buildslave/jenkins/workspace/lnt-ctmark-aarch64-Oz/lnt-sandbox/build/CMakeFiles/progress.marks /Applications/Xcode.app/Contents/Developer/usr/bin/make -f CMakeFiles/Makefile2 all /Applications/Xcode.app/Contents/Developer/usr/bin/make -f tools/CMakeFiles/timeit-target.dir/build.make tools/CMakeFiles/timeit-target.dir/depend cd /Users/buildslave/jenkins/workspace/lnt-ctmark-aarch64-Oz/lnt-sandbox/build && /usr/local/Cellar/cmake/3.17.2/bin/cmake -E cmake_depends "Unix Makefiles" /Users/buildslave/jenkins/workspace/lnt-ctmark-aarch64-Oz/test-suite /Users/buildslave/jenkins/workspace/lnt-ctmark-aarch64-Oz/test-suite/tools /Users/buildslave/jenkins/workspace/lnt-ctmark-aarch64-Oz/lnt-sandbox/build /Users/buildslave/jenkins/workspace/lnt-ctmark-aarch64-Oz/lnt-sandbox/build/tools /Users/buildslave/jenkins/workspace/lnt-ctmark-aarch64-Oz/lnt-sandbox/build/tools/CMakeFiles/timeit-target.dir/DependInfo.cmake --color= Dependee "/Users/buildslave/jenkins/workspace/lnt-ctmark-aarch64-Oz/lnt-sandbox/build/tools/CMakeFiles/timeit-target.dir/DependInfo.cmake" is newer than depender "/Users/buildslave/jenkins/workspace/lnt-ctmark-aarch64-Oz/lnt-sandbox/build/tools/CMakeFiles/timeit-target.dir/depend.internal". Dependee "/Users/buildslave/jenkins/workspace/lnt-ctmark-aarch64-Oz/lnt-sandbox/build/tools/CMakeFiles/CMakeDirectoryInformation.cmake" is newer than depender "/Users/buildslave/jenkins/workspace/lnt-ctmark-aarch64-Oz/lnt-sandbox/build/tools/CMakeFiles/timeit-target.dir/depend.internal". Scanning dependencies of target timeit-target /Applications/Xcode.app/Contents/Developer/usr/bin/make -f tools/CMakeFiles/timeit-target.dir/build.make tools/CMakeFiles/timeit-target.dir/build [ 0%] Building C object tools/CMakeFiles/timeit-target.dir/timeit.c.o cd /Users/buildslave/jenkins/workspace/lnt-ctmark-aarch64-Oz/lnt-sandbox/build/tools && /Users/buildslave/jenkins/workspace/lnt-ctmark-aarch64-Oz/compiler/bin/clang -DNDEBUG -B /Applications/Xcode.app/Contents/Developer/Toolchains/XcodeDefault.xctoolchain/usr/bin -Oz -arch arm64 -isysroot /Applications/Xcode.app/Contents/Developer/Platforms/iPhoneOS.platform/Developer/SDKs/iPhoneOS13.5.sdk -w -Werror=date-time -o CMakeFiles/timeit-target.dir/timeit.c.o -c /Users/buildslave/jenkins/workspace/lnt-ctmark-aarch64-Oz/test-suite/tools/timeit.c [ 0%] Linking C executable timeit-target cd /Users/buildslave/jenkins/workspace/lnt-ctmark-aarch64-Oz/lnt-sandbox/build/tools && /usr/local/Cellar/cmake/3.17.2/bin/cmake -E cmake_link_script CMakeFiles/timeit-target.dir/link.txt --verbose=1 /Users/buildslave/jenkins/workspace/lnt-ctmark-aarch64-Oz/compiler/bin/clang -B /Applications/Xcode.app/Contents/Developer/Toolchains/XcodeDefault.xctoolchain/usr/bin -Oz -arch arm64 -isysroot /Applications/Xcode.app/Contents/Developer/Platforms/iPhoneOS.platform/Developer/SDKs/iPhoneOS13.5.sdk -Wl,-search_paths_first -Wl,-headerpad_max_install_names -B /Applications/Xcode.app/Contents/Developer/Toolchains/XcodeDefault.xctoolchain/usr/bin CMakeFiles/timeit-target.dir/timeit.c.o -o timeit-target [ 0%] Built target timeit-target /Applications/Xcode.app/Contents/Developer/usr/bin/make -f tools/CMakeFiles/fpcmp-target.dir/build.make tools/CMakeFiles/fpcmp-target.dir/depend cd /Users/buildslave/jenkins/workspace/lnt-ctmark-aarch64-Oz/lnt-sandbox/build && /usr/local/Cellar/cmake/3.17.2/bin/cmake -E cmake_depends "Unix Makefiles" /Users/buildslave/jenkins/workspace/lnt-ctmark-aarch64-Oz/test-suite /Users/buildslave/jenkins/workspace/lnt-ctmark-aarch64-Oz/test-suite/tools /Users/buildslave/jenkins/workspace/lnt-ctmark-aarch64-Oz/lnt-sandbox/build /Users/buildslave/jenkins/workspace/lnt-ctmark-aarch64-Oz/lnt-sandbox/build/tools /Users/buildslave/jenkins/workspace/lnt-ctmark-aarch64-Oz/lnt-sandbox/build/tools/CMakeFiles/fpcmp-target.dir/DependInfo.cmake --color= Dependee "/Users/buildslave/jenkins/workspace/lnt-ctmark-aarch64-Oz/lnt-sandbox/build/tools/CMakeFiles/fpcmp-target.dir/DependInfo.cmake" is newer than depender "/Users/buildslave/jenkins/workspace/lnt-ctmark-aarch64-Oz/lnt-sandbox/build/tools/CMakeFiles/fpcmp-target.dir/depend.internal". Dependee "/Users/buildslave/jenkins/workspace/lnt-ctmark-aarch64-Oz/lnt-sandbox/build/tools/CMakeFiles/CMakeDirectoryInformation.cmake" is newer than depender "/Users/buildslave/jenkins/workspace/lnt-ctmark-aarch64-Oz/lnt-sandbox/build/tools/CMakeFiles/fpcmp-target.dir/depend.internal". Scanning dependencies of target fpcmp-target /Applications/Xcode.app/Contents/Developer/usr/bin/make -f tools/CMakeFiles/fpcmp-target.dir/build.make tools/CMakeFiles/fpcmp-target.dir/build [ 0%] Building C object tools/CMakeFiles/fpcmp-target.dir/fpcmp.c.o cd /Users/buildslave/jenkins/workspace/lnt-ctmark-aarch64-Oz/lnt-sandbox/build/tools && /Users/buildslave/jenkins/workspace/lnt-ctmark-aarch64-Oz/compiler/bin/clang -DNDEBUG -B /Applications/Xcode.app/Contents/Developer/Toolchains/XcodeDefault.xctoolchain/usr/bin -Oz -arch arm64 -isysroot /Applications/Xcode.app/Contents/Developer/Platforms/iPhoneOS.platform/Developer/SDKs/iPhoneOS13.5.sdk -w -Werror=date-time -o CMakeFiles/fpcmp-target.dir/fpcmp.c.o -c /Users/buildslave/jenkins/workspace/lnt-ctmark-aarch64-Oz/test-suite/tools/fpcmp.c [ 1%] Linking C executable fpcmp-target cd /Users/buildslave/jenkins/workspace/lnt-ctmark-aarch64-Oz/lnt-sandbox/build/tools && /usr/local/Cellar/cmake/3.17.2/bin/cmake -E cmake_link_script CMakeFiles/fpcmp-target.dir/link.txt --verbose=1 /Users/buildslave/jenkins/workspace/lnt-ctmark-aarch64-Oz/compiler/bin/clang -B /Applications/Xcode.app/Contents/Developer/Toolchains/XcodeDefault.xctoolchain/usr/bin -Oz -arch arm64 -isysroot /Applications/Xcode.app/Contents/Developer/Platforms/iPhoneOS.platform/Developer/SDKs/iPhoneOS13.5.sdk -Wl,-search_paths_first -Wl,-headerpad_max_install_names -B /Applications/Xcode.app/Contents/Developer/Toolchains/XcodeDefault.xctoolchain/usr/bin CMakeFiles/fpcmp-target.dir/fpcmp.c.o -o fpcmp-target Undefined symbols for architecture arm64: "_isspace.inline", referenced from: _skip_whitespace in fpcmp.c.o ld: symbol(s) not found for architecture arm64 clang-14: error: linker command failed with exit code 1 (use -v to see invocation) make[2]: *** [tools/fpcmp-target] Error 1 make[2]: Target `tools/CMakeFiles/fpcmp-target.dir/build' not remade because of errors. make[1]: *** [tools/CMakeFiles/fpcmp-target.dir/all] Error 2 /Applications/Xcode.app/Contents/Developer/usr/bin/make -f tools/CMakeFiles/build-timeit.dir/build.make tools/CMakeFiles/build-timeit.dir/depend cd /Users/buildslave/jenkins/workspace/lnt-ctmark-aarch64-Oz/lnt-sandbox/build && /usr/local/Cellar/cmake/3.17.2/bin/cmake -E cmake_depends "Unix Makefiles" /Users/buildslave/jenkins/workspace/lnt-ctmark-aarch64-Oz/test-suite /Users/buildslave/jenkins/workspace/lnt-ctmark-aarch64-Oz/test-suite/tools /Users/buildslave/jenkins/workspace/lnt-ctmark-aarch64-Oz/lnt-sandbox/build /Users/buildslave/jenkins/workspace/lnt-ctmark-aarch64-Oz/lnt-sandbox/build/tools /Users/buildslave/jenkins/workspace/lnt-ctmark-aarch64-Oz/lnt-sandbox/build/tools/CMakeFiles/build-timeit.dir/DependInfo.cmake --color= Dependee "/Users/buildslave/jenkins/workspace/lnt-ctmark-aarch64-Oz/lnt-sandbox/build/tools/CMakeFiles/build-timeit.dir/DependInfo.cmake" is newer than depender "/Users/buildslave/jenkins/workspace/lnt-ctmark-aarch64-Oz/lnt-sandbox/build/tools/CMakeFiles/build-timeit.dir/depend.internal". Dependee "/Users/buildslave/jenkins/workspace/lnt-ctmark-aarch64-Oz/lnt-sandbox/build/tools/CMakeFiles/CMakeDirectoryInformation.cmake" is newer than depender "/Users/buildslave/jenkins/workspace/lnt-ctmark-aarch64-Oz/lnt-sandbox/build/tools/CMakeFiles/build-timeit.dir/depend.internal". Scanning dependencies of target build-timeit /Applications/Xcode.app/Contents/Developer/usr/bin/make -f tools/CMakeFiles/build-timeit.dir/build.make tools/CMakeFiles/build-timeit.dir/build [ 2%] [TEST_SUITE_HOST_CC] Compiling host source timeit.c cd /Users/buildslave/jenkins/workspace/lnt-ctmark-aarch64-Oz/lnt-sandbox/build/tools && cc -c /Users/buildslave/jenkins/workspace/lnt-ctmark-aarch64-Oz/test-suite/tools/timeit.c -o /Users/buildslave/jenkins/workspace/lnt-ctmark-aarch64-Oz/lnt-sandbox/build/tools/timeit.c.o [ 2%] [TEST_SUITE_HOST_CC] Linking host executable timeit cd /Users/buildslave/jenkins/workspace/lnt-ctmark-aarch64-Oz/lnt-sandbox/build/tools && cc /Users/buildslave/jenkins/workspace/lnt-ctmark-aarch64-Oz/lnt-sandbox/build/tools/timeit.c.o -o /Users/buildslave/jenkins/workspace/lnt-ctmark-aarch64-Oz/lnt-sandbox/build/tools/timeit [ 2%] Built target build-timeit /Applications/Xcode.app/Contents/Developer/usr/bin/make -f litsupport/CMakeFiles/build-litsupport.dir/build.make litsupport/CMakeFiles/build-litsupport.dir/depend cd /Users/buildslave/jenkins/workspace/lnt-ctmark-aarch64-Oz/lnt-sandbox/build && /usr/local/Cellar/cmake/3.17.2/bin/cmake -E cmake_depends "Unix Makefiles" /Users/buildslave/jenkins/workspace/lnt-ctmark-aarch64-Oz/test-suite /Users/buildslave/jenkins/workspace/lnt-ctmark-aarch64-Oz/test-suite/litsupport /Users/buildslave/jenkins/workspace/lnt-ctmark-aarch64-Oz/lnt-sandbox/build /Users/buildslave/jenkins/workspace/lnt-ctmark-aarch64-Oz/lnt-sandbox/build/litsupport /Users/buildslave/jenkins/workspace/lnt-ctmark-aarch64-Oz/lnt-sandbox/build/litsupport/CMakeFiles/build-litsupport.dir/DependInfo.cmake --color= Dependee "/Users/buildslave/jenkins/workspace/lnt-ctmark-aarch64-Oz/lnt-sandbox/build/litsupport/CMakeFiles/build-litsupport.dir/DependInfo.cmake" is newer than depender "/Users/buildslave/jenkins/workspace/lnt-ctmark-aarch64-Oz/lnt-sandbox/build/litsupport/CMakeFiles/build-litsupport.dir/depend.internal". Dependee "/Users/buildslave/jenkins/workspace/lnt-ctmark-aarch64-Oz/lnt-sandbox/build/litsupport/CMakeFiles/CMakeDirectoryInformation.cmake" is newer than depender "/Users/buildslave/jenkins/workspace/lnt-ctmark-aarch64-Oz/lnt-sandbox/build/litsupport/CMakeFiles/build-litsupport.dir/depend.internal". Scanning dependencies of target build-litsupport /Applications/Xcode.app/Contents/Developer/usr/bin/make -f litsupport/CMakeFiles/build-litsupport.dir/build.make litsupport/CMakeFiles/build-litsupport.dir/build [ 3%] Generating __init__.py cd /Users/buildslave/jenkins/workspace/lnt-ctmark-aarch64-Oz/lnt-sandbox/build/litsupport && /usr/local/Cellar/cmake/3.17.2/bin/cmake -E copy /Users/buildslave/jenkins/workspace/lnt-ctmark-aarch64-Oz/test-suite/litsupport/__init__.py /Users/buildslave/jenkins/workspace/lnt-ctmark-aarch64-Oz/lnt-sandbox/build/litsupport/__init__.py [ 3%] Generating shellcommand.py cd /Users/buildslave/jenkins/workspace/lnt-ctmark-aarch64-Oz/lnt-sandbox/build/litsupport && /usr/local/Cellar/cmake/3.17.2/bin/cmake -E copy /Users/buildslave/jenkins/workspace/lnt-ctmark-aarch64-Oz/test-suite/litsupport/shellcommand.py /Users/buildslave/jenkins/workspace/lnt-ctmark-aarch64-Oz/lnt-sandbox/build/litsupport/shellcommand.py [ 3%] Generating testfile.py cd /Users/buildslave/jenkins/workspace/lnt-ctmark-aarch64-Oz/lnt-sandbox/build/litsupport && /usr/local/Cellar/cmake/3.17.2/bin/cmake -E copy /Users/buildslave/jenkins/workspace/lnt-ctmark-aarch64-Oz/test-suite/litsupport/testfile.py /Users/buildslave/jenkins/workspace/lnt-ctmark-aarch64-Oz/lnt-sandbox/build/litsupport/testfile.py [ 3%] Generating testplan.py cd /Users/buildslave/jenkins/workspace/lnt-ctmark-aarch64-Oz/lnt-sandbox/build/litsupport && /usr/local/Cellar/cmake/3.17.2/bin/cmake -E copy /Users/buildslave/jenkins/workspace/lnt-ctmark-aarch64-Oz/test-suite/litsupport/testplan.py /Users/buildslave/jenkins/workspace/lnt-ctmark-aarch64-Oz/lnt-sandbox/build/litsupport/testplan.py [ 3%] Generating test.py cd /Users/buildslave/jenkins/workspace/lnt-ctmark-aarch64-Oz/lnt-sandbox/build/litsupport && /usr/local/Cellar/cmake/3.17.2/bin/cmake -E copy /Users/buildslave/jenkins/workspace/lnt-ctmark-aarch64-Oz/test-suite/litsupport/test.py /Users/buildslave/jenkins/workspace/lnt-ctmark-aarch64-Oz/lnt-sandbox/build/litsupport/test.py [ 3%] Generating modules/codesize.py cd /Users/buildslave/jenkins/workspace/lnt-ctmark-aarch64-Oz/lnt-sandbox/build/litsupport && /usr/local/Cellar/cmake/3.17.2/bin/cmake -E copy /Users/buildslave/jenkins/workspace/lnt-ctmark-aarch64-Oz/test-suite/litsupport/modules/codesize.py /Users/buildslave/jenkins/workspace/lnt-ctmark-aarch64-Oz/lnt-sandbox/build/litsupport/modules/codesize.py [ 3%] Generating modules/compiletime.py cd /Users/buildslave/jenkins/workspace/lnt-ctmark-aarch64-Oz/lnt-sandbox/build/litsupport && /usr/local/Cellar/cmake/3.17.2/bin/cmake -E copy /Users/buildslave/jenkins/workspace/lnt-ctmark-aarch64-Oz/test-suite/litsupport/modules/compiletime.py /Users/buildslave/jenkins/workspace/lnt-ctmark-aarch64-Oz/lnt-sandbox/build/litsupport/modules/compiletime.py [ 4%] Generating modules/hash.py cd /Users/buildslave/jenkins/workspace/lnt-ctmark-aarch64-Oz/lnt-sandbox/build/litsupport && /usr/local/Cellar/cmake/3.17.2/bin/cmake -E copy /Users/buildslave/jenkins/workspace/lnt-ctmark-aarch64-Oz/test-suite/litsupport/modules/hash.py /Users/buildslave/jenkins/workspace/lnt-ctmark-aarch64-Oz/lnt-sandbox/build/litsupport/modules/hash.py [ 4%] Generating modules/hpmcount.py cd /Users/buildslave/jenkins/workspace/lnt-ctmark-aarch64-Oz/lnt-sandbox/build/litsupport && /usr/local/Cellar/cmake/3.17.2/bin/cmake -E copy /Users/buildslave/jenkins/workspace/lnt-ctmark-aarch64-Oz/test-suite/litsupport/modules/hpmcount.py /Users/buildslave/jenkins/workspace/lnt-ctmark-aarch64-Oz/lnt-sandbox/build/litsupport/modules/hpmcount.py [ 4%] Generating modules/__init__.py cd /Users/buildslave/jenkins/workspace/lnt-ctmark-aarch64-Oz/lnt-sandbox/build/litsupport && /usr/local/Cellar/cmake/3.17.2/bin/cmake -E copy /Users/buildslave/jenkins/workspace/lnt-ctmark-aarch64-Oz/test-suite/litsupport/modules/__init__.py /Users/buildslave/jenkins/workspace/lnt-ctmark-aarch64-Oz/lnt-sandbox/build/litsupport/modules/__init__.py [ 4%] Generating modules/microbenchmark.py cd /Users/buildslave/jenkins/workspace/lnt-ctmark-aarch64-Oz/lnt-sandbox/build/litsupport && /usr/local/Cellar/cmake/3.17.2/bin/cmake -E copy /Users/buildslave/jenkins/workspace/lnt-ctmark-aarch64-Oz/test-suite/litsupport/modules/microbenchmark.py /Users/buildslave/jenkins/workspace/lnt-ctmark-aarch64-Oz/lnt-sandbox/build/litsupport/modules/microbenchmark.py [ 4%] Generating modules/perf.py cd /Users/buildslave/jenkins/workspace/lnt-ctmark-aarch64-Oz/lnt-sandbox/build/litsupport && /usr/local/Cellar/cmake/3.17.2/bin/cmake -E copy /Users/buildslave/jenkins/workspace/lnt-ctmark-aarch64-Oz/test-suite/litsupport/modules/perf.py /Users/buildslave/jenkins/workspace/lnt-ctmark-aarch64-Oz/lnt-sandbox/build/litsupport/modules/perf.py [ 4%] Generating modules/profilegen.py cd /Users/buildslave/jenkins/workspace/lnt-ctmark-aarch64-Oz/lnt-sandbox/build/litsupport && /usr/local/Cellar/cmake/3.17.2/bin/cmake -E copy /Users/buildslave/jenkins/workspace/lnt-ctmark-aarch64-Oz/test-suite/litsupport/modules/profilegen.py /Users/buildslave/jenkins/workspace/lnt-ctmark-aarch64-Oz/lnt-sandbox/build/litsupport/modules/profilegen.py [ 5%] Generating modules/remote.py cd /Users/buildslave/jenkins/workspace/lnt-ctmark-aarch64-Oz/lnt-sandbox/build/litsupport && /usr/local/Cellar/cmake/3.17.2/bin/cmake -E copy /Users/buildslave/jenkins/workspace/lnt-ctmark-aarch64-Oz/test-suite/litsupport/modules/remote.py /Users/buildslave/jenkins/workspace/lnt-ctmark-aarch64-Oz/lnt-sandbox/build/litsupport/modules/remote.py [ 5%] Generating modules/run.py cd /Users/buildslave/jenkins/workspace/lnt-ctmark-aarch64-Oz/lnt-sandbox/build/litsupport && /usr/local/Cellar/cmake/3.17.2/bin/cmake -E copy /Users/buildslave/jenkins/workspace/lnt-ctmark-aarch64-Oz/test-suite/litsupport/modules/run.py /Users/buildslave/jenkins/workspace/lnt-ctmark-aarch64-Oz/lnt-sandbox/build/litsupport/modules/run.py [ 5%] Generating modules/run_under.py cd /Users/buildslave/jenkins/workspace/lnt-ctmark-aarch64-Oz/lnt-sandbox/build/litsupport && /usr/local/Cellar/cmake/3.17.2/bin/cmake -E copy /Users/buildslave/jenkins/workspace/lnt-ctmark-aarch64-Oz/test-suite/litsupport/modules/run_under.py /Users/buildslave/jenkins/workspace/lnt-ctmark-aarch64-Oz/lnt-sandbox/build/litsupport/modules/run_under.py [ 5%] Generating modules/stats.py cd /Users/buildslave/jenkins/workspace/lnt-ctmark-aarch64-Oz/lnt-sandbox/build/litsupport && /usr/local/Cellar/cmake/3.17.2/bin/cmake -E copy /Users/buildslave/jenkins/workspace/lnt-ctmark-aarch64-Oz/test-suite/litsupport/modules/stats.py /Users/buildslave/jenkins/workspace/lnt-ctmark-aarch64-Oz/lnt-sandbox/build/litsupport/modules/stats.py [ 5%] Generating modules/timeit.py cd /Users/buildslave/jenkins/workspace/lnt-ctmark-aarch64-Oz/lnt-sandbox/build/litsupport && /usr/local/Cellar/cmake/3.17.2/bin/cmake -E copy /Users/buildslave/jenkins/workspace/lnt-ctmark-aarch64-Oz/test-suite/litsupport/modules/timeit.py /Users/buildslave/jenkins/workspace/lnt-ctmark-aarch64-Oz/lnt-sandbox/build/litsupport/modules/timeit.py [ 5%] Generating ../lit.cfg cd /Users/buildslave/jenkins/workspace/lnt-ctmark-aarch64-Oz/lnt-sandbox/build/litsupport && /usr/local/Cellar/cmake/3.17.2/bin/cmake -E copy /Users/buildslave/jenkins/workspace/lnt-ctmark-aarch64-Oz/test-suite/litsupport/../lit.cfg /Users/buildslave/jenkins/workspace/lnt-ctmark-aarch64-Oz/lnt-sandbox/build/litsupport/../lit.cfg [ 5%] Built target build-litsupport /Applications/Xcode.app/Contents/Developer/usr/bin/make -f tools/CMakeFiles/build-HashProgramOutput.sh.dir/build.make tools/CMakeFiles/build-HashProgramOutput.sh.dir/depend cd /Users/buildslave/jenkins/workspace/lnt-ctmark-aarch64-Oz/lnt-sandbox/build && /usr/local/Cellar/cmake/3.17.2/bin/cmake -E cmake_depends "Unix Makefiles" /Users/buildslave/jenkins/workspace/lnt-ctmark-aarch64-Oz/test-suite /Users/buildslave/jenkins/workspace/lnt-ctmark-aarch64-Oz/test-suite/tools /Users/buildslave/jenkins/workspace/lnt-ctmark-aarch64-Oz/lnt-sandbox/build /Users/buildslave/jenkins/workspace/lnt-ctmark-aarch64-Oz/lnt-sandbox/build/tools /Users/buildslave/jenkins/workspace/lnt-ctmark-aarch64-Oz/lnt-sandbox/build/tools/CMakeFiles/build-HashProgramOutput.sh.dir/DependInfo.cmake --color= Dependee "/Users/buildslave/jenkins/workspace/lnt-ctmark-aarch64-Oz/lnt-sandbox/build/tools/CMakeFiles/build-HashProgramOutput.sh.dir/DependInfo.cmake" is newer than depender "/Users/buildslave/jenkins/workspace/lnt-ctmark-aarch64-Oz/lnt-sandbox/build/tools/CMakeFiles/build-HashProgramOutput.sh.dir/depend.internal". Dependee "/Users/buildslave/jenkins/workspace/lnt-ctmark-aarch64-Oz/lnt-sandbox/build/tools/CMakeFiles/CMakeDirectoryInformation.cmake" is newer than depender "/Users/buildslave/jenkins/workspace/lnt-ctmark-aarch64-Oz/lnt-sandbox/build/tools/CMakeFiles/build-HashProgramOutput.sh.dir/depend.internal". Scanning dependencies of target build-HashProgramOutput.sh /Applications/Xcode.app/Contents/Developer/usr/bin/make -f tools/CMakeFiles/build-HashProgramOutput.sh.dir/build.make tools/CMakeFiles/build-HashProgramOutput.sh.dir/build [ 5%] Generating HashProgramOutput.sh cd /Users/buildslave/jenkins/workspace/lnt-ctmark-aarch64-Oz/lnt-sandbox/build/tools && /usr/local/Cellar/cmake/3.17.2/bin/cmake -E copy /Users/buildslave/jenkins/workspace/lnt-ctmark-aarch64-Oz/test-suite/tools/../HashProgramOutput.sh /Users/buildslave/jenkins/workspace/lnt-ctmark-aarch64-Oz/lnt-sandbox/build/tools/HashProgramOutput.sh cd /Users/buildslave/jenkins/workspace/lnt-ctmark-aarch64-Oz/lnt-sandbox/build/tools && chmod +x /Users/buildslave/jenkins/workspace/lnt-ctmark-aarch64-Oz/lnt-sandbox/build/tools/HashProgramOutput.sh [ 5%] Built target build-HashProgramOutput.sh /Applications/Xcode.app/Contents/Developer/usr/bin/make -f tools/CMakeFiles/build-fpcmp.dir/build.make tools/CMakeFiles/build-fpcmp.dir/depend cd /Users/buildslave/jenkins/workspace/lnt-ctmark-aarch64-Oz/lnt-sandbox/build && /usr/local/Cellar/cmake/3.17.2/bin/cmake -E cmake_depends "Unix Makefiles" /Users/buildslave/jenkins/workspace/lnt-ctmark-aarch64-Oz/test-suite /Users/buildslave/jenkins/workspace/lnt-ctmark-aarch64-Oz/test-suite/tools /Users/buildslave/jenkins/workspace/lnt-ctmark-aarch64-Oz/lnt-sandbox/build /Users/buildslave/jenkins/workspace/lnt-ctmark-aarch64-Oz/lnt-sandbox/build/tools /Users/buildslave/jenkins/workspace/lnt-ctmark-aarch64-Oz/lnt-sandbox/build/tools/CMakeFiles/build-fpcmp.dir/DependInfo.cmake --color= Dependee "/Users/buildslave/jenkins/workspace/lnt-ctmark-aarch64-Oz/lnt-sandbox/build/tools/CMakeFiles/build-fpcmp.dir/DependInfo.cmake" is newer than depender "/Users/buildslave/jenkins/workspace/lnt-ctmark-aarch64-Oz/lnt-sandbox/build/tools/CMakeFiles/build-fpcmp.dir/depend.internal". Dependee "/Users/buildslave/jenkins/workspace/lnt-ctmark-aarch64-Oz/lnt-sandbox/build/tools/CMakeFiles/CMakeDirectoryInformation.cmake" is newer than depender "/Users/buildslave/jenkins/workspace/lnt-ctmark-aarch64-Oz/lnt-sandbox/build/tools/CMakeFiles/build-fpcmp.dir/depend.internal". Scanning dependencies of target build-fpcmp /Applications/Xcode.app/Contents/Developer/usr/bin/make -f tools/CMakeFiles/build-fpcmp.dir/build.make tools/CMakeFiles/build-fpcmp.dir/build [ 5%] [TEST_SUITE_HOST_CC] Compiling host source fpcmp.c cd /Users/buildslave/jenkins/workspace/lnt-ctmark-aarch64-Oz/lnt-sandbox/build/tools && cc -c /Users/buildslave/jenkins/workspace/lnt-ctmark-aarch64-Oz/test-suite/tools/fpcmp.c -o /Users/buildslave/jenkins/workspace/lnt-ctmark-aarch64-Oz/lnt-sandbox/build/tools/fpcmp.c.o [ 5%] [TEST_SUITE_HOST_CC] Linking host executable fpcmp cd /Users/buildslave/jenkins/workspace/lnt-ctmark-aarch64-Oz/lnt-sandbox/build/tools && cc /Users/buildslave/jenkins/workspace/lnt-ctmark-aarch64-Oz/lnt-sandbox/build/tools/fpcmp.c.o -o /Users/buildslave/jenkins/workspace/lnt-ctmark-aarch64-Oz/lnt-sandbox/build/tools/fpcmp [ 5%] Built target build-fpcmp /Applications/Xcode.app/Contents/Developer/usr/bin/make -f CTMark/sqlite3/CMakeFiles/sqlite_input.dir/build.make CTMark/sqlite3/CMakeFiles/sqlite_input.dir/depend cd /Users/buildslave/jenkins/workspace/lnt-ctmark-aarch64-Oz/lnt-sandbox/build && /usr/local/Cellar/cmake/3.17.2/bin/cmake -E cmake_depends "Unix Makefiles" /Users/buildslave/jenkins/workspace/lnt-ctmark-aarch64-Oz/test-suite /Users/buildslave/jenkins/workspace/lnt-ctmark-aarch64-Oz/test-suite/CTMark/sqlite3 /Users/buildslave/jenkins/workspace/lnt-ctmark-aarch64-Oz/lnt-sandbox/build /Users/buildslave/jenkins/workspace/lnt-ctmark-aarch64-Oz/lnt-sandbox/build/CTMark/sqlite3 /Users/buildslave/jenkins/workspace/lnt-ctmark-aarch64-Oz/lnt-sandbox/build/CTMark/sqlite3/CMakeFiles/sqlite_input.dir/DependInfo.cmake --color= Dependee "/Users/buildslave/jenkins/workspace/lnt-ctmark-aarch64-Oz/lnt-sandbox/build/CTMark/sqlite3/CMakeFiles/sqlite_input.dir/DependInfo.cmake" is newer than depender "/Users/buildslave/jenkins/workspace/lnt-ctmark-aarch64-Oz/lnt-sandbox/build/CTMark/sqlite3/CMakeFiles/sqlite_input.dir/depend.internal". Dependee "/Users/buildslave/jenkins/workspace/lnt-ctmark-aarch64-Oz/lnt-sandbox/build/CTMark/sqlite3/CMakeFiles/CMakeDirectoryInformation.cmake" is newer than depender "/Users/buildslave/jenkins/workspace/lnt-ctmark-aarch64-Oz/lnt-sandbox/build/CTMark/sqlite3/CMakeFiles/sqlite_input.dir/depend.internal". Scanning dependencies of target sqlite_input /Applications/Xcode.app/Contents/Developer/usr/bin/make -f CTMark/sqlite3/CMakeFiles/sqlite_input.dir/build.make CTMark/sqlite3/CMakeFiles/sqlite_input.dir/build [ 5%] Generating sqlite test inputs cd /Users/buildslave/jenkins/workspace/lnt-ctmark-aarch64-Oz/lnt-sandbox/build/CTMark/sqlite3 && /usr/bin/tclsh /Users/buildslave/jenkins/workspace/lnt-ctmark-aarch64-Oz/test-suite/CTMark/sqlite3/speedtest.tcl [ 5%] Built target sqlite_input make[1]: Target `all' not remade because of errors. make: *** [all] Error 2 2021-09-28 11:05:33 INFO: Testing... 2021-09-28 11:05:33 INFO: Execute: /Users/buildslave/jenkins/workspace/lnt-ctmark-aarch64-Oz/venv/bin/lit -v -j 1 /Users/buildslave/jenkins/workspace/lnt-ctmark-aarch64-Oz/lnt-sandbox/build -o /Users/buildslave/jenkins/workspace/lnt-ctmark-aarch64-Oz/lnt-sandbox/build/outputmb7xpf5m.json -- Testing: 10 tests, 1 workers -- NOEXE: test-suite :: CTMark/7zip/7zip-benchmark.test (1 of 10) ******************** TEST 'test-suite :: CTMark/7zip/7zip-benchmark.test' FAILED ******************** Executable '/Users/buildslave/jenkins/workspace/lnt-ctmark-aarch64-Oz/lnt-sandbox/build/CTMark/7zip/7zip-benchmark' is missing ******************** NOEXE: test-suite :: CTMark/Bullet/bullet.test (2 of 10) ******************** TEST 'test-suite :: CTMark/Bullet/bullet.test' FAILED ******************** Executable '/Users/buildslave/jenkins/workspace/lnt-ctmark-aarch64-Oz/lnt-sandbox/build/CTMark/Bullet/bullet' is missing ******************** NOEXE: test-suite :: CTMark/ClamAV/clamscan.test (3 of 10) ******************** TEST 'test-suite :: CTMark/ClamAV/clamscan.test' FAILED ******************** Executable '/Users/buildslave/jenkins/workspace/lnt-ctmark-aarch64-Oz/lnt-sandbox/build/CTMark/ClamAV/clamscan' is missing ******************** NOEXE: test-suite :: CTMark/SPASS/SPASS.test (4 of 10) ******************** TEST 'test-suite :: CTMark/SPASS/SPASS.test' FAILED ******************** Executable '/Users/buildslave/jenkins/workspace/lnt-ctmark-aarch64-Oz/lnt-sandbox/build/CTMark/SPASS/SPASS' is missing ******************** NOEXE: test-suite :: CTMark/consumer-typeset/consumer-typeset.test (5 of 10) ******************** TEST 'test-suite :: CTMark/consumer-typeset/consumer-typeset.test' FAILED ******************** Executable '/Users/buildslave/jenkins/workspace/lnt-ctmark-aarch64-Oz/lnt-sandbox/build/CTMark/consumer-typeset/consumer-typeset' is missing ******************** NOEXE: test-suite :: CTMark/kimwitu++/kc.test (6 of 10) ******************** TEST 'test-suite :: CTMark/kimwitu++/kc.test' FAILED ******************** Executable '/Users/buildslave/jenkins/workspace/lnt-ctmark-aarch64-Oz/lnt-sandbox/build/CTMark/kimwitu++/kc' is missing ******************** NOEXE: test-suite :: CTMark/lencod/lencod.test (7 of 10) ******************** TEST 'test-suite :: CTMark/lencod/lencod.test' FAILED ******************** Executable '/Users/buildslave/jenkins/workspace/lnt-ctmark-aarch64-Oz/lnt-sandbox/build/CTMark/lencod/lencod' is missing ******************** NOEXE: test-suite :: CTMark/mafft/pairlocalalign.test (8 of 10) ******************** TEST 'test-suite :: CTMark/mafft/pairlocalalign.test' FAILED ******************** Executable '/Users/buildslave/jenkins/workspace/lnt-ctmark-aarch64-Oz/lnt-sandbox/build/CTMark/mafft/pairlocalalign' is missing ******************** NOEXE: test-suite :: CTMark/sqlite3/sqlite3.test (9 of 10) ******************** TEST 'test-suite :: CTMark/sqlite3/sqlite3.test' FAILED ******************** Executable '/Users/buildslave/jenkins/workspace/lnt-ctmark-aarch64-Oz/lnt-sandbox/build/CTMark/sqlite3/sqlite3' is missing ******************** NOEXE: test-suite :: CTMark/tramp3d-v4/tramp3d-v4.test (10 of 10) ******************** TEST 'test-suite :: CTMark/tramp3d-v4/tramp3d-v4.test' FAILED ******************** Executable '/Users/buildslave/jenkins/workspace/lnt-ctmark-aarch64-Oz/lnt-sandbox/build/CTMark/tramp3d-v4/tramp3d-v4' is missing ******************** ******************** Executable Missing Tests (10): test-suite :: CTMark/7zip/7zip-benchmark.test test-suite :: CTMark/Bullet/bullet.test test-suite :: CTMark/ClamAV/clamscan.test test-suite :: CTMark/SPASS/SPASS.test test-suite :: CTMark/consumer-typeset/consumer-typeset.test test-suite :: CTMark/kimwitu++/kc.test test-suite :: CTMark/lencod/lencod.test test-suite :: CTMark/mafft/pairlocalalign.test test-suite :: CTMark/sqlite3/sqlite3.test test-suite :: CTMark/tramp3d-v4/tramp3d-v4.test

Hide Details

Hide Details

Testing Time: 0.12s Executable Missing: 10 Import succeeded.

Hide Details

++ echo @@@@@@ @@@@@@ + . /Users/buildslave/jenkins/workspace/lnt-ctmark-aarch64-Oz/config/tasks/utils/lnt_submit.sh ++ echo '@@@ LNT Submit @@@'
LNT Submit

Hide Details

@@@ LNT Submit @@@ ++ '[' -n http://104.154.54.203/db_default/v4/nts/submitRun -a -n green-dragon-12_lnt-ctmark-aarch64-Oz ']' +++ lnt submit http://104.154.54.203/db_default/v4/nts/submitRun /Users/buildslave/jenkins/workspace/lnt-ctmark-aarch64-Oz/lnt-sandbox/report.json ++ LNT_RESULT_URL=http://104.154.54.203/db_default/v4/nts/152475 ++ echo 'Results available at: http://104.154.54.203/db_default/v4/nts/152475' Results available at: http://104.154.54.203/db_default/v4/nts/152475 ++ echo @@@@@@@ @@@@@@@ + . /Users/buildslave/jenkins/workspace/lnt-ctmark-aarch64-Oz/config/tasks/utils/lnt_move_results.sh ++ echo '@@@ Move LNT Results @@@'
Move LNT Results

Hide Details

@@@ Move LNT Results @@@ ++ mkdir -p result ++ test -e lnt-sandbox/build/test.log ++ cp -p lnt-sandbox/build/test.log result/ ++ test -e lnt-sandbox/build/report.json ++ cp -p lnt-sandbox/build/report.json result/ ++ test -e lnt-sandbox/build/test-results.xunit.xml ++ cp -p lnt-sandbox/build/test-results.xunit.xml result/ ++ echo @@@@@@@ @@@@@@@ + . /Users/buildslave/jenkins/workspace/lnt-ctmark-aarch64-Oz/config/tasks/utils/lnt_check_no_errors.sh ++ echo '@@@ LNT Check No Erros @@@'
LNT Check No Erros

Hide Details

@@@ LNT Check No Erros @@@ ++ lnt check-no-errors /Users/buildslave/jenkins/workspace/lnt-ctmark-aarch64-Oz/lnt-sandbox/report.json /Users/buildslave/jenkins/workspace/lnt-ctmark-aarch64-Oz/lnt-sandbox/report.json: run section does not specify "no_errors": true *Build failed!* (return code 1) [Pipeline] } [Pipeline] // timeout [Pipeline] } [Pipeline] // stage [Pipeline] stage [Pipeline] { (post) [Pipeline] sh + curl http://labmaster2:8080/green/job/lnt-ctmark-aarch64-Oz/10725/consoleText -s + config/zorg/jenkins/inspect_log.py [Pipeline] readFile [Pipeline] readTrusted Obtained zorg/jenkins/job_description.template from git https://github.com/llvm/llvm-zorg.git [Pipeline] readTrusted Obtained zorg/jenkins/email.template from git https://github.com/llvm/llvm-zorg.git [Pipeline] emailext Warning: pavel@labath.sk is not a recognized user, but sending mail anyway Warning: a.bataev@hotmail.com is not a recognized user, but sending mail anyway Warning: kbobyrev@google.com is not a recognized user, but sending mail anyway Warning: sguelton@redhat.com is not a recognized user, but sending mail anyway Warning: aaron@aaronballman.com is not a recognized user, but sending mail anyway Warning: erich.keane@intel.com is not a recognized user, but sending mail anyway Warning: spatel@rotateright.com is not a recognized user, but sending mail anyway Warning: flo@fhahn.com is not a recognized user, but sending mail anyway Warning: diana.picus@linaro.org is not a recognized user, but sending mail anyway Warning: gusrb406@snu.ac.kr is not a recognized user, but sending mail anyway Warning: mkazantsev@azul.com is not a recognized user, but sending mail anyway Warning: jingu.kang@arm.com is not a recognized user, but sending mail anyway Warning: shivam98.tkg@gmail.com is not a recognized user, but sending mail anyway Warning: bjorn.a.pettersson@ericsson.com is not a recognized user, but sending mail anyway Warning: pavel@labath.sk is not a recognized user, but sending mail anyway Warning: a.bataev@hotmail.com is not a recognized user, but sending mail anyway Warning: kbobyrev@google.com is not a recognized user, but sending mail anyway Warning: sguelton@redhat.com is not a recognized user, but sending mail anyway Warning: aaron@aaronballman.com is not a recognized user, but sending mail anyway Warning: erich.keane@intel.com is not a recognized user, but sending mail anyway Warning: spatel@rotateright.com is not a recognized user, but sending mail anyway Warning: flo@fhahn.com is not a recognized user, but sending mail anyway Warning: diana.picus@linaro.org is not a recognized user, but sending mail anyway Warning: gusrb406@snu.ac.kr is not a recognized user, but sending mail anyway Warning: mkazantsev@azul.com is not a recognized user, but sending mail anyway Warning: jingu.kang@arm.com is not a recognized user, but sending mail anyway Warning: shivam98.tkg@gmail.com is not a recognized user, but sending mail anyway Warning: bjorn.a.pettersson@ericsson.com is not a recognized user, but sending mail anyway

Hide Details

Begin Pre-Send Script... Sending email to: Jessica Paquette <jonathan_roelofs@apple.com> Jessica Paquette <jonathan_roelofs@apple.com> Azhar Mohammed <azhar@apple.com> [Pipeline] } [Pipeline] // stage [Pipeline] } [Pipeline] // node [Pipeline] End of Pipeline Finished: FAILURE