Console Output

Skipping 4,871 KB.. Full Log
While building module 'LLVM_Utils' imported from /Users/buildslave/jenkins/workspace/lldb-cmake/llvm-project/llvm/tools/llvm-exegesis/lib/RegisterAliasing.h:20:
While building module 'LLVM_C' imported from /Users/buildslave/jenkins/workspace/lldb-cmake/llvm-project/llvm/include/llvm/Support/DataTypes.h:19:
In file included from <module-includes>:5:
/Users/buildslave/jenkins/workspace/lldb-cmake/llvm-project/llvm/include/llvm-c/./Core.h:3614:5: warning: declaration is marked with '@deprecated' command but does not have a deprecation attribute [-Wdocumentation-deprecated-sync]
 * @deprecated LLVMSetInstDebugLocation is deprecated in favor of the more general
   ~^~~~~~~~~~~~~~~~~~~~~~~~~~~~~~~~~~~~~~~~~~~~~~~~~~~~~~~~~~~~~~~~~~~~~~~~~~~~~~
/Users/buildslave/jenkins/workspace/lldb-cmake/llvm-project/llvm/include/llvm-c/./Core.h:3619:1: note: add a deprecation attribute to the declaration to silence this warning
void LLVMSetInstDebugLocation(LLVMBuilderRef Builder, LLVMValueRef Inst);
^
[[deprecated]] 
1 warning generated.
[2766/2770] : && /Users/buildslave/jenkins/workspace/lldb-cmake/host-compiler/bin/clang++  -Wdocumentation -fPIC -fvisibility-inlines-hidden -Werror=date-time -Werror=unguarded-availability-new -fmodules -fmodules-cache-path=/Users/buildslave/jenkins/workspace/lldb-cmake/lldb-build/module.cache -fcxx-modules -Xclang -fmodules-local-submodule-visibility -Wall -Wextra -Wno-unused-parameter -Wwrite-strings -Wcast-qual -Wmissing-field-initializers -pedantic -Wno-long-long -Wc++98-compat-extra-semi -Wimplicit-fallthrough -Wcovered-switch-default -Wno-noexcept-type -Wnon-virtual-dtor -Wdelete-non-virtual-dtor -Wsuggest-override -Wstring-conversion -Wmisleading-indentation -fdiagnostics-color -O3 -DNDEBUG -isysroot /Applications/Xcode.app/Contents/Developer/Platforms/MacOSX.platform/Developer/SDKs/MacOSX10.15.sdk -Wl,-search_paths_first -Wl,-headerpad_max_install_names -Wl,-dead_strip tools/llvm-exegesis/CMakeFiles/llvm-exegesis.dir/llvm-exegesis.cpp.o  -o bin/llvm-exegesis  -Wl,-rpath,@loader_path/../lib  lib/libLLVMMC.a  lib/libLLVMMCParser.a  lib/libLLVMSupport.a  lib/libLLVMX86CodeGen.a  lib/libLLVMX86AsmParser.a  lib/libLLVMX86Desc.a  lib/libLLVMX86Disassembler.a  lib/libLLVMX86Info.a  lib/libLLVMExegesis.a  lib/libLLVMExegesisX86.a  lib/libLLVMX86CodeGen.a  lib/libLLVMAsmPrinter.a  lib/libLLVMDebugInfoDWARF.a  lib/libLLVMDebugInfoMSF.a  lib/libLLVMInstrumentation.a  lib/libLLVMCFGuard.a  lib/libLLVMX86AsmParser.a  lib/libLLVMX86Desc.a  lib/libLLVMX86Disassembler.a  lib/libLLVMX86Info.a  lib/libLLVMExegesis.a  lib/libLLVMGlobalISel.a  lib/libLLVMSelectionDAG.a  lib/libLLVMMCDisassembler.a  lib/libLLVMMCJIT.a  lib/libLLVMExecutionEngine.a  lib/libLLVMOrcTargetProcess.a  lib/libLLVMOrcShared.a  lib/libLLVMObjectYAML.a  lib/libLLVMRuntimeDyld.a  lib/libLLVMCodeGen.a  lib/libLLVMTarget.a  lib/libLLVMBitWriter.a  lib/libLLVMScalarOpts.a  lib/libLLVMAggressiveInstCombine.a  lib/libLLVMInstCombine.a  lib/libLLVMTransformUtils.a  lib/libLLVMAnalysis.a  lib/libLLVMProfileData.a  lib/libLLVMObject.a  lib/libLLVMMCParser.a  lib/libLLVMMC.a  lib/libLLVMDebugInfoCodeView.a  lib/libLLVMBitReader.a  lib/libLLVMTextAPI.a  lib/libLLVMCore.a  lib/libLLVMBinaryFormat.a  lib/libLLVMRemarks.a  lib/libLLVMBitstreamReader.a  lib/libLLVMSupport.a  -lm  /usr/lib/libz.dylib  /usr/lib/libcurses.dylib  lib/libLLVMDemangle.a && :
[2767/2770] /Users/buildslave/jenkins/workspace/lldb-cmake/host-compiler/bin/clang++  -DGTEST_HAS_RTTI=0 -DLLVM_ENABLE_PLUGINS -D_DEBUG -D__STDC_CONSTANT_MACROS -D__STDC_FORMAT_MACROS -D__STDC_LIMIT_MACROS -Iunittests/Passes -I/Users/buildslave/jenkins/workspace/lldb-cmake/llvm-project/llvm/unittests/Passes -Iinclude -I/Users/buildslave/jenkins/workspace/lldb-cmake/llvm-project/llvm/include -Wdocumentation -fPIC -fvisibility-inlines-hidden -Werror=date-time -Werror=unguarded-availability-new -fmodules -fmodules-cache-path=/Users/buildslave/jenkins/workspace/lldb-cmake/lldb-build/module.cache -fcxx-modules -Xclang -fmodules-local-submodule-visibility -Wall -Wextra -Wno-unused-parameter -Wwrite-strings -Wcast-qual -Wmissing-field-initializers -pedantic -Wno-long-long -Wc++98-compat-extra-semi -Wimplicit-fallthrough -Wcovered-switch-default -Wno-noexcept-type -Wnon-virtual-dtor -Wdelete-non-virtual-dtor -Wsuggest-override -Wstring-conversion -Wmisleading-indentation -fdiagnostics-color -O3 -DNDEBUG -isysroot /Applications/Xcode.app/Contents/Developer/Platforms/MacOSX.platform/Developer/SDKs/MacOSX10.15.sdk -fPIC    -fno-exceptions -fno-rtti -UNDEBUG -std=c++14 -MD -MT unittests/Passes/CMakeFiles/DoublerPlugin.dir/DoublerPlugin.cpp.o -MF unittests/Passes/CMakeFiles/DoublerPlugin.dir/DoublerPlugin.cpp.o.d -o unittests/Passes/CMakeFiles/DoublerPlugin.dir/DoublerPlugin.cpp.o -c /Users/buildslave/jenkins/workspace/lldb-cmake/llvm-project/llvm/unittests/Passes/DoublerPlugin.cpp
While building module 'LLVM_Utils' imported from /Users/buildslave/jenkins/workspace/lldb-cmake/llvm-project/llvm/include/llvm/Passes/PassBuilder.h:18:
While building module 'LLVM_C' imported from /Users/buildslave/jenkins/workspace/lldb-cmake/llvm-project/llvm/include/llvm/Support/DataTypes.h:19:
In file included from <module-includes>:5:
/Users/buildslave/jenkins/workspace/lldb-cmake/llvm-project/llvm/include/llvm-c/./Core.h:3614:5: warning: declaration is marked with '@deprecated' command but does not have a deprecation attribute [-Wdocumentation-deprecated-sync]
 * @deprecated LLVMSetInstDebugLocation is deprecated in favor of the more general
   ~^~~~~~~~~~~~~~~~~~~~~~~~~~~~~~~~~~~~~~~~~~~~~~~~~~~~~~~~~~~~~~~~~~~~~~~~~~~~~~
/Users/buildslave/jenkins/workspace/lldb-cmake/llvm-project/llvm/include/llvm-c/./Core.h:3619:1: note: add a deprecation attribute to the declaration to silence this warning
void LLVMSetInstDebugLocation(LLVMBuilderRef Builder, LLVMValueRef Inst);
^
[[deprecated]] 
1 warning generated.
[2768/2770] : && /Users/buildslave/jenkins/workspace/lldb-cmake/host-compiler/bin/clang++ -Wdocumentation -fPIC -fvisibility-inlines-hidden -Werror=date-time -Werror=unguarded-availability-new -fmodules -fmodules-cache-path=/Users/buildslave/jenkins/workspace/lldb-cmake/lldb-build/module.cache -fcxx-modules -Xclang -fmodules-local-submodule-visibility -Wall -Wextra -Wno-unused-parameter -Wwrite-strings -Wcast-qual -Wmissing-field-initializers -pedantic -Wno-long-long -Wc++98-compat-extra-semi -Wimplicit-fallthrough -Wcovered-switch-default -Wno-noexcept-type -Wnon-virtual-dtor -Wdelete-non-virtual-dtor -Wsuggest-override -Wstring-conversion -Wmisleading-indentation -fdiagnostics-color -O3 -DNDEBUG -isysroot /Applications/Xcode.app/Contents/Developer/Platforms/MacOSX.platform/Developer/SDKs/MacOSX10.15.sdk -bundle -Wl,-headerpad_max_install_names -Wl,-flat_namespace -Wl,-undefined -Wl,suppress   -Wl,-dead_strip -o unittests/Passes/DoublerPlugin.dylib unittests/Passes/CMakeFiles/DoublerPlugin.dir/DoublerPlugin.cpp.o  -Wl,-rpath,@loader_path/../lib && :
[2769/2770] /Users/buildslave/jenkins/workspace/lldb-cmake/host-compiler/bin/clang++  -DGTEST_HAS_RTTI=0 -DLLVM_ENABLE_PLUGINS -D_DEBUG -D__STDC_CONSTANT_MACROS -D__STDC_FORMAT_MACROS -D__STDC_LIMIT_MACROS -Iunittests/Passes -I/Users/buildslave/jenkins/workspace/lldb-cmake/llvm-project/llvm/unittests/Passes -Iinclude -I/Users/buildslave/jenkins/workspace/lldb-cmake/llvm-project/llvm/include -Wdocumentation -fPIC -fvisibility-inlines-hidden -Werror=date-time -Werror=unguarded-availability-new -fmodules -fmodules-cache-path=/Users/buildslave/jenkins/workspace/lldb-cmake/lldb-build/module.cache -fcxx-modules -Xclang -fmodules-local-submodule-visibility -Wall -Wextra -Wno-unused-parameter -Wwrite-strings -Wcast-qual -Wmissing-field-initializers -pedantic -Wno-long-long -Wc++98-compat-extra-semi -Wimplicit-fallthrough -Wcovered-switch-default -Wno-noexcept-type -Wnon-virtual-dtor -Wdelete-non-virtual-dtor -Wsuggest-override -Wstring-conversion -Wmisleading-indentation -fdiagnostics-color -O3 -DNDEBUG -isysroot /Applications/Xcode.app/Contents/Developer/Platforms/MacOSX.platform/Developer/SDKs/MacOSX10.15.sdk -fPIC    -fno-exceptions -fno-rtti -UNDEBUG -std=c++14 -MD -MT unittests/Passes/CMakeFiles/TestPlugin.dir/TestPlugin.cpp.o -MF unittests/Passes/CMakeFiles/TestPlugin.dir/TestPlugin.cpp.o.d -o unittests/Passes/CMakeFiles/TestPlugin.dir/TestPlugin.cpp.o -c /Users/buildslave/jenkins/workspace/lldb-cmake/llvm-project/llvm/unittests/Passes/TestPlugin.cpp
[2770/2770] : && /Users/buildslave/jenkins/workspace/lldb-cmake/host-compiler/bin/clang++ -Wdocumentation -fPIC -fvisibility-inlines-hidden -Werror=date-time -Werror=unguarded-availability-new -fmodules -fmodules-cache-path=/Users/buildslave/jenkins/workspace/lldb-cmake/lldb-build/module.cache -fcxx-modules -Xclang -fmodules-local-submodule-visibility -Wall -Wextra -Wno-unused-parameter -Wwrite-strings -Wcast-qual -Wmissing-field-initializers -pedantic -Wno-long-long -Wc++98-compat-extra-semi -Wimplicit-fallthrough -Wcovered-switch-default -Wno-noexcept-type -Wnon-virtual-dtor -Wdelete-non-virtual-dtor -Wsuggest-override -Wstring-conversion -Wmisleading-indentation -fdiagnostics-color -O3 -DNDEBUG -isysroot /Applications/Xcode.app/Contents/Developer/Platforms/MacOSX.platform/Developer/SDKs/MacOSX10.15.sdk -bundle -Wl,-headerpad_max_install_names -Wl,-flat_namespace -Wl,-undefined -Wl,suppress   -Wl,-dead_strip -o unittests/Passes/TestPlugin.dylib unittests/Passes/CMakeFiles/TestPlugin.dir/TestPlugin.cpp.o  -Wl,-rpath,@loader_path/../lib && :
Completed at: 2021-11-27T09:27:38
@@@@@@
++ hostname
+ test green-dragon-04 == green-dragon-04
+ sh /opt/codesign-workaround.sh sign lldb-build/bin/debugserver
[Pipeline] }
[Pipeline] // timeout
[Pipeline] }
[Pipeline] // stage
[Pipeline] stage
[Pipeline] { (Clean Test Results)
[Pipeline] timeout
Timeout set to expire in 10 min
[Pipeline] {
[Pipeline] sh
+ set -u
+ export PATH=/usr/local/bin:/usr/local/sbin:/usr/bin:/bin:/usr/sbin:/sbin:/usr/bin:/usr/local/bin
+ PATH=/usr/local/bin:/usr/local/sbin:/usr/bin:/bin:/usr/sbin:/sbin:/usr/bin:/usr/local/bin
+ rm -rf test/results.xml
[Pipeline] }
[Pipeline] // timeout
[Pipeline] }
[Pipeline] // stage
[Pipeline] stage
[Pipeline] { (Test (Debug Info))
[Pipeline] timeout
Timeout set to expire in 30 min
[Pipeline] {
[Pipeline] sh
+ set -u
+ export PATH=/usr/local/bin:/usr/local/sbin:/usr/bin:/bin:/usr/sbin:/sbin:/usr/bin:/usr/local/bin
+ PATH=/usr/local/bin:/usr/local/sbin:/usr/bin:/bin:/usr/sbin:/sbin:/usr/bin:/usr/local/bin
++ sysctl hw.physicalcpu
++ awk '{print $2}'
+ export MAX_PARALLEL_TESTS=4
+ MAX_PARALLEL_TESTS=4
+ set +e
+ python llvm-zorg/zorg/jenkins/monorepo_build.py lldb-cmake-debuginfo test
You are using pip version 18.1, however version 20.3.4 is available.
You should consider upgrading via the 'pip install --upgrade pip' command.
You are using pip version 18.1, however version 20.3.4 is available.
You should consider upgrading via the 'pip install --upgrade pip' command.
Dependency met os_version v10.15.5
Dependency met brew cmake v3.17.2
Dependency met brew ninja v1.8.2
Dependency met pip psutil v5.4.5
Dependency met pip six v1.11.0
Dependency met xcode v11.5
Clean

Hide Details

@@@ Clean @@@ Removing module cache: /Users/buildslave/jenkins/workspace/lldb-cmake/lldb-build/module.cache Completed at: 2021-11-27T09:27:49 @@@@@@
Run Tests

Hide Details

@@@ Run Tests @@@ cd /Users/buildslave/jenkins/workspace/lldb-cmake/lldb-build '/usr/bin/env' 'TERM=vt100' '/usr/local/bin/ninja' '-v' 'check-debuginfo' [1/3] cd /Users/buildslave/jenkins/workspace/lldb-cmake/lldb-build/tools/lldb && /usr/local/Cellar/cmake/3.17.2/bin/cmake -E make_directory /Users/buildslave/jenkins/workspace/lldb-cmake/lldb-build/./lib/python3.7/site-packages/lldb [2/3] cd /Users/buildslave/jenkins/workspace/lldb-cmake/lldb-build/tools/lldb && /usr/local/Cellar/cmake/3.17.2/bin/cmake -E copy /Users/buildslave/jenkins/workspace/lldb-cmake/llvm-project/lldb/third_party/Python/module/six/six.py /Users/buildslave/jenkins/workspace/lldb-cmake/lldb-build/./lib/python3.7/site-packages/lldb/../six.py && cd /Users/buildslave/jenkins/workspace/lldb-cmake/lldb-build/tools/lldb && /usr/local/Cellar/cmake/3.17.2/bin/cmake -E copy /Users/buildslave/jenkins/workspace/lldb-cmake/lldb-build/tools/lldb/bindings/python/lldb.py /Users/buildslave/jenkins/workspace/lldb-cmake/lldb-build/./lib/python3.7/site-packages/lldb/__init__.py && cd /Users/buildslave/jenkins/workspace/lldb-cmake/lldb-build/tools/lldb && /usr/local/Cellar/cmake/3.17.2/bin/cmake -E copy /Users/buildslave/jenkins/workspace/lldb-cmake/llvm-project/lldb/source/Interpreter/embedded_interpreter.py /Users/buildslave/jenkins/workspace/lldb-cmake/lldb-build/./lib/python3.7/site-packages/lldb && cd /Users/buildslave/jenkins/workspace/lldb-cmake/lldb-build/lib/python3.7/site-packages/lldb && /usr/local/Cellar/cmake/3.17.2/bin/cmake -E make_directory formatters/cpp && /usr/local/Cellar/cmake/3.17.2/bin/cmake -E copy /Users/buildslave/jenkins/workspace/lldb-cmake/llvm-project/lldb/examples/synthetic/gnu_libstdcpp.py /Users/buildslave/jenkins/workspace/lldb-cmake/llvm-project/lldb/examples/synthetic/libcxx.py formatters/cpp && /usr/local/Frameworks/Python.framework/Versions/3.7/bin/python3.7 /Users/buildslave/jenkins/workspace/lldb-cmake/llvm-project/lldb/bindings/python/createPythonInit.py formatters/cpp /Users/buildslave/jenkins/workspace/lldb-cmake/llvm-project/lldb/examples/synthetic/gnu_libstdcpp.py /Users/buildslave/jenkins/workspace/lldb-cmake/llvm-project/lldb/examples/synthetic/libcxx.py && cd /Users/buildslave/jenkins/workspace/lldb-cmake/lldb-build/lib/python3.7/site-packages/lldb && /usr/local/Cellar/cmake/3.17.2/bin/cmake -E make_directory formatters && /usr/local/Cellar/cmake/3.17.2/bin/cmake -E copy /Users/buildslave/jenkins/workspace/lldb-cmake/llvm-project/lldb/examples/summaries/cocoa/cache.py /Users/buildslave/jenkins/workspace/lldb-cmake/llvm-project/lldb/examples/summaries/synth.py /Users/buildslave/jenkins/workspace/lldb-cmake/llvm-project/lldb/examples/summaries/cocoa/metrics.py /Users/buildslave/jenkins/workspace/lldb-cmake/llvm-project/lldb/examples/summaries/cocoa/attrib_fromdict.py /Users/buildslave/jenkins/workspace/lldb-cmake/llvm-project/lldb/examples/summaries/cocoa/Logger.py formatters && /usr/local/Frameworks/Python.framework/Versions/3.7/bin/python3.7 /Users/buildslave/jenkins/workspace/lldb-cmake/llvm-project/lldb/bindings/python/createPythonInit.py formatters /Users/buildslave/jenkins/workspace/lldb-cmake/llvm-project/lldb/examples/summaries/cocoa/cache.py /Users/buildslave/jenkins/workspace/lldb-cmake/llvm-project/lldb/examples/summaries/synth.py /Users/buildslave/jenkins/workspace/lldb-cmake/llvm-project/lldb/examples/summaries/cocoa/metrics.py /Users/buildslave/jenkins/workspace/lldb-cmake/llvm-project/lldb/examples/summaries/cocoa/attrib_fromdict.py /Users/buildslave/jenkins/workspace/lldb-cmake/llvm-project/lldb/examples/summaries/cocoa/Logger.py && cd /Users/buildslave/jenkins/workspace/lldb-cmake/lldb-build/lib/python3.7/site-packages/lldb && /usr/local/Cellar/cmake/3.17.2/bin/cmake -E make_directory utils && /usr/local/Cellar/cmake/3.17.2/bin/cmake -E copy /Users/buildslave/jenkins/workspace/lldb-cmake/llvm-project/lldb/examples/python/in_call_stack.py /Users/buildslave/jenkins/workspace/lldb-cmake/llvm-project/lldb/examples/python/symbolication.py utils && /usr/local/Frameworks/Python.framework/Versions/3.7/bin/python3.7 /Users/buildslave/jenkins/workspace/lldb-cmake/llvm-project/lldb/bindings/python/createPythonInit.py utils /Users/buildslave/jenkins/workspace/lldb-cmake/llvm-project/lldb/examples/python/in_call_stack.py /Users/buildslave/jenkins/workspace/lldb-cmake/llvm-project/lldb/examples/python/symbolication.py && cd /Users/buildslave/jenkins/workspace/lldb-cmake/lldb-build/lib/python3.7/site-packages/lldb && /usr/local/Cellar/cmake/3.17.2/bin/cmake -E make_directory plugins && /usr/local/Cellar/cmake/3.17.2/bin/cmake -E copy /Users/buildslave/jenkins/workspace/lldb-cmake/llvm-project/lldb/examples/python/scripted_process/scripted_process.py plugins && /usr/local/Frameworks/Python.framework/Versions/3.7/bin/python3.7 /Users/buildslave/jenkins/workspace/lldb-cmake/llvm-project/lldb/bindings/python/createPythonInit.py plugins /Users/buildslave/jenkins/workspace/lldb-cmake/llvm-project/lldb/examples/python/scripted_process/scripted_process.py && cd /Users/buildslave/jenkins/workspace/lldb-cmake/lldb-build/lib/python3.7/site-packages/lldb && /usr/local/Cellar/cmake/3.17.2/bin/cmake -E make_directory macosx && /usr/local/Cellar/cmake/3.17.2/bin/cmake -E copy /Users/buildslave/jenkins/workspace/lldb-cmake/llvm-project/lldb/examples/python/crashlog.py /Users/buildslave/jenkins/workspace/lldb-cmake/llvm-project/lldb/examples/darwin/heap_find/heap.py macosx && /usr/local/Frameworks/Python.framework/Versions/3.7/bin/python3.7 /Users/buildslave/jenkins/workspace/lldb-cmake/llvm-project/lldb/bindings/python/createPythonInit.py macosx /Users/buildslave/jenkins/workspace/lldb-cmake/llvm-project/lldb/examples/python/crashlog.py /Users/buildslave/jenkins/workspace/lldb-cmake/llvm-project/lldb/examples/darwin/heap_find/heap.py && cd /Users/buildslave/jenkins/workspace/lldb-cmake/lldb-build/lib/python3.7/site-packages/lldb && /usr/local/Cellar/cmake/3.17.2/bin/cmake -E make_directory macosx/heap && /usr/local/Cellar/cmake/3.17.2/bin/cmake -E copy /Users/buildslave/jenkins/workspace/lldb-cmake/llvm-project/lldb/examples/darwin/heap_find/heap/heap_find.cpp /Users/buildslave/jenkins/workspace/lldb-cmake/llvm-project/lldb/examples/darwin/heap_find/heap/Makefile macosx/heap && cd /Users/buildslave/jenkins/workspace/lldb-cmake/lldb-build/lib/python3.7/site-packages/lldb && /usr/local/Cellar/cmake/3.17.2/bin/cmake -E make_directory diagnose && /usr/local/Cellar/cmake/3.17.2/bin/cmake -E copy /Users/buildslave/jenkins/workspace/lldb-cmake/llvm-project/lldb/examples/python/diagnose_unwind.py /Users/buildslave/jenkins/workspace/lldb-cmake/llvm-project/lldb/examples/python/diagnose_nsstring.py diagnose && /usr/local/Frameworks/Python.framework/Versions/3.7/bin/python3.7 /Users/buildslave/jenkins/workspace/lldb-cmake/llvm-project/lldb/bindings/python/createPythonInit.py diagnose /Users/buildslave/jenkins/workspace/lldb-cmake/llvm-project/lldb/examples/python/diagnose_unwind.py /Users/buildslave/jenkins/workspace/lldb-cmake/llvm-project/lldb/examples/python/diagnose_nsstring.py && cd /Users/buildslave/jenkins/workspace/lldb-cmake/lldb-build/lib/python3.7/site-packages/lldb && /usr/local/Cellar/cmake/3.17.2/bin/cmake -E create_symlink ../../../liblldb.dylib _lldb.cpython-37m-darwin.so && cd /Users/buildslave/jenkins/workspace/lldb-cmake/lldb-build/lib/python3.7/site-packages/lldb && /usr/local/Cellar/cmake/3.17.2/bin/cmake -E create_symlink ../../../../bin/lldb-argdumper lldb-argdumper [2/3] cd /Users/buildslave/jenkins/workspace/lldb-cmake/lldb-build/projects/cross-project-tests && /usr/local/Frameworks/Python.framework/Versions/3.7/bin/python3.7 /Users/buildslave/jenkins/workspace/lldb-cmake/lldb-build/./bin/llvm-lit -v --time-tests --shuffle --xunit-xml-output=/Users/buildslave/jenkins/workspace/lldb-cmake/test/results.xml -v -j 4 /Users/buildslave/jenkins/workspace/lldb-cmake/lldb-build/projects/cross-project-tests/debuginfo-tests -- Testing: 105 tests, 4 workers -- llvm-lit: /Users/buildslave/jenkins/workspace/lldb-cmake/llvm-project/llvm/utils/lit/lit/llvm/config.py:436: note: using clang: /Users/buildslave/jenkins/workspace/lldb-cmake/lldb-build/bin/clang llvm-lit: /Users/buildslave/jenkins/workspace/lldb-cmake/llvm-project/llvm/utils/lit/lit/llvm/config.py:436: note: using ld.lld: /Users/buildslave/jenkins/workspace/lldb-cmake/lldb-build/bin/ld.lld llvm-lit: /Users/buildslave/jenkins/workspace/lldb-cmake/llvm-project/llvm/utils/lit/lit/llvm/config.py:436: note: using lld-link: /Users/buildslave/jenkins/workspace/lldb-cmake/lldb-build/bin/lld-link llvm-lit: /Users/buildslave/jenkins/workspace/lldb-cmake/llvm-project/llvm/utils/lit/lit/llvm/config.py:436: note: using ld64.lld: /Users/buildslave/jenkins/workspace/lldb-cmake/lldb-build/bin/ld64.lld llvm-lit: /Users/buildslave/jenkins/workspace/lldb-cmake/llvm-project/llvm/utils/lit/lit/llvm/config.py:436: note: using wasm-ld: /Users/buildslave/jenkins/workspace/lldb-cmake/lldb-build/bin/wasm-ld llvm-lit: /Users/buildslave/jenkins/workspace/lldb-cmake/llvm-project/llvm/utils/lit/lit/llvm/config.py:436: note: using clang++: /Users/buildslave/jenkins/workspace/lldb-cmake/lldb-build/bin/clang++ llvm-lit: /Users/buildslave/jenkins/workspace/lldb-cmake/llvm-project/llvm/utils/lit/lit/llvm/config.py:436: note: using clang-cl: /Users/buildslave/jenkins/workspace/lldb-cmake/lldb-build/bin/clang-cl llvm-lit: /Users/buildslave/jenkins/workspace/lldb-cmake/llvm-project/llvm/utils/lit/lit/llvm/config.py:436: note: using lldb: /Users/buildslave/jenkins/workspace/lldb-cmake/lldb-build/bin/lldb llvm-lit: /Users/buildslave/jenkins/workspace/lldb-cmake/llvm-project/llvm/utils/lit/lit/util.py:399: note: using SDKROOT: '/Applications/Xcode.app/Contents/Developer/Platforms/MacOSX.platform/Developer/SDKs/MacOSX10.15.sdk' UNSUPPORTED: cross-project-tests :: debuginfo-tests/dexter/feature_tests/commands/perfect/expect_watch_value.cpp (1 of 105) UNSUPPORTED: cross-project-tests :: debuginfo-tests/dexter/feature_tests/commands/perfect/limit_steps/limit_steps_check_json_step_count.cpp (2 of 105) UNSUPPORTED: cross-project-tests :: debuginfo-tests/dexter/feature_tests/commands/perfect/dex_finish_test/limit_steps_hit_count.cpp (3 of 105) PASS: cross-project-tests :: debuginfo-tests/llgdb-tests/apple-accel.cpp (4 of 105) XFAIL: cross-project-tests :: debuginfo-tests/llgdb-tests/static-member-2.cpp (5 of 105) PASS: cross-project-tests :: debuginfo-tests/dexter/feature_tests/subtools/list-debuggers/list-debuggers.test (6 of 105) UNSUPPORTED: cross-project-tests :: debuginfo-tests/dexter/feature_tests/commands/perfect/limit_steps/limit_steps_same_line_conditional.cpp (7 of 105) UNSUPPORTED: cross-project-tests :: debuginfo-tests/dexter/feature_tests/commands/perfect/unreachable.cpp (8 of 105) UNSUPPORTED: cross-project-tests :: debuginfo-tests/dexter/feature_tests/commands/perfect/dex_declare_file/precompiled_binary/commands.dex (9 of 105) FAIL: cross-project-tests :: debuginfo-tests/dexter-tests/dbg-arg.c (10 of 105) ******************** TEST 'cross-project-tests :: debuginfo-tests/dexter-tests/dbg-arg.c' FAILED ******************** Script: -- : 'RUN: at line 5'; "/usr/local/opt/python/bin/python3.7" "/Users/buildslave/jenkins/workspace/lldb-cmake/llvm-project/cross-project-tests/debuginfo-tests/dexter/dexter.py" test --lldb-executable "/Users/buildslave/jenkins/workspace/lldb-cmake/lldb-build/bin/lldb" --fail-lt 1.0 -w --builder clang-c --debugger 'lldb' --cflags "-m64 -mllvm -fast-isel=false -g" -- /Users/buildslave/jenkins/workspace/lldb-cmake/llvm-project/cross-project-tests/debuginfo-tests/dexter-tests/dbg-arg.c -- Exit Code: 2

Hide Details

Command Output (stdout): -- dbg-arg.c: nan/nan (nan) [Command '['/usr/local/opt/python/bin/python3.7', '/Users/buildslave/jenkins/workspace/lldb-cmake/llvm-project/cross-project-tests/debuginfo-tests/dexter/dex/../dexter.py', 'run-debugger-internal-', '/var/folders/09/r4vw4v8n5kb67jl66zvlbljw0000gn/T/dexter/tmprzb5y9p2/tmpz7he4ykb', '--working-directory=/var/folders/09/r4vw4v8n5kb67jl66zvlbljw0000gn/T/dexter/tmprzb5y9p2', '--unittest=off', '--indent-timer-level=3']' returned non-zero exit status 1.]

Hide Details

Hide Details

-- Command Output (stderr): --

Hide Details

error: could not load lldb (No module named 'six')

Hide Details

Hide Details

--

Hide Details

******************** UNSUPPORTED: cross-project-tests :: debuginfo-tests/dexter-tests/realigned-frame.cpp (11 of 105) UNSUPPORTED: cross-project-tests :: debuginfo-tests/dexter/feature_tests/commands/perfect/expect_step_kind/func.cpp (12 of 105) FAIL: cross-project-tests :: debuginfo-tests/dexter-tests/optnone-vectors-and-functions.cpp (13 of 105) ******************** TEST 'cross-project-tests :: debuginfo-tests/dexter-tests/optnone-vectors-and-functions.cpp' FAILED ******************** Script: -- : 'RUN: at line 1'; "/usr/local/opt/python/bin/python3.7" "/Users/buildslave/jenkins/workspace/lldb-cmake/llvm-project/cross-project-tests/debuginfo-tests/dexter/dexter.py" test --lldb-executable "/Users/buildslave/jenkins/workspace/lldb-cmake/lldb-build/bin/lldb" --fail-lt 1.0 -w --builder 'clang' --debugger 'lldb' --cflags "-g -O2" -v -- /Users/buildslave/jenkins/workspace/lldb-cmake/llvm-project/cross-project-tests/debuginfo-tests/dexter-tests/optnone-vectors-and-functions.cpp : 'RUN: at line 4'; "/usr/local/opt/python/bin/python3.7" "/Users/buildslave/jenkins/workspace/lldb-cmake/llvm-project/cross-project-tests/debuginfo-tests/dexter/dexter.py" test --lldb-executable "/Users/buildslave/jenkins/workspace/lldb-cmake/lldb-build/bin/lldb" --fail-lt 1.0 -w --builder 'clang' --debugger 'lldb' --cflags "-g -O0" -- /Users/buildslave/jenkins/workspace/lldb-cmake/llvm-project/cross-project-tests/debuginfo-tests/dexter-tests/optnone-vectors-and-functions.cpp -- Exit Code: 2

Hide Details

Command Output (stdout): -- optnone-vectors-and-functions.cpp: nan/nan (nan) [Command '['/usr/local/opt/python/bin/python3.7', '/Users/buildslave/jenkins/workspace/lldb-cmake/llvm-project/cross-project-tests/debuginfo-tests/dexter/dex/../dexter.py', 'run-debugger-internal-', '/var/folders/09/r4vw4v8n5kb67jl66zvlbljw0000gn/T/dexter/tmp42yg4c3_/tmpcywxzzd2', '--working-directory=/var/folders/09/r4vw4v8n5kb67jl66zvlbljw0000gn/T/dexter/tmp42yg4c3_', '--unittest=off', '--indent-timer-level=3']' returned non-zero exit status 1.] Command '['/usr/local/opt/python/bin/python3.7', '/Users/buildslave/jenkins/workspace/lldb-cmake/llvm-project/cross-project-tests/debuginfo-tests/dexter/dex/../dexter.py', 'run-debugger-internal-', '/var/folders/09/r4vw4v8n5kb67jl66zvlbljw0000gn/T/dexter/tmp42yg4c3_/tmpcywxzzd2', '--working-directory=/var/folders/09/r4vw4v8n5kb67jl66zvlbljw0000gn/T/dexter/tmp42yg4c3_', '--unittest=off', '--indent-timer-level=3']' returned non-zero exit status 1. -- Command Output (stderr): --

Hide Details

error: could not load lldb (No module named 'six')

Hide Details

Traceback (most recent call last): File "/Users/buildslave/jenkins/workspace/lldb-cmake/llvm-project/cross-project-tests/debuginfo-tests/dexter/dex/debugger/lldb/LLDB.py", line 83, in _load_interface return imp.load_module('lldb', *module_info) File "/usr/local/Cellar/python/3.7.1/Frameworks/Python.framework/Versions/3.7/lib/python3.7/imp.py", line 244, in load_module return load_package(name, filename) File "/usr/local/Cellar/python/3.7.1/Frameworks/Python.framework/Versions/3.7/lib/python3.7/imp.py", line 216, in load_package return _load(spec) File "<frozen importlib._bootstrap>", line 696, in _load File "<frozen importlib._bootstrap>", line 677, in _load_unlocked File "<frozen importlib._bootstrap_external>", line 728, in exec_module File "<frozen importlib._bootstrap>", line 219, in _call_with_frames_removed File "/Users/buildslave/jenkins/workspace/lldb-cmake/lldb-build/lib/python3.7/site-packages/lldb/__init__.py", line 99, in <module> import six ModuleNotFoundError: No module named 'six'

Hide Details

During handling of the above exception, another exception occurred:

Hide Details

Traceback (most recent call last): File "/Users/buildslave/jenkins/workspace/lldb-cmake/llvm-project/cross-project-tests/debuginfo-tests/dexter/dex/debugger/DebuggerBase.py", line 48, in __init__ self._interface = self._load_interface() File "/Users/buildslave/jenkins/workspace/lldb-cmake/llvm-project/cross-project-tests/debuginfo-tests/dexter/dex/debugger/lldb/LLDB.py", line 89, in _load_interface raise LoadDebuggerException(msg, sys.exc_info()) dex.utils.Exceptions.LoadDebuggerException: No module named 'six'

Hide Details

Hide Details

--

Hide Details

******************** UNSUPPORTED: cross-project-tests :: debuginfo-tests/dexter/feature_tests/commands/perfect/limit_steps/limit_steps_expect_value.cpp (14 of 105) UNSUPPORTED: cross-project-tests :: debuginfo-tests/dexter/feature_tests/subtools/clang-opt-bisect/clang-opt-bisect.cpp (15 of 105) UNSUPPORTED: cross-project-tests :: debuginfo-tests/dexter/feature_tests/commands/perfect/expect_step_kind/small_loop.cpp (16 of 105) PASS: cross-project-tests :: debuginfo-tests/dexter/feature_tests/subtools/test/err_paren.cpp (17 of 105) UNSUPPORTED: cross-project-tests :: debuginfo-tests/dexter/feature_tests/commands/perfect/dex_finish_test/default_simple.cpp (18 of 105) FAIL: cross-project-tests :: debuginfo-tests/dexter-tests/vla.c (19 of 105) ******************** TEST 'cross-project-tests :: debuginfo-tests/dexter-tests/vla.c' FAILED ******************** Script: -- : 'RUN: at line 5'; "/usr/local/opt/python/bin/python3.7" "/Users/buildslave/jenkins/workspace/lldb-cmake/llvm-project/cross-project-tests/debuginfo-tests/dexter/dexter.py" test --lldb-executable "/Users/buildslave/jenkins/workspace/lldb-cmake/lldb-build/bin/lldb" --fail-lt 1.0 -w --builder clang-c --debugger 'lldb' --cflags "-O0 -glldb" -- /Users/buildslave/jenkins/workspace/lldb-cmake/llvm-project/cross-project-tests/debuginfo-tests/dexter-tests/vla.c -- Exit Code: 2

Hide Details

Command Output (stdout): -- vla.c: nan/nan (nan) [Command '['/usr/local/opt/python/bin/python3.7', '/Users/buildslave/jenkins/workspace/lldb-cmake/llvm-project/cross-project-tests/debuginfo-tests/dexter/dex/../dexter.py', 'run-debugger-internal-', '/var/folders/09/r4vw4v8n5kb67jl66zvlbljw0000gn/T/dexter/tmpuemiqht7/tmpm_48relx', '--working-directory=/var/folders/09/r4vw4v8n5kb67jl66zvlbljw0000gn/T/dexter/tmpuemiqht7', '--unittest=off', '--indent-timer-level=3']' returned non-zero exit status 1.]

Hide Details

Hide Details

-- Command Output (stderr): --

Hide Details

error: could not load lldb (No module named 'six')

Hide Details

Hide Details

--

Hide Details

******************** XFAIL: cross-project-tests :: debuginfo-tests/dexter-tests/memvars/ptr-to.c (20 of 105) UNSUPPORTED: cross-project-tests :: debuginfo-tests/dexter/feature_tests/commands/penalty/unreachable.cpp (21 of 105) UNSUPPORTED: cross-project-tests :: debuginfo-tests/dexter/feature_tests/commands/perfect/dex_finish_test/default_conditional_hit_count.cpp (22 of 105) UNSUPPORTED: cross-project-tests :: debuginfo-tests/dexter/feature_tests/commands/penalty/expect_step_order.cpp (23 of 105) UNSUPPORTED: cross-project-tests :: debuginfo-tests/dexter-tests/hello.c (24 of 105) UNSUPPORTED: cross-project-tests :: debuginfo-tests/dexter/feature_tests/commands/perfect/limit_steps/hit_count.cpp (25 of 105) UNSUPPORTED: cross-project-tests :: debuginfo-tests/dexter/feature_tests/commands/perfect/limit_steps/unconditional.cpp (26 of 105) XFAIL: cross-project-tests :: debuginfo-tests/dexter/feature_tests/subtools/test/source-root-dir.cpp (27 of 105) UNSUPPORTED: cross-project-tests :: debuginfo-tests/dexter/feature_tests/commands/perfect/dex_declare_file/precompiled_binary_different_dir/dex_commands/commands.dex (28 of 105) UNSUPPORTED: cross-project-tests :: debuginfo-tests/dexter-tests/nrvo.cpp (29 of 105) PASS: cross-project-tests :: debuginfo-tests/dexter/feature_tests/subtools/test/err_label_kwarg.cpp (30 of 105) FAIL: cross-project-tests :: debuginfo-tests/dexter-tests/asan.c (31 of 105) ******************** TEST 'cross-project-tests :: debuginfo-tests/dexter-tests/asan.c' FAILED ******************** Script: -- : 'RUN: at line 6'; "/usr/local/opt/python/bin/python3.7" "/Users/buildslave/jenkins/workspace/lldb-cmake/llvm-project/cross-project-tests/debuginfo-tests/dexter/dexter.py" test --lldb-executable "/Users/buildslave/jenkins/workspace/lldb-cmake/lldb-build/bin/lldb" --fail-lt 1.0 -w --builder 'clang-c' --debugger 'lldb' --cflags "--driver-mode=gcc -O0 -glldb -fblocks -arch x86_64 -fsanitize=address" --ldflags="-fsanitize=address" -- /Users/buildslave/jenkins/workspace/lldb-cmake/llvm-project/cross-project-tests/debuginfo-tests/dexter-tests/asan.c -- Exit Code: 2

Hide Details

Command Output (stdout): -- asan.c: nan/nan (nan) [Command '['/usr/local/opt/python/bin/python3.7', '/Users/buildslave/jenkins/workspace/lldb-cmake/llvm-project/cross-project-tests/debuginfo-tests/dexter/dex/../dexter.py', 'run-debugger-internal-', '/var/folders/09/r4vw4v8n5kb67jl66zvlbljw0000gn/T/dexter/tmp8cy85znw/tmp36bak6cs', '--working-directory=/var/folders/09/r4vw4v8n5kb67jl66zvlbljw0000gn/T/dexter/tmp8cy85znw', '--unittest=off', '--indent-timer-level=3']' returned non-zero exit status 1.]

Hide Details

Hide Details

-- Command Output (stderr): --

Hide Details

error: could not load lldb (No module named 'six')

Hide Details

Hide Details

--

Hide Details

******************** UNSUPPORTED: cross-project-tests :: debuginfo-tests/dexter/feature_tests/commands/perfect/limit_steps/limit_steps_line_mismatch.cpp (32 of 105) FAIL: cross-project-tests :: debuginfo-tests/dexter-tests/deferred_globals.cpp (33 of 105) ******************** TEST 'cross-project-tests :: debuginfo-tests/dexter-tests/deferred_globals.cpp' FAILED ******************** Script: -- : 'RUN: at line 8'; "/usr/local/opt/python/bin/python3.7" "/Users/buildslave/jenkins/workspace/lldb-cmake/llvm-project/cross-project-tests/debuginfo-tests/dexter/dexter.py" test --lldb-executable "/Users/buildslave/jenkins/workspace/lldb-cmake/lldb-build/bin/lldb" --fail-lt 1.0 -w --builder 'clang' --debugger 'lldb' --cflags "-g -O0" -v -- /Users/buildslave/jenkins/workspace/lldb-cmake/llvm-project/cross-project-tests/debuginfo-tests/dexter-tests/deferred_globals.cpp -- Exit Code: 2

Hide Details

Command Output (stdout): -- deferred_globals.cpp: nan/nan (nan) [Command '['/usr/local/opt/python/bin/python3.7', '/Users/buildslave/jenkins/workspace/lldb-cmake/llvm-project/cross-project-tests/debuginfo-tests/dexter/dex/../dexter.py', 'run-debugger-internal-', '/var/folders/09/r4vw4v8n5kb67jl66zvlbljw0000gn/T/dexter/tmp0px8lnu8/tmp0q769f_1', '--working-directory=/var/folders/09/r4vw4v8n5kb67jl66zvlbljw0000gn/T/dexter/tmp0px8lnu8', '--unittest=off', '--indent-timer-level=3']' returned non-zero exit status 1.] Command '['/usr/local/opt/python/bin/python3.7', '/Users/buildslave/jenkins/workspace/lldb-cmake/llvm-project/cross-project-tests/debuginfo-tests/dexter/dex/../dexter.py', 'run-debugger-internal-', '/var/folders/09/r4vw4v8n5kb67jl66zvlbljw0000gn/T/dexter/tmp0px8lnu8/tmp0q769f_1', '--working-directory=/var/folders/09/r4vw4v8n5kb67jl66zvlbljw0000gn/T/dexter/tmp0px8lnu8', '--unittest=off', '--indent-timer-level=3']' returned non-zero exit status 1. -- Command Output (stderr): --

Hide Details

error: could not load lldb (No module named 'six')

Hide Details

Traceback (most recent call last): File "/Users/buildslave/jenkins/workspace/lldb-cmake/llvm-project/cross-project-tests/debuginfo-tests/dexter/dex/debugger/lldb/LLDB.py", line 83, in _load_interface return imp.load_module('lldb', *module_info) File "/usr/local/Cellar/python/3.7.1/Frameworks/Python.framework/Versions/3.7/lib/python3.7/imp.py", line 244, in load_module return load_package(name, filename) File "/usr/local/Cellar/python/3.7.1/Frameworks/Python.framework/Versions/3.7/lib/python3.7/imp.py", line 216, in load_package return _load(spec) File "<frozen importlib._bootstrap>", line 696, in _load File "<frozen importlib._bootstrap>", line 677, in _load_unlocked File "<frozen importlib._bootstrap_external>", line 728, in exec_module File "<frozen importlib._bootstrap>", line 219, in _call_with_frames_removed File "/Users/buildslave/jenkins/workspace/lldb-cmake/lldb-build/lib/python3.7/site-packages/lldb/__init__.py", line 99, in <module> import six ModuleNotFoundError: No module named 'six'

Hide Details

During handling of the above exception, another exception occurred:

Hide Details

Traceback (most recent call last): File "/Users/buildslave/jenkins/workspace/lldb-cmake/llvm-project/cross-project-tests/debuginfo-tests/dexter/dex/debugger/DebuggerBase.py", line 48, in __init__ self._interface = self._load_interface() File "/Users/buildslave/jenkins/workspace/lldb-cmake/llvm-project/cross-project-tests/debuginfo-tests/dexter/dex/debugger/lldb/LLDB.py", line 89, in _load_interface raise LoadDebuggerException(msg, sys.exc_info()) dex.utils.Exceptions.LoadDebuggerException: No module named 'six'

Hide Details

Hide Details

--

Hide Details

******************** FAIL: cross-project-tests :: debuginfo-tests/dexter-tests/optnone-simple-functions.cpp (34 of 105) ******************** TEST 'cross-project-tests :: debuginfo-tests/dexter-tests/optnone-simple-functions.cpp' FAILED ******************** Script: -- : 'RUN: at line 1'; "/usr/local/opt/python/bin/python3.7" "/Users/buildslave/jenkins/workspace/lldb-cmake/llvm-project/cross-project-tests/debuginfo-tests/dexter/dexter.py" test --lldb-executable "/Users/buildslave/jenkins/workspace/lldb-cmake/lldb-build/bin/lldb" --fail-lt 1.0 -w --builder 'clang' --debugger 'lldb' --cflags "-O2 -g" -- /Users/buildslave/jenkins/workspace/lldb-cmake/llvm-project/cross-project-tests/debuginfo-tests/dexter-tests/optnone-simple-functions.cpp : 'RUN: at line 4'; "/usr/local/opt/python/bin/python3.7" "/Users/buildslave/jenkins/workspace/lldb-cmake/llvm-project/cross-project-tests/debuginfo-tests/dexter/dexter.py" test --lldb-executable "/Users/buildslave/jenkins/workspace/lldb-cmake/lldb-build/bin/lldb" --fail-lt 1.0 -w --builder 'clang' --debugger 'lldb' --cflags "-O0 -g" -- /Users/buildslave/jenkins/workspace/lldb-cmake/llvm-project/cross-project-tests/debuginfo-tests/dexter-tests/optnone-simple-functions.cpp -- Exit Code: 2

Hide Details

Command Output (stdout): -- optnone-simple-functions.cpp: nan/nan (nan) [Command '['/usr/local/opt/python/bin/python3.7', '/Users/buildslave/jenkins/workspace/lldb-cmake/llvm-project/cross-project-tests/debuginfo-tests/dexter/dex/../dexter.py', 'run-debugger-internal-', '/var/folders/09/r4vw4v8n5kb67jl66zvlbljw0000gn/T/dexter/tmp1q_vh_2d/tmp2oby8kcr', '--working-directory=/var/folders/09/r4vw4v8n5kb67jl66zvlbljw0000gn/T/dexter/tmp1q_vh_2d', '--unittest=off', '--indent-timer-level=3']' returned non-zero exit status 1.]

Hide Details

Hide Details

-- Command Output (stderr): --

Hide Details

error: could not load lldb (No module named 'six')

Hide Details

Hide Details

--

Hide Details

******************** UNSUPPORTED: cross-project-tests :: debuginfo-tests/dexter-tests/optnone-loops.cpp (35 of 105) FAIL: cross-project-tests :: debuginfo-tests/dexter/feature_tests/subtools/test/label_another_line.cpp (36 of 105) ******************** TEST 'cross-project-tests :: debuginfo-tests/dexter/feature_tests/subtools/test/label_another_line.cpp' FAILED ******************** Script: -- : 'RUN: at line 8'; "/usr/local/opt/python/bin/python3.7" "/Users/buildslave/jenkins/workspace/lldb-cmake/llvm-project/cross-project-tests/debuginfo-tests/dexter/dexter.py" test --fail-lt 1.0 -w --debugger lldb --builder clang --cflags "-O0 -glldb" -- /Users/buildslave/jenkins/workspace/lldb-cmake/llvm-project/cross-project-tests/debuginfo-tests/dexter/feature_tests/subtools/test/label_another_line.cpp | /Users/buildslave/jenkins/workspace/lldb-cmake/lldb-build/bin/FileCheck /Users/buildslave/jenkins/workspace/lldb-cmake/llvm-project/cross-project-tests/debuginfo-tests/dexter/feature_tests/subtools/test/label_another_line.cpp -- Exit Code: 1

Hide Details

Command Output (stderr): --

Hide Details

error: could not load lldb (No module named 'six')

Hide Details

/Users/buildslave/jenkins/workspace/lldb-cmake/llvm-project/cross-project-tests/debuginfo-tests/dexter/feature_tests/subtools/test/label_another_line.cpp:9:11: error: CHECK: expected string not found in input // CHECK: label_another_line.cpp: (1.0000) ^ <stdin>:1:1: note: scanning from here label_another_line.cpp: nan/nan (nan) [Command '['/usr/local/opt/python/bin/python3.7', '/Users/buildslave/jenkins/workspace/lldb-cmake/llvm-project/cross-project-tests/debuginfo-tests/dexter/dex/../dexter.py', 'run-debugger-internal-', '/var/folders/09/r4vw4v8n5kb67jl66zvlbljw0000gn/T/dexter/tmp64a849sg/tmp4ujdp_fs', '--working-directory=/var/folders/09/r4vw4v8n5kb67jl66zvlbljw0000gn/T/dexter/tmp64a849sg', '--unittest=off', '--indent-timer-level=3']' returned non-zero exit status 1.] ^

Hide Details

Input file: <stdin> Check file: /Users/buildslave/jenkins/workspace/lldb-cmake/llvm-project/cross-project-tests/debuginfo-tests/dexter/feature_tests/subtools/test/label_another_line.cpp

Hide Details

-dump-input=help explains the following input dump.

Hide Details

Input was: <<<<<< 1: label_another_line.cpp: nan/nan (nan) [Command '['/usr/local/opt/python/bin/python3.7', '/Users/buildslave/jenkins/workspace/lldb-cmake/llvm-project/cross-project-tests/debuginfo-tests/dexter/dex/../dexter.py', 'run-debugger-internal-', '/var/folders/09/r4vw4v8n5kb67jl66zvlbljw0000gn/T/dexter/tmp64a849sg/tmp4ujdp_fs', '--working-directory=/var/folders/09/r4vw4v8n5kb67jl66zvlbljw0000gn/T/dexter/tmp64a849sg', '--unittest=off', '--indent-timer-level=3']' returned non-zero exit status 1.] check:9 X~~~~~~~~~~~~~~~~~~~~~~~~~~~~~~~~~~~~~~~~~~~~~~~~~~~~~~~~~~~~~~~~~~~~~~~~~~~~~~~~~~~~~~~~~~~~~~~~~~~~~~~~~~~~~~~~~~~~~~~~~~~~~~~~~~~~~~~~~~~~~~~~~~~~~~~~~~~~~~~~~~~~~~~~~~~~~~~~~~~~~~~~~~~~~~~~~~~~~~~~~~~~~~~~~~~~~~~~~~~~~~~~~~~~~~~~~~~~~~~~~~~~~~~~~~~~~~~~~~~~~~~~~~~~~~~~~~~~~~~~~~~~~~~~~~~~~~~~~~~~~~~~~~~~~~~~~~~~~~~~~~~~~~~~~~~~~~~~~~~~~~~~~~~~~~~~~~~~~~~~~~~~~~~~~~~~~~~~~~~~~~~~~~~~~~~~~~~~~~~~~~~~~~~~~~~~~~~~~~~~~~~~~~~~~~~~~~~~~~~~~~~~~~~~~~~~~~~~~~~~~~~~~~~~~~~~~~~~~~~~~~~~~~~~~ error: no match found 2: check:9 ~ >>>>>>

Hide Details

--

Hide Details

******************** UNSUPPORTED: cross-project-tests :: debuginfo-tests/dexter/feature_tests/commands/perfect/dex_finish_test/default_conditional.cpp (37 of 105) PASS: cross-project-tests :: debuginfo-tests/dexter/feature_tests/subtools/test/err_bad_label_ref.cpp (38 of 105) UNSUPPORTED: cross-project-tests :: debuginfo-tests/dexter/feature_tests/commands/perfect/expect_step_kind/direction.cpp (39 of 105) PASS: cross-project-tests :: debuginfo-tests/dexter/feature_tests/unittests/run.test (40 of 105) PASS: cross-project-tests :: debuginfo-tests/llgdb-tests/static-member.cpp (41 of 105) XFAIL: cross-project-tests :: debuginfo-tests/dexter-tests/memvars/const-branch.c (42 of 105) FAIL: cross-project-tests :: debuginfo-tests/dexter-tests/memvars/ctrl-flow.c (43 of 105) ******************** TEST 'cross-project-tests :: debuginfo-tests/dexter-tests/memvars/ctrl-flow.c' FAILED ******************** Script: -- : 'RUN: at line 3'; "/usr/local/opt/python/bin/python3.7" "/Users/buildslave/jenkins/workspace/lldb-cmake/llvm-project/cross-project-tests/debuginfo-tests/dexter/dexter.py" test --lldb-executable "/Users/buildslave/jenkins/workspace/lldb-cmake/lldb-build/bin/lldb" --fail-lt 1.0 -w --debugger lldb --builder clang-c --cflags "-O2 -glldb" -- /Users/buildslave/jenkins/workspace/lldb-cmake/llvm-project/cross-project-tests/debuginfo-tests/dexter-tests/memvars/ctrl-flow.c -- Exit Code: 2

Hide Details

Command Output (stdout): -- ctrl-flow.c: nan/nan (nan) [Command '['/usr/local/opt/python/bin/python3.7', '/Users/buildslave/jenkins/workspace/lldb-cmake/llvm-project/cross-project-tests/debuginfo-tests/dexter/dex/../dexter.py', 'run-debugger-internal-', '/var/folders/09/r4vw4v8n5kb67jl66zvlbljw0000gn/T/dexter/tmpqkpc395k/tmpz1lt16k7', '--working-directory=/var/folders/09/r4vw4v8n5kb67jl66zvlbljw0000gn/T/dexter/tmpqkpc395k', '--unittest=off', '--indent-timer-level=3']' returned non-zero exit status 1.]

Hide Details

Hide Details

-- Command Output (stderr): --

Hide Details

error: could not load lldb (No module named 'six')

Hide Details

Hide Details

--

Hide Details

******************** FAIL: cross-project-tests :: debuginfo-tests/dexter-tests/ctor.cpp (44 of 105) ******************** TEST 'cross-project-tests :: debuginfo-tests/dexter-tests/ctor.cpp' FAILED ******************** Script: -- : 'RUN: at line 4'; "/usr/local/opt/python/bin/python3.7" "/Users/buildslave/jenkins/workspace/lldb-cmake/llvm-project/cross-project-tests/debuginfo-tests/dexter/dexter.py" test --lldb-executable "/Users/buildslave/jenkins/workspace/lldb-cmake/lldb-build/bin/lldb" --fail-lt 1.0 -w --builder 'clang' --debugger 'lldb' --cflags "-O0 -glldb" -- /Users/buildslave/jenkins/workspace/lldb-cmake/llvm-project/cross-project-tests/debuginfo-tests/dexter-tests/ctor.cpp -- Exit Code: 2

Hide Details

Command Output (stdout): -- ctor.cpp: nan/nan (nan) [Command '['/usr/local/opt/python/bin/python3.7', '/Users/buildslave/jenkins/workspace/lldb-cmake/llvm-project/cross-project-tests/debuginfo-tests/dexter/dex/../dexter.py', 'run-debugger-internal-', '/var/folders/09/r4vw4v8n5kb67jl66zvlbljw0000gn/T/dexter/tmpxdbva48g/tmpzhr2bn3x', '--working-directory=/var/folders/09/r4vw4v8n5kb67jl66zvlbljw0000gn/T/dexter/tmpxdbva48g', '--unittest=off', '--indent-timer-level=3']' returned non-zero exit status 1.]

Hide Details

Hide Details

-- Command Output (stderr): --

Hide Details

error: could not load lldb (No module named 'six')

Hide Details

Hide Details

--

Hide Details

******************** UNSUPPORTED: cross-project-tests :: debuginfo-tests/dexter/feature_tests/commands/perfect/dex_declare_file/precompiled_binary_different_dir/dex_commands/source_root_dir.dex (45 of 105) UNSUPPORTED: cross-project-tests :: debuginfo-tests/dexter/feature_tests/commands/perfect/limit_steps/limit_steps_overlapping_ranges.cpp (46 of 105) UNSUPPORTED: cross-project-tests :: debuginfo-tests/dexter/feature_tests/commands/perfect/expect_watch_type.cpp (47 of 105) UNSUPPORTED: cross-project-tests :: debuginfo-tests/dexter/feature_tests/commands/penalty/dex_declare_file.cpp (48 of 105) UNSUPPORTED: cross-project-tests :: debuginfo-tests/dexter/feature_tests/subtools/test/err_limit_steps_no_values.cpp (49 of 105) UNSUPPORTED: cross-project-tests :: debuginfo-tests/dexter/feature_tests/commands/perfect/expect_step_kind/recursive.cpp (50 of 105) UNSUPPORTED: cross-project-tests :: debuginfo-tests/dexter/feature_tests/commands/perfect/dex_finish_test/default_hit_count.cpp (51 of 105) UNSUPPORTED: cross-project-tests :: debuginfo-tests/dexter/feature_tests/commands/perfect/expect_step_order.cpp (52 of 105) FAIL: cross-project-tests :: debuginfo-tests/dexter-tests/optnone-fastmath.cpp (53 of 105) ******************** TEST 'cross-project-tests :: debuginfo-tests/dexter-tests/optnone-fastmath.cpp' FAILED ******************** Script: -- : 'RUN: at line 1'; "/usr/local/opt/python/bin/python3.7" "/Users/buildslave/jenkins/workspace/lldb-cmake/llvm-project/cross-project-tests/debuginfo-tests/dexter/dexter.py" test --lldb-executable "/Users/buildslave/jenkins/workspace/lldb-cmake/lldb-build/bin/lldb" --fail-lt 1.0 -w --builder 'clang' --debugger 'lldb' --cflags "-ffast-math -O2 -g" -- /Users/buildslave/jenkins/workspace/lldb-cmake/llvm-project/cross-project-tests/debuginfo-tests/dexter-tests/optnone-fastmath.cpp : 'RUN: at line 4'; "/usr/local/opt/python/bin/python3.7" "/Users/buildslave/jenkins/workspace/lldb-cmake/llvm-project/cross-project-tests/debuginfo-tests/dexter/dexter.py" test --lldb-executable "/Users/buildslave/jenkins/workspace/lldb-cmake/lldb-build/bin/lldb" --fail-lt 1.0 -w --builder 'clang' --debugger 'lldb' --cflags "-ffast-math -O0 -g" -- /Users/buildslave/jenkins/workspace/lldb-cmake/llvm-project/cross-project-tests/debuginfo-tests/dexter-tests/optnone-fastmath.cpp -- Exit Code: 2

Hide Details

Command Output (stdout): -- optnone-fastmath.cpp: nan/nan (nan) [Command '['/usr/local/opt/python/bin/python3.7', '/Users/buildslave/jenkins/workspace/lldb-cmake/llvm-project/cross-project-tests/debuginfo-tests/dexter/dex/../dexter.py', 'run-debugger-internal-', '/var/folders/09/r4vw4v8n5kb67jl66zvlbljw0000gn/T/dexter/tmp_5ahhxgr/tmp7ka9me8i', '--working-directory=/var/folders/09/r4vw4v8n5kb67jl66zvlbljw0000gn/T/dexter/tmp_5ahhxgr', '--unittest=off', '--indent-timer-level=3']' returned non-zero exit status 1.]

Hide Details

Hide Details

-- Command Output (stderr): --

Hide Details

error: could not load lldb (No module named 'six')

Hide Details

Hide Details

--

Hide Details

******************** PASS: cross-project-tests :: debuginfo-tests/llgdb-tests/asan.c (54 of 105) PASS: cross-project-tests :: debuginfo-tests/dexter/feature_tests/subtools/test/err_paren_mline.cpp (55 of 105) FAIL: cross-project-tests :: debuginfo-tests/dexter/feature_tests/subtools/test/label_offset.cpp (56 of 105) ******************** TEST 'cross-project-tests :: debuginfo-tests/dexter/feature_tests/subtools/test/label_offset.cpp' FAILED ******************** Script: -- : 'RUN: at line 5'; "/usr/local/opt/python/bin/python3.7" "/Users/buildslave/jenkins/workspace/lldb-cmake/llvm-project/cross-project-tests/debuginfo-tests/dexter/dexter.py" test --fail-lt 1.0 -w --debugger lldb --builder clang --cflags "-O0 -glldb" -v -- /Users/buildslave/jenkins/workspace/lldb-cmake/llvm-project/cross-project-tests/debuginfo-tests/dexter/feature_tests/subtools/test/label_offset.cpp | /Users/buildslave/jenkins/workspace/lldb-cmake/lldb-build/bin/FileCheck /Users/buildslave/jenkins/workspace/lldb-cmake/llvm-project/cross-project-tests/debuginfo-tests/dexter/feature_tests/subtools/test/label_offset.cpp -- Exit Code: 1

Hide Details

Command Output (stderr): --

Hide Details

error: could not load lldb (No module named 'six')

Hide Details

Traceback (most recent call last): File "/Users/buildslave/jenkins/workspace/lldb-cmake/llvm-project/cross-project-tests/debuginfo-tests/dexter/dex/debugger/lldb/LLDB.py", line 83, in _load_interface return imp.load_module('lldb', *module_info) File "/usr/local/Cellar/python/3.7.1/Frameworks/Python.framework/Versions/3.7/lib/python3.7/imp.py", line 244, in load_module return load_package(name, filename) File "/usr/local/Cellar/python/3.7.1/Frameworks/Python.framework/Versions/3.7/lib/python3.7/imp.py", line 216, in load_package return _load(spec) File "<frozen importlib._bootstrap>", line 696, in _load File "<frozen importlib._bootstrap>", line 677, in _load_unlocked File "<frozen importlib._bootstrap_external>", line 728, in exec_module File "<frozen importlib._bootstrap>", line 219, in _call_with_frames_removed File "/Users/buildslave/jenkins/workspace/lldb-cmake/lldb-build/lib/python3.7/site-packages/lldb/__init__.py", line 99, in <module> import six ModuleNotFoundError: No module named 'six'

Hide Details

During handling of the above exception, another exception occurred:

Hide Details

Traceback (most recent call last): File "/Users/buildslave/jenkins/workspace/lldb-cmake/llvm-project/cross-project-tests/debuginfo-tests/dexter/dex/debugger/DebuggerBase.py", line 48, in __init__ self._interface = self._load_interface() File "/Users/buildslave/jenkins/workspace/lldb-cmake/llvm-project/cross-project-tests/debuginfo-tests/dexter/dex/debugger/lldb/LLDB.py", line 89, in _load_interface raise LoadDebuggerException(msg, sys.exc_info()) dex.utils.Exceptions.LoadDebuggerException: No module named 'six'

Hide Details

/Users/buildslave/jenkins/workspace/lldb-cmake/llvm-project/cross-project-tests/debuginfo-tests/dexter/feature_tests/subtools/test/label_offset.cpp:7:11: error: CHECK: expected string not found in input // CHECK: label_offset.cpp: (1.0000) ^ <stdin>:1:1: note: scanning from here label_offset.cpp: nan/nan (nan) [Command '['/usr/local/opt/python/bin/python3.7', '/Users/buildslave/jenkins/workspace/lldb-cmake/llvm-project/cross-project-tests/debuginfo-tests/dexter/dex/../dexter.py', 'run-debugger-internal-', '/var/folders/09/r4vw4v8n5kb67jl66zvlbljw0000gn/T/dexter/tmpvhuepyaf/tmprdlcy8s6', '--working-directory=/var/folders/09/r4vw4v8n5kb67jl66zvlbljw0000gn/T/dexter/tmpvhuepyaf', '--unittest=off', '--indent-timer-level=3']' returned non-zero exit status 1.] ^

Hide Details

Input file: <stdin> Check file: /Users/buildslave/jenkins/workspace/lldb-cmake/llvm-project/cross-project-tests/debuginfo-tests/dexter/feature_tests/subtools/test/label_offset.cpp

Hide Details

-dump-input=help explains the following input dump.

Hide Details

Input was: <<<<<< 1: label_offset.cpp: nan/nan (nan) [Command '['/usr/local/opt/python/bin/python3.7', '/Users/buildslave/jenkins/workspace/lldb-cmake/llvm-project/cross-project-tests/debuginfo-tests/dexter/dex/../dexter.py', 'run-debugger-internal-', '/var/folders/09/r4vw4v8n5kb67jl66zvlbljw0000gn/T/dexter/tmpvhuepyaf/tmprdlcy8s6', '--working-directory=/var/folders/09/r4vw4v8n5kb67jl66zvlbljw0000gn/T/dexter/tmpvhuepyaf', '--unittest=off', '--indent-timer-level=3']' returned non-zero exit status 1.] check:7 X~~~~~~~~~~~~~~~~~~~~~~~~~~~~~~~~~~~~~~~~~~~~~~~~~~~~~~~~~~~~~~~~~~~~~~~~~~~~~~~~~~~~~~~~~~~~~~~~~~~~~~~~~~~~~~~~~~~~~~~~~~~~~~~~~~~~~~~~~~~~~~~~~~~~~~~~~~~~~~~~~~~~~~~~~~~~~~~~~~~~~~~~~~~~~~~~~~~~~~~~~~~~~~~~~~~~~~~~~~~~~~~~~~~~~~~~~~~~~~~~~~~~~~~~~~~~~~~~~~~~~~~~~~~~~~~~~~~~~~~~~~~~~~~~~~~~~~~~~~~~~~~~~~~~~~~~~~~~~~~~~~~~~~~~~~~~~~~~~~~~~~~~~~~~~~~~~~~~~~~~~~~~~~~~~~~~~~~~~~~~~~~~~~~~~~~~~~~~~~~~~~~~~~~~~~~~~~~~~~~~~~~~~~~~~~~~~~~~~~~~~~~~~~~~~~~~~~~~~~~~~~~~~~~~~~~~~~~~~~~~~~~ error: no match found 2: Command '['/usr/local/opt/python/bin/python3.7', '/Users/buildslave/jenkins/workspace/lldb-cmake/llvm-project/cross-project-tests/debuginfo-tests/dexter/dex/../dexter.py', 'run-debugger-internal-', '/var/folders/09/r4vw4v8n5kb67jl66zvlbljw0000gn/T/dexter/tmpvhuepyaf/tmprdlcy8s6', '--working-directory=/var/folders/09/r4vw4v8n5kb67jl66zvlbljw0000gn/T/dexter/tmpvhuepyaf', '--unittest=off', '--indent-timer-level=3']' returned non-zero exit status 1. check:7 ~~~~~~~~~~~~~~~~~~~~~~~~~~~~~~~~~~~~~~~~~~~~~~~~~~~~~~~~~~~~~~~~~~~~~~~~~~~~~~~~~~~~~~~~~~~~~~~~~~~~~~~~~~~~~~~~~~~~~~~~~~~~~~~~~~~~~~~~~~~~~~~~~~~~~~~~~~~~~~~~~~~~~~~~~~~~~~~~~~~~~~~~~~~~~~~~~~~~~~~~~~~~~~~~~~~~~~~~~~~~~~~~~~~~~~~~~~~~~~~~~~~~~~~~~~~~~~~~~~~~~~~~~~~~~~~~~~~~~~~~~~~~~~~~~~~~~~~~~~~~~~~~~~~~~~~~~~~~~~~~~~~~~~~~~~~~~~~~~~~~~~~~~~~~~~~~~~~~~~~~~~~~~~~~~~~~~~~~~~~~~~~~~~~~~~~~~~~~~~~~~~~~~~~~~~~~~~~~~~~~~~~~~~~~~~~~~~~~~~~~~~~~~~~~~ >>>>>>

Hide Details

--

Hide Details

******************** UNSUPPORTED: cross-project-tests :: debuginfo-tests/llvm-prettyprinters/gdb/mlir-support.gdb (57 of 105) XFAIL: cross-project-tests :: debuginfo-tests/dexter-tests/memvars/bitcast.c (58 of 105) XFAIL: cross-project-tests :: debuginfo-tests/dexter-tests/memvars/inlining-dse.c (59 of 105) UNSUPPORTED: cross-project-tests :: debuginfo-tests/dexter/feature_tests/commands/perfect/expect_step_kind/func_external.cpp (60 of 105) PASS: cross-project-tests :: debuginfo-tests/dexter/feature_tests/subtools/help/help.test (61 of 105) PASS: cross-project-tests :: debuginfo-tests/llgdb-tests/forward-declare-class.cpp (62 of 105) PASS: cross-project-tests :: debuginfo-tests/llgdb-tests/foreach.m (63 of 105) UNSUPPORTED: cross-project-tests :: debuginfo-tests/dexter-tests/inline-line-gap.cpp (64 of 105) UNSUPPORTED: cross-project-tests :: debuginfo-tests/dexter-tests/global-constant.cpp (65 of 105) UNSUPPORTED: cross-project-tests :: debuginfo-tests/dexter/feature_tests/commands/penalty/expect_watch_value.cpp (66 of 105) UNSUPPORTED: cross-project-tests :: debuginfo-tests/dexter/feature_tests/commands/perfect/limit_steps/limit_steps_expect_loop.cpp (67 of 105) UNSUPPORTED: cross-project-tests :: debuginfo-tests/dexter/feature_tests/commands/perfect/dex_declare_file/windows_noncanonical_path/test.dex (68 of 105) PASS: cross-project-tests :: debuginfo-tests/dexter/feature_tests/subtools/test/err_syntax_mline.cpp (69 of 105) UNSUPPORTED: cross-project-tests :: debuginfo-tests/dexter/feature_tests/commands/perfect/expect_program_state.cpp (70 of 105) XFAIL: cross-project-tests :: debuginfo-tests/dexter-tests/asan-deque.cpp (71 of 105) UNSUPPORTED: cross-project-tests :: debuginfo-tests/dexter/feature_tests/commands/perfect/dex_finish_test/limit_steps_conditional_hit_count.cpp (72 of 105) PASS: cross-project-tests :: debuginfo-tests/dexter/feature_tests/subtools/test/err_duplicate_label.cpp (73 of 105) FAIL: cross-project-tests :: debuginfo-tests/dexter-tests/nrvo-string.cpp (74 of 105) ******************** TEST 'cross-project-tests :: debuginfo-tests/dexter-tests/nrvo-string.cpp' FAILED ******************** Script: -- : 'RUN: at line 10'; "/usr/local/opt/python/bin/python3.7" "/Users/buildslave/jenkins/workspace/lldb-cmake/llvm-project/cross-project-tests/debuginfo-tests/dexter/dexter.py" test --lldb-executable "/Users/buildslave/jenkins/workspace/lldb-cmake/lldb-build/bin/lldb" --fail-lt 1.0 -w --builder 'clang' --debugger 'lldb' --cflags "-O0 -glldb -fno-exceptions" -- /Users/buildslave/jenkins/workspace/lldb-cmake/llvm-project/cross-project-tests/debuginfo-tests/dexter-tests/nrvo-string.cpp : 'RUN: at line 14'; "/usr/local/opt/python/bin/python3.7" "/Users/buildslave/jenkins/workspace/lldb-cmake/llvm-project/cross-project-tests/debuginfo-tests/dexter/dexter.py" test --lldb-executable "/Users/buildslave/jenkins/workspace/lldb-cmake/lldb-build/bin/lldb" --fail-lt 1.0 -w --builder 'clang' --debugger 'lldb' --cflags "-O1 -glldb -fno-exceptions" -- /Users/buildslave/jenkins/workspace/lldb-cmake/llvm-project/cross-project-tests/debuginfo-tests/dexter-tests/nrvo-string.cpp -- Exit Code: 2

Hide Details

Command Output (stdout): -- nrvo-string.cpp: nan/nan (nan) [Command '['/usr/local/opt/python/bin/python3.7', '/Users/buildslave/jenkins/workspace/lldb-cmake/llvm-project/cross-project-tests/debuginfo-tests/dexter/dex/../dexter.py', 'run-debugger-internal-', '/var/folders/09/r4vw4v8n5kb67jl66zvlbljw0000gn/T/dexter/tmp6h5w78e2/tmp6mralviu', '--working-directory=/var/folders/09/r4vw4v8n5kb67jl66zvlbljw0000gn/T/dexter/tmp6h5w78e2', '--unittest=off', '--indent-timer-level=3']' returned non-zero exit status 1.]

Hide Details

Hide Details

-- Command Output (stderr): --

Hide Details

error: could not load lldb (No module named 'six')

Hide Details

Hide Details

--

Hide Details

******************** XFAIL: cross-project-tests :: debuginfo-tests/dexter-tests/memvars/implicit-ptr.c (75 of 105) UNSUPPORTED: cross-project-tests :: debuginfo-tests/dexter/feature_tests/commands/penalty/expect_watch_type.cpp (76 of 105) UNSUPPORTED: cross-project-tests :: debuginfo-tests/llvm-prettyprinters/gdb/llvm-support.gdb (77 of 105) FAIL: cross-project-tests :: debuginfo-tests/dexter-tests/namespace.cpp (78 of 105) ******************** TEST 'cross-project-tests :: debuginfo-tests/dexter-tests/namespace.cpp' FAILED ******************** Script: -- : 'RUN: at line 8'; "/usr/local/opt/python/bin/python3.7" "/Users/buildslave/jenkins/workspace/lldb-cmake/llvm-project/cross-project-tests/debuginfo-tests/dexter/dexter.py" test --lldb-executable "/Users/buildslave/jenkins/workspace/lldb-cmake/lldb-build/bin/lldb" --fail-lt 1.0 -w --builder 'clang' --debugger 'lldb' --cflags "-g -O0" -v -- /Users/buildslave/jenkins/workspace/lldb-cmake/llvm-project/cross-project-tests/debuginfo-tests/dexter-tests/namespace.cpp -- Exit Code: 2

Hide Details

Command Output (stdout): -- namespace.cpp: nan/nan (nan) [Command '['/usr/local/opt/python/bin/python3.7', '/Users/buildslave/jenkins/workspace/lldb-cmake/llvm-project/cross-project-tests/debuginfo-tests/dexter/dex/../dexter.py', 'run-debugger-internal-', '/var/folders/09/r4vw4v8n5kb67jl66zvlbljw0000gn/T/dexter/tmpezwtg4r4/tmpd2hnp4zb', '--working-directory=/var/folders/09/r4vw4v8n5kb67jl66zvlbljw0000gn/T/dexter/tmpezwtg4r4', '--unittest=off', '--indent-timer-level=3']' returned non-zero exit status 1.] Command '['/usr/local/opt/python/bin/python3.7', '/Users/buildslave/jenkins/workspace/lldb-cmake/llvm-project/cross-project-tests/debuginfo-tests/dexter/dex/../dexter.py', 'run-debugger-internal-', '/var/folders/09/r4vw4v8n5kb67jl66zvlbljw0000gn/T/dexter/tmpezwtg4r4/tmpd2hnp4zb', '--working-directory=/var/folders/09/r4vw4v8n5kb67jl66zvlbljw0000gn/T/dexter/tmpezwtg4r4', '--unittest=off', '--indent-timer-level=3']' returned non-zero exit status 1. -- Command Output (stderr): --

Hide Details

error: could not load lldb (No module named 'six')

Hide Details

Traceback (most recent call last): File "/Users/buildslave/jenkins/workspace/lldb-cmake/llvm-project/cross-project-tests/debuginfo-tests/dexter/dex/debugger/lldb/LLDB.py", line 83, in _load_interface return imp.load_module('lldb', *module_info) File "/usr/local/Cellar/python/3.7.1/Frameworks/Python.framework/Versions/3.7/lib/python3.7/imp.py", line 244, in load_module return load_package(name, filename) File "/usr/local/Cellar/python/3.7.1/Frameworks/Python.framework/Versions/3.7/lib/python3.7/imp.py", line 216, in load_package return _load(spec) File "<frozen importlib._bootstrap>", line 696, in _load File "<frozen importlib._bootstrap>", line 677, in _load_unlocked File "<frozen importlib._bootstrap_external>", line 728, in exec_module File "<frozen importlib._bootstrap>", line 219, in _call_with_frames_removed File "/Users/buildslave/jenkins/workspace/lldb-cmake/lldb-build/lib/python3.7/site-packages/lldb/__init__.py", line 99, in <module> import six ModuleNotFoundError: No module named 'six'

Hide Details

During handling of the above exception, another exception occurred:

Hide Details

Traceback (most recent call last): File "/Users/buildslave/jenkins/workspace/lldb-cmake/llvm-project/cross-project-tests/debuginfo-tests/dexter/dex/debugger/DebuggerBase.py", line 48, in __init__ self._interface = self._load_interface() File "/Users/buildslave/jenkins/workspace/lldb-cmake/llvm-project/cross-project-tests/debuginfo-tests/dexter/dex/debugger/lldb/LLDB.py", line 89, in _load_interface raise LoadDebuggerException(msg, sys.exc_info()) dex.utils.Exceptions.LoadDebuggerException: No module named 'six'

Hide Details

Hide Details

--

Hide Details

******************** UNSUPPORTED: cross-project-tests :: debuginfo-tests/dexter/feature_tests/commands/perfect/dex_finish_test/limit_steps_conditional.cpp (79 of 105) FAIL: cross-project-tests :: debuginfo-tests/dexter-tests/memvars/inlining.c (80 of 105) ******************** TEST 'cross-project-tests :: debuginfo-tests/dexter-tests/memvars/inlining.c' FAILED ******************** Script: -- : 'RUN: at line 3'; "/usr/local/opt/python/bin/python3.7" "/Users/buildslave/jenkins/workspace/lldb-cmake/llvm-project/cross-project-tests/debuginfo-tests/dexter/dexter.py" test --lldb-executable "/Users/buildslave/jenkins/workspace/lldb-cmake/lldb-build/bin/lldb" --fail-lt 1.0 -w --debugger lldb --builder clang-c --cflags "-O2 -glldb" -- /Users/buildslave/jenkins/workspace/lldb-cmake/llvm-project/cross-project-tests/debuginfo-tests/dexter-tests/memvars/inlining.c -- Exit Code: 2

Hide Details

Command Output (stdout): -- inlining.c: nan/nan (nan) [Command '['/usr/local/opt/python/bin/python3.7', '/Users/buildslave/jenkins/workspace/lldb-cmake/llvm-project/cross-project-tests/debuginfo-tests/dexter/dex/../dexter.py', 'run-debugger-internal-', '/var/folders/09/r4vw4v8n5kb67jl66zvlbljw0000gn/T/dexter/tmpwlj4q1mv/tmpbjv1mi1_', '--working-directory=/var/folders/09/r4vw4v8n5kb67jl66zvlbljw0000gn/T/dexter/tmpwlj4q1mv', '--unittest=off', '--indent-timer-level=3']' returned non-zero exit status 1.]

Hide Details

Hide Details

-- Command Output (stderr): --

Hide Details

error: could not load lldb (No module named 'six')

Hide Details

Hide Details

--

Hide Details

******************** FAIL: cross-project-tests :: debuginfo-tests/clang_llvm_roundtrip/simplified_template_names.cpp (81 of 105) ******************** TEST 'cross-project-tests :: debuginfo-tests/clang_llvm_roundtrip/simplified_template_names.cpp' FAILED ******************** Script: -- : 'RUN: at line 1'; /Users/buildslave/jenkins/workspace/lldb-cmake/lldb-build/bin/clang --target=x86_64-apple-darwin19.5.0 /Users/buildslave/jenkins/workspace/lldb-cmake/llvm-project/cross-project-tests/debuginfo-tests/clang_llvm_roundtrip/simplified_template_names.cpp -c -o - -gdwarf-4 -Xclang -gsimple-template-names=mangled -Xclang -debug-forward-template-params -std=c++20 | llvm-dwarfdump --verify - : 'RUN: at line 3'; /Users/buildslave/jenkins/workspace/lldb-cmake/lldb-build/bin/clang --target=x86_64-apple-darwin19.5.0 /Users/buildslave/jenkins/workspace/lldb-cmake/llvm-project/cross-project-tests/debuginfo-tests/clang_llvm_roundtrip/simplified_template_names.cpp -c -o - -gdwarf-4 -Xclang -gsimple-template-names=mangled -Xclang -debug-forward-template-params -std=c++20 -fdebug-types-section | llvm-dwarfdump --verify - : 'RUN: at line 5'; /Users/buildslave/jenkins/workspace/lldb-cmake/lldb-build/bin/clang --target=x86_64-apple-darwin19.5.0 /Users/buildslave/jenkins/workspace/lldb-cmake/llvm-project/cross-project-tests/debuginfo-tests/clang_llvm_roundtrip/simplified_template_names.cpp -c -o - -gdwarf-5 -Xclang -gsimple-template-names=mangled -Xclang -debug-forward-template-params -std=c++20 -fdebug-types-section | llvm-dwarfdump --verify - -- Exit Code: 1

Hide Details

Command Output (stderr): -- /Users/buildslave/jenkins/workspace/lldb-cmake/llvm-project/cross-project-tests/debuginfo-tests/clang_llvm_roundtrip/simplified_template_names.cpp:121:27: error: no type named 'size_t' in namespace 'std' void* operator new(std::size_t, T) { ~~~~~^ /Users/buildslave/jenkins/workspace/lldb-cmake/llvm-project/cross-project-tests/debuginfo-tests/clang_llvm_roundtrip/simplified_template_names.cpp:128:29: error: no type named 'size_t' in namespace 'std' void* operator new[](std::size_t, T) { ~~~~~^ /Users/buildslave/jenkins/workspace/lldb-cmake/llvm-project/cross-project-tests/debuginfo-tests/clang_llvm_roundtrip/simplified_template_names.cpp:260:3: error: no matching function for call to 'operator new' t6::operator new(0, 0); ^~~~~~~~~~~~~~~~ /Users/buildslave/jenkins/workspace/lldb-cmake/llvm-project/cross-project-tests/debuginfo-tests/clang_llvm_roundtrip/simplified_template_names.cpp:261:3: error: no matching function for call to 'operator new[]' t6::operator new[](0, 0); ^~~~~~~~~~~~~~~~~~ 4 errors generated. error: -: The file was not recognized as a valid object file

Hide Details

--

Hide Details

******************** PASS: cross-project-tests :: debuginfo-tests/llgdb-tests/asan-blocks.c (82 of 105) XFAIL: cross-project-tests :: debuginfo-tests/dexter-tests/memvars/unused-merged-value.c (83 of 105) PASS: cross-project-tests :: debuginfo-tests/dexter/feature_tests/subtools/test/err_type_mline.cpp (84 of 105) FAIL: cross-project-tests :: debuginfo-tests/dexter-tests/stack-var.c (85 of 105) ******************** TEST 'cross-project-tests :: debuginfo-tests/dexter-tests/stack-var.c' FAILED ******************** Script: -- : 'RUN: at line 4'; "/usr/local/opt/python/bin/python3.7" "/Users/buildslave/jenkins/workspace/lldb-cmake/llvm-project/cross-project-tests/debuginfo-tests/dexter/dexter.py" test --lldb-executable "/Users/buildslave/jenkins/workspace/lldb-cmake/lldb-build/bin/lldb" --fail-lt 1.0 -w --builder clang-c --debugger 'lldb' --cflags "-O -glldb" -- /Users/buildslave/jenkins/workspace/lldb-cmake/llvm-project/cross-project-tests/debuginfo-tests/dexter-tests/stack-var.c -- Exit Code: 2

Hide Details

Command Output (stdout): -- stack-var.c: nan/nan (nan) [Command '['/usr/local/opt/python/bin/python3.7', '/Users/buildslave/jenkins/workspace/lldb-cmake/llvm-project/cross-project-tests/debuginfo-tests/dexter/dex/../dexter.py', 'run-debugger-internal-', '/var/folders/09/r4vw4v8n5kb67jl66zvlbljw0000gn/T/dexter/tmpoaw1sbfg/tmpjdis867f', '--working-directory=/var/folders/09/r4vw4v8n5kb67jl66zvlbljw0000gn/T/dexter/tmpoaw1sbfg', '--unittest=off', '--indent-timer-level=3']' returned non-zero exit status 1.]

Hide Details

Hide Details

-- Command Output (stderr): --

Hide Details

error: could not load lldb (No module named 'six')

Hide Details

Hide Details

--

Hide Details

******************** XFAIL: cross-project-tests :: debuginfo-tests/dexter-tests/memvars/loop.c (86 of 105) PASS: cross-project-tests :: debuginfo-tests/llgdb-tests/sret.cpp (87 of 105) XFAIL: cross-project-tests :: debuginfo-tests/dexter-tests/memvars/inline-escaping-function.c (88 of 105) PASS: cross-project-tests :: debuginfo-tests/llgdb-tests/nested-struct.cpp (89 of 105) UNSUPPORTED: cross-project-tests :: debuginfo-tests/dexter/feature_tests/commands/perfect/dex_declare_file/dex_and_source/test.cpp (90 of 105) XFAIL: cross-project-tests :: debuginfo-tests/dexter-tests/memvars/merged-store.c (91 of 105) UNSUPPORTED: cross-project-tests :: debuginfo-tests/dexter/feature_tests/commands/perfect/dex_finish_test/limit_steps_simple.cpp (92 of 105) PASS: cross-project-tests :: debuginfo-tests/llgdb-tests/nrvo-string.cpp (93 of 105) PASS: cross-project-tests :: debuginfo-tests/dexter/feature_tests/subtools/test/err_syntax.cpp (94 of 105) UNSUPPORTED: cross-project-tests :: debuginfo-tests/dexter/feature_tests/commands/penalty/expect_step_kinds.cpp (95 of 105) PASS: cross-project-tests :: debuginfo-tests/dexter/feature_tests/subtools/test/err_type.cpp (96 of 105) PASS: cross-project-tests :: debuginfo-tests/llgdb-tests/block_var.m (97 of 105) XFAIL: cross-project-tests :: debuginfo-tests/dexter-tests/memvars/struct-dse.c (98 of 105) UNSUPPORTED: cross-project-tests :: debuginfo-tests/llgdb-tests/safestack.c (99 of 105) FAIL: cross-project-tests :: debuginfo-tests/dexter-tests/aggregate-indirect-arg.cpp (100 of 105) ******************** TEST 'cross-project-tests :: debuginfo-tests/dexter-tests/aggregate-indirect-arg.cpp' FAILED ******************** Script: -- : 'RUN: at line 4'; "/usr/local/opt/python/bin/python3.7" "/Users/buildslave/jenkins/workspace/lldb-cmake/llvm-project/cross-project-tests/debuginfo-tests/dexter/dexter.py" test --lldb-executable "/Users/buildslave/jenkins/workspace/lldb-cmake/lldb-build/bin/lldb" --fail-lt 1.0 -w --builder 'clang' --debugger 'lldb' --cflags "-O0 -g" --ldflags="-lstdc++" -- /Users/buildslave/jenkins/workspace/lldb-cmake/llvm-project/cross-project-tests/debuginfo-tests/dexter-tests/aggregate-indirect-arg.cpp -- Exit Code: 2

Hide Details

Command Output (stdout): -- aggregate-indirect-arg.cpp: nan/nan (nan) [Command '['/usr/local/opt/python/bin/python3.7', '/Users/buildslave/jenkins/workspace/lldb-cmake/llvm-project/cross-project-tests/debuginfo-tests/dexter/dex/../dexter.py', 'run-debugger-internal-', '/var/folders/09/r4vw4v8n5kb67jl66zvlbljw0000gn/T/dexter/tmpm__ep8cq/tmpt5m9irkm', '--working-directory=/var/folders/09/r4vw4v8n5kb67jl66zvlbljw0000gn/T/dexter/tmpm__ep8cq', '--unittest=off', '--indent-timer-level=3']' returned non-zero exit status 1.]

Hide Details

Hide Details

-- Command Output (stderr): --

Hide Details

error: could not load lldb (No module named 'six')

Hide Details

Hide Details

--

Hide Details

******************** FAIL: cross-project-tests :: debuginfo-tests/dexter-tests/optnone-struct-and-methods.cpp (101 of 105) ******************** TEST 'cross-project-tests :: debuginfo-tests/dexter-tests/optnone-struct-and-methods.cpp' FAILED ******************** Script: -- : 'RUN: at line 1'; "/usr/local/opt/python/bin/python3.7" "/Users/buildslave/jenkins/workspace/lldb-cmake/llvm-project/cross-project-tests/debuginfo-tests/dexter/dexter.py" test --lldb-executable "/Users/buildslave/jenkins/workspace/lldb-cmake/lldb-build/bin/lldb" --fail-lt 1.0 -w --builder 'clang' --debugger 'lldb' --cflags "-g -O2" -v -- /Users/buildslave/jenkins/workspace/lldb-cmake/llvm-project/cross-project-tests/debuginfo-tests/dexter-tests/optnone-struct-and-methods.cpp : 'RUN: at line 4'; "/usr/local/opt/python/bin/python3.7" "/Users/buildslave/jenkins/workspace/lldb-cmake/llvm-project/cross-project-tests/debuginfo-tests/dexter/dexter.py" test --lldb-executable "/Users/buildslave/jenkins/workspace/lldb-cmake/lldb-build/bin/lldb" --fail-lt 1.0 -w --builder 'clang' --debugger 'lldb' --cflags "-g -O0" -- /Users/buildslave/jenkins/workspace/lldb-cmake/llvm-project/cross-project-tests/debuginfo-tests/dexter-tests/optnone-struct-and-methods.cpp -- Exit Code: 2

Hide Details

Command Output (stdout): -- optnone-struct-and-methods.cpp: nan/nan (nan) [Command '['/usr/local/opt/python/bin/python3.7', '/Users/buildslave/jenkins/workspace/lldb-cmake/llvm-project/cross-project-tests/debuginfo-tests/dexter/dex/../dexter.py', 'run-debugger-internal-', '/var/folders/09/r4vw4v8n5kb67jl66zvlbljw0000gn/T/dexter/tmp7d60n9lx/tmpm9r1vlnj', '--working-directory=/var/folders/09/r4vw4v8n5kb67jl66zvlbljw0000gn/T/dexter/tmp7d60n9lx', '--unittest=off', '--indent-timer-level=3']' returned non-zero exit status 1.] Command '['/usr/local/opt/python/bin/python3.7', '/Users/buildslave/jenkins/workspace/lldb-cmake/llvm-project/cross-project-tests/debuginfo-tests/dexter/dex/../dexter.py', 'run-debugger-internal-', '/var/folders/09/r4vw4v8n5kb67jl66zvlbljw0000gn/T/dexter/tmp7d60n9lx/tmpm9r1vlnj', '--working-directory=/var/folders/09/r4vw4v8n5kb67jl66zvlbljw0000gn/T/dexter/tmp7d60n9lx', '--unittest=off', '--indent-timer-level=3']' returned non-zero exit status 1. -- Command Output (stderr): --

Hide Details

error: could not load lldb (No module named 'six')

Hide Details

Traceback (most recent call last): File "/Users/buildslave/jenkins/workspace/lldb-cmake/llvm-project/cross-project-tests/debuginfo-tests/dexter/dex/debugger/lldb/LLDB.py", line 83, in _load_interface return imp.load_module('lldb', *module_info) File "/usr/local/Cellar/python/3.7.1/Frameworks/Python.framework/Versions/3.7/lib/python3.7/imp.py", line 244, in load_module return load_package(name, filename) File "/usr/local/Cellar/python/3.7.1/Frameworks/Python.framework/Versions/3.7/lib/python3.7/imp.py", line 216, in load_package return _load(spec) File "<frozen importlib._bootstrap>", line 696, in _load File "<frozen importlib._bootstrap>", line 677, in _load_unlocked File "<frozen importlib._bootstrap_external>", line 728, in exec_module File "<frozen importlib._bootstrap>", line 219, in _call_with_frames_removed File "/Users/buildslave/jenkins/workspace/lldb-cmake/lldb-build/lib/python3.7/site-packages/lldb/__init__.py", line 99, in <module> import six ModuleNotFoundError: No module named 'six'

Hide Details

During handling of the above exception, another exception occurred:

Hide Details

Traceback (most recent call last): File "/Users/buildslave/jenkins/workspace/lldb-cmake/llvm-project/cross-project-tests/debuginfo-tests/dexter/dex/debugger/DebuggerBase.py", line 48, in __init__ self._interface = self._load_interface() File "/Users/buildslave/jenkins/workspace/lldb-cmake/llvm-project/cross-project-tests/debuginfo-tests/dexter/dex/debugger/lldb/LLDB.py", line 89, in _load_interface raise LoadDebuggerException(msg, sys.exc_info()) dex.utils.Exceptions.LoadDebuggerException: No module named 'six'

Hide Details

Hide Details

--

Hide Details

******************** UNSUPPORTED: cross-project-tests :: debuginfo-tests/dexter/feature_tests/commands/penalty/expect_program_state.cpp (102 of 105) FAIL: cross-project-tests :: debuginfo-tests/dexter/feature_tests/subtools/view.cpp (103 of 105) ******************** TEST 'cross-project-tests :: debuginfo-tests/dexter/feature_tests/subtools/view.cpp' FAILED ******************** Script: -- : 'RUN: at line 5'; "/usr/local/opt/python/bin/python3.7" "/Users/buildslave/jenkins/workspace/lldb-cmake/llvm-project/cross-project-tests/debuginfo-tests/dexter/dexter.py" test --fail-lt 1.0 -w --debugger lldb --builder clang --cflags "-O0 -glldb" --results /Users/buildslave/jenkins/workspace/lldb-cmake/lldb-build/projects/cross-project-tests/debuginfo-tests/dexter/feature_tests/subtools/Output/view.cpp.tmp -- /Users/buildslave/jenkins/workspace/lldb-cmake/llvm-project/cross-project-tests/debuginfo-tests/dexter/feature_tests/subtools/view.cpp : 'RUN: at line 7'; "/usr/local/opt/python/bin/python3.7" "/Users/buildslave/jenkins/workspace/lldb-cmake/llvm-project/cross-project-tests/debuginfo-tests/dexter/dexter.py" view /Users/buildslave/jenkins/workspace/lldb-cmake/lldb-build/projects/cross-project-tests/debuginfo-tests/dexter/feature_tests/subtools/Output/view.cpp.tmp/view.cpp.dextIR | /Users/buildslave/jenkins/workspace/lldb-cmake/lldb-build/bin/FileCheck /Users/buildslave/jenkins/workspace/lldb-cmake/llvm-project/cross-project-tests/debuginfo-tests/dexter/feature_tests/subtools/view.cpp : 'RUN: at line 12'; rm -rf /Users/buildslave/jenkins/workspace/lldb-cmake/lldb-build/projects/cross-project-tests/debuginfo-tests/dexter/feature_tests/subtools/Output/view.cpp.tmp -- Exit Code: 2

Hide Details

Command Output (stdout): -- view.cpp: nan/nan (nan) [Command '['/usr/local/opt/python/bin/python3.7', '/Users/buildslave/jenkins/workspace/lldb-cmake/llvm-project/cross-project-tests/debuginfo-tests/dexter/dex/../dexter.py', 'run-debugger-internal-', '/var/folders/09/r4vw4v8n5kb67jl66zvlbljw0000gn/T/dexter/tmpee6abhvv/tmpigecj_3r', '--working-directory=/var/folders/09/r4vw4v8n5kb67jl66zvlbljw0000gn/T/dexter/tmpee6abhvv', '--unittest=off', '--indent-timer-level=3']' returned non-zero exit status 1.]

Hide Details

Hide Details

-- Command Output (stderr): --

Hide Details

error: could not load lldb (No module named 'six')

Hide Details

Hide Details

--

Hide Details

******************** PASS: cross-project-tests :: debuginfo-tests/llgdb-tests/asan-deque.cpp (104 of 105) PASS: cross-project-tests :: debuginfo-tests/llgdb-tests/blocks.m (105 of 105) Slowest Tests: -------------------------------------------------------------------------- 3.82s: cross-project-tests :: debuginfo-tests/dexter-tests/asan-deque.cpp 3.49s: cross-project-tests :: debuginfo-tests/llgdb-tests/blocks.m 2.93s: cross-project-tests :: debuginfo-tests/llgdb-tests/foreach.m 2.93s: cross-project-tests :: debuginfo-tests/llgdb-tests/asan-deque.cpp 2.73s: cross-project-tests :: debuginfo-tests/llgdb-tests/nrvo-string.cpp 1.89s: cross-project-tests :: debuginfo-tests/llgdb-tests/asan.c 1.86s: cross-project-tests :: debuginfo-tests/llgdb-tests/block_var.m 1.54s: cross-project-tests :: debuginfo-tests/llgdb-tests/asan-blocks.c 1.43s: cross-project-tests :: debuginfo-tests/dexter-tests/dbg-arg.c 1.42s: cross-project-tests :: debuginfo-tests/dexter/feature_tests/subtools/list-debuggers/list-debuggers.test 1.39s: cross-project-tests :: debuginfo-tests/llgdb-tests/static-member-2.cpp 1.31s: cross-project-tests :: debuginfo-tests/llgdb-tests/sret.cpp 1.17s: cross-project-tests :: debuginfo-tests/dexter-tests/optnone-vectors-and-functions.cpp 0.93s: cross-project-tests :: debuginfo-tests/llgdb-tests/static-member.cpp 0.70s: cross-project-tests :: debuginfo-tests/dexter-tests/optnone-struct-and-methods.cpp 0.66s: cross-project-tests :: debuginfo-tests/dexter/feature_tests/subtools/view.cpp 0.62s: cross-project-tests :: debuginfo-tests/dexter-tests/memvars/struct-dse.c 0.62s: cross-project-tests :: debuginfo-tests/dexter-tests/aggregate-indirect-arg.cpp 0.58s: cross-project-tests :: debuginfo-tests/dexter-tests/memvars/ctrl-flow.c 0.58s: cross-project-tests :: debuginfo-tests/dexter-tests/memvars/unused-merged-value.c

Hide Details

Tests Times: -------------------------------------------------------------------------- [ Range ] :: [ Percentage ] :: [ Count ] -------------------------------------------------------------------------- [3.80s,4.00s) :: [ ] :: [ 1/105] [3.60s,3.80s) :: [ ] :: [ 1/105] [3.40s,3.60s) :: [ ] :: [ 0/105] [3.20s,3.40s) :: [ ] :: [ 0/105] [3.00s,3.20s) :: [ ] :: [ 2/105] [2.80s,3.00s) :: [ ] :: [ 1/105] [2.60s,2.80s) :: [ ] :: [ 0/105] [2.40s,2.60s) :: [ ] :: [ 0/105] [2.20s,2.40s) :: [ ] :: [ 0/105] [2.00s,2.20s) :: [ ] :: [ 0/105] [1.80s,2.00s) :: [ ] :: [ 2/105] [1.60s,1.80s) :: [ ] :: [ 1/105] [1.40s,1.60s) :: [* ] :: [ 3/105] [1.20s,1.40s) :: [ ] :: [ 2/105] [1.00s,1.20s) :: [ ] :: [ 0/105] [0.80s,1.00s) :: [ ] :: [ 1/105] [0.60s,0.80s) :: [** ] :: [ 6/105] [0.40s,0.60s) :: [******* ] :: [ 20/105] [0.20s,0.40s) :: [****** ] :: [ 16/105] [0.00s,0.20s) :: [****************** ] :: [ 49/105] -------------------------------------------------------------------------- ******************** Failed Tests (19): cross-project-tests :: debuginfo-tests/clang_llvm_roundtrip/simplified_template_names.cpp cross-project-tests :: debuginfo-tests/dexter-tests/aggregate-indirect-arg.cpp cross-project-tests :: debuginfo-tests/dexter-tests/asan.c cross-project-tests :: debuginfo-tests/dexter-tests/ctor.cpp cross-project-tests :: debuginfo-tests/dexter-tests/dbg-arg.c cross-project-tests :: debuginfo-tests/dexter-tests/deferred_globals.cpp cross-project-tests :: debuginfo-tests/dexter-tests/memvars/ctrl-flow.c cross-project-tests :: debuginfo-tests/dexter-tests/memvars/inlining.c cross-project-tests :: debuginfo-tests/dexter-tests/namespace.cpp cross-project-tests :: debuginfo-tests/dexter-tests/nrvo-string.cpp cross-project-tests :: debuginfo-tests/dexter-tests/optnone-fastmath.cpp cross-project-tests :: debuginfo-tests/dexter-tests/optnone-simple-functions.cpp cross-project-tests :: debuginfo-tests/dexter-tests/optnone-struct-and-methods.cpp cross-project-tests :: debuginfo-tests/dexter-tests/optnone-vectors-and-functions.cpp cross-project-tests :: debuginfo-tests/dexter-tests/stack-var.c cross-project-tests :: debuginfo-tests/dexter-tests/vla.c cross-project-tests :: debuginfo-tests/dexter/feature_tests/subtools/test/label_another_line.cpp cross-project-tests :: debuginfo-tests/dexter/feature_tests/subtools/test/label_offset.cpp cross-project-tests :: debuginfo-tests/dexter/feature_tests/subtools/view.cpp

Hide Details

Hide Details

Testing Time: 13.26s Unsupported : 49 Passed : 24 Expectedly Failed: 13 Failed : 19 FAILED: projects/cross-project-tests/CMakeFiles/check-debuginfo cd /Users/buildslave/jenkins/workspace/lldb-cmake/lldb-build/projects/cross-project-tests && /usr/local/Frameworks/Python.framework/Versions/3.7/bin/python3.7 /Users/buildslave/jenkins/workspace/lldb-cmake/lldb-build/./bin/llvm-lit -v --time-tests --shuffle --xunit-xml-output=/Users/buildslave/jenkins/workspace/lldb-cmake/test/results.xml -v -j 4 /Users/buildslave/jenkins/workspace/lldb-cmake/lldb-build/projects/cross-project-tests/debuginfo-tests ninja: build stopped: subcommand failed. Command failed: Command '['/usr/bin/env', 'TERM=vt100', '/usr/local/bin/ninja', '-v', 'check-debuginfo']' returned non-zero exit status 1 Command: ['/usr/bin/env', 'TERM=vt100', '/usr/local/bin/ninja', '-v', 'check-debuginfo'] + set -e [Pipeline] } [Pipeline] // timeout [Pipeline] } [Pipeline] // stage [Pipeline] stage [Pipeline] { (Test (LLDB)) [Pipeline] timeout Timeout set to expire in 1 hr 30 min [Pipeline] { [Pipeline] sh + set -u + export PATH=/usr/local/bin:/usr/local/sbin:/usr/bin:/bin:/usr/sbin:/sbin:/usr/bin:/usr/local/bin + PATH=/usr/local/bin:/usr/local/sbin:/usr/bin:/bin:/usr/sbin:/sbin:/usr/bin:/usr/local/bin ++ sysctl hw.physicalcpu ++ awk '{print $2}' + export MAX_PARALLEL_TESTS=4 + MAX_PARALLEL_TESTS=4 + python llvm-zorg/zorg/jenkins/monorepo_build.py lldb-cmake test You are using pip version 18.1, however version 20.3.4 is available. You should consider upgrading via the 'pip install --upgrade pip' command. You are using pip version 18.1, however version 20.3.4 is available. You should consider upgrading via the 'pip install --upgrade pip' command. Dependency met os_version v10.15.5 Dependency met brew cmake v3.17.2 Dependency met brew ninja v1.8.2 Dependency met pip psutil v5.4.5 Dependency met pip six v1.11.0 Dependency met xcode v11.5
Clean

Hide Details

@@@ Clean @@@ Completed at: 2021-11-27T09:28:15 @@@@@@
Run Tests

Hide Details

@@@ Run Tests @@@ cd /Users/buildslave/jenkins/workspace/lldb-cmake/lldb-build '/usr/bin/env' 'TERM=vt100' '/usr/local/bin/ninja' '-v' 'check-lldb' [1/179] : && /Users/buildslave/jenkins/workspace/lldb-cmake/host-compiler/bin/clang++ -Wdocumentation -fPIC -fvisibility-inlines-hidden -Werror=date-time -Werror=unguarded-availability-new -fmodules -fmodules-cache-path=/Users/buildslave/jenkins/workspace/lldb-cmake/lldb-build/module.cache -fcxx-modules -Xclang -fmodules-local-submodule-visibility -Wall -Wextra -Wno-unused-parameter -Wwrite-strings -Wcast-qual -Wmissing-field-initializers -pedantic -Wno-long-long -Wc++98-compat-extra-semi -Wimplicit-fallthrough -Wcovered-switch-default -Wno-noexcept-type -Wnon-virtual-dtor -Wdelete-non-virtual-dtor -Wsuggest-override -Wstring-conversion -Wmisleading-indentation -fdiagnostics-color -Wno-deprecated-declarations -Wno-unknown-pragmas -Wno-strict-aliasing -Wno-deprecated-register -Wno-vla-extension -O3 -DNDEBUG -isysroot /Applications/Xcode.app/Contents/Developer/Platforms/MacOSX.platform/Developer/SDKs/MacOSX10.15.sdk -Wl,-search_paths_first -Wl,-headerpad_max_install_names -Wl,-dead_strip tools/lldb/unittests/ObjectFile/Breakpad/CMakeFiles/ObjectFileBreakpadTests.dir/BreakpadRecordsTest.cpp.o -o tools/lldb/unittests/ObjectFile/Breakpad/ObjectFileBreakpadTests lib/libLLVMSupport.a lib/libgtest_main.a lib/libgtest.a lib/liblldbPluginObjectFileBreakpad.a -lpthread lib/liblldbCore.a lib/liblldbSymbol.a lib/liblldbBreakpoint.a lib/liblldbDataFormatters.a lib/liblldbExpression.a lib/liblldbInterpreter.a lib/liblldbTarget.a lib/liblldbPluginCPlusPlusLanguage.a lib/liblldbPluginObjCLanguage.a lib/liblldbPluginObjectFileJIT.a lib/liblldbCommands.a lib/liblldbPluginProcessUtility.a lib/liblldbPluginClangCommon.a lib/liblldbPluginCPPRuntime.a lib/liblldbPluginTypeSystemClang.a lib/liblldbPluginAppleObjCRuntime.a lib/liblldbPluginExpressionParserClang.a lib/liblldbPluginSymbolFileDWARF.a lib/liblldbPluginSymbolFilePDB.a lib/liblldbPluginObjCRuntime.a lib/liblldbPluginRenderScriptRuntime.a lib/liblldbPluginSymbolFileNativePDB.a lib/liblldbPluginObjectFilePDB.a lib/liblldbCore.a lib/liblldbSymbol.a lib/liblldbBreakpoint.a lib/liblldbDataFormatters.a lib/liblldbExpression.a lib/liblldbInterpreter.a lib/liblldbTarget.a lib/liblldbPluginCPlusPlusLanguage.a lib/liblldbPluginObjCLanguage.a lib/liblldbPluginObjectFileJIT.a lib/liblldbCommands.a lib/liblldbPluginProcessUtility.a lib/liblldbPluginClangCommon.a lib/liblldbPluginCPPRuntime.a lib/liblldbPluginTypeSystemClang.a lib/liblldbPluginAppleObjCRuntime.a lib/liblldbPluginExpressionParserClang.a lib/liblldbPluginSymbolFileDWARF.a lib/liblldbPluginSymbolFilePDB.a lib/liblldbPluginObjCRuntime.a lib/liblldbPluginRenderScriptRuntime.a lib/liblldbPluginSymbolFileNativePDB.a lib/liblldbPluginObjectFilePDB.a lib/liblldbCore.a lib/liblldbSymbol.a lib/liblldbBreakpoint.a lib/liblldbDataFormatters.a lib/liblldbExpression.a lib/liblldbInterpreter.a lib/liblldbTarget.a lib/liblldbPluginCPlusPlusLanguage.a lib/liblldbPluginObjCLanguage.a lib/liblldbPluginObjectFileJIT.a lib/liblldbCommands.a lib/liblldbPluginProcessUtility.a lib/liblldbPluginClangCommon.a lib/liblldbPluginCPPRuntime.a lib/liblldbPluginTypeSystemClang.a lib/liblldbPluginAppleObjCRuntime.a lib/liblldbPluginExpressionParserClang.a lib/liblldbPluginSymbolFileDWARF.a lib/liblldbPluginSymbolFilePDB.a lib/liblldbPluginObjCRuntime.a lib/liblldbPluginRenderScriptRuntime.a lib/liblldbPluginSymbolFileNativePDB.a lib/liblldbPluginObjectFilePDB.a lib/liblldbCore.a lib/liblldbSymbol.a lib/liblldbBreakpoint.a lib/liblldbDataFormatters.a lib/liblldbExpression.a lib/liblldbInterpreter.a lib/liblldbTarget.a lib/liblldbPluginCPlusPlusLanguage.a lib/liblldbPluginObjCLanguage.a lib/liblldbPluginObjectFileJIT.a lib/liblldbCommands.a lib/liblldbPluginProcessUtility.a lib/liblldbPluginClangCommon.a lib/liblldbPluginCPPRuntime.a lib/liblldbPluginTypeSystemClang.a lib/liblldbPluginAppleObjCRuntime.a lib/liblldbPluginExpressionParserClang.a lib/liblldbPluginSymbolFileDWARF.a lib/liblldbPluginSymbolFilePDB.a lib/liblldbPluginObjCRuntime.a lib/liblldbPluginRenderScriptRuntime.a lib/liblldbPluginSymbolFileNativePDB.a lib/liblldbPluginObjectFilePDB.a lib/liblldbCore.a lib/liblldbSymbol.a lib/liblldbBreakpoint.a lib/liblldbDataFormatters.a lib/liblldbExpression.a lib/liblldbInterpreter.a lib/liblldbTarget.a lib/liblldbPluginCPlusPlusLanguage.a lib/liblldbPluginObjCLanguage.a lib/liblldbPluginObjectFileJIT.a lib/liblldbCommands.a lib/liblldbPluginProcessUtility.a lib/liblldbPluginClangCommon.a lib/liblldbPluginCPPRuntime.a lib/liblldbPluginTypeSystemClang.a lib/liblldbPluginAppleObjCRuntime.a lib/liblldbPluginExpressionParserClang.a lib/liblldbPluginSymbolFileDWARF.a lib/liblldbPluginSymbolFilePDB.a lib/liblldbPluginObjCRuntime.a lib/liblldbPluginRenderScriptRuntime.a lib/liblldbPluginSymbolFileNativePDB.a lib/liblldbPluginObjectFilePDB.a /usr/lib/libform.dylib /usr/lib/libpanel.dylib lib/liblldbBase.a lib/libLLVMMCJIT.a lib/libLLVMExecutionEngine.a lib/libLLVMOrcTargetProcess.a lib/libLLVMOrcShared.a lib/libLLVMRuntimeDyld.a lib/libclangCodeGen.a lib/libLLVMCoverage.a lib/libLLVMLTO.a lib/libLLVMExtensions.a lib/libLLVMCodeGen.a lib/libLLVMPasses.a lib/libLLVMCoroutines.a lib/libLLVMipo.a lib/libLLVMBitWriter.a lib/libLLVMLinker.a lib/libLLVMVectorize.a lib/libLLVMInstrumentation.a lib/libLLVMObjCARCOpts.a lib/libclangRewriteFrontend.a lib/libclangFrontend.a lib/libclangDriver.a lib/libLLVMOption.a lib/libclangParse.a lib/libclangRewrite.a lib/libclangSerialization.a lib/libclangSema.a lib/libclangEdit.a lib/libclangAnalysis.a lib/libclangASTMatchers.a lib/libLLVMDebugInfoDWARF.a lib/liblldbHost.a /usr/lib/libxml2.dylib /usr/lib/libedit.dylib /usr/local/lib/liblzma.dylib /usr/lib/libedit.dylib /usr/local/lib/liblzma.dylib lib/liblldbHostMacOSXObjCXX.a lib/libLLVMTarget.a lib/libLLVMIRReader.a lib/libLLVMAsmParser.a lib/libclangAST.a lib/libLLVMFrontendOpenMP.a lib/libLLVMScalarOpts.a lib/libLLVMAggressiveInstCombine.a lib/libLLVMInstCombine.a lib/libLLVMTransformUtils.a lib/libLLVMAnalysis.a lib/libLLVMProfileData.a lib/libclangLex.a lib/libclangBasic.a lib/libLLVMDebugInfoPDB.a lib/libLLVMObject.a lib/libLLVMBitReader.a lib/libLLVMCore.a lib/libLLVMRemarks.a lib/libLLVMBitstreamReader.a lib/libLLVMMCParser.a lib/libLLVMMC.a lib/libLLVMTextAPI.a lib/libLLVMDebugInfoCodeView.a lib/libLLVMDebugInfoMSF.a lib/liblldbUtility.a -framework Foundation -framework CoreFoundation -framework CoreServices -framework Security lib/libLLVMBinaryFormat.a lib/libLLVMSupport.a -lm /usr/lib/libz.dylib /usr/lib/libcurses.dylib lib/libLLVMDemangle.a && cd /Users/buildslave/jenkins/workspace/lldb-cmake/lldb-build/tools/lldb/unittests/ObjectFile/Breakpad && /usr/local/Cellar/cmake/3.17.2/bin/cmake -E make_directory /Users/buildslave/jenkins/workspace/lldb-cmake/lldb-build/tools/lldb/unittests/ObjectFile/Breakpad/./Inputs [2/179] : && /Users/buildslave/jenkins/workspace/lldb-cmake/host-compiler/bin/clang++ -Wdocumentation -fPIC -fvisibility-inlines-hidden -Werror=date-time -Werror=unguarded-availability-new -fmodules -fmodules-cache-path=/Users/buildslave/jenkins/workspace/lldb-cmake/lldb-build/module.cache -fcxx-modules -Xclang -fmodules-local-submodule-visibility -Wall -Wextra -Wno-unused-parameter -Wwrite-strings -Wcast-qual -Wmissing-field-initializers -pedantic -Wno-long-long -Wc++98-compat-extra-semi -Wimplicit-fallthrough -Wcovered-switch-default -Wno-noexcept-type -Wnon-virtual-dtor -Wdelete-non-virtual-dtor -Wsuggest-override -Wstring-conversion -Wmisleading-indentation -fdiagnostics-color -Wno-deprecated-declarations -Wno-unknown-pragmas -Wno-strict-aliasing -Wno-deprecated-register -Wno-vla-extension -O3 -DNDEBUG -isysroot /Applications/Xcode.app/Contents/Developer/Platforms/MacOSX.platform/Developer/SDKs/MacOSX10.15.sdk -Wl,-search_paths_first -Wl,-headerpad_max_install_names -Wl,-dead_strip tools/lldb/unittests/Platform/Android/CMakeFiles/AdbClientTests.dir/AdbClientTest.cpp.o -o tools/lldb/unittests/Platform/Android/AdbClientTests lib/libLLVMSupport.a lib/libgtest_main.a lib/libgtest.a lib/liblldbPluginPlatformAndroid.a -lpthread lib/liblldbPluginPlatformLinux.a lib/liblldbPluginPlatformPOSIX.a lib/liblldbPluginPlatformGDB.a lib/liblldbCore.a lib/liblldbBreakpoint.a lib/liblldbDataFormatters.a lib/liblldbExpression.a lib/liblldbInterpreter.a lib/liblldbSymbol.a lib/liblldbTarget.a lib/liblldbPluginCPlusPlusLanguage.a lib/liblldbPluginObjCLanguage.a lib/liblldbPluginProcessUtility.a lib/liblldbPluginObjectFileJIT.a lib/liblldbCommands.a lib/liblldbPluginClangCommon.a lib/liblldbPluginCPPRuntime.a lib/liblldbPluginTypeSystemClang.a lib/liblldbPluginAppleObjCRuntime.a lib/liblldbPluginExpressionParserClang.a lib/liblldbPluginSymbolFileDWARF.a lib/liblldbPluginSymbolFilePDB.a lib/liblldbPluginObjCRuntime.a lib/liblldbPluginRenderScriptRuntime.a lib/liblldbPluginSymbolFileNativePDB.a lib/liblldbPluginObjectFilePDB.a lib/liblldbCore.a lib/liblldbBreakpoint.a lib/liblldbDataFormatters.a lib/liblldbExpression.a lib/liblldbInterpreter.a lib/liblldbSymbol.a lib/liblldbTarget.a lib/liblldbPluginCPlusPlusLanguage.a lib/liblldbPluginObjCLanguage.a lib/liblldbPluginProcessUtility.a lib/liblldbPluginObjectFileJIT.a lib/liblldbCommands.a lib/liblldbPluginClangCommon.a lib/liblldbPluginCPPRuntime.a lib/liblldbPluginTypeSystemClang.a lib/liblldbPluginAppleObjCRuntime.a lib/liblldbPluginExpressionParserClang.a lib/liblldbPluginSymbolFileDWARF.a lib/liblldbPluginSymbolFilePDB.a lib/liblldbPluginObjCRuntime.a lib/liblldbPluginRenderScriptRuntime.a lib/liblldbPluginSymbolFileNativePDB.a lib/liblldbPluginObjectFilePDB.a lib/liblldbCore.a lib/liblldbBreakpoint.a lib/liblldbDataFormatters.a lib/liblldbExpression.a lib/liblldbInterpreter.a lib/liblldbSymbol.a lib/liblldbTarget.a lib/liblldbPluginCPlusPlusLanguage.a lib/liblldbPluginObjCLanguage.a lib/liblldbPluginProcessUtility.a lib/liblldbPluginObjectFileJIT.a lib/liblldbCommands.a lib/liblldbPluginClangCommon.a lib/liblldbPluginCPPRuntime.a lib/liblldbPluginTypeSystemClang.a lib/liblldbPluginAppleObjCRuntime.a lib/liblldbPluginExpressionParserClang.a lib/liblldbPluginSymbolFileDWARF.a lib/liblldbPluginSymbolFilePDB.a lib/liblldbPluginObjCRuntime.a lib/liblldbPluginRenderScriptRuntime.a lib/liblldbPluginSymbolFileNativePDB.a lib/liblldbPluginObjectFilePDB.a lib/liblldbCore.a lib/liblldbBreakpoint.a lib/liblldbDataFormatters.a lib/liblldbExpression.a lib/liblldbInterpreter.a lib/liblldbSymbol.a lib/liblldbTarget.a lib/liblldbPluginCPlusPlusLanguage.a lib/liblldbPluginObjCLanguage.a lib/liblldbPluginProcessUtility.a lib/liblldbPluginObjectFileJIT.a lib/liblldbCommands.a lib/liblldbPluginClangCommon.a lib/liblldbPluginCPPRuntime.a lib/liblldbPluginTypeSystemClang.a lib/liblldbPluginAppleObjCRuntime.a lib/liblldbPluginExpressionParserClang.a lib/liblldbPluginSymbolFileDWARF.a lib/liblldbPluginSymbolFilePDB.a lib/liblldbPluginObjCRuntime.a lib/liblldbPluginRenderScriptRuntime.a lib/liblldbPluginSymbolFileNativePDB.a lib/liblldbPluginObjectFilePDB.a lib/liblldbCore.a lib/liblldbBreakpoint.a lib/liblldbDataFormatters.a lib/liblldbExpression.a lib/liblldbInterpreter.a lib/liblldbSymbol.a lib/liblldbTarget.a lib/liblldbPluginCPlusPlusLanguage.a lib/liblldbPluginObjCLanguage.a lib/liblldbPluginProcessUtility.a lib/liblldbPluginObjectFileJIT.a lib/liblldbCommands.a lib/liblldbPluginClangCommon.a lib/liblldbPluginCPPRuntime.a lib/liblldbPluginTypeSystemClang.a lib/liblldbPluginAppleObjCRuntime.a lib/liblldbPluginExpressionParserClang.a lib/liblldbPluginSymbolFileDWARF.a lib/liblldbPluginSymbolFilePDB.a lib/liblldbPluginObjCRuntime.a lib/liblldbPluginRenderScriptRuntime.a lib/liblldbPluginSymbolFileNativePDB.a lib/liblldbPluginObjectFilePDB.a /usr/lib/libform.dylib /usr/lib/libpanel.dylib lib/liblldbBase.a lib/libLLVMMCJIT.a lib/libLLVMExecutionEngine.a lib/libLLVMOrcTargetProcess.a lib/libLLVMOrcShared.a lib/libLLVMRuntimeDyld.a lib/libclangCodeGen.a lib/libLLVMCoverage.a lib/libLLVMLTO.a lib/libLLVMExtensions.a lib/libLLVMCodeGen.a lib/libLLVMPasses.a lib/libLLVMCoroutines.a lib/libLLVMipo.a lib/libLLVMBitWriter.a lib/libLLVMLinker.a lib/libLLVMVectorize.a lib/libLLVMInstrumentation.a lib/libLLVMObjCARCOpts.a lib/libclangRewriteFrontend.a lib/libclangFrontend.a lib/libclangDriver.a lib/libLLVMOption.a lib/libclangParse.a lib/libclangRewrite.a lib/libclangSerialization.a lib/libclangSema.a lib/libclangEdit.a lib/libclangAnalysis.a lib/libclangASTMatchers.a lib/libLLVMDebugInfoDWARF.a lib/liblldbHost.a /usr/lib/libxml2.dylib /usr/lib/libedit.dylib /usr/local/lib/liblzma.dylib /usr/lib/libedit.dylib /usr/local/lib/liblzma.dylib lib/liblldbHostMacOSXObjCXX.a lib/libLLVMTarget.a lib/libLLVMIRReader.a lib/libLLVMAsmParser.a lib/libclangAST.a lib/libLLVMFrontendOpenMP.a lib/libLLVMScalarOpts.a lib/libLLVMAggressiveInstCombine.a lib/libLLVMInstCombine.a lib/libLLVMTransformUtils.a lib/libLLVMAnalysis.a lib/libLLVMProfileData.a lib/libclangLex.a lib/libclangBasic.a lib/libLLVMDebugInfoPDB.a lib/libLLVMObject.a lib/libLLVMBitReader.a lib/libLLVMCore.a lib/libLLVMRemarks.a lib/libLLVMBitstreamReader.a lib/libLLVMMCParser.a lib/libLLVMMC.a lib/libLLVMTextAPI.a lib/libLLVMDebugInfoCodeView.a lib/libLLVMDebugInfoMSF.a lib/liblldbUtility.a -framework Foundation -framework CoreFoundation -framework CoreServices -framework Security lib/libLLVMBinaryFormat.a lib/libLLVMSupport.a -lm /usr/lib/libz.dylib /usr/lib/libcurses.dylib lib/libLLVMDemangle.a && cd /Users/buildslave/jenkins/workspace/lldb-cmake/lldb-build/tools/lldb/unittests/Platform/Android && /usr/local/Cellar/cmake/3.17.2/bin/cmake -E make_directory /Users/buildslave/jenkins/workspace/lldb-cmake/lldb-build/tools/lldb/unittests/Platform/Android/./Inputs [3/179] /Users/buildslave/jenkins/workspace/lldb-cmake/host-compiler/bin/clang++ -DGTEST_HAS_RTTI=0 -DHAVE_ROUND -D_DEBUG -D__STDC_CONSTANT_MACROS -D__STDC_FORMAT_MACROS -D__STDC_LIMIT_MACROS -Itools/lldb/unittests/Platform -I/Users/buildslave/jenkins/workspace/lldb-cmake/llvm-project/lldb/unittests/Platform -I/Users/buildslave/jenkins/workspace/lldb-cmake/llvm-project/lldb/include -Itools/lldb/include -Iinclude -I/Users/buildslave/jenkins/workspace/lldb-cmake/llvm-project/llvm/include -I/usr/local/Cellar/python/3.7.1/Frameworks/Python.framework/Versions/3.7/include/python3.7m -I/Users/buildslave/jenkins/workspace/lldb-cmake/llvm-project/llvm/../clang/include -Itools/lldb/../clang/include -I/usr/local/include -I/Users/buildslave/jenkins/workspace/lldb-cmake/llvm-project/lldb/source -I/Users/buildslave/jenkins/workspace/lldb-cmake/llvm-project/lldb/unittests -I/Users/buildslave/jenkins/workspace/lldb-cmake/llvm-project/llvm/utils/unittest/googletest/include -I/Users/buildslave/jenkins/workspace/lldb-cmake/llvm-project/llvm/utils/unittest/googlemock/include -isystem /Applications/Xcode.app/Contents/Developer/Platforms/MacOSX.platform/Developer/SDKs/MacOSX10.15.sdk/usr/include/libxml2 -Wdocumentation -fPIC -fvisibility-inlines-hidden -Werror=date-time -Werror=unguarded-availability-new -fmodules -fmodules-cache-path=/Users/buildslave/jenkins/workspace/lldb-cmake/lldb-build/module.cache -fcxx-modules -Xclang -fmodules-local-submodule-visibility -Wall -Wextra -Wno-unused-parameter -Wwrite-strings -Wcast-qual -Wmissing-field-initializers -pedantic -Wno-long-long -Wc++98-compat-extra-semi -Wimplicit-fallthrough -Wcovered-switch-default -Wno-noexcept-type -Wnon-virtual-dtor -Wdelete-non-virtual-dtor -Wsuggest-override -Wstring-conversion -Wmisleading-indentation -fdiagnostics-color -Wno-deprecated-declarations -Wno-unknown-pragmas -Wno-strict-aliasing -Wno-deprecated-register -Wno-vla-extension -O3 -DNDEBUG -isysroot /Applications/Xcode.app/Contents/Developer/Platforms/MacOSX.platform/Developer/SDKs/MacOSX10.15.sdk -include /Users/buildslave/jenkins/workspace/lldb-cmake/llvm-project/lldb/unittests/gtest_common.h -Wno-variadic-macros -Wno-gnu-zero-variadic-macro-arguments -fno-exceptions -fno-rtti -UNDEBUG -Wno-suggest-override -std=c++14 -MD -MT tools/lldb/unittests/Platform/CMakeFiles/LLDBPlatformTests.dir/PlatformDarwinTest.cpp.o -MF tools/lldb/unittests/Platform/CMakeFiles/LLDBPlatformTests.dir/PlatformDarwinTest.cpp.o.d -o tools/lldb/unittests/Platform/CMakeFiles/LLDBPlatformTests.dir/PlatformDarwinTest.cpp.o -c /Users/buildslave/jenkins/workspace/lldb-cmake/llvm-project/lldb/unittests/Platform/PlatformDarwinTest.cpp [4/179] /Users/buildslave/jenkins/workspace/lldb-cmake/host-compiler/bin/clang++ -DGTEST_HAS_RTTI=0 -DHAVE_ROUND -D_DEBUG -D__STDC_CONSTANT_MACROS -D__STDC_FORMAT_MACROS -D__STDC_LIMIT_MACROS -Itools/lldb/unittests/Platform -I/Users/buildslave/jenkins/workspace/lldb-cmake/llvm-project/lldb/unittests/Platform -I/Users/buildslave/jenkins/workspace/lldb-cmake/llvm-project/lldb/include -Itools/lldb/include -Iinclude -I/Users/buildslave/jenkins/workspace/lldb-cmake/llvm-project/llvm/include -I/usr/local/Cellar/python/3.7.1/Frameworks/Python.framework/Versions/3.7/include/python3.7m -I/Users/buildslave/jenkins/workspace/lldb-cmake/llvm-project/llvm/../clang/include -Itools/lldb/../clang/include -I/usr/local/include -I/Users/buildslave/jenkins/workspace/lldb-cmake/llvm-project/lldb/source -I/Users/buildslave/jenkins/workspace/lldb-cmake/llvm-project/lldb/unittests -I/Users/buildslave/jenkins/workspace/lldb-cmake/llvm-project/llvm/utils/unittest/googletest/include -I/Users/buildslave/jenkins/workspace/lldb-cmake/llvm-project/llvm/utils/unittest/googlemock/include -isystem /Applications/Xcode.app/Contents/Developer/Platforms/MacOSX.platform/Developer/SDKs/MacOSX10.15.sdk/usr/include/libxml2 -Wdocumentation -fPIC -fvisibility-inlines-hidden -Werror=date-time -Werror=unguarded-availability-new -fmodules -fmodules-cache-path=/Users/buildslave/jenkins/workspace/lldb-cmake/lldb-build/module.cache -fcxx-modules -Xclang -fmodules-local-submodule-visibility -Wall -Wextra -Wno-unused-parameter -Wwrite-strings -Wcast-qual -Wmissing-field-initializers -pedantic -Wno-long-long -Wc++98-compat-extra-semi -Wimplicit-fallthrough -Wcovered-switch-default -Wno-noexcept-type -Wnon-virtual-dtor -Wdelete-non-virtual-dtor -Wsuggest-override -Wstring-conversion -Wmisleading-indentation -fdiagnostics-color -Wno-deprecated-declarations -Wno-unknown-pragmas -Wno-strict-aliasing -Wno-deprecated-register -Wno-vla-extension -O3 -DNDEBUG -isysroot /Applications/Xcode.app/Contents/Developer/Platforms/MacOSX.platform/Developer/SDKs/MacOSX10.15.sdk -include /Users/buildslave/jenkins/workspace/lldb-cmake/llvm-project/lldb/unittests/gtest_common.h -Wno-variadic-macros -Wno-gnu-zero-variadic-macro-arguments -fno-exceptions -fno-rtti -UNDEBUG -Wno-suggest-override -std=c++14 -MD -MT tools/lldb/unittests/Platform/CMakeFiles/LLDBPlatformTests.dir/PlatformAppleSimulatorTest.cpp.o -MF tools/lldb/unittests/Platform/CMakeFiles/LLDBPlatformTests.dir/PlatformAppleSimulatorTest.cpp.o.d -o tools/lldb/unittests/Platform/CMakeFiles/LLDBPlatformTests.dir/PlatformAppleSimulatorTest.cpp.o -c /Users/buildslave/jenkins/workspace/lldb-cmake/llvm-project/lldb/unittests/Platform/PlatformAppleSimulatorTest.cpp FAILED: tools/lldb/unittests/Platform/CMakeFiles/LLDBPlatformTests.dir/PlatformAppleSimulatorTest.cpp.o /Users/buildslave/jenkins/workspace/lldb-cmake/host-compiler/bin/clang++ -DGTEST_HAS_RTTI=0 -DHAVE_ROUND -D_DEBUG -D__STDC_CONSTANT_MACROS -D__STDC_FORMAT_MACROS -D__STDC_LIMIT_MACROS -Itools/lldb/unittests/Platform -I/Users/buildslave/jenkins/workspace/lldb-cmake/llvm-project/lldb/unittests/Platform -I/Users/buildslave/jenkins/workspace/lldb-cmake/llvm-project/lldb/include -Itools/lldb/include -Iinclude -I/Users/buildslave/jenkins/workspace/lldb-cmake/llvm-project/llvm/include -I/usr/local/Cellar/python/3.7.1/Frameworks/Python.framework/Versions/3.7/include/python3.7m -I/Users/buildslave/jenkins/workspace/lldb-cmake/llvm-project/llvm/../clang/include -Itools/lldb/../clang/include -I/usr/local/include -I/Users/buildslave/jenkins/workspace/lldb-cmake/llvm-project/lldb/source -I/Users/buildslave/jenkins/workspace/lldb-cmake/llvm-project/lldb/unittests -I/Users/buildslave/jenkins/workspace/lldb-cmake/llvm-project/llvm/utils/unittest/googletest/include -I/Users/buildslave/jenkins/workspace/lldb-cmake/llvm-project/llvm/utils/unittest/googlemock/include -isystem /Applications/Xcode.app/Contents/Developer/Platforms/MacOSX.platform/Developer/SDKs/MacOSX10.15.sdk/usr/include/libxml2 -Wdocumentation -fPIC -fvisibility-inlines-hidden -Werror=date-time -Werror=unguarded-availability-new -fmodules -fmodules-cache-path=/Users/buildslave/jenkins/workspace/lldb-cmake/lldb-build/module.cache -fcxx-modules -Xclang -fmodules-local-submodule-visibility -Wall -Wextra -Wno-unused-parameter -Wwrite-strings -Wcast-qual -Wmissing-field-initializers -pedantic -Wno-long-long -Wc++98-compat-extra-semi -Wimplicit-fallthrough -Wcovered-switch-default -Wno-noexcept-type -Wnon-virtual-dtor -Wdelete-non-virtual-dtor -Wsuggest-override -Wstring-conversion -Wmisleading-indentation -fdiagnostics-color -Wno-deprecated-declarations -Wno-unknown-pragmas -Wno-strict-aliasing -Wno-deprecated-register -Wno-vla-extension -O3 -DNDEBUG -isysroot /Applications/Xcode.app/Contents/Developer/Platforms/MacOSX.platform/Developer/SDKs/MacOSX10.15.sdk -include /Users/buildslave/jenkins/workspace/lldb-cmake/llvm-project/lldb/unittests/gtest_common.h -Wno-variadic-macros -Wno-gnu-zero-variadic-macro-arguments -fno-exceptions -fno-rtti -UNDEBUG -Wno-suggest-override -std=c++14 -MD -MT tools/lldb/unittests/Platform/CMakeFiles/LLDBPlatformTests.dir/PlatformAppleSimulatorTest.cpp.o -MF tools/lldb/unittests/Platform/CMakeFiles/LLDBPlatformTests.dir/PlatformAppleSimulatorTest.cpp.o.d -o tools/lldb/unittests/Platform/CMakeFiles/LLDBPlatformTests.dir/PlatformAppleSimulatorTest.cpp.o -c /Users/buildslave/jenkins/workspace/lldb-cmake/llvm-project/lldb/unittests/Platform/PlatformAppleSimulatorTest.cpp /Users/buildslave/jenkins/workspace/lldb-cmake/llvm-project/lldb/unittests/Platform/PlatformAppleSimulatorTest.cpp:35:23: error: no member named 'GetSupportedArchitectureAtIndex' in 'lldb_private::Platform' if (!platform_sp->GetSupportedArchitectureAtIndex(num_arches, arch)) ~~~~~~~~~~~~~^ 1 error generated. [5/179] /Users/buildslave/jenkins/workspace/lldb-cmake/host-compiler/bin/clang++ -DGTEST_HAS_RTTI=0 -DHAVE_ROUND -D_DEBUG -D__STDC_CONSTANT_MACROS -D__STDC_FORMAT_MACROS -D__STDC_LIMIT_MACROS -Itools/lldb/unittests/Process/gdb-remote -I/Users/buildslave/jenkins/workspace/lldb-cmake/llvm-project/lldb/unittests/Process/gdb-remote -I/Users/buildslave/jenkins/workspace/lldb-cmake/llvm-project/lldb/include -Itools/lldb/include -Iinclude -I/Users/buildslave/jenkins/workspace/lldb-cmake/llvm-project/llvm/include -I/usr/local/Cellar/python/3.7.1/Frameworks/Python.framework/Versions/3.7/include/python3.7m -I/Users/buildslave/jenkins/workspace/lldb-cmake/llvm-project/llvm/../clang/include -Itools/lldb/../clang/include -I/usr/local/include -I/Users/buildslave/jenkins/workspace/lldb-cmake/llvm-project/lldb/source -I/Users/buildslave/jenkins/workspace/lldb-cmake/llvm-project/lldb/unittests -I/Users/buildslave/jenkins/workspace/lldb-cmake/llvm-project/llvm/utils/unittest/googletest/include -I/Users/buildslave/jenkins/workspace/lldb-cmake/llvm-project/llvm/utils/unittest/googlemock/include -isystem /Applications/Xcode.app/Contents/Developer/Platforms/MacOSX.platform/Developer/SDKs/MacOSX10.15.sdk/usr/include/libxml2 -Wdocumentation -fPIC -fvisibility-inlines-hidden -Werror=date-time -Werror=unguarded-availability-new -fmodules -fmodules-cache-path=/Users/buildslave/jenkins/workspace/lldb-cmake/lldb-build/module.cache -fcxx-modules -Xclang -fmodules-local-submodule-visibility -Wall -Wextra -Wno-unused-parameter -Wwrite-strings -Wcast-qual -Wmissing-field-initializers -pedantic -Wno-long-long -Wc++98-compat-extra-semi -Wimplicit-fallthrough -Wcovered-switch-default -Wno-noexcept-type -Wnon-virtual-dtor -Wdelete-non-virtual-dtor -Wsuggest-override -Wstring-conversion -Wmisleading-indentation -fdiagnostics-color -Wno-deprecated-declarations -Wno-unknown-pragmas -Wno-strict-aliasing -Wno-deprecated-register -Wno-vla-extension -O3 -DNDEBUG -isysroot /Applications/Xcode.app/Contents/Developer/Platforms/MacOSX.platform/Developer/SDKs/MacOSX10.15.sdk -include /Users/buildslave/jenkins/workspace/lldb-cmake/llvm-project/lldb/unittests/gtest_common.h -Wno-variadic-macros -Wno-gnu-zero-variadic-macro-arguments -fno-exceptions -fno-rtti -UNDEBUG -Wno-suggest-override -std=c++14 -MD -MT tools/lldb/unittests/Process/gdb-remote/CMakeFiles/ProcessGdbRemoteTests.dir/PortMapTest.cpp.o -MF tools/lldb/unittests/Process/gdb-remote/CMakeFiles/ProcessGdbRemoteTests.dir/PortMapTest.cpp.o.d -o tools/lldb/unittests/Process/gdb-remote/CMakeFiles/ProcessGdbRemoteTests.dir/PortMapTest.cpp.o -c /Users/buildslave/jenkins/workspace/lldb-cmake/llvm-project/lldb/unittests/Process/gdb-remote/PortMapTest.cpp While building module 'LLVM_Utils' imported from /Users/buildslave/jenkins/workspace/lldb-cmake/llvm-project/llvm/include/llvm/Testing/Support/Error.h:12: While building module 'LLVM_C' imported from /Users/buildslave/jenkins/workspace/lldb-cmake/llvm-project/llvm/include/llvm/Support/DataTypes.h:19: In file included from <module-includes>:5: /Users/buildslave/jenkins/workspace/lldb-cmake/llvm-project/llvm/include/llvm-c/./Core.h:3614:5: warning: declaration is marked with '@deprecated' command but does not have a deprecation attribute [-Wdocumentation-deprecated-sync] * @deprecated LLVMSetInstDebugLocation is deprecated in favor of the more general ~^~~~~~~~~~~~~~~~~~~~~~~~~~~~~~~~~~~~~~~~~~~~~~~~~~~~~~~~~~~~~~~~~~~~~~~~~~~~~~ /Users/buildslave/jenkins/workspace/lldb-cmake/llvm-project/llvm/include/llvm-c/./Core.h:3619:1: note: add a deprecation attribute to the declaration to silence this warning void LLVMSetInstDebugLocation(LLVMBuilderRef Builder, LLVMValueRef Inst); ^ [[deprecated]] 1 warning generated. [6/179] /Users/buildslave/jenkins/workspace/lldb-cmake/host-compiler/bin/clang++ -DGTEST_HAS_RTTI=0 -DHAVE_ROUND -D_DEBUG -D__STDC_CONSTANT_MACROS -D__STDC_FORMAT_MACROS -D__STDC_LIMIT_MACROS -Itools/lldb/unittests/Process -I/Users/buildslave/jenkins/workspace/lldb-cmake/llvm-project/lldb/unittests/Process -I/Users/buildslave/jenkins/workspace/lldb-cmake/llvm-project/lldb/include -Itools/lldb/include -Iinclude -I/Users/buildslave/jenkins/workspace/lldb-cmake/llvm-project/llvm/include -I/usr/local/Cellar/python/3.7.1/Frameworks/Python.framework/Versions/3.7/include/python3.7m -I/Users/buildslave/jenkins/workspace/lldb-cmake/llvm-project/llvm/../clang/include -Itools/lldb/../clang/include -I/usr/local/include -I/Users/buildslave/jenkins/workspace/lldb-cmake/llvm-project/lldb/source -I/Users/buildslave/jenkins/workspace/lldb-cmake/llvm-project/lldb/unittests -I/Users/buildslave/jenkins/workspace/lldb-cmake/llvm-project/llvm/utils/unittest/googletest/include -I/Users/buildslave/jenkins/workspace/lldb-cmake/llvm-project/llvm/utils/unittest/googlemock/include -isystem /Applications/Xcode.app/Contents/Developer/Platforms/MacOSX.platform/Developer/SDKs/MacOSX10.15.sdk/usr/include/libxml2 -Wdocumentation -fPIC -fvisibility-inlines-hidden -Werror=date-time -Werror=unguarded-availability-new -fmodules -fmodules-cache-path=/Users/buildslave/jenkins/workspace/lldb-cmake/lldb-build/module.cache -fcxx-modules -Xclang -fmodules-local-submodule-visibility -Wall -Wextra -Wno-unused-parameter -Wwrite-strings -Wcast-qual -Wmissing-field-initializers -pedantic -Wno-long-long -Wc++98-compat-extra-semi -Wimplicit-fallthrough -Wcovered-switch-default -Wno-noexcept-type -Wnon-virtual-dtor -Wdelete-non-virtual-dtor -Wsuggest-override -Wstring-conversion -Wmisleading-indentation -fdiagnostics-color -Wno-deprecated-declarations -Wno-unknown-pragmas -Wno-strict-aliasing -Wno-deprecated-register -Wno-vla-extension -O3 -DNDEBUG -isysroot /Applications/Xcode.app/Contents/Developer/Platforms/MacOSX.platform/Developer/SDKs/MacOSX10.15.sdk -include /Users/buildslave/jenkins/workspace/lldb-cmake/llvm-project/lldb/unittests/gtest_common.h -Wno-variadic-macros -Wno-gnu-zero-variadic-macro-arguments -fno-exceptions -fno-rtti -UNDEBUG -Wno-suggest-override -std=c++14 -MD -MT tools/lldb/unittests/Process/CMakeFiles/ProcessEventDataTests.dir/ProcessEventDataTest.cpp.o -MF tools/lldb/unittests/Process/CMakeFiles/ProcessEventDataTests.dir/ProcessEventDataTest.cpp.o.d -o tools/lldb/unittests/Process/CMakeFiles/ProcessEventDataTests.dir/ProcessEventDataTest.cpp.o -c /Users/buildslave/jenkins/workspace/lldb-cmake/llvm-project/lldb/unittests/Process/ProcessEventDataTest.cpp [7/179] /Users/buildslave/jenkins/workspace/lldb-cmake/host-compiler/bin/clang++ -DGTEST_HAS_RTTI=0 -DHAVE_ROUND -D_DEBUG -D__STDC_CONSTANT_MACROS -D__STDC_FORMAT_MACROS -D__STDC_LIMIT_MACROS -Itools/lldb/unittests/ObjectFile/MachO -I/Users/buildslave/jenkins/workspace/lldb-cmake/llvm-project/lldb/unittests/ObjectFile/MachO -I/Users/buildslave/jenkins/workspace/lldb-cmake/llvm-project/lldb/include -Itools/lldb/include -Iinclude -I/Users/buildslave/jenkins/workspace/lldb-cmake/llvm-project/llvm/include -I/usr/local/Cellar/python/3.7.1/Frameworks/Python.framework/Versions/3.7/include/python3.7m -I/Users/buildslave/jenkins/workspace/lldb-cmake/llvm-project/llvm/../clang/include -Itools/lldb/../clang/include -I/usr/local/include -I/Users/buildslave/jenkins/workspace/lldb-cmake/llvm-project/lldb/source -I/Users/buildslave/jenkins/workspace/lldb-cmake/llvm-project/lldb/unittests -I/Users/buildslave/jenkins/workspace/lldb-cmake/llvm-project/llvm/utils/unittest/googletest/include -I/Users/buildslave/jenkins/workspace/lldb-cmake/llvm-project/llvm/utils/unittest/googlemock/include -isystem /Applications/Xcode.app/Contents/Developer/Platforms/MacOSX.platform/Developer/SDKs/MacOSX10.15.sdk/usr/include/libxml2 -Wdocumentation -fPIC -fvisibility-inlines-hidden -Werror=date-time -Werror=unguarded-availability-new -fmodules -fmodules-cache-path=/Users/buildslave/jenkins/workspace/lldb-cmake/lldb-build/module.cache -fcxx-modules -Xclang -fmodules-local-submodule-visibility -Wall -Wextra -Wno-unused-parameter -Wwrite-strings -Wcast-qual -Wmissing-field-initializers -pedantic -Wno-long-long -Wc++98-compat-extra-semi -Wimplicit-fallthrough -Wcovered-switch-default -Wno-noexcept-type -Wnon-virtual-dtor -Wdelete-non-virtual-dtor -Wsuggest-override -Wstring-conversion -Wmisleading-indentation -fdiagnostics-color -Wno-deprecated-declarations -Wno-unknown-pragmas -Wno-strict-aliasing -Wno-deprecated-register -Wno-vla-extension -O3 -DNDEBUG -isysroot /Applications/Xcode.app/Contents/Developer/Platforms/MacOSX.platform/Developer/SDKs/MacOSX10.15.sdk -include /Users/buildslave/jenkins/workspace/lldb-cmake/llvm-project/lldb/unittests/gtest_common.h -Wno-variadic-macros -Wno-gnu-zero-variadic-macro-arguments -fno-exceptions -fno-rtti -UNDEBUG -Wno-suggest-override -std=c++14 -MD -MT tools/lldb/unittests/ObjectFile/MachO/CMakeFiles/ObjectFileMachOTests.dir/TestObjectFileMachO.cpp.o -MF tools/lldb/unittests/ObjectFile/MachO/CMakeFiles/ObjectFileMachOTests.dir/TestObjectFileMachO.cpp.o.d -o tools/lldb/unittests/ObjectFile/MachO/CMakeFiles/ObjectFileMachOTests.dir/TestObjectFileMachO.cpp.o -c /Users/buildslave/jenkins/workspace/lldb-cmake/llvm-project/lldb/unittests/ObjectFile/MachO/TestObjectFileMachO.cpp [8/179] /Users/buildslave/jenkins/workspace/lldb-cmake/host-compiler/bin/clang++ -DGTEST_HAS_RTTI=0 -DHAVE_ROUND -D_DEBUG -D__STDC_CONSTANT_MACROS -D__STDC_FORMAT_MACROS -D__STDC_LIMIT_MACROS -Itools/lldb/unittests/Language/Highlighting -I/Users/buildslave/jenkins/workspace/lldb-cmake/llvm-project/lldb/unittests/Language/Highlighting -I/Users/buildslave/jenkins/workspace/lldb-cmake/llvm-project/lldb/include -Itools/lldb/include -Iinclude -I/Users/buildslave/jenkins/workspace/lldb-cmake/llvm-project/llvm/include -I/usr/local/Cellar/python/3.7.1/Frameworks/Python.framework/Versions/3.7/include/python3.7m -I/Users/buildslave/jenkins/workspace/lldb-cmake/llvm-project/llvm/../clang/include -Itools/lldb/../clang/include -I/usr/local/include -I/Users/buildslave/jenkins/workspace/lldb-cmake/llvm-project/lldb/source -I/Users/buildslave/jenkins/workspace/lldb-cmake/llvm-project/lldb/unittests -I/Users/buildslave/jenkins/workspace/lldb-cmake/llvm-project/llvm/utils/unittest/googletest/include -I/Users/buildslave/jenkins/workspace/lldb-cmake/llvm-project/llvm/utils/unittest/googlemock/include -isystem /Applications/Xcode.app/Contents/Developer/Platforms/MacOSX.platform/Developer/SDKs/MacOSX10.15.sdk/usr/include/libxml2 -Wdocumentation -fPIC -fvisibility-inlines-hidden -Werror=date-time -Werror=unguarded-availability-new -fmodules -fmodules-cache-path=/Users/buildslave/jenkins/workspace/lldb-cmake/lldb-build/module.cache -fcxx-modules -Xclang -fmodules-local-submodule-visibility -Wall -Wextra -Wno-unused-parameter -Wwrite-strings -Wcast-qual -Wmissing-field-initializers -pedantic -Wno-long-long -Wc++98-compat-extra-semi -Wimplicit-fallthrough -Wcovered-switch-default -Wno-noexcept-type -Wnon-virtual-dtor -Wdelete-non-virtual-dtor -Wsuggest-override -Wstring-conversion -Wmisleading-indentation -fdiagnostics-color -Wno-deprecated-declarations -Wno-unknown-pragmas -Wno-strict-aliasing -Wno-deprecated-register -Wno-vla-extension -O3 -DNDEBUG -isysroot /Applications/Xcode.app/Contents/Developer/Platforms/MacOSX.platform/Developer/SDKs/MacOSX10.15.sdk -include /Users/buildslave/jenkins/workspace/lldb-cmake/llvm-project/lldb/unittests/gtest_common.h -Wno-variadic-macros -Wno-gnu-zero-variadic-macro-arguments -fno-exceptions -fno-rtti -UNDEBUG -Wno-suggest-override -std=c++14 -MD -MT tools/lldb/unittests/Language/Highlighting/CMakeFiles/HighlighterTests.dir/HighlighterTest.cpp.o -MF tools/lldb/unittests/Language/Highlighting/CMakeFiles/HighlighterTests.dir/HighlighterTest.cpp.o.d -o tools/lldb/unittests/Language/Highlighting/CMakeFiles/HighlighterTests.dir/HighlighterTest.cpp.o -c /Users/buildslave/jenkins/workspace/lldb-cmake/llvm-project/lldb/unittests/Language/Highlighting/HighlighterTest.cpp [9/179] /Users/buildslave/jenkins/workspace/lldb-cmake/host-compiler/bin/clang++ -DGTEST_HAS_RTTI=0 -DHAVE_ROUND -D_DEBUG -D__STDC_CONSTANT_MACROS -D__STDC_FORMAT_MACROS -D__STDC_LIMIT_MACROS -Itools/lldb/unittests/ObjectFile/PECOFF -I/Users/buildslave/jenkins/workspace/lldb-cmake/llvm-project/lldb/unittests/ObjectFile/PECOFF -I/Users/buildslave/jenkins/workspace/lldb-cmake/llvm-project/lldb/include -Itools/lldb/include -Iinclude -I/Users/buildslave/jenkins/workspace/lldb-cmake/llvm-project/llvm/include -I/usr/local/Cellar/python/3.7.1/Frameworks/Python.framework/Versions/3.7/include/python3.7m -I/Users/buildslave/jenkins/workspace/lldb-cmake/llvm-project/llvm/../clang/include -Itools/lldb/../clang/include -I/usr/local/include -I/Users/buildslave/jenkins/workspace/lldb-cmake/llvm-project/lldb/source -I/Users/buildslave/jenkins/workspace/lldb-cmake/llvm-project/lldb/unittests -I/Users/buildslave/jenkins/workspace/lldb-cmake/llvm-project/llvm/utils/unittest/googletest/include -I/Users/buildslave/jenkins/workspace/lldb-cmake/llvm-project/llvm/utils/unittest/googlemock/include -isystem /Applications/Xcode.app/Contents/Developer/Platforms/MacOSX.platform/Developer/SDKs/MacOSX10.15.sdk/usr/include/libxml2 -Wdocumentation -fPIC -fvisibility-inlines-hidden -Werror=date-time -Werror=unguarded-availability-new -fmodules -fmodules-cache-path=/Users/buildslave/jenkins/workspace/lldb-cmake/lldb-build/module.cache -fcxx-modules -Xclang -fmodules-local-submodule-visibility -Wall -Wextra -Wno-unused-parameter -Wwrite-strings -Wcast-qual -Wmissing-field-initializers -pedantic -Wno-long-long -Wc++98-compat-extra-semi -Wimplicit-fallthrough -Wcovered-switch-default -Wno-noexcept-type -Wnon-virtual-dtor -Wdelete-non-virtual-dtor -Wsuggest-override -Wstring-conversion -Wmisleading-indentation -fdiagnostics-color -Wno-deprecated-declarations -Wno-unknown-pragmas -Wno-strict-aliasing -Wno-deprecated-register -Wno-vla-extension -O3 -DNDEBUG -isysroot /Applications/Xcode.app/Contents/Developer/Platforms/MacOSX.platform/Developer/SDKs/MacOSX10.15.sdk -include /Users/buildslave/jenkins/workspace/lldb-cmake/llvm-project/lldb/unittests/gtest_common.h -Wno-variadic-macros -Wno-gnu-zero-variadic-macro-arguments -fno-exceptions -fno-rtti -UNDEBUG -Wno-suggest-override -std=c++14 -MD -MT tools/lldb/unittests/ObjectFile/PECOFF/CMakeFiles/ObjectFilePECOFFTests.dir/TestPECallFrameInfo.cpp.o -MF tools/lldb/unittests/ObjectFile/PECOFF/CMakeFiles/ObjectFilePECOFFTests.dir/TestPECallFrameInfo.cpp.o.d -o tools/lldb/unittests/ObjectFile/PECOFF/CMakeFiles/ObjectFilePECOFFTests.dir/TestPECallFrameInfo.cpp.o -c /Users/buildslave/jenkins/workspace/lldb-cmake/llvm-project/lldb/unittests/ObjectFile/PECOFF/TestPECallFrameInfo.cpp [10/179] /Users/buildslave/jenkins/workspace/lldb-cmake/host-compiler/bin/clang++ -DGTEST_HAS_RTTI=0 -DHAVE_ROUND -D_DEBUG -D__STDC_CONSTANT_MACROS -D__STDC_FORMAT_MACROS -D__STDC_LIMIT_MACROS -Itools/lldb/unittests/ObjectFile/ELF -I/Users/buildslave/jenkins/workspace/lldb-cmake/llvm-project/lldb/unittests/ObjectFile/ELF -I/Users/buildslave/jenkins/workspace/lldb-cmake/llvm-project/lldb/include -Itools/lldb/include -Iinclude -I/Users/buildslave/jenkins/workspace/lldb-cmake/llvm-project/llvm/include -I/usr/local/Cellar/python/3.7.1/Frameworks/Python.framework/Versions/3.7/include/python3.7m -I/Users/buildslave/jenkins/workspace/lldb-cmake/llvm-project/llvm/../clang/include -Itools/lldb/../clang/include -I/usr/local/include -I/Users/buildslave/jenkins/workspace/lldb-cmake/llvm-project/lldb/source -I/Users/buildslave/jenkins/workspace/lldb-cmake/llvm-project/lldb/unittests -I/Users/buildslave/jenkins/workspace/lldb-cmake/llvm-project/llvm/utils/unittest/googletest/include -I/Users/buildslave/jenkins/workspace/lldb-cmake/llvm-project/llvm/utils/unittest/googlemock/include -isystem /Applications/Xcode.app/Contents/Developer/Platforms/MacOSX.platform/Developer/SDKs/MacOSX10.15.sdk/usr/include/libxml2 -Wdocumentation -fPIC -fvisibility-inlines-hidden -Werror=date-time -Werror=unguarded-availability-new -fmodules -fmodules-cache-path=/Users/buildslave/jenkins/workspace/lldb-cmake/lldb-build/module.cache -fcxx-modules -Xclang -fmodules-local-submodule-visibility -Wall -Wextra -Wno-unused-parameter -Wwrite-strings -Wcast-qual -Wmissing-field-initializers -pedantic -Wno-long-long -Wc++98-compat-extra-semi -Wimplicit-fallthrough -Wcovered-switch-default -Wno-noexcept-type -Wnon-virtual-dtor -Wdelete-non-virtual-dtor -Wsuggest-override -Wstring-conversion -Wmisleading-indentation -fdiagnostics-color -Wno-deprecated-declarations -Wno-unknown-pragmas -Wno-strict-aliasing -Wno-deprecated-register -Wno-vla-extension -O3 -DNDEBUG -isysroot /Applications/Xcode.app/Contents/Developer/Platforms/MacOSX.platform/Developer/SDKs/MacOSX10.15.sdk -include /Users/buildslave/jenkins/workspace/lldb-cmake/llvm-project/lldb/unittests/gtest_common.h -Wno-variadic-macros -Wno-gnu-zero-variadic-macro-arguments -fno-exceptions -fno-rtti -UNDEBUG -Wno-suggest-override -std=c++14 -MD -MT tools/lldb/unittests/ObjectFile/ELF/CMakeFiles/ObjectFileELFTests.dir/TestObjectFileELF.cpp.o -MF tools/lldb/unittests/ObjectFile/ELF/CMakeFiles/ObjectFileELFTests.dir/TestObjectFileELF.cpp.o.d -o tools/lldb/unittests/ObjectFile/ELF/CMakeFiles/ObjectFileELFTests.dir/TestObjectFileELF.cpp.o -c /Users/buildslave/jenkins/workspace/lldb-cmake/llvm-project/lldb/unittests/ObjectFile/ELF/TestObjectFileELF.cpp While building module 'lldb_Wrapper' imported from /Users/buildslave/jenkins/workspace/lldb-cmake/llvm-project/lldb/source/Plugins/ObjectFile/ELF/ObjectFileELF.h:16: In file included from <module-includes>:13: In file included from /Users/buildslave/jenkins/workspace/lldb-cmake/llvm-project/lldb/include/lldb/Breakpoint/BreakpointResolverFileLine.h:13: /Users/buildslave/jenkins/workspace/lldb-cmake/llvm-project/lldb/include/lldb/Core/SourceLocationSpec.h:141:18: warning: parameter 'full' not found in the function declaration [-Wdocumentation] /// \param[in] full ^~~~ While building module 'lldb_Wrapper' imported from /Users/buildslave/jenkins/workspace/lldb-cmake/llvm-project/lldb/source/Plugins/ObjectFile/ELF/ObjectFileELF.h:16: In file included from <module-includes>:38: In file included from /Users/buildslave/jenkins/workspace/lldb-cmake/llvm-project/lldb/include/lldb/Core/FileLineResolver.h:13: /Users/buildslave/jenkins/workspace/lldb-cmake/llvm-project/lldb/include/lldb/Symbol/SymbolContext.h:143:18: warning: parameter 'show_inline_callsite_line_info' not found in the function declaration [-Wdocumentation] /// \param[in] show_inline_callsite_line_info ^~~~~~~~~~~~~~~~~~~~~~~~~~~~~~ /Users/buildslave/jenkins/workspace/lldb-cmake/llvm-project/lldb/include/lldb/Symbol/SymbolContext.h:143:18: note: did you mean 'exe_scope'? /// \param[in] show_inline_callsite_line_info ^~~~~~~~~~~~~~~~~~~~~~~~~~~~~~ exe_scope While building module 'lldb_Wrapper' imported from /Users/buildslave/jenkins/workspace/lldb-cmake/llvm-project/lldb/source/Plugins/ObjectFile/ELF/ObjectFileELF.h:16: In file included from <module-includes>:71: In file included from /Users/buildslave/jenkins/workspace/lldb-cmake/llvm-project/lldb/include/lldb/Core/ValueObject.h:16: In file included from /Users/buildslave/jenkins/workspace/lldb-cmake/llvm-project/lldb/include/lldb/Target/Process.h:41: /Users/buildslave/jenkins/workspace/lldb-cmake/llvm-project/lldb/include/lldb/Target/Trace.h:228:18: warning: parameter 'request' not found in the function declaration [-Wdocumentation] /// \param[in] request ^~~~~~~ While building module 'lldb_Wrapper' imported from /Users/buildslave/jenkins/workspace/lldb-cmake/llvm-project/lldb/source/Plugins/ObjectFile/ELF/ObjectFileELF.h:16: In file included from <module-includes>:123: /Users/buildslave/jenkins/workspace/lldb-cmake/llvm-project/lldb/include/lldb/Interpreter/CommandInterpreter.h:234:36: warning: not a Doxygen trailing comment [-Wdocumentation] eCommandTypesBuiltin = 0x0001, //< native commands such as "frame" ^~~ ///< /Users/buildslave/jenkins/workspace/lldb-cmake/llvm-project/lldb/include/lldb/Interpreter/CommandInterpreter.h:235:36: warning: not a Doxygen trailing comment [-Wdocumentation] eCommandTypesUserDef = 0x0002, //< scripted commands ^~~ ///< /Users/buildslave/jenkins/workspace/lldb-cmake/llvm-project/lldb/include/lldb/Interpreter/CommandInterpreter.h:236:36: warning: not a Doxygen trailing comment [-Wdocumentation] eCommandTypesUserMW = 0x0004, //< multiword commands (command containers) ^~~ ///< /Users/buildslave/jenkins/workspace/lldb-cmake/llvm-project/lldb/include/lldb/Interpreter/CommandInterpreter.h:237:36: warning: not a Doxygen trailing comment [-Wdocumentation] eCommandTypesAliases = 0x0008, //< aliases such as "po" ^~~ ///< /Users/buildslave/jenkins/workspace/lldb-cmake/llvm-project/lldb/include/lldb/Interpreter/CommandInterpreter.h:238:36: warning: not a Doxygen trailing comment [-Wdocumentation] eCommandTypesHidden = 0x0010, //< commands prefixed with an underscore ^~~ ///< /Users/buildslave/jenkins/workspace/lldb-cmake/llvm-project/lldb/include/lldb/Interpreter/CommandInterpreter.h:239:36: warning: not a Doxygen trailing comment [-Wdocumentation] eCommandTypesAllThem = 0xFFFF //< all commands ^~~ ///< While building module 'lldb_Wrapper' imported from /Users/buildslave/jenkins/workspace/lldb-cmake/llvm-project/lldb/source/Plugins/ObjectFile/ELF/ObjectFileELF.h:16: In file included from <module-includes>:275: /Users/buildslave/jenkins/workspace/lldb-cmake/llvm-project/lldb/include/lldb/Target/TraceExporter.h:32:18: warning: parameter 'plugin_Name' not found in the function declaration [-Wdocumentation] /// \param[in] plugin_Name ^~~~~~~~~~~ /Users/buildslave/jenkins/workspace/lldb-cmake/llvm-project/lldb/include/lldb/Target/TraceExporter.h:32:18: note: did you mean 'plugin_name'? /// \param[in] plugin_Name ^~~~~~~~~~~ plugin_name While building module 'lldb_Wrapper' imported from /Users/buildslave/jenkins/workspace/lldb-cmake/llvm-project/lldb/source/Plugins/ObjectFile/ELF/ObjectFileELF.h:16: In file included from <module-includes>:276: /Users/buildslave/jenkins/workspace/lldb-cmake/llvm-project/lldb/include/lldb/Target/TraceInstructionDumper.h:22:18: warning: parameter 'cursor' not found in the function declaration [-Wdocumentation] /// \param[in] cursor ^~~~~~ /Users/buildslave/jenkins/workspace/lldb-cmake/llvm-project/lldb/include/lldb/Target/TraceInstructionDumper.h:22:18: note: did you mean 'cursor_up'? /// \param[in] cursor ^~~~~~ cursor_up 11 warnings generated. [11/179] /Users/buildslave/jenkins/workspace/lldb-cmake/host-compiler/bin/clang++ -DGTEST_HAS_RTTI=0 -DHAVE_ROUND -D_DEBUG -D__STDC_CONSTANT_MACROS -D__STDC_FORMAT_MACROS -D__STDC_LIMIT_MACROS -Itools/lldb/unittests/Process/gdb-remote -I/Users/buildslave/jenkins/workspace/lldb-cmake/llvm-project/lldb/unittests/Process/gdb-remote -I/Users/buildslave/jenkins/workspace/lldb-cmake/llvm-project/lldb/include -Itools/lldb/include -Iinclude -I/Users/buildslave/jenkins/workspace/lldb-cmake/llvm-project/llvm/include -I/usr/local/Cellar/python/3.7.1/Frameworks/Python.framework/Versions/3.7/include/python3.7m -I/Users/buildslave/jenkins/workspace/lldb-cmake/llvm-project/llvm/../clang/include -Itools/lldb/../clang/include -I/usr/local/include -I/Users/buildslave/jenkins/workspace/lldb-cmake/llvm-project/lldb/source -I/Users/buildslave/jenkins/workspace/lldb-cmake/llvm-project/lldb/unittests -I/Users/buildslave/jenkins/workspace/lldb-cmake/llvm-project/llvm/utils/unittest/googletest/include -I/Users/buildslave/jenkins/workspace/lldb-cmake/llvm-project/llvm/utils/unittest/googlemock/include -isystem /Applications/Xcode.app/Contents/Developer/Platforms/MacOSX.platform/Developer/SDKs/MacOSX10.15.sdk/usr/include/libxml2 -Wdocumentation -fPIC -fvisibility-inlines-hidden -Werror=date-time -Werror=unguarded-availability-new -fmodules -fmodules-cache-path=/Users/buildslave/jenkins/workspace/lldb-cmake/lldb-build/module.cache -fcxx-modules -Xclang -fmodules-local-submodule-visibility -Wall -Wextra -Wno-unused-parameter -Wwrite-strings -Wcast-qual -Wmissing-field-initializers -pedantic -Wno-long-long -Wc++98-compat-extra-semi -Wimplicit-fallthrough -Wcovered-switch-default -Wno-noexcept-type -Wnon-virtual-dtor -Wdelete-non-virtual-dtor -Wsuggest-override -Wstring-conversion -Wmisleading-indentation -fdiagnostics-color -Wno-deprecated-declarations -Wno-unknown-pragmas -Wno-strict-aliasing -Wno-deprecated-register -Wno-vla-extension -O3 -DNDEBUG -isysroot /Applications/Xcode.app/Contents/Developer/Platforms/MacOSX.platform/Developer/SDKs/MacOSX10.15.sdk -include /Users/buildslave/jenkins/workspace/lldb-cmake/llvm-project/lldb/unittests/gtest_common.h -Wno-variadic-macros -Wno-gnu-zero-variadic-macro-arguments -fno-exceptions -fno-rtti -UNDEBUG -Wno-suggest-override -std=c++14 -MD -MT tools/lldb/unittests/Process/gdb-remote/CMakeFiles/ProcessGdbRemoteTests.dir/GDBRemoteCommunicationServerLLGSTest.cpp.o -MF tools/lldb/unittests/Process/gdb-remote/CMakeFiles/ProcessGdbRemoteTests.dir/GDBRemoteCommunicationServerLLGSTest.cpp.o.d -o tools/lldb/unittests/Process/gdb-remote/CMakeFiles/ProcessGdbRemoteTests.dir/GDBRemoteCommunicationServerLLGSTest.cpp.o -c /Users/buildslave/jenkins/workspace/lldb-cmake/llvm-project/lldb/unittests/Process/gdb-remote/GDBRemoteCommunicationServerLLGSTest.cpp [12/179] /Users/buildslave/jenkins/workspace/lldb-cmake/host-compiler/bin/clang++ -DGTEST_HAS_RTTI=0 -DHAVE_ROUND -D_DEBUG -D__STDC_CONSTANT_MACROS -D__STDC_FORMAT_MACROS -D__STDC_LIMIT_MACROS -Itools/lldb/unittests/Process/gdb-remote -I/Users/buildslave/jenkins/workspace/lldb-cmake/llvm-project/lldb/unittests/Process/gdb-remote -I/Users/buildslave/jenkins/workspace/lldb-cmake/llvm-project/lldb/include -Itools/lldb/include -Iinclude -I/Users/buildslave/jenkins/workspace/lldb-cmake/llvm-project/llvm/include -I/usr/local/Cellar/python/3.7.1/Frameworks/Python.framework/Versions/3.7/include/python3.7m -I/Users/buildslave/jenkins/workspace/lldb-cmake/llvm-project/llvm/../clang/include -Itools/lldb/../clang/include -I/usr/local/include -I/Users/buildslave/jenkins/workspace/lldb-cmake/llvm-project/lldb/source -I/Users/buildslave/jenkins/workspace/lldb-cmake/llvm-project/lldb/unittests -I/Users/buildslave/jenkins/workspace/lldb-cmake/llvm-project/llvm/utils/unittest/googletest/include -I/Users/buildslave/jenkins/workspace/lldb-cmake/llvm-project/llvm/utils/unittest/googlemock/include -isystem /Applications/Xcode.app/Contents/Developer/Platforms/MacOSX.platform/Developer/SDKs/MacOSX10.15.sdk/usr/include/libxml2 -Wdocumentation -fPIC -fvisibility-inlines-hidden -Werror=date-time -Werror=unguarded-availability-new -fmodules -fmodules-cache-path=/Users/buildslave/jenkins/workspace/lldb-cmake/lldb-build/module.cache -fcxx-modules -Xclang -fmodules-local-submodule-visibility -Wall -Wextra -Wno-unused-parameter -Wwrite-strings -Wcast-qual -Wmissing-field-initializers -pedantic -Wno-long-long -Wc++98-compat-extra-semi -Wimplicit-fallthrough -Wcovered-switch-default -Wno-noexcept-type -Wnon-virtual-dtor -Wdelete-non-virtual-dtor -Wsuggest-override -Wstring-conversion -Wmisleading-indentation -fdiagnostics-color -Wno-deprecated-declarations -Wno-unknown-pragmas -Wno-strict-aliasing -Wno-deprecated-register -Wno-vla-extension -O3 -DNDEBUG -isysroot /Applications/Xcode.app/Contents/Developer/Platforms/MacOSX.platform/Developer/SDKs/MacOSX10.15.sdk -include /Users/buildslave/jenkins/workspace/lldb-cmake/llvm-project/lldb/unittests/gtest_common.h -Wno-variadic-macros -Wno-gnu-zero-variadic-macro-arguments -fno-exceptions -fno-rtti -UNDEBUG -Wno-suggest-override -std=c++14 -MD -MT tools/lldb/unittests/Process/gdb-remote/CMakeFiles/ProcessGdbRemoteTests.dir/GDBRemoteClientBaseTest.cpp.o -MF tools/lldb/unittests/Process/gdb-remote/CMakeFiles/ProcessGdbRemoteTests.dir/GDBRemoteClientBaseTest.cpp.o.d -o tools/lldb/unittests/Process/gdb-remote/CMakeFiles/ProcessGdbRemoteTests.dir/GDBRemoteClientBaseTest.cpp.o -c /Users/buildslave/jenkins/workspace/lldb-cmake/llvm-project/lldb/unittests/Process/gdb-remote/GDBRemoteClientBaseTest.cpp [13/179] /Users/buildslave/jenkins/workspace/lldb-cmake/host-compiler/bin/clang++ -DGTEST_HAS_RTTI=0 -DHAVE_ROUND -D_DEBUG -D__STDC_CONSTANT_MACROS -D__STDC_FORMAT_MACROS -D__STDC_LIMIT_MACROS -Itools/lldb/unittests/Process/gdb-remote -I/Users/buildslave/jenkins/workspace/lldb-cmake/llvm-project/lldb/unittests/Process/gdb-remote -I/Users/buildslave/jenkins/workspace/lldb-cmake/llvm-project/lldb/include -Itools/lldb/include -Iinclude -I/Users/buildslave/jenkins/workspace/lldb-cmake/llvm-project/llvm/include -I/usr/local/Cellar/python/3.7.1/Frameworks/Python.framework/Versions/3.7/include/python3.7m -I/Users/buildslave/jenkins/workspace/lldb-cmake/llvm-project/llvm/../clang/include -Itools/lldb/../clang/include -I/usr/local/include -I/Users/buildslave/jenkins/workspace/lldb-cmake/llvm-project/lldb/source -I/Users/buildslave/jenkins/workspace/lldb-cmake/llvm-project/lldb/unittests -I/Users/buildslave/jenkins/workspace/lldb-cmake/llvm-project/llvm/utils/unittest/googletest/include -I/Users/buildslave/jenkins/workspace/lldb-cmake/llvm-project/llvm/utils/unittest/googlemock/include -isystem /Applications/Xcode.app/Contents/Developer/Platforms/MacOSX.platform/Developer/SDKs/MacOSX10.15.sdk/usr/include/libxml2 -Wdocumentation -fPIC -fvisibility-inlines-hidden -Werror=date-time -Werror=unguarded-availability-new -fmodules -fmodules-cache-path=/Users/buildslave/jenkins/workspace/lldb-cmake/lldb-build/module.cache -fcxx-modules -Xclang -fmodules-local-submodule-visibility -Wall -Wextra -Wno-unused-parameter -Wwrite-strings -Wcast-qual -Wmissing-field-initializers -pedantic -Wno-long-long -Wc++98-compat-extra-semi -Wimplicit-fallthrough -Wcovered-switch-default -Wno-noexcept-type -Wnon-virtual-dtor -Wdelete-non-virtual-dtor -Wsuggest-override -Wstring-conversion -Wmisleading-indentation -fdiagnostics-color -Wno-deprecated-declarations -Wno-unknown-pragmas -Wno-strict-aliasing -Wno-deprecated-register -Wno-vla-extension -O3 -DNDEBUG -isysroot /Applications/Xcode.app/Contents/Developer/Platforms/MacOSX.platform/Developer/SDKs/MacOSX10.15.sdk -include /Users/buildslave/jenkins/workspace/lldb-cmake/llvm-project/lldb/unittests/gtest_common.h -Wno-variadic-macros -Wno-gnu-zero-variadic-macro-arguments -fno-exceptions -fno-rtti -UNDEBUG -Wno-suggest-override -std=c++14 -MD -MT tools/lldb/unittests/Process/gdb-remote/CMakeFiles/ProcessGdbRemoteTests.dir/GDBRemoteCommunicationClientTest.cpp.o -MF tools/lldb/unittests/Process/gdb-remote/CMakeFiles/ProcessGdbRemoteTests.dir/GDBRemoteCommunicationClientTest.cpp.o.d -o tools/lldb/unittests/Process/gdb-remote/CMakeFiles/ProcessGdbRemoteTests.dir/GDBRemoteCommunicationClientTest.cpp.o -c /Users/buildslave/jenkins/workspace/lldb-cmake/llvm-project/lldb/unittests/Process/gdb-remote/GDBRemoteCommunicationClientTest.cpp ninja: build stopped: subcommand failed. Command failed: Command '['/usr/bin/env', 'TERM=vt100', '/usr/local/bin/ninja', '-v', 'check-lldb']' returned non-zero exit status 1 Command: ['/usr/bin/env', 'TERM=vt100', '/usr/local/bin/ninja', '-v', 'check-lldb'] [Pipeline] } [Pipeline] // timeout [Pipeline] } [Pipeline] // stage [Pipeline] stage [Pipeline] { (Upload artifacts (LLDB)) Stage "Upload artifacts (LLDB)" skipped due to earlier failure(s) [Pipeline] } [Pipeline] // stage [Pipeline] stage [Pipeline] { (Declarative: Post Actions) [Pipeline] scanForIssues [Clang] Sleeping for 5 seconds due to JENKINS-32191... [Clang] Parsing console log (workspace: '/Users/buildslave/jenkins/workspace/lldb-cmake') [Clang] -> found 33 issues (skipped 30 duplicates) [Clang] Parsing console log (workspace: '/Users/buildslave/jenkins/workspace/lldb-cmake') [Clang] -> found 33 issues (skipped 30 duplicates) [Clang] Successfully parsed console log [Clang] -> found 33 issues (skipped 30 duplicates) [Clang] Parsing console log (workspace: '/Users/buildslave/jenkins/workspace/lldb-cmake') [Clang] Post processing issues on 'green-dragon-04' with source code encoding 'UTF-8' [Clang] Creating SCM blamer to obtain author and commit information for affected files [Clang] -> No blamer installed yet. You need to install the 'git-forensics' plugin to enable blaming for Git. [Clang] Resolving file names for all issues in source directory '/Users/buildslave/jenkins/workspace/lldb-cmake' [Clang] -> resolved paths in source directory (16 found, 0 not found) [Clang] Resolving module names from module definitions (build.xml, pom.xml, or Manifest.mf files) [Clang] -> resolved module names for 33 issues [Clang] Resolving package names (or namespaces) by parsing the affected files [Clang] -> resolved package names of 15 affected files [Clang] No filter has been set, publishing all 31 issues [Clang] Creating fingerprints for all affected code blocks to track issues over different builds [Clang] -> created fingerprints for 31 issues (skipped 0 issues) [Clang] Copying affected files to Jenkins' build folder '/Users/Shared/Jenkins/Home/jobs/lldb-cmake/builds/38828/files-with-issues' [Clang] -> 15 copied, 0 not in workspace, 0 not-found, 0 with I/O error [Clang] Repository miner is not configured, skipping repository mining [Pipeline] junit Recording test results [Checks API] No suitable checks publisher found. [Pipeline] } [Pipeline] // stage [Pipeline] } [Pipeline] // withEnv [Pipeline] } [Pipeline] // node [Pipeline] End of Pipeline ERROR: script returned exit code 1 Finished: FAILURE