Started by upstream project "clang-3.4-debuginfo-statistics" build number 5117 originally caused by: Started by upstream project "clang-stage2-Rthinlto" build number 5190 originally caused by: Started by upstream project "clang-stage2-Rthinlto_relay" build number 7030 originally caused by: Started by upstream project "clang-stage1-RA" build number 27066 originally caused by: Started by an SCM change Started by an SCM change Started by an SCM change Started by an SCM change Started by an SCM change Started by an SCM change Started by an SCM change Started by an SCM change Started by an SCM change Started by an SCM change Started by an SCM change Started by an SCM change Started by an SCM change Started by an SCM change Started by an SCM change Started by an SCM change Started by an SCM change Started by an SCM change Started by an SCM change Started by an SCM change Started by an SCM change Started by an SCM change Started by an SCM change Started by an SCM change Running as SYSTEM Building remotely on green-dragon-23 (1exec Zorg RebootDaily 10.14 lldb) in workspace /Users/buildslave/jenkins/sharedspace/lldb No emails were triggered. [lldb] $ /bin/sh -xe /var/folders/09/r4vw4v8n5kb67jl66zvlbljw0000gn/T/jenkins1075127633349538627.sh + set -u +x ===== ACME Zombie Detector ===== Checking number of a.out zombies against threshold 8 Found 261 zombies on green-dragon-23. Zombie processes exceed threshold! green-dragon-23 should be rebooted ASAP to prevent extended downtime. ===== ===== ===== Automatic reboot requested. Restarting green-dragon-23 now... Rebooting in 5 ... Rebooting in 4 ... Rebooting in 3 ... Rebooting in 2 ... Rebooting in 1 ... FATAL: command execution failed java.io.EOFException at java.io.ObjectInputStream$PeekInputStream.readFully(ObjectInputStream.java:2797) at java.io.ObjectInputStream$BlockDataInputStream.readShort(ObjectInputStream.java:3272) at java.io.ObjectInputStream.readStreamHeader(ObjectInputStream.java:932) at java.io.ObjectInputStream.<init>(ObjectInputStream.java:394) at hudson.remoting.ObjectInputStreamEx.<init>(ObjectInputStreamEx.java:49) at hudson.remoting.Command.readFrom(Command.java:142) at hudson.remoting.Command.readFrom(Command.java:128) at hudson.remoting.AbstractSynchronousByteArrayCommandTransport.read(AbstractSynchronousByteArrayCommandTransport.java:35) at hudson.remoting.SynchronousCommandTransport$ReaderThread.run(SynchronousCommandTransport.java:61) Caused: java.io.IOException: Unexpected termination of the channel at hudson.remoting.SynchronousCommandTransport$ReaderThread.run(SynchronousCommandTransport.java:75) Caused: java.io.IOException: Backing channel 'green-dragon-23' is disconnected. at hudson.remoting.RemoteInvocationHandler.channelOrFail(RemoteInvocationHandler.java:216) at hudson.remoting.RemoteInvocationHandler.invoke(RemoteInvocationHandler.java:286) at com.sun.proxy.$Proxy96.isAlive(Unknown Source) at hudson.Launcher$RemoteLauncher$ProcImpl.isAlive(Launcher.java:1211) at hudson.Launcher$RemoteLauncher$ProcImpl.join(Launcher.java:1203) at hudson.tasks.CommandInterpreter.join(CommandInterpreter.java:195) at hudson.tasks.CommandInterpreter.perform(CommandInterpreter.java:145) at hudson.tasks.CommandInterpreter.perform(CommandInterpreter.java:92) at hudson.tasks.BuildStepMonitor$1.perform(BuildStepMonitor.java:20) at hudson.model.AbstractBuild$AbstractBuildExecution.perform(AbstractBuild.java:803) at hudson.model.Build$BuildExecution.build(Build.java:197) at hudson.model.Build$BuildExecution.doRun(Build.java:163) at hudson.model.AbstractBuild$AbstractBuildExecution.run(AbstractBuild.java:513) at hudson.model.Run.execute(Run.java:1906) at hudson.model.FreeStyleBuild.run(FreeStyleBuild.java:43) at hudson.model.ResourceController.execute(ResourceController.java:97) at hudson.model.Executor.run(Executor.java:429) FATAL: Unable to delete script file /var/folders/09/r4vw4v8n5kb67jl66zvlbljw0000gn/T/jenkins1075127633349538627.sh java.io.EOFException at java.io.ObjectInputStream$PeekInputStream.readFully(ObjectInputStream.java:2797) at java.io.ObjectInputStream$BlockDataInputStream.readShort(ObjectInputStream.java:3272) at java.io.ObjectInputStream.readStreamHeader(ObjectInputStream.java:932) at java.io.ObjectInputStream.<init>(ObjectInputStream.java:394) at hudson.remoting.ObjectInputStreamEx.<init>(ObjectInputStreamEx.java:49) at hudson.remoting.Command.readFrom(Command.java:142) at hudson.remoting.Command.readFrom(Command.java:128) at hudson.remoting.AbstractSynchronousByteArrayCommandTransport.read(AbstractSynchronousByteArrayCommandTransport.java:35) at hudson.remoting.SynchronousCommandTransport$ReaderThread.run(SynchronousCommandTransport.java:61) Caused: java.io.IOException: Unexpected termination of the channel at hudson.remoting.SynchronousCommandTransport$ReaderThread.run(SynchronousCommandTransport.java:75) Caused: hudson.remoting.ChannelClosedException: Channel "hudson.remoting.Channel@4e27fdb2:green-dragon-23": Remote call on green-dragon-23 failed. The channel is closing down or has closed down at hudson.remoting.Channel.call(Channel.java:994) at hudson.FilePath.act(FilePath.java:1159) at hudson.FilePath.act(FilePath.java:1148) at hudson.FilePath.delete(FilePath.java:1671) at hudson.tasks.CommandInterpreter.perform(CommandInterpreter.java:163) at hudson.tasks.CommandInterpreter.perform(CommandInterpreter.java:92) at hudson.tasks.BuildStepMonitor$1.perform(BuildStepMonitor.java:20) at hudson.model.AbstractBuild$AbstractBuildExecution.perform(AbstractBuild.java:803) at hudson.model.Build$BuildExecution.build(Build.java:197) at hudson.model.Build$BuildExecution.doRun(Build.java:163) at hudson.model.AbstractBuild$AbstractBuildExecution.run(AbstractBuild.java:513) at hudson.model.Run.execute(Run.java:1906) at hudson.model.FreeStyleBuild.run(FreeStyleBuild.java:43) at hudson.model.ResourceController.execute(ResourceController.java:97) at hudson.model.Executor.run(Executor.java:429) Build step 'Execute shell' marked build as failure Email was triggered for: Failure - Any Sending email for trigger: Failure - Any

Hide Details

Begin Pre-Send Script... javax.mail.internet.AddressException: Domain contains illegal character in string ``florian_hahn@apple.com@apple.com'' at javax.mail.internet.InternetAddress.checkAddress(InternetAddress.java:1410) at javax.mail.internet.InternetAddress.parse(InternetAddress.java:1191) at javax.mail.internet.InternetAddress.parse(InternetAddress.java:728) at javax.mail.internet.InternetAddress.<init>(InternetAddress.java:95) at sun.reflect.NativeConstructorAccessorImpl.newInstance0(Native Method) at sun.reflect.NativeConstructorAccessorImpl.newInstance(NativeConstructorAccessorImpl.java:62) at sun.reflect.DelegatingConstructorAccessorImpl.newInstance(DelegatingConstructorAccessorImpl.java:45) at java.lang.reflect.Constructor.newInstance(Constructor.java:423) at org.codehaus.groovy.reflection.CachedConstructor.invoke(CachedConstructor.java:83) at org.codehaus.groovy.runtime.callsite.ConstructorSite$ConstructorSiteNoUnwrapNoCoerce.callConstructor(ConstructorSite.java:105) at org.codehaus.groovy.runtime.callsite.CallSiteArray.defaultCallConstructor(CallSiteArray.java:60) at org.codehaus.groovy.runtime.callsite.AbstractCallSite.callConstructor(AbstractCallSite.java:235) at org.codehaus.groovy.runtime.callsite.AbstractCallSite.callConstructor(AbstractCallSite.java:247) at Script1.run(Script1.groovy:71) at hudson.plugins.emailext.ExtendedEmailPublisher.executeScript(ExtendedEmailPublisher.java:691) at hudson.plugins.emailext.ExtendedEmailPublisher.executePresendScript(ExtendedEmailPublisher.java:649) at hudson.plugins.emailext.ExtendedEmailPublisher.sendMail(ExtendedEmailPublisher.java:513) at hudson.plugins.emailext.ExtendedEmailPublisher._perform(ExtendedEmailPublisher.java:444) at hudson.plugins.emailext.ExtendedEmailPublisher.perform(ExtendedEmailPublisher.java:354) at hudson.tasks.BuildStepMonitor$1.perform(BuildStepMonitor.java:20) at hudson.model.AbstractBuild$AbstractBuildExecution.perform(AbstractBuild.java:803) at hudson.model.AbstractBuild$AbstractBuildExecution.performAllBuildSteps(AbstractBuild.java:752) at hudson.model.Build$BuildExecution.cleanUp(Build.java:187) at hudson.model.Run.execute(Run.java:1953) at hudson.model.FreeStyleBuild.run(FreeStyleBuild.java:43) at hudson.model.ResourceController.execute(ResourceController.java:97) at hudson.model.Executor.run(Executor.java:429)

Hide Details

Sending email to: jmolenda@apple.com Finished: FAILURE