FailedConsole Output

Started by upstream project "clang-3.4-debuginfo-statistics" build number 4677
originally caused by:
 Started by upstream project "clang-stage2-Rthinlto" build number 3841
 originally caused by:
  Started by upstream project "clang-stage2-Rthinlto_relay" build number 5681
  originally caused by:
   Started by upstream project "clang-stage1-RA" build number 19953
   originally caused by:
    Started by an SCM change
    Started by an SCM change
    Started by an SCM change
    Started by an SCM change
    Started by an SCM change
    Started by an SCM change
    Started by an SCM change
    Started by an SCM change
    Started by an SCM change
    Started by an SCM change
    Started by an SCM change
    Started by an SCM change
    Started by an SCM change
    Started by an SCM change
    Started by an SCM change
    Started by an SCM change
    Started by an SCM change
   Started by upstream project "clang-stage1-RA" build number 19954
   originally caused by:
    Started by an SCM change
    Started by an SCM change
    Started by an SCM change
    Started by an SCM change
    Started by an SCM change
    Started by an SCM change
    Started by an SCM change
    Started by an SCM change
    Started by an SCM change
    Started by an SCM change
    Started by an SCM change
    Started by an SCM change
   Started by upstream project "clang-stage1-RA" build number 19955
   originally caused by:
    Started by an SCM change
   Started by upstream project "clang-stage1-RA" build number 19956
   originally caused by:
    Started by an SCM change
    Started by an SCM change
    Started by an SCM change
    Started by an SCM change
    Started by an SCM change
    Started by an SCM change
    Started by an SCM change
    Started by an SCM change
    Started by an SCM change
    Started by an SCM change
    Started by an SCM change
   Started by upstream project "clang-stage1-RA" build number 19957
   originally caused by:
    Started by an SCM change
    Started by an SCM change
    Started by an SCM change
    Started by an SCM change
    Started by an SCM change
    Started by an SCM change
    Started by an SCM change
    Started by an SCM change
    Started by an SCM change
    Started by an SCM change
    Started by an SCM change
   Started by upstream project "clang-stage1-RA" build number 19958
   originally caused by:
    Started by an SCM change
    Started by an SCM change
    Started by an SCM change
    Started by an SCM change
    Started by an SCM change
    Started by an SCM change
    Started by an SCM change
    Started by an SCM change
    Started by an SCM change
    Started by an SCM change
   Started by upstream project "clang-stage1-RA" build number 19959
   originally caused by:
    Started by an SCM change
    Started by an SCM change
    Started by an SCM change
    Started by an SCM change
    Started by an SCM change
    Started by an SCM change
    Started by an SCM change
    Started by an SCM change
    Started by an SCM change
    Started by an SCM change
Running as SYSTEM
Building remotely on green-dragon-10 (Zorg 10.15.5 RebootDaily Xcode11.5 10.15 Xcode11 MacMini) in workspace /Users/buildslave/jenkins/sharedspace/lldb
No emails were triggered.
[lldb] $ /bin/sh -xe /var/folders/09/r4vw4v8n5kb67jl66zvlbljw0000gn/T/jenkins8529318973598785329.sh
+ set -u +x
===== ACME Zombie Detector =====
Checking number of a.out zombies against threshold 8
Found 116 zombies on green-dragon-10.
Zombie processes exceed threshold!
green-dragon-10 should be rebooted ASAP to prevent extended downtime.
===== ===== =====
Automatic reboot requested. Restarting green-dragon-10 now...
Rebooting in 5 ...
Rebooting in 4 ...
Rebooting in 3 ...
Rebooting in 2 ...
Rebooting in 1 ...
FATAL: command execution failed
java.io.EOFException
	at java.io.ObjectInputStream$PeekInputStream.readFully(ObjectInputStream.java:2797)
	at java.io.ObjectInputStream$BlockDataInputStream.readShort(ObjectInputStream.java:3272)
	at java.io.ObjectInputStream.readStreamHeader(ObjectInputStream.java:932)
	at java.io.ObjectInputStream.<init>(ObjectInputStream.java:394)
	at hudson.remoting.ObjectInputStreamEx.<init>(ObjectInputStreamEx.java:49)
	at hudson.remoting.Command.readFrom(Command.java:142)
	at hudson.remoting.Command.readFrom(Command.java:128)
	at hudson.remoting.AbstractSynchronousByteArrayCommandTransport.read(AbstractSynchronousByteArrayCommandTransport.java:35)
	at hudson.remoting.SynchronousCommandTransport$ReaderThread.run(SynchronousCommandTransport.java:61)
Caused: java.io.IOException: Unexpected termination of the channel
	at hudson.remoting.SynchronousCommandTransport$ReaderThread.run(SynchronousCommandTransport.java:75)
Caused: java.io.IOException: Backing channel 'green-dragon-10' is disconnected.
	at hudson.remoting.RemoteInvocationHandler.channelOrFail(RemoteInvocationHandler.java:216)
	at hudson.remoting.RemoteInvocationHandler.invoke(RemoteInvocationHandler.java:286)
	at com.sun.proxy.$Proxy107.isAlive(Unknown Source)
	at hudson.Launcher$RemoteLauncher$ProcImpl.isAlive(Launcher.java:1211)
	at hudson.Launcher$RemoteLauncher$ProcImpl.join(Launcher.java:1203)
	at hudson.tasks.CommandInterpreter.join(CommandInterpreter.java:194)
	at hudson.tasks.CommandInterpreter.perform(CommandInterpreter.java:144)
	at hudson.tasks.CommandInterpreter.perform(CommandInterpreter.java:91)
	at hudson.tasks.BuildStepMonitor$1.perform(BuildStepMonitor.java:20)
	at hudson.model.AbstractBuild$AbstractBuildExecution.perform(AbstractBuild.java:803)
	at hudson.model.Build$BuildExecution.build(Build.java:197)
	at hudson.model.Build$BuildExecution.doRun(Build.java:163)
	at hudson.model.AbstractBuild$AbstractBuildExecution.run(AbstractBuild.java:513)
	at hudson.model.Run.execute(Run.java:1907)
	at hudson.model.FreeStyleBuild.run(FreeStyleBuild.java:43)
	at hudson.model.ResourceController.execute(ResourceController.java:97)
	at hudson.model.Executor.run(Executor.java:429)
FATAL: Unable to delete script file /var/folders/09/r4vw4v8n5kb67jl66zvlbljw0000gn/T/jenkins8529318973598785329.sh
java.io.EOFException
	at java.io.ObjectInputStream$PeekInputStream.readFully(ObjectInputStream.java:2797)
	at java.io.ObjectInputStream$BlockDataInputStream.readShort(ObjectInputStream.java:3272)
	at java.io.ObjectInputStream.readStreamHeader(ObjectInputStream.java:932)
	at java.io.ObjectInputStream.<init>(ObjectInputStream.java:394)
	at hudson.remoting.ObjectInputStreamEx.<init>(ObjectInputStreamEx.java:49)
	at hudson.remoting.Command.readFrom(Command.java:142)
	at hudson.remoting.Command.readFrom(Command.java:128)
	at hudson.remoting.AbstractSynchronousByteArrayCommandTransport.read(AbstractSynchronousByteArrayCommandTransport.java:35)
	at hudson.remoting.SynchronousCommandTransport$ReaderThread.run(SynchronousCommandTransport.java:61)
Caused: java.io.IOException: Unexpected termination of the channel
	at hudson.remoting.SynchronousCommandTransport$ReaderThread.run(SynchronousCommandTransport.java:75)
Caused: hudson.remoting.ChannelClosedException: Channel "hudson.remoting.Channel@58e94cfc:green-dragon-10": Remote call on green-dragon-10 failed. The channel is closing down or has closed down
	at hudson.remoting.Channel.call(Channel.java:994)
	at hudson.FilePath.act(FilePath.java:1158)
	at hudson.FilePath.act(FilePath.java:1147)
	at hudson.FilePath.delete(FilePath.java:1670)
	at hudson.tasks.CommandInterpreter.perform(CommandInterpreter.java:162)
	at hudson.tasks.CommandInterpreter.perform(CommandInterpreter.java:91)
	at hudson.tasks.BuildStepMonitor$1.perform(BuildStepMonitor.java:20)
	at hudson.model.AbstractBuild$AbstractBuildExecution.perform(AbstractBuild.java:803)
	at hudson.model.Build$BuildExecution.build(Build.java:197)
	at hudson.model.Build$BuildExecution.doRun(Build.java:163)
	at hudson.model.AbstractBuild$AbstractBuildExecution.run(AbstractBuild.java:513)
	at hudson.model.Run.execute(Run.java:1907)
	at hudson.model.FreeStyleBuild.run(FreeStyleBuild.java:43)
	at hudson.model.ResourceController.execute(ResourceController.java:97)
	at hudson.model.Executor.run(Executor.java:429)
Build step 'Execute shell' marked build as failure
Email was triggered for: Failure - Any
Sending email for trigger: Failure - Any

Hide Details

Begin Pre-Send Script... Sending email to: jmolenda@apple.com Ahmed Bougacha <abougacha@apple.com> Azhar Mohammed <azhar@apple.com> Finished: FAILURE