SuccessConsole Output

Skipping 105,656 KB.. Full Log
Kill of <lldb.SBProcess; proxy of <Swig Object of type 'lldb::SBProcess *' at 0x10973ce40> >>: success

PASS: LLDB (/Users/buildslave/jenkins/workspace/lldb-cmake-matrix/lldb-build/bin/clang-x86_64) :: test_recursive_inferior_crashing_register_dwarf (TestRecursiveInferior.CrashingRecursiveInferiorTestCase)
UNSUPPORTED: LLDB (/Users/buildslave/jenkins/workspace/lldb-cmake-matrix/lldb-build/bin/clang-x86_64) :: test_recursive_inferior_crashing_register_dwo (TestRecursiveInferior.CrashingRecursiveInferiorTestCase) (test case does not fall in any category of interest for this run) 
UNSUPPORTED: LLDB (/Users/buildslave/jenkins/workspace/lldb-cmake-matrix/lldb-build/bin/clang-x86_64) :: test_recursive_inferior_crashing_register_gmodules (TestRecursiveInferior.CrashingRecursiveInferiorTestCase) (test case does not fall in any category of interest for this run) 
Restore dir to: /Users/buildslave/jenkins/workspace/lldb-cmake-matrix/lldb-build/tools/lldb/test
======================================================================
FAIL: test_recursive_inferior_crashing_dsym (TestRecursiveInferior.CrashingRecursiveInferiorTestCase)
    Test that lldb reliably catches the inferior crashing (command).
----------------------------------------------------------------------
Traceback (most recent call last):
  File "/Users/buildslave/jenkins/workspace/lldb-cmake-matrix/llvm-project/lldb/packages/Python/lldbsuite/test/lldbtest.py", line 1830, in test_method
    return attrvalue(self)
  File "/Users/buildslave/jenkins/workspace/lldb-cmake-matrix/llvm-project/lldb/packages/Python/lldbsuite/test/decorators.py", line 119, in wrapper
    func(*args, **kwargs)
  File "/Users/buildslave/jenkins/workspace/lldb-cmake-matrix/llvm-project/lldb/packages/Python/lldbsuite/test/decorators.py", line 119, in wrapper
    func(*args, **kwargs)
  File "/Users/buildslave/jenkins/workspace/lldb-cmake-matrix/llvm-project/lldb/test/API/functionalities/inferior-crashing/recursive-inferior/TestRecursiveInferior.py", line 21, in test_recursive_inferior_crashing
    self.recursive_inferior_crashing()
  File "/Users/buildslave/jenkins/workspace/lldb-cmake-matrix/llvm-project/lldb/test/API/functionalities/inferior-crashing/recursive-inferior/TestRecursiveInferior.py", line 84, in recursive_inferior_crashing
    'argv',
  File "/Users/buildslave/jenkins/workspace/lldb-cmake-matrix/llvm-project/lldb/packages/Python/lldbsuite/test/lldbtest.py", line 2550, in expect
    self.fail(log_msg)
AssertionError: Ran command:
"thread backtrace all"

Got output:
* thread #1, queue = 'com.apple.main-thread', stop reason = EXC_BAD_ACCESS (code=1, address=0x0)
  * frame #0: 0x0000000100000f82 a.out`recursive_function(i=10)
    frame #1: 0x0000000100000f6f a.out`recursive_function(i=9)
    frame #2: 0x0000000100000f6f a.out`recursive_function(i=8)
    frame #3: 0x0000000100000f6f a.out`recursive_function(i=7)
    frame #4: 0x0000000100000f6f a.out`recursive_function(i=6)
    frame #5: 0x0000000100000f6f a.out`recursive_function(i=5)
    frame #6: 0x0000000100000f6f a.out`recursive_function(i=4)
    frame #7: 0x0000000100000f6f a.out`recursive_function(i=3)
    frame #8: 0x0000000100000f6f a.out`recursive_function(i=2)
    frame #9: 0x0000000100000f6f a.out`recursive_function(i=1)
    frame #10: 0x0000000100000f6f a.out`recursive_function(i=0)
    frame #11: 0x0000000100000fac a.out`main + 28
    frame #12: 0x00007fff68993cc9 libdyld.dylib`start + 1

Expecting sub string: "stop reason = EXC_BAD_ACCESS" (was found)
Expecting sub string: "recursive_function" (was found)
Expecting sub string: "main" (was found)
Expecting sub string: "argc" (was not found)
Config=x86_64-/Users/buildslave/jenkins/workspace/lldb-cmake-matrix/lldb-build/bin/clang
======================================================================
FAIL: test_recursive_inferior_crashing_dwarf (TestRecursiveInferior.CrashingRecursiveInferiorTestCase)
    Test that lldb reliably catches the inferior crashing (command).
----------------------------------------------------------------------
Traceback (most recent call last):
  File "/Users/buildslave/jenkins/workspace/lldb-cmake-matrix/llvm-project/lldb/packages/Python/lldbsuite/test/lldbtest.py", line 1830, in test_method
    return attrvalue(self)
  File "/Users/buildslave/jenkins/workspace/lldb-cmake-matrix/llvm-project/lldb/packages/Python/lldbsuite/test/decorators.py", line 119, in wrapper
    func(*args, **kwargs)
  File "/Users/buildslave/jenkins/workspace/lldb-cmake-matrix/llvm-project/lldb/packages/Python/lldbsuite/test/decorators.py", line 119, in wrapper
    func(*args, **kwargs)
  File "/Users/buildslave/jenkins/workspace/lldb-cmake-matrix/llvm-project/lldb/test/API/functionalities/inferior-crashing/recursive-inferior/TestRecursiveInferior.py", line 21, in test_recursive_inferior_crashing
    self.recursive_inferior_crashing()
  File "/Users/buildslave/jenkins/workspace/lldb-cmake-matrix/llvm-project/lldb/test/API/functionalities/inferior-crashing/recursive-inferior/TestRecursiveInferior.py", line 84, in recursive_inferior_crashing
    'argv',
  File "/Users/buildslave/jenkins/workspace/lldb-cmake-matrix/llvm-project/lldb/packages/Python/lldbsuite/test/lldbtest.py", line 2550, in expect
    self.fail(log_msg)
AssertionError: Ran command:
"thread backtrace all"

Got output:
* thread #1, queue = 'com.apple.main-thread', stop reason = EXC_BAD_ACCESS (code=1, address=0x0)
  * frame #0: 0x0000000100000f82 a.out`clang version 13.0.99 (clang version 13.0.99 (http://labmaster3.local/git/llvm-project.git 80b2da42d28466341b9512599aac354c178c39f8)=10)
    frame #1: 0x0000000100000f6f a.out`clang version 13.0.99 (clang version 13.0.99 (http://labmaster3.local/git/llvm-project.git 80b2da42d28466341b9512599aac354c178c39f8)=-272631608, clang version 13.0.99 (http://labmaster3.local/git/llvm-project.git 80b2da42d28466341b9512599aac354c178c39f8)=0x0000000100000000)
    frame #2: 0x0000000100000f6f a.out`clang version 13.0.99 (clang version 13.0.99 (http://labmaster3.local/git/llvm-project.git 80b2da42d28466341b9512599aac354c178c39f8)=-272631632, clang version 13.0.99 (http://labmaster3.local/git/llvm-project.git 80b2da42d28466341b9512599aac354c178c39f8)=0x0000000100003227)
    frame #3: 0x0000000100000f6f a.out`clang version 13.0.99 (clang version 13.0.99 (http://labmaster3.local/git/llvm-project.git 80b2da42d28466341b9512599aac354c178c39f8)=838480, clang version 13.0.99 (http://labmaster3.local/git/llvm-project.git 80b2da42d28466341b9512599aac354c178c39f8)=0x0000000000000000)
    frame #4: 0x0000000100000f6f a.out`clang version 13.0.99 (clang version 13.0.99 (http://labmaster3.local/git/llvm-project.git 80b2da42d28466341b9512599aac354c178c39f8)=-272631808, clang version 13.0.99 (http://labmaster3.local/git/llvm-project.git 80b2da42d28466341b9512599aac354c178c39f8)=0x0000000100094030)
    frame #5: 0x0000000100000f6f a.out`clang version 13.0.99 (clang version 13.0.99 (http://labmaster3.local/git/llvm-project.git 80b2da42d28466341b9512599aac354c178c39f8)=1073741824, clang version 13.0.99 (http://labmaster3.local/git/llvm-project.git 80b2da42d28466341b9512599aac354c178c39f8)=0x00000001000ccb50)
    frame #6: 0x0000000100000f6f a.out`clang version 13.0.99 (clang version 13.0.99 (http://labmaster3.local/git/llvm-project.git 80b2da42d28466341b9512599aac354c178c39f8)=0, clang version 13.0.99 (http://labmaster3.local/git/llvm-project.git 80b2da42d28466341b9512599aac354c178c39f8)=0x0000000100002000)
    frame #7: 0x0000000100000f6f a.out`clang version 13.0.99 (clang version 13.0.99 (http://labmaster3.local/git/llvm-project.git 80b2da42d28466341b9512599aac354c178c39f8)=12914, clang version 13.0.99 (http://labmaster3.local/git/llvm-project.git 80b2da42d28466341b9512599aac354c178c39f8)=0x0000000100003264)
    frame #8: 0x0000000100000f6f a.out`clang version 13.0.99 (clang version 13.0.99 (http://labmaster3.local/git/llvm-project.git 80b2da42d28466341b9512599aac354c178c39f8)=0, clang version 13.0.99 (http://labmaster3.local/git/llvm-project.git 80b2da42d28466341b9512599aac354c178c39f8)=0x0000000000000000)
    frame #9: 0x0000000100000f6f a.out`clang version 13.0.99 (clang version 13.0.99 (http://labmaster3.local/git/llvm-project.git 80b2da42d28466341b9512599aac354c178c39f8)=0, clang version 13.0.99 (http://labmaster3.local/git/llvm-project.git 80b2da42d28466341b9512599aac354c178c39f8)=0x00007ffeefbff8b0)
    frame #10: 0x0000000100000f6f a.out`clang version 13.0.99 (clang version 13.0.99 (http://labmaster3.local/git/llvm-project.git 80b2da42d28466341b9512599aac354c178c39f8)=0, clang version 13.0.99 (http://labmaster3.local/git/llvm-project.git 80b2da42d28466341b9512599aac354c178c39f8)=0x0000000000000000)
    frame #11: 0x0000000100000fac a.out`main
    frame #12: 0x00007fff68993cc9 libdyld.dylib`start + 1
    frame #13: 0x00007fff68993cc9 libdyld.dylib`start + 1

Expecting sub string: "stop reason = EXC_BAD_ACCESS" (was found)
Expecting sub string: "recursive_function" (was not found)
Config=x86_64-/Users/buildslave/jenkins/workspace/lldb-cmake-matrix/lldb-build/bin/clang
======================================================================
FAIL: test_recursive_inferior_crashing_expr_dwarf (TestRecursiveInferior.CrashingRecursiveInferiorTestCase)
    Test that the lldb expression interpreter can read from the inferior after crashing (command).
----------------------------------------------------------------------
Traceback (most recent call last):
  File "/Users/buildslave/jenkins/workspace/lldb-cmake-matrix/llvm-project/lldb/packages/Python/lldbsuite/test/lldbtest.py", line 1830, in test_method
    return attrvalue(self)
  File "/Users/buildslave/jenkins/workspace/lldb-cmake-matrix/llvm-project/lldb/test/API/functionalities/inferior-crashing/recursive-inferior/TestRecursiveInferior.py", line 38, in test_recursive_inferior_crashing_expr
    self.recursive_inferior_crashing_expr()
  File "/Users/buildslave/jenkins/workspace/lldb-cmake-matrix/llvm-project/lldb/test/API/functionalities/inferior-crashing/recursive-inferior/TestRecursiveInferior.py", line 141, in recursive_inferior_crashing_expr
    startstr='(int) $0 =')
  File "/Users/buildslave/jenkins/workspace/lldb-cmake-matrix/llvm-project/lldb/packages/Python/lldbsuite/test/lldbtest.py", line 2463, in expect
    inHistory=inHistory)
  File "/Users/buildslave/jenkins/workspace/lldb-cmake-matrix/llvm-project/lldb/packages/Python/lldbsuite/test/lldbtest.py", line 2161, in runCmd
    msg if (msg) else CMD_MSG(cmd))
AssertionError: False is not True : Command 'p i
Error output:
error: expression failed to parse:
error: <user expression 0>:1:1: use of undeclared identifier 'i'
i
^
' did not return successfully
Config=x86_64-/Users/buildslave/jenkins/workspace/lldb-cmake-matrix/lldb-build/bin/clang
----------------------------------------------------------------------
Ran 16 tests in 5.995s

RESULT: FAILED (5 passes, 3 failures, 0 errors, 8 skipped, 0 expected failures, 0 unexpected successes)

--

********************
PASS: lldb-shell :: Watchpoint/SetErrorCases.test (2324 of 2339)
FAIL: lldb-api :: commands/expression/xvalue/TestXValuePrinting.py (2325 of 2339)
******************** TEST 'lldb-api :: commands/expression/xvalue/TestXValuePrinting.py' FAILED ********************
Script:
--
/usr/local/Frameworks/Python.framework/Versions/3.7/bin/python3.7 /Users/buildslave/jenkins/workspace/lldb-cmake-matrix/llvm-project/lldb/test/API/dotest.py -u CXXFLAGS -u CFLAGS --codesign-identity lldb_codesign --arch x86_64 --build-dir /Users/buildslave/jenkins/workspace/lldb-cmake-matrix/lldb-build/lldb-test-build.noindex -t --env TERM=vt100 --skip-category gmodules --skip-category watchpoint --arch=x86_64 --dwarf-version=5 --env LLVM_LIBS_DIR=/Users/buildslave/jenkins/workspace/lldb-cmake-matrix/lldb-build/./lib --arch x86_64 --build-dir /Users/buildslave/jenkins/workspace/lldb-cmake-matrix/lldb-build/lldb-test-build.noindex --lldb-module-cache-dir /Users/buildslave/jenkins/workspace/lldb-cmake-matrix/lldb-build/lldb-test-build.noindex/module-cache-lldb/lldb-api --clang-module-cache-dir /Users/buildslave/jenkins/workspace/lldb-cmake-matrix/lldb-build/lldb-test-build.noindex/module-cache-clang/lldb-api --executable /Users/buildslave/jenkins/workspace/lldb-cmake-matrix/lldb-build/./bin/lldb --compiler /Users/buildslave/jenkins/workspace/lldb-cmake-matrix/lldb-build/./bin/clang --dsymutil /Users/buildslave/jenkins/workspace/lldb-cmake-matrix/lldb-build/./bin/dsymutil --llvm-tools-dir /Users/buildslave/jenkins/workspace/lldb-cmake-matrix/lldb-build/./bin --lldb-libs-dir /Users/buildslave/jenkins/workspace/lldb-cmake-matrix/lldb-build/./lib /Users/buildslave/jenkins/workspace/lldb-cmake-matrix/llvm-project/lldb/test/API/commands/expression/xvalue -p TestXValuePrinting.py
--
Exit Code: 1

Command Output (stdout):
--
lldb version 13.0.99 (http://labmaster3.local/git/llvm-project.git revision 80b2da42d28466341b9512599aac354c178c39f8)
  clang revision 80b2da42d28466341b9512599aac354c178c39f8
  llvm revision 80b2da42d28466341b9512599aac354c178c39f8
Skipping the following test categories: ['darwin-log', 'gmodules', 'watchpoint', 'libstdcxx', 'dwo', 'llgs', 'fork']

--
Command Output (stderr):
--
Change dir to: /Users/buildslave/jenkins/workspace/lldb-cmake-matrix/llvm-project/lldb/test/API/commands/expression/xvalue
runCmd: settings clear -all
output: 

runCmd: settings set symbols.enable-external-lookup false
output: 

runCmd: settings set target.inherit-tcc true
output: 

runCmd: settings set target.detach-on-error false
output: 

runCmd: settings set target.auto-apply-fixits false
output: 

runCmd: settings set plugin.process.gdb-remote.packet-timeout 60
output: 

runCmd: settings set symbols.clang-modules-cache-path "/Users/buildslave/jenkins/workspace/lldb-cmake-matrix/lldb-build/lldb-test-build.noindex/module-cache-lldb/lldb-api"
output: 

runCmd: settings set use-color false
output: 

runCmd: setting set target.prefer-dynamic-value no-dynamic-values
output: 

FAIL: LLDB (/Users/buildslave/jenkins/workspace/lldb-cmake-matrix/lldb-build/bin/clang-x86_64) :: test_dsym (TestXValuePrinting.ExprXValuePrintingTestCase)
runCmd: settings clear -all
output: 

runCmd: settings set symbols.enable-external-lookup false
output: 

runCmd: settings set target.inherit-tcc true
output: 

runCmd: settings set target.detach-on-error false
output: 

runCmd: settings set target.auto-apply-fixits false
output: 

runCmd: settings set plugin.process.gdb-remote.packet-timeout 60
output: 

runCmd: settings set symbols.clang-modules-cache-path "/Users/buildslave/jenkins/workspace/lldb-cmake-matrix/lldb-build/lldb-test-build.noindex/module-cache-lldb/lldb-api"
output: 

runCmd: settings set use-color false
output: 

runCmd: setting set target.prefer-dynamic-value no-dynamic-values
output: 

FAIL: LLDB (/Users/buildslave/jenkins/workspace/lldb-cmake-matrix/lldb-build/bin/clang-x86_64) :: test_dwarf (TestXValuePrinting.ExprXValuePrintingTestCase)
UNSUPPORTED: LLDB (/Users/buildslave/jenkins/workspace/lldb-cmake-matrix/lldb-build/bin/clang-x86_64) :: test_dwo (TestXValuePrinting.ExprXValuePrintingTestCase) (test case does not fall in any category of interest for this run) 
UNSUPPORTED: LLDB (/Users/buildslave/jenkins/workspace/lldb-cmake-matrix/lldb-build/bin/clang-x86_64) :: test_gmodules (TestXValuePrinting.ExprXValuePrintingTestCase) (test case does not fall in any category of interest for this run) 
Restore dir to: /Users/buildslave/jenkins/workspace/lldb-cmake-matrix/lldb-build/tools/lldb/test
======================================================================
FAIL: test_dsym (TestXValuePrinting.ExprXValuePrintingTestCase)
   Printing an xvalue should work.
----------------------------------------------------------------------
Traceback (most recent call last):
  File "/Users/buildslave/jenkins/workspace/lldb-cmake-matrix/llvm-project/lldb/packages/Python/lldbsuite/test/lldbtest.py", line 1830, in test_method
    return attrvalue(self)
  File "/Users/buildslave/jenkins/workspace/lldb-cmake-matrix/llvm-project/lldb/packages/Python/lldbsuite/test/decorators.py", line 119, in wrapper
    func(*args, **kwargs)
  File "/Users/buildslave/jenkins/workspace/lldb-cmake-matrix/llvm-project/lldb/test/API/commands/expression/xvalue/TestXValuePrinting.py", line 14, in test
    lldbutil.run_to_source_breakpoint(self, '// Break here', lldb.SBFileSpec("main.cpp"))
  File "/Users/buildslave/jenkins/workspace/lldb-cmake-matrix/llvm-project/lldb/packages/Python/lldbsuite/test/lldbutil.py", line 969, in run_to_source_breakpoint
    %(bkpt_pattern, source_spec.GetFilename(), source_spec.GetDirectory()))
AssertionError: False is not True : No locations found for source breakpoint: "// Break here", file: "main.cpp", dir: "/Users/buildslave/jenkins/workspace/lldb-cmake-matrix/llvm-project/lldb/test/API/commands/expression/xvalue"
Config=x86_64-/Users/buildslave/jenkins/workspace/lldb-cmake-matrix/lldb-build/bin/clang
======================================================================
FAIL: test_dwarf (TestXValuePrinting.ExprXValuePrintingTestCase)
   Printing an xvalue should work.
----------------------------------------------------------------------
Traceback (most recent call last):
  File "/Users/buildslave/jenkins/workspace/lldb-cmake-matrix/llvm-project/lldb/packages/Python/lldbsuite/test/lldbtest.py", line 1830, in test_method
    return attrvalue(self)
  File "/Users/buildslave/jenkins/workspace/lldb-cmake-matrix/llvm-project/lldb/packages/Python/lldbsuite/test/decorators.py", line 119, in wrapper
    func(*args, **kwargs)
  File "/Users/buildslave/jenkins/workspace/lldb-cmake-matrix/llvm-project/lldb/test/API/commands/expression/xvalue/TestXValuePrinting.py", line 14, in test
    lldbutil.run_to_source_breakpoint(self, '// Break here', lldb.SBFileSpec("main.cpp"))
  File "/Users/buildslave/jenkins/workspace/lldb-cmake-matrix/llvm-project/lldb/packages/Python/lldbsuite/test/lldbutil.py", line 969, in run_to_source_breakpoint
    %(bkpt_pattern, source_spec.GetFilename(), source_spec.GetDirectory()))
AssertionError: False is not True : No locations found for source breakpoint: "// Break here", file: "main.cpp", dir: "/Users/buildslave/jenkins/workspace/lldb-cmake-matrix/llvm-project/lldb/test/API/commands/expression/xvalue"
Config=x86_64-/Users/buildslave/jenkins/workspace/lldb-cmake-matrix/lldb-build/bin/clang
----------------------------------------------------------------------
Ran 4 tests in 0.594s

RESULT: FAILED (0 passes, 2 failures, 0 errors, 2 skipped, 0 expected failures, 0 unexpected successes)

--

********************
FAIL: lldb-api :: commands/expression/top-level/TestTopLevelExprs.py (2326 of 2339)
******************** TEST 'lldb-api :: commands/expression/top-level/TestTopLevelExprs.py' FAILED ********************
Script:
--
/usr/local/Frameworks/Python.framework/Versions/3.7/bin/python3.7 /Users/buildslave/jenkins/workspace/lldb-cmake-matrix/llvm-project/lldb/test/API/dotest.py -u CXXFLAGS -u CFLAGS --codesign-identity lldb_codesign --arch x86_64 --build-dir /Users/buildslave/jenkins/workspace/lldb-cmake-matrix/lldb-build/lldb-test-build.noindex -t --env TERM=vt100 --skip-category gmodules --skip-category watchpoint --arch=x86_64 --dwarf-version=5 --env LLVM_LIBS_DIR=/Users/buildslave/jenkins/workspace/lldb-cmake-matrix/lldb-build/./lib --arch x86_64 --build-dir /Users/buildslave/jenkins/workspace/lldb-cmake-matrix/lldb-build/lldb-test-build.noindex --lldb-module-cache-dir /Users/buildslave/jenkins/workspace/lldb-cmake-matrix/lldb-build/lldb-test-build.noindex/module-cache-lldb/lldb-api --clang-module-cache-dir /Users/buildslave/jenkins/workspace/lldb-cmake-matrix/lldb-build/lldb-test-build.noindex/module-cache-clang/lldb-api --executable /Users/buildslave/jenkins/workspace/lldb-cmake-matrix/lldb-build/./bin/lldb --compiler /Users/buildslave/jenkins/workspace/lldb-cmake-matrix/lldb-build/./bin/clang --dsymutil /Users/buildslave/jenkins/workspace/lldb-cmake-matrix/lldb-build/./bin/dsymutil --llvm-tools-dir /Users/buildslave/jenkins/workspace/lldb-cmake-matrix/lldb-build/./bin --lldb-libs-dir /Users/buildslave/jenkins/workspace/lldb-cmake-matrix/lldb-build/./lib /Users/buildslave/jenkins/workspace/lldb-cmake-matrix/llvm-project/lldb/test/API/commands/expression/top-level -p TestTopLevelExprs.py
--
Exit Code: 1

Command Output (stdout):
--
lldb version 13.0.99 (http://labmaster3.local/git/llvm-project.git revision 80b2da42d28466341b9512599aac354c178c39f8)
  clang revision 80b2da42d28466341b9512599aac354c178c39f8
  llvm revision 80b2da42d28466341b9512599aac354c178c39f8
Skipping the following test categories: ['darwin-log', 'gmodules', 'watchpoint', 'libstdcxx', 'dwo', 'llgs', 'fork']

--
Command Output (stderr):
--
Change dir to: /Users/buildslave/jenkins/workspace/lldb-cmake-matrix/llvm-project/lldb/test/API/commands/expression/top-level
runCmd: settings clear -all
output: 

runCmd: settings set symbols.enable-external-lookup false
output: 

runCmd: settings set target.inherit-tcc true
output: 

runCmd: settings set target.detach-on-error false
output: 

runCmd: settings set target.auto-apply-fixits false
output: 

runCmd: settings set plugin.process.gdb-remote.packet-timeout 60
output: 

runCmd: settings set symbols.clang-modules-cache-path "/Users/buildslave/jenkins/workspace/lldb-cmake-matrix/lldb-build/lldb-test-build.noindex/module-cache-lldb/lldb-api"
output: 

runCmd: settings set use-color false
output: 

runCmd: setting set target.prefer-dynamic-value no-dynamic-values
output: 

runCmd: settings set auto-confirm true
output: 

Adding tearDown hook:             lambda: self.runCmd("settings clear auto-confirm"))


runCmd: expr --top-level -- void func() {}
check of return status not required
runCmd failed!
error: expression failed to parse:
error: Top-level code needs to be inserted into a runnable target, but the target can't be run


Ran command:
"expr --top-level -- void func() {}"

Got output:
error: expression failed to parse:
error: Top-level code needs to be inserted into a runnable target, but the target can't be run

Expecting sub string: "Top-level code needs to be inserted into a runnable target" (was found)

runCmd: expr --top-level -- template<typename T> struct StructT { T m; };
check of return status not required
runCmd failed!
error: expression failed to parse:
error: Top-level code needs to be inserted into a runnable target, but the target can't be run


Ran command:
"expr --top-level -- template<typename T> struct StructT { T m; };"

Got output:
error: expression failed to parse:
error: Top-level code needs to be inserted into a runnable target, but the target can't be run

Expecting sub string: "Top-level code needs to be inserted into a runnable target" (was found)

runCmd: expr --top-level -- struct Struct { int i; };
check of return status not required
runCmd failed!
error: expression failed to parse:
error: Top-level code needs to be inserted into a runnable target, but the target can't be run


Ran command:
"expr --top-level -- struct Struct { int i; };"

Got output:
error: expression failed to parse:
error: Top-level code needs to be inserted into a runnable target, but the target can't be run

Expecting sub string: "Top-level code needs to be inserted into a runnable target" (was found)

Executing tearDown hook:             lambda: self.runCmd("settings clear auto-confirm"))


runCmd: settings clear auto-confirm
output: 

PASS: LLDB (/Users/buildslave/jenkins/workspace/lldb-cmake-matrix/lldb-build/bin/clang-x86_64) :: test_top_level_expression_without_target_dsym (TestTopLevelExprs.TopLevelExpressionsTestCase)
runCmd: settings clear -all
output: 

runCmd: settings set symbols.enable-external-lookup false
output: 

runCmd: settings set target.inherit-tcc true
output: 

runCmd: settings set target.detach-on-error false
output: 

runCmd: settings set target.auto-apply-fixits false
output: 

runCmd: settings set plugin.process.gdb-remote.packet-timeout 60
output: 

runCmd: settings set symbols.clang-modules-cache-path "/Users/buildslave/jenkins/workspace/lldb-cmake-matrix/lldb-build/lldb-test-build.noindex/module-cache-lldb/lldb-api"
output: 

runCmd: settings set use-color false
output: 

runCmd: setting set target.prefer-dynamic-value no-dynamic-values
output: 

runCmd: settings set auto-confirm true
output: 

Adding tearDown hook:             lambda: self.runCmd("settings clear auto-confirm"))


runCmd: expr --top-level -- void func() {}
check of return status not required
runCmd failed!
error: expression failed to parse:
error: Top-level code needs to be inserted into a runnable target, but the target can't be run


Ran command:
"expr --top-level -- void func() {}"

Got output:
error: expression failed to parse:
error: Top-level code needs to be inserted into a runnable target, but the target can't be run

Expecting sub string: "Top-level code needs to be inserted into a runnable target" (was found)

runCmd: expr --top-level -- template<typename T> struct StructT { T m; };
check of return status not required
runCmd failed!
error: expression failed to parse:
error: Top-level code needs to be inserted into a runnable target, but the target can't be run


Ran command:
"expr --top-level -- template<typename T> struct StructT { T m; };"

Got output:
error: expression failed to parse:
error: Top-level code needs to be inserted into a runnable target, but the target can't be run

Expecting sub string: "Top-level code needs to be inserted into a runnable target" (was found)

runCmd: expr --top-level -- struct Struct { int i; };
check of return status not required
runCmd failed!
error: expression failed to parse:
error: Top-level code needs to be inserted into a runnable target, but the target can't be run


Ran command:
"expr --top-level -- struct Struct { int i; };"

Got output:
error: expression failed to parse:
error: Top-level code needs to be inserted into a runnable target, but the target can't be run

Expecting sub string: "Top-level code needs to be inserted into a runnable target" (was found)

Executing tearDown hook:             lambda: self.runCmd("settings clear auto-confirm"))


runCmd: settings clear auto-confirm
output: 

PASS: LLDB (/Users/buildslave/jenkins/workspace/lldb-cmake-matrix/lldb-build/bin/clang-x86_64) :: test_top_level_expression_without_target_dwarf (TestTopLevelExprs.TopLevelExpressionsTestCase)
UNSUPPORTED: LLDB (/Users/buildslave/jenkins/workspace/lldb-cmake-matrix/lldb-build/bin/clang-x86_64) :: test_top_level_expression_without_target_dwo (TestTopLevelExprs.TopLevelExpressionsTestCase) (test case does not fall in any category of interest for this run) 
UNSUPPORTED: LLDB (/Users/buildslave/jenkins/workspace/lldb-cmake-matrix/lldb-build/bin/clang-x86_64) :: test_top_level_expression_without_target_gmodules (TestTopLevelExprs.TopLevelExpressionsTestCase) (test case does not fall in any category of interest for this run) 
runCmd: settings clear -all
output: 

runCmd: settings set symbols.enable-external-lookup false
output: 

runCmd: settings set target.inherit-tcc true
output: 

runCmd: settings set target.detach-on-error false
output: 

runCmd: settings set target.auto-apply-fixits false
output: 

runCmd: settings set plugin.process.gdb-remote.packet-timeout 60
output: 

runCmd: settings set symbols.clang-modules-cache-path "/Users/buildslave/jenkins/workspace/lldb-cmake-matrix/lldb-build/lldb-test-build.noindex/module-cache-lldb/lldb-api"
output: 

runCmd: settings set use-color false
output: 

runCmd: setting set target.prefer-dynamic-value no-dynamic-values
output: 

runCmd: settings set auto-confirm true
output: 

Adding tearDown hook:             lambda: self.runCmd("settings clear auto-confirm"))


runCmd: file /Users/buildslave/jenkins/workspace/lldb-cmake-matrix/lldb-build/lldb-test-build.noindex/commands/expression/top-level/TestTopLevelExprs.test_top_level_expressions_dsym/a.out
output: Current executable set to '/Users/buildslave/jenkins/workspace/lldb-cmake-matrix/lldb-build/lldb-test-build.noindex/commands/expression/top-level/TestTopLevelExprs.test_top_level_expressions_dsym/a.out' (x86_64).


runCmd: breakpoint set -f "main.cpp" -l 7
output: Breakpoint 1: no locations (pending).
WARNING:  Unable to resolve breakpoint to any actual locations.


Expecting pattern: ^Breakpoint (?P<bpno>[0-9]+): (?P<num_locations>[0-9]+) locations\.$
Not matched

Expecting pattern: ^Breakpoint (?P<bpno>[0-9]+): (?P<num_locations>no) locations \(pending\)\.
Matched

FAIL: LLDB (/Users/buildslave/jenkins/workspace/lldb-cmake-matrix/lldb-build/bin/clang-x86_64) :: test_top_level_expressions_dsym (TestTopLevelExprs.TopLevelExpressionsTestCase)
Executing tearDown hook:             lambda: self.runCmd("settings clear auto-confirm"))


runCmd: settings clear auto-confirm
output: 

runCmd: settings clear -all
output: 

runCmd: settings set symbols.enable-external-lookup false
output: 

runCmd: settings set target.inherit-tcc true
output: 

runCmd: settings set target.detach-on-error false
output: 

runCmd: settings set target.auto-apply-fixits false
output: 

runCmd: settings set plugin.process.gdb-remote.packet-timeout 60
output: 

runCmd: settings set symbols.clang-modules-cache-path "/Users/buildslave/jenkins/workspace/lldb-cmake-matrix/lldb-build/lldb-test-build.noindex/module-cache-lldb/lldb-api"
output: 

runCmd: settings set use-color false
output: 

runCmd: setting set target.prefer-dynamic-value no-dynamic-values
output: 

runCmd: settings set auto-confirm true
output: 

Adding tearDown hook:             lambda: self.runCmd("settings clear auto-confirm"))


runCmd: file /Users/buildslave/jenkins/workspace/lldb-cmake-matrix/lldb-build/lldb-test-build.noindex/commands/expression/top-level/TestTopLevelExprs.test_top_level_expressions_dwarf/a.out
output: Current executable set to '/Users/buildslave/jenkins/workspace/lldb-cmake-matrix/lldb-build/lldb-test-build.noindex/commands/expression/top-level/TestTopLevelExprs.test_top_level_expressions_dwarf/a.out' (x86_64).


runCmd: breakpoint set -f "main.cpp" -l 7
output: Breakpoint 1: no locations (pending).
WARNING:  Unable to resolve breakpoint to any actual locations.


Expecting pattern: ^Breakpoint (?P<bpno>[0-9]+): (?P<num_locations>[0-9]+) locations\.$
Not matched

Expecting pattern: ^Breakpoint (?P<bpno>[0-9]+): (?P<num_locations>no) locations \(pending\)\.
Matched

FAIL: LLDB (/Users/buildslave/jenkins/workspace/lldb-cmake-matrix/lldb-build/bin/clang-x86_64) :: test_top_level_expressions_dwarf (TestTopLevelExprs.TopLevelExpressionsTestCase)
Executing tearDown hook:             lambda: self.runCmd("settings clear auto-confirm"))


runCmd: settings clear auto-confirm
output: 

UNSUPPORTED: LLDB (/Users/buildslave/jenkins/workspace/lldb-cmake-matrix/lldb-build/bin/clang-x86_64) :: test_top_level_expressions_dwo (TestTopLevelExprs.TopLevelExpressionsTestCase) (test case does not fall in any category of interest for this run) 
UNSUPPORTED: LLDB (/Users/buildslave/jenkins/workspace/lldb-cmake-matrix/lldb-build/bin/clang-x86_64) :: test_top_level_expressions_gmodules (TestTopLevelExprs.TopLevelExpressionsTestCase) (test case does not fall in any category of interest for this run) 
Restore dir to: /Users/buildslave/jenkins/workspace/lldb-cmake-matrix/lldb-build/tools/lldb/test
======================================================================
FAIL: test_top_level_expressions_dsym (TestTopLevelExprs.TopLevelExpressionsTestCase)
----------------------------------------------------------------------
Traceback (most recent call last):
  File "/Users/buildslave/jenkins/workspace/lldb-cmake-matrix/llvm-project/lldb/packages/Python/lldbsuite/test/lldbtest.py", line 1830, in test_method
    return attrvalue(self)
  File "/Users/buildslave/jenkins/workspace/lldb-cmake-matrix/llvm-project/lldb/packages/Python/lldbsuite/test/decorators.py", line 149, in wrapper
    return func(*args, **kwargs)
  File "/Users/buildslave/jenkins/workspace/lldb-cmake-matrix/llvm-project/lldb/packages/Python/lldbsuite/test/decorators.py", line 149, in wrapper
    return func(*args, **kwargs)
  File "/Users/buildslave/jenkins/workspace/lldb-cmake-matrix/llvm-project/lldb/test/API/commands/expression/top-level/TestTopLevelExprs.py", line 61, in test_top_level_expressions
    self.build_and_run()
  File "/Users/buildslave/jenkins/workspace/lldb-cmake-matrix/llvm-project/lldb/test/API/commands/expression/top-level/TestTopLevelExprs.py", line 40, in build_and_run
    self, "main.cpp", self.line, num_expected_locations=1, loc_exact=False)
  File "/Users/buildslave/jenkins/workspace/lldb-cmake-matrix/llvm-project/lldb/packages/Python/lldbsuite/test/lldbutil.py", line 443, in run_break_set_by_file_and_line
    num_locations=num_expected_locations)
  File "/Users/buildslave/jenkins/workspace/lldb-cmake-matrix/llvm-project/lldb/packages/Python/lldbsuite/test/lldbutil.py", line 664, in check_breakpoint_result
    out_num_locations))
AssertionError: False is not True : Expecting 1 locations, got 0.
Config=x86_64-/Users/buildslave/jenkins/workspace/lldb-cmake-matrix/lldb-build/bin/clang
======================================================================
FAIL: test_top_level_expressions_dwarf (TestTopLevelExprs.TopLevelExpressionsTestCase)
----------------------------------------------------------------------
Traceback (most recent call last):
  File "/Users/buildslave/jenkins/workspace/lldb-cmake-matrix/llvm-project/lldb/packages/Python/lldbsuite/test/lldbtest.py", line 1830, in test_method
    return attrvalue(self)
  File "/Users/buildslave/jenkins/workspace/lldb-cmake-matrix/llvm-project/lldb/packages/Python/lldbsuite/test/decorators.py", line 149, in wrapper
    return func(*args, **kwargs)
  File "/Users/buildslave/jenkins/workspace/lldb-cmake-matrix/llvm-project/lldb/packages/Python/lldbsuite/test/decorators.py", line 149, in wrapper
    return func(*args, **kwargs)
  File "/Users/buildslave/jenkins/workspace/lldb-cmake-matrix/llvm-project/lldb/test/API/commands/expression/top-level/TestTopLevelExprs.py", line 61, in test_top_level_expressions
    self.build_and_run()
  File "/Users/buildslave/jenkins/workspace/lldb-cmake-matrix/llvm-project/lldb/test/API/commands/expression/top-level/TestTopLevelExprs.py", line 40, in build_and_run
    self, "main.cpp", self.line, num_expected_locations=1, loc_exact=False)
  File "/Users/buildslave/jenkins/workspace/lldb-cmake-matrix/llvm-project/lldb/packages/Python/lldbsuite/test/lldbutil.py", line 443, in run_break_set_by_file_and_line
    num_locations=num_expected_locations)
  File "/Users/buildslave/jenkins/workspace/lldb-cmake-matrix/llvm-project/lldb/packages/Python/lldbsuite/test/lldbutil.py", line 664, in check_breakpoint_result
    out_num_locations))
AssertionError: False is not True : Expecting 1 locations, got 0.
Config=x86_64-/Users/buildslave/jenkins/workspace/lldb-cmake-matrix/lldb-build/bin/clang
----------------------------------------------------------------------
Ran 8 tests in 1.047s

RESULT: FAILED (2 passes, 2 failures, 0 errors, 4 skipped, 0 expected failures, 0 unexpected successes)

--

********************
PASS: lldb-api :: functionalities/gdb_remote_client/TestWasm.py (2327 of 2339)
FAIL: lldb-api :: python_api/symbol-context/two-files/TestSymbolContextTwoFiles.py (2328 of 2339)
******************** TEST 'lldb-api :: python_api/symbol-context/two-files/TestSymbolContextTwoFiles.py' FAILED ********************
Script:
--
/usr/local/Frameworks/Python.framework/Versions/3.7/bin/python3.7 /Users/buildslave/jenkins/workspace/lldb-cmake-matrix/llvm-project/lldb/test/API/dotest.py -u CXXFLAGS -u CFLAGS --codesign-identity lldb_codesign --arch x86_64 --build-dir /Users/buildslave/jenkins/workspace/lldb-cmake-matrix/lldb-build/lldb-test-build.noindex -t --env TERM=vt100 --skip-category gmodules --skip-category watchpoint --arch=x86_64 --dwarf-version=5 --env LLVM_LIBS_DIR=/Users/buildslave/jenkins/workspace/lldb-cmake-matrix/lldb-build/./lib --arch x86_64 --build-dir /Users/buildslave/jenkins/workspace/lldb-cmake-matrix/lldb-build/lldb-test-build.noindex --lldb-module-cache-dir /Users/buildslave/jenkins/workspace/lldb-cmake-matrix/lldb-build/lldb-test-build.noindex/module-cache-lldb/lldb-api --clang-module-cache-dir /Users/buildslave/jenkins/workspace/lldb-cmake-matrix/lldb-build/lldb-test-build.noindex/module-cache-clang/lldb-api --executable /Users/buildslave/jenkins/workspace/lldb-cmake-matrix/lldb-build/./bin/lldb --compiler /Users/buildslave/jenkins/workspace/lldb-cmake-matrix/lldb-build/./bin/clang --dsymutil /Users/buildslave/jenkins/workspace/lldb-cmake-matrix/lldb-build/./bin/dsymutil --llvm-tools-dir /Users/buildslave/jenkins/workspace/lldb-cmake-matrix/lldb-build/./bin --lldb-libs-dir /Users/buildslave/jenkins/workspace/lldb-cmake-matrix/lldb-build/./lib /Users/buildslave/jenkins/workspace/lldb-cmake-matrix/llvm-project/lldb/test/API/python_api/symbol-context/two-files -p TestSymbolContextTwoFiles.py
--
Exit Code: 1

Command Output (stdout):
--
lldb version 13.0.99 (http://labmaster3.local/git/llvm-project.git revision 80b2da42d28466341b9512599aac354c178c39f8)
  clang revision 80b2da42d28466341b9512599aac354c178c39f8
  llvm revision 80b2da42d28466341b9512599aac354c178c39f8
Skipping the following test categories: ['darwin-log', 'gmodules', 'watchpoint', 'libstdcxx', 'dwo', 'llgs', 'fork']

--
Command Output (stderr):
--
Change dir to: /Users/buildslave/jenkins/workspace/lldb-cmake-matrix/llvm-project/lldb/test/API/python_api/symbol-context/two-files
runCmd: settings clear -all
output: 

runCmd: settings set symbols.enable-external-lookup false
output: 

runCmd: settings set target.inherit-tcc true
output: 

runCmd: settings set target.detach-on-error false
output: 

runCmd: settings set target.auto-apply-fixits false
output: 

runCmd: settings set plugin.process.gdb-remote.packet-timeout 60
output: 

runCmd: settings set symbols.clang-modules-cache-path "/Users/buildslave/jenkins/workspace/lldb-cmake-matrix/lldb-build/lldb-test-build.noindex/module-cache-lldb/lldb-api"
output: 

runCmd: settings set use-color false
output: 

runCmd: setting set target.prefer-dynamic-value no-dynamic-values
output: 

FAIL: LLDB (/Users/buildslave/jenkins/workspace/lldb-cmake-matrix/lldb-build/bin/clang-x86_64) :: test_lookup_by_address_dsym (TestSymbolContextTwoFiles.SymbolContextTwoFilesTestCase)
runCmd: settings clear -all
output: 

runCmd: settings set symbols.enable-external-lookup false
output: 

runCmd: settings set target.inherit-tcc true
output: 

runCmd: settings set target.detach-on-error false
output: 

runCmd: settings set target.auto-apply-fixits false
output: 

runCmd: settings set plugin.process.gdb-remote.packet-timeout 60
output: 

runCmd: settings set symbols.clang-modules-cache-path "/Users/buildslave/jenkins/workspace/lldb-cmake-matrix/lldb-build/lldb-test-build.noindex/module-cache-lldb/lldb-api"
output: 

runCmd: settings set use-color false
output: 

runCmd: setting set target.prefer-dynamic-value no-dynamic-values
output: 

FAIL: LLDB (/Users/buildslave/jenkins/workspace/lldb-cmake-matrix/lldb-build/bin/clang-x86_64) :: test_lookup_by_address_dwarf (TestSymbolContextTwoFiles.SymbolContextTwoFilesTestCase)
UNSUPPORTED: LLDB (/Users/buildslave/jenkins/workspace/lldb-cmake-matrix/lldb-build/bin/clang-x86_64) :: test_lookup_by_address_dwo (TestSymbolContextTwoFiles.SymbolContextTwoFilesTestCase) (test case does not fall in any category of interest for this run) 
UNSUPPORTED: LLDB (/Users/buildslave/jenkins/workspace/lldb-cmake-matrix/lldb-build/bin/clang-x86_64) :: test_lookup_by_address_gmodules (TestSymbolContextTwoFiles.SymbolContextTwoFilesTestCase) (test case does not fall in any category of interest for this run) 
runCmd: settings clear -all
output: 

runCmd: settings set symbols.enable-external-lookup false
output: 

runCmd: settings set target.inherit-tcc true
output: 

runCmd: settings set target.detach-on-error false
output: 

runCmd: settings set target.auto-apply-fixits false
output: 

runCmd: settings set plugin.process.gdb-remote.packet-timeout 60
output: 

runCmd: settings set symbols.clang-modules-cache-path "/Users/buildslave/jenkins/workspace/lldb-cmake-matrix/lldb-build/lldb-test-build.noindex/module-cache-lldb/lldb-api"
output: 

runCmd: settings set use-color false
output: 

runCmd: setting set target.prefer-dynamic-value no-dynamic-values
output: 

FAIL: LLDB (/Users/buildslave/jenkins/workspace/lldb-cmake-matrix/lldb-build/bin/clang-x86_64) :: test_ranges_in_multiple_compile_unit_dsym (TestSymbolContextTwoFiles.SymbolContextTwoFilesTestCase)
<bound method SBProcess.Kill of <lldb.SBProcess; proxy of <Swig Object of type 'lldb::SBProcess *' at 0x10880f720> >>: success

runCmd: settings clear -all
output: 

runCmd: settings set symbols.enable-external-lookup false
output: 

runCmd: settings set target.inherit-tcc true
output: 

runCmd: settings set target.detach-on-error false
output: 

runCmd: settings set target.auto-apply-fixits false
output: 

runCmd: settings set plugin.process.gdb-remote.packet-timeout 60
output: 

runCmd: settings set symbols.clang-modules-cache-path "/Users/buildslave/jenkins/workspace/lldb-cmake-matrix/lldb-build/lldb-test-build.noindex/module-cache-lldb/lldb-api"
output: 

runCmd: settings set use-color false
output: 

runCmd: setting set target.prefer-dynamic-value no-dynamic-values
output: 

FAIL: LLDB (/Users/buildslave/jenkins/workspace/lldb-cmake-matrix/lldb-build/bin/clang-x86_64) :: test_ranges_in_multiple_compile_unit_dwarf (TestSymbolContextTwoFiles.SymbolContextTwoFilesTestCase)
<bound method SBProcess.Kill of <lldb.SBProcess; proxy of <Swig Object of type 'lldb::SBProcess *' at 0x1080afc90> >>: success

UNSUPPORTED: LLDB (/Users/buildslave/jenkins/workspace/lldb-cmake-matrix/lldb-build/bin/clang-x86_64) :: test_ranges_in_multiple_compile_unit_dwo (TestSymbolContextTwoFiles.SymbolContextTwoFilesTestCase) (test case does not fall in any category of interest for this run) 
UNSUPPORTED: LLDB (/Users/buildslave/jenkins/workspace/lldb-cmake-matrix/lldb-build/bin/clang-x86_64) :: test_ranges_in_multiple_compile_unit_gmodules (TestSymbolContextTwoFiles.SymbolContextTwoFilesTestCase) (test case does not fall in any category of interest for this run) 
Restore dir to: /Users/buildslave/jenkins/workspace/lldb-cmake-matrix/lldb-build/tools/lldb/test
======================================================================
FAIL: test_lookup_by_address_dsym (TestSymbolContextTwoFiles.SymbolContextTwoFilesTestCase)
   Test lookup by address in a module with multiple compilation units
----------------------------------------------------------------------
Traceback (most recent call last):
  File "/Users/buildslave/jenkins/workspace/lldb-cmake-matrix/llvm-project/lldb/packages/Python/lldbsuite/test/lldbtest.py", line 1830, in test_method
    return attrvalue(self)
  File "/Users/buildslave/jenkins/workspace/lldb-cmake-matrix/llvm-project/lldb/packages/Python/lldbsuite/test/decorators.py", line 119, in wrapper
    func(*args, **kwargs)
  File "/Users/buildslave/jenkins/workspace/lldb-cmake-matrix/llvm-project/lldb/test/API/python_api/symbol-context/two-files/TestSymbolContextTwoFiles.py", line 32, in test_lookup_by_address
    self.assertTrue(symbol_address.IsValid())
AssertionError: False is not True
Config=x86_64-/Users/buildslave/jenkins/workspace/lldb-cmake-matrix/lldb-build/bin/clang
======================================================================
FAIL: test_lookup_by_address_dwarf (TestSymbolContextTwoFiles.SymbolContextTwoFilesTestCase)
   Test lookup by address in a module with multiple compilation units
----------------------------------------------------------------------
Traceback (most recent call last):
  File "/Users/buildslave/jenkins/workspace/lldb-cmake-matrix/llvm-project/lldb/packages/Python/lldbsuite/test/lldbtest.py", line 1830, in test_method
    return attrvalue(self)
  File "/Users/buildslave/jenkins/workspace/lldb-cmake-matrix/llvm-project/lldb/packages/Python/lldbsuite/test/decorators.py", line 119, in wrapper
    func(*args, **kwargs)
  File "/Users/buildslave/jenkins/workspace/lldb-cmake-matrix/llvm-project/lldb/test/API/python_api/symbol-context/two-files/TestSymbolContextTwoFiles.py", line 36, in test_lookup_by_address
    sc_by_address.GetFunction().GetName())
AssertionError: 'struct1::f()' != None
Config=x86_64-/Users/buildslave/jenkins/workspace/lldb-cmake-matrix/lldb-build/bin/clang
======================================================================
FAIL: test_ranges_in_multiple_compile_unit_dsym (TestSymbolContextTwoFiles.SymbolContextTwoFilesTestCase)
   This test verifies that we correctly handle the case when multiple
----------------------------------------------------------------------
Traceback (most recent call last):
  File "/Users/buildslave/jenkins/workspace/lldb-cmake-matrix/llvm-project/lldb/packages/Python/lldbsuite/test/lldbtest.py", line 1830, in test_method
    return attrvalue(self)
  File "/Users/buildslave/jenkins/workspace/lldb-cmake-matrix/llvm-project/lldb/test/API/python_api/symbol-context/two-files/TestSymbolContextTwoFiles.py", line 63, in test_ranges_in_multiple_compile_unit
    self.assertEqual(len(threads), 1)
AssertionError: 0 != 1
Config=x86_64-/Users/buildslave/jenkins/workspace/lldb-cmake-matrix/lldb-build/bin/clang
======================================================================
FAIL: test_ranges_in_multiple_compile_unit_dwarf (TestSymbolContextTwoFiles.SymbolContextTwoFilesTestCase)
   This test verifies that we correctly handle the case when multiple
----------------------------------------------------------------------
Traceback (most recent call last):
  File "/Users/buildslave/jenkins/workspace/lldb-cmake-matrix/llvm-project/lldb/packages/Python/lldbsuite/test/lldbtest.py", line 1830, in test_method
    return attrvalue(self)
  File "/Users/buildslave/jenkins/workspace/lldb-cmake-matrix/llvm-project/lldb/test/API/python_api/symbol-context/two-files/TestSymbolContextTwoFiles.py", line 63, in test_ranges_in_multiple_compile_unit
    self.assertEqual(len(threads), 1)
AssertionError: 0 != 1
Config=x86_64-/Users/buildslave/jenkins/workspace/lldb-cmake-matrix/lldb-build/bin/clang
----------------------------------------------------------------------
Ran 8 tests in 1.807s

RESULT: FAILED (0 passes, 4 failures, 0 errors, 4 skipped, 0 expected failures, 0 unexpected successes)

--

********************
FAIL: lldb-api :: functionalities/float-display/TestFloatDisplay.py (2329 of 2339)
******************** TEST 'lldb-api :: functionalities/float-display/TestFloatDisplay.py' FAILED ********************
Script:
--
/usr/local/Frameworks/Python.framework/Versions/3.7/bin/python3.7 /Users/buildslave/jenkins/workspace/lldb-cmake-matrix/llvm-project/lldb/test/API/dotest.py -u CXXFLAGS -u CFLAGS --codesign-identity lldb_codesign --arch x86_64 --build-dir /Users/buildslave/jenkins/workspace/lldb-cmake-matrix/lldb-build/lldb-test-build.noindex -t --env TERM=vt100 --skip-category gmodules --skip-category watchpoint --arch=x86_64 --dwarf-version=5 --env LLVM_LIBS_DIR=/Users/buildslave/jenkins/workspace/lldb-cmake-matrix/lldb-build/./lib --arch x86_64 --build-dir /Users/buildslave/jenkins/workspace/lldb-cmake-matrix/lldb-build/lldb-test-build.noindex --lldb-module-cache-dir /Users/buildslave/jenkins/workspace/lldb-cmake-matrix/lldb-build/lldb-test-build.noindex/module-cache-lldb/lldb-api --clang-module-cache-dir /Users/buildslave/jenkins/workspace/lldb-cmake-matrix/lldb-build/lldb-test-build.noindex/module-cache-clang/lldb-api --executable /Users/buildslave/jenkins/workspace/lldb-cmake-matrix/lldb-build/./bin/lldb --compiler /Users/buildslave/jenkins/workspace/lldb-cmake-matrix/lldb-build/./bin/clang --dsymutil /Users/buildslave/jenkins/workspace/lldb-cmake-matrix/lldb-build/./bin/dsymutil --llvm-tools-dir /Users/buildslave/jenkins/workspace/lldb-cmake-matrix/lldb-build/./bin --lldb-libs-dir /Users/buildslave/jenkins/workspace/lldb-cmake-matrix/lldb-build/./lib /Users/buildslave/jenkins/workspace/lldb-cmake-matrix/llvm-project/lldb/test/API/functionalities/float-display -p TestFloatDisplay.py
--
Exit Code: 1

Command Output (stdout):
--
lldb version 13.0.99 (http://labmaster3.local/git/llvm-project.git revision 80b2da42d28466341b9512599aac354c178c39f8)
  clang revision 80b2da42d28466341b9512599aac354c178c39f8
  llvm revision 80b2da42d28466341b9512599aac354c178c39f8
Skipping the following test categories: ['darwin-log', 'gmodules', 'watchpoint', 'libstdcxx', 'dwo', 'llgs', 'fork']

--
Command Output (stderr):
--
Change dir to: /Users/buildslave/jenkins/workspace/lldb-cmake-matrix/llvm-project/lldb/test/API/functionalities/float-display
runCmd: settings clear -all
output: 

runCmd: settings set symbols.enable-external-lookup false
output: 

runCmd: settings set target.inherit-tcc true
output: 

runCmd: settings set target.detach-on-error false
output: 

runCmd: settings set target.auto-apply-fixits false
output: 

runCmd: settings set plugin.process.gdb-remote.packet-timeout 60
output: 

runCmd: settings set symbols.clang-modules-cache-path "/Users/buildslave/jenkins/workspace/lldb-cmake-matrix/lldb-build/lldb-test-build.noindex/module-cache-lldb/lldb-api"
output: 

runCmd: settings set use-color false
output: 

runCmd: setting set target.prefer-dynamic-value no-dynamic-values
output: 

FAIL: LLDB (/Users/buildslave/jenkins/workspace/lldb-cmake-matrix/lldb-build/bin/clang-x86_64) :: test_dsym (lldbsuite.test.lldbtest.TestFloatDisplay)
<bound method SBProcess.Kill of <lldb.SBProcess; proxy of <Swig Object of type 'lldb::SBProcess *' at 0x10b5153f0> >>: success

runCmd: settings clear -all
output: 

runCmd: settings set symbols.enable-external-lookup false
output: 

runCmd: settings set target.inherit-tcc true
output: 

runCmd: settings set target.detach-on-error false
output: 

runCmd: settings set target.auto-apply-fixits false
output: 

runCmd: settings set plugin.process.gdb-remote.packet-timeout 60
output: 

runCmd: settings set symbols.clang-modules-cache-path "/Users/buildslave/jenkins/workspace/lldb-cmake-matrix/lldb-build/lldb-test-build.noindex/module-cache-lldb/lldb-api"
output: 

runCmd: settings set use-color false
output: 

runCmd: setting set target.prefer-dynamic-value no-dynamic-values
output: 

FAIL: LLDB (/Users/buildslave/jenkins/workspace/lldb-cmake-matrix/lldb-build/bin/clang-x86_64) :: test_dwarf (lldbsuite.test.lldbtest.TestFloatDisplay)
<bound method SBProcess.Kill of <lldb.SBProcess; proxy of <Swig Object of type 'lldb::SBProcess *' at 0x105c51e70> >>: success

UNSUPPORTED: LLDB (/Users/buildslave/jenkins/workspace/lldb-cmake-matrix/lldb-build/bin/clang-x86_64) :: test_dwo (lldbsuite.test.lldbtest.TestFloatDisplay) (test case does not fall in any category of interest for this run) 
UNSUPPORTED: LLDB (/Users/buildslave/jenkins/workspace/lldb-cmake-matrix/lldb-build/bin/clang-x86_64) :: test_gmodules (lldbsuite.test.lldbtest.TestFloatDisplay) (test case does not fall in any category of interest for this run) 
Restore dir to: /Users/buildslave/jenkins/workspace/lldb-cmake-matrix/lldb-build/tools/lldb/test
======================================================================
FAIL: test_dsym (lldbsuite.test.lldbtest.TestFloatDisplay)
----------------------------------------------------------------------
Traceback (most recent call last):
  File "/Users/buildslave/jenkins/workspace/lldb-cmake-matrix/llvm-project/lldb/packages/Python/lldbsuite/test/lldbtest.py", line 1830, in test_method
    return attrvalue(self)
  File "/Users/buildslave/jenkins/workspace/lldb-cmake-matrix/llvm-project/lldb/packages/Python/lldbsuite/test/lldbinline.py", line 121, in _test
    self.do_test()
  File "/Users/buildslave/jenkins/workspace/lldb-cmake-matrix/llvm-project/lldb/packages/Python/lldbsuite/test/lldbinline.py", line 157, in do_test
    "inline test did not hit a single breakpoint")
AssertionError: False is not True : inline test did not hit a single breakpoint
Config=x86_64-/Users/buildslave/jenkins/workspace/lldb-cmake-matrix/lldb-build/bin/clang
======================================================================
FAIL: test_dwarf (lldbsuite.test.lldbtest.TestFloatDisplay)
----------------------------------------------------------------------
Traceback (most recent call last):
  File "/Users/buildslave/jenkins/workspace/lldb-cmake-matrix/llvm-project/lldb/packages/Python/lldbsuite/test/lldbtest.py", line 1830, in test_method
    return attrvalue(self)
  File "/Users/buildslave/jenkins/workspace/lldb-cmake-matrix/llvm-project/lldb/packages/Python/lldbsuite/test/lldbinline.py", line 121, in _test
    self.do_test()
  File "/Users/buildslave/jenkins/workspace/lldb-cmake-matrix/llvm-project/lldb/packages/Python/lldbsuite/test/lldbinline.py", line 157, in do_test
    "inline test did not hit a single breakpoint")
AssertionError: False is not True : inline test did not hit a single breakpoint
Config=x86_64-/Users/buildslave/jenkins/workspace/lldb-cmake-matrix/lldb-build/bin/clang
----------------------------------------------------------------------
Ran 4 tests in 1.121s

RESULT: FAILED (0 passes, 2 failures, 0 errors, 2 skipped, 0 expected failures, 0 unexpected successes)

--

********************
FAIL: lldb-api :: functionalities/data-formatter/nsdictionarysynth/TestNSDictionarySynthetic.py (2330 of 2339)
******************** TEST 'lldb-api :: functionalities/data-formatter/nsdictionarysynth/TestNSDictionarySynthetic.py' FAILED ********************
Script:
--
/usr/local/Frameworks/Python.framework/Versions/3.7/bin/python3.7 /Users/buildslave/jenkins/workspace/lldb-cmake-matrix/llvm-project/lldb/test/API/dotest.py -u CXXFLAGS -u CFLAGS --codesign-identity lldb_codesign --arch x86_64 --build-dir /Users/buildslave/jenkins/workspace/lldb-cmake-matrix/lldb-build/lldb-test-build.noindex -t --env TERM=vt100 --skip-category gmodules --skip-category watchpoint --arch=x86_64 --dwarf-version=5 --env LLVM_LIBS_DIR=/Users/buildslave/jenkins/workspace/lldb-cmake-matrix/lldb-build/./lib --arch x86_64 --build-dir /Users/buildslave/jenkins/workspace/lldb-cmake-matrix/lldb-build/lldb-test-build.noindex --lldb-module-cache-dir /Users/buildslave/jenkins/workspace/lldb-cmake-matrix/lldb-build/lldb-test-build.noindex/module-cache-lldb/lldb-api --clang-module-cache-dir /Users/buildslave/jenkins/workspace/lldb-cmake-matrix/lldb-build/lldb-test-build.noindex/module-cache-clang/lldb-api --executable /Users/buildslave/jenkins/workspace/lldb-cmake-matrix/lldb-build/./bin/lldb --compiler /Users/buildslave/jenkins/workspace/lldb-cmake-matrix/lldb-build/./bin/clang --dsymutil /Users/buildslave/jenkins/workspace/lldb-cmake-matrix/lldb-build/./bin/dsymutil --llvm-tools-dir /Users/buildslave/jenkins/workspace/lldb-cmake-matrix/lldb-build/./bin --lldb-libs-dir /Users/buildslave/jenkins/workspace/lldb-cmake-matrix/lldb-build/./lib /Users/buildslave/jenkins/workspace/lldb-cmake-matrix/llvm-project/lldb/test/API/functionalities/data-formatter/nsdictionarysynth -p TestNSDictionarySynthetic.py
--
Exit Code: 1

Command Output (stdout):
--
lldb version 13.0.99 (http://labmaster3.local/git/llvm-project.git revision 80b2da42d28466341b9512599aac354c178c39f8)
  clang revision 80b2da42d28466341b9512599aac354c178c39f8
  llvm revision 80b2da42d28466341b9512599aac354c178c39f8
Skipping the following test categories: ['darwin-log', 'gmodules', 'watchpoint', 'libstdcxx', 'dwo', 'llgs', 'fork']

--
Command Output (stderr):
--
Change dir to: /Users/buildslave/jenkins/workspace/lldb-cmake-matrix/llvm-project/lldb/test/API/functionalities/data-formatter/nsdictionarysynth
runCmd: settings clear -all
output: 

runCmd: settings set symbols.enable-external-lookup false
output: 

runCmd: settings set target.inherit-tcc true
output: 

runCmd: settings set target.detach-on-error false
output: 

runCmd: settings set target.auto-apply-fixits false
output: 

runCmd: settings set plugin.process.gdb-remote.packet-timeout 60
output: 

runCmd: settings set symbols.clang-modules-cache-path "/Users/buildslave/jenkins/workspace/lldb-cmake-matrix/lldb-build/lldb-test-build.noindex/module-cache-lldb/lldb-api"
output: 

runCmd: settings set use-color false
output: 

runCmd: setting set target.prefer-dynamic-value no-dynamic-values
output: 

runCmd: file /Users/buildslave/jenkins/workspace/lldb-cmake-matrix/lldb-build/lldb-test-build.noindex/functionalities/data-formatter/nsdictionarysynth/TestNSDictionarySynthetic.test_rdar11988289_with_run_command_dsym/a.out
output: Current executable set to '/Users/buildslave/jenkins/workspace/lldb-cmake-matrix/lldb-build/lldb-test-build.noindex/functionalities/data-formatter/nsdictionarysynth/TestNSDictionarySynthetic.test_rdar11988289_with_run_command_dsym/a.out' (x86_64).


runCmd: breakpoint set -f "main.m" -l 18
output: Breakpoint 1: no locations (pending).
WARNING:  Unable to resolve breakpoint to any actual locations.


Expecting pattern: ^Breakpoint (?P<bpno>[0-9]+): (?P<num_locations>[0-9]+) locations\.$
Not matched

Expecting pattern: ^Breakpoint (?P<bpno>[0-9]+): (?P<num_locations>no) locations \(pending\)\.
Matched

FAIL: LLDB (/Users/buildslave/jenkins/workspace/lldb-cmake-matrix/lldb-build/bin/clang-x86_64) :: test_rdar11988289_with_run_command_dsym (TestNSDictionarySynthetic.NSDictionarySyntheticTestCase)
runCmd: settings clear -all
output: 

runCmd: settings set symbols.enable-external-lookup false
output: 

runCmd: settings set target.inherit-tcc true
output: 

runCmd: settings set target.detach-on-error false
output: 

runCmd: settings set target.auto-apply-fixits false
output: 

runCmd: settings set plugin.process.gdb-remote.packet-timeout 60
output: 

runCmd: settings set symbols.clang-modules-cache-path "/Users/buildslave/jenkins/workspace/lldb-cmake-matrix/lldb-build/lldb-test-build.noindex/module-cache-lldb/lldb-api"
output: 

runCmd: settings set use-color false
output: 

runCmd: setting set target.prefer-dynamic-value no-dynamic-values
output: 

runCmd: file /Users/buildslave/jenkins/workspace/lldb-cmake-matrix/lldb-build/lldb-test-build.noindex/functionalities/data-formatter/nsdictionarysynth/TestNSDictionarySynthetic.test_rdar11988289_with_run_command_dwarf/a.out
output: Current executable set to '/Users/buildslave/jenkins/workspace/lldb-cmake-matrix/lldb-build/lldb-test-build.noindex/functionalities/data-formatter/nsdictionarysynth/TestNSDictionarySynthetic.test_rdar11988289_with_run_command_dwarf/a.out' (x86_64).


runCmd: breakpoint set -f "main.m" -l 18
output: Breakpoint 1: no locations (pending).
WARNING:  Unable to resolve breakpoint to any actual locations.


Expecting pattern: ^Breakpoint (?P<bpno>[0-9]+): (?P<num_locations>[0-9]+) locations\.$
Not matched

Expecting pattern: ^Breakpoint (?P<bpno>[0-9]+): (?P<num_locations>no) locations \(pending\)\.
Matched

FAIL: LLDB (/Users/buildslave/jenkins/workspace/lldb-cmake-matrix/lldb-build/bin/clang-x86_64) :: test_rdar11988289_with_run_command_dwarf (TestNSDictionarySynthetic.NSDictionarySyntheticTestCase)
UNSUPPORTED: LLDB (/Users/buildslave/jenkins/workspace/lldb-cmake-matrix/lldb-build/bin/clang-x86_64) :: test_rdar11988289_with_run_command_dwo (TestNSDictionarySynthetic.NSDictionarySyntheticTestCase) (test case does not fall in any category of interest for this run) 
UNSUPPORTED: LLDB (/Users/buildslave/jenkins/workspace/lldb-cmake-matrix/lldb-build/bin/clang-x86_64) :: test_rdar11988289_with_run_command_gmodules (TestNSDictionarySynthetic.NSDictionarySyntheticTestCase) (test case does not fall in any category of interest for this run) 
Restore dir to: /Users/buildslave/jenkins/workspace/lldb-cmake-matrix/lldb-build/tools/lldb/test
======================================================================
FAIL: test_rdar11988289_with_run_command_dsym (TestNSDictionarySynthetic.NSDictionarySyntheticTestCase)
   Test that NSDictionary reports its synthetic children properly.
----------------------------------------------------------------------
Traceback (most recent call last):
  File "/Users/buildslave/jenkins/workspace/lldb-cmake-matrix/llvm-project/lldb/packages/Python/lldbsuite/test/lldbtest.py", line 1830, in test_method
    return attrvalue(self)
  File "/Users/buildslave/jenkins/workspace/lldb-cmake-matrix/llvm-project/lldb/test/API/functionalities/data-formatter/nsdictionarysynth/TestNSDictionarySynthetic.py", line 30, in test_rdar11988289_with_run_command
    self, "main.m", self.line, num_expected_locations=1, loc_exact=True)
  File "/Users/buildslave/jenkins/workspace/lldb-cmake-matrix/llvm-project/lldb/packages/Python/lldbsuite/test/lldbutil.py", line 438, in run_break_set_by_file_and_line
    module_name=module_name)
  File "/Users/buildslave/jenkins/workspace/lldb-cmake-matrix/llvm-project/lldb/packages/Python/lldbsuite/test/lldbutil.py", line 664, in check_breakpoint_result
    out_num_locations))
AssertionError: False is not True : Expecting 1 locations, got 0.
Config=x86_64-/Users/buildslave/jenkins/workspace/lldb-cmake-matrix/lldb-build/bin/clang
======================================================================
FAIL: test_rdar11988289_with_run_command_dwarf (TestNSDictionarySynthetic.NSDictionarySyntheticTestCase)
   Test that NSDictionary reports its synthetic children properly.
----------------------------------------------------------------------
Traceback (most recent call last):
  File "/Users/buildslave/jenkins/workspace/lldb-cmake-matrix/llvm-project/lldb/packages/Python/lldbsuite/test/lldbtest.py", line 1830, in test_method
    return attrvalue(self)
  File "/Users/buildslave/jenkins/workspace/lldb-cmake-matrix/llvm-project/lldb/test/API/functionalities/data-formatter/nsdictionarysynth/TestNSDictionarySynthetic.py", line 30, in test_rdar11988289_with_run_command
    self, "main.m", self.line, num_expected_locations=1, loc_exact=True)
  File "/Users/buildslave/jenkins/workspace/lldb-cmake-matrix/llvm-project/lldb/packages/Python/lldbsuite/test/lldbutil.py", line 438, in run_break_set_by_file_and_line
    module_name=module_name)
  File "/Users/buildslave/jenkins/workspace/lldb-cmake-matrix/llvm-project/lldb/packages/Python/lldbsuite/test/lldbutil.py", line 664, in check_breakpoint_result
    out_num_locations))
AssertionError: False is not True : Expecting 1 locations, got 0.
Config=x86_64-/Users/buildslave/jenkins/workspace/lldb-cmake-matrix/lldb-build/bin/clang
----------------------------------------------------------------------
Ran 4 tests in 3.710s

RESULT: FAILED (0 passes, 2 failures, 0 errors, 2 skipped, 0 expected failures, 0 unexpected successes)

--

********************
PASS: lldb-api :: tools/lldb-server/TestGdbRemoteAttachOrWait.py (2331 of 2339)
FAIL: lldb-api :: functionalities/data-formatter/poarray/TestPrintObjectArray.py (2332 of 2339)
******************** TEST 'lldb-api :: functionalities/data-formatter/poarray/TestPrintObjectArray.py' FAILED ********************
Script:
--
/usr/local/Frameworks/Python.framework/Versions/3.7/bin/python3.7 /Users/buildslave/jenkins/workspace/lldb-cmake-matrix/llvm-project/lldb/test/API/dotest.py -u CXXFLAGS -u CFLAGS --codesign-identity lldb_codesign --arch x86_64 --build-dir /Users/buildslave/jenkins/workspace/lldb-cmake-matrix/lldb-build/lldb-test-build.noindex -t --env TERM=vt100 --skip-category gmodules --skip-category watchpoint --arch=x86_64 --dwarf-version=5 --env LLVM_LIBS_DIR=/Users/buildslave/jenkins/workspace/lldb-cmake-matrix/lldb-build/./lib --arch x86_64 --build-dir /Users/buildslave/jenkins/workspace/lldb-cmake-matrix/lldb-build/lldb-test-build.noindex --lldb-module-cache-dir /Users/buildslave/jenkins/workspace/lldb-cmake-matrix/lldb-build/lldb-test-build.noindex/module-cache-lldb/lldb-api --clang-module-cache-dir /Users/buildslave/jenkins/workspace/lldb-cmake-matrix/lldb-build/lldb-test-build.noindex/module-cache-clang/lldb-api --executable /Users/buildslave/jenkins/workspace/lldb-cmake-matrix/lldb-build/./bin/lldb --compiler /Users/buildslave/jenkins/workspace/lldb-cmake-matrix/lldb-build/./bin/clang --dsymutil /Users/buildslave/jenkins/workspace/lldb-cmake-matrix/lldb-build/./bin/dsymutil --llvm-tools-dir /Users/buildslave/jenkins/workspace/lldb-cmake-matrix/lldb-build/./bin --lldb-libs-dir /Users/buildslave/jenkins/workspace/lldb-cmake-matrix/lldb-build/./lib /Users/buildslave/jenkins/workspace/lldb-cmake-matrix/llvm-project/lldb/test/API/functionalities/data-formatter/poarray -p TestPrintObjectArray.py
--
Exit Code: 1

Command Output (stdout):
--
lldb version 13.0.99 (http://labmaster3.local/git/llvm-project.git revision 80b2da42d28466341b9512599aac354c178c39f8)
  clang revision 80b2da42d28466341b9512599aac354c178c39f8
  llvm revision 80b2da42d28466341b9512599aac354c178c39f8
Skipping the following test categories: ['darwin-log', 'gmodules', 'watchpoint', 'libstdcxx', 'dwo', 'llgs', 'fork']

--
Command Output (stderr):
--
Change dir to: /Users/buildslave/jenkins/workspace/lldb-cmake-matrix/llvm-project/lldb/test/API/functionalities/data-formatter/poarray
runCmd: settings clear -all
output: 

runCmd: settings set symbols.enable-external-lookup false
output: 

runCmd: settings set target.inherit-tcc true
output: 

runCmd: settings set target.detach-on-error false
output: 

runCmd: settings set target.auto-apply-fixits false
output: 

runCmd: settings set plugin.process.gdb-remote.packet-timeout 60
output: 

runCmd: settings set symbols.clang-modules-cache-path "/Users/buildslave/jenkins/workspace/lldb-cmake-matrix/lldb-build/lldb-test-build.noindex/module-cache-lldb/lldb-api"
output: 

runCmd: settings set use-color false
output: 

runCmd: setting set target.prefer-dynamic-value no-dynamic-values
output: 

runCmd: file /Users/buildslave/jenkins/workspace/lldb-cmake-matrix/lldb-build/lldb-test-build.noindex/functionalities/data-formatter/poarray/TestPrintObjectArray.test_print_array_dsym/a.out
output: Current executable set to '/Users/buildslave/jenkins/workspace/lldb-cmake-matrix/lldb-build/lldb-test-build.noindex/functionalities/data-formatter/poarray/TestPrintObjectArray.test_print_array_dsym/a.out' (x86_64).


runCmd: breakpoint set -f "main.mm" -l 20
output: Breakpoint 1: no locations (pending).
WARNING:  Unable to resolve breakpoint to any actual locations.


Expecting pattern: ^Breakpoint (?P<bpno>[0-9]+): (?P<num_locations>[0-9]+) locations\.$
Not matched

Expecting pattern: ^Breakpoint (?P<bpno>[0-9]+): (?P<num_locations>no) locations \(pending\)\.
Matched

FAIL: LLDB (/Users/buildslave/jenkins/workspace/lldb-cmake-matrix/lldb-build/bin/clang-x86_64) :: test_print_array_dsym (TestPrintObjectArray.PrintObjectArrayTestCase)
runCmd: settings clear -all
output: 

runCmd: settings set symbols.enable-external-lookup false
output: 

runCmd: settings set target.inherit-tcc true
output: 

runCmd: settings set target.detach-on-error false
output: 

runCmd: settings set target.auto-apply-fixits false
output: 

runCmd: settings set plugin.process.gdb-remote.packet-timeout 60
output: 

runCmd: settings set symbols.clang-modules-cache-path "/Users/buildslave/jenkins/workspace/lldb-cmake-matrix/lldb-build/lldb-test-build.noindex/module-cache-lldb/lldb-api"
output: 

runCmd: settings set use-color false
output: 

runCmd: setting set target.prefer-dynamic-value no-dynamic-values
output: 

runCmd: file /Users/buildslave/jenkins/workspace/lldb-cmake-matrix/lldb-build/lldb-test-build.noindex/functionalities/data-formatter/poarray/TestPrintObjectArray.test_print_array_dwarf/a.out
output: Current executable set to '/Users/buildslave/jenkins/workspace/lldb-cmake-matrix/lldb-build/lldb-test-build.noindex/functionalities/data-formatter/poarray/TestPrintObjectArray.test_print_array_dwarf/a.out' (x86_64).


runCmd: breakpoint set -f "main.mm" -l 20
output: Breakpoint 1: no locations (pending).
WARNING:  Unable to resolve breakpoint to any actual locations.


Expecting pattern: ^Breakpoint (?P<bpno>[0-9]+): (?P<num_locations>[0-9]+) locations\.$
Not matched

Expecting pattern: ^Breakpoint (?P<bpno>[0-9]+): (?P<num_locations>no) locations \(pending\)\.
Matched

FAIL: LLDB (/Users/buildslave/jenkins/workspace/lldb-cmake-matrix/lldb-build/bin/clang-x86_64) :: test_print_array_dwarf (TestPrintObjectArray.PrintObjectArrayTestCase)
UNSUPPORTED: LLDB (/Users/buildslave/jenkins/workspace/lldb-cmake-matrix/lldb-build/bin/clang-x86_64) :: test_print_array_dwo (TestPrintObjectArray.PrintObjectArrayTestCase) (test case does not fall in any category of interest for this run) 
UNSUPPORTED: LLDB (/Users/buildslave/jenkins/workspace/lldb-cmake-matrix/lldb-build/bin/clang-x86_64) :: test_print_array_gmodules (TestPrintObjectArray.PrintObjectArrayTestCase) (test case does not fall in any category of interest for this run) 
Restore dir to: /Users/buildslave/jenkins/workspace/lldb-cmake-matrix/lldb-build/tools/lldb/test
======================================================================
FAIL: test_print_array_dsym (TestPrintObjectArray.PrintObjectArrayTestCase)
   Test that expr -O -Z works
----------------------------------------------------------------------
Traceback (most recent call last):
  File "/Users/buildslave/jenkins/workspace/lldb-cmake-matrix/llvm-project/lldb/packages/Python/lldbsuite/test/lldbtest.py", line 1830, in test_method
    return attrvalue(self)
  File "/Users/buildslave/jenkins/workspace/lldb-cmake-matrix/llvm-project/lldb/test/API/functionalities/data-formatter/poarray/TestPrintObjectArray.py", line 21, in test_print_array
    self.printarray_data_formatter_commands()
  File "/Users/buildslave/jenkins/workspace/lldb-cmake-matrix/llvm-project/lldb/test/API/functionalities/data-formatter/poarray/TestPrintObjectArray.py", line 34, in printarray_data_formatter_commands
    self, "main.mm", self.line, num_expected_locations=1, loc_exact=True)
  File "/Users/buildslave/jenkins/workspace/lldb-cmake-matrix/llvm-project/lldb/packages/Python/lldbsuite/test/lldbutil.py", line 438, in run_break_set_by_file_and_line
    module_name=module_name)
  File "/Users/buildslave/jenkins/workspace/lldb-cmake-matrix/llvm-project/lldb/packages/Python/lldbsuite/test/lldbutil.py", line 664, in check_breakpoint_result
    out_num_locations))
AssertionError: False is not True : Expecting 1 locations, got 0.
Config=x86_64-/Users/buildslave/jenkins/workspace/lldb-cmake-matrix/lldb-build/bin/clang
======================================================================
FAIL: test_print_array_dwarf (TestPrintObjectArray.PrintObjectArrayTestCase)
   Test that expr -O -Z works
----------------------------------------------------------------------
Traceback (most recent call last):
  File "/Users/buildslave/jenkins/workspace/lldb-cmake-matrix/llvm-project/lldb/packages/Python/lldbsuite/test/lldbtest.py", line 1830, in test_method
    return attrvalue(self)
  File "/Users/buildslave/jenkins/workspace/lldb-cmake-matrix/llvm-project/lldb/test/API/functionalities/data-formatter/poarray/TestPrintObjectArray.py", line 21, in test_print_array
    self.printarray_data_formatter_commands()
  File "/Users/buildslave/jenkins/workspace/lldb-cmake-matrix/llvm-project/lldb/test/API/functionalities/data-formatter/poarray/TestPrintObjectArray.py", line 34, in printarray_data_formatter_commands
    self, "main.mm", self.line, num_expected_locations=1, loc_exact=True)
  File "/Users/buildslave/jenkins/workspace/lldb-cmake-matrix/llvm-project/lldb/packages/Python/lldbsuite/test/lldbutil.py", line 438, in run_break_set_by_file_and_line
    module_name=module_name)
  File "/Users/buildslave/jenkins/workspace/lldb-cmake-matrix/llvm-project/lldb/packages/Python/lldbsuite/test/lldbutil.py", line 664, in check_breakpoint_result
    out_num_locations))
AssertionError: False is not True : Expecting 1 locations, got 0.
Config=x86_64-/Users/buildslave/jenkins/workspace/lldb-cmake-matrix/lldb-build/bin/clang
----------------------------------------------------------------------
Ran 4 tests in 4.128s

RESULT: FAILED (0 passes, 2 failures, 0 errors, 2 skipped, 0 expected failures, 0 unexpected successes)

--

********************
FAIL: lldb-api :: lang/objc/objc-new-syntax/TestObjCNewSyntaxDictionary.py (2333 of 2339)
******************** TEST 'lldb-api :: lang/objc/objc-new-syntax/TestObjCNewSyntaxDictionary.py' FAILED ********************
Script:
--
/usr/local/Frameworks/Python.framework/Versions/3.7/bin/python3.7 /Users/buildslave/jenkins/workspace/lldb-cmake-matrix/llvm-project/lldb/test/API/dotest.py -u CXXFLAGS -u CFLAGS --codesign-identity lldb_codesign --arch x86_64 --build-dir /Users/buildslave/jenkins/workspace/lldb-cmake-matrix/lldb-build/lldb-test-build.noindex -t --env TERM=vt100 --skip-category gmodules --skip-category watchpoint --arch=x86_64 --dwarf-version=5 --env LLVM_LIBS_DIR=/Users/buildslave/jenkins/workspace/lldb-cmake-matrix/lldb-build/./lib --arch x86_64 --build-dir /Users/buildslave/jenkins/workspace/lldb-cmake-matrix/lldb-build/lldb-test-build.noindex --lldb-module-cache-dir /Users/buildslave/jenkins/workspace/lldb-cmake-matrix/lldb-build/lldb-test-build.noindex/module-cache-lldb/lldb-api --clang-module-cache-dir /Users/buildslave/jenkins/workspace/lldb-cmake-matrix/lldb-build/lldb-test-build.noindex/module-cache-clang/lldb-api --executable /Users/buildslave/jenkins/workspace/lldb-cmake-matrix/lldb-build/./bin/lldb --compiler /Users/buildslave/jenkins/workspace/lldb-cmake-matrix/lldb-build/./bin/clang --dsymutil /Users/buildslave/jenkins/workspace/lldb-cmake-matrix/lldb-build/./bin/dsymutil --llvm-tools-dir /Users/buildslave/jenkins/workspace/lldb-cmake-matrix/lldb-build/./bin --lldb-libs-dir /Users/buildslave/jenkins/workspace/lldb-cmake-matrix/lldb-build/./lib /Users/buildslave/jenkins/workspace/lldb-cmake-matrix/llvm-project/lldb/test/API/lang/objc/objc-new-syntax -p TestObjCNewSyntaxDictionary.py
--
Exit Code: 1

Command Output (stdout):
--
lldb version 13.0.99 (http://labmaster3.local/git/llvm-project.git revision 80b2da42d28466341b9512599aac354c178c39f8)
  clang revision 80b2da42d28466341b9512599aac354c178c39f8
  llvm revision 80b2da42d28466341b9512599aac354c178c39f8
Skipping the following test categories: ['darwin-log', 'gmodules', 'watchpoint', 'libstdcxx', 'dwo', 'llgs', 'fork']

--
Command Output (stderr):
--
Change dir to: /Users/buildslave/jenkins/workspace/lldb-cmake-matrix/llvm-project/lldb/test/API/lang/objc/objc-new-syntax
runCmd: settings clear -all
output: 

runCmd: settings set symbols.enable-external-lookup false
output: 

runCmd: settings set target.inherit-tcc true
output: 

runCmd: settings set target.detach-on-error false
output: 

runCmd: settings set target.auto-apply-fixits false
output: 

runCmd: settings set plugin.process.gdb-remote.packet-timeout 60
output: 

runCmd: settings set symbols.clang-modules-cache-path "/Users/buildslave/jenkins/workspace/lldb-cmake-matrix/lldb-build/lldb-test-build.noindex/module-cache-lldb/lldb-api"
output: 

runCmd: settings set use-color false
output: 

runCmd: setting set target.prefer-dynamic-value no-dynamic-values
output: 

FAIL: LLDB (/Users/buildslave/jenkins/workspace/lldb-cmake-matrix/lldb-build/bin/clang-x86_64) :: test_dictionary_literal_dsym (TestObjCNewSyntaxDictionary.ObjCNewSyntaxTestCaseDictionary)
runCmd: settings clear -all
output: 

runCmd: settings set symbols.enable-external-lookup false
output: 

runCmd: settings set target.inherit-tcc true
output: 

runCmd: settings set target.detach-on-error false
output: 

runCmd: settings set target.auto-apply-fixits false
output: 

runCmd: settings set plugin.process.gdb-remote.packet-timeout 60
output: 

runCmd: settings set symbols.clang-modules-cache-path "/Users/buildslave/jenkins/workspace/lldb-cmake-matrix/lldb-build/lldb-test-build.noindex/module-cache-lldb/lldb-api"
output: 

runCmd: settings set use-color false
output: 

runCmd: setting set target.prefer-dynamic-value no-dynamic-values
output: 

FAIL: LLDB (/Users/buildslave/jenkins/workspace/lldb-cmake-matrix/lldb-build/bin/clang-x86_64) :: test_dictionary_literal_dwarf (TestObjCNewSyntaxDictionary.ObjCNewSyntaxTestCaseDictionary)
UNSUPPORTED: LLDB (/Users/buildslave/jenkins/workspace/lldb-cmake-matrix/lldb-build/bin/clang-x86_64) :: test_dictionary_literal_dwo (TestObjCNewSyntaxDictionary.ObjCNewSyntaxTestCaseDictionary) (test case does not fall in any category of interest for this run) 
UNSUPPORTED: LLDB (/Users/buildslave/jenkins/workspace/lldb-cmake-matrix/lldb-build/bin/clang-x86_64) :: test_dictionary_literal_gmodules (TestObjCNewSyntaxDictionary.ObjCNewSyntaxTestCaseDictionary) (test case does not fall in any category of interest for this run) 
runCmd: settings clear -all
output: 

runCmd: settings set symbols.enable-external-lookup false
output: 

runCmd: settings set target.inherit-tcc true
output: 

runCmd: settings set target.detach-on-error false
output: 

runCmd: settings set target.auto-apply-fixits false
output: 

runCmd: settings set plugin.process.gdb-remote.packet-timeout 60
output: 

runCmd: settings set symbols.clang-modules-cache-path "/Users/buildslave/jenkins/workspace/lldb-cmake-matrix/lldb-build/lldb-test-build.noindex/module-cache-lldb/lldb-api"
output: 

runCmd: settings set use-color false
output: 

runCmd: setting set target.prefer-dynamic-value no-dynamic-values
output: 

FAIL: LLDB (/Users/buildslave/jenkins/workspace/lldb-cmake-matrix/lldb-build/bin/clang-x86_64) :: test_read_dictionary_dsym (TestObjCNewSyntaxDictionary.ObjCNewSyntaxTestCaseDictionary)
runCmd: settings clear -all
output: 

runCmd: settings set symbols.enable-external-lookup false
output: 

runCmd: settings set target.inherit-tcc true
output: 

runCmd: settings set target.detach-on-error false
output: 

runCmd: settings set target.auto-apply-fixits false
output: 

runCmd: settings set plugin.process.gdb-remote.packet-timeout 60
output: 

runCmd: settings set symbols.clang-modules-cache-path "/Users/buildslave/jenkins/workspace/lldb-cmake-matrix/lldb-build/lldb-test-build.noindex/module-cache-lldb/lldb-api"
output: 

runCmd: settings set use-color false
output: 

runCmd: setting set target.prefer-dynamic-value no-dynamic-values
output: 

FAIL: LLDB (/Users/buildslave/jenkins/workspace/lldb-cmake-matrix/lldb-build/bin/clang-x86_64) :: test_read_dictionary_dwarf (TestObjCNewSyntaxDictionary.ObjCNewSyntaxTestCaseDictionary)
UNSUPPORTED: LLDB (/Users/buildslave/jenkins/workspace/lldb-cmake-matrix/lldb-build/bin/clang-x86_64) :: test_read_dictionary_dwo (TestObjCNewSyntaxDictionary.ObjCNewSyntaxTestCaseDictionary) (test case does not fall in any category of interest for this run) 
UNSUPPORTED: LLDB (/Users/buildslave/jenkins/workspace/lldb-cmake-matrix/lldb-build/bin/clang-x86_64) :: test_read_dictionary_gmodules (TestObjCNewSyntaxDictionary.ObjCNewSyntaxTestCaseDictionary) (test case does not fall in any category of interest for this run) 
runCmd: settings clear -all
output: 

runCmd: settings set symbols.enable-external-lookup false
output: 

runCmd: settings set target.inherit-tcc true
output: 

runCmd: settings set target.detach-on-error false
output: 

runCmd: settings set target.auto-apply-fixits false
output: 

runCmd: settings set plugin.process.gdb-remote.packet-timeout 60
output: 

runCmd: settings set symbols.clang-modules-cache-path "/Users/buildslave/jenkins/workspace/lldb-cmake-matrix/lldb-build/lldb-test-build.noindex/module-cache-lldb/lldb-api"
output: 

runCmd: settings set use-color false
output: 

runCmd: setting set target.prefer-dynamic-value no-dynamic-values
output: 

FAIL: LLDB (/Users/buildslave/jenkins/workspace/lldb-cmake-matrix/lldb-build/bin/clang-x86_64) :: test_update_dictionary_dsym (TestObjCNewSyntaxDictionary.ObjCNewSyntaxTestCaseDictionary)
runCmd: settings clear -all
output: 

runCmd: settings set symbols.enable-external-lookup false
output: 

runCmd: settings set target.inherit-tcc true
output: 

runCmd: settings set target.detach-on-error false
output: 

runCmd: settings set target.auto-apply-fixits false
output: 

runCmd: settings set plugin.process.gdb-remote.packet-timeout 60
output: 

runCmd: settings set symbols.clang-modules-cache-path "/Users/buildslave/jenkins/workspace/lldb-cmake-matrix/lldb-build/lldb-test-build.noindex/module-cache-lldb/lldb-api"
output: 

runCmd: settings set use-color false
output: 

runCmd: setting set target.prefer-dynamic-value no-dynamic-values
output: 

FAIL: LLDB (/Users/buildslave/jenkins/workspace/lldb-cmake-matrix/lldb-build/bin/clang-x86_64) :: test_update_dictionary_dwarf (TestObjCNewSyntaxDictionary.ObjCNewSyntaxTestCaseDictionary)
UNSUPPORTED: LLDB (/Users/buildslave/jenkins/workspace/lldb-cmake-matrix/lldb-build/bin/clang-x86_64) :: test_update_dictionary_dwo (TestObjCNewSyntaxDictionary.ObjCNewSyntaxTestCaseDictionary) (test case does not fall in any category of interest for this run) 
UNSUPPORTED: LLDB (/Users/buildslave/jenkins/workspace/lldb-cmake-matrix/lldb-build/bin/clang-x86_64) :: test_update_dictionary_gmodules (TestObjCNewSyntaxDictionary.ObjCNewSyntaxTestCaseDictionary) (test case does not fall in any category of interest for this run) 
Restore dir to: /Users/buildslave/jenkins/workspace/lldb-cmake-matrix/lldb-build/tools/lldb/test
======================================================================
FAIL: test_dictionary_literal_dsym (TestObjCNewSyntaxDictionary.ObjCNewSyntaxTestCaseDictionary)
----------------------------------------------------------------------
Traceback (most recent call last):
  File "/Users/buildslave/jenkins/workspace/lldb-cmake-matrix/llvm-project/lldb/packages/Python/lldbsuite/test/lldbtest.py", line 1830, in test_method
    return attrvalue(self)
  File "/Users/buildslave/jenkins/workspace/lldb-cmake-matrix/llvm-project/lldb/packages/Python/lldbsuite/test/decorators.py", line 149, in wrapper
    return func(*args, **kwargs)
  File "/Users/buildslave/jenkins/workspace/lldb-cmake-matrix/llvm-project/lldb/packages/Python/lldbsuite/test/decorators.py", line 119, in wrapper
    func(*args, **kwargs)
  File "/Users/buildslave/jenkins/workspace/lldb-cmake-matrix/llvm-project/lldb/test/API/lang/objc/objc-new-syntax/TestObjCNewSyntaxDictionary.py", line 47, in test_dictionary_literal
    self.runToBreakpoint()
  File "/Users/buildslave/jenkins/workspace/lldb-cmake-matrix/llvm-project/lldb/test/API/lang/objc/objc-new-syntax/ObjCNewSyntaxTest.py", line 17, in runToBreakpoint
    'main.m', False))
  File "/Users/buildslave/jenkins/workspace/lldb-cmake-matrix/llvm-project/lldb/packages/Python/lldbsuite/test/lldbutil.py", line 969, in run_to_source_breakpoint
    %(bkpt_pattern, source_spec.GetFilename(), source_spec.GetDirectory()))
AssertionError: False is not True : No locations found for source breakpoint: "// Set breakpoint 0 here.", file: "main.m", dir: "None"
Config=x86_64-/Users/buildslave/jenkins/workspace/lldb-cmake-matrix/lldb-build/bin/clang
======================================================================
FAIL: test_dictionary_literal_dwarf (TestObjCNewSyntaxDictionary.ObjCNewSyntaxTestCaseDictionary)
----------------------------------------------------------------------
Traceback (most recent call last):
  File "/Users/buildslave/jenkins/workspace/lldb-cmake-matrix/llvm-project/lldb/packages/Python/lldbsuite/test/lldbtest.py", line 1830, in test_method
    return attrvalue(self)
  File "/Users/buildslave/jenkins/workspace/lldb-cmake-matrix/llvm-project/lldb/packages/Python/lldbsuite/test/decorators.py", line 149, in wrapper
    return func(*args, **kwargs)
  File "/Users/buildslave/jenkins/workspace/lldb-cmake-matrix/llvm-project/lldb/packages/Python/lldbsuite/test/decorators.py", line 119, in wrapper
    func(*args, **kwargs)
  File "/Users/buildslave/jenkins/workspace/lldb-cmake-matrix/llvm-project/lldb/test/API/lang/objc/objc-new-syntax/TestObjCNewSyntaxDictionary.py", line 47, in test_dictionary_literal
    self.runToBreakpoint()
  File "/Users/buildslave/jenkins/workspace/lldb-cmake-matrix/llvm-project/lldb/test/API/lang/objc/objc-new-syntax/ObjCNewSyntaxTest.py", line 17, in runToBreakpoint
    'main.m', False))
  File "/Users/buildslave/jenkins/workspace/lldb-cmake-matrix/llvm-project/lldb/packages/Python/lldbsuite/test/lldbutil.py", line 969, in run_to_source_breakpoint
    %(bkpt_pattern, source_spec.GetFilename(), source_spec.GetDirectory()))
AssertionError: False is not True : No locations found for source breakpoint: "// Set breakpoint 0 here.", file: "main.m", dir: "None"
Config=x86_64-/Users/buildslave/jenkins/workspace/lldb-cmake-matrix/lldb-build/bin/clang
======================================================================
FAIL: test_read_dictionary_dsym (TestObjCNewSyntaxDictionary.ObjCNewSyntaxTestCaseDictionary)
----------------------------------------------------------------------
Traceback (most recent call last):
  File "/Users/buildslave/jenkins/workspace/lldb-cmake-matrix/llvm-project/lldb/packages/Python/lldbsuite/test/lldbtest.py", line 1830, in test_method
    return attrvalue(self)
  File "/Users/buildslave/jenkins/workspace/lldb-cmake-matrix/llvm-project/lldb/packages/Python/lldbsuite/test/decorators.py", line 149, in wrapper
    return func(*args, **kwargs)
  File "/Users/buildslave/jenkins/workspace/lldb-cmake-matrix/llvm-project/lldb/packages/Python/lldbsuite/test/decorators.py", line 119, in wrapper
    func(*args, **kwargs)
  File "/Users/buildslave/jenkins/workspace/lldb-cmake-matrix/llvm-project/lldb/test/API/lang/objc/objc-new-syntax/TestObjCNewSyntaxDictionary.py", line 17, in test_read_dictionary
    self.runToBreakpoint()
  File "/Users/buildslave/jenkins/workspace/lldb-cmake-matrix/llvm-project/lldb/test/API/lang/objc/objc-new-syntax/ObjCNewSyntaxTest.py", line 17, in runToBreakpoint
    'main.m', False))
  File "/Users/buildslave/jenkins/workspace/lldb-cmake-matrix/llvm-project/lldb/packages/Python/lldbsuite/test/lldbutil.py", line 969, in run_to_source_breakpoint
    %(bkpt_pattern, source_spec.GetFilename(), source_spec.GetDirectory()))
AssertionError: False is not True : No locations found for source breakpoint: "// Set breakpoint 0 here.", file: "main.m", dir: "None"
Config=x86_64-/Users/buildslave/jenkins/workspace/lldb-cmake-matrix/lldb-build/bin/clang
======================================================================
FAIL: test_read_dictionary_dwarf (TestObjCNewSyntaxDictionary.ObjCNewSyntaxTestCaseDictionary)
----------------------------------------------------------------------
Traceback (most recent call last):
  File "/Users/buildslave/jenkins/workspace/lldb-cmake-matrix/llvm-project/lldb/packages/Python/lldbsuite/test/lldbtest.py", line 1830, in test_method
    return attrvalue(self)
  File "/Users/buildslave/jenkins/workspace/lldb-cmake-matrix/llvm-project/lldb/packages/Python/lldbsuite/test/decorators.py", line 149, in wrapper
    return func(*args, **kwargs)
  File "/Users/buildslave/jenkins/workspace/lldb-cmake-matrix/llvm-project/lldb/packages/Python/lldbsuite/test/decorators.py", line 119, in wrapper
    func(*args, **kwargs)
  File "/Users/buildslave/jenkins/workspace/lldb-cmake-matrix/llvm-project/lldb/test/API/lang/objc/objc-new-syntax/TestObjCNewSyntaxDictionary.py", line 17, in test_read_dictionary
    self.runToBreakpoint()
  File "/Users/buildslave/jenkins/workspace/lldb-cmake-matrix/llvm-project/lldb/test/API/lang/objc/objc-new-syntax/ObjCNewSyntaxTest.py", line 17, in runToBreakpoint
    'main.m', False))
  File "/Users/buildslave/jenkins/workspace/lldb-cmake-matrix/llvm-project/lldb/packages/Python/lldbsuite/test/lldbutil.py", line 969, in run_to_source_breakpoint
    %(bkpt_pattern, source_spec.GetFilename(), source_spec.GetDirectory()))
AssertionError: False is not True : No locations found for source breakpoint: "// Set breakpoint 0 here.", file: "main.m", dir: "None"
Config=x86_64-/Users/buildslave/jenkins/workspace/lldb-cmake-matrix/lldb-build/bin/clang
======================================================================
FAIL: test_update_dictionary_dsym (TestObjCNewSyntaxDictionary.ObjCNewSyntaxTestCaseDictionary)
----------------------------------------------------------------------
Traceback (most recent call last):
  File "/Users/buildslave/jenkins/workspace/lldb-cmake-matrix/llvm-project/lldb/packages/Python/lldbsuite/test/lldbtest.py", line 1830, in test_method
    return attrvalue(self)
  File "/Users/buildslave/jenkins/workspace/lldb-cmake-matrix/llvm-project/lldb/packages/Python/lldbsuite/test/decorators.py", line 149, in wrapper
    return func(*args, **kwargs)
  File "/Users/buildslave/jenkins/workspace/lldb-cmake-matrix/llvm-project/lldb/packages/Python/lldbsuite/test/decorators.py", line 119, in wrapper
    func(*args, **kwargs)
  File "/Users/buildslave/jenkins/workspace/lldb-cmake-matrix/llvm-project/lldb/test/API/lang/objc/objc-new-syntax/TestObjCNewSyntaxDictionary.py", line 32, in test_update_dictionary
    self.runToBreakpoint()
  File "/Users/buildslave/jenkins/workspace/lldb-cmake-matrix/llvm-project/lldb/test/API/lang/objc/objc-new-syntax/ObjCNewSyntaxTest.py", line 17, in runToBreakpoint
    'main.m', False))
  File "/Users/buildslave/jenkins/workspace/lldb-cmake-matrix/llvm-project/lldb/packages/Python/lldbsuite/test/lldbutil.py", line 969, in run_to_source_breakpoint
    %(bkpt_pattern, source_spec.GetFilename(), source_spec.GetDirectory()))
AssertionError: False is not True : No locations found for source breakpoint: "// Set breakpoint 0 here.", file: "main.m", dir: "None"
Config=x86_64-/Users/buildslave/jenkins/workspace/lldb-cmake-matrix/lldb-build/bin/clang
======================================================================
FAIL: test_update_dictionary_dwarf (TestObjCNewSyntaxDictionary.ObjCNewSyntaxTestCaseDictionary)
----------------------------------------------------------------------
Traceback (most recent call last):
  File "/Users/buildslave/jenkins/workspace/lldb-cmake-matrix/llvm-project/lldb/packages/Python/lldbsuite/test/lldbtest.py", line 1830, in test_method
    return attrvalue(self)
  File "/Users/buildslave/jenkins/workspace/lldb-cmake-matrix/llvm-project/lldb/packages/Python/lldbsuite/test/decorators.py", line 149, in wrapper
    return func(*args, **kwargs)
  File "/Users/buildslave/jenkins/workspace/lldb-cmake-matrix/llvm-project/lldb/packages/Python/lldbsuite/test/decorators.py", line 119, in wrapper
    func(*args, **kwargs)
  File "/Users/buildslave/jenkins/workspace/lldb-cmake-matrix/llvm-project/lldb/test/API/lang/objc/objc-new-syntax/TestObjCNewSyntaxDictionary.py", line 32, in test_update_dictionary
    self.runToBreakpoint()
  File "/Users/buildslave/jenkins/workspace/lldb-cmake-matrix/llvm-project/lldb/test/API/lang/objc/objc-new-syntax/ObjCNewSyntaxTest.py", line 17, in runToBreakpoint
    'main.m', False))
  File "/Users/buildslave/jenkins/workspace/lldb-cmake-matrix/llvm-project/lldb/packages/Python/lldbsuite/test/lldbutil.py", line 969, in run_to_source_breakpoint
    %(bkpt_pattern, source_spec.GetFilename(), source_spec.GetDirectory()))
AssertionError: False is not True : No locations found for source breakpoint: "// Set breakpoint 0 here.", file: "main.m", dir: "None"
Config=x86_64-/Users/buildslave/jenkins/workspace/lldb-cmake-matrix/lldb-build/bin/clang
----------------------------------------------------------------------
Ran 12 tests in 10.017s

RESULT: FAILED (0 passes, 6 failures, 0 errors, 6 skipped, 0 expected failures, 0 unexpected successes)

--

********************
FAIL: lldb-api :: commands/gui/breakpoints/TestGuiBreakpoints.py (2334 of 2339)
******************** TEST 'lldb-api :: commands/gui/breakpoints/TestGuiBreakpoints.py' FAILED ********************
Script:
--
/usr/local/Frameworks/Python.framework/Versions/3.7/bin/python3.7 /Users/buildslave/jenkins/workspace/lldb-cmake-matrix/llvm-project/lldb/test/API/dotest.py -u CXXFLAGS -u CFLAGS --codesign-identity lldb_codesign --arch x86_64 --build-dir /Users/buildslave/jenkins/workspace/lldb-cmake-matrix/lldb-build/lldb-test-build.noindex -t --env TERM=vt100 --skip-category gmodules --skip-category watchpoint --arch=x86_64 --dwarf-version=5 --env LLVM_LIBS_DIR=/Users/buildslave/jenkins/workspace/lldb-cmake-matrix/lldb-build/./lib --arch x86_64 --build-dir /Users/buildslave/jenkins/workspace/lldb-cmake-matrix/lldb-build/lldb-test-build.noindex --lldb-module-cache-dir /Users/buildslave/jenkins/workspace/lldb-cmake-matrix/lldb-build/lldb-test-build.noindex/module-cache-lldb/lldb-api --clang-module-cache-dir /Users/buildslave/jenkins/workspace/lldb-cmake-matrix/lldb-build/lldb-test-build.noindex/module-cache-clang/lldb-api --executable /Users/buildslave/jenkins/workspace/lldb-cmake-matrix/lldb-build/./bin/lldb --compiler /Users/buildslave/jenkins/workspace/lldb-cmake-matrix/lldb-build/./bin/clang --dsymutil /Users/buildslave/jenkins/workspace/lldb-cmake-matrix/lldb-build/./bin/dsymutil --llvm-tools-dir /Users/buildslave/jenkins/workspace/lldb-cmake-matrix/lldb-build/./bin --lldb-libs-dir /Users/buildslave/jenkins/workspace/lldb-cmake-matrix/lldb-build/./lib /Users/buildslave/jenkins/workspace/lldb-cmake-matrix/llvm-project/lldb/test/API/commands/gui/breakpoints -p TestGuiBreakpoints.py
--
Exit Code: 1

Command Output (stdout):
--
lldb version 13.0.99 (http://labmaster3.local/git/llvm-project.git revision 80b2da42d28466341b9512599aac354c178c39f8)
  clang revision 80b2da42d28466341b9512599aac354c178c39f8
  llvm revision 80b2da42d28466341b9512599aac354c178c39f8
(lldb) settings clear -all
(lldb) settings set symbols.enable-external-lookup false
(lldb) settings set target.inherit-tcc true
(lldb) settings set target.detach-on-error false
(lldb) settings set target.auto-apply-fixits false
(lldb) settings set plugin.process.gdb-remote.packet-timeout 60
(lldb) settings set symbols.clang-modules-cache-path "/Users/buildslave/jenkins/workspace/lldb-cmake-matrix/lldb-build/lldb-test-build.noindex/module-cache-lldb/lldb-api"
(lldb) settings set use-color false
(lldb) setting set target.prefer-dynamic-value no-dynamic-values
(lldb) target create "/Users/buildslave/jenkins/workspace/lldb-cmake-matrix/lldb-build/lldb-test-build.noindex/commands/gui/breakpoints/TestGuiBreakpoints.test_gui/a.out"
Current executable set to '/Users/buildslave/jenkins/workspace/lldb-cmake-matrix/lldb-build/lldb-test-build.noindex/commands/gui/breakpoints/TestGuiBreakpoints.test_gui/a.out' (x86_64).
(lldb) br set -o true -f main.c -p "// First break here"
br set -o true -f main.c -p "// First break here"
Breakpoint 1: no locations (pending).
WARNING:  Unable to resolve breakpoint to any actual locations.
(lldb) settings set interpreter.prompt-on-quit false
quit
settings set interpreter.prompt-on-quit false
(lldb) quit
Skipping the following test categories: ['darwin-log', 'gmodules', 'watchpoint', 'libstdcxx', 'dwo', 'llgs', 'fork']

--
Command Output (stderr):
--
Change dir to: /Users/buildslave/jenkins/workspace/lldb-cmake-matrix/llvm-project/lldb/test/API/commands/gui/breakpoints
runCmd: settings clear -all
output: 

runCmd: settings set symbols.enable-external-lookup false
output: 

runCmd: settings set target.inherit-tcc true
output: 

runCmd: settings set target.detach-on-error false
output: 

runCmd: settings set target.auto-apply-fixits false
output: 

runCmd: settings set plugin.process.gdb-remote.packet-timeout 60
output: 

runCmd: settings set symbols.clang-modules-cache-path "/Users/buildslave/jenkins/workspace/lldb-cmake-matrix/lldb-build/lldb-test-build.noindex/module-cache-lldb/lldb-api"
output: 

runCmd: settings set use-color false
output: 

runCmd: setting set target.prefer-dynamic-value no-dynamic-values
output: 

FAIL: LLDB (/Users/buildslave/jenkins/workspace/lldb-cmake-matrix/lldb-build/bin/clang-x86_64) :: test_gui (TestGuiBreakpoints.TestGuiBasicDebugCommandTest)
tearing down the child process....

Restore dir to: /Users/buildslave/jenkins/workspace/lldb-cmake-matrix/lldb-build/tools/lldb/test
======================================================================
ERROR: test_gui (TestGuiBreakpoints.TestGuiBasicDebugCommandTest)
----------------------------------------------------------------------
Traceback (most recent call last):
  File "/Users/buildslave/jenkins/workspace/lldb-cmake-matrix/llvm-project/lldb/third_party/Python/module/pexpect-4.6/pexpect/expect.py", line 111, in expect_loop
    incoming = spawn.read_nonblocking(spawn.maxread, timeout)
  File "/Users/buildslave/jenkins/workspace/lldb-cmake-matrix/llvm-project/lldb/third_party/Python/module/pexpect-4.6/pexpect/pty_spawn.py", line 482, in read_nonblocking
    raise TIMEOUT('Timeout exceeded.')
pexpect.exceptions.TIMEOUT: Timeout exceeded.

During handling of the above exception, another exception occurred:

Traceback (most recent call last):
  File "/Users/buildslave/jenkins/workspace/lldb-cmake-matrix/llvm-project/lldb/packages/Python/lldbsuite/test/decorators.py", line 149, in wrapper
    return func(*args, **kwargs)
  File "/Users/buildslave/jenkins/workspace/lldb-cmake-matrix/llvm-project/lldb/test/API/commands/gui/breakpoints/TestGuiBreakpoints.py", line 22, in test_gui
    self.expect('br set -o true -f main.c -p "// First break here"', substrs=["Breakpoint 1", "address ="])
  File "/Users/buildslave/jenkins/workspace/lldb-cmake-matrix/llvm-project/lldb/packages/Python/lldbsuite/test/lldbpexpect.py", line 64, in expect
    self.child.expect_exact(s)
  File "/Users/buildslave/jenkins/workspace/lldb-cmake-matrix/llvm-project/lldb/third_party/Python/module/pexpect-4.6/pexpect/spawnbase.py", line 418, in expect_exact
    return exp.expect_loop(timeout)
  File "/Users/buildslave/jenkins/workspace/lldb-cmake-matrix/llvm-project/lldb/third_party/Python/module/pexpect-4.6/pexpect/expect.py", line 119, in expect_loop
    return self.timeout(e)
  File "/Users/buildslave/jenkins/workspace/lldb-cmake-matrix/llvm-project/lldb/third_party/Python/module/pexpect-4.6/pexpect/expect.py", line 82, in timeout
    raise TIMEOUT(msg)
pexpect.exceptions.TIMEOUT: Timeout exceeded.
<pexpect.pty_spawn.spawn object at 0x11111f2b0>
command: /Users/buildslave/jenkins/workspace/lldb-cmake-matrix/lldb-build/bin/lldb
args: ['/Users/buildslave/jenkins/workspace/lldb-cmake-matrix/lldb-build/bin/lldb', '--no-lldbinit', '--no-use-colors', '-O', 'settings clear -all', '-O', 'settings set symbols.enable-external-lookup false', '-O', 'settings set target.inherit-tcc true', '-O', 'settings set target.detach-on-error false', '-O', 'settings set target.auto-apply-fixits false', '-O', 'settings set plugin.process.gdb-remote.packet-timeout 60', '-O', 'settings set symbols.clang-modules-cache-path "/Users/buildslave/jenkins/workspace/lldb-cmake-matrix/lldb-build/lldb-test-build.noindex/module-cache-lldb/lldb-api"', '-O', 'settings set use-color false', '-O', 'setting set target.prefer-dynamic-value no-dynamic-values', '--file', '/Users/buildslave/jenkins/workspace/lldb-cmake-matrix/lldb-build/lldb-test-build.noindex/commands/gui/breakpoints/TestGuiBreakpoints.test_gui/a.out']
buffer (last 100 chars): b': no locations (pending).\r\nWARNING:  Unable to resolve breakpoint to any actual locations.\r\n(lldb) '
before (last 100 chars): b': no locations (pending).\r\nWARNING:  Unable to resolve breakpoint to any actual locations.\r\n(lldb) '
after: <class 'pexpect.exceptions.TIMEOUT'>
match: None
match_index: None
exitstatus: None
flag_eof: False
pid: 11774
child_fd: 6
closed: False
timeout: 30
delimiter: <class 'pexpect.exceptions.EOF'>
logfile: <_io.BufferedWriter name='<stdout>'>
logfile_read: None
logfile_send: None
maxread: 2000
ignorecase: False
searchwindowsize: None
delaybeforesend: 0.05
delayafterclose: 0.1
delayafterterminate: 0.1
searcher: searcher_string:
    0: b'address ='
Config=x86_64-/Users/buildslave/jenkins/workspace/lldb-cmake-matrix/lldb-build/bin/clang
----------------------------------------------------------------------
Ran 1 test in 30.781s

RESULT: FAILED (0 passes, 0 failures, 1 errors, 0 skipped, 0 expected failures, 0 unexpected successes)

--

********************
UNSUPPORTED: lldb-api :: tools/lldb-server/vCont-threads/TestGdbRemote_vContThreads.py (2335 of 2339)
PASS: lldb-api :: api/multithreaded/TestMultithreaded.py (2336 of 2339)
TIMEOUT: lldb-api :: commands/expression/persistent_ptr_update/TestPersistentPtrUpdate.py (2337 of 2339)
******************** TEST 'lldb-api :: commands/expression/persistent_ptr_update/TestPersistentPtrUpdate.py' FAILED ********************
Script:
--
/usr/local/Frameworks/Python.framework/Versions/3.7/bin/python3.7 /Users/buildslave/jenkins/workspace/lldb-cmake-matrix/llvm-project/lldb/test/API/dotest.py -u CXXFLAGS -u CFLAGS --codesign-identity lldb_codesign --arch x86_64 --build-dir /Users/buildslave/jenkins/workspace/lldb-cmake-matrix/lldb-build/lldb-test-build.noindex -t --env TERM=vt100 --skip-category gmodules --skip-category watchpoint --arch=x86_64 --dwarf-version=5 --env LLVM_LIBS_DIR=/Users/buildslave/jenkins/workspace/lldb-cmake-matrix/lldb-build/./lib --arch x86_64 --build-dir /Users/buildslave/jenkins/workspace/lldb-cmake-matrix/lldb-build/lldb-test-build.noindex --lldb-module-cache-dir /Users/buildslave/jenkins/workspace/lldb-cmake-matrix/lldb-build/lldb-test-build.noindex/module-cache-lldb/lldb-api --clang-module-cache-dir /Users/buildslave/jenkins/workspace/lldb-cmake-matrix/lldb-build/lldb-test-build.noindex/module-cache-clang/lldb-api --executable /Users/buildslave/jenkins/workspace/lldb-cmake-matrix/lldb-build/./bin/lldb --compiler /Users/buildslave/jenkins/workspace/lldb-cmake-matrix/lldb-build/./bin/clang --dsymutil /Users/buildslave/jenkins/workspace/lldb-cmake-matrix/lldb-build/./bin/dsymutil --llvm-tools-dir /Users/buildslave/jenkins/workspace/lldb-cmake-matrix/lldb-build/./bin --lldb-libs-dir /Users/buildslave/jenkins/workspace/lldb-cmake-matrix/lldb-build/./lib /Users/buildslave/jenkins/workspace/lldb-cmake-matrix/llvm-project/lldb/test/API/commands/expression/persistent_ptr_update -p TestPersistentPtrUpdate.py
--
Exit Code: -9
Timeout: Reached timeout of 600 seconds

Command Output (stdout):
--
lldb version 13.0.99 (http://labmaster3.local/git/llvm-project.git revision 80b2da42d28466341b9512599aac354c178c39f8)
  clang revision 80b2da42d28466341b9512599aac354c178c39f8
  llvm revision 80b2da42d28466341b9512599aac354c178c39f8

--

********************
TIMEOUT: lldb-api :: python_api/lldbutil/iter/TestLLDBIterator.py (2338 of 2339)
******************** TEST 'lldb-api :: python_api/lldbutil/iter/TestLLDBIterator.py' FAILED ********************
Script:
--
/usr/local/Frameworks/Python.framework/Versions/3.7/bin/python3.7 /Users/buildslave/jenkins/workspace/lldb-cmake-matrix/llvm-project/lldb/test/API/dotest.py -u CXXFLAGS -u CFLAGS --codesign-identity lldb_codesign --arch x86_64 --build-dir /Users/buildslave/jenkins/workspace/lldb-cmake-matrix/lldb-build/lldb-test-build.noindex -t --env TERM=vt100 --skip-category gmodules --skip-category watchpoint --arch=x86_64 --dwarf-version=5 --env LLVM_LIBS_DIR=/Users/buildslave/jenkins/workspace/lldb-cmake-matrix/lldb-build/./lib --arch x86_64 --build-dir /Users/buildslave/jenkins/workspace/lldb-cmake-matrix/lldb-build/lldb-test-build.noindex --lldb-module-cache-dir /Users/buildslave/jenkins/workspace/lldb-cmake-matrix/lldb-build/lldb-test-build.noindex/module-cache-lldb/lldb-api --clang-module-cache-dir /Users/buildslave/jenkins/workspace/lldb-cmake-matrix/lldb-build/lldb-test-build.noindex/module-cache-clang/lldb-api --executable /Users/buildslave/jenkins/workspace/lldb-cmake-matrix/lldb-build/./bin/lldb --compiler /Users/buildslave/jenkins/workspace/lldb-cmake-matrix/lldb-build/./bin/clang --dsymutil /Users/buildslave/jenkins/workspace/lldb-cmake-matrix/lldb-build/./bin/dsymutil --llvm-tools-dir /Users/buildslave/jenkins/workspace/lldb-cmake-matrix/lldb-build/./bin --lldb-libs-dir /Users/buildslave/jenkins/workspace/lldb-cmake-matrix/lldb-build/./lib /Users/buildslave/jenkins/workspace/lldb-cmake-matrix/llvm-project/lldb/test/API/python_api/lldbutil/iter -p TestLLDBIterator.py
--
Exit Code: -9
Timeout: Reached timeout of 600 seconds

Command Output (stdout):
--
lldb version 13.0.99 (http://labmaster3.local/git/llvm-project.git revision 80b2da42d28466341b9512599aac354c178c39f8)
  clang revision 80b2da42d28466341b9512599aac354c178c39f8
  llvm revision 80b2da42d28466341b9512599aac354c178c39f8

--

********************
TIMEOUT: lldb-api :: python_api/lldbutil/iter/TestRegistersIterator.py (2339 of 2339)
******************** TEST 'lldb-api :: python_api/lldbutil/iter/TestRegistersIterator.py' FAILED ********************
Script:
--
/usr/local/Frameworks/Python.framework/Versions/3.7/bin/python3.7 /Users/buildslave/jenkins/workspace/lldb-cmake-matrix/llvm-project/lldb/test/API/dotest.py -u CXXFLAGS -u CFLAGS --codesign-identity lldb_codesign --arch x86_64 --build-dir /Users/buildslave/jenkins/workspace/lldb-cmake-matrix/lldb-build/lldb-test-build.noindex -t --env TERM=vt100 --skip-category gmodules --skip-category watchpoint --arch=x86_64 --dwarf-version=5 --env LLVM_LIBS_DIR=/Users/buildslave/jenkins/workspace/lldb-cmake-matrix/lldb-build/./lib --arch x86_64 --build-dir /Users/buildslave/jenkins/workspace/lldb-cmake-matrix/lldb-build/lldb-test-build.noindex --lldb-module-cache-dir /Users/buildslave/jenkins/workspace/lldb-cmake-matrix/lldb-build/lldb-test-build.noindex/module-cache-lldb/lldb-api --clang-module-cache-dir /Users/buildslave/jenkins/workspace/lldb-cmake-matrix/lldb-build/lldb-test-build.noindex/module-cache-clang/lldb-api --executable /Users/buildslave/jenkins/workspace/lldb-cmake-matrix/lldb-build/./bin/lldb --compiler /Users/buildslave/jenkins/workspace/lldb-cmake-matrix/lldb-build/./bin/clang --dsymutil /Users/buildslave/jenkins/workspace/lldb-cmake-matrix/lldb-build/./bin/dsymutil --llvm-tools-dir /Users/buildslave/jenkins/workspace/lldb-cmake-matrix/lldb-build/./bin --lldb-libs-dir /Users/buildslave/jenkins/workspace/lldb-cmake-matrix/lldb-build/./lib /Users/buildslave/jenkins/workspace/lldb-cmake-matrix/llvm-project/lldb/test/API/python_api/lldbutil/iter -p TestRegistersIterator.py
--
Exit Code: -9
Timeout: Reached timeout of 600 seconds

Command Output (stdout):
--
lldb version 13.0.99 (http://labmaster3.local/git/llvm-project.git revision 80b2da42d28466341b9512599aac354c178c39f8)
  clang revision 80b2da42d28466341b9512599aac354c178c39f8
  llvm revision 80b2da42d28466341b9512599aac354c178c39f8

--

********************
Slowest Tests:
--------------------------------------------------------------------------
599.99s: lldb-api :: commands/expression/persistent_ptr_update/TestPersistentPtrUpdate.py
599.99s: lldb-api :: python_api/lldbutil/iter/TestRegistersIterator.py
599.98s: lldb-api :: python_api/lldbutil/iter/TestLLDBIterator.py
96.60s: lldb-api :: driver/batch_mode/TestBatchMode.py
95.30s: lldb-api :: tools/lldb-server/TestLldbGdbServer.py
66.68s: lldb-api :: macosx/nslog/TestDarwinNSLogOutput.py
59.17s: lldb-api :: lang/objc/foundation/TestFoundationDisassembly.py
56.08s: lldb-api :: api/multithreaded/TestMultithreaded.py
44.06s: lldb-api :: tools/lldb-server/vCont-threads/TestGdbRemote_vContThreads.py
32.58s: lldb-api :: commands/process/attach-resume/TestAttachResume.py
32.16s: lldb-api :: commands/expression/multiline-completion/TestMultilineCompletion.py
31.28s: lldb-api :: commands/gui/viewlarge/TestGuiViewLarge.py
31.22s: lldb-api :: commands/gui/breakpoints/TestGuiBreakpoints.py
31.20s: lldb-api :: commands/gui/basic/TestGuiBasic.py
31.05s: lldb-api :: commands/gui/basicdebug/TestGuiBasicDebug.py
30.67s: lldb-api :: python_api/target/TestTargetAPI.py
30.39s: lldb-api :: tools/lldb-server/TestGdbRemoteThreadsInStopReply.py
29.78s: lldb-api :: functionalities/completion/TestCompletion.py
28.53s: lldb-api :: functionalities/gdb_remote_client/TestHaltFails.py
24.91s: lldb-api :: lang/objc/exceptions/TestObjCExceptions.py

Tests Times:
--------------------------------------------------------------------------
[   Range   ] :: [               Percentage               ] :: [  Count  ]
--------------------------------------------------------------------------
[550s,600s) :: [                                        ] :: [   3/2339]
[500s,550s) :: [                                        ] :: [   0/2339]
[450s,500s) :: [                                        ] :: [   0/2339]
[400s,450s) :: [                                        ] :: [   0/2339]
[350s,400s) :: [                                        ] :: [   0/2339]
[300s,350s) :: [                                        ] :: [   0/2339]
[250s,300s) :: [                                        ] :: [   0/2339]
[200s,250s) :: [                                        ] :: [   0/2339]
[150s,200s) :: [                                        ] :: [   0/2339]
[100s,150s) :: [                                        ] :: [   0/2339]
[ 50s,100s) :: [                                        ] :: [   5/2339]
[  0s, 50s) :: [*************************************** ] :: [2331/2339]
--------------------------------------------------------------------------
********************
Timed Out Tests (3):
  lldb-api :: commands/expression/persistent_ptr_update/TestPersistentPtrUpdate.py
  lldb-api :: python_api/lldbutil/iter/TestLLDBIterator.py
  lldb-api :: python_api/lldbutil/iter/TestRegistersIterator.py

********************
Failed Tests (584):
  lldb-api :: api/check_public_api_headers/TestPublicAPIHeaders.py
  lldb-api :: commands/apropos/with-process/TestAproposWithProcess.py
  lldb-api :: commands/command/nested_alias/TestNestedAlias.py
  lldb-api :: commands/command/script/TestCommandScript.py
  lldb-api :: commands/disassemble/basic/TestDisassembleBreakpoint.py
  lldb-api :: commands/disassemble/basic/TestFrameDisassemble.py
  lldb-api :: commands/expression/anonymous-struct/TestCallUserAnonTypedef.py
  lldb-api :: commands/expression/argument_passing_restrictions/TestArgumentPassingRestrictions.py
  lldb-api :: commands/expression/call-function/TestCallStdStringFunction.py
  lldb-api :: commands/expression/call-function/TestCallStopAndContinue.py
  lldb-api :: commands/expression/call-function/TestCallUserDefinedFunction.py
  lldb-api :: commands/expression/call-throws/TestCallThatThrows.py
  lldb-api :: commands/expression/cast_int_to_anonymous_enum/TestCastIntToAnonymousEnum.py
  lldb-api :: commands/expression/char/TestExprsChar.py
  lldb-api :: commands/expression/class_template_specialization_empty_pack/TestClassTemplateSpecializationParametersHandling.py
  lldb-api :: commands/expression/codegen-crash-import-def-arraytype-element/TestImportDefinitionArrayType.py
  lldb-api :: commands/expression/codegen-crash-typedefdecl-not-in_declcontext/TestCodegenCrashTypedefDeclNotInDeclContext.py
  lldb-api :: commands/expression/completion-crash-incomplete-record/TestCompletionCrashIncompleteRecord.py
  lldb-api :: commands/expression/completion-in-lambda-and-unnamed-class/TestCompletionInLambdaAndUnnamedClass.py
  lldb-api :: commands/expression/completion/TestExprCompletion.py
  lldb-api :: commands/expression/context-object-objc/TestContextObjectObjc.py
  lldb-api :: commands/expression/context-object/TestContextObject.py
  lldb-api :: commands/expression/deleting-implicit-copy-constructor/TestDeletingImplicitCopyConstructor.py
  lldb-api :: commands/expression/diagnostics/TestExprDiagnostics.py
  lldb-api :: commands/expression/dollar-in-variable/TestDollarInVariable.py
  lldb-api :: commands/expression/dont_allow_jit/TestAllowJIT.py
  lldb-api :: commands/expression/entry-bp/TestExprEntryBP.py
  lldb-api :: commands/expression/expr-in-syscall/TestExpressionInSyscall.py
  lldb-api :: commands/expression/fixits/TestFixIts.py
  lldb-api :: commands/expression/formatters/TestFormatters.py
  lldb-api :: commands/expression/function_template_specialization_temp_args/TestFunctionTemplateSpecializationTempArgs.py
  lldb-api :: commands/expression/ignore-artificial-constructors/TestIgnoreArtificialConstructors.py
  lldb-api :: commands/expression/import-std-module/array/TestArrayFromStdModule.py
  lldb-api :: commands/expression/import-std-module/basic/TestImportStdModule.py
  lldb-api :: commands/expression/import-std-module/conflicts/TestStdModuleWithConflicts.py
  lldb-api :: commands/expression/import-std-module/deque-basic/TestDequeFromStdModule.py
  lldb-api :: commands/expression/import-std-module/deque-dbg-info-content/TestDbgInfoContentDequeFromStdModule.py
  lldb-api :: commands/expression/import-std-module/empty-module/TestEmptyStdModule.py
  lldb-api :: commands/expression/import-std-module/forward_decl_from_module/TestForwardDeclFromStdModule.py
  lldb-api :: commands/expression/import-std-module/forward_list-dbg-info-content/TestDbgInfoContentForwardListFromStdModule.py
  lldb-api :: commands/expression/import-std-module/forward_list/TestForwardListFromStdModule.py
  lldb-api :: commands/expression/import-std-module/iterator/TestIteratorFromStdModule.py
  lldb-api :: commands/expression/import-std-module/list-dbg-info-content/TestDbgInfoContentListFromStdModule.py
  lldb-api :: commands/expression/import-std-module/list/TestListFromStdModule.py
  lldb-api :: commands/expression/import-std-module/missing-module-sources/TestStdModuleSourcesMissing.py
  lldb-api :: commands/expression/import-std-module/no-std-module/TestMissingStdModule.py
  lldb-api :: commands/expression/import-std-module/non-module-type-separation/TestNonModuleTypeSeparation.py
  lldb-api :: commands/expression/import-std-module/pair/TestPairFromStdModule.py
  lldb-api :: commands/expression/import-std-module/queue/TestQueueFromStdModule.py
  lldb-api :: commands/expression/import-std-module/retry-with-std-module/TestRetryWithStdModule.py
  lldb-api :: commands/expression/import-std-module/shared_ptr-dbg-info-content/TestSharedPtrDbgInfoContentFromStdModule.py
  lldb-api :: commands/expression/import-std-module/shared_ptr/TestSharedPtrFromStdModule.py
  lldb-api :: commands/expression/import-std-module/stack/TestStackFromStdModule.py
  lldb-api :: commands/expression/import-std-module/sysroot/TestStdModuleSysroot.py
  lldb-api :: commands/expression/import-std-module/unique_ptr-dbg-info-content/TestUniquePtrDbgInfoContent.py
  lldb-api :: commands/expression/import-std-module/unique_ptr/TestUniquePtrFromStdModule.py
  lldb-api :: commands/expression/import-std-module/vector-bool/TestVectorBoolFromStdModule.py
  lldb-api :: commands/expression/import-std-module/vector-dbg-info-content/TestDbgInfoContentVectorFromStdModule.py
  lldb-api :: commands/expression/import-std-module/vector-of-vectors/TestVectorOfVectorsFromStdModule.py
  lldb-api :: commands/expression/import-std-module/vector/TestVectorFromStdModule.py
  lldb-api :: commands/expression/import-std-module/weak_ptr-dbg-info-content/TestDbgInfoContentWeakPtrFromStdModule.py
  lldb-api :: commands/expression/import-std-module/weak_ptr/TestWeakPtrFromStdModule.py
  lldb-api :: commands/expression/import_base_class_when_class_has_derived_member/TestImportBaseClassWhenClassHasDerivedMember.py
  lldb-api :: commands/expression/inline-namespace/TestInlineNamespace.py
  lldb-api :: commands/expression/ir-interpreter-phi-nodes/TestIRInterpreterPHINodes.py
  lldb-api :: commands/expression/ir-interpreter/TestIRInterpreter.py
  lldb-api :: commands/expression/issue_11588/Test11588.py
  lldb-api :: commands/expression/multiline-completion/TestMultilineCompletion.py
  lldb-api :: commands/expression/no-deadlock/TestExprDoesntBlock.py
  lldb-api :: commands/expression/options/TestExprOptions.py
  lldb-api :: commands/expression/persist_objc_pointeetype/TestPersistObjCPointeeType.py
  lldb-api :: commands/expression/persistent_types/TestPersistentTypes.py
  lldb-api :: commands/expression/persistent_variables/TestPersistentVariables.py
  lldb-api :: commands/expression/po_verbosity/TestPoVerbosity.py
  lldb-api :: commands/expression/pr35310/TestExprsBug35310.py
  lldb-api :: commands/expression/radar_8638051/Test8638051.py
  lldb-api :: commands/expression/radar_9531204/TestPrintfAfterUp.py
  lldb-api :: commands/expression/radar_9673664/TestExprHelpExamples.py
  lldb-api :: commands/expression/rdar42038760/TestScalarURem.py
  lldb-api :: commands/expression/rdar44436068/Test128BitsInteger.py
  lldb-api :: commands/expression/regression-access-function-template-in-record/TestRegressionAccessFunctionTemplateInRecord.py
  lldb-api :: commands/expression/result_numbering/TestResultNumbering.py
  lldb-api :: commands/expression/save_jit_objects/TestSaveJITObjects.py
  lldb-api :: commands/expression/scoped_enums/TestScopedEnumType.py
  lldb-api :: commands/expression/static-initializers/TestStaticInitializers.py
  lldb-api :: commands/expression/test/TestExprs.py
  lldb-api :: commands/expression/test/TestExprs2.py
  lldb-api :: commands/expression/timeout/TestCallWithTimeout.py
  lldb-api :: commands/expression/top-level/TestTopLevelExprs.py
  lldb-api :: commands/expression/two-files/TestObjCTypeQueryFromOtherCompileUnit.py
  lldb-api :: commands/expression/unicode-in-variable/TestUnicodeInVariable.py
  lldb-api :: commands/expression/unwind_expression/TestUnwindExpression.py
  lldb-api :: commands/expression/vector_of_enums/TestVectorOfEnums.py
  lldb-api :: commands/expression/weak_symbols/TestWeakSymbols.py
  lldb-api :: commands/expression/xvalue/TestXValuePrinting.py
  lldb-api :: commands/frame/diagnose/array/TestArray.py
  lldb-api :: commands/frame/diagnose/bad-reference/TestBadReference.py
  lldb-api :: commands/frame/diagnose/complicated-expression/TestComplicatedExpression.py
  lldb-api :: commands/frame/diagnose/dereference-argument/TestDiagnoseDereferenceArgument.py
  lldb-api :: commands/frame/diagnose/dereference-function-return/TestDiagnoseDereferenceFunctionReturn.py
  lldb-api :: commands/frame/diagnose/dereference-this/TestDiagnoseDereferenceThis.py
  lldb-api :: commands/frame/diagnose/inheritance/TestDiagnoseInheritance.py
  lldb-api :: commands/frame/diagnose/local-variable/TestLocalVariable.py
  lldb-api :: commands/frame/diagnose/virtual-method-call/TestDiagnoseDereferenceVirtualMethodCall.py
  lldb-api :: commands/frame/language/TestGuessLanguage.py
  lldb-api :: commands/frame/select/TestFrameSelect.py
  lldb-api :: commands/frame/var-scope/TestFrameVariableScope.py
  lldb-api :: commands/frame/var/TestFrameVar.py
  lldb-api :: commands/gui/basic/TestGuiBasic.py
  lldb-api :: commands/gui/basicdebug/TestGuiBasicDebug.py
  lldb-api :: commands/gui/breakpoints/TestGuiBreakpoints.py
  lldb-api :: commands/gui/viewlarge/TestGuiViewLarge.py
  lldb-api :: commands/process/attach-resume/TestAttachResume.py
  lldb-api :: commands/process/attach/TestProcessAttach.py
  lldb-api :: commands/process/launch-with-shellexpand/TestLaunchWithShellExpand.py
  lldb-api :: commands/process/launch/TestProcessLaunch.py
  lldb-api :: commands/process/signal/TestProcessSignal.py
  lldb-api :: commands/settings/TestSettings.py
  lldb-api :: commands/source/info/TestSourceInfo.py
  lldb-api :: commands/statistics/basic/TestStats.py
  lldb-api :: commands/target/basic/TestTargetCommand.py
  lldb-api :: commands/target/stop-hooks/TestStopHookScripted.py
  lldb-api :: commands/target/stop-hooks/TestStopHooks.py
  lldb-api :: commands/thread/select/TestThreadSelect.py
  lldb-api :: driver/batch_mode/TestBatchMode.py
  lldb-api :: functionalities/archives/TestBSDArchives.py
  lldb-api :: functionalities/avoids-fd-leak/TestFdLeak.py
  lldb-api :: functionalities/breakpoint/address_breakpoints/TestAddressBreakpoints.py
  lldb-api :: functionalities/breakpoint/address_breakpoints/TestBadAddressBreakpoints.py
  lldb-api :: functionalities/breakpoint/auto_continue/TestBreakpointAutoContinue.py
  lldb-api :: functionalities/breakpoint/breakpoint_by_file_colon_line/TestBreakpointByFileColonLine.py
  lldb-api :: functionalities/breakpoint/breakpoint_by_line_and_column/TestBreakpointByLineAndColumn.py
  lldb-api :: functionalities/breakpoint/breakpoint_command/TestBreakpointCommand.py
  lldb-api :: functionalities/breakpoint/breakpoint_command/TestBreakpointCommandsFromPython.py
  lldb-api :: functionalities/breakpoint/breakpoint_command/TestRegexpBreakCommand.py
  lldb-api :: functionalities/breakpoint/breakpoint_conditions/TestBreakpointConditions.py
  lldb-api :: functionalities/breakpoint/breakpoint_ids/TestBreakpointIDs.py
  lldb-api :: functionalities/breakpoint/breakpoint_ignore_count/TestBreakpointIgnoreCount.py
  lldb-api :: functionalities/breakpoint/breakpoint_language/TestBreakpointLanguage.py
  lldb-api :: functionalities/breakpoint/breakpoint_locations/TestBreakpointLocations.py
  lldb-api :: functionalities/breakpoint/breakpoint_options/TestBreakpointOptions.py
  lldb-api :: functionalities/breakpoint/breakpoint_set_restart/TestBreakpointSetRestart.py
  lldb-api :: functionalities/breakpoint/comp_dir_symlink/TestCompDirSymLink.py
  lldb-api :: functionalities/breakpoint/consecutive_breakpoints/TestConsecutiveBreakpoints.py
  lldb-api :: functionalities/breakpoint/cpp/TestCPPBreakpointLocations.py
  lldb-api :: functionalities/breakpoint/dummy_target_breakpoints/TestBreakpointsWithNoTargets.py
  lldb-api :: functionalities/breakpoint/global_constructor/TestBreakpointInGlobalConstructor.py
  lldb-api :: functionalities/breakpoint/inlined_breakpoints/TestInlinedBreakpoints.py
  lldb-api :: functionalities/breakpoint/move_nearest/TestMoveNearest.py
  lldb-api :: functionalities/breakpoint/scripted_bkpt/TestScriptedResolver.py
  lldb-api :: functionalities/breakpoint/source_regexp/TestSourceRegexBreakpoints.py
  lldb-api :: functionalities/breakpoint/step_over_breakpoint/TestStepOverBreakpoint.py
  lldb-api :: functionalities/completion/TestCompletion.py
  lldb-api :: functionalities/conditional_break/TestConditionalBreak.py
  lldb-api :: functionalities/data-formatter/array_typedef/TestArrayTypedef.py
  lldb-api :: functionalities/data-formatter/boolreference/TestFormattersBoolRefPtr.py
  lldb-api :: functionalities/data-formatter/builtin-formats/TestBuiltinFormats.py
  lldb-api :: functionalities/data-formatter/compactvectors/TestCompactVectors.py
  lldb-api :: functionalities/data-formatter/cstring-utf8-summary/TestCstringUnicode.py
  lldb-api :: functionalities/data-formatter/data-formatter-advanced/TestDataFormatterAdv.py
  lldb-api :: functionalities/data-formatter/data-formatter-caching/TestDataFormatterCaching.py
  lldb-api :: functionalities/data-formatter/data-formatter-categories/TestDataFormatterCategories.py
  lldb-api :: functionalities/data-formatter/data-formatter-cpp/TestDataFormatterCpp.py
  lldb-api :: functionalities/data-formatter/data-formatter-disabling/TestDataFormatterDisabling.py
  lldb-api :: functionalities/data-formatter/data-formatter-enum-format/TestDataFormatterEnumFormat.py
  lldb-api :: functionalities/data-formatter/data-formatter-globals/TestDataFormatterGlobals.py
  lldb-api :: functionalities/data-formatter/data-formatter-named-summaries/TestDataFormatterNamedSummaries.py
  lldb-api :: functionalities/data-formatter/data-formatter-objc/TestDataFormatterObjCCF.py
  lldb-api :: functionalities/data-formatter/data-formatter-objc/TestDataFormatterObjCExpr.py
  lldb-api :: functionalities/data-formatter/data-formatter-objc/TestDataFormatterObjCKVO.py
  lldb-api :: functionalities/data-formatter/data-formatter-objc/TestDataFormatterObjCNSBundle.py
  lldb-api :: functionalities/data-formatter/data-formatter-objc/TestDataFormatterObjCNSContainer.py
  lldb-api :: functionalities/data-formatter/data-formatter-objc/TestDataFormatterObjCNSData.py
  lldb-api :: functionalities/data-formatter/data-formatter-objc/TestDataFormatterObjCNSDate.py
  lldb-api :: functionalities/data-formatter/data-formatter-objc/TestDataFormatterObjCNSError.py
  lldb-api :: functionalities/data-formatter/data-formatter-objc/TestDataFormatterObjCNSURL.py
  lldb-api :: functionalities/data-formatter/data-formatter-objc/TestDataFormatterObjCPlain.py
  lldb-api :: functionalities/data-formatter/data-formatter-objc/TestDataFormatterObjNSException.py
  lldb-api :: functionalities/data-formatter/data-formatter-objc/cmtime/TestDataFormatterCMTime.py
  lldb-api :: functionalities/data-formatter/data-formatter-objc/nsindexpath/TestDataFormatterNSIndexPath.py
  lldb-api :: functionalities/data-formatter/data-formatter-objc/nsstring/TestDataFormatterNSString.py
  lldb-api :: functionalities/data-formatter/data-formatter-proper-plurals/TestFormattersOneIsSingular.py
  lldb-api :: functionalities/data-formatter/data-formatter-ptr-to-array/TestPtrToArrayFormatting.py
  lldb-api :: functionalities/data-formatter/data-formatter-python-synth/TestDataFormatterPythonSynth.py
  lldb-api :: functionalities/data-formatter/data-formatter-script/TestDataFormatterScript.py
  lldb-api :: functionalities/data-formatter/data-formatter-skip-summary/TestDataFormatterSkipSummary.py
  lldb-api :: functionalities/data-formatter/data-formatter-smart-array/TestDataFormatterSmartArray.py
  lldb-api :: functionalities/data-formatter/data-formatter-stl/libcxx/atomic/TestLibCxxAtomic.py
  lldb-api :: functionalities/data-formatter/data-formatter-stl/libcxx/bitset/TestDataFormatterLibcxxBitset.py
  lldb-api :: functionalities/data-formatter/data-formatter-stl/libcxx/deque/TestDataFormatterLibcxxDeque.py
  lldb-api :: functionalities/data-formatter/data-formatter-stl/libcxx/forward_list/TestDataFormatterLibcxxForwardList.py
  lldb-api :: functionalities/data-formatter/data-formatter-stl/libcxx/function/TestLibCxxFunction.py
  lldb-api :: functionalities/data-formatter/data-formatter-stl/libcxx/initializerlist/TestInitializerList.py
  lldb-api :: functionalities/data-formatter/data-formatter-stl/libcxx/iterator/TestDataFormatterLibccIterator.py
  lldb-api :: functionalities/data-formatter/data-formatter-stl/libcxx/list/TestDataFormatterLibcxxList.py
  lldb-api :: functionalities/data-formatter/data-formatter-stl/libcxx/list/loop/TestDataFormatterLibcxxListLoop.py
  lldb-api :: functionalities/data-formatter/data-formatter-stl/libcxx/map/TestDataFormatterLibccMap.py
  lldb-api :: functionalities/data-formatter/data-formatter-stl/libcxx/multimap/TestDataFormatterLibccMultiMap.py
  lldb-api :: functionalities/data-formatter/data-formatter-stl/libcxx/multiset/TestDataFormatterLibcxxMultiSet.py
  lldb-api :: functionalities/data-formatter/data-formatter-stl/libcxx/optional/TestDataFormatterLibcxxOptional.py
  lldb-api :: functionalities/data-formatter/data-formatter-stl/libcxx/queue/TestDataFormatterLibcxxQueue.py
  lldb-api :: functionalities/data-formatter/data-formatter-stl/libcxx/set/TestDataFormatterLibcxxSet.py
  lldb-api :: functionalities/data-formatter/data-formatter-stl/libcxx/shared_ptr/TestDataFormatterLibcxxSharedPtr.py
  lldb-api :: functionalities/data-formatter/data-formatter-stl/libcxx/string/TestDataFormatterLibcxxString.py
  lldb-api :: functionalities/data-formatter/data-formatter-stl/libcxx/tuple/TestDataFormatterLibcxxTuple.py
  lldb-api :: functionalities/data-formatter/data-formatter-stl/libcxx/unique_ptr/TestDataFormatterLibcxxUniquePtr.py
  lldb-api :: functionalities/data-formatter/data-formatter-stl/libcxx/unordered/TestDataFormatterUnordered.py
  lldb-api :: functionalities/data-formatter/data-formatter-stl/libcxx/variant/TestDataFormatterLibcxxVariant.py
  lldb-api :: functionalities/data-formatter/data-formatter-stl/libcxx/vbool/TestDataFormatterLibcxxVBool.py
  lldb-api :: functionalities/data-formatter/data-formatter-stl/libcxx/vector/TestDataFormatterLibcxxVector.py
  lldb-api :: functionalities/data-formatter/data-formatter-stl/libstdcpp/unique_ptr/invalid/TestDataFormatterInvalidStdUniquePtr.py
  lldb-api :: functionalities/data-formatter/data-formatter-synth/TestDataFormatterSynth.py
  lldb-api :: functionalities/data-formatter/data-formatter-synthtype/TestDataFormatterSynthType.py
  lldb-api :: functionalities/data-formatter/data-formatter-synthval/TestDataFormatterSynthVal.py
  lldb-api :: functionalities/data-formatter/dump_dynamic/TestDumpDynamic.py
  lldb-api :: functionalities/data-formatter/format-propagation/TestFormatPropagation.py
  lldb-api :: functionalities/data-formatter/frameformat_smallstruct/TestFrameFormatSmallStruct.py
  lldb-api :: functionalities/data-formatter/hexcaps/TestDataFormatterHexCaps.py
  lldb-api :: functionalities/data-formatter/language_category_updates/TestDataFormatterLanguageCategoryUpdates.py
  lldb-api :: functionalities/data-formatter/nsarraysynth/TestNSArraySynthetic.py
  lldb-api :: functionalities/data-formatter/nsdictionarysynth/TestNSDictionarySynthetic.py
  lldb-api :: functionalities/data-formatter/nssetsynth/TestNSSetSynthetic.py
  lldb-api :: functionalities/data-formatter/ostypeformatting/TestFormattersOsType.py
  lldb-api :: functionalities/data-formatter/parray/TestPrintArray.py
  lldb-api :: functionalities/data-formatter/poarray/TestPrintObjectArray.py
  lldb-api :: functionalities/data-formatter/ptr_ref_typedef/TestPtrRef2Typedef.py
  lldb-api :: functionalities/data-formatter/pyobjsynthprovider/TestPyObjSynthProvider.py
  lldb-api :: functionalities/data-formatter/refpointer-recursion/TestDataFormatterRefPtrRecursion.py
  lldb-api :: functionalities/data-formatter/setvaluefromcstring/TestSetValueFromCString.py
  lldb-api :: functionalities/data-formatter/stringprinter/TestStringPrinter.py
  lldb-api :: functionalities/data-formatter/summary-string-onfail/Test-rdar-9974002.py
  lldb-api :: functionalities/data-formatter/synthcapping/TestSyntheticCapping.py
  lldb-api :: functionalities/data-formatter/synthupdate/TestSyntheticFilterRecompute.py
  lldb-api :: functionalities/data-formatter/type_summary_list_script/TestTypeSummaryListScript.py
  lldb-api :: functionalities/data-formatter/typedef_array/TestTypedefArray.py
  lldb-api :: functionalities/data-formatter/user-format-vs-summary/TestUserFormatVsSummary.py
  lldb-api :: functionalities/data-formatter/var-in-aggregate-misuse/TestVarInAggregateMisuse.py
  lldb-api :: functionalities/data-formatter/varscript_formatting/TestDataFormatterVarScriptFormatting.py
  lldb-api :: functionalities/data-formatter/vector-types/TestVectorTypesFormatting.py
  lldb-api :: functionalities/dead-strip/TestDeadStrip.py
  lldb-api :: functionalities/dlopen_other_executable/TestDlopenOtherExecutable.py
  lldb-api :: functionalities/dynamic_value_child_count/TestDynamicValueChildCount.py
  lldb-api :: functionalities/exec/TestExec.py
  lldb-api :: functionalities/find-line-entry/TestFindLineEntry.py
  lldb-api :: functionalities/float-display/TestFloatDisplay.py
  lldb-api :: functionalities/inferior-assert/TestInferiorAssert.py
  lldb-api :: functionalities/inferior-changed/TestInferiorChanged.py
  lldb-api :: functionalities/inferior-crashing/TestInferiorCrashing.py
  lldb-api :: functionalities/inferior-crashing/TestInferiorCrashingStep.py
  lldb-api :: functionalities/inferior-crashing/recursive-inferior/TestRecursiveInferior.py
  lldb-api :: functionalities/inferior-crashing/recursive-inferior/TestRecursiveInferiorStep.py
  lldb-api :: functionalities/inline-stepping/TestInlineStepping.py
  lldb-api :: functionalities/lazy-loading/TestLazyLoading.py
  lldb-api :: functionalities/limit-debug-info/TestLimitDebugInfo.py
  lldb-api :: functionalities/load_lazy/TestLoadUsingLazyBind.py
  lldb-api :: functionalities/load_unload/TestLoadUnload.py
  lldb-api :: functionalities/load_using_paths/TestLoadUsingPaths.py
  lldb-api :: functionalities/memory-region/TestMemoryRegion.py
  lldb-api :: functionalities/memory/cache/TestMemoryCache.py
  lldb-api :: functionalities/memory/find/TestMemoryFind.py
  lldb-api :: functionalities/memory/read/TestMemoryRead.py
  lldb-api :: functionalities/non-overlapping-index-variable-i/TestIndexVariable.py
  lldb-api :: functionalities/optimized_code/TestNoASanExceptionAfterEvalOP_piece.py
  lldb-api :: functionalities/param_entry_vals/basic_entry_values/TestBasicEntryValues.py
  lldb-api :: functionalities/plugins/python_os_plugin/TestPythonOSPlugin.py
  lldb-api :: functionalities/plugins/python_os_plugin/stepping_plugin_threads/TestOSPluginStepping.py
  lldb-api :: functionalities/pointer_num_children/TestPointerNumChildren.py
  lldb-api :: functionalities/process_crash_info/TestProcessCrashInfo.py
  lldb-api :: functionalities/process_group/TestChangeProcessGroup.py
  lldb-api :: functionalities/ptr_refs/TestPtrRefs.py
  lldb-api :: functionalities/recursion/TestValueObjectRecursion.py
  lldb-api :: functionalities/rerun/TestRerun.py
  lldb-api :: functionalities/return-value/TestReturnValue.py
  lldb-api :: functionalities/set-data/TestSetData.py
  lldb-api :: functionalities/signal/TestSendSignal.py
  lldb-api :: functionalities/signal/handle-abrt/TestHandleAbort.py
  lldb-api :: functionalities/step-avoids-no-debug/TestStepNoDebug.py
  lldb-api :: functionalities/step_scripted/TestStepScripted.py
  lldb-api :: functionalities/stop-on-sharedlibrary-load/TestStopOnSharedlibraryEvents.py
  lldb-api :: functionalities/tail_call_frames/ambiguous_tail_call_seq1/TestAmbiguousTailCallSeq1.py
  lldb-api :: functionalities/tail_call_frames/ambiguous_tail_call_seq2/TestAmbiguousTailCallSeq2.py
  lldb-api :: functionalities/tail_call_frames/cross_dso/TestCrossDSOTailCalls.py
  lldb-api :: functionalities/tail_call_frames/cross_object/TestCrossObjectTailCalls.py
  lldb-api :: functionalities/tail_call_frames/disambiguate_call_site/TestDisambiguateCallSite.py
  lldb-api :: functionalities/tail_call_frames/disambiguate_paths_to_common_sink/TestDisambiguatePathsToCommonSink.py
  lldb-api :: functionalities/tail_call_frames/disambiguate_tail_call_seq/TestDisambiguateTailCallSeq.py
  lldb-api :: functionalities/tail_call_frames/inlining_and_tail_calls/TestInliningAndTailCalls.py
  lldb-api :: functionalities/tail_call_frames/sbapi_support/TestTailCallFrameSBAPI.py
  lldb-api :: functionalities/tail_call_frames/thread_step_out_message/TestArtificialFrameStepOutMessage.py
  lldb-api :: functionalities/tail_call_frames/thread_step_out_or_return/TestSteppingOutWithArtificialFrames.py
  lldb-api :: functionalities/tail_call_frames/unambiguous_sequence/TestUnambiguousTailCalls.py
  lldb-api :: functionalities/target_var/TestTargetVar.py
  lldb-api :: functionalities/thread/backtrace_all/TestBacktraceAll.py
  lldb-api :: functionalities/thread/backtrace_limit/TestBacktraceLimit.py
  lldb-api :: functionalities/thread/concurrent_events/TestConcurrentBreakpointDelayBreakpointOneSignal.py
  lldb-api :: functionalities/thread/concurrent_events/TestConcurrentBreakpointOneDelayBreakpointThreads.py
  lldb-api :: functionalities/thread/concurrent_events/TestConcurrentCrashWithBreak.py
  lldb-api :: functionalities/thread/concurrent_events/TestConcurrentCrashWithSignal.py
  lldb-api :: functionalities/thread/concurrent_events/TestConcurrentDelaySignalBreak.py
  lldb-api :: functionalities/thread/concurrent_events/TestConcurrentDelayedCrashWithBreakpointSignal.py
  lldb-api :: functionalities/thread/concurrent_events/TestConcurrentManyBreakpoints.py
  lldb-api :: functionalities/thread/concurrent_events/TestConcurrentManyCrash.py
  lldb-api :: functionalities/thread/concurrent_events/TestConcurrentSignalBreak.py
  lldb-api :: functionalities/thread/concurrent_events/TestConcurrentSignalDelayBreak.py
  lldb-api :: functionalities/thread/concurrent_events/TestConcurrentTwoBreakpointThreads.py
  lldb-api :: functionalities/thread/concurrent_events/TestConcurrentTwoBreakpointsOneDelaySignal.py
  lldb-api :: functionalities/thread/concurrent_events/TestConcurrentTwoBreakpointsOneSignal.py
  lldb-api :: functionalities/thread/crash_during_step/TestCrashDuringStep.py
  lldb-api :: functionalities/thread/create_after_attach/TestCreateAfterAttach.py
  lldb-api :: functionalities/thread/exit_during_break/TestExitDuringBreak.py
  lldb-api :: functionalities/thread/exit_during_expression/TestExitDuringExpression.py
  lldb-api :: functionalities/thread/exit_during_step/TestExitDuringStep.py
  lldb-api :: functionalities/thread/ignore_suspended/TestIgnoreSuspendedThread.py
  lldb-api :: functionalities/thread/jump/TestThreadJump.py
  lldb-api :: functionalities/thread/num_threads/TestNumThreads.py
  lldb-api :: functionalities/thread/state_after_expression/TestStateAfterExpression.py
  lldb-api :: functionalities/thread/step_out/TestThreadStepOut.py
  lldb-api :: functionalities/thread/step_until/TestStepUntil.py
  lldb-api :: functionalities/thread/thread_exit/TestThreadExit.py
  lldb-api :: functionalities/thread/thread_specific_break/TestThreadSpecificBreakpoint.py
  lldb-api :: functionalities/thread_plan/TestThreadPlanCommands.py
  lldb-api :: functionalities/type_completion/TestTypeCompletion.py
  lldb-api :: functionalities/type_get_module/TestTypeGetModule.py
  lldb-api :: functionalities/type_lookup/TestTypeLookup.py
  lldb-api :: functionalities/unwind/noreturn/TestNoreturnUnwind.py
  lldb-api :: functionalities/unwind/sigtramp/TestSigtrampUnwind.py
  lldb-api :: functionalities/unwind/zeroth_frame/TestZerothFrame.py
  lldb-api :: functionalities/value_md5_crash/TestValueMD5Crash.py
  lldb-api :: functionalities/var_path/TestVarPath.py
  lldb-api :: lang/c/anonymous/TestAnonymous.py
  lldb-api :: lang/c/array_types/TestArrayTypes.py
  lldb-api :: lang/c/bitfields/TestBitfields.py
  lldb-api :: lang/c/blocks/TestBlocks.py
  lldb-api :: lang/c/complex/TestComplexC99.py
  lldb-api :: lang/c/complex_int/TestComplexInt.py
  lldb-api :: lang/c/conflicting-symbol/TestConflictingSymbol.py
  lldb-api :: lang/c/const_variables/TestConstVariables.py
  lldb-api :: lang/c/cpp_keyword_identifiers/TestCppKeywordsAsCIdentifiers.py
  lldb-api :: lang/c/enum_types/TestEnumTypes.py
  lldb-api :: lang/c/forward/TestForwardDeclaration.py
  lldb-api :: lang/c/function_types/TestFunctionTypes.py
  lldb-api :: lang/c/global_variables/TestGlobalVariables.py
  lldb-api :: lang/c/inlines/TestRedefinitionsInInlines.py
  lldb-api :: lang/c/local_variables/TestLocalVariables.py
  lldb-api :: lang/c/modules/TestCModules.py
  lldb-api :: lang/c/offsetof/TestOffsetof.py
  lldb-api :: lang/c/register_variables/TestRegisterVariables.py
  lldb-api :: lang/c/set_values/TestSetValues.py
  lldb-api :: lang/c/shared_lib/TestSharedLib.py
  lldb-api :: lang/c/shared_lib_stripped_symbols/TestSharedLibStrippedSymbols.py
  lldb-api :: lang/c/step-target/TestStepTarget.py
  lldb-api :: lang/c/step_over_no_deadlock/TestStepOverDoesntBlock.py
  lldb-api :: lang/c/stepping/TestStepAndBreakpoints.py
  lldb-api :: lang/c/stepping/TestThreadStepInAvoidRegexp.py
  lldb-api :: lang/c/stepping/TestThreadStepping.py
  lldb-api :: lang/c/strings/TestCStrings.py
  lldb-api :: lang/c/struct_types/TestStructTypes.py
  lldb-api :: lang/c/tls_globals/TestTlsGlobals.py
  lldb-api :: lang/c/unicode/TestUnicodeSymbols.py
  lldb-api :: lang/c/unions/TestUnionMembers.py
  lldb-api :: lang/c/vla/TestVLA.py
  lldb-api :: lang/cpp/accelerator-table/TestCPPAccelerator.py
  lldb-api :: lang/cpp/alignas_base_class/TestAlignAsBaseClass.py
  lldb-api :: lang/cpp/auto/TestCPPAuto.py
  lldb-api :: lang/cpp/bitfields/TestCppBitfields.py
  lldb-api :: lang/cpp/bool/TestCPPBool.py
  lldb-api :: lang/cpp/break-on-initializers/TestBreakOnCPP11Initializers.py
  lldb-api :: lang/cpp/breakpoint-commands/TestCPPBreakpointCommands.py
  lldb-api :: lang/cpp/call-function/TestCallCPPFunction.py
  lldb-api :: lang/cpp/chained-calls/TestCppChainedCalls.py
  lldb-api :: lang/cpp/char8_t/TestCxxChar8_t.py
  lldb-api :: lang/cpp/class-template-non-type-parameter-pack/TestClassTemplateNonTypeParameterPack.py
  lldb-api :: lang/cpp/class-template-parameter-pack/TestClassTemplateParameterPack.py
  lldb-api :: lang/cpp/class-template-type-parameter-pack/TestClassTemplateTypeParameterPack.py
  lldb-api :: lang/cpp/class_static/TestStaticVariables.py
  lldb-api :: lang/cpp/class_types/TestClassTypes.py
  lldb-api :: lang/cpp/class_types/TestClassTypesDisassembly.py
  lldb-api :: lang/cpp/const_this/TestConstThis.py
  lldb-api :: lang/cpp/constructors/TestCppConstructors.py
  lldb-api :: lang/cpp/covariant-return-types/TestCovariantReturnTypes.py
  lldb-api :: lang/cpp/default-template-args/TestDefaultTemplateArgs.py
  lldb-api :: lang/cpp/dereferencing_references/TestCPPDereferencingReferences.py
  lldb-api :: lang/cpp/diamond/TestDiamond.py
  lldb-api :: lang/cpp/dynamic-value-same-basename/TestDynamicValueSameBase.py
  lldb-api :: lang/cpp/dynamic-value/TestCppValueCast.py
  lldb-api :: lang/cpp/dynamic-value/TestDynamicValue.py
  lldb-api :: lang/cpp/enum_types/TestCPP11EnumTypes.py
  lldb-api :: lang/cpp/exceptions/TestCPPExceptionBreakpoints.py
  lldb-api :: lang/cpp/extern_c/TestExternCSymbols.py
  lldb-api :: lang/cpp/forward-declared-template-specialization/TestCppForwardDeclaredTemplateSpecialization.py
  lldb-api :: lang/cpp/frame-var-anon-unions/TestFrameVariableAnonymousUnions.py
  lldb-api :: lang/cpp/function-qualifiers/TestCppFunctionQualifiers.py
  lldb-api :: lang/cpp/function_refs/TestFunctionRefs.py
  lldb-api :: lang/cpp/global_operators/TestCppGlobalOperators.py
  lldb-api :: lang/cpp/global_variables/TestCPPGlobalVariables.py
  lldb-api :: lang/cpp/gmodules-templates/TestGModules.py
  lldb-api :: lang/cpp/incompatible-class-templates/TestCppIncompatibleClassTemplates.py
  lldb-api :: lang/cpp/incomplete-types/TestCppIncompleteTypes.py
  lldb-api :: lang/cpp/inlines/TestInlines.py
  lldb-api :: lang/cpp/lambdas/TestLambdas.py
  lldb-api :: lang/cpp/limit-debug-info/TestWithLimitDebugInfo.py
  lldb-api :: lang/cpp/llvm-style/TestLLVMStyle.py
  lldb-api :: lang/cpp/member-and-local-vars-with-same-name/TestMembersAndLocalsWithSameName.py
  lldb-api :: lang/cpp/modules-import/TestCXXModulesImport.py
  lldb-api :: lang/cpp/multiple-inheritance/TestCppMultipleInheritance.py
  lldb-api :: lang/cpp/namespace/TestNamespace.py
  lldb-api :: lang/cpp/namespace/TestNamespaceLookup.py
  lldb-api :: lang/cpp/namespace_conflicts/TestNamespaceConflicts.py
  lldb-api :: lang/cpp/namespace_definitions/TestNamespaceDefinitions.py
  lldb-api :: lang/cpp/nested-class-other-compilation-unit/TestNestedClassWithParentInAnotherCU.py
  lldb-api :: lang/cpp/non-type-template-param/TestCppNonTypeTemplateParam.py
  lldb-api :: lang/cpp/nsimport/TestCppNsImport.py
  lldb-api :: lang/cpp/offsetof/TestOffsetofCpp.py
  lldb-api :: lang/cpp/operator-overload/TestOperatorOverload.py
  lldb-api :: lang/cpp/operators/TestCppOperators.py
  lldb-api :: lang/cpp/overloaded-functions/TestOverloadedFunctions.py
  lldb-api :: lang/cpp/pointer_to_member_type_depending_on_parent_size/TestPointerToMemberTypeDependingOnParentSize.py
  lldb-api :: lang/cpp/reference-to-outer-type/TestCppReferenceToOuterClass.py
  lldb-api :: lang/cpp/rvalue-references/TestRvalueReferences.py
  lldb-api :: lang/cpp/scope/TestCppScope.py
  lldb-api :: lang/cpp/signed_types/TestSignedTypes.py
  lldb-api :: lang/cpp/static_member_type_depending_on_parent_size/TestStaticMemberTypeDependingOnParentSize.py
  lldb-api :: lang/cpp/static_members/TestCPPStaticMembers.py
  lldb-api :: lang/cpp/static_methods/TestCPPStaticMethods.py
  lldb-api :: lang/cpp/std-function-step-into-callable/TestStdFunctionStepIntoCallable.py
  lldb-api :: lang/cpp/struct_with_keyword_name/TestStructWithKeywordName.py
  lldb-api :: lang/cpp/symbols/TestSymbols.py
  lldb-api :: lang/cpp/template-arguments/TestCppTemplateArguments.py
  lldb-api :: lang/cpp/template-function/TestTemplateFunctions.py
  lldb-api :: lang/cpp/template-specialization-type/TestTemplateSpecializationType.py
  lldb-api :: lang/cpp/template/TestTemplateArgs.py
  lldb-api :: lang/cpp/this/TestCPPThis.py
  lldb-api :: lang/cpp/this_class_type_mixing/TestThisClassTypeMixing.py
  lldb-api :: lang/cpp/thread_local/TestThreadLocal.py
  lldb-api :: lang/cpp/trivial_abi/TestTrivialABI.py
  lldb-api :: lang/cpp/type_lookup/TestCppTypeLookup.py
  lldb-api :: lang/cpp/typedef/TestCppTypedef.py
  lldb-api :: lang/cpp/unique-types/TestUniqueTypes.py
  lldb-api :: lang/cpp/unsigned_types/TestUnsignedTypes.py
  lldb-api :: lang/cpp/virtual-functions/TestCppVirtualFunctions.py
  lldb-api :: lang/cpp/virtual-overload/TestVirtualOverload.py
  lldb-api :: lang/mixed/TestMixedLanguages.py
  lldb-api :: lang/objc/bitfield_ivars/TestBitfieldIvars.py
  lldb-api :: lang/objc/blocks/TestObjCIvarsInBlocks.py
  lldb-api :: lang/objc/conflicting-definition/TestConflictingDefinition.py
  lldb-api :: lang/objc/cpp_keyword_identifiers/TestCppKeywordsAsObjCIdentifiers.py
  lldb-api :: lang/objc/direct-dispatch-step/TestObjCDirectDispatchStepping.py
  lldb-api :: lang/objc/exceptions/TestObjCExceptions.py
  lldb-api :: lang/objc/forward-decl/TestForwardDecl.py
  lldb-api :: lang/objc/foundation/TestConstStrings.py
  lldb-api :: lang/objc/foundation/TestFoundationDisassembly.py
  lldb-api :: lang/objc/foundation/TestObjCMethods.py
  lldb-api :: lang/objc/foundation/TestObjCMethods2.py
  lldb-api :: lang/objc/foundation/TestObjCMethodsNSArray.py
  lldb-api :: lang/objc/foundation/TestObjCMethodsNSError.py
  lldb-api :: lang/objc/foundation/TestObjCMethodsString.py
  lldb-api :: lang/objc/foundation/TestObjectDescriptionAPI.py
  lldb-api :: lang/objc/foundation/TestRuntimeTypes.py
  lldb-api :: lang/objc/global_ptrs/TestGlobalObjects.py
  lldb-api :: lang/objc/hidden-ivars/TestHiddenIvars.py
  lldb-api :: lang/objc/ivar-IMP/TestObjCiVarIMP.py
  lldb-api :: lang/objc/modules-auto-import/TestModulesAutoImport.py
  lldb-api :: lang/objc/modules-cache/TestClangModulesCache.py
  lldb-api :: lang/objc/modules-compile-error/TestModulesCompileError.py
  lldb-api :: lang/objc/modules-inline-functions/TestModulesInlineFunctions.py
  lldb-api :: lang/objc/modules-non-objc-target/TestObjCModulesNonObjCTarget.py
  lldb-api :: lang/objc/modules-objc-property/TestModulesObjCProperty.py
  lldb-api :: lang/objc/modules/TestObjCModules.py
  lldb-api :: lang/objc/objc++/TestObjCXX.py
  lldb-api :: lang/objc/objc-baseclass-sbtype/TestObjCBaseClassSBType.py
  lldb-api :: lang/objc/objc-checker/TestObjCCheckers.py
  lldb-api :: lang/objc/objc-class-method/TestObjCClassMethod.py
  lldb-api :: lang/objc/objc-dyn-sbtype/TestObjCDynamicSBType.py
  lldb-api :: lang/objc/objc-foundation-dictionary-empty/TestNSDictionary0.py
  lldb-api :: lang/objc/objc-ivar-offsets/TestObjCIvarOffsets.py
  lldb-api :: lang/objc/objc-ivar-protocols/TestIvarProtocols.py
  lldb-api :: lang/objc/objc-ivar-stripped/TestObjCIvarStripped.py
  lldb-api :: lang/objc/objc-new-syntax/TestObjCNewSyntaxArray.py
  lldb-api :: lang/objc/objc-new-syntax/TestObjCNewSyntaxDictionary.py
  lldb-api :: lang/objc/objc-new-syntax/TestObjCNewSyntaxLiteral.py
  lldb-api :: lang/objc/objc-optimized/TestObjcOptimized.py
  lldb-api :: lang/objc/objc-property/TestObjCProperty.py
  lldb-api :: lang/objc/objc-runtime-ivars/TestRuntimeIvars.py
  lldb-api :: lang/objc/objc-static-method-stripped/TestObjCStaticMethodStripped.py
  lldb-api :: lang/objc/objc-static-method/TestObjCStaticMethod.py
  lldb-api :: lang/objc/objc-stepping/TestObjCStepping.py
  lldb-api :: lang/objc/objc-struct-argument/TestObjCStructArgument.py
  lldb-api :: lang/objc/objc-struct-return/TestObjCStructReturn.py
  lldb-api :: lang/objc/objc-super/TestObjCSuper.py
  lldb-api :: lang/objc/objc_direct-methods/TestObjCDirectMethods.py
  lldb-api :: lang/objc/orderedset/TestOrderedSet.py
  lldb-api :: lang/objc/print-obj/TestPrintObj.py
  lldb-api :: lang/objc/ptr_refs/TestPtrRefsObjC.py
  lldb-api :: lang/objc/radar-9691614/TestObjCMethodReturningBOOL.py
  lldb-api :: lang/objc/rdar-10967107/TestRdar10967107.py
  lldb-api :: lang/objc/rdar-11355592/TestRdar11355592.py
  lldb-api :: lang/objc/real-definition/TestRealDefinition.py
  lldb-api :: lang/objc/self/TestObjCSelf.py
  lldb-api :: lang/objc/single-entry-dictionary/TestObjCSingleEntryDictionary.py
  lldb-api :: lang/objc/unicode-string/TestUnicodeString.py
  lldb-api :: lang/objc/variadic_methods/TestVariadicMethods.py
  lldb-api :: lang/objc/warnings-in-expr-parser/TestObjCWarningsInExprParser.py
  lldb-api :: lang/objcxx/class-name-clash/TestNameClash.py
  lldb-api :: lang/objcxx/cxx-bridged-po/TestObjCXXBridgedPO.py
  lldb-api :: lang/objcxx/hide-runtime-values/TestObjCXXHideRuntimeValues.py
  lldb-api :: lang/objcxx/objc-builtin-types/TestObjCBuiltinTypes.py
  lldb-api :: lang/objcxx/objcxx-ivar-vector/TestIvarVector.py
  lldb-api :: linux/builtin_trap/TestBuiltinTrap.py
  lldb-api :: macosx/DBGSourcePathRemapping/TestDSYMSourcePathRemapping.py
  lldb-api :: macosx/add-dsym/TestAddDsymMidExecutionCommand.py
  lldb-api :: macosx/builtin-debugtrap/TestBuiltinDebugTrap.py
  lldb-api :: macosx/duplicate-archive-members/TestDuplicateMembers.py
  lldb-api :: macosx/find-app-in-bundle/TestFindAppInBundle.py
  lldb-api :: macosx/find-dsym/bundle-with-dot-in-filename/TestBundleWithDotInFilename.py
  lldb-api :: macosx/find-dsym/deep-bundle/TestDeepBundle.py
  lldb-api :: macosx/indirect_symbol/TestIndirectSymbols.py
  lldb-api :: macosx/macCatalyst/TestMacCatalyst.py
  lldb-api :: macosx/nslog/TestDarwinNSLogOutput.py
  lldb-api :: macosx/profile_vrs_detach/TestDetachVrsProfile.py
  lldb-api :: macosx/queues/TestQueues.py
  lldb-api :: macosx/save_crashlog/TestSaveCrashlog.py
  lldb-api :: macosx/thread_suspend/TestInternalThreadSuspension.py
  lldb-api :: python_api/class_members/TestSBTypeClassMembers.py
  lldb-api :: python_api/exprpath_synthetic/TestExprPathSynthetic.py
  lldb-api :: python_api/findvalue_duplist/TestSBFrameFindValue.py
  lldb-api :: python_api/formatters/TestFormattersSBAPI.py
  lldb-api :: python_api/frame/TestFrames.py
  lldb-api :: python_api/frame/get-variables/TestGetVariables.py
  lldb-api :: python_api/frame/inlines/TestInlinedFrame.py
  lldb-api :: python_api/function_symbol/TestDisasmAPI.py
  lldb-api :: python_api/function_symbol/TestSymbolAPI.py
  lldb-api :: python_api/get-value-32bit-int/TestGetValue32BitInt.py
  lldb-api :: python_api/hello_world/TestHelloWorld.py
  lldb-api :: python_api/interpreter/TestCommandInterpreterAPI.py
  lldb-api :: python_api/lldbutil/frame/TestFrameUtils.py
  lldb-api :: python_api/lldbutil/process/TestPrintStackTraces.py
  lldb-api :: python_api/name_lookup/TestNameLookup.py
  lldb-api :: python_api/objc_type/TestObjCType.py
  lldb-api :: python_api/process/TestProcessAPI.py
  lldb-api :: python_api/process/io/TestProcessIO.py
  lldb-api :: python_api/process/read-mem-cstring/TestReadMemCString.py
  lldb-api :: python_api/sbdata/TestSBData.py
  lldb-api :: python_api/sbtype_typeclass/TestSBTypeTypeClass.py
  lldb-api :: python_api/sbvalue_const_addrof/TestSBValueConstAddrOf.py
  lldb-api :: python_api/sbvalue_persist/TestSBValuePersist.py
  lldb-api :: python_api/signals/TestSignalsAPI.py
  lldb-api :: python_api/symbol-context/TestSymbolContext.py
  lldb-api :: python_api/symbol-context/two-files/TestSymbolContextTwoFiles.py
  lldb-api :: python_api/target/TestTargetAPI.py
  lldb-api :: python_api/thread/TestThreadAPI.py
  lldb-api :: python_api/type/TestTypeList.py
  lldb-api :: python_api/value/TestValueAPI.py
  lldb-api :: python_api/value/change_values/TestChangeValueAPI.py
  lldb-api :: python_api/value/empty_class/TestValueAPIEmptyClass.py
  lldb-api :: python_api/value/linked_list/TestValueAPILinkedList.py
  lldb-api :: python_api/value_var_update/TestValueVarUpdate.py
  lldb-api :: sample_test/TestSampleInlineTest.py
  lldb-api :: sample_test/TestSampleTest.py
  lldb-api :: source-manager/TestSourceManager.py
  lldb-api :: tools/lldb-vscode/attach/TestVSCode_attach.py
  lldb-api :: tools/lldb-vscode/breakpoint-events/TestVSCode_breakpointEvents.py
  lldb-api :: tools/lldb-vscode/breakpoint/TestVSCode_setBreakpoints.py
  lldb-api :: tools/lldb-vscode/console/TestVSCode_console.py
  lldb-api :: tools/lldb-vscode/console/TestVSCode_redirection_to_console.py
  lldb-api :: tools/lldb-vscode/evaluate/TestVSCode_evaluate.py
  lldb-api :: tools/lldb-vscode/launch/TestVSCode_launch.py
  lldb-api :: tools/lldb-vscode/module/TestVSCode_module.py
  lldb-api :: tools/lldb-vscode/runInTerminal/TestVSCode_runInTerminal.py
  lldb-api :: tools/lldb-vscode/stackTrace/TestVSCode_stackTrace.py
  lldb-api :: tools/lldb-vscode/step/TestVSCode_step.py
  lldb-api :: tools/lldb-vscode/variables/TestVSCode_variables.py
  lldb-api :: types/TestCharType.py
  lldb-api :: types/TestCharTypeExpr.py
  lldb-api :: types/TestDoubleTypes.py
  lldb-api :: types/TestDoubleTypesExpr.py
  lldb-api :: types/TestFloatTypes.py
  lldb-api :: types/TestFloatTypesExpr.py
  lldb-api :: types/TestIntegerType.py
  lldb-api :: types/TestIntegerTypeExpr.py
  lldb-api :: types/TestLongTypes.py
  lldb-api :: types/TestLongTypesExpr.py
  lldb-api :: types/TestRecursiveTypes.py
  lldb-api :: types/TestShortType.py
  lldb-api :: types/TestShortTypeExpr.py


Testing Time: 730.54s
  Unsupported      :  295
  Passed           : 1448
  Expectedly Failed:    9
  Timed Out        :    3
  Failed           :  584
FAILED: tools/lldb/test/CMakeFiles/check-lldb 
cd /Users/buildslave/jenkins/workspace/lldb-cmake-matrix/lldb-build/tools/lldb/test && /usr/local/Frameworks/Python.framework/Versions/3.7/bin/python3.7 /Users/buildslave/jenkins/workspace/lldb-cmake-matrix/lldb-build/./bin/llvm-lit -v --time-tests --shuffle --xunit-xml-output=/Users/buildslave/jenkins/workspace/lldb-cmake-matrix/test/results.xml -v /Users/buildslave/jenkins/workspace/lldb-cmake-matrix/lldb-build/tools/lldb/test
ninja: build stopped: subcommand failed.
Command failed: Command '['/usr/bin/env', 'TERM=vt100', '/usr/local/bin/ninja', '-v', 'check-lldb']' returned non-zero exit status 1.
Command: ['/usr/bin/env', 'TERM=vt100', '/usr/local/bin/ninja', '-v', 'check-lldb']
+ set -e