Console Output

Skipping 15,343 KB.. Full Log
warning: unknown warning option '-Wno-suggest-override'; did you mean '-Wno-shift-overflow'? [-Wunknown-warning-option]
1 warning generated.

Hide Details

CompileC /Users/buildslave/jenkins/workspace/lldb-cmake-standalone/lldb-xcode-build/unittests/Utility/lldb.build/Release/UtilityTests.build/Objects-normal/x86_64/TildeExpressionResolverTest.o unittests/Utility/TildeExpressionResolverTest.cpp normal x86_64 c++ com.apple.compilers.llvm.clang.1_0.compiler cd /Users/buildslave/jenkins/workspace/lldb-cmake-standalone/llvm-project/lldb /Applications/Xcode.app/Contents/Developer/Toolchains/XcodeDefault.xctoolchain/usr/bin/clang -x c++ -target x86_64-apple-macos10.12 -fmessage-length=0 -fdiagnostics-show-note-include-stack -fmacro-backtrace-limit=0 -Wno-trigraphs -fpascal-strings -O3 -Wno-missing-field-initializers -Wno-missing-prototypes -Wnon-virtual-dtor -Woverloaded-virtual -Wno-exit-time-destructors -Wmissing-braces -Wparentheses -Wswitch -Wunused-function -Wno-unused-label -Wno-unused-parameter -Wunused-variable -Wunused-value -Wempty-body -Wuninitialized -Wno-unknown-pragmas -Wno-shadow -Wno-four-char-constants -Wno-conversion -Wconstant-conversion -Wint-conversion -Wbool-conversion -Wenum-conversion -Wno-float-conversion -Wno-non-literal-null-conversion -Wno-objc-literal-conversion -Wsign-compare -Wno-shorten-64-to-32 -Wnewline-eof -Wno-c++11-extensions -DCMAKE_INTDIR=\"Release\" -DGTEST_HAS_RTTI=0 -D_DEBUG -D__STDC_CONSTANT_MACROS -D__STDC_FORMAT_MACROS -D__STDC_LIMIT_MACROS -DHAVE_ROUND -isysroot /Applications/Xcode.app/Contents/Developer/Platforms/MacOSX.platform/Developer/SDKs/MacOSX10.15.sdk -fasm-blocks -fstrict-aliasing -Wdeprecated-declarations -Winvalid-offsetof -Wno-sign-conversion -Wno-infinite-recursion -Wno-move -Wno-comma -Wno-block-capture-autoreleasing -Wno-strict-prototypes -Wno-range-loop-analysis -Wno-semicolon-before-method-body -I/Users/buildslave/jenkins/workspace/lldb-cmake-standalone/lldb-xcode-build/unittests/Utility/Release/include -I/Users/buildslave/jenkins/workspace/lldb-cmake-standalone/lldb-xcode-build/unittests/Utility -I/Users/buildslave/jenkins/workspace/lldb-cmake-standalone/llvm-project/lldb/unittests/Utility -I/Users/buildslave/jenkins/workspace/lldb-cmake-standalone/llvm-project/lldb/include -I/Users/buildslave/jenkins/workspace/lldb-cmake-standalone/lldb-xcode-build/include -I/Users/buildslave/jenkins/workspace/lldb-cmake-standalone/llvm-project/llvm/include -I/Users/buildslave/jenkins/workspace/lldb-cmake-standalone/clang-build/include -I/Users/buildslave/jenkins/workspace/lldb-cmake-standalone/llvm-project/clang/include -I/Users/buildslave/jenkins/workspace/lldb-cmake-standalone/clang-build/tools/clang/include -I/usr/local/Cellar/python/3.7.0/Frameworks/Python.framework/Versions/3.7/include/python3.7m -I/Users/buildslave/jenkins/workspace/lldb-cmake-standalone/llvm-project/lldb/tools/clang/include -I/Users/buildslave/jenkins/workspace/lldb-cmake-standalone/lldb-xcode-build/../clang/include -I/usr/local/include -I/Applications/Xcode.app/Contents/Developer/Platforms/MacOSX.platform/Developer/SDKs/MacOSX10.15.sdk/usr/include/libxml2 -I/Users/buildslave/jenkins/workspace/lldb-cmake-standalone/llvm-project/lldb/source -I/Users/buildslave/jenkins/workspace/lldb-cmake-standalone/llvm-project/lldb/unittests -isystem /Users/buildslave/jenkins/workspace/lldb-cmake-standalone/llvm-project/llvm/utils/unittest/googletest/include -isystem /Users/buildslave/jenkins/workspace/lldb-cmake-standalone/llvm-project/llvm/utils/unittest/googlemock/include -I/Users/buildslave/jenkins/workspace/lldb-cmake-standalone/lldb-xcode-build/unittests/Utility/lldb.build/Release/UtilityTests.build/DerivedSources-normal/x86_64 -I/Users/buildslave/jenkins/workspace/lldb-cmake-standalone/lldb-xcode-build/unittests/Utility/lldb.build/Release/UtilityTests.build/DerivedSources/x86_64 -I/Users/buildslave/jenkins/workspace/lldb-cmake-standalone/lldb-xcode-build/unittests/Utility/lldb.build/Release/UtilityTests.build/DerivedSources -F/Users/buildslave/jenkins/workspace/lldb-cmake-standalone/lldb-xcode-build/unittests/Utility/Release -fvisibility-inlines-hidden -Werror=date-time -Werror=unguarded-availability-new -Wall -Wextra -Wno-unused-parameter -Wwrite-strings -Wcast-qual -Wmissing-field-initializers -Wimplicit-fallthrough -Wcovered-switch-default -Wno-noexcept-type -Wnon-virtual-dtor -Wdelete-non-virtual-dtor -Wstring-conversion -Wno-deprecated-declarations -Wno-unknown-pragmas -Wno-strict-aliasing -Wno-deprecated-register -Wno-vla-extension -DNDEBUG -include /Users/buildslave/jenkins/workspace/lldb-cmake-standalone/llvm-project/lldb/unittests/gtest_common.h -fno-exceptions -fno-rtti -UNDEBUG -Wno-suggest-override -std=c++14 -MMD -MT dependencies -MF /Users/buildslave/jenkins/workspace/lldb-cmake-standalone/lldb-xcode-build/unittests/Utility/lldb.build/Release/UtilityTests.build/Objects-normal/x86_64/TildeExpressionResolverTest.d --serialize-diagnostics /Users/buildslave/jenkins/workspace/lldb-cmake-standalone/lldb-xcode-build/unittests/Utility/lldb.build/Release/UtilityTests.build/Objects-normal/x86_64/TildeExpressionResolverTest.dia -c /Users/buildslave/jenkins/workspace/lldb-cmake-standalone/llvm-project/lldb/unittests/Utility/TildeExpressionResolverTest.cpp -o /Users/buildslave/jenkins/workspace/lldb-cmake-standalone/lldb-xcode-build/unittests/Utility/lldb.build/Release/UtilityTests.build/Objects-normal/x86_64/TildeExpressionResolverTest.o warning: unknown warning option '-Wno-suggest-override'; did you mean '-Wno-shift-overflow'? [-Wunknown-warning-option] 1 warning generated.

Hide Details

CompileC /Users/buildslave/jenkins/workspace/lldb-cmake-standalone/lldb-xcode-build/unittests/Utility/lldb.build/Release/UtilityTests.build/Objects-normal/x86_64/TimeoutTest.o unittests/Utility/TimeoutTest.cpp normal x86_64 c++ com.apple.compilers.llvm.clang.1_0.compiler cd /Users/buildslave/jenkins/workspace/lldb-cmake-standalone/llvm-project/lldb /Applications/Xcode.app/Contents/Developer/Toolchains/XcodeDefault.xctoolchain/usr/bin/clang -x c++ -target x86_64-apple-macos10.12 -fmessage-length=0 -fdiagnostics-show-note-include-stack -fmacro-backtrace-limit=0 -Wno-trigraphs -fpascal-strings -O3 -Wno-missing-field-initializers -Wno-missing-prototypes -Wnon-virtual-dtor -Woverloaded-virtual -Wno-exit-time-destructors -Wmissing-braces -Wparentheses -Wswitch -Wunused-function -Wno-unused-label -Wno-unused-parameter -Wunused-variable -Wunused-value -Wempty-body -Wuninitialized -Wno-unknown-pragmas -Wno-shadow -Wno-four-char-constants -Wno-conversion -Wconstant-conversion -Wint-conversion -Wbool-conversion -Wenum-conversion -Wno-float-conversion -Wno-non-literal-null-conversion -Wno-objc-literal-conversion -Wsign-compare -Wno-shorten-64-to-32 -Wnewline-eof -Wno-c++11-extensions -DCMAKE_INTDIR=\"Release\" -DGTEST_HAS_RTTI=0 -D_DEBUG -D__STDC_CONSTANT_MACROS -D__STDC_FORMAT_MACROS -D__STDC_LIMIT_MACROS -DHAVE_ROUND -isysroot /Applications/Xcode.app/Contents/Developer/Platforms/MacOSX.platform/Developer/SDKs/MacOSX10.15.sdk -fasm-blocks -fstrict-aliasing -Wdeprecated-declarations -Winvalid-offsetof -Wno-sign-conversion -Wno-infinite-recursion -Wno-move -Wno-comma -Wno-block-capture-autoreleasing -Wno-strict-prototypes -Wno-range-loop-analysis -Wno-semicolon-before-method-body -I/Users/buildslave/jenkins/workspace/lldb-cmake-standalone/lldb-xcode-build/unittests/Utility/Release/include -I/Users/buildslave/jenkins/workspace/lldb-cmake-standalone/lldb-xcode-build/unittests/Utility -I/Users/buildslave/jenkins/workspace/lldb-cmake-standalone/llvm-project/lldb/unittests/Utility -I/Users/buildslave/jenkins/workspace/lldb-cmake-standalone/llvm-project/lldb/include -I/Users/buildslave/jenkins/workspace/lldb-cmake-standalone/lldb-xcode-build/include -I/Users/buildslave/jenkins/workspace/lldb-cmake-standalone/llvm-project/llvm/include -I/Users/buildslave/jenkins/workspace/lldb-cmake-standalone/clang-build/include -I/Users/buildslave/jenkins/workspace/lldb-cmake-standalone/llvm-project/clang/include -I/Users/buildslave/jenkins/workspace/lldb-cmake-standalone/clang-build/tools/clang/include -I/usr/local/Cellar/python/3.7.0/Frameworks/Python.framework/Versions/3.7/include/python3.7m -I/Users/buildslave/jenkins/workspace/lldb-cmake-standalone/llvm-project/lldb/tools/clang/include -I/Users/buildslave/jenkins/workspace/lldb-cmake-standalone/lldb-xcode-build/../clang/include -I/usr/local/include -I/Applications/Xcode.app/Contents/Developer/Platforms/MacOSX.platform/Developer/SDKs/MacOSX10.15.sdk/usr/include/libxml2 -I/Users/buildslave/jenkins/workspace/lldb-cmake-standalone/llvm-project/lldb/source -I/Users/buildslave/jenkins/workspace/lldb-cmake-standalone/llvm-project/lldb/unittests -isystem /Users/buildslave/jenkins/workspace/lldb-cmake-standalone/llvm-project/llvm/utils/unittest/googletest/include -isystem /Users/buildslave/jenkins/workspace/lldb-cmake-standalone/llvm-project/llvm/utils/unittest/googlemock/include -I/Users/buildslave/jenkins/workspace/lldb-cmake-standalone/lldb-xcode-build/unittests/Utility/lldb.build/Release/UtilityTests.build/DerivedSources-normal/x86_64 -I/Users/buildslave/jenkins/workspace/lldb-cmake-standalone/lldb-xcode-build/unittests/Utility/lldb.build/Release/UtilityTests.build/DerivedSources/x86_64 -I/Users/buildslave/jenkins/workspace/lldb-cmake-standalone/lldb-xcode-build/unittests/Utility/lldb.build/Release/UtilityTests.build/DerivedSources -F/Users/buildslave/jenkins/workspace/lldb-cmake-standalone/lldb-xcode-build/unittests/Utility/Release -fvisibility-inlines-hidden -Werror=date-time -Werror=unguarded-availability-new -Wall -Wextra -Wno-unused-parameter -Wwrite-strings -Wcast-qual -Wmissing-field-initializers -Wimplicit-fallthrough -Wcovered-switch-default -Wno-noexcept-type -Wnon-virtual-dtor -Wdelete-non-virtual-dtor -Wstring-conversion -Wno-deprecated-declarations -Wno-unknown-pragmas -Wno-strict-aliasing -Wno-deprecated-register -Wno-vla-extension -DNDEBUG -include /Users/buildslave/jenkins/workspace/lldb-cmake-standalone/llvm-project/lldb/unittests/gtest_common.h -fno-exceptions -fno-rtti -UNDEBUG -Wno-suggest-override -std=c++14 -MMD -MT dependencies -MF /Users/buildslave/jenkins/workspace/lldb-cmake-standalone/lldb-xcode-build/unittests/Utility/lldb.build/Release/UtilityTests.build/Objects-normal/x86_64/TimeoutTest.d --serialize-diagnostics /Users/buildslave/jenkins/workspace/lldb-cmake-standalone/lldb-xcode-build/unittests/Utility/lldb.build/Release/UtilityTests.build/Objects-normal/x86_64/TimeoutTest.dia -c /Users/buildslave/jenkins/workspace/lldb-cmake-standalone/llvm-project/lldb/unittests/Utility/TimeoutTest.cpp -o /Users/buildslave/jenkins/workspace/lldb-cmake-standalone/lldb-xcode-build/unittests/Utility/lldb.build/Release/UtilityTests.build/Objects-normal/x86_64/TimeoutTest.o warning: unknown warning option '-Wno-suggest-override'; did you mean '-Wno-shift-overflow'? [-Wunknown-warning-option] 1 warning generated.

Hide Details

CompileC /Users/buildslave/jenkins/workspace/lldb-cmake-standalone/lldb-xcode-build/unittests/Utility/lldb.build/Release/UtilityTests.build/Objects-normal/x86_64/TimerTest.o unittests/Utility/TimerTest.cpp normal x86_64 c++ com.apple.compilers.llvm.clang.1_0.compiler cd /Users/buildslave/jenkins/workspace/lldb-cmake-standalone/llvm-project/lldb /Applications/Xcode.app/Contents/Developer/Toolchains/XcodeDefault.xctoolchain/usr/bin/clang -x c++ -target x86_64-apple-macos10.12 -fmessage-length=0 -fdiagnostics-show-note-include-stack -fmacro-backtrace-limit=0 -Wno-trigraphs -fpascal-strings -O3 -Wno-missing-field-initializers -Wno-missing-prototypes -Wnon-virtual-dtor -Woverloaded-virtual -Wno-exit-time-destructors -Wmissing-braces -Wparentheses -Wswitch -Wunused-function -Wno-unused-label -Wno-unused-parameter -Wunused-variable -Wunused-value -Wempty-body -Wuninitialized -Wno-unknown-pragmas -Wno-shadow -Wno-four-char-constants -Wno-conversion -Wconstant-conversion -Wint-conversion -Wbool-conversion -Wenum-conversion -Wno-float-conversion -Wno-non-literal-null-conversion -Wno-objc-literal-conversion -Wsign-compare -Wno-shorten-64-to-32 -Wnewline-eof -Wno-c++11-extensions -DCMAKE_INTDIR=\"Release\" -DGTEST_HAS_RTTI=0 -D_DEBUG -D__STDC_CONSTANT_MACROS -D__STDC_FORMAT_MACROS -D__STDC_LIMIT_MACROS -DHAVE_ROUND -isysroot /Applications/Xcode.app/Contents/Developer/Platforms/MacOSX.platform/Developer/SDKs/MacOSX10.15.sdk -fasm-blocks -fstrict-aliasing -Wdeprecated-declarations -Winvalid-offsetof -Wno-sign-conversion -Wno-infinite-recursion -Wno-move -Wno-comma -Wno-block-capture-autoreleasing -Wno-strict-prototypes -Wno-range-loop-analysis -Wno-semicolon-before-method-body -I/Users/buildslave/jenkins/workspace/lldb-cmake-standalone/lldb-xcode-build/unittests/Utility/Release/include -I/Users/buildslave/jenkins/workspace/lldb-cmake-standalone/lldb-xcode-build/unittests/Utility -I/Users/buildslave/jenkins/workspace/lldb-cmake-standalone/llvm-project/lldb/unittests/Utility -I/Users/buildslave/jenkins/workspace/lldb-cmake-standalone/llvm-project/lldb/include -I/Users/buildslave/jenkins/workspace/lldb-cmake-standalone/lldb-xcode-build/include -I/Users/buildslave/jenkins/workspace/lldb-cmake-standalone/llvm-project/llvm/include -I/Users/buildslave/jenkins/workspace/lldb-cmake-standalone/clang-build/include -I/Users/buildslave/jenkins/workspace/lldb-cmake-standalone/llvm-project/clang/include -I/Users/buildslave/jenkins/workspace/lldb-cmake-standalone/clang-build/tools/clang/include -I/usr/local/Cellar/python/3.7.0/Frameworks/Python.framework/Versions/3.7/include/python3.7m -I/Users/buildslave/jenkins/workspace/lldb-cmake-standalone/llvm-project/lldb/tools/clang/include -I/Users/buildslave/jenkins/workspace/lldb-cmake-standalone/lldb-xcode-build/../clang/include -I/usr/local/include -I/Applications/Xcode.app/Contents/Developer/Platforms/MacOSX.platform/Developer/SDKs/MacOSX10.15.sdk/usr/include/libxml2 -I/Users/buildslave/jenkins/workspace/lldb-cmake-standalone/llvm-project/lldb/source -I/Users/buildslave/jenkins/workspace/lldb-cmake-standalone/llvm-project/lldb/unittests -isystem /Users/buildslave/jenkins/workspace/lldb-cmake-standalone/llvm-project/llvm/utils/unittest/googletest/include -isystem /Users/buildslave/jenkins/workspace/lldb-cmake-standalone/llvm-project/llvm/utils/unittest/googlemock/include -I/Users/buildslave/jenkins/workspace/lldb-cmake-standalone/lldb-xcode-build/unittests/Utility/lldb.build/Release/UtilityTests.build/DerivedSources-normal/x86_64 -I/Users/buildslave/jenkins/workspace/lldb-cmake-standalone/lldb-xcode-build/unittests/Utility/lldb.build/Release/UtilityTests.build/DerivedSources/x86_64 -I/Users/buildslave/jenkins/workspace/lldb-cmake-standalone/lldb-xcode-build/unittests/Utility/lldb.build/Release/UtilityTests.build/DerivedSources -F/Users/buildslave/jenkins/workspace/lldb-cmake-standalone/lldb-xcode-build/unittests/Utility/Release -fvisibility-inlines-hidden -Werror=date-time -Werror=unguarded-availability-new -Wall -Wextra -Wno-unused-parameter -Wwrite-strings -Wcast-qual -Wmissing-field-initializers -Wimplicit-fallthrough -Wcovered-switch-default -Wno-noexcept-type -Wnon-virtual-dtor -Wdelete-non-virtual-dtor -Wstring-conversion -Wno-deprecated-declarations -Wno-unknown-pragmas -Wno-strict-aliasing -Wno-deprecated-register -Wno-vla-extension -DNDEBUG -include /Users/buildslave/jenkins/workspace/lldb-cmake-standalone/llvm-project/lldb/unittests/gtest_common.h -fno-exceptions -fno-rtti -UNDEBUG -Wno-suggest-override -std=c++14 -MMD -MT dependencies -MF /Users/buildslave/jenkins/workspace/lldb-cmake-standalone/lldb-xcode-build/unittests/Utility/lldb.build/Release/UtilityTests.build/Objects-normal/x86_64/TimerTest.d --serialize-diagnostics /Users/buildslave/jenkins/workspace/lldb-cmake-standalone/lldb-xcode-build/unittests/Utility/lldb.build/Release/UtilityTests.build/Objects-normal/x86_64/TimerTest.dia -c /Users/buildslave/jenkins/workspace/lldb-cmake-standalone/llvm-project/lldb/unittests/Utility/TimerTest.cpp -o /Users/buildslave/jenkins/workspace/lldb-cmake-standalone/lldb-xcode-build/unittests/Utility/lldb.build/Release/UtilityTests.build/Objects-normal/x86_64/TimerTest.o warning: unknown warning option '-Wno-suggest-override'; did you mean '-Wno-shift-overflow'? [-Wunknown-warning-option] 1 warning generated.

Hide Details

CompileC /Users/buildslave/jenkins/workspace/lldb-cmake-standalone/lldb-xcode-build/unittests/Utility/lldb.build/Release/UtilityTests.build/Objects-normal/x86_64/UUIDTest.o unittests/Utility/UUIDTest.cpp normal x86_64 c++ com.apple.compilers.llvm.clang.1_0.compiler cd /Users/buildslave/jenkins/workspace/lldb-cmake-standalone/llvm-project/lldb /Applications/Xcode.app/Contents/Developer/Toolchains/XcodeDefault.xctoolchain/usr/bin/clang -x c++ -target x86_64-apple-macos10.12 -fmessage-length=0 -fdiagnostics-show-note-include-stack -fmacro-backtrace-limit=0 -Wno-trigraphs -fpascal-strings -O3 -Wno-missing-field-initializers -Wno-missing-prototypes -Wnon-virtual-dtor -Woverloaded-virtual -Wno-exit-time-destructors -Wmissing-braces -Wparentheses -Wswitch -Wunused-function -Wno-unused-label -Wno-unused-parameter -Wunused-variable -Wunused-value -Wempty-body -Wuninitialized -Wno-unknown-pragmas -Wno-shadow -Wno-four-char-constants -Wno-conversion -Wconstant-conversion -Wint-conversion -Wbool-conversion -Wenum-conversion -Wno-float-conversion -Wno-non-literal-null-conversion -Wno-objc-literal-conversion -Wsign-compare -Wno-shorten-64-to-32 -Wnewline-eof -Wno-c++11-extensions -DCMAKE_INTDIR=\"Release\" -DGTEST_HAS_RTTI=0 -D_DEBUG -D__STDC_CONSTANT_MACROS -D__STDC_FORMAT_MACROS -D__STDC_LIMIT_MACROS -DHAVE_ROUND -isysroot /Applications/Xcode.app/Contents/Developer/Platforms/MacOSX.platform/Developer/SDKs/MacOSX10.15.sdk -fasm-blocks -fstrict-aliasing -Wdeprecated-declarations -Winvalid-offsetof -Wno-sign-conversion -Wno-infinite-recursion -Wno-move -Wno-comma -Wno-block-capture-autoreleasing -Wno-strict-prototypes -Wno-range-loop-analysis -Wno-semicolon-before-method-body -I/Users/buildslave/jenkins/workspace/lldb-cmake-standalone/lldb-xcode-build/unittests/Utility/Release/include -I/Users/buildslave/jenkins/workspace/lldb-cmake-standalone/lldb-xcode-build/unittests/Utility -I/Users/buildslave/jenkins/workspace/lldb-cmake-standalone/llvm-project/lldb/unittests/Utility -I/Users/buildslave/jenkins/workspace/lldb-cmake-standalone/llvm-project/lldb/include -I/Users/buildslave/jenkins/workspace/lldb-cmake-standalone/lldb-xcode-build/include -I/Users/buildslave/jenkins/workspace/lldb-cmake-standalone/llvm-project/llvm/include -I/Users/buildslave/jenkins/workspace/lldb-cmake-standalone/clang-build/include -I/Users/buildslave/jenkins/workspace/lldb-cmake-standalone/llvm-project/clang/include -I/Users/buildslave/jenkins/workspace/lldb-cmake-standalone/clang-build/tools/clang/include -I/usr/local/Cellar/python/3.7.0/Frameworks/Python.framework/Versions/3.7/include/python3.7m -I/Users/buildslave/jenkins/workspace/lldb-cmake-standalone/llvm-project/lldb/tools/clang/include -I/Users/buildslave/jenkins/workspace/lldb-cmake-standalone/lldb-xcode-build/../clang/include -I/usr/local/include -I/Applications/Xcode.app/Contents/Developer/Platforms/MacOSX.platform/Developer/SDKs/MacOSX10.15.sdk/usr/include/libxml2 -I/Users/buildslave/jenkins/workspace/lldb-cmake-standalone/llvm-project/lldb/source -I/Users/buildslave/jenkins/workspace/lldb-cmake-standalone/llvm-project/lldb/unittests -isystem /Users/buildslave/jenkins/workspace/lldb-cmake-standalone/llvm-project/llvm/utils/unittest/googletest/include -isystem /Users/buildslave/jenkins/workspace/lldb-cmake-standalone/llvm-project/llvm/utils/unittest/googlemock/include -I/Users/buildslave/jenkins/workspace/lldb-cmake-standalone/lldb-xcode-build/unittests/Utility/lldb.build/Release/UtilityTests.build/DerivedSources-normal/x86_64 -I/Users/buildslave/jenkins/workspace/lldb-cmake-standalone/lldb-xcode-build/unittests/Utility/lldb.build/Release/UtilityTests.build/DerivedSources/x86_64 -I/Users/buildslave/jenkins/workspace/lldb-cmake-standalone/lldb-xcode-build/unittests/Utility/lldb.build/Release/UtilityTests.build/DerivedSources -F/Users/buildslave/jenkins/workspace/lldb-cmake-standalone/lldb-xcode-build/unittests/Utility/Release -fvisibility-inlines-hidden -Werror=date-time -Werror=unguarded-availability-new -Wall -Wextra -Wno-unused-parameter -Wwrite-strings -Wcast-qual -Wmissing-field-initializers -Wimplicit-fallthrough -Wcovered-switch-default -Wno-noexcept-type -Wnon-virtual-dtor -Wdelete-non-virtual-dtor -Wstring-conversion -Wno-deprecated-declarations -Wno-unknown-pragmas -Wno-strict-aliasing -Wno-deprecated-register -Wno-vla-extension -DNDEBUG -include /Users/buildslave/jenkins/workspace/lldb-cmake-standalone/llvm-project/lldb/unittests/gtest_common.h -fno-exceptions -fno-rtti -UNDEBUG -Wno-suggest-override -std=c++14 -MMD -MT dependencies -MF /Users/buildslave/jenkins/workspace/lldb-cmake-standalone/lldb-xcode-build/unittests/Utility/lldb.build/Release/UtilityTests.build/Objects-normal/x86_64/UUIDTest.d --serialize-diagnostics /Users/buildslave/jenkins/workspace/lldb-cmake-standalone/lldb-xcode-build/unittests/Utility/lldb.build/Release/UtilityTests.build/Objects-normal/x86_64/UUIDTest.dia -c /Users/buildslave/jenkins/workspace/lldb-cmake-standalone/llvm-project/lldb/unittests/Utility/UUIDTest.cpp -o /Users/buildslave/jenkins/workspace/lldb-cmake-standalone/lldb-xcode-build/unittests/Utility/lldb.build/Release/UtilityTests.build/Objects-normal/x86_64/UUIDTest.o warning: unknown warning option '-Wno-suggest-override'; did you mean '-Wno-shift-overflow'? [-Wunknown-warning-option] 1 warning generated.

Hide Details

CompileC /Users/buildslave/jenkins/workspace/lldb-cmake-standalone/lldb-xcode-build/unittests/Utility/lldb.build/Release/UtilityTests.build/Objects-normal/x86_64/UriParserTest.o unittests/Utility/UriParserTest.cpp normal x86_64 c++ com.apple.compilers.llvm.clang.1_0.compiler cd /Users/buildslave/jenkins/workspace/lldb-cmake-standalone/llvm-project/lldb /Applications/Xcode.app/Contents/Developer/Toolchains/XcodeDefault.xctoolchain/usr/bin/clang -x c++ -target x86_64-apple-macos10.12 -fmessage-length=0 -fdiagnostics-show-note-include-stack -fmacro-backtrace-limit=0 -Wno-trigraphs -fpascal-strings -O3 -Wno-missing-field-initializers -Wno-missing-prototypes -Wnon-virtual-dtor -Woverloaded-virtual -Wno-exit-time-destructors -Wmissing-braces -Wparentheses -Wswitch -Wunused-function -Wno-unused-label -Wno-unused-parameter -Wunused-variable -Wunused-value -Wempty-body -Wuninitialized -Wno-unknown-pragmas -Wno-shadow -Wno-four-char-constants -Wno-conversion -Wconstant-conversion -Wint-conversion -Wbool-conversion -Wenum-conversion -Wno-float-conversion -Wno-non-literal-null-conversion -Wno-objc-literal-conversion -Wsign-compare -Wno-shorten-64-to-32 -Wnewline-eof -Wno-c++11-extensions -DCMAKE_INTDIR=\"Release\" -DGTEST_HAS_RTTI=0 -D_DEBUG -D__STDC_CONSTANT_MACROS -D__STDC_FORMAT_MACROS -D__STDC_LIMIT_MACROS -DHAVE_ROUND -isysroot /Applications/Xcode.app/Contents/Developer/Platforms/MacOSX.platform/Developer/SDKs/MacOSX10.15.sdk -fasm-blocks -fstrict-aliasing -Wdeprecated-declarations -Winvalid-offsetof -Wno-sign-conversion -Wno-infinite-recursion -Wno-move -Wno-comma -Wno-block-capture-autoreleasing -Wno-strict-prototypes -Wno-range-loop-analysis -Wno-semicolon-before-method-body -I/Users/buildslave/jenkins/workspace/lldb-cmake-standalone/lldb-xcode-build/unittests/Utility/Release/include -I/Users/buildslave/jenkins/workspace/lldb-cmake-standalone/lldb-xcode-build/unittests/Utility -I/Users/buildslave/jenkins/workspace/lldb-cmake-standalone/llvm-project/lldb/unittests/Utility -I/Users/buildslave/jenkins/workspace/lldb-cmake-standalone/llvm-project/lldb/include -I/Users/buildslave/jenkins/workspace/lldb-cmake-standalone/lldb-xcode-build/include -I/Users/buildslave/jenkins/workspace/lldb-cmake-standalone/llvm-project/llvm/include -I/Users/buildslave/jenkins/workspace/lldb-cmake-standalone/clang-build/include -I/Users/buildslave/jenkins/workspace/lldb-cmake-standalone/llvm-project/clang/include -I/Users/buildslave/jenkins/workspace/lldb-cmake-standalone/clang-build/tools/clang/include -I/usr/local/Cellar/python/3.7.0/Frameworks/Python.framework/Versions/3.7/include/python3.7m -I/Users/buildslave/jenkins/workspace/lldb-cmake-standalone/llvm-project/lldb/tools/clang/include -I/Users/buildslave/jenkins/workspace/lldb-cmake-standalone/lldb-xcode-build/../clang/include -I/usr/local/include -I/Applications/Xcode.app/Contents/Developer/Platforms/MacOSX.platform/Developer/SDKs/MacOSX10.15.sdk/usr/include/libxml2 -I/Users/buildslave/jenkins/workspace/lldb-cmake-standalone/llvm-project/lldb/source -I/Users/buildslave/jenkins/workspace/lldb-cmake-standalone/llvm-project/lldb/unittests -isystem /Users/buildslave/jenkins/workspace/lldb-cmake-standalone/llvm-project/llvm/utils/unittest/googletest/include -isystem /Users/buildslave/jenkins/workspace/lldb-cmake-standalone/llvm-project/llvm/utils/unittest/googlemock/include -I/Users/buildslave/jenkins/workspace/lldb-cmake-standalone/lldb-xcode-build/unittests/Utility/lldb.build/Release/UtilityTests.build/DerivedSources-normal/x86_64 -I/Users/buildslave/jenkins/workspace/lldb-cmake-standalone/lldb-xcode-build/unittests/Utility/lldb.build/Release/UtilityTests.build/DerivedSources/x86_64 -I/Users/buildslave/jenkins/workspace/lldb-cmake-standalone/lldb-xcode-build/unittests/Utility/lldb.build/Release/UtilityTests.build/DerivedSources -F/Users/buildslave/jenkins/workspace/lldb-cmake-standalone/lldb-xcode-build/unittests/Utility/Release -fvisibility-inlines-hidden -Werror=date-time -Werror=unguarded-availability-new -Wall -Wextra -Wno-unused-parameter -Wwrite-strings -Wcast-qual -Wmissing-field-initializers -Wimplicit-fallthrough -Wcovered-switch-default -Wno-noexcept-type -Wnon-virtual-dtor -Wdelete-non-virtual-dtor -Wstring-conversion -Wno-deprecated-declarations -Wno-unknown-pragmas -Wno-strict-aliasing -Wno-deprecated-register -Wno-vla-extension -DNDEBUG -include /Users/buildslave/jenkins/workspace/lldb-cmake-standalone/llvm-project/lldb/unittests/gtest_common.h -fno-exceptions -fno-rtti -UNDEBUG -Wno-suggest-override -std=c++14 -MMD -MT dependencies -MF /Users/buildslave/jenkins/workspace/lldb-cmake-standalone/lldb-xcode-build/unittests/Utility/lldb.build/Release/UtilityTests.build/Objects-normal/x86_64/UriParserTest.d --serialize-diagnostics /Users/buildslave/jenkins/workspace/lldb-cmake-standalone/lldb-xcode-build/unittests/Utility/lldb.build/Release/UtilityTests.build/Objects-normal/x86_64/UriParserTest.dia -c /Users/buildslave/jenkins/workspace/lldb-cmake-standalone/llvm-project/lldb/unittests/Utility/UriParserTest.cpp -o /Users/buildslave/jenkins/workspace/lldb-cmake-standalone/lldb-xcode-build/unittests/Utility/lldb.build/Release/UtilityTests.build/Objects-normal/x86_64/UriParserTest.o warning: unknown warning option '-Wno-suggest-override'; did you mean '-Wno-shift-overflow'? [-Wunknown-warning-option] 1 warning generated.

Hide Details

CompileC /Users/buildslave/jenkins/workspace/lldb-cmake-standalone/lldb-xcode-build/unittests/Utility/lldb.build/Release/UtilityTests.build/Objects-normal/x86_64/UserIDResolverTest.o unittests/Utility/UserIDResolverTest.cpp normal x86_64 c++ com.apple.compilers.llvm.clang.1_0.compiler cd /Users/buildslave/jenkins/workspace/lldb-cmake-standalone/llvm-project/lldb /Applications/Xcode.app/Contents/Developer/Toolchains/XcodeDefault.xctoolchain/usr/bin/clang -x c++ -target x86_64-apple-macos10.12 -fmessage-length=0 -fdiagnostics-show-note-include-stack -fmacro-backtrace-limit=0 -Wno-trigraphs -fpascal-strings -O3 -Wno-missing-field-initializers -Wno-missing-prototypes -Wnon-virtual-dtor -Woverloaded-virtual -Wno-exit-time-destructors -Wmissing-braces -Wparentheses -Wswitch -Wunused-function -Wno-unused-label -Wno-unused-parameter -Wunused-variable -Wunused-value -Wempty-body -Wuninitialized -Wno-unknown-pragmas -Wno-shadow -Wno-four-char-constants -Wno-conversion -Wconstant-conversion -Wint-conversion -Wbool-conversion -Wenum-conversion -Wno-float-conversion -Wno-non-literal-null-conversion -Wno-objc-literal-conversion -Wsign-compare -Wno-shorten-64-to-32 -Wnewline-eof -Wno-c++11-extensions -DCMAKE_INTDIR=\"Release\" -DGTEST_HAS_RTTI=0 -D_DEBUG -D__STDC_CONSTANT_MACROS -D__STDC_FORMAT_MACROS -D__STDC_LIMIT_MACROS -DHAVE_ROUND -isysroot /Applications/Xcode.app/Contents/Developer/Platforms/MacOSX.platform/Developer/SDKs/MacOSX10.15.sdk -fasm-blocks -fstrict-aliasing -Wdeprecated-declarations -Winvalid-offsetof -Wno-sign-conversion -Wno-infinite-recursion -Wno-move -Wno-comma -Wno-block-capture-autoreleasing -Wno-strict-prototypes -Wno-range-loop-analysis -Wno-semicolon-before-method-body -I/Users/buildslave/jenkins/workspace/lldb-cmake-standalone/lldb-xcode-build/unittests/Utility/Release/include -I/Users/buildslave/jenkins/workspace/lldb-cmake-standalone/lldb-xcode-build/unittests/Utility -I/Users/buildslave/jenkins/workspace/lldb-cmake-standalone/llvm-project/lldb/unittests/Utility -I/Users/buildslave/jenkins/workspace/lldb-cmake-standalone/llvm-project/lldb/include -I/Users/buildslave/jenkins/workspace/lldb-cmake-standalone/lldb-xcode-build/include -I/Users/buildslave/jenkins/workspace/lldb-cmake-standalone/llvm-project/llvm/include -I/Users/buildslave/jenkins/workspace/lldb-cmake-standalone/clang-build/include -I/Users/buildslave/jenkins/workspace/lldb-cmake-standalone/llvm-project/clang/include -I/Users/buildslave/jenkins/workspace/lldb-cmake-standalone/clang-build/tools/clang/include -I/usr/local/Cellar/python/3.7.0/Frameworks/Python.framework/Versions/3.7/include/python3.7m -I/Users/buildslave/jenkins/workspace/lldb-cmake-standalone/llvm-project/lldb/tools/clang/include -I/Users/buildslave/jenkins/workspace/lldb-cmake-standalone/lldb-xcode-build/../clang/include -I/usr/local/include -I/Applications/Xcode.app/Contents/Developer/Platforms/MacOSX.platform/Developer/SDKs/MacOSX10.15.sdk/usr/include/libxml2 -I/Users/buildslave/jenkins/workspace/lldb-cmake-standalone/llvm-project/lldb/source -I/Users/buildslave/jenkins/workspace/lldb-cmake-standalone/llvm-project/lldb/unittests -isystem /Users/buildslave/jenkins/workspace/lldb-cmake-standalone/llvm-project/llvm/utils/unittest/googletest/include -isystem /Users/buildslave/jenkins/workspace/lldb-cmake-standalone/llvm-project/llvm/utils/unittest/googlemock/include -I/Users/buildslave/jenkins/workspace/lldb-cmake-standalone/lldb-xcode-build/unittests/Utility/lldb.build/Release/UtilityTests.build/DerivedSources-normal/x86_64 -I/Users/buildslave/jenkins/workspace/lldb-cmake-standalone/lldb-xcode-build/unittests/Utility/lldb.build/Release/UtilityTests.build/DerivedSources/x86_64 -I/Users/buildslave/jenkins/workspace/lldb-cmake-standalone/lldb-xcode-build/unittests/Utility/lldb.build/Release/UtilityTests.build/DerivedSources -F/Users/buildslave/jenkins/workspace/lldb-cmake-standalone/lldb-xcode-build/unittests/Utility/Release -fvisibility-inlines-hidden -Werror=date-time -Werror=unguarded-availability-new -Wall -Wextra -Wno-unused-parameter -Wwrite-strings -Wcast-qual -Wmissing-field-initializers -Wimplicit-fallthrough -Wcovered-switch-default -Wno-noexcept-type -Wnon-virtual-dtor -Wdelete-non-virtual-dtor -Wstring-conversion -Wno-deprecated-declarations -Wno-unknown-pragmas -Wno-strict-aliasing -Wno-deprecated-register -Wno-vla-extension -DNDEBUG -include /Users/buildslave/jenkins/workspace/lldb-cmake-standalone/llvm-project/lldb/unittests/gtest_common.h -fno-exceptions -fno-rtti -UNDEBUG -Wno-suggest-override -std=c++14 -MMD -MT dependencies -MF /Users/buildslave/jenkins/workspace/lldb-cmake-standalone/lldb-xcode-build/unittests/Utility/lldb.build/Release/UtilityTests.build/Objects-normal/x86_64/UserIDResolverTest.d --serialize-diagnostics /Users/buildslave/jenkins/workspace/lldb-cmake-standalone/lldb-xcode-build/unittests/Utility/lldb.build/Release/UtilityTests.build/Objects-normal/x86_64/UserIDResolverTest.dia -c /Users/buildslave/jenkins/workspace/lldb-cmake-standalone/llvm-project/lldb/unittests/Utility/UserIDResolverTest.cpp -o /Users/buildslave/jenkins/workspace/lldb-cmake-standalone/lldb-xcode-build/unittests/Utility/lldb.build/Release/UtilityTests.build/Objects-normal/x86_64/UserIDResolverTest.o warning: unknown warning option '-Wno-suggest-override'; did you mean '-Wno-shift-overflow'? [-Wunknown-warning-option] 1 warning generated.

Hide Details

CompileC /Users/buildslave/jenkins/workspace/lldb-cmake-standalone/lldb-xcode-build/unittests/Utility/lldb.build/Release/UtilityTests.build/Objects-normal/x86_64/VASprintfTest.o unittests/Utility/VASprintfTest.cpp normal x86_64 c++ com.apple.compilers.llvm.clang.1_0.compiler cd /Users/buildslave/jenkins/workspace/lldb-cmake-standalone/llvm-project/lldb /Applications/Xcode.app/Contents/Developer/Toolchains/XcodeDefault.xctoolchain/usr/bin/clang -x c++ -target x86_64-apple-macos10.12 -fmessage-length=0 -fdiagnostics-show-note-include-stack -fmacro-backtrace-limit=0 -Wno-trigraphs -fpascal-strings -O3 -Wno-missing-field-initializers -Wno-missing-prototypes -Wnon-virtual-dtor -Woverloaded-virtual -Wno-exit-time-destructors -Wmissing-braces -Wparentheses -Wswitch -Wunused-function -Wno-unused-label -Wno-unused-parameter -Wunused-variable -Wunused-value -Wempty-body -Wuninitialized -Wno-unknown-pragmas -Wno-shadow -Wno-four-char-constants -Wno-conversion -Wconstant-conversion -Wint-conversion -Wbool-conversion -Wenum-conversion -Wno-float-conversion -Wno-non-literal-null-conversion -Wno-objc-literal-conversion -Wsign-compare -Wno-shorten-64-to-32 -Wnewline-eof -Wno-c++11-extensions -DCMAKE_INTDIR=\"Release\" -DGTEST_HAS_RTTI=0 -D_DEBUG -D__STDC_CONSTANT_MACROS -D__STDC_FORMAT_MACROS -D__STDC_LIMIT_MACROS -DHAVE_ROUND -isysroot /Applications/Xcode.app/Contents/Developer/Platforms/MacOSX.platform/Developer/SDKs/MacOSX10.15.sdk -fasm-blocks -fstrict-aliasing -Wdeprecated-declarations -Winvalid-offsetof -Wno-sign-conversion -Wno-infinite-recursion -Wno-move -Wno-comma -Wno-block-capture-autoreleasing -Wno-strict-prototypes -Wno-range-loop-analysis -Wno-semicolon-before-method-body -I/Users/buildslave/jenkins/workspace/lldb-cmake-standalone/lldb-xcode-build/unittests/Utility/Release/include -I/Users/buildslave/jenkins/workspace/lldb-cmake-standalone/lldb-xcode-build/unittests/Utility -I/Users/buildslave/jenkins/workspace/lldb-cmake-standalone/llvm-project/lldb/unittests/Utility -I/Users/buildslave/jenkins/workspace/lldb-cmake-standalone/llvm-project/lldb/include -I/Users/buildslave/jenkins/workspace/lldb-cmake-standalone/lldb-xcode-build/include -I/Users/buildslave/jenkins/workspace/lldb-cmake-standalone/llvm-project/llvm/include -I/Users/buildslave/jenkins/workspace/lldb-cmake-standalone/clang-build/include -I/Users/buildslave/jenkins/workspace/lldb-cmake-standalone/llvm-project/clang/include -I/Users/buildslave/jenkins/workspace/lldb-cmake-standalone/clang-build/tools/clang/include -I/usr/local/Cellar/python/3.7.0/Frameworks/Python.framework/Versions/3.7/include/python3.7m -I/Users/buildslave/jenkins/workspace/lldb-cmake-standalone/llvm-project/lldb/tools/clang/include -I/Users/buildslave/jenkins/workspace/lldb-cmake-standalone/lldb-xcode-build/../clang/include -I/usr/local/include -I/Applications/Xcode.app/Contents/Developer/Platforms/MacOSX.platform/Developer/SDKs/MacOSX10.15.sdk/usr/include/libxml2 -I/Users/buildslave/jenkins/workspace/lldb-cmake-standalone/llvm-project/lldb/source -I/Users/buildslave/jenkins/workspace/lldb-cmake-standalone/llvm-project/lldb/unittests -isystem /Users/buildslave/jenkins/workspace/lldb-cmake-standalone/llvm-project/llvm/utils/unittest/googletest/include -isystem /Users/buildslave/jenkins/workspace/lldb-cmake-standalone/llvm-project/llvm/utils/unittest/googlemock/include -I/Users/buildslave/jenkins/workspace/lldb-cmake-standalone/lldb-xcode-build/unittests/Utility/lldb.build/Release/UtilityTests.build/DerivedSources-normal/x86_64 -I/Users/buildslave/jenkins/workspace/lldb-cmake-standalone/lldb-xcode-build/unittests/Utility/lldb.build/Release/UtilityTests.build/DerivedSources/x86_64 -I/Users/buildslave/jenkins/workspace/lldb-cmake-standalone/lldb-xcode-build/unittests/Utility/lldb.build/Release/UtilityTests.build/DerivedSources -F/Users/buildslave/jenkins/workspace/lldb-cmake-standalone/lldb-xcode-build/unittests/Utility/Release -fvisibility-inlines-hidden -Werror=date-time -Werror=unguarded-availability-new -Wall -Wextra -Wno-unused-parameter -Wwrite-strings -Wcast-qual -Wmissing-field-initializers -Wimplicit-fallthrough -Wcovered-switch-default -Wno-noexcept-type -Wnon-virtual-dtor -Wdelete-non-virtual-dtor -Wstring-conversion -Wno-deprecated-declarations -Wno-unknown-pragmas -Wno-strict-aliasing -Wno-deprecated-register -Wno-vla-extension -DNDEBUG -include /Users/buildslave/jenkins/workspace/lldb-cmake-standalone/llvm-project/lldb/unittests/gtest_common.h -fno-exceptions -fno-rtti -UNDEBUG -Wno-suggest-override -std=c++14 -MMD -MT dependencies -MF /Users/buildslave/jenkins/workspace/lldb-cmake-standalone/lldb-xcode-build/unittests/Utility/lldb.build/Release/UtilityTests.build/Objects-normal/x86_64/VASprintfTest.d --serialize-diagnostics /Users/buildslave/jenkins/workspace/lldb-cmake-standalone/lldb-xcode-build/unittests/Utility/lldb.build/Release/UtilityTests.build/Objects-normal/x86_64/VASprintfTest.dia -c /Users/buildslave/jenkins/workspace/lldb-cmake-standalone/llvm-project/lldb/unittests/Utility/VASprintfTest.cpp -o /Users/buildslave/jenkins/workspace/lldb-cmake-standalone/lldb-xcode-build/unittests/Utility/lldb.build/Release/UtilityTests.build/Objects-normal/x86_64/VASprintfTest.o warning: unknown warning option '-Wno-suggest-override'; did you mean '-Wno-shift-overflow'? [-Wunknown-warning-option] 1 warning generated.

Hide Details

CompileC /Users/buildslave/jenkins/workspace/lldb-cmake-standalone/lldb-xcode-build/unittests/Utility/lldb.build/Release/UtilityTests.build/Objects-normal/x86_64/VMRangeTest.o unittests/Utility/VMRangeTest.cpp normal x86_64 c++ com.apple.compilers.llvm.clang.1_0.compiler cd /Users/buildslave/jenkins/workspace/lldb-cmake-standalone/llvm-project/lldb /Applications/Xcode.app/Contents/Developer/Toolchains/XcodeDefault.xctoolchain/usr/bin/clang -x c++ -target x86_64-apple-macos10.12 -fmessage-length=0 -fdiagnostics-show-note-include-stack -fmacro-backtrace-limit=0 -Wno-trigraphs -fpascal-strings -O3 -Wno-missing-field-initializers -Wno-missing-prototypes -Wnon-virtual-dtor -Woverloaded-virtual -Wno-exit-time-destructors -Wmissing-braces -Wparentheses -Wswitch -Wunused-function -Wno-unused-label -Wno-unused-parameter -Wunused-variable -Wunused-value -Wempty-body -Wuninitialized -Wno-unknown-pragmas -Wno-shadow -Wno-four-char-constants -Wno-conversion -Wconstant-conversion -Wint-conversion -Wbool-conversion -Wenum-conversion -Wno-float-conversion -Wno-non-literal-null-conversion -Wno-objc-literal-conversion -Wsign-compare -Wno-shorten-64-to-32 -Wnewline-eof -Wno-c++11-extensions -DCMAKE_INTDIR=\"Release\" -DGTEST_HAS_RTTI=0 -D_DEBUG -D__STDC_CONSTANT_MACROS -D__STDC_FORMAT_MACROS -D__STDC_LIMIT_MACROS -DHAVE_ROUND -isysroot /Applications/Xcode.app/Contents/Developer/Platforms/MacOSX.platform/Developer/SDKs/MacOSX10.15.sdk -fasm-blocks -fstrict-aliasing -Wdeprecated-declarations -Winvalid-offsetof -Wno-sign-conversion -Wno-infinite-recursion -Wno-move -Wno-comma -Wno-block-capture-autoreleasing -Wno-strict-prototypes -Wno-range-loop-analysis -Wno-semicolon-before-method-body -I/Users/buildslave/jenkins/workspace/lldb-cmake-standalone/lldb-xcode-build/unittests/Utility/Release/include -I/Users/buildslave/jenkins/workspace/lldb-cmake-standalone/lldb-xcode-build/unittests/Utility -I/Users/buildslave/jenkins/workspace/lldb-cmake-standalone/llvm-project/lldb/unittests/Utility -I/Users/buildslave/jenkins/workspace/lldb-cmake-standalone/llvm-project/lldb/include -I/Users/buildslave/jenkins/workspace/lldb-cmake-standalone/lldb-xcode-build/include -I/Users/buildslave/jenkins/workspace/lldb-cmake-standalone/llvm-project/llvm/include -I/Users/buildslave/jenkins/workspace/lldb-cmake-standalone/clang-build/include -I/Users/buildslave/jenkins/workspace/lldb-cmake-standalone/llvm-project/clang/include -I/Users/buildslave/jenkins/workspace/lldb-cmake-standalone/clang-build/tools/clang/include -I/usr/local/Cellar/python/3.7.0/Frameworks/Python.framework/Versions/3.7/include/python3.7m -I/Users/buildslave/jenkins/workspace/lldb-cmake-standalone/llvm-project/lldb/tools/clang/include -I/Users/buildslave/jenkins/workspace/lldb-cmake-standalone/lldb-xcode-build/../clang/include -I/usr/local/include -I/Applications/Xcode.app/Contents/Developer/Platforms/MacOSX.platform/Developer/SDKs/MacOSX10.15.sdk/usr/include/libxml2 -I/Users/buildslave/jenkins/workspace/lldb-cmake-standalone/llvm-project/lldb/source -I/Users/buildslave/jenkins/workspace/lldb-cmake-standalone/llvm-project/lldb/unittests -isystem /Users/buildslave/jenkins/workspace/lldb-cmake-standalone/llvm-project/llvm/utils/unittest/googletest/include -isystem /Users/buildslave/jenkins/workspace/lldb-cmake-standalone/llvm-project/llvm/utils/unittest/googlemock/include -I/Users/buildslave/jenkins/workspace/lldb-cmake-standalone/lldb-xcode-build/unittests/Utility/lldb.build/Release/UtilityTests.build/DerivedSources-normal/x86_64 -I/Users/buildslave/jenkins/workspace/lldb-cmake-standalone/lldb-xcode-build/unittests/Utility/lldb.build/Release/UtilityTests.build/DerivedSources/x86_64 -I/Users/buildslave/jenkins/workspace/lldb-cmake-standalone/lldb-xcode-build/unittests/Utility/lldb.build/Release/UtilityTests.build/DerivedSources -F/Users/buildslave/jenkins/workspace/lldb-cmake-standalone/lldb-xcode-build/unittests/Utility/Release -fvisibility-inlines-hidden -Werror=date-time -Werror=unguarded-availability-new -Wall -Wextra -Wno-unused-parameter -Wwrite-strings -Wcast-qual -Wmissing-field-initializers -Wimplicit-fallthrough -Wcovered-switch-default -Wno-noexcept-type -Wnon-virtual-dtor -Wdelete-non-virtual-dtor -Wstring-conversion -Wno-deprecated-declarations -Wno-unknown-pragmas -Wno-strict-aliasing -Wno-deprecated-register -Wno-vla-extension -DNDEBUG -include /Users/buildslave/jenkins/workspace/lldb-cmake-standalone/llvm-project/lldb/unittests/gtest_common.h -fno-exceptions -fno-rtti -UNDEBUG -Wno-suggest-override -std=c++14 -MMD -MT dependencies -MF /Users/buildslave/jenkins/workspace/lldb-cmake-standalone/lldb-xcode-build/unittests/Utility/lldb.build/Release/UtilityTests.build/Objects-normal/x86_64/VMRangeTest.d --serialize-diagnostics /Users/buildslave/jenkins/workspace/lldb-cmake-standalone/lldb-xcode-build/unittests/Utility/lldb.build/Release/UtilityTests.build/Objects-normal/x86_64/VMRangeTest.dia -c /Users/buildslave/jenkins/workspace/lldb-cmake-standalone/llvm-project/lldb/unittests/Utility/VMRangeTest.cpp -o /Users/buildslave/jenkins/workspace/lldb-cmake-standalone/lldb-xcode-build/unittests/Utility/lldb.build/Release/UtilityTests.build/Objects-normal/x86_64/VMRangeTest.o warning: unknown warning option '-Wno-suggest-override'; did you mean '-Wno-shift-overflow'? [-Wunknown-warning-option] 1 warning generated.

Hide Details

CompileC /Users/buildslave/jenkins/workspace/lldb-cmake-standalone/lldb-xcode-build/unittests/Utility/lldb.build/Release/UtilityTests.build/Objects-normal/x86_64/XcodeSDKTest.o unittests/Utility/XcodeSDKTest.cpp normal x86_64 c++ com.apple.compilers.llvm.clang.1_0.compiler cd /Users/buildslave/jenkins/workspace/lldb-cmake-standalone/llvm-project/lldb /Applications/Xcode.app/Contents/Developer/Toolchains/XcodeDefault.xctoolchain/usr/bin/clang -x c++ -target x86_64-apple-macos10.12 -fmessage-length=0 -fdiagnostics-show-note-include-stack -fmacro-backtrace-limit=0 -Wno-trigraphs -fpascal-strings -O3 -Wno-missing-field-initializers -Wno-missing-prototypes -Wnon-virtual-dtor -Woverloaded-virtual -Wno-exit-time-destructors -Wmissing-braces -Wparentheses -Wswitch -Wunused-function -Wno-unused-label -Wno-unused-parameter -Wunused-variable -Wunused-value -Wempty-body -Wuninitialized -Wno-unknown-pragmas -Wno-shadow -Wno-four-char-constants -Wno-conversion -Wconstant-conversion -Wint-conversion -Wbool-conversion -Wenum-conversion -Wno-float-conversion -Wno-non-literal-null-conversion -Wno-objc-literal-conversion -Wsign-compare -Wno-shorten-64-to-32 -Wnewline-eof -Wno-c++11-extensions -DCMAKE_INTDIR=\"Release\" -DGTEST_HAS_RTTI=0 -D_DEBUG -D__STDC_CONSTANT_MACROS -D__STDC_FORMAT_MACROS -D__STDC_LIMIT_MACROS -DHAVE_ROUND -isysroot /Applications/Xcode.app/Contents/Developer/Platforms/MacOSX.platform/Developer/SDKs/MacOSX10.15.sdk -fasm-blocks -fstrict-aliasing -Wdeprecated-declarations -Winvalid-offsetof -Wno-sign-conversion -Wno-infinite-recursion -Wno-move -Wno-comma -Wno-block-capture-autoreleasing -Wno-strict-prototypes -Wno-range-loop-analysis -Wno-semicolon-before-method-body -I/Users/buildslave/jenkins/workspace/lldb-cmake-standalone/lldb-xcode-build/unittests/Utility/Release/include -I/Users/buildslave/jenkins/workspace/lldb-cmake-standalone/lldb-xcode-build/unittests/Utility -I/Users/buildslave/jenkins/workspace/lldb-cmake-standalone/llvm-project/lldb/unittests/Utility -I/Users/buildslave/jenkins/workspace/lldb-cmake-standalone/llvm-project/lldb/include -I/Users/buildslave/jenkins/workspace/lldb-cmake-standalone/lldb-xcode-build/include -I/Users/buildslave/jenkins/workspace/lldb-cmake-standalone/llvm-project/llvm/include -I/Users/buildslave/jenkins/workspace/lldb-cmake-standalone/clang-build/include -I/Users/buildslave/jenkins/workspace/lldb-cmake-standalone/llvm-project/clang/include -I/Users/buildslave/jenkins/workspace/lldb-cmake-standalone/clang-build/tools/clang/include -I/usr/local/Cellar/python/3.7.0/Frameworks/Python.framework/Versions/3.7/include/python3.7m -I/Users/buildslave/jenkins/workspace/lldb-cmake-standalone/llvm-project/lldb/tools/clang/include -I/Users/buildslave/jenkins/workspace/lldb-cmake-standalone/lldb-xcode-build/../clang/include -I/usr/local/include -I/Applications/Xcode.app/Contents/Developer/Platforms/MacOSX.platform/Developer/SDKs/MacOSX10.15.sdk/usr/include/libxml2 -I/Users/buildslave/jenkins/workspace/lldb-cmake-standalone/llvm-project/lldb/source -I/Users/buildslave/jenkins/workspace/lldb-cmake-standalone/llvm-project/lldb/unittests -isystem /Users/buildslave/jenkins/workspace/lldb-cmake-standalone/llvm-project/llvm/utils/unittest/googletest/include -isystem /Users/buildslave/jenkins/workspace/lldb-cmake-standalone/llvm-project/llvm/utils/unittest/googlemock/include -I/Users/buildslave/jenkins/workspace/lldb-cmake-standalone/lldb-xcode-build/unittests/Utility/lldb.build/Release/UtilityTests.build/DerivedSources-normal/x86_64 -I/Users/buildslave/jenkins/workspace/lldb-cmake-standalone/lldb-xcode-build/unittests/Utility/lldb.build/Release/UtilityTests.build/DerivedSources/x86_64 -I/Users/buildslave/jenkins/workspace/lldb-cmake-standalone/lldb-xcode-build/unittests/Utility/lldb.build/Release/UtilityTests.build/DerivedSources -F/Users/buildslave/jenkins/workspace/lldb-cmake-standalone/lldb-xcode-build/unittests/Utility/Release -fvisibility-inlines-hidden -Werror=date-time -Werror=unguarded-availability-new -Wall -Wextra -Wno-unused-parameter -Wwrite-strings -Wcast-qual -Wmissing-field-initializers -Wimplicit-fallthrough -Wcovered-switch-default -Wno-noexcept-type -Wnon-virtual-dtor -Wdelete-non-virtual-dtor -Wstring-conversion -Wno-deprecated-declarations -Wno-unknown-pragmas -Wno-strict-aliasing -Wno-deprecated-register -Wno-vla-extension -DNDEBUG -include /Users/buildslave/jenkins/workspace/lldb-cmake-standalone/llvm-project/lldb/unittests/gtest_common.h -fno-exceptions -fno-rtti -UNDEBUG -Wno-suggest-override -std=c++14 -MMD -MT dependencies -MF /Users/buildslave/jenkins/workspace/lldb-cmake-standalone/lldb-xcode-build/unittests/Utility/lldb.build/Release/UtilityTests.build/Objects-normal/x86_64/XcodeSDKTest.d --serialize-diagnostics /Users/buildslave/jenkins/workspace/lldb-cmake-standalone/lldb-xcode-build/unittests/Utility/lldb.build/Release/UtilityTests.build/Objects-normal/x86_64/XcodeSDKTest.dia -c /Users/buildslave/jenkins/workspace/lldb-cmake-standalone/llvm-project/lldb/unittests/Utility/XcodeSDKTest.cpp -o /Users/buildslave/jenkins/workspace/lldb-cmake-standalone/lldb-xcode-build/unittests/Utility/lldb.build/Release/UtilityTests.build/Objects-normal/x86_64/XcodeSDKTest.o warning: unknown warning option '-Wno-suggest-override'; did you mean '-Wno-shift-overflow'? [-Wunknown-warning-option] 1 warning generated.

Hide Details

CompileC /Users/buildslave/jenkins/workspace/lldb-cmake-standalone/lldb-xcode-build/unittests/Utility/lldb.build/Release/UtilityTests.build/Objects-normal/x86_64/dummy.o /Users/buildslave/jenkins/workspace/lldb-cmake-standalone/llvm-project/llvm/cmake/dummy.cpp normal x86_64 c++ com.apple.compilers.llvm.clang.1_0.compiler cd /Users/buildslave/jenkins/workspace/lldb-cmake-standalone/llvm-project/lldb /Applications/Xcode.app/Contents/Developer/Toolchains/XcodeDefault.xctoolchain/usr/bin/clang -x c++ -target x86_64-apple-macos10.12 -fmessage-length=0 -fdiagnostics-show-note-include-stack -fmacro-backtrace-limit=0 -Wno-trigraphs -fpascal-strings -O3 -Wno-missing-field-initializers -Wno-missing-prototypes -Wnon-virtual-dtor -Woverloaded-virtual -Wno-exit-time-destructors -Wmissing-braces -Wparentheses -Wswitch -Wunused-function -Wno-unused-label -Wno-unused-parameter -Wunused-variable -Wunused-value -Wempty-body -Wuninitialized -Wno-unknown-pragmas -Wno-shadow -Wno-four-char-constants -Wno-conversion -Wconstant-conversion -Wint-conversion -Wbool-conversion -Wenum-conversion -Wno-float-conversion -Wno-non-literal-null-conversion -Wno-objc-literal-conversion -Wsign-compare -Wno-shorten-64-to-32 -Wnewline-eof -Wno-c++11-extensions -DCMAKE_INTDIR=\"Release\" -DGTEST_HAS_RTTI=0 -D_DEBUG -D__STDC_CONSTANT_MACROS -D__STDC_FORMAT_MACROS -D__STDC_LIMIT_MACROS -DHAVE_ROUND -isysroot /Applications/Xcode.app/Contents/Developer/Platforms/MacOSX.platform/Developer/SDKs/MacOSX10.15.sdk -fasm-blocks -fstrict-aliasing -Wdeprecated-declarations -Winvalid-offsetof -Wno-sign-conversion -Wno-infinite-recursion -Wno-move -Wno-comma -Wno-block-capture-autoreleasing -Wno-strict-prototypes -Wno-range-loop-analysis -Wno-semicolon-before-method-body -I/Users/buildslave/jenkins/workspace/lldb-cmake-standalone/lldb-xcode-build/unittests/Utility/Release/include -I/Users/buildslave/jenkins/workspace/lldb-cmake-standalone/lldb-xcode-build/unittests/Utility -I/Users/buildslave/jenkins/workspace/lldb-cmake-standalone/llvm-project/lldb/unittests/Utility -I/Users/buildslave/jenkins/workspace/lldb-cmake-standalone/llvm-project/lldb/include -I/Users/buildslave/jenkins/workspace/lldb-cmake-standalone/lldb-xcode-build/include -I/Users/buildslave/jenkins/workspace/lldb-cmake-standalone/llvm-project/llvm/include -I/Users/buildslave/jenkins/workspace/lldb-cmake-standalone/clang-build/include -I/Users/buildslave/jenkins/workspace/lldb-cmake-standalone/llvm-project/clang/include -I/Users/buildslave/jenkins/workspace/lldb-cmake-standalone/clang-build/tools/clang/include -I/usr/local/Cellar/python/3.7.0/Frameworks/Python.framework/Versions/3.7/include/python3.7m -I/Users/buildslave/jenkins/workspace/lldb-cmake-standalone/llvm-project/lldb/tools/clang/include -I/Users/buildslave/jenkins/workspace/lldb-cmake-standalone/lldb-xcode-build/../clang/include -I/usr/local/include -I/Applications/Xcode.app/Contents/Developer/Platforms/MacOSX.platform/Developer/SDKs/MacOSX10.15.sdk/usr/include/libxml2 -I/Users/buildslave/jenkins/workspace/lldb-cmake-standalone/llvm-project/lldb/source -I/Users/buildslave/jenkins/workspace/lldb-cmake-standalone/llvm-project/lldb/unittests -isystem /Users/buildslave/jenkins/workspace/lldb-cmake-standalone/llvm-project/llvm/utils/unittest/googletest/include -isystem /Users/buildslave/jenkins/workspace/lldb-cmake-standalone/llvm-project/llvm/utils/unittest/googlemock/include -I/Users/buildslave/jenkins/workspace/lldb-cmake-standalone/lldb-xcode-build/unittests/Utility/lldb.build/Release/UtilityTests.build/DerivedSources-normal/x86_64 -I/Users/buildslave/jenkins/workspace/lldb-cmake-standalone/lldb-xcode-build/unittests/Utility/lldb.build/Release/UtilityTests.build/DerivedSources/x86_64 -I/Users/buildslave/jenkins/workspace/lldb-cmake-standalone/lldb-xcode-build/unittests/Utility/lldb.build/Release/UtilityTests.build/DerivedSources -F/Users/buildslave/jenkins/workspace/lldb-cmake-standalone/lldb-xcode-build/unittests/Utility/Release -fvisibility-inlines-hidden -Werror=date-time -Werror=unguarded-availability-new -Wall -Wextra -Wno-unused-parameter -Wwrite-strings -Wcast-qual -Wmissing-field-initializers -Wimplicit-fallthrough -Wcovered-switch-default -Wno-noexcept-type -Wnon-virtual-dtor -Wdelete-non-virtual-dtor -Wstring-conversion -Wno-deprecated-declarations -Wno-unknown-pragmas -Wno-strict-aliasing -Wno-deprecated-register -Wno-vla-extension -DNDEBUG -include /Users/buildslave/jenkins/workspace/lldb-cmake-standalone/llvm-project/lldb/unittests/gtest_common.h -fno-exceptions -fno-rtti -UNDEBUG -Wno-suggest-override -std=c++14 -MMD -MT dependencies -MF /Users/buildslave/jenkins/workspace/lldb-cmake-standalone/lldb-xcode-build/unittests/Utility/lldb.build/Release/UtilityTests.build/Objects-normal/x86_64/dummy.d --serialize-diagnostics /Users/buildslave/jenkins/workspace/lldb-cmake-standalone/lldb-xcode-build/unittests/Utility/lldb.build/Release/UtilityTests.build/Objects-normal/x86_64/dummy.dia -c /Users/buildslave/jenkins/workspace/lldb-cmake-standalone/llvm-project/llvm/cmake/dummy.cpp -o /Users/buildslave/jenkins/workspace/lldb-cmake-standalone/lldb-xcode-build/unittests/Utility/lldb.build/Release/UtilityTests.build/Objects-normal/x86_64/dummy.o warning: unknown warning option '-Wno-suggest-override'; did you mean '-Wno-shift-overflow'? [-Wunknown-warning-option] 1 warning generated.

Hide Details

Ld /Users/buildslave/jenkins/workspace/lldb-cmake-standalone/lldb-xcode-build/unittests/Utility/Release/UtilityTests normal x86_64 cd /Users/buildslave/jenkins/workspace/lldb-cmake-standalone/llvm-project/lldb /Applications/Xcode.app/Contents/Developer/Toolchains/XcodeDefault.xctoolchain/usr/bin/clang++ -target x86_64-apple-macos10.12 -isysroot /Applications/Xcode.app/Contents/Developer/Platforms/MacOSX.platform/Developer/SDKs/MacOSX10.15.sdk -L/Users/buildslave/jenkins/workspace/lldb-cmake-standalone/lldb-xcode-build/unittests/Utility/Release -F/Users/buildslave/jenkins/workspace/lldb-cmake-standalone/lldb-xcode-build/unittests/Utility/Release -filelist /Users/buildslave/jenkins/workspace/lldb-cmake-standalone/lldb-xcode-build/unittests/Utility/lldb.build/Release/UtilityTests.build/Objects-normal/x86_64/UtilityTests.LinkFileList -Wl,-dead_strip -Wl,-search_paths_first -Wl,-headerpad_max_install_names /Users/buildslave/jenkins/workspace/lldb-cmake-standalone/clang-build/lib/libLLVMSupport.a /Users/buildslave/jenkins/workspace/lldb-cmake-standalone/clang-build/lib/libLLVMSupport.a /Users/buildslave/jenkins/workspace/lldb-cmake-standalone/clang-build/lib/libgtest_main.a /Users/buildslave/jenkins/workspace/lldb-cmake-standalone/clang-build/lib/libgtest.a /Users/buildslave/jenkins/workspace/lldb-cmake-standalone/lldb-xcode-build/Release/lib/liblldbUtility.a /Users/buildslave/jenkins/workspace/lldb-cmake-standalone/lldb-xcode-build/Release/lib/liblldbUtilityHelpers.a /Users/buildslave/jenkins/workspace/lldb-cmake-standalone/clang-build/lib/libLLVMTestingSupport.a /Users/buildslave/jenkins/workspace/lldb-cmake-standalone/lldb-xcode-build/Release/lib/liblldbUtility.a -framework Foundation -framework CoreFoundation -framework CoreServices -framework Security /Users/buildslave/jenkins/workspace/lldb-cmake-standalone/clang-build/lib/libLLVMObjectYAML.a /Users/buildslave/jenkins/workspace/lldb-cmake-standalone/clang-build/lib/libLLVMObject.a /Users/buildslave/jenkins/workspace/lldb-cmake-standalone/clang-build/lib/libLLVMBitReader.a /Users/buildslave/jenkins/workspace/lldb-cmake-standalone/clang-build/lib/libLLVMCore.a /Users/buildslave/jenkins/workspace/lldb-cmake-standalone/clang-build/lib/libLLVMRemarks.a /Users/buildslave/jenkins/workspace/lldb-cmake-standalone/clang-build/lib/libLLVMBitstreamReader.a /Users/buildslave/jenkins/workspace/lldb-cmake-standalone/clang-build/lib/libLLVMMCParser.a /Users/buildslave/jenkins/workspace/lldb-cmake-standalone/clang-build/lib/libLLVMTextAPI.a /Users/buildslave/jenkins/workspace/lldb-cmake-standalone/clang-build/lib/libLLVMMC.a /Users/buildslave/jenkins/workspace/lldb-cmake-standalone/clang-build/lib/libLLVMBinaryFormat.a /Users/buildslave/jenkins/workspace/lldb-cmake-standalone/clang-build/lib/libLLVMDebugInfoCodeView.a /Users/buildslave/jenkins/workspace/lldb-cmake-standalone/clang-build/lib/libgtest.a /Users/buildslave/jenkins/workspace/lldb-cmake-standalone/clang-build/lib/libLLVMSupport.a -lm /usr/lib/libz.dylib /usr/lib/libcurses.dylib /Users/buildslave/jenkins/workspace/lldb-cmake-standalone/clang-build/lib/libLLVMDemangle.a -lpthread -Xlinker -dependency_info -Xlinker /Users/buildslave/jenkins/workspace/lldb-cmake-standalone/lldb-xcode-build/unittests/Utility/lldb.build/Release/UtilityTests.build/Objects-normal/x86_64/UtilityTests_dependency_info.dat -o /Users/buildslave/jenkins/workspace/lldb-cmake-standalone/lldb-xcode-build/unittests/Utility/Release/UtilityTests

Hide Details

PhaseScriptExecution CMake\ PostBuild\ Rules /Users/buildslave/jenkins/workspace/lldb-cmake-standalone/lldb-xcode-build/unittests/Utility/lldb.build/Release/UtilityTests.build/Script-CBDD09B7CFF74024AF0BFCA4.sh cd /Users/buildslave/jenkins/workspace/lldb-cmake-standalone/llvm-project/lldb /bin/sh -c /Users/buildslave/jenkins/workspace/lldb-cmake-standalone/lldb-xcode-build/unittests/Utility/lldb.build/Release/UtilityTests.build/Script-CBDD09B7CFF74024AF0BFCA4.sh /usr/local/Cellar/cmake/3.17.2/bin/cmake -E make_directory /Users/buildslave/jenkins/workspace/lldb-cmake-standalone/lldb-xcode-build/unittests/Utility/Release/Inputs echo "Copying StructuredData-basic.json to binary directory." Copying StructuredData-basic.json to binary directory. /usr/local/Cellar/cmake/3.17.2/bin/cmake -E copy /Users/buildslave/jenkins/workspace/lldb-cmake-standalone/llvm-project/lldb/unittests/Utility/Inputs/StructuredData-basic.json /Users/buildslave/jenkins/workspace/lldb-cmake-standalone/lldb-xcode-build/unittests/Utility/Release/Inputs

Hide Details

ProcessProductPackaging "" /Users/buildslave/jenkins/workspace/lldb-cmake-standalone/lldb-xcode-build/unittests/Utility/lldb.build/Release/UtilityTests.build/UtilityTests.xcent cd /Users/buildslave/jenkins/workspace/lldb-cmake-standalone/llvm-project/lldb

Hide Details

Hide Details

Entitlements:

Hide Details

{ "com.apple.security.get-task-allow" = 1; }

Hide Details

Hide Details

builtin-productPackagingUtility -entitlements -format xml -o /Users/buildslave/jenkins/workspace/lldb-cmake-standalone/lldb-xcode-build/unittests/Utility/lldb.build/Release/UtilityTests.build/UtilityTests.xcent

Hide Details

CodeSign /Users/buildslave/jenkins/workspace/lldb-cmake-standalone/lldb-xcode-build/unittests/Utility/Release/UtilityTests cd /Users/buildslave/jenkins/workspace/lldb-cmake-standalone/llvm-project/lldb

Hide Details

Signing Identity: "-"

Hide Details

/usr/bin/codesign --force --sign - --entitlements /Users/buildslave/jenkins/workspace/lldb-cmake-standalone/lldb-xcode-build/unittests/Utility/lldb.build/Release/UtilityTests.build/UtilityTests.xcent --timestamp=none /Users/buildslave/jenkins/workspace/lldb-cmake-standalone/lldb-xcode-build/unittests/Utility/Release/UtilityTests

Hide Details

=== BUILD TARGET ThreadTests OF PROJECT lldb WITH CONFIGURATION Release ===

Hide Details

Check dependencies

Hide Details

Write auxiliary files /bin/mkdir -p /Users/buildslave/jenkins/workspace/lldb-cmake-standalone/lldb-xcode-build/unittests/Thread/lldb.build/Release/ThreadTests.build/Objects-normal/x86_64 write-file /Users/buildslave/jenkins/workspace/lldb-cmake-standalone/lldb-xcode-build/unittests/Thread/lldb.build/Release/ThreadTests.build/Objects-normal/x86_64/ThreadTests.LinkFileList write-file /Users/buildslave/jenkins/workspace/lldb-cmake-standalone/lldb-xcode-build/unittests/Thread/lldb.build/Release/ThreadTests.build/Script-767D78D21C4D41A784F63460.sh chmod 0755 /Users/buildslave/jenkins/workspace/lldb-cmake-standalone/lldb-xcode-build/unittests/Thread/lldb.build/Release/ThreadTests.build/Script-767D78D21C4D41A784F63460.sh

Hide Details

CompileC /Users/buildslave/jenkins/workspace/lldb-cmake-standalone/lldb-xcode-build/unittests/Thread/lldb.build/Release/ThreadTests.build/Objects-normal/x86_64/ThreadTest.o unittests/Thread/ThreadTest.cpp normal x86_64 c++ com.apple.compilers.llvm.clang.1_0.compiler cd /Users/buildslave/jenkins/workspace/lldb-cmake-standalone/llvm-project/lldb /Applications/Xcode.app/Contents/Developer/Toolchains/XcodeDefault.xctoolchain/usr/bin/clang -x c++ -target x86_64-apple-macos10.12 -fmessage-length=0 -fdiagnostics-show-note-include-stack -fmacro-backtrace-limit=0 -Wno-trigraphs -fpascal-strings -O3 -Wno-missing-field-initializers -Wno-missing-prototypes -Wnon-virtual-dtor -Woverloaded-virtual -Wno-exit-time-destructors -Wmissing-braces -Wparentheses -Wswitch -Wunused-function -Wno-unused-label -Wno-unused-parameter -Wunused-variable -Wunused-value -Wempty-body -Wuninitialized -Wno-unknown-pragmas -Wno-shadow -Wno-four-char-constants -Wno-conversion -Wconstant-conversion -Wint-conversion -Wbool-conversion -Wenum-conversion -Wno-float-conversion -Wno-non-literal-null-conversion -Wno-objc-literal-conversion -Wsign-compare -Wno-shorten-64-to-32 -Wnewline-eof -Wno-c++11-extensions -DCMAKE_INTDIR=\"Release\" -DGTEST_HAS_RTTI=0 -D_DEBUG -D__STDC_CONSTANT_MACROS -D__STDC_FORMAT_MACROS -D__STDC_LIMIT_MACROS -DHAVE_ROUND -isysroot /Applications/Xcode.app/Contents/Developer/Platforms/MacOSX.platform/Developer/SDKs/MacOSX10.15.sdk -fasm-blocks -fstrict-aliasing -Wdeprecated-declarations -Winvalid-offsetof -Wno-sign-conversion -Wno-infinite-recursion -Wno-move -Wno-comma -Wno-block-capture-autoreleasing -Wno-strict-prototypes -Wno-range-loop-analysis -Wno-semicolon-before-method-body -I/Users/buildslave/jenkins/workspace/lldb-cmake-standalone/lldb-xcode-build/unittests/Thread/Release/include -I/Users/buildslave/jenkins/workspace/lldb-cmake-standalone/lldb-xcode-build/unittests/Thread -I/Users/buildslave/jenkins/workspace/lldb-cmake-standalone/llvm-project/lldb/unittests/Thread -I/Users/buildslave/jenkins/workspace/lldb-cmake-standalone/llvm-project/lldb/include -I/Users/buildslave/jenkins/workspace/lldb-cmake-standalone/lldb-xcode-build/include -I/Users/buildslave/jenkins/workspace/lldb-cmake-standalone/llvm-project/llvm/include -I/Users/buildslave/jenkins/workspace/lldb-cmake-standalone/clang-build/include -I/Users/buildslave/jenkins/workspace/lldb-cmake-standalone/llvm-project/clang/include -I/Users/buildslave/jenkins/workspace/lldb-cmake-standalone/clang-build/tools/clang/include -I/usr/local/Cellar/python/3.7.0/Frameworks/Python.framework/Versions/3.7/include/python3.7m -I/Users/buildslave/jenkins/workspace/lldb-cmake-standalone/llvm-project/lldb/tools/clang/include -I/Users/buildslave/jenkins/workspace/lldb-cmake-standalone/lldb-xcode-build/../clang/include -I/usr/local/include -I/Users/buildslave/jenkins/workspace/lldb-cmake-standalone/llvm-project/lldb/source -I/Users/buildslave/jenkins/workspace/lldb-cmake-standalone/llvm-project/lldb/unittests -isystem /Applications/Xcode.app/Contents/Developer/Platforms/MacOSX.platform/Developer/SDKs/MacOSX10.15.sdk/usr/include/libxml2 -isystem /Users/buildslave/jenkins/workspace/lldb-cmake-standalone/llvm-project/llvm/utils/unittest/googletest/include -isystem /Users/buildslave/jenkins/workspace/lldb-cmake-standalone/llvm-project/llvm/utils/unittest/googlemock/include -I/Users/buildslave/jenkins/workspace/lldb-cmake-standalone/lldb-xcode-build/unittests/Thread/lldb.build/Release/ThreadTests.build/DerivedSources-normal/x86_64 -I/Users/buildslave/jenkins/workspace/lldb-cmake-standalone/lldb-xcode-build/unittests/Thread/lldb.build/Release/ThreadTests.build/DerivedSources/x86_64 -I/Users/buildslave/jenkins/workspace/lldb-cmake-standalone/lldb-xcode-build/unittests/Thread/lldb.build/Release/ThreadTests.build/DerivedSources -F/Users/buildslave/jenkins/workspace/lldb-cmake-standalone/lldb-xcode-build/unittests/Thread/Release -fvisibility-inlines-hidden -Werror=date-time -Werror=unguarded-availability-new -Wall -Wextra -Wno-unused-parameter -Wwrite-strings -Wcast-qual -Wmissing-field-initializers -Wimplicit-fallthrough -Wcovered-switch-default -Wno-noexcept-type -Wnon-virtual-dtor -Wdelete-non-virtual-dtor -Wstring-conversion -Wno-deprecated-declarations -Wno-unknown-pragmas -Wno-strict-aliasing -Wno-deprecated-register -Wno-vla-extension -DNDEBUG -include /Users/buildslave/jenkins/workspace/lldb-cmake-standalone/llvm-project/lldb/unittests/gtest_common.h -fno-exceptions -fno-rtti -UNDEBUG -Wno-suggest-override -std=c++14 -MMD -MT dependencies -MF /Users/buildslave/jenkins/workspace/lldb-cmake-standalone/lldb-xcode-build/unittests/Thread/lldb.build/Release/ThreadTests.build/Objects-normal/x86_64/ThreadTest.d --serialize-diagnostics /Users/buildslave/jenkins/workspace/lldb-cmake-standalone/lldb-xcode-build/unittests/Thread/lldb.build/Release/ThreadTests.build/Objects-normal/x86_64/ThreadTest.dia -c /Users/buildslave/jenkins/workspace/lldb-cmake-standalone/llvm-project/lldb/unittests/Thread/ThreadTest.cpp -o /Users/buildslave/jenkins/workspace/lldb-cmake-standalone/lldb-xcode-build/unittests/Thread/lldb.build/Release/ThreadTests.build/Objects-normal/x86_64/ThreadTest.o warning: unknown warning option '-Wno-suggest-override'; did you mean '-Wno-shift-overflow'? [-Wunknown-warning-option] 1 warning generated.

Hide Details

CompileC /Users/buildslave/jenkins/workspace/lldb-cmake-standalone/lldb-xcode-build/unittests/Thread/lldb.build/Release/ThreadTests.build/Objects-normal/x86_64/dummy.o /Users/buildslave/jenkins/workspace/lldb-cmake-standalone/llvm-project/llvm/cmake/dummy.cpp normal x86_64 c++ com.apple.compilers.llvm.clang.1_0.compiler cd /Users/buildslave/jenkins/workspace/lldb-cmake-standalone/llvm-project/lldb /Applications/Xcode.app/Contents/Developer/Toolchains/XcodeDefault.xctoolchain/usr/bin/clang -x c++ -target x86_64-apple-macos10.12 -fmessage-length=0 -fdiagnostics-show-note-include-stack -fmacro-backtrace-limit=0 -Wno-trigraphs -fpascal-strings -O3 -Wno-missing-field-initializers -Wno-missing-prototypes -Wnon-virtual-dtor -Woverloaded-virtual -Wno-exit-time-destructors -Wmissing-braces -Wparentheses -Wswitch -Wunused-function -Wno-unused-label -Wno-unused-parameter -Wunused-variable -Wunused-value -Wempty-body -Wuninitialized -Wno-unknown-pragmas -Wno-shadow -Wno-four-char-constants -Wno-conversion -Wconstant-conversion -Wint-conversion -Wbool-conversion -Wenum-conversion -Wno-float-conversion -Wno-non-literal-null-conversion -Wno-objc-literal-conversion -Wsign-compare -Wno-shorten-64-to-32 -Wnewline-eof -Wno-c++11-extensions -DCMAKE_INTDIR=\"Release\" -DGTEST_HAS_RTTI=0 -D_DEBUG -D__STDC_CONSTANT_MACROS -D__STDC_FORMAT_MACROS -D__STDC_LIMIT_MACROS -DHAVE_ROUND -isysroot /Applications/Xcode.app/Contents/Developer/Platforms/MacOSX.platform/Developer/SDKs/MacOSX10.15.sdk -fasm-blocks -fstrict-aliasing -Wdeprecated-declarations -Winvalid-offsetof -Wno-sign-conversion -Wno-infinite-recursion -Wno-move -Wno-comma -Wno-block-capture-autoreleasing -Wno-strict-prototypes -Wno-range-loop-analysis -Wno-semicolon-before-method-body -I/Users/buildslave/jenkins/workspace/lldb-cmake-standalone/lldb-xcode-build/unittests/Thread/Release/include -I/Users/buildslave/jenkins/workspace/lldb-cmake-standalone/lldb-xcode-build/unittests/Thread -I/Users/buildslave/jenkins/workspace/lldb-cmake-standalone/llvm-project/lldb/unittests/Thread -I/Users/buildslave/jenkins/workspace/lldb-cmake-standalone/llvm-project/lldb/include -I/Users/buildslave/jenkins/workspace/lldb-cmake-standalone/lldb-xcode-build/include -I/Users/buildslave/jenkins/workspace/lldb-cmake-standalone/llvm-project/llvm/include -I/Users/buildslave/jenkins/workspace/lldb-cmake-standalone/clang-build/include -I/Users/buildslave/jenkins/workspace/lldb-cmake-standalone/llvm-project/clang/include -I/Users/buildslave/jenkins/workspace/lldb-cmake-standalone/clang-build/tools/clang/include -I/usr/local/Cellar/python/3.7.0/Frameworks/Python.framework/Versions/3.7/include/python3.7m -I/Users/buildslave/jenkins/workspace/lldb-cmake-standalone/llvm-project/lldb/tools/clang/include -I/Users/buildslave/jenkins/workspace/lldb-cmake-standalone/lldb-xcode-build/../clang/include -I/usr/local/include -I/Users/buildslave/jenkins/workspace/lldb-cmake-standalone/llvm-project/lldb/source -I/Users/buildslave/jenkins/workspace/lldb-cmake-standalone/llvm-project/lldb/unittests -isystem /Applications/Xcode.app/Contents/Developer/Platforms/MacOSX.platform/Developer/SDKs/MacOSX10.15.sdk/usr/include/libxml2 -isystem /Users/buildslave/jenkins/workspace/lldb-cmake-standalone/llvm-project/llvm/utils/unittest/googletest/include -isystem /Users/buildslave/jenkins/workspace/lldb-cmake-standalone/llvm-project/llvm/utils/unittest/googlemock/include -I/Users/buildslave/jenkins/workspace/lldb-cmake-standalone/lldb-xcode-build/unittests/Thread/lldb.build/Release/ThreadTests.build/DerivedSources-normal/x86_64 -I/Users/buildslave/jenkins/workspace/lldb-cmake-standalone/lldb-xcode-build/unittests/Thread/lldb.build/Release/ThreadTests.build/DerivedSources/x86_64 -I/Users/buildslave/jenkins/workspace/lldb-cmake-standalone/lldb-xcode-build/unittests/Thread/lldb.build/Release/ThreadTests.build/DerivedSources -F/Users/buildslave/jenkins/workspace/lldb-cmake-standalone/lldb-xcode-build/unittests/Thread/Release -fvisibility-inlines-hidden -Werror=date-time -Werror=unguarded-availability-new -Wall -Wextra -Wno-unused-parameter -Wwrite-strings -Wcast-qual -Wmissing-field-initializers -Wimplicit-fallthrough -Wcovered-switch-default -Wno-noexcept-type -Wnon-virtual-dtor -Wdelete-non-virtual-dtor -Wstring-conversion -Wno-deprecated-declarations -Wno-unknown-pragmas -Wno-strict-aliasing -Wno-deprecated-register -Wno-vla-extension -DNDEBUG -include /Users/buildslave/jenkins/workspace/lldb-cmake-standalone/llvm-project/lldb/unittests/gtest_common.h -fno-exceptions -fno-rtti -UNDEBUG -Wno-suggest-override -std=c++14 -MMD -MT dependencies -MF /Users/buildslave/jenkins/workspace/lldb-cmake-standalone/lldb-xcode-build/unittests/Thread/lldb.build/Release/ThreadTests.build/Objects-normal/x86_64/dummy.d --serialize-diagnostics /Users/buildslave/jenkins/workspace/lldb-cmake-standalone/lldb-xcode-build/unittests/Thread/lldb.build/Release/ThreadTests.build/Objects-normal/x86_64/dummy.dia -c /Users/buildslave/jenkins/workspace/lldb-cmake-standalone/llvm-project/llvm/cmake/dummy.cpp -o /Users/buildslave/jenkins/workspace/lldb-cmake-standalone/lldb-xcode-build/unittests/Thread/lldb.build/Release/ThreadTests.build/Objects-normal/x86_64/dummy.o warning: unknown warning option '-Wno-suggest-override'; did you mean '-Wno-shift-overflow'? [-Wunknown-warning-option] 1 warning generated.

Hide Details

Ld /Users/buildslave/jenkins/workspace/lldb-cmake-standalone/lldb-xcode-build/unittests/Thread/Release/ThreadTests normal x86_64 cd /Users/buildslave/jenkins/workspace/lldb-cmake-standalone/llvm-project/lldb /Applications/Xcode.app/Contents/Developer/Toolchains/XcodeDefault.xctoolchain/usr/bin/clang++ -target x86_64-apple-macos10.12 -isysroot /Applications/Xcode.app/Contents/Developer/Platforms/MacOSX.platform/Developer/SDKs/MacOSX10.15.sdk -L/Users/buildslave/jenkins/workspace/lldb-cmake-standalone/lldb-xcode-build/unittests/Thread/Release -F/Users/buildslave/jenkins/workspace/lldb-cmake-standalone/lldb-xcode-build/unittests/Thread/Release -filelist /Users/buildslave/jenkins/workspace/lldb-cmake-standalone/lldb-xcode-build/unittests/Thread/lldb.build/Release/ThreadTests.build/Objects-normal/x86_64/ThreadTests.LinkFileList -Wl,-dead_strip -Wl,-search_paths_first -Wl,-headerpad_max_install_names /Users/buildslave/jenkins/workspace/lldb-cmake-standalone/clang-build/lib/libLLVMSupport.a /Users/buildslave/jenkins/workspace/lldb-cmake-standalone/clang-build/lib/libgtest_main.a /Users/buildslave/jenkins/workspace/lldb-cmake-standalone/clang-build/lib/libgtest.a /Users/buildslave/jenkins/workspace/lldb-cmake-standalone/lldb-xcode-build/Release/lib/liblldbCore.a /Users/buildslave/jenkins/workspace/lldb-cmake-standalone/lldb-xcode-build/Release/lib/liblldbHost.a /Users/buildslave/jenkins/workspace/lldb-cmake-standalone/lldb-xcode-build/Release/lib/liblldbTarget.a /Users/buildslave/jenkins/workspace/lldb-cmake-standalone/lldb-xcode-build/Release/lib/liblldbSymbol.a /Users/buildslave/jenkins/workspace/lldb-cmake-standalone/lldb-xcode-build/Release/lib/liblldbUtility.a /Users/buildslave/jenkins/workspace/lldb-cmake-standalone/lldb-xcode-build/Release/lib/liblldbUtilityHelpers.a /Users/buildslave/jenkins/workspace/lldb-cmake-standalone/lldb-xcode-build/Release/lib/liblldbInterpreter.a /Users/buildslave/jenkins/workspace/lldb-cmake-standalone/lldb-xcode-build/Release/lib/liblldbBreakpoint.a /Users/buildslave/jenkins/workspace/lldb-cmake-standalone/lldb-xcode-build/Release/lib/liblldbPluginPlatformLinux.a /Users/buildslave/jenkins/workspace/lldb-cmake-standalone/clang-build/lib/libgtest.a -lpthread /Users/buildslave/jenkins/workspace/lldb-cmake-standalone/clang-build/lib/libLLVMObjectYAML.a /Users/buildslave/jenkins/workspace/lldb-cmake-standalone/lldb-xcode-build/Release/lib/liblldbPluginPlatformPOSIX.a /Users/buildslave/jenkins/workspace/lldb-cmake-standalone/lldb-xcode-build/Release/lib/liblldbCore.a /Users/buildslave/jenkins/workspace/lldb-cmake-standalone/lldb-xcode-build/Release/lib/liblldbTarget.a /Users/buildslave/jenkins/workspace/lldb-cmake-standalone/lldb-xcode-build/Release/lib/liblldbSymbol.a /Users/buildslave/jenkins/workspace/lldb-cmake-standalone/lldb-xcode-build/Release/lib/liblldbInterpreter.a /Users/buildslave/jenkins/workspace/lldb-cmake-standalone/lldb-xcode-build/Release/lib/liblldbBreakpoint.a /Users/buildslave/jenkins/workspace/lldb-cmake-standalone/lldb-xcode-build/Release/lib/liblldbDataFormatters.a /Users/buildslave/jenkins/workspace/lldb-cmake-standalone/lldb-xcode-build/Release/lib/liblldbExpression.a /Users/buildslave/jenkins/workspace/lldb-cmake-standalone/lldb-xcode-build/Release/lib/liblldbPluginCPlusPlusLanguage.a /Users/buildslave/jenkins/workspace/lldb-cmake-standalone/lldb-xcode-build/Release/lib/liblldbPluginObjCLanguage.a /Users/buildslave/jenkins/workspace/lldb-cmake-standalone/lldb-xcode-build/Release/lib/liblldbPluginProcessUtility.a /Users/buildslave/jenkins/workspace/lldb-cmake-standalone/lldb-xcode-build/Release/lib/liblldbCommands.a /Users/buildslave/jenkins/workspace/lldb-cmake-standalone/lldb-xcode-build/Release/lib/liblldbPluginObjectFileJIT.a /Users/buildslave/jenkins/workspace/lldb-cmake-standalone/lldb-xcode-build/Release/lib/liblldbPluginClangCommon.a /Users/buildslave/jenkins/workspace/lldb-cmake-standalone/lldb-xcode-build/Release/lib/liblldbPluginCPPRuntime.a /Users/buildslave/jenkins/workspace/lldb-cmake-standalone/lldb-xcode-build/Release/lib/liblldbPluginTypeSystemClang.a /Users/buildslave/jenkins/workspace/lldb-cmake-standalone/lldb-xcode-build/Release/lib/liblldbPluginAppleObjCRuntime.a /Users/buildslave/jenkins/workspace/lldb-cmake-standalone/lldb-xcode-build/Release/lib/liblldbPluginExpressionParserClang.a /Users/buildslave/jenkins/workspace/lldb-cmake-standalone/lldb-xcode-build/Release/lib/liblldbPluginSymbolFileDWARF.a /Users/buildslave/jenkins/workspace/lldb-cmake-standalone/lldb-xcode-build/Release/lib/liblldbPluginSymbolFilePDB.a /Users/buildslave/jenkins/workspace/lldb-cmake-standalone/lldb-xcode-build/Release/lib/liblldbPluginObjCRuntime.a /Users/buildslave/jenkins/workspace/lldb-cmake-standalone/lldb-xcode-build/Release/lib/liblldbPluginRenderScriptRuntime.a /Users/buildslave/jenkins/workspace/lldb-cmake-standalone/lldb-xcode-build/Release/lib/liblldbPluginSymbolFileNativePDB.a /Users/buildslave/jenkins/workspace/lldb-cmake-standalone/lldb-xcode-build/Release/lib/liblldbPluginObjectFilePDB.a /Users/buildslave/jenkins/workspace/lldb-cmake-standalone/lldb-xcode-build/Release/lib/liblldbCore.a /Users/buildslave/jenkins/workspace/lldb-cmake-standalone/lldb-xcode-build/Release/lib/liblldbTarget.a /Users/buildslave/jenkins/workspace/lldb-cmake-standalone/lldb-xcode-build/Release/lib/liblldbSymbol.a /Users/buildslave/jenkins/workspace/lldb-cmake-standalone/lldb-xcode-build/Release/lib/liblldbInterpreter.a /Users/buildslave/jenkins/workspace/lldb-cmake-standalone/lldb-xcode-build/Release/lib/liblldbBreakpoint.a /Users/buildslave/jenkins/workspace/lldb-cmake-standalone/lldb-xcode-build/Release/lib/liblldbDataFormatters.a /Users/buildslave/jenkins/workspace/lldb-cmake-standalone/lldb-xcode-build/Release/lib/liblldbExpression.a /Users/buildslave/jenkins/workspace/lldb-cmake-standalone/lldb-xcode-build/Release/lib/liblldbPluginCPlusPlusLanguage.a /Users/buildslave/jenkins/workspace/lldb-cmake-standalone/lldb-xcode-build/Release/lib/liblldbPluginObjCLanguage.a /Users/buildslave/jenkins/workspace/lldb-cmake-standalone/lldb-xcode-build/Release/lib/liblldbPluginProcessUtility.a /Users/buildslave/jenkins/workspace/lldb-cmake-standalone/lldb-xcode-build/Release/lib/liblldbCommands.a /Users/buildslave/jenkins/workspace/lldb-cmake-standalone/lldb-xcode-build/Release/lib/liblldbPluginObjectFileJIT.a /Users/buildslave/jenkins/workspace/lldb-cmake-standalone/lldb-xcode-build/Release/lib/liblldbPluginClangCommon.a /Users/buildslave/jenkins/workspace/lldb-cmake-standalone/lldb-xcode-build/Release/lib/liblldbPluginCPPRuntime.a /Users/buildslave/jenkins/workspace/lldb-cmake-standalone/lldb-xcode-build/Release/lib/liblldbPluginTypeSystemClang.a /Users/buildslave/jenkins/workspace/lldb-cmake-standalone/lldb-xcode-build/Release/lib/liblldbPluginAppleObjCRuntime.a /Users/buildslave/jenkins/workspace/lldb-cmake-standalone/lldb-xcode-build/Release/lib/liblldbPluginExpressionParserClang.a /Users/buildslave/jenkins/workspace/lldb-cmake-standalone/lldb-xcode-build/Release/lib/liblldbPluginSymbolFileDWARF.a /Users/buildslave/jenkins/workspace/lldb-cmake-standalone/lldb-xcode-build/Release/lib/liblldbPluginSymbolFilePDB.a /Users/buildslave/jenkins/workspace/lldb-cmake-standalone/lldb-xcode-build/Release/lib/liblldbPluginObjCRuntime.a /Users/buildslave/jenkins/workspace/lldb-cmake-standalone/lldb-xcode-build/Release/lib/liblldbPluginRenderScriptRuntime.a /Users/buildslave/jenkins/workspace/lldb-cmake-standalone/lldb-xcode-build/Release/lib/liblldbPluginSymbolFileNativePDB.a /Users/buildslave/jenkins/workspace/lldb-cmake-standalone/lldb-xcode-build/Release/lib/liblldbPluginObjectFilePDB.a /Users/buildslave/jenkins/workspace/lldb-cmake-standalone/lldb-xcode-build/Release/lib/liblldbCore.a /Users/buildslave/jenkins/workspace/lldb-cmake-standalone/lldb-xcode-build/Release/lib/liblldbTarget.a /Users/buildslave/jenkins/workspace/lldb-cmake-standalone/lldb-xcode-build/Release/lib/liblldbSymbol.a /Users/buildslave/jenkins/workspace/lldb-cmake-standalone/lldb-xcode-build/Release/lib/liblldbInterpreter.a /Users/buildslave/jenkins/workspace/lldb-cmake-standalone/lldb-xcode-build/Release/lib/liblldbBreakpoint.a /Users/buildslave/jenkins/workspace/lldb-cmake-standalone/lldb-xcode-build/Release/lib/liblldbDataFormatters.a /Users/buildslave/jenkins/workspace/lldb-cmake-standalone/lldb-xcode-build/Release/lib/liblldbExpression.a /Users/buildslave/jenkins/workspace/lldb-cmake-standalone/lldb-xcode-build/Release/lib/liblldbPluginCPlusPlusLanguage.a /Users/buildslave/jenkins/workspace/lldb-cmake-standalone/lldb-xcode-build/Release/lib/liblldbPluginObjCLanguage.a /Users/buildslave/jenkins/workspace/lldb-cmake-standalone/lldb-xcode-build/Release/lib/liblldbPluginProcessUtility.a /Users/buildslave/jenkins/workspace/lldb-cmake-standalone/lldb-xcode-build/Release/lib/liblldbCommands.a /Users/buildslave/jenkins/workspace/lldb-cmake-standalone/lldb-xcode-build/Release/lib/liblldbPluginObjectFileJIT.a /Users/buildslave/jenkins/workspace/lldb-cmake-standalone/lldb-xcode-build/Release/lib/liblldbPluginClangCommon.a /Users/buildslave/jenkins/workspace/lldb-cmake-standalone/lldb-xcode-build/Release/lib/liblldbPluginCPPRuntime.a /Users/buildslave/jenkins/workspace/lldb-cmake-standalone/lldb-xcode-build/Release/lib/liblldbPluginTypeSystemClang.a /Users/buildslave/jenkins/workspace/lldb-cmake-standalone/lldb-xcode-build/Release/lib/liblldbPluginAppleObjCRuntime.a /Users/buildslave/jenkins/workspace/lldb-cmake-standalone/lldb-xcode-build/Release/lib/liblldbPluginExpressionParserClang.a /Users/buildslave/jenkins/workspace/lldb-cmake-standalone/lldb-xcode-build/Release/lib/liblldbPluginSymbolFileDWARF.a /Users/buildslave/jenkins/workspace/lldb-cmake-standalone/lldb-xcode-build/Release/lib/liblldbPluginSymbolFilePDB.a /Users/buildslave/jenkins/workspace/lldb-cmake-standalone/lldb-xcode-build/Release/lib/liblldbPluginObjCRuntime.a /Users/buildslave/jenkins/workspace/lldb-cmake-standalone/lldb-xcode-build/Release/lib/liblldbPluginRenderScriptRuntime.a /Users/buildslave/jenkins/workspace/lldb-cmake-standalone/lldb-xcode-build/Release/lib/liblldbPluginSymbolFileNativePDB.a /Users/buildslave/jenkins/workspace/lldb-cmake-standalone/lldb-xcode-build/Release/lib/liblldbPluginObjectFilePDB.a /Users/buildslave/jenkins/workspace/lldb-cmake-standalone/lldb-xcode-build/Release/lib/liblldbCore.a /Users/buildslave/jenkins/workspace/lldb-cmake-standalone/lldb-xcode-build/Release/lib/liblldbTarget.a /Users/buildslave/jenkins/workspace/lldb-cmake-standalone/lldb-xcode-build/Release/lib/liblldbSymbol.a /Users/buildslave/jenkins/workspace/lldb-cmake-standalone/lldb-xcode-build/Release/lib/liblldbInterpreter.a /Users/buildslave/jenkins/workspace/lldb-cmake-standalone/lldb-xcode-build/Release/lib/liblldbBreakpoint.a /Users/buildslave/jenkins/workspace/lldb-cmake-standalone/lldb-xcode-build/Release/lib/liblldbDataFormatters.a /Users/buildslave/jenkins/workspace/lldb-cmake-standalone/lldb-xcode-build/Release/lib/liblldbExpression.a /Users/buildslave/jenkins/workspace/lldb-cmake-standalone/lldb-xcode-build/Release/lib/liblldbPluginCPlusPlusLanguage.a /Users/buildslave/jenkins/workspace/lldb-cmake-standalone/lldb-xcode-build/Release/lib/liblldbPluginObjCLanguage.a /Users/buildslave/jenkins/workspace/lldb-cmake-standalone/lldb-xcode-build/Release/lib/liblldbPluginProcessUtility.a /Users/buildslave/jenkins/workspace/lldb-cmake-standalone/lldb-xcode-build/Release/lib/liblldbCommands.a /Users/buildslave/jenkins/workspace/lldb-cmake-standalone/lldb-xcode-build/Release/lib/liblldbPluginObjectFileJIT.a /Users/buildslave/jenkins/workspace/lldb-cmake-standalone/lldb-xcode-build/Release/lib/liblldbPluginClangCommon.a /Users/buildslave/jenkins/workspace/lldb-cmake-standalone/lldb-xcode-build/Release/lib/liblldbPluginCPPRuntime.a /Users/buildslave/jenkins/workspace/lldb-cmake-standalone/lldb-xcode-build/Release/lib/liblldbPluginTypeSystemClang.a /Users/buildslave/jenkins/workspace/lldb-cmake-standalone/lldb-xcode-build/Release/lib/liblldbPluginAppleObjCRuntime.a /Users/buildslave/jenkins/workspace/lldb-cmake-standalone/lldb-xcode-build/Release/lib/liblldbPluginExpressionParserClang.a /Users/buildslave/jenkins/workspace/lldb-cmake-standalone/lldb-xcode-build/Release/lib/liblldbPluginSymbolFileDWARF.a /Users/buildslave/jenkins/workspace/lldb-cmake-standalone/lldb-xcode-build/Release/lib/liblldbPluginSymbolFilePDB.a /Users/buildslave/jenkins/workspace/lldb-cmake-standalone/lldb-xcode-build/Release/lib/liblldbPluginObjCRuntime.a /Users/buildslave/jenkins/workspace/lldb-cmake-standalone/lldb-xcode-build/Release/lib/liblldbPluginRenderScriptRuntime.a /Users/buildslave/jenkins/workspace/lldb-cmake-standalone/lldb-xcode-build/Release/lib/liblldbPluginSymbolFileNativePDB.a /Users/buildslave/jenkins/workspace/lldb-cmake-standalone/lldb-xcode-build/Release/lib/liblldbPluginObjectFilePDB.a /Users/buildslave/jenkins/workspace/lldb-cmake-standalone/lldb-xcode-build/Release/lib/liblldbCore.a /Users/buildslave/jenkins/workspace/lldb-cmake-standalone/lldb-xcode-build/Release/lib/liblldbTarget.a /Users/buildslave/jenkins/workspace/lldb-cmake-standalone/lldb-xcode-build/Release/lib/liblldbSymbol.a /Users/buildslave/jenkins/workspace/lldb-cmake-standalone/lldb-xcode-build/Release/lib/liblldbInterpreter.a /Users/buildslave/jenkins/workspace/lldb-cmake-standalone/lldb-xcode-build/Release/lib/liblldbBreakpoint.a /Users/buildslave/jenkins/workspace/lldb-cmake-standalone/lldb-xcode-build/Release/lib/liblldbDataFormatters.a /Users/buildslave/jenkins/workspace/lldb-cmake-standalone/lldb-xcode-build/Release/lib/liblldbExpression.a /Users/buildslave/jenkins/workspace/lldb-cmake-standalone/lldb-xcode-build/Release/lib/liblldbPluginCPlusPlusLanguage.a /Users/buildslave/jenkins/workspace/lldb-cmake-standalone/lldb-xcode-build/Release/lib/liblldbPluginObjCLanguage.a /Users/buildslave/jenkins/workspace/lldb-cmake-standalone/lldb-xcode-build/Release/lib/liblldbPluginProcessUtility.a /Users/buildslave/jenkins/workspace/lldb-cmake-standalone/lldb-xcode-build/Release/lib/liblldbCommands.a /Users/buildslave/jenkins/workspace/lldb-cmake-standalone/lldb-xcode-build/Release/lib/liblldbPluginObjectFileJIT.a /Users/buildslave/jenkins/workspace/lldb-cmake-standalone/lldb-xcode-build/Release/lib/liblldbPluginClangCommon.a /Users/buildslave/jenkins/workspace/lldb-cmake-standalone/lldb-xcode-build/Release/lib/liblldbPluginCPPRuntime.a /Users/buildslave/jenkins/workspace/lldb-cmake-standalone/lldb-xcode-build/Release/lib/liblldbPluginTypeSystemClang.a /Users/buildslave/jenkins/workspace/lldb-cmake-standalone/lldb-xcode-build/Release/lib/liblldbPluginAppleObjCRuntime.a /Users/buildslave/jenkins/workspace/lldb-cmake-standalone/lldb-xcode-build/Release/lib/liblldbPluginExpressionParserClang.a /Users/buildslave/jenkins/workspace/lldb-cmake-standalone/lldb-xcode-build/Release/lib/liblldbPluginSymbolFileDWARF.a /Users/buildslave/jenkins/workspace/lldb-cmake-standalone/lldb-xcode-build/Release/lib/liblldbPluginSymbolFilePDB.a /Users/buildslave/jenkins/workspace/lldb-cmake-standalone/lldb-xcode-build/Release/lib/liblldbPluginObjCRuntime.a /Users/buildslave/jenkins/workspace/lldb-cmake-standalone/lldb-xcode-build/Release/lib/liblldbPluginRenderScriptRuntime.a /Users/buildslave/jenkins/workspace/lldb-cmake-standalone/lldb-xcode-build/Release/lib/liblldbPluginSymbolFileNativePDB.a /Users/buildslave/jenkins/workspace/lldb-cmake-standalone/lldb-xcode-build/Release/lib/liblldbPluginObjectFilePDB.a /usr/lib/libcurses.dylib /usr/lib/libform.dylib /usr/lib/libpanel.dylib /Users/buildslave/jenkins/workspace/lldb-cmake-standalone/lldb-xcode-build/Release/lib/liblldbVersion.a /Users/buildslave/jenkins/workspace/lldb-cmake-standalone/clang-build/lib/libLLVMMCJIT.a /Users/buildslave/jenkins/workspace/lldb-cmake-standalone/clang-build/lib/libLLVMExecutionEngine.a /Users/buildslave/jenkins/workspace/lldb-cmake-standalone/clang-build/lib/libLLVMOrcTargetProcess.a /Users/buildslave/jenkins/workspace/lldb-cmake-standalone/clang-build/lib/libLLVMOrcShared.a /Users/buildslave/jenkins/workspace/lldb-cmake-standalone/clang-build/lib/libLLVMRuntimeDyld.a /Users/buildslave/jenkins/workspace/lldb-cmake-standalone/clang-build/lib/libclangCodeGen.a /Users/buildslave/jenkins/workspace/lldb-cmake-standalone/clang-build/lib/libLLVMCoverage.a /Users/buildslave/jenkins/workspace/lldb-cmake-standalone/clang-build/lib/libLLVMLTO.a /Users/buildslave/jenkins/workspace/lldb-cmake-standalone/clang-build/lib/libLLVMExtensions.a /Users/buildslave/jenkins/workspace/lldb-cmake-standalone/clang-build/lib/libLLVMCodeGen.a /Users/buildslave/jenkins/workspace/lldb-cmake-standalone/clang-build/lib/libLLVMPasses.a /Users/buildslave/jenkins/workspace/lldb-cmake-standalone/clang-build/lib/libLLVMCoroutines.a /Users/buildslave/jenkins/workspace/lldb-cmake-standalone/clang-build/lib/libLLVMipo.a /Users/buildslave/jenkins/workspace/lldb-cmake-standalone/clang-build/lib/libLLVMBitWriter.a /Users/buildslave/jenkins/workspace/lldb-cmake-standalone/clang-build/lib/libLLVMLinker.a /Users/buildslave/jenkins/workspace/lldb-cmake-standalone/clang-build/lib/libLLVMVectorize.a /Users/buildslave/jenkins/workspace/lldb-cmake-standalone/clang-build/lib/libLLVMInstrumentation.a /Users/buildslave/jenkins/workspace/lldb-cmake-standalone/clang-build/lib/libLLVMObjCARCOpts.a /Users/buildslave/jenkins/workspace/lldb-cmake-standalone/clang-build/lib/libclangRewriteFrontend.a /Users/buildslave/jenkins/workspace/lldb-cmake-standalone/clang-build/lib/libclangFrontend.a /Users/buildslave/jenkins/workspace/lldb-cmake-standalone/clang-build/lib/libclangDriver.a /Users/buildslave/jenkins/workspace/lldb-cmake-standalone/clang-build/lib/libLLVMOption.a /Users/buildslave/jenkins/workspace/lldb-cmake-standalone/clang-build/lib/libclangParse.a /Users/buildslave/jenkins/workspace/lldb-cmake-standalone/clang-build/lib/libclangRewrite.a /Users/buildslave/jenkins/workspace/lldb-cmake-standalone/clang-build/lib/libclangSerialization.a /Users/buildslave/jenkins/workspace/lldb-cmake-standalone/clang-build/lib/libclangSema.a /Users/buildslave/jenkins/workspace/lldb-cmake-standalone/clang-build/lib/libclangEdit.a /Users/buildslave/jenkins/workspace/lldb-cmake-standalone/clang-build/lib/libclangAnalysis.a /Users/buildslave/jenkins/workspace/lldb-cmake-standalone/clang-build/lib/libclangASTMatchers.a /Users/buildslave/jenkins/workspace/lldb-cmake-standalone/clang-build/lib/libLLVMDebugInfoDWARF.a /Users/buildslave/jenkins/workspace/lldb-cmake-standalone/lldb-xcode-build/Release/lib/liblldbHost.a /usr/lib/libxml2.dylib /usr/lib/libedit.dylib /usr/local/lib/liblzma.dylib /usr/lib/libedit.dylib /usr/local/lib/liblzma.dylib /Users/buildslave/jenkins/workspace/lldb-cmake-standalone/lldb-xcode-build/Release/lib/liblldbHostMacOSXObjCXX.a /Users/buildslave/jenkins/workspace/lldb-cmake-standalone/clang-build/lib/libLLVMTarget.a /Users/buildslave/jenkins/workspace/lldb-cmake-standalone/clang-build/lib/libLLVMIRReader.a /Users/buildslave/jenkins/workspace/lldb-cmake-standalone/clang-build/lib/libLLVMAsmParser.a /Users/buildslave/jenkins/workspace/lldb-cmake-standalone/clang-build/lib/libclangAST.a /Users/buildslave/jenkins/workspace/lldb-cmake-standalone/clang-build/lib/libLLVMFrontendOpenMP.a /Users/buildslave/jenkins/workspace/lldb-cmake-standalone/clang-build/lib/libLLVMScalarOpts.a /Users/buildslave/jenkins/workspace/lldb-cmake-standalone/clang-build/lib/libLLVMAggressiveInstCombine.a /Users/buildslave/jenkins/workspace/lldb-cmake-standalone/clang-build/lib/libLLVMInstCombine.a /Users/buildslave/jenkins/workspace/lldb-cmake-standalone/clang-build/lib/libLLVMTransformUtils.a /Users/buildslave/jenkins/workspace/lldb-cmake-standalone/clang-build/lib/libLLVMAnalysis.a /Users/buildslave/jenkins/workspace/lldb-cmake-standalone/clang-build/lib/libLLVMProfileData.a /Users/buildslave/jenkins/workspace/lldb-cmake-standalone/clang-build/lib/libclangLex.a /Users/buildslave/jenkins/workspace/lldb-cmake-standalone/clang-build/lib/libclangBasic.a /Users/buildslave/jenkins/workspace/lldb-cmake-standalone/clang-build/lib/libLLVMDebugInfoPDB.a /Users/buildslave/jenkins/workspace/lldb-cmake-standalone/clang-build/lib/libLLVMObject.a /Users/buildslave/jenkins/workspace/lldb-cmake-standalone/clang-build/lib/libLLVMBitReader.a /Users/buildslave/jenkins/workspace/lldb-cmake-standalone/clang-build/lib/libLLVMCore.a /Users/buildslave/jenkins/workspace/lldb-cmake-standalone/clang-build/lib/libLLVMRemarks.a /Users/buildslave/jenkins/workspace/lldb-cmake-standalone/clang-build/lib/libLLVMBitstreamReader.a /Users/buildslave/jenkins/workspace/lldb-cmake-standalone/clang-build/lib/libLLVMMCParser.a /Users/buildslave/jenkins/workspace/lldb-cmake-standalone/clang-build/lib/libLLVMMC.a /Users/buildslave/jenkins/workspace/lldb-cmake-standalone/clang-build/lib/libLLVMTextAPI.a /Users/buildslave/jenkins/workspace/lldb-cmake-standalone/clang-build/lib/libLLVMDebugInfoCodeView.a /Users/buildslave/jenkins/workspace/lldb-cmake-standalone/clang-build/lib/libLLVMDebugInfoMSF.a /Users/buildslave/jenkins/workspace/lldb-cmake-standalone/lldb-xcode-build/Release/lib/liblldbUtility.a -framework Foundation -framework CoreFoundation -framework CoreServices -framework Security /Users/buildslave/jenkins/workspace/lldb-cmake-standalone/clang-build/lib/libLLVMBinaryFormat.a /Users/buildslave/jenkins/workspace/lldb-cmake-standalone/clang-build/lib/libLLVMSupport.a -lm /usr/lib/libz.dylib /usr/lib/libcurses.dylib /Users/buildslave/jenkins/workspace/lldb-cmake-standalone/clang-build/lib/libLLVMDemangle.a -Xlinker -dependency_info -Xlinker /Users/buildslave/jenkins/workspace/lldb-cmake-standalone/lldb-xcode-build/unittests/Thread/lldb.build/Release/ThreadTests.build/Objects-normal/x86_64/ThreadTests_dependency_info.dat -o /Users/buildslave/jenkins/workspace/lldb-cmake-standalone/lldb-xcode-build/unittests/Thread/Release/ThreadTests

Hide Details

PhaseScriptExecution CMake\ PostBuild\ Rules /Users/buildslave/jenkins/workspace/lldb-cmake-standalone/lldb-xcode-build/unittests/Thread/lldb.build/Release/ThreadTests.build/Script-767D78D21C4D41A784F63460.sh cd /Users/buildslave/jenkins/workspace/lldb-cmake-standalone/llvm-project/lldb /bin/sh -c /Users/buildslave/jenkins/workspace/lldb-cmake-standalone/lldb-xcode-build/unittests/Thread/lldb.build/Release/ThreadTests.build/Script-767D78D21C4D41A784F63460.sh /usr/local/Cellar/cmake/3.17.2/bin/cmake -E make_directory /Users/buildslave/jenkins/workspace/lldb-cmake-standalone/lldb-xcode-build/unittests/Thread/Release/Inputs

Hide Details

ProcessProductPackaging "" /Users/buildslave/jenkins/workspace/lldb-cmake-standalone/lldb-xcode-build/unittests/Thread/lldb.build/Release/ThreadTests.build/ThreadTests.xcent cd /Users/buildslave/jenkins/workspace/lldb-cmake-standalone/llvm-project/lldb

Hide Details

Hide Details

Entitlements:

Hide Details

{ "com.apple.security.get-task-allow" = 1; }

Hide Details

Hide Details

builtin-productPackagingUtility -entitlements -format xml -o /Users/buildslave/jenkins/workspace/lldb-cmake-standalone/lldb-xcode-build/unittests/Thread/lldb.build/Release/ThreadTests.build/ThreadTests.xcent

Hide Details

CodeSign /Users/buildslave/jenkins/workspace/lldb-cmake-standalone/lldb-xcode-build/unittests/Thread/Release/ThreadTests cd /Users/buildslave/jenkins/workspace/lldb-cmake-standalone/llvm-project/lldb

Hide Details

Signing Identity: "-"

Hide Details

/usr/bin/codesign --force --sign - --entitlements /Users/buildslave/jenkins/workspace/lldb-cmake-standalone/lldb-xcode-build/unittests/Thread/lldb.build/Release/ThreadTests.build/ThreadTests.xcent --timestamp=none /Users/buildslave/jenkins/workspace/lldb-cmake-standalone/lldb-xcode-build/unittests/Thread/Release/ThreadTests

Hide Details

=== BUILD TARGET debugserverTests OF PROJECT lldb WITH CONFIGURATION Release ===

Hide Details

Check dependencies

Hide Details

Write auxiliary files /bin/mkdir -p /Users/buildslave/jenkins/workspace/lldb-cmake-standalone/lldb-xcode-build/unittests/debugserver/lldb.build/Release/debugserverTests.build/Objects-normal/x86_64 write-file /Users/buildslave/jenkins/workspace/lldb-cmake-standalone/lldb-xcode-build/unittests/debugserver/lldb.build/Release/debugserverTests.build/Objects-normal/x86_64/debugserverTests.LinkFileList write-file /Users/buildslave/jenkins/workspace/lldb-cmake-standalone/lldb-xcode-build/unittests/debugserver/lldb.build/Release/debugserverTests.build/Script-05B6E1DA831443EBB32559DA.sh chmod 0755 /Users/buildslave/jenkins/workspace/lldb-cmake-standalone/lldb-xcode-build/unittests/debugserver/lldb.build/Release/debugserverTests.build/Script-05B6E1DA831443EBB32559DA.sh

Hide Details

CompileC /Users/buildslave/jenkins/workspace/lldb-cmake-standalone/lldb-xcode-build/unittests/debugserver/lldb.build/Release/debugserverTests.build/Objects-normal/x86_64/JSONTest.o unittests/debugserver/JSONTest.cpp normal x86_64 c++ com.apple.compilers.llvm.clang.1_0.compiler cd /Users/buildslave/jenkins/workspace/lldb-cmake-standalone/llvm-project/lldb /Applications/Xcode.app/Contents/Developer/Toolchains/XcodeDefault.xctoolchain/usr/bin/clang -x c++ -target x86_64-apple-macos10.12 -fmessage-length=0 -fdiagnostics-show-note-include-stack -fmacro-backtrace-limit=0 -Wno-trigraphs -fpascal-strings -O3 -Wno-missing-field-initializers -Wno-missing-prototypes -Wnon-virtual-dtor -Woverloaded-virtual -Wno-exit-time-destructors -Wmissing-braces -Wparentheses -Wswitch -Wunused-function -Wno-unused-label -Wno-unused-parameter -Wunused-variable -Wunused-value -Wempty-body -Wuninitialized -Wno-unknown-pragmas -Wno-shadow -Wno-four-char-constants -Wno-conversion -Wconstant-conversion -Wint-conversion -Wbool-conversion -Wenum-conversion -Wno-float-conversion -Wno-non-literal-null-conversion -Wno-objc-literal-conversion -Wsign-compare -Wno-shorten-64-to-32 -Wnewline-eof -Wno-c++11-extensions -DCMAKE_INTDIR=\"Release\" -DGTEST_HAS_RTTI=0 -D_DEBUG -D__STDC_CONSTANT_MACROS -D__STDC_FORMAT_MACROS -D__STDC_LIMIT_MACROS -DHAVE_ROUND -isysroot /Applications/Xcode.app/Contents/Developer/Platforms/MacOSX.platform/Developer/SDKs/MacOSX10.15.sdk -fasm-blocks -fstrict-aliasing -Wdeprecated-declarations -Winvalid-offsetof -Wno-sign-conversion -Wno-infinite-recursion -Wno-move -Wno-comma -Wno-block-capture-autoreleasing -Wno-strict-prototypes -Wno-range-loop-analysis -Wno-semicolon-before-method-body -I/Users/buildslave/jenkins/workspace/lldb-cmake-standalone/lldb-xcode-build/unittests/debugserver/Release/include -I/Users/buildslave/jenkins/workspace/lldb-cmake-standalone/lldb-xcode-build/unittests/debugserver -I/Users/buildslave/jenkins/workspace/lldb-cmake-standalone/llvm-project/lldb/unittests/debugserver -I/Users/buildslave/jenkins/workspace/lldb-cmake-standalone/llvm-project/lldb/include -I/Users/buildslave/jenkins/workspace/lldb-cmake-standalone/lldb-xcode-build/include -I/Users/buildslave/jenkins/workspace/lldb-cmake-standalone/llvm-project/llvm/include -I/Users/buildslave/jenkins/workspace/lldb-cmake-standalone/clang-build/include -I/Users/buildslave/jenkins/workspace/lldb-cmake-standalone/llvm-project/clang/include -I/Users/buildslave/jenkins/workspace/lldb-cmake-standalone/clang-build/tools/clang/include -I/usr/local/Cellar/python/3.7.0/Frameworks/Python.framework/Versions/3.7/include/python3.7m -I/Users/buildslave/jenkins/workspace/lldb-cmake-standalone/llvm-project/lldb/tools/clang/include -I/Users/buildslave/jenkins/workspace/lldb-cmake-standalone/lldb-xcode-build/../clang/include -I/usr/local/include -I/Users/buildslave/jenkins/workspace/lldb-cmake-standalone/llvm-project/lldb/source -I/Users/buildslave/jenkins/workspace/lldb-cmake-standalone/llvm-project/lldb/unittests -I/Users/buildslave/jenkins/workspace/lldb-cmake-standalone/llvm-project/lldb/tools/debugserver/source -I/Users/buildslave/jenkins/workspace/lldb-cmake-standalone/llvm-project/lldb/tools/debugserver/source/MacOSX -isystem /Applications/Xcode.app/Contents/Developer/Platforms/MacOSX.platform/Developer/SDKs/MacOSX10.15.sdk/usr/include/libxml2 -isystem /Users/buildslave/jenkins/workspace/lldb-cmake-standalone/llvm-project/llvm/utils/unittest/googletest/include -isystem /Users/buildslave/jenkins/workspace/lldb-cmake-standalone/llvm-project/llvm/utils/unittest/googlemock/include -I/Users/buildslave/jenkins/workspace/lldb-cmake-standalone/lldb-xcode-build/unittests/debugserver/lldb.build/Release/debugserverTests.build/DerivedSources-normal/x86_64 -I/Users/buildslave/jenkins/workspace/lldb-cmake-standalone/lldb-xcode-build/unittests/debugserver/lldb.build/Release/debugserverTests.build/DerivedSources/x86_64 -I/Users/buildslave/jenkins/workspace/lldb-cmake-standalone/lldb-xcode-build/unittests/debugserver/lldb.build/Release/debugserverTests.build/DerivedSources -F/Users/buildslave/jenkins/workspace/lldb-cmake-standalone/lldb-xcode-build/unittests/debugserver/Release -fvisibility-inlines-hidden -Werror=date-time -Werror=unguarded-availability-new -Wall -Wextra -Wno-unused-parameter -Wwrite-strings -Wcast-qual -Wmissing-field-initializers -Wimplicit-fallthrough -Wcovered-switch-default -Wno-noexcept-type -Wnon-virtual-dtor -Wdelete-non-virtual-dtor -Wstring-conversion -Wno-deprecated-declarations -Wno-unknown-pragmas -Wno-strict-aliasing -Wno-deprecated-register -Wno-vla-extension -DNDEBUG -include /Users/buildslave/jenkins/workspace/lldb-cmake-standalone/llvm-project/lldb/unittests/gtest_common.h -fno-exceptions -fno-rtti -UNDEBUG -Wno-suggest-override -std=c++14 -MMD -MT dependencies -MF /Users/buildslave/jenkins/workspace/lldb-cmake-standalone/lldb-xcode-build/unittests/debugserver/lldb.build/Release/debugserverTests.build/Objects-normal/x86_64/JSONTest.d --serialize-diagnostics /Users/buildslave/jenkins/workspace/lldb-cmake-standalone/lldb-xcode-build/unittests/debugserver/lldb.build/Release/debugserverTests.build/Objects-normal/x86_64/JSONTest.dia -c /Users/buildslave/jenkins/workspace/lldb-cmake-standalone/llvm-project/lldb/unittests/debugserver/JSONTest.cpp -o /Users/buildslave/jenkins/workspace/lldb-cmake-standalone/lldb-xcode-build/unittests/debugserver/lldb.build/Release/debugserverTests.build/Objects-normal/x86_64/JSONTest.o warning: unknown warning option '-Wno-suggest-override'; did you mean '-Wno-shift-overflow'? [-Wunknown-warning-option] 1 warning generated.

Hide Details

CompileC /Users/buildslave/jenkins/workspace/lldb-cmake-standalone/lldb-xcode-build/unittests/debugserver/lldb.build/Release/debugserverTests.build/Objects-normal/x86_64/RNBSocketTest.o unittests/debugserver/RNBSocketTest.cpp normal x86_64 c++ com.apple.compilers.llvm.clang.1_0.compiler cd /Users/buildslave/jenkins/workspace/lldb-cmake-standalone/llvm-project/lldb /Applications/Xcode.app/Contents/Developer/Toolchains/XcodeDefault.xctoolchain/usr/bin/clang -x c++ -target x86_64-apple-macos10.12 -fmessage-length=0 -fdiagnostics-show-note-include-stack -fmacro-backtrace-limit=0 -Wno-trigraphs -fpascal-strings -O3 -Wno-missing-field-initializers -Wno-missing-prototypes -Wnon-virtual-dtor -Woverloaded-virtual -Wno-exit-time-destructors -Wmissing-braces -Wparentheses -Wswitch -Wunused-function -Wno-unused-label -Wno-unused-parameter -Wunused-variable -Wunused-value -Wempty-body -Wuninitialized -Wno-unknown-pragmas -Wno-shadow -Wno-four-char-constants -Wno-conversion -Wconstant-conversion -Wint-conversion -Wbool-conversion -Wenum-conversion -Wno-float-conversion -Wno-non-literal-null-conversion -Wno-objc-literal-conversion -Wsign-compare -Wno-shorten-64-to-32 -Wnewline-eof -Wno-c++11-extensions -DCMAKE_INTDIR=\"Release\" -DGTEST_HAS_RTTI=0 -D_DEBUG -D__STDC_CONSTANT_MACROS -D__STDC_FORMAT_MACROS -D__STDC_LIMIT_MACROS -DHAVE_ROUND -isysroot /Applications/Xcode.app/Contents/Developer/Platforms/MacOSX.platform/Developer/SDKs/MacOSX10.15.sdk -fasm-blocks -fstrict-aliasing -Wdeprecated-declarations -Winvalid-offsetof -Wno-sign-conversion -Wno-infinite-recursion -Wno-move -Wno-comma -Wno-block-capture-autoreleasing -Wno-strict-prototypes -Wno-range-loop-analysis -Wno-semicolon-before-method-body -I/Users/buildslave/jenkins/workspace/lldb-cmake-standalone/lldb-xcode-build/unittests/debugserver/Release/include -I/Users/buildslave/jenkins/workspace/lldb-cmake-standalone/lldb-xcode-build/unittests/debugserver -I/Users/buildslave/jenkins/workspace/lldb-cmake-standalone/llvm-project/lldb/unittests/debugserver -I/Users/buildslave/jenkins/workspace/lldb-cmake-standalone/llvm-project/lldb/include -I/Users/buildslave/jenkins/workspace/lldb-cmake-standalone/lldb-xcode-build/include -I/Users/buildslave/jenkins/workspace/lldb-cmake-standalone/llvm-project/llvm/include -I/Users/buildslave/jenkins/workspace/lldb-cmake-standalone/clang-build/include -I/Users/buildslave/jenkins/workspace/lldb-cmake-standalone/llvm-project/clang/include -I/Users/buildslave/jenkins/workspace/lldb-cmake-standalone/clang-build/tools/clang/include -I/usr/local/Cellar/python/3.7.0/Frameworks/Python.framework/Versions/3.7/include/python3.7m -I/Users/buildslave/jenkins/workspace/lldb-cmake-standalone/llvm-project/lldb/tools/clang/include -I/Users/buildslave/jenkins/workspace/lldb-cmake-standalone/lldb-xcode-build/../clang/include -I/usr/local/include -I/Users/buildslave/jenkins/workspace/lldb-cmake-standalone/llvm-project/lldb/source -I/Users/buildslave/jenkins/workspace/lldb-cmake-standalone/llvm-project/lldb/unittests -I/Users/buildslave/jenkins/workspace/lldb-cmake-standalone/llvm-project/lldb/tools/debugserver/source -I/Users/buildslave/jenkins/workspace/lldb-cmake-standalone/llvm-project/lldb/tools/debugserver/source/MacOSX -isystem /Applications/Xcode.app/Contents/Developer/Platforms/MacOSX.platform/Developer/SDKs/MacOSX10.15.sdk/usr/include/libxml2 -isystem /Users/buildslave/jenkins/workspace/lldb-cmake-standalone/llvm-project/llvm/utils/unittest/googletest/include -isystem /Users/buildslave/jenkins/workspace/lldb-cmake-standalone/llvm-project/llvm/utils/unittest/googlemock/include -I/Users/buildslave/jenkins/workspace/lldb-cmake-standalone/lldb-xcode-build/unittests/debugserver/lldb.build/Release/debugserverTests.build/DerivedSources-normal/x86_64 -I/Users/buildslave/jenkins/workspace/lldb-cmake-standalone/lldb-xcode-build/unittests/debugserver/lldb.build/Release/debugserverTests.build/DerivedSources/x86_64 -I/Users/buildslave/jenkins/workspace/lldb-cmake-standalone/lldb-xcode-build/unittests/debugserver/lldb.build/Release/debugserverTests.build/DerivedSources -F/Users/buildslave/jenkins/workspace/lldb-cmake-standalone/lldb-xcode-build/unittests/debugserver/Release -fvisibility-inlines-hidden -Werror=date-time -Werror=unguarded-availability-new -Wall -Wextra -Wno-unused-parameter -Wwrite-strings -Wcast-qual -Wmissing-field-initializers -Wimplicit-fallthrough -Wcovered-switch-default -Wno-noexcept-type -Wnon-virtual-dtor -Wdelete-non-virtual-dtor -Wstring-conversion -Wno-deprecated-declarations -Wno-unknown-pragmas -Wno-strict-aliasing -Wno-deprecated-register -Wno-vla-extension -DNDEBUG -include /Users/buildslave/jenkins/workspace/lldb-cmake-standalone/llvm-project/lldb/unittests/gtest_common.h -fno-exceptions -fno-rtti -UNDEBUG -Wno-suggest-override -std=c++14 -MMD -MT dependencies -MF /Users/buildslave/jenkins/workspace/lldb-cmake-standalone/lldb-xcode-build/unittests/debugserver/lldb.build/Release/debugserverTests.build/Objects-normal/x86_64/RNBSocketTest.d --serialize-diagnostics /Users/buildslave/jenkins/workspace/lldb-cmake-standalone/lldb-xcode-build/unittests/debugserver/lldb.build/Release/debugserverTests.build/Objects-normal/x86_64/RNBSocketTest.dia -c /Users/buildslave/jenkins/workspace/lldb-cmake-standalone/llvm-project/lldb/unittests/debugserver/RNBSocketTest.cpp -o /Users/buildslave/jenkins/workspace/lldb-cmake-standalone/lldb-xcode-build/unittests/debugserver/lldb.build/Release/debugserverTests.build/Objects-normal/x86_64/RNBSocketTest.o warning: unknown warning option '-Wno-suggest-override'; did you mean '-Wno-shift-overflow'? [-Wunknown-warning-option] 1 warning generated.

Hide Details

CompileC /Users/buildslave/jenkins/workspace/lldb-cmake-standalone/lldb-xcode-build/unittests/debugserver/lldb.build/Release/debugserverTests.build/Objects-normal/x86_64/debugserver_LogCallback.o unittests/debugserver/debugserver_LogCallback.cpp normal x86_64 c++ com.apple.compilers.llvm.clang.1_0.compiler cd /Users/buildslave/jenkins/workspace/lldb-cmake-standalone/llvm-project/lldb /Applications/Xcode.app/Contents/Developer/Toolchains/XcodeDefault.xctoolchain/usr/bin/clang -x c++ -target x86_64-apple-macos10.12 -fmessage-length=0 -fdiagnostics-show-note-include-stack -fmacro-backtrace-limit=0 -Wno-trigraphs -fpascal-strings -O3 -Wno-missing-field-initializers -Wno-missing-prototypes -Wnon-virtual-dtor -Woverloaded-virtual -Wno-exit-time-destructors -Wmissing-braces -Wparentheses -Wswitch -Wunused-function -Wno-unused-label -Wno-unused-parameter -Wunused-variable -Wunused-value -Wempty-body -Wuninitialized -Wno-unknown-pragmas -Wno-shadow -Wno-four-char-constants -Wno-conversion -Wconstant-conversion -Wint-conversion -Wbool-conversion -Wenum-conversion -Wno-float-conversion -Wno-non-literal-null-conversion -Wno-objc-literal-conversion -Wsign-compare -Wno-shorten-64-to-32 -Wnewline-eof -Wno-c++11-extensions -DCMAKE_INTDIR=\"Release\" -DGTEST_HAS_RTTI=0 -D_DEBUG -D__STDC_CONSTANT_MACROS -D__STDC_FORMAT_MACROS -D__STDC_LIMIT_MACROS -DHAVE_ROUND -isysroot /Applications/Xcode.app/Contents/Developer/Platforms/MacOSX.platform/Developer/SDKs/MacOSX10.15.sdk -fasm-blocks -fstrict-aliasing -Wdeprecated-declarations -Winvalid-offsetof -Wno-sign-conversion -Wno-infinite-recursion -Wno-move -Wno-comma -Wno-block-capture-autoreleasing -Wno-strict-prototypes -Wno-range-loop-analysis -Wno-semicolon-before-method-body -I/Users/buildslave/jenkins/workspace/lldb-cmake-standalone/lldb-xcode-build/unittests/debugserver/Release/include -I/Users/buildslave/jenkins/workspace/lldb-cmake-standalone/lldb-xcode-build/unittests/debugserver -I/Users/buildslave/jenkins/workspace/lldb-cmake-standalone/llvm-project/lldb/unittests/debugserver -I/Users/buildslave/jenkins/workspace/lldb-cmake-standalone/llvm-project/lldb/include -I/Users/buildslave/jenkins/workspace/lldb-cmake-standalone/lldb-xcode-build/include -I/Users/buildslave/jenkins/workspace/lldb-cmake-standalone/llvm-project/llvm/include -I/Users/buildslave/jenkins/workspace/lldb-cmake-standalone/clang-build/include -I/Users/buildslave/jenkins/workspace/lldb-cmake-standalone/llvm-project/clang/include -I/Users/buildslave/jenkins/workspace/lldb-cmake-standalone/clang-build/tools/clang/include -I/usr/local/Cellar/python/3.7.0/Frameworks/Python.framework/Versions/3.7/include/python3.7m -I/Users/buildslave/jenkins/workspace/lldb-cmake-standalone/llvm-project/lldb/tools/clang/include -I/Users/buildslave/jenkins/workspace/lldb-cmake-standalone/lldb-xcode-build/../clang/include -I/usr/local/include -I/Users/buildslave/jenkins/workspace/lldb-cmake-standalone/llvm-project/lldb/source -I/Users/buildslave/jenkins/workspace/lldb-cmake-standalone/llvm-project/lldb/unittests -I/Users/buildslave/jenkins/workspace/lldb-cmake-standalone/llvm-project/lldb/tools/debugserver/source -I/Users/buildslave/jenkins/workspace/lldb-cmake-standalone/llvm-project/lldb/tools/debugserver/source/MacOSX -isystem /Applications/Xcode.app/Contents/Developer/Platforms/MacOSX.platform/Developer/SDKs/MacOSX10.15.sdk/usr/include/libxml2 -isystem /Users/buildslave/jenkins/workspace/lldb-cmake-standalone/llvm-project/llvm/utils/unittest/googletest/include -isystem /Users/buildslave/jenkins/workspace/lldb-cmake-standalone/llvm-project/llvm/utils/unittest/googlemock/include -I/Users/buildslave/jenkins/workspace/lldb-cmake-standalone/lldb-xcode-build/unittests/debugserver/lldb.build/Release/debugserverTests.build/DerivedSources-normal/x86_64 -I/Users/buildslave/jenkins/workspace/lldb-cmake-standalone/lldb-xcode-build/unittests/debugserver/lldb.build/Release/debugserverTests.build/DerivedSources/x86_64 -I/Users/buildslave/jenkins/workspace/lldb-cmake-standalone/lldb-xcode-build/unittests/debugserver/lldb.build/Release/debugserverTests.build/DerivedSources -F/Users/buildslave/jenkins/workspace/lldb-cmake-standalone/lldb-xcode-build/unittests/debugserver/Release -fvisibility-inlines-hidden -Werror=date-time -Werror=unguarded-availability-new -Wall -Wextra -Wno-unused-parameter -Wwrite-strings -Wcast-qual -Wmissing-field-initializers -Wimplicit-fallthrough -Wcovered-switch-default -Wno-noexcept-type -Wnon-virtual-dtor -Wdelete-non-virtual-dtor -Wstring-conversion -Wno-deprecated-declarations -Wno-unknown-pragmas -Wno-strict-aliasing -Wno-deprecated-register -Wno-vla-extension -DNDEBUG -include /Users/buildslave/jenkins/workspace/lldb-cmake-standalone/llvm-project/lldb/unittests/gtest_common.h -fno-exceptions -fno-rtti -UNDEBUG -Wno-suggest-override -std=c++14 -MMD -MT dependencies -MF /Users/buildslave/jenkins/workspace/lldb-cmake-standalone/lldb-xcode-build/unittests/debugserver/lldb.build/Release/debugserverTests.build/Objects-normal/x86_64/debugserver_LogCallback.d --serialize-diagnostics /Users/buildslave/jenkins/workspace/lldb-cmake-standalone/lldb-xcode-build/unittests/debugserver/lldb.build/Release/debugserverTests.build/Objects-normal/x86_64/debugserver_LogCallback.dia -c /Users/buildslave/jenkins/workspace/lldb-cmake-standalone/llvm-project/lldb/unittests/debugserver/debugserver_LogCallback.cpp -o /Users/buildslave/jenkins/workspace/lldb-cmake-standalone/lldb-xcode-build/unittests/debugserver/lldb.build/Release/debugserverTests.build/Objects-normal/x86_64/debugserver_LogCallback.o warning: unknown warning option '-Wno-suggest-override'; did you mean '-Wno-shift-overflow'? [-Wunknown-warning-option] 1 warning generated.

Hide Details

CompileC /Users/buildslave/jenkins/workspace/lldb-cmake-standalone/lldb-xcode-build/unittests/debugserver/lldb.build/Release/debugserverTests.build/Objects-normal/x86_64/dummy.o /Users/buildslave/jenkins/workspace/lldb-cmake-standalone/llvm-project/llvm/cmake/dummy.cpp normal x86_64 c++ com.apple.compilers.llvm.clang.1_0.compiler cd /Users/buildslave/jenkins/workspace/lldb-cmake-standalone/llvm-project/lldb /Applications/Xcode.app/Contents/Developer/Toolchains/XcodeDefault.xctoolchain/usr/bin/clang -x c++ -target x86_64-apple-macos10.12 -fmessage-length=0 -fdiagnostics-show-note-include-stack -fmacro-backtrace-limit=0 -Wno-trigraphs -fpascal-strings -O3 -Wno-missing-field-initializers -Wno-missing-prototypes -Wnon-virtual-dtor -Woverloaded-virtual -Wno-exit-time-destructors -Wmissing-braces -Wparentheses -Wswitch -Wunused-function -Wno-unused-label -Wno-unused-parameter -Wunused-variable -Wunused-value -Wempty-body -Wuninitialized -Wno-unknown-pragmas -Wno-shadow -Wno-four-char-constants -Wno-conversion -Wconstant-conversion -Wint-conversion -Wbool-conversion -Wenum-conversion -Wno-float-conversion -Wno-non-literal-null-conversion -Wno-objc-literal-conversion -Wsign-compare -Wno-shorten-64-to-32 -Wnewline-eof -Wno-c++11-extensions -DCMAKE_INTDIR=\"Release\" -DGTEST_HAS_RTTI=0 -D_DEBUG -D__STDC_CONSTANT_MACROS -D__STDC_FORMAT_MACROS -D__STDC_LIMIT_MACROS -DHAVE_ROUND -isysroot /Applications/Xcode.app/Contents/Developer/Platforms/MacOSX.platform/Developer/SDKs/MacOSX10.15.sdk -fasm-blocks -fstrict-aliasing -Wdeprecated-declarations -Winvalid-offsetof -Wno-sign-conversion -Wno-infinite-recursion -Wno-move -Wno-comma -Wno-block-capture-autoreleasing -Wno-strict-prototypes -Wno-range-loop-analysis -Wno-semicolon-before-method-body -I/Users/buildslave/jenkins/workspace/lldb-cmake-standalone/lldb-xcode-build/unittests/debugserver/Release/include -I/Users/buildslave/jenkins/workspace/lldb-cmake-standalone/lldb-xcode-build/unittests/debugserver -I/Users/buildslave/jenkins/workspace/lldb-cmake-standalone/llvm-project/lldb/unittests/debugserver -I/Users/buildslave/jenkins/workspace/lldb-cmake-standalone/llvm-project/lldb/include -I/Users/buildslave/jenkins/workspace/lldb-cmake-standalone/lldb-xcode-build/include -I/Users/buildslave/jenkins/workspace/lldb-cmake-standalone/llvm-project/llvm/include -I/Users/buildslave/jenkins/workspace/lldb-cmake-standalone/clang-build/include -I/Users/buildslave/jenkins/workspace/lldb-cmake-standalone/llvm-project/clang/include -I/Users/buildslave/jenkins/workspace/lldb-cmake-standalone/clang-build/tools/clang/include -I/usr/local/Cellar/python/3.7.0/Frameworks/Python.framework/Versions/3.7/include/python3.7m -I/Users/buildslave/jenkins/workspace/lldb-cmake-standalone/llvm-project/lldb/tools/clang/include -I/Users/buildslave/jenkins/workspace/lldb-cmake-standalone/lldb-xcode-build/../clang/include -I/usr/local/include -I/Users/buildslave/jenkins/workspace/lldb-cmake-standalone/llvm-project/lldb/source -I/Users/buildslave/jenkins/workspace/lldb-cmake-standalone/llvm-project/lldb/unittests -I/Users/buildslave/jenkins/workspace/lldb-cmake-standalone/llvm-project/lldb/tools/debugserver/source -I/Users/buildslave/jenkins/workspace/lldb-cmake-standalone/llvm-project/lldb/tools/debugserver/source/MacOSX -isystem /Applications/Xcode.app/Contents/Developer/Platforms/MacOSX.platform/Developer/SDKs/MacOSX10.15.sdk/usr/include/libxml2 -isystem /Users/buildslave/jenkins/workspace/lldb-cmake-standalone/llvm-project/llvm/utils/unittest/googletest/include -isystem /Users/buildslave/jenkins/workspace/lldb-cmake-standalone/llvm-project/llvm/utils/unittest/googlemock/include -I/Users/buildslave/jenkins/workspace/lldb-cmake-standalone/lldb-xcode-build/unittests/debugserver/lldb.build/Release/debugserverTests.build/DerivedSources-normal/x86_64 -I/Users/buildslave/jenkins/workspace/lldb-cmake-standalone/lldb-xcode-build/unittests/debugserver/lldb.build/Release/debugserverTests.build/DerivedSources/x86_64 -I/Users/buildslave/jenkins/workspace/lldb-cmake-standalone/lldb-xcode-build/unittests/debugserver/lldb.build/Release/debugserverTests.build/DerivedSources -F/Users/buildslave/jenkins/workspace/lldb-cmake-standalone/lldb-xcode-build/unittests/debugserver/Release -fvisibility-inlines-hidden -Werror=date-time -Werror=unguarded-availability-new -Wall -Wextra -Wno-unused-parameter -Wwrite-strings -Wcast-qual -Wmissing-field-initializers -Wimplicit-fallthrough -Wcovered-switch-default -Wno-noexcept-type -Wnon-virtual-dtor -Wdelete-non-virtual-dtor -Wstring-conversion -Wno-deprecated-declarations -Wno-unknown-pragmas -Wno-strict-aliasing -Wno-deprecated-register -Wno-vla-extension -DNDEBUG -include /Users/buildslave/jenkins/workspace/lldb-cmake-standalone/llvm-project/lldb/unittests/gtest_common.h -fno-exceptions -fno-rtti -UNDEBUG -Wno-suggest-override -std=c++14 -MMD -MT dependencies -MF /Users/buildslave/jenkins/workspace/lldb-cmake-standalone/lldb-xcode-build/unittests/debugserver/lldb.build/Release/debugserverTests.build/Objects-normal/x86_64/dummy.d --serialize-diagnostics /Users/buildslave/jenkins/workspace/lldb-cmake-standalone/lldb-xcode-build/unittests/debugserver/lldb.build/Release/debugserverTests.build/Objects-normal/x86_64/dummy.dia -c /Users/buildslave/jenkins/workspace/lldb-cmake-standalone/llvm-project/llvm/cmake/dummy.cpp -o /Users/buildslave/jenkins/workspace/lldb-cmake-standalone/lldb-xcode-build/unittests/debugserver/lldb.build/Release/debugserverTests.build/Objects-normal/x86_64/dummy.o warning: unknown warning option '-Wno-suggest-override'; did you mean '-Wno-shift-overflow'? [-Wunknown-warning-option] 1 warning generated.

Hide Details

Ld /Users/buildslave/jenkins/workspace/lldb-cmake-standalone/lldb-xcode-build/unittests/debugserver/Release/debugserverTests normal x86_64 cd /Users/buildslave/jenkins/workspace/lldb-cmake-standalone/llvm-project/lldb /Applications/Xcode.app/Contents/Developer/Toolchains/XcodeDefault.xctoolchain/usr/bin/clang++ -target x86_64-apple-macos10.12 -isysroot /Applications/Xcode.app/Contents/Developer/Platforms/MacOSX.platform/Developer/SDKs/MacOSX10.15.sdk -L/Users/buildslave/jenkins/workspace/lldb-cmake-standalone/lldb-xcode-build/unittests/debugserver/Release -F/Users/buildslave/jenkins/workspace/lldb-cmake-standalone/lldb-xcode-build/unittests/debugserver/Release -filelist /Users/buildslave/jenkins/workspace/lldb-cmake-standalone/lldb-xcode-build/unittests/debugserver/lldb.build/Release/debugserverTests.build/Objects-normal/x86_64/debugserverTests.LinkFileList -Wl,-dead_strip -Wl,-search_paths_first -Wl,-headerpad_max_install_names /Users/buildslave/jenkins/workspace/lldb-cmake-standalone/clang-build/lib/libLLVMSupport.a /Users/buildslave/jenkins/workspace/lldb-cmake-standalone/clang-build/lib/libLLVMSupport.a /Users/buildslave/jenkins/workspace/lldb-cmake-standalone/clang-build/lib/libgtest_main.a /Users/buildslave/jenkins/workspace/lldb-cmake-standalone/clang-build/lib/libgtest.a /Users/buildslave/jenkins/workspace/lldb-cmake-standalone/lldb-xcode-build/Release/lib/liblldbDebugserverCommon.a /Users/buildslave/jenkins/workspace/lldb-cmake-standalone/lldb-xcode-build/Release/lib/liblldbHost.a /Users/buildslave/jenkins/workspace/lldb-cmake-standalone/clang-build/lib/libLLVMTestingSupport.a /Users/buildslave/jenkins/workspace/lldb-cmake-standalone/lldb-xcode-build/lib/Release/liblldbDebugserverArchSupport.a -lcompression /usr/lib/libxml2.dylib /usr/lib/libedit.dylib /usr/local/lib/liblzma.dylib /usr/lib/libedit.dylib /usr/local/lib/liblzma.dylib /Users/buildslave/jenkins/workspace/lldb-cmake-standalone/lldb-xcode-build/Release/lib/liblldbHostMacOSXObjCXX.a /Users/buildslave/jenkins/workspace/lldb-cmake-standalone/lldb-xcode-build/Release/lib/liblldbUtility.a -framework CoreFoundation -framework Foundation -framework CoreServices -framework Security /Users/buildslave/jenkins/workspace/lldb-cmake-standalone/clang-build/lib/libLLVMObject.a /Users/buildslave/jenkins/workspace/lldb-cmake-standalone/clang-build/lib/libLLVMBitReader.a /Users/buildslave/jenkins/workspace/lldb-cmake-standalone/clang-build/lib/libLLVMCore.a /Users/buildslave/jenkins/workspace/lldb-cmake-standalone/clang-build/lib/libLLVMRemarks.a /Users/buildslave/jenkins/workspace/lldb-cmake-standalone/clang-build/lib/libLLVMBitstreamReader.a /Users/buildslave/jenkins/workspace/lldb-cmake-standalone/clang-build/lib/libLLVMMCParser.a /Users/buildslave/jenkins/workspace/lldb-cmake-standalone/clang-build/lib/libLLVMMC.a /Users/buildslave/jenkins/workspace/lldb-cmake-standalone/clang-build/lib/libLLVMDebugInfoCodeView.a /Users/buildslave/jenkins/workspace/lldb-cmake-standalone/clang-build/lib/libLLVMTextAPI.a /Users/buildslave/jenkins/workspace/lldb-cmake-standalone/clang-build/lib/libLLVMBinaryFormat.a /Users/buildslave/jenkins/workspace/lldb-cmake-standalone/clang-build/lib/libgtest.a /Users/buildslave/jenkins/workspace/lldb-cmake-standalone/clang-build/lib/libLLVMSupport.a -lm /usr/lib/libz.dylib /usr/lib/libcurses.dylib /Users/buildslave/jenkins/workspace/lldb-cmake-standalone/clang-build/lib/libLLVMDemangle.a -lpthread -Xlinker -dependency_info -Xlinker /Users/buildslave/jenkins/workspace/lldb-cmake-standalone/lldb-xcode-build/unittests/debugserver/lldb.build/Release/debugserverTests.build/Objects-normal/x86_64/debugserverTests_dependency_info.dat -o /Users/buildslave/jenkins/workspace/lldb-cmake-standalone/lldb-xcode-build/unittests/debugserver/Release/debugserverTests

Hide Details

PhaseScriptExecution CMake\ PostBuild\ Rules /Users/buildslave/jenkins/workspace/lldb-cmake-standalone/lldb-xcode-build/unittests/debugserver/lldb.build/Release/debugserverTests.build/Script-05B6E1DA831443EBB32559DA.sh cd /Users/buildslave/jenkins/workspace/lldb-cmake-standalone/llvm-project/lldb /bin/sh -c /Users/buildslave/jenkins/workspace/lldb-cmake-standalone/lldb-xcode-build/unittests/debugserver/lldb.build/Release/debugserverTests.build/Script-05B6E1DA831443EBB32559DA.sh /usr/local/Cellar/cmake/3.17.2/bin/cmake -E make_directory /Users/buildslave/jenkins/workspace/lldb-cmake-standalone/lldb-xcode-build/unittests/debugserver/Release/Inputs

Hide Details

ProcessProductPackaging "" /Users/buildslave/jenkins/workspace/lldb-cmake-standalone/lldb-xcode-build/unittests/debugserver/lldb.build/Release/debugserverTests.build/debugserverTests.xcent cd /Users/buildslave/jenkins/workspace/lldb-cmake-standalone/llvm-project/lldb

Hide Details

Hide Details

Entitlements:

Hide Details

{ "com.apple.security.get-task-allow" = 1; }

Hide Details

Hide Details

builtin-productPackagingUtility -entitlements -format xml -o /Users/buildslave/jenkins/workspace/lldb-cmake-standalone/lldb-xcode-build/unittests/debugserver/lldb.build/Release/debugserverTests.build/debugserverTests.xcent

Hide Details

CodeSign /Users/buildslave/jenkins/workspace/lldb-cmake-standalone/lldb-xcode-build/unittests/debugserver/Release/debugserverTests cd /Users/buildslave/jenkins/workspace/lldb-cmake-standalone/llvm-project/lldb

Hide Details

Signing Identity: "-"

Hide Details

/usr/bin/codesign --force --sign - --entitlements /Users/buildslave/jenkins/workspace/lldb-cmake-standalone/lldb-xcode-build/unittests/debugserver/lldb.build/Release/debugserverTests.build/debugserverTests.xcent --timestamp=none /Users/buildslave/jenkins/workspace/lldb-cmake-standalone/lldb-xcode-build/unittests/debugserver/Release/debugserverTests

Hide Details

=== BUILD AGGREGATE TARGET LLDBUnitTests OF PROJECT lldb WITH CONFIGURATION Release ===

Hide Details

Check dependencies

Hide Details

=== BUILD AGGREGATE TARGET lldb-unit-test-deps OF PROJECT lldb WITH CONFIGURATION Release ===

Hide Details

Check dependencies

Hide Details

=== BUILD AGGREGATE TARGET check-lldb OF PROJECT lldb WITH CONFIGURATION Release ===

Hide Details

Check dependencies

Hide Details

Write auxiliary files write-file /Users/buildslave/jenkins/workspace/lldb-cmake-standalone/lldb-xcode-build/test/lldb.build/Release/check-lldb.build/Script-4C41032047134E608919323C.sh chmod 0755 /Users/buildslave/jenkins/workspace/lldb-cmake-standalone/lldb-xcode-build/test/lldb.build/Release/check-lldb.build/Script-4C41032047134E608919323C.sh

Hide Details

PhaseScriptExecution CMake\ Rules /Users/buildslave/jenkins/workspace/lldb-cmake-standalone/lldb-xcode-build/test/lldb.build/Release/check-lldb.build/Script-4C41032047134E608919323C.sh cd /Users/buildslave/jenkins/workspace/lldb-cmake-standalone/llvm-project/lldb /bin/sh -c /Users/buildslave/jenkins/workspace/lldb-cmake-standalone/lldb-xcode-build/test/lldb.build/Release/check-lldb.build/Script-4C41032047134E608919323C.sh echo "Running lldb lit test suite" Running lldb lit test suite /usr/local/Frameworks/Python.framework/Versions/3.7/bin/python3.7 /Users/buildslave/jenkins/workspace/lldb-cmake-standalone/lldb-xcode-build/Release/bin/llvm-lit -sv --param build_mode=Release /Users/buildslave/jenkins/workspace/lldb-cmake-standalone/lldb-xcode-build/test -- Testing: 2501 tests, 16 workers -- Testing: llvm-lit: /Users/buildslave/jenkins/workspace/lldb-cmake-standalone/llvm-project/lldb/test/Shell/helper/toolchain.py:129: note: using SDKROOT: '/Applications/Xcode.app/Contents/Developer/Platforms/MacOSX.platform/Developer/SDKs/MacOSX10.15.sdk' llvm-lit: /Users/buildslave/jenkins/workspace/lldb-cmake-standalone/llvm-project/llvm/utils/lit/lit/llvm/config.py:436: note: using clang: /Users/buildslave/jenkins/workspace/lldb-cmake-standalone/clang-build/bin/clang 0.. 10.. 20.. 30.. 40.. 50.. 60.. 70.. 80.. 90.. FAIL: lldb-api :: tools/lldb-server/TestLldbGdbServer.py (2501 of 2501) ******************** TEST 'lldb-api :: tools/lldb-server/TestLldbGdbServer.py' FAILED ******************** Script: -- /usr/local/Frameworks/Python.framework/Versions/3.7/bin/python3.7 /Users/buildslave/jenkins/workspace/lldb-cmake-standalone/llvm-project/lldb/test/API/dotest.py -u CXXFLAGS -u CFLAGS --codesign-identity lldb_codesign --env LLVM_LIBS_DIR=/Users/buildslave/jenkins/workspace/lldb-cmake-standalone/clang-build/./lib --arch x86_64 --build-dir /Users/buildslave/jenkins/workspace/lldb-cmake-standalone/lldb-xcode-build/lldb-test-build.noindex --lldb-module-cache-dir /Users/buildslave/jenkins/workspace/lldb-cmake-standalone/lldb-xcode-build/lldb-test-build.noindex/module-cache-lldb/lldb-api --clang-module-cache-dir /Users/buildslave/jenkins/workspace/lldb-cmake-standalone/lldb-xcode-build/lldb-test-build.noindex/module-cache-clang/lldb-api --executable /Users/buildslave/jenkins/workspace/lldb-cmake-standalone/lldb-xcode-build/Release/bin/lldb --compiler /Users/buildslave/jenkins/workspace/lldb-cmake-standalone/clang-build/./bin/clang --dsymutil /Users/buildslave/jenkins/workspace/lldb-cmake-standalone/clang-build/./bin/dsymutil --llvm-tools-dir /Users/buildslave/jenkins/workspace/lldb-cmake-standalone/clang-build/./bin --lldb-libs-dir /Users/buildslave/jenkins/workspace/lldb-cmake-standalone/lldb-xcode-build/Release/lib --framework /Users/buildslave/jenkins/workspace/lldb-cmake-standalone/lldb-xcode-build/Release/bin/LLDB.framework /Users/buildslave/jenkins/workspace/lldb-cmake-standalone/llvm-project/lldb/test/API/tools/lldb-server -p TestLldbGdbServer.py -- Exit Code: 1

Hide Details

Command Output (stdout): -- lldb version 14.0.0 (http://labmaster3.local/git/llvm-project.git revision 54b35c09b2cd5e068a9b2f1df461045c732b2807) clang revision 54b35c09b2cd5e068a9b2f1df461045c732b2807 llvm revision 54b35c09b2cd5e068a9b2f1df461045c732b2807 Skipping the following test categories: ['libstdcxx', 'dwo', 'llgs', 'fork']

Hide Details

-- Command Output (stderr): -- XFAIL: LLDB (/Users/buildslave/jenkins/workspace/lldb-cmake-standalone/clang-build/bin/clang-x86_64) :: test_Hc_then_Csignal_signals_correct_thread_launch_debugserver (TestLldbGdbServer.LldbGdbServerTestCase) UNSUPPORTED: LLDB (/Users/buildslave/jenkins/workspace/lldb-cmake-standalone/clang-build/bin/clang-x86_64) :: test_Hc_then_Csignal_signals_correct_thread_launch_llgs (TestLldbGdbServer.LldbGdbServerTestCase) (test case does not fall in any category of interest for this run) UNSUPPORTED: LLDB (/Users/buildslave/jenkins/workspace/lldb-cmake-standalone/clang-build/bin/clang-x86_64) :: test_Hg_fails_on_another_pid_llgs (TestLldbGdbServer.LldbGdbServerTestCase) (test case does not fall in any category of interest for this run) UNSUPPORTED: LLDB (/Users/buildslave/jenkins/workspace/lldb-cmake-standalone/clang-build/bin/clang-x86_64) :: test_Hg_fails_on_minus_one_pid_llgs (TestLldbGdbServer.LldbGdbServerTestCase) (test case does not fall in any category of interest for this run) UNSUPPORTED: LLDB (/Users/buildslave/jenkins/workspace/lldb-cmake-standalone/clang-build/bin/clang-x86_64) :: test_Hg_fails_on_zero_pid_llgs (TestLldbGdbServer.LldbGdbServerTestCase) (test case does not fall in any category of interest for this run) PASS: LLDB (/Users/buildslave/jenkins/workspace/lldb-cmake-standalone/clang-build/bin/clang-x86_64) :: test_Hg_switches_to_3_threads_attach_debugserver (TestLldbGdbServer.LldbGdbServerTestCase) UNSUPPORTED: LLDB (/Users/buildslave/jenkins/workspace/lldb-cmake-standalone/clang-build/bin/clang-x86_64) :: test_Hg_switches_to_3_threads_attach_llgs (TestLldbGdbServer.LldbGdbServerTestCase) (test case does not fall in any category of interest for this run) UNSUPPORTED: LLDB (/Users/buildslave/jenkins/workspace/lldb-cmake-standalone/clang-build/bin/clang-x86_64) :: test_Hg_switches_to_3_threads_attach_pass_correct_pid_llgs (TestLldbGdbServer.LldbGdbServerTestCase) (test case does not fall in any category of interest for this run) FAIL: LLDB (/Users/buildslave/jenkins/workspace/lldb-cmake-standalone/clang-build/bin/clang-x86_64) :: test_Hg_switches_to_3_threads_launch_debugserver (TestLldbGdbServer.LldbGdbServerTestCase) UNSUPPORTED: LLDB (/Users/buildslave/jenkins/workspace/lldb-cmake-standalone/clang-build/bin/clang-x86_64) :: test_Hg_switches_to_3_threads_launch_llgs (TestLldbGdbServer.LldbGdbServerTestCase) (test case does not fall in any category of interest for this run) PASS: LLDB (/Users/buildslave/jenkins/workspace/lldb-cmake-standalone/clang-build/bin/clang-x86_64) :: test_P_and_p_thread_suffix_work_debugserver (TestLldbGdbServer.LldbGdbServerTestCase) UNSUPPORTED: LLDB (/Users/buildslave/jenkins/workspace/lldb-cmake-standalone/clang-build/bin/clang-x86_64) :: test_P_and_p_thread_suffix_work_llgs (TestLldbGdbServer.LldbGdbServerTestCase) (test case does not fall in any category of interest for this run) PASS: LLDB (/Users/buildslave/jenkins/workspace/lldb-cmake-standalone/clang-build/bin/clang-x86_64) :: test_P_writes_all_gpr_registers_debugserver (TestLldbGdbServer.LldbGdbServerTestCase) UNSUPPORTED: LLDB (/Users/buildslave/jenkins/workspace/lldb-cmake-standalone/clang-build/bin/clang-x86_64) :: test_P_writes_all_gpr_registers_llgs (TestLldbGdbServer.LldbGdbServerTestCase) (test case does not fall in any category of interest for this run) UNSUPPORTED: LLDB (/Users/buildslave/jenkins/workspace/lldb-cmake-standalone/clang-build/bin/clang-x86_64) :: test_QEnvironmentHexEncoded_llgs (TestLldbGdbServer.LldbGdbServerTestCase) (test case does not fall in any category of interest for this run) UNSUPPORTED: LLDB (/Users/buildslave/jenkins/workspace/lldb-cmake-standalone/clang-build/bin/clang-x86_64) :: test_QEnvironment_llgs (TestLldbGdbServer.LldbGdbServerTestCase) (test case does not fall in any category of interest for this run) PASS: LLDB (/Users/buildslave/jenkins/workspace/lldb-cmake-standalone/clang-build/bin/clang-x86_64) :: test_attach_commandline_continue_app_exits_debugserver (TestLldbGdbServer.LldbGdbServerTestCase) UNSUPPORTED: LLDB (/Users/buildslave/jenkins/workspace/lldb-cmake-standalone/clang-build/bin/clang-x86_64) :: test_attach_commandline_continue_app_exits_llgs (TestLldbGdbServer.LldbGdbServerTestCase) (test case does not fall in any category of interest for this run) PASS: LLDB (/Users/buildslave/jenkins/workspace/lldb-cmake-standalone/clang-build/bin/clang-x86_64) :: test_c_packet_works_debugserver (TestLldbGdbServer.LldbGdbServerTestCase) UNSUPPORTED: LLDB (/Users/buildslave/jenkins/workspace/lldb-cmake-standalone/clang-build/bin/clang-x86_64) :: test_c_packet_works_llgs (TestLldbGdbServer.LldbGdbServerTestCase) (test case does not fall in any category of interest for this run) PASS: LLDB (/Users/buildslave/jenkins/workspace/lldb-cmake-standalone/clang-build/bin/clang-x86_64) :: test_first_launch_stop_reply_thread_matches_first_qC_debugserver (TestLldbGdbServer.LldbGdbServerTestCase) UNSUPPORTED: LLDB (/Users/buildslave/jenkins/workspace/lldb-cmake-standalone/clang-build/bin/clang-x86_64) :: test_first_launch_stop_reply_thread_matches_first_qC_llgs (TestLldbGdbServer.LldbGdbServerTestCase) (test case does not fall in any category of interest for this run) UNSUPPORTED: LLDB (/Users/buildslave/jenkins/workspace/lldb-cmake-standalone/clang-build/bin/clang-x86_64) :: test_hardware_breakpoint_set_and_remove_work_debugserver (TestLldbGdbServer.LldbGdbServerTestCase) (requires one of linux) UNSUPPORTED: LLDB (/Users/buildslave/jenkins/workspace/lldb-cmake-standalone/clang-build/bin/clang-x86_64) :: test_hardware_breakpoint_set_and_remove_work_llgs (TestLldbGdbServer.LldbGdbServerTestCase) (test case does not fall in any category of interest for this run) PASS: LLDB (/Users/buildslave/jenkins/workspace/lldb-cmake-standalone/clang-build/bin/clang-x86_64) :: test_inferior_print_exit_debugserver (TestLldbGdbServer.LldbGdbServerTestCase) UNSUPPORTED: LLDB (/Users/buildslave/jenkins/workspace/lldb-cmake-standalone/clang-build/bin/clang-x86_64) :: test_inferior_print_exit_llgs (TestLldbGdbServer.LldbGdbServerTestCase) (test case does not fall in any category of interest for this run) UNSUPPORTED: LLDB (/Users/buildslave/jenkins/workspace/lldb-cmake-standalone/clang-build/bin/clang-x86_64) :: test_launch_via_A_llgs (TestLldbGdbServer.LldbGdbServerTestCase) (test case does not fall in any category of interest for this run) UNSUPPORTED: LLDB (/Users/buildslave/jenkins/workspace/lldb-cmake-standalone/clang-build/bin/clang-x86_64) :: test_launch_via_vRun_llgs (TestLldbGdbServer.LldbGdbServerTestCase) (test case does not fall in any category of interest for this run) UNSUPPORTED: LLDB (/Users/buildslave/jenkins/workspace/lldb-cmake-standalone/clang-build/bin/clang-x86_64) :: test_launch_via_vRun_no_args_llgs (TestLldbGdbServer.LldbGdbServerTestCase) (test case does not fall in any category of interest for this run) PASS: LLDB (/Users/buildslave/jenkins/workspace/lldb-cmake-standalone/clang-build/bin/clang-x86_64) :: test_list_threads_in_stop_reply_supported_debugserver (TestLldbGdbServer.LldbGdbServerTestCase) UNSUPPORTED: LLDB (/Users/buildslave/jenkins/workspace/lldb-cmake-standalone/clang-build/bin/clang-x86_64) :: test_list_threads_in_stop_reply_supported_llgs (TestLldbGdbServer.LldbGdbServerTestCase) (test case does not fall in any category of interest for this run) PASS: LLDB (/Users/buildslave/jenkins/workspace/lldb-cmake-standalone/clang-build/bin/clang-x86_64) :: test_m_packet_reads_memory_debugserver (TestLldbGdbServer.LldbGdbServerTestCase) UNSUPPORTED: LLDB (/Users/buildslave/jenkins/workspace/lldb-cmake-standalone/clang-build/bin/clang-x86_64) :: test_m_packet_reads_memory_llgs (TestLldbGdbServer.LldbGdbServerTestCase) (test case does not fall in any category of interest for this run) PASS: LLDB (/Users/buildslave/jenkins/workspace/lldb-cmake-standalone/clang-build/bin/clang-x86_64) :: test_p_returns_correct_data_size_for_each_qRegisterInfo_launch_debugserver (TestLldbGdbServer.LldbGdbServerTestCase) UNSUPPORTED: LLDB (/Users/buildslave/jenkins/workspace/lldb-cmake-standalone/clang-build/bin/clang-x86_64) :: test_p_returns_correct_data_size_for_each_qRegisterInfo_launch_llgs (TestLldbGdbServer.LldbGdbServerTestCase) (test case does not fall in any category of interest for this run) PASS: LLDB (/Users/buildslave/jenkins/workspace/lldb-cmake-standalone/clang-build/bin/clang-x86_64) :: test_qMemoryRegionInfo_is_supported_debugserver (TestLldbGdbServer.LldbGdbServerTestCase) UNSUPPORTED: LLDB (/Users/buildslave/jenkins/workspace/lldb-cmake-standalone/clang-build/bin/clang-x86_64) :: test_qMemoryRegionInfo_is_supported_llgs (TestLldbGdbServer.LldbGdbServerTestCase) (test case does not fall in any category of interest for this run) PASS: LLDB (/Users/buildslave/jenkins/workspace/lldb-cmake-standalone/clang-build/bin/clang-x86_64) :: test_qMemoryRegionInfo_reports_code_address_as_executable_debugserver (TestLldbGdbServer.LldbGdbServerTestCase) UNSUPPORTED: LLDB (/Users/buildslave/jenkins/workspace/lldb-cmake-standalone/clang-build/bin/clang-x86_64) :: test_qMemoryRegionInfo_reports_code_address_as_executable_llgs (TestLldbGdbServer.LldbGdbServerTestCase) (test case does not fall in any category of interest for this run) PASS: LLDB (/Users/buildslave/jenkins/workspace/lldb-cmake-standalone/clang-build/bin/clang-x86_64) :: test_qMemoryRegionInfo_reports_heap_address_as_rw_debugserver (TestLldbGdbServer.LldbGdbServerTestCase) UNSUPPORTED: LLDB (/Users/buildslave/jenkins/workspace/lldb-cmake-standalone/clang-build/bin/clang-x86_64) :: test_qMemoryRegionInfo_reports_heap_address_as_rw_llgs (TestLldbGdbServer.LldbGdbServerTestCase) (test case does not fall in any category of interest for this run) PASS: LLDB (/Users/buildslave/jenkins/workspace/lldb-cmake-standalone/clang-build/bin/clang-x86_64) :: test_qMemoryRegionInfo_reports_stack_address_as_rw_debugserver (TestLldbGdbServer.LldbGdbServerTestCase) UNSUPPORTED: LLDB (/Users/buildslave/jenkins/workspace/lldb-cmake-standalone/clang-build/bin/clang-x86_64) :: test_qMemoryRegionInfo_reports_stack_address_as_rw_llgs (TestLldbGdbServer.LldbGdbServerTestCase) (test case does not fall in any category of interest for this run) PASS: LLDB (/Users/buildslave/jenkins/workspace/lldb-cmake-standalone/clang-build/bin/clang-x86_64) :: test_qRegisterInfo_contains_at_least_one_register_set_debugserver (TestLldbGdbServer.LldbGdbServerTestCase) UNSUPPORTED: LLDB (/Users/buildslave/jenkins/workspace/lldb-cmake-standalone/clang-build/bin/clang-x86_64) :: test_qRegisterInfo_contains_at_least_one_register_set_llgs (TestLldbGdbServer.LldbGdbServerTestCase) (test case does not fall in any category of interest for this run) UNSUPPORTED: LLDB (/Users/buildslave/jenkins/workspace/lldb-cmake-standalone/clang-build/bin/clang-x86_64) :: test_qRegisterInfo_contains_avx_registers_llgs (TestLldbGdbServer.LldbGdbServerTestCase) (test case does not fall in any category of interest for this run) PASS: LLDB (/Users/buildslave/jenkins/workspace/lldb-cmake-standalone/clang-build/bin/clang-x86_64) :: test_qRegisterInfo_contains_required_generics_debugserver_debugserver (TestLldbGdbServer.LldbGdbServerTestCase) UNSUPPORTED: LLDB (/Users/buildslave/jenkins/workspace/lldb-cmake-standalone/clang-build/bin/clang-x86_64) :: test_qRegisterInfo_contains_required_generics_debugserver_llgs (TestLldbGdbServer.LldbGdbServerTestCase) (test case does not fall in any category of interest for this run) PASS: LLDB (/Users/buildslave/jenkins/workspace/lldb-cmake-standalone/clang-build/bin/clang-x86_64) :: test_qRegisterInfo_returns_all_valid_results_debugserver (TestLldbGdbServer.LldbGdbServerTestCase) UNSUPPORTED: LLDB (/Users/buildslave/jenkins/workspace/lldb-cmake-standalone/clang-build/bin/clang-x86_64) :: test_qRegisterInfo_returns_all_valid_results_llgs (TestLldbGdbServer.LldbGdbServerTestCase) (test case does not fall in any category of interest for this run) PASS: LLDB (/Users/buildslave/jenkins/workspace/lldb-cmake-standalone/clang-build/bin/clang-x86_64) :: test_qRegisterInfo_returns_one_valid_result_debugserver (TestLldbGdbServer.LldbGdbServerTestCase) UNSUPPORTED: LLDB (/Users/buildslave/jenkins/workspace/lldb-cmake-standalone/clang-build/bin/clang-x86_64) :: test_qRegisterInfo_returns_one_valid_result_llgs (TestLldbGdbServer.LldbGdbServerTestCase) (test case does not fall in any category of interest for this run) PASS: LLDB (/Users/buildslave/jenkins/workspace/lldb-cmake-standalone/clang-build/bin/clang-x86_64) :: test_qSupported_QPassSignals_debugserver (TestLldbGdbServer.LldbGdbServerTestCase) UNSUPPORTED: LLDB (/Users/buildslave/jenkins/workspace/lldb-cmake-standalone/clang-build/bin/clang-x86_64) :: test_qSupported_QPassSignals_llgs (TestLldbGdbServer.LldbGdbServerTestCase) (test case does not fall in any category of interest for this run) PASS: LLDB (/Users/buildslave/jenkins/workspace/lldb-cmake-standalone/clang-build/bin/clang-x86_64) :: test_qSupported_auvx_debugserver (TestLldbGdbServer.LldbGdbServerTestCase) UNSUPPORTED: LLDB (/Users/buildslave/jenkins/workspace/lldb-cmake-standalone/clang-build/bin/clang-x86_64) :: test_qSupported_auvx_llgs (TestLldbGdbServer.LldbGdbServerTestCase) (test case does not fall in any category of interest for this run) UNSUPPORTED: LLDB (/Users/buildslave/jenkins/workspace/lldb-cmake-standalone/clang-build/bin/clang-x86_64) :: test_qSupported_fork_events_debugserver (TestLldbGdbServer.LldbGdbServerTestCase) (test case does not fall in any category of interest for this run) UNSUPPORTED: LLDB (/Users/buildslave/jenkins/workspace/lldb-cmake-standalone/clang-build/bin/clang-x86_64) :: test_qSupported_fork_events_llgs (TestLldbGdbServer.LldbGdbServerTestCase) (test case does not fall in any category of interest for this run) UNSUPPORTED: LLDB (/Users/buildslave/jenkins/workspace/lldb-cmake-standalone/clang-build/bin/clang-x86_64) :: test_qSupported_fork_events_without_multiprocess_debugserver (TestLldbGdbServer.LldbGdbServerTestCase) (test case does not fall in any category of interest for this run) UNSUPPORTED: LLDB (/Users/buildslave/jenkins/workspace/lldb-cmake-standalone/clang-build/bin/clang-x86_64) :: test_qSupported_fork_events_without_multiprocess_llgs (TestLldbGdbServer.LldbGdbServerTestCase) (test case does not fall in any category of interest for this run) PASS: LLDB (/Users/buildslave/jenkins/workspace/lldb-cmake-standalone/clang-build/bin/clang-x86_64) :: test_qSupported_libraries_svr4_debugserver (TestLldbGdbServer.LldbGdbServerTestCase) UNSUPPORTED: LLDB (/Users/buildslave/jenkins/workspace/lldb-cmake-standalone/clang-build/bin/clang-x86_64) :: test_qSupported_libraries_svr4_llgs (TestLldbGdbServer.LldbGdbServerTestCase) (test case does not fall in any category of interest for this run) PASS: LLDB (/Users/buildslave/jenkins/workspace/lldb-cmake-standalone/clang-build/bin/clang-x86_64) :: test_qSupported_memory_tagging_debugserver (TestLldbGdbServer.LldbGdbServerTestCase) UNSUPPORTED: LLDB (/Users/buildslave/jenkins/workspace/lldb-cmake-standalone/clang-build/bin/clang-x86_64) :: test_qSupported_memory_tagging_llgs (TestLldbGdbServer.LldbGdbServerTestCase) (test case does not fall in any category of interest for this run) PASS: LLDB (/Users/buildslave/jenkins/workspace/lldb-cmake-standalone/clang-build/bin/clang-x86_64) :: test_qSupported_returns_known_stub_features_debugserver (TestLldbGdbServer.LldbGdbServerTestCase) UNSUPPORTED: LLDB (/Users/buildslave/jenkins/workspace/lldb-cmake-standalone/clang-build/bin/clang-x86_64) :: test_qSupported_returns_known_stub_features_llgs (TestLldbGdbServer.LldbGdbServerTestCase) (test case does not fall in any category of interest for this run) UNSUPPORTED: LLDB (/Users/buildslave/jenkins/workspace/lldb-cmake-standalone/clang-build/bin/clang-x86_64) :: test_qSupported_vfork_events_debugserver (TestLldbGdbServer.LldbGdbServerTestCase) (test case does not fall in any category of interest for this run) UNSUPPORTED: LLDB (/Users/buildslave/jenkins/workspace/lldb-cmake-standalone/clang-build/bin/clang-x86_64) :: test_qSupported_vfork_events_llgs (TestLldbGdbServer.LldbGdbServerTestCase) (test case does not fall in any category of interest for this run) UNSUPPORTED: LLDB (/Users/buildslave/jenkins/workspace/lldb-cmake-standalone/clang-build/bin/clang-x86_64) :: test_qSupported_vfork_events_without_multiprocess_debugserver (TestLldbGdbServer.LldbGdbServerTestCase) (test case does not fall in any category of interest for this run) UNSUPPORTED: LLDB (/Users/buildslave/jenkins/workspace/lldb-cmake-standalone/clang-build/bin/clang-x86_64) :: test_qSupported_vfork_events_without_multiprocess_llgs (TestLldbGdbServer.LldbGdbServerTestCase) (test case does not fall in any category of interest for this run) PASS: LLDB (/Users/buildslave/jenkins/workspace/lldb-cmake-standalone/clang-build/bin/clang-x86_64) :: test_qThreadInfo_contains_thread_attach_debugserver (TestLldbGdbServer.LldbGdbServerTestCase) UNSUPPORTED: LLDB (/Users/buildslave/jenkins/workspace/lldb-cmake-standalone/clang-build/bin/clang-x86_64) :: test_qThreadInfo_contains_thread_attach_llgs (TestLldbGdbServer.LldbGdbServerTestCase) (test case does not fall in any category of interest for this run) PASS: LLDB (/Users/buildslave/jenkins/workspace/lldb-cmake-standalone/clang-build/bin/clang-x86_64) :: test_qThreadInfo_contains_thread_launch_debugserver (TestLldbGdbServer.LldbGdbServerTestCase) UNSUPPORTED: LLDB (/Users/buildslave/jenkins/workspace/lldb-cmake-standalone/clang-build/bin/clang-x86_64) :: test_qThreadInfo_contains_thread_launch_llgs (TestLldbGdbServer.LldbGdbServerTestCase) (test case does not fall in any category of interest for this run) PASS: LLDB (/Users/buildslave/jenkins/workspace/lldb-cmake-standalone/clang-build/bin/clang-x86_64) :: test_qThreadInfo_matches_qC_attach_debugserver (TestLldbGdbServer.LldbGdbServerTestCase) UNSUPPORTED: LLDB (/Users/buildslave/jenkins/workspace/lldb-cmake-standalone/clang-build/bin/clang-x86_64) :: test_qThreadInfo_matches_qC_attach_llgs (TestLldbGdbServer.LldbGdbServerTestCase) (test case does not fall in any category of interest for this run) PASS: LLDB (/Users/buildslave/jenkins/workspace/lldb-cmake-standalone/clang-build/bin/clang-x86_64) :: test_qThreadInfo_matches_qC_launch_debugserver (TestLldbGdbServer.LldbGdbServerTestCase) UNSUPPORTED: LLDB (/Users/buildslave/jenkins/workspace/lldb-cmake-standalone/clang-build/bin/clang-x86_64) :: test_qThreadInfo_matches_qC_launch_llgs (TestLldbGdbServer.LldbGdbServerTestCase) (test case does not fall in any category of interest for this run) PASS: LLDB (/Users/buildslave/jenkins/workspace/lldb-cmake-standalone/clang-build/bin/clang-x86_64) :: test_software_breakpoint_set_and_remove_work_debugserver (TestLldbGdbServer.LldbGdbServerTestCase) UNSUPPORTED: LLDB (/Users/buildslave/jenkins/workspace/lldb-cmake-standalone/clang-build/bin/clang-x86_64) :: test_software_breakpoint_set_and_remove_work_llgs (TestLldbGdbServer.LldbGdbServerTestCase) (test case does not fall in any category of interest for this run) PASS: LLDB (/Users/buildslave/jenkins/workspace/lldb-cmake-standalone/clang-build/bin/clang-x86_64) :: test_thread_suffix_supported_debugserver (TestLldbGdbServer.LldbGdbServerTestCase) UNSUPPORTED: LLDB (/Users/buildslave/jenkins/workspace/lldb-cmake-standalone/clang-build/bin/clang-x86_64) :: test_thread_suffix_supported_llgs (TestLldbGdbServer.LldbGdbServerTestCase) (test case does not fall in any category of interest for this run) PASS: LLDB (/Users/buildslave/jenkins/workspace/lldb-cmake-standalone/clang-build/bin/clang-x86_64) :: test_written_M_content_reads_back_correctly_debugserver (TestLldbGdbServer.LldbGdbServerTestCase) UNSUPPORTED: LLDB (/Users/buildslave/jenkins/workspace/lldb-cmake-standalone/clang-build/bin/clang-x86_64) :: test_written_M_content_reads_back_correctly_llgs (TestLldbGdbServer.LldbGdbServerTestCase) (test case does not fall in any category of interest for this run) ====================================================================== ERROR: test_Hg_switches_to_3_threads_launch_debugserver (TestLldbGdbServer.LldbGdbServerTestCase) ---------------------------------------------------------------------- Traceback (most recent call last): File "/Users/buildslave/jenkins/workspace/lldb-cmake-standalone/llvm-project/lldb/packages/Python/lldbsuite/test/tools/lldb-server/gdbremote_testcase.py", line 52, in test_method return attrvalue(self) File "/Users/buildslave/jenkins/workspace/lldb-cmake-standalone/llvm-project/lldb/packages/Python/lldbsuite/test/decorators.py", line 122, in wrapper func(*args, **kwargs) File "/Users/buildslave/jenkins/workspace/lldb-cmake-standalone/llvm-project/lldb/packages/Python/lldbsuite/test/decorators.py", line 152, in wrapper return func(*args, **kwargs) File "/Users/buildslave/jenkins/workspace/lldb-cmake-standalone/llvm-project/lldb/test/API/tools/lldb-server/TestLldbGdbServer.py", line 397, in test_Hg_switches_to_3_threads_launch self.Hg_switches_to_3_threads() File "/Users/buildslave/jenkins/workspace/lldb-cmake-standalone/llvm-project/lldb/test/API/tools/lldb-server/TestLldbGdbServer.py", line 367, in Hg_switches_to_3_threads threads = self.wait_for_thread_count(3) File "/Users/buildslave/jenkins/workspace/lldb-cmake-standalone/llvm-project/lldb/packages/Python/lldbsuite/test/tools/lldb-server/gdbremote_testcase.py", line 795, in wait_for_thread_count self.DEFAULT_TIMEOUT, thread_count, actual_thread_count)) Exception: timed out after 20 seconds while waiting for threads: waiting for at least 3 threads, found 1 Config=x86_64-/Users/buildslave/jenkins/workspace/lldb-cmake-standalone/clang-build/bin/clang ---------------------------------------------------------------------- Ran 84 tests in 105.425s

Hide Details

RESULT: FAILED (30 passes, 0 failures, 1 errors, 52 skipped, 1 expected failures, 0 unexpected successes)

Hide Details

--

Hide Details

******************** Testing: 0.. 10.. 20.. 30.. 40.. 50.. 60.. 70.. 80.. 90.. ******************** Failed Tests (1): lldb-api :: tools/lldb-server/TestLldbGdbServer.py

Hide Details

Hide Details

Testing Time: 565.04s Unsupported : 270 Passed : 2221 Expectedly Failed: 9 Failed : 1 make: *** [/Users/buildslave/jenkins/workspace/lldb-cmake-standalone/lldb-xcode-build/test/CMakeFiles/check-lldb] Error 1

Hide Details

** BUILD FAILED **

Hide Details

Hide Details

The following build commands failed: PhaseScriptExecution CMake\ Rules /Users/buildslave/jenkins/workspace/lldb-cmake-standalone/lldb-xcode-build/test/lldb.build/Release/check-lldb.build/Script-4C41032047134E608919323C.sh (1 failure) Command failed: Command '['/usr/bin/env', 'TERM=vt100', '/usr/local/bin/cmake', '--build', '.', '--config', 'Release', '--target', 'check-lldb']' returned non-zero exit status 65. Command: ['/usr/bin/env', 'TERM=vt100', '/usr/local/bin/cmake', '--build', '.', '--config', 'Release', '--target', 'check-lldb'] [Pipeline] } [Pipeline] // timeout [Pipeline] } [Pipeline] // stage [Pipeline] } [Pipeline] // withEnv [Pipeline] } [Pipeline] // node [Pipeline] End of Pipeline ERROR: script returned exit code 1 Finished: FAILURE