Regression

Test Clang 5.0.2 / lldb-api.tools/lldb-server.TestGdbRemoteProcessInfo.py (from lldb-api)

Failing for the past 1 build (Since #3318 )
Took 4.9 sec.

Stacktrace

Script:
--
/usr/local/Frameworks/Python.framework/Versions/3.7/bin/python3.7 /Users/buildslave/jenkins/workspace/lldb-cmake-matrix/llvm-project/lldb/test/API/dotest.py -u CXXFLAGS -u CFLAGS --codesign-identity lldb_codesign --arch x86_64 --build-dir /Users/buildslave/jenkins/workspace/lldb-cmake-matrix/lldb-build/lldb-test-build.noindex -t --env TERM=vt100 --skip-category gmodules --skip-category watchpoint --arch=x86_64 --env LLVM_LIBS_DIR=/Users/buildslave/jenkins/workspace/lldb-cmake-matrix/lldb-build/./lib --arch x86_64 --build-dir /Users/buildslave/jenkins/workspace/lldb-cmake-matrix/lldb-build/lldb-test-build.noindex --lldb-module-cache-dir /Users/buildslave/jenkins/workspace/lldb-cmake-matrix/lldb-build/lldb-test-build.noindex/module-cache-lldb/lldb-api --clang-module-cache-dir /Users/buildslave/jenkins/workspace/lldb-cmake-matrix/lldb-build/lldb-test-build.noindex/module-cache-clang/lldb-api --executable /Users/buildslave/jenkins/workspace/lldb-cmake-matrix/lldb-build/./bin/lldb --compiler /Users/buildslave/jenkins/workspace/lldb-cmake-matrix/clang_502_build/bin/clang --dsymutil /Users/buildslave/jenkins/workspace/lldb-cmake-matrix/lldb-build/./bin/dsymutil --llvm-tools-dir /Users/buildslave/jenkins/workspace/lldb-cmake-matrix/lldb-build/./bin --lldb-libs-dir /Users/buildslave/jenkins/workspace/lldb-cmake-matrix/lldb-build/./lib /Users/buildslave/jenkins/workspace/lldb-cmake-matrix/llvm-project/lldb/test/API/tools/lldb-server -p TestGdbRemoteProcessInfo.py
--
Exit Code: 1

Command Output (stdout):
--
lldb version 13.0.99 (http://labmaster3.local/git/llvm-project.git revision 3accff2553c00c3237876edd6066e1701c52e66c)
  clang revision 3accff2553c00c3237876edd6066e1701c52e66c
  llvm revision 3accff2553c00c3237876edd6066e1701c52e66c
Skipping the following test categories: ['darwin-log', 'gmodules', 'watchpoint', 'libstdcxx', 'dwo', 'llgs', 'fork']

--
Command Output (stderr):
--
Change dir to: /Users/buildslave/jenkins/workspace/lldb-cmake-matrix/llvm-project/lldb/test/API/tools/lldb-server
FAIL: LLDB (/Users/buildslave/jenkins/workspace/lldb-cmake-matrix/clang_502_build/bin/clang-x86_64) :: test_attach_commandline_qProcessInfo_reports_correct_pid_debugserver (TestGdbRemoteProcessInfo.TestGdbRemoteProcessInfo)
UNSUPPORTED: LLDB (/Users/buildslave/jenkins/workspace/lldb-cmake-matrix/clang_502_build/bin/clang-x86_64) :: test_attach_commandline_qProcessInfo_reports_correct_pid_llgs (TestGdbRemoteProcessInfo.TestGdbRemoteProcessInfo) (test case does not fall in any category of interest for this run) 
FAIL: LLDB (/Users/buildslave/jenkins/workspace/lldb-cmake-matrix/clang_502_build/bin/clang-x86_64) :: test_qProcessInfo_contains_cputype_cpusubtype_debugserver (TestGdbRemoteProcessInfo.TestGdbRemoteProcessInfo)
UNSUPPORTED: LLDB (/Users/buildslave/jenkins/workspace/lldb-cmake-matrix/clang_502_build/bin/clang-x86_64) :: test_qProcessInfo_contains_triple_ppid_llgs (TestGdbRemoteProcessInfo.TestGdbRemoteProcessInfo) (test case does not fall in any category of interest for this run) 
UNSUPPORTED: LLDB (/Users/buildslave/jenkins/workspace/lldb-cmake-matrix/clang_502_build/bin/clang-x86_64) :: test_qProcessInfo_does_not_contain_cputype_cpusubtype_llgs (TestGdbRemoteProcessInfo.TestGdbRemoteProcessInfo) (test case does not fall in any category of interest for this run) 
FAIL: LLDB (/Users/buildslave/jenkins/workspace/lldb-cmake-matrix/clang_502_build/bin/clang-x86_64) :: test_qProcessInfo_does_not_contain_triple_debugserver (TestGdbRemoteProcessInfo.TestGdbRemoteProcessInfo)
FAIL: LLDB (/Users/buildslave/jenkins/workspace/lldb-cmake-matrix/clang_502_build/bin/clang-x86_64) :: test_qProcessInfo_reports_valid_endian_debugserver (TestGdbRemoteProcessInfo.TestGdbRemoteProcessInfo)
UNSUPPORTED: LLDB (/Users/buildslave/jenkins/workspace/lldb-cmake-matrix/clang_502_build/bin/clang-x86_64) :: test_qProcessInfo_reports_valid_endian_llgs (TestGdbRemoteProcessInfo.TestGdbRemoteProcessInfo) (test case does not fall in any category of interest for this run) 
FAIL: LLDB (/Users/buildslave/jenkins/workspace/lldb-cmake-matrix/clang_502_build/bin/clang-x86_64) :: test_qProcessInfo_returns_running_process_debugserver (TestGdbRemoteProcessInfo.TestGdbRemoteProcessInfo)
UNSUPPORTED: LLDB (/Users/buildslave/jenkins/workspace/lldb-cmake-matrix/clang_502_build/bin/clang-x86_64) :: test_qProcessInfo_returns_running_process_llgs (TestGdbRemoteProcessInfo.TestGdbRemoteProcessInfo) (test case does not fall in any category of interest for this run) 
Restore dir to: /Users/buildslave/jenkins/workspace/lldb-cmake-matrix/lldb-build/tools/lldb/test
======================================================================
ERROR: test_attach_commandline_qProcessInfo_reports_correct_pid_debugserver (TestGdbRemoteProcessInfo.TestGdbRemoteProcessInfo)
----------------------------------------------------------------------
Error when building test subject.

Build Command:
make VPATH=/Users/buildslave/jenkins/workspace/lldb-cmake-matrix/llvm-project/lldb/test/API/tools/lldb-server -C /Users/buildslave/jenkins/workspace/lldb-cmake-matrix/lldb-build/lldb-test-build.noindex/tools/lldb-server/TestGdbRemoteProcessInfo.test_attach_commandline_qProcessInfo_reports_correct_pid_debugserver -I /Users/buildslave/jenkins/workspace/lldb-cmake-matrix/llvm-project/lldb/test/API/tools/lldb-server -I /Users/buildslave/jenkins/workspace/lldb-cmake-matrix/llvm-project/lldb/packages/Python/lldbsuite/test/make -f /Users/buildslave/jenkins/workspace/lldb-cmake-matrix/llvm-project/lldb/test/API/tools/lldb-server/Makefile all  ARCH=x86_64 CC="/Users/buildslave/jenkins/workspace/lldb-cmake-matrix/clang_502_build/bin/clang" DSYMUTIL="/Users/buildslave/jenkins/workspace/lldb-cmake-matrix/lldb-build/./bin/dsymutil"  CLANG_MODULE_CACHE_DIR=/Users/buildslave/jenkins/workspace/lldb-cmake-matrix/lldb-build/lldb-test-build.noindex/module-cache-clang/lldb-api 

Build Command Output:
/Users/buildslave/jenkins/workspace/lldb-cmake-matrix/clang_502_build/bin/clang  -std=c++11 -g -O0 -fno-builtin -isysroot "/Applications/Xcode.app/Contents/Developer/Platforms/MacOSX.platform/Developer/SDKs/MacOSX10.15.sdk" -arch x86_64  -I/Users/buildslave/jenkins/workspace/lldb-cmake-matrix/llvm-project/lldb/packages/Python/lldbsuite/test/make/../../../../../include -I/Users/buildslave/jenkins/workspace/lldb-cmake-matrix/llvm-project/lldb/test/API/tools/lldb-server -I/Users/buildslave/jenkins/workspace/lldb-cmake-matrix/llvm-project/lldb/packages/Python/lldbsuite/test/make -include /Users/buildslave/jenkins/workspace/lldb-cmake-matrix/llvm-project/lldb/packages/Python/lldbsuite/test/make/test_common.h  -fno-limit-debug-info  -D__STDC_LIMIT_MACROS -D__STDC_FORMAT_MACROS   --driver-mode=g++ -MT main.o -MD -MP -MF main.d -c -o main.o /Users/buildslave/jenkins/workspace/lldb-cmake-matrix/llvm-project/lldb/test/API/tools/lldb-server/main.cpp
/Users/buildslave/jenkins/workspace/lldb-cmake-matrix/llvm-project/lldb/test/API/tools/lldb-server/main.cpp:192:10: error: implicit instantiation of undefined template 'std::__1::basic_string<char, std::__1::char_traits<char>, std::__1::allocator<char> >'
  if (str.find(front) != 0)
         ^
/Users/buildslave/jenkins/workspace/lldb-cmake-matrix/clang_502_build/include/c++/v1/iosfwd:193:32: note: template is declared here
    class _LIBCPP_TEMPLATE_VIS basic_string;
                               ^
/Users/buildslave/jenkins/workspace/lldb-cmake-matrix/llvm-project/lldb/test/API/tools/lldb-server/main.cpp:195:12: error: implicit instantiation of undefined template 'std::__1::basic_string<char, std::__1::char_traits<char>, std::__1::allocator<char> >'
  str = str.substr(front.size());
           ^
/Users/buildslave/jenkins/workspace/lldb-cmake-matrix/clang_502_build/include/c++/v1/iosfwd:193:32: note: template is declared here
    class _LIBCPP_TEMPLATE_VIS basic_string;
                               ^
/Users/buildslave/jenkins/workspace/lldb-cmake-matrix/llvm-project/lldb/test/API/tools/lldb-server/main.cpp:235:17: error: implicit instantiation of undefined template 'std::__1::basic_string<char, std::__1::char_traits<char>, std::__1::allocator<char> >'
    std::string arg = argv[i];
                ^
/Users/buildslave/jenkins/workspace/lldb-cmake-matrix/clang_502_build/include/c++/v1/iosfwd:193:32: note: template is declared here
    class _LIBCPP_TEMPLATE_VIS basic_string;
                               ^
3 errors generated.
make: *** [main.o] Error 1

Test Directory:
/Users/buildslave/jenkins/workspace/lldb-cmake-matrix/llvm-project/lldb/test/API/tools/lldb-server
======================================================================
ERROR: test_qProcessInfo_contains_cputype_cpusubtype_debugserver (TestGdbRemoteProcessInfo.TestGdbRemoteProcessInfo)
----------------------------------------------------------------------
Error when building test subject.

Build Command:
make VPATH=/Users/buildslave/jenkins/workspace/lldb-cmake-matrix/llvm-project/lldb/test/API/tools/lldb-server -C /Users/buildslave/jenkins/workspace/lldb-cmake-matrix/lldb-build/lldb-test-build.noindex/tools/lldb-server/TestGdbRemoteProcessInfo.test_qProcessInfo_contains_cputype_cpusubtype_debugserver -I /Users/buildslave/jenkins/workspace/lldb-cmake-matrix/llvm-project/lldb/test/API/tools/lldb-server -I /Users/buildslave/jenkins/workspace/lldb-cmake-matrix/llvm-project/lldb/packages/Python/lldbsuite/test/make -f /Users/buildslave/jenkins/workspace/lldb-cmake-matrix/llvm-project/lldb/test/API/tools/lldb-server/Makefile all  ARCH=x86_64 CC="/Users/buildslave/jenkins/workspace/lldb-cmake-matrix/clang_502_build/bin/clang" DSYMUTIL="/Users/buildslave/jenkins/workspace/lldb-cmake-matrix/lldb-build/./bin/dsymutil"  CLANG_MODULE_CACHE_DIR=/Users/buildslave/jenkins/workspace/lldb-cmake-matrix/lldb-build/lldb-test-build.noindex/module-cache-clang/lldb-api 

Build Command Output:
/Users/buildslave/jenkins/workspace/lldb-cmake-matrix/clang_502_build/bin/clang  -std=c++11 -g -O0 -fno-builtin -isysroot "/Applications/Xcode.app/Contents/Developer/Platforms/MacOSX.platform/Developer/SDKs/MacOSX10.15.sdk" -arch x86_64  -I/Users/buildslave/jenkins/workspace/lldb-cmake-matrix/llvm-project/lldb/packages/Python/lldbsuite/test/make/../../../../../include -I/Users/buildslave/jenkins/workspace/lldb-cmake-matrix/llvm-project/lldb/test/API/tools/lldb-server -I/Users/buildslave/jenkins/workspace/lldb-cmake-matrix/llvm-project/lldb/packages/Python/lldbsuite/test/make -include /Users/buildslave/jenkins/workspace/lldb-cmake-matrix/llvm-project/lldb/packages/Python/lldbsuite/test/make/test_common.h  -fno-limit-debug-info  -D__STDC_LIMIT_MACROS -D__STDC_FORMAT_MACROS   --driver-mode=g++ -MT main.o -MD -MP -MF main.d -c -o main.o /Users/buildslave/jenkins/workspace/lldb-cmake-matrix/llvm-project/lldb/test/API/tools/lldb-server/main.cpp
/Users/buildslave/jenkins/workspace/lldb-cmake-matrix/llvm-project/lldb/test/API/tools/lldb-server/main.cpp:192:10: error: implicit instantiation of undefined template 'std::__1::basic_string<char, std::__1::char_traits<char>, std::__1::allocator<char> >'
  if (str.find(front) != 0)
         ^
/Users/buildslave/jenkins/workspace/lldb-cmake-matrix/clang_502_build/include/c++/v1/iosfwd:193:32: note: template is declared here
    class _LIBCPP_TEMPLATE_VIS basic_string;
                               ^
/Users/buildslave/jenkins/workspace/lldb-cmake-matrix/llvm-project/lldb/test/API/tools/lldb-server/main.cpp:195:12: error: implicit instantiation of undefined template 'std::__1::basic_string<char, std::__1::char_traits<char>, std::__1::allocator<char> >'
  str = str.substr(front.size());
           ^
/Users/buildslave/jenkins/workspace/lldb-cmake-matrix/clang_502_build/include/c++/v1/iosfwd:193:32: note: template is declared here
    class _LIBCPP_TEMPLATE_VIS basic_string;
                               ^
/Users/buildslave/jenkins/workspace/lldb-cmake-matrix/llvm-project/lldb/test/API/tools/lldb-server/main.cpp:235:17: error: implicit instantiation of undefined template 'std::__1::basic_string<char, std::__1::char_traits<char>, std::__1::allocator<char> >'
    std::string arg = argv[i];
                ^
/Users/buildslave/jenkins/workspace/lldb-cmake-matrix/clang_502_build/include/c++/v1/iosfwd:193:32: note: template is declared here
    class _LIBCPP_TEMPLATE_VIS basic_string;
                               ^
3 errors generated.
make: *** [main.o] Error 1

Test Directory:
/Users/buildslave/jenkins/workspace/lldb-cmake-matrix/llvm-project/lldb/test/API/tools/lldb-server
======================================================================
ERROR: test_qProcessInfo_does_not_contain_triple_debugserver (TestGdbRemoteProcessInfo.TestGdbRemoteProcessInfo)
----------------------------------------------------------------------
Error when building test subject.

Build Command:
make VPATH=/Users/buildslave/jenkins/workspace/lldb-cmake-matrix/llvm-project/lldb/test/API/tools/lldb-server -C /Users/buildslave/jenkins/workspace/lldb-cmake-matrix/lldb-build/lldb-test-build.noindex/tools/lldb-server/TestGdbRemoteProcessInfo.test_qProcessInfo_does_not_contain_triple_debugserver -I /Users/buildslave/jenkins/workspace/lldb-cmake-matrix/llvm-project/lldb/test/API/tools/lldb-server -I /Users/buildslave/jenkins/workspace/lldb-cmake-matrix/llvm-project/lldb/packages/Python/lldbsuite/test/make -f /Users/buildslave/jenkins/workspace/lldb-cmake-matrix/llvm-project/lldb/test/API/tools/lldb-server/Makefile all  ARCH=x86_64 CC="/Users/buildslave/jenkins/workspace/lldb-cmake-matrix/clang_502_build/bin/clang" DSYMUTIL="/Users/buildslave/jenkins/workspace/lldb-cmake-matrix/lldb-build/./bin/dsymutil"  CLANG_MODULE_CACHE_DIR=/Users/buildslave/jenkins/workspace/lldb-cmake-matrix/lldb-build/lldb-test-build.noindex/module-cache-clang/lldb-api 

Build Command Output:
/Users/buildslave/jenkins/workspace/lldb-cmake-matrix/clang_502_build/bin/clang  -std=c++11 -g -O0 -fno-builtin -isysroot "/Applications/Xcode.app/Contents/Developer/Platforms/MacOSX.platform/Developer/SDKs/MacOSX10.15.sdk" -arch x86_64  -I/Users/buildslave/jenkins/workspace/lldb-cmake-matrix/llvm-project/lldb/packages/Python/lldbsuite/test/make/../../../../../include -I/Users/buildslave/jenkins/workspace/lldb-cmake-matrix/llvm-project/lldb/test/API/tools/lldb-server -I/Users/buildslave/jenkins/workspace/lldb-cmake-matrix/llvm-project/lldb/packages/Python/lldbsuite/test/make -include /Users/buildslave/jenkins/workspace/lldb-cmake-matrix/llvm-project/lldb/packages/Python/lldbsuite/test/make/test_common.h  -fno-limit-debug-info  -D__STDC_LIMIT_MACROS -D__STDC_FORMAT_MACROS   --driver-mode=g++ -MT main.o -MD -MP -MF main.d -c -o main.o /Users/buildslave/jenkins/workspace/lldb-cmake-matrix/llvm-project/lldb/test/API/tools/lldb-server/main.cpp
/Users/buildslave/jenkins/workspace/lldb-cmake-matrix/llvm-project/lldb/test/API/tools/lldb-server/main.cpp:192:10: error: implicit instantiation of undefined template 'std::__1::basic_string<char, std::__1::char_traits<char>, std::__1::allocator<char> >'
  if (str.find(front) != 0)
         ^
/Users/buildslave/jenkins/workspace/lldb-cmake-matrix/clang_502_build/include/c++/v1/iosfwd:193:32: note: template is declared here
    class _LIBCPP_TEMPLATE_VIS basic_string;
                               ^
/Users/buildslave/jenkins/workspace/lldb-cmake-matrix/llvm-project/lldb/test/API/tools/lldb-server/main.cpp:195:12: error: implicit instantiation of undefined template 'std::__1::basic_string<char, std::__1::char_traits<char>, std::__1::allocator<char> >'
  str = str.substr(front.size());
           ^
/Users/buildslave/jenkins/workspace/lldb-cmake-matrix/clang_502_build/include/c++/v1/iosfwd:193:32: note: template is declared here
    class _LIBCPP_TEMPLATE_VIS basic_string;
                               ^
/Users/buildslave/jenkins/workspace/lldb-cmake-matrix/llvm-project/lldb/test/API/tools/lldb-server/main.cpp:235:17: error: implicit instantiation of undefined template 'std::__1::basic_string<char, std::__1::char_traits<char>, std::__1::allocator<char> >'
    std::string arg = argv[i];
                ^
/Users/buildslave/jenkins/workspace/lldb-cmake-matrix/clang_502_build/include/c++/v1/iosfwd:193:32: note: template is declared here
    class _LIBCPP_TEMPLATE_VIS basic_string;
                               ^
3 errors generated.
make: *** [main.o] Error 1

Test Directory:
/Users/buildslave/jenkins/workspace/lldb-cmake-matrix/llvm-project/lldb/test/API/tools/lldb-server
======================================================================
ERROR: test_qProcessInfo_reports_valid_endian_debugserver (TestGdbRemoteProcessInfo.TestGdbRemoteProcessInfo)
----------------------------------------------------------------------
Error when building test subject.

Build Command:
make VPATH=/Users/buildslave/jenkins/workspace/lldb-cmake-matrix/llvm-project/lldb/test/API/tools/lldb-server -C /Users/buildslave/jenkins/workspace/lldb-cmake-matrix/lldb-build/lldb-test-build.noindex/tools/lldb-server/TestGdbRemoteProcessInfo.test_qProcessInfo_reports_valid_endian_debugserver -I /Users/buildslave/jenkins/workspace/lldb-cmake-matrix/llvm-project/lldb/test/API/tools/lldb-server -I /Users/buildslave/jenkins/workspace/lldb-cmake-matrix/llvm-project/lldb/packages/Python/lldbsuite/test/make -f /Users/buildslave/jenkins/workspace/lldb-cmake-matrix/llvm-project/lldb/test/API/tools/lldb-server/Makefile all  ARCH=x86_64 CC="/Users/buildslave/jenkins/workspace/lldb-cmake-matrix/clang_502_build/bin/clang" DSYMUTIL="/Users/buildslave/jenkins/workspace/lldb-cmake-matrix/lldb-build/./bin/dsymutil"  CLANG_MODULE_CACHE_DIR=/Users/buildslave/jenkins/workspace/lldb-cmake-matrix/lldb-build/lldb-test-build.noindex/module-cache-clang/lldb-api 

Build Command Output:
/Users/buildslave/jenkins/workspace/lldb-cmake-matrix/clang_502_build/bin/clang  -std=c++11 -g -O0 -fno-builtin -isysroot "/Applications/Xcode.app/Contents/Developer/Platforms/MacOSX.platform/Developer/SDKs/MacOSX10.15.sdk" -arch x86_64  -I/Users/buildslave/jenkins/workspace/lldb-cmake-matrix/llvm-project/lldb/packages/Python/lldbsuite/test/make/../../../../../include -I/Users/buildslave/jenkins/workspace/lldb-cmake-matrix/llvm-project/lldb/test/API/tools/lldb-server -I/Users/buildslave/jenkins/workspace/lldb-cmake-matrix/llvm-project/lldb/packages/Python/lldbsuite/test/make -include /Users/buildslave/jenkins/workspace/lldb-cmake-matrix/llvm-project/lldb/packages/Python/lldbsuite/test/make/test_common.h  -fno-limit-debug-info  -D__STDC_LIMIT_MACROS -D__STDC_FORMAT_MACROS   --driver-mode=g++ -MT main.o -MD -MP -MF main.d -c -o main.o /Users/buildslave/jenkins/workspace/lldb-cmake-matrix/llvm-project/lldb/test/API/tools/lldb-server/main.cpp
/Users/buildslave/jenkins/workspace/lldb-cmake-matrix/llvm-project/lldb/test/API/tools/lldb-server/main.cpp:192:10: error: implicit instantiation of undefined template 'std::__1::basic_string<char, std::__1::char_traits<char>, std::__1::allocator<char> >'
  if (str.find(front) != 0)
         ^
/Users/buildslave/jenkins/workspace/lldb-cmake-matrix/clang_502_build/include/c++/v1/iosfwd:193:32: note: template is declared here
    class _LIBCPP_TEMPLATE_VIS basic_string;
                               ^
/Users/buildslave/jenkins/workspace/lldb-cmake-matrix/llvm-project/lldb/test/API/tools/lldb-server/main.cpp:195:12: error: implicit instantiation of undefined template 'std::__1::basic_string<char, std::__1::char_traits<char>, std::__1::allocator<char> >'
  str = str.substr(front.size());
           ^
/Users/buildslave/jenkins/workspace/lldb-cmake-matrix/clang_502_build/include/c++/v1/iosfwd:193:32: note: template is declared here
    class _LIBCPP_TEMPLATE_VIS basic_string;
                               ^
/Users/buildslave/jenkins/workspace/lldb-cmake-matrix/llvm-project/lldb/test/API/tools/lldb-server/main.cpp:235:17: error: implicit instantiation of undefined template 'std::__1::basic_string<char, std::__1::char_traits<char>, std::__1::allocator<char> >'
    std::string arg = argv[i];
                ^
/Users/buildslave/jenkins/workspace/lldb-cmake-matrix/clang_502_build/include/c++/v1/iosfwd:193:32: note: template is declared here
    class _LIBCPP_TEMPLATE_VIS basic_string;
                               ^
3 errors generated.
make: *** [main.o] Error 1

Test Directory:
/Users/buildslave/jenkins/workspace/lldb-cmake-matrix/llvm-project/lldb/test/API/tools/lldb-server
======================================================================
ERROR: test_qProcessInfo_returns_running_process_debugserver (TestGdbRemoteProcessInfo.TestGdbRemoteProcessInfo)
----------------------------------------------------------------------
Error when building test subject.

Build Command:
make VPATH=/Users/buildslave/jenkins/workspace/lldb-cmake-matrix/llvm-project/lldb/test/API/tools/lldb-server -C /Users/buildslave/jenkins/workspace/lldb-cmake-matrix/lldb-build/lldb-test-build.noindex/tools/lldb-server/TestGdbRemoteProcessInfo.test_qProcessInfo_returns_running_process_debugserver -I /Users/buildslave/jenkins/workspace/lldb-cmake-matrix/llvm-project/lldb/test/API/tools/lldb-server -I /Users/buildslave/jenkins/workspace/lldb-cmake-matrix/llvm-project/lldb/packages/Python/lldbsuite/test/make -f /Users/buildslave/jenkins/workspace/lldb-cmake-matrix/llvm-project/lldb/test/API/tools/lldb-server/Makefile all  ARCH=x86_64 CC="/Users/buildslave/jenkins/workspace/lldb-cmake-matrix/clang_502_build/bin/clang" DSYMUTIL="/Users/buildslave/jenkins/workspace/lldb-cmake-matrix/lldb-build/./bin/dsymutil"  CLANG_MODULE_CACHE_DIR=/Users/buildslave/jenkins/workspace/lldb-cmake-matrix/lldb-build/lldb-test-build.noindex/module-cache-clang/lldb-api 

Build Command Output:
/Users/buildslave/jenkins/workspace/lldb-cmake-matrix/clang_502_build/bin/clang  -std=c++11 -g -O0 -fno-builtin -isysroot "/Applications/Xcode.app/Contents/Developer/Platforms/MacOSX.platform/Developer/SDKs/MacOSX10.15.sdk" -arch x86_64  -I/Users/buildslave/jenkins/workspace/lldb-cmake-matrix/llvm-project/lldb/packages/Python/lldbsuite/test/make/../../../../../include -I/Users/buildslave/jenkins/workspace/lldb-cmake-matrix/llvm-project/lldb/test/API/tools/lldb-server -I/Users/buildslave/jenkins/workspace/lldb-cmake-matrix/llvm-project/lldb/packages/Python/lldbsuite/test/make -include /Users/buildslave/jenkins/workspace/lldb-cmake-matrix/llvm-project/lldb/packages/Python/lldbsuite/test/make/test_common.h  -fno-limit-debug-info  -D__STDC_LIMIT_MACROS -D__STDC_FORMAT_MACROS   --driver-mode=g++ -MT main.o -MD -MP -MF main.d -c -o main.o /Users/buildslave/jenkins/workspace/lldb-cmake-matrix/llvm-project/lldb/test/API/tools/lldb-server/main.cpp
/Users/buildslave/jenkins/workspace/lldb-cmake-matrix/llvm-project/lldb/test/API/tools/lldb-server/main.cpp:192:10: error: implicit instantiation of undefined template 'std::__1::basic_string<char, std::__1::char_traits<char>, std::__1::allocator<char> >'
  if (str.find(front) != 0)
         ^
/Users/buildslave/jenkins/workspace/lldb-cmake-matrix/clang_502_build/include/c++/v1/iosfwd:193:32: note: template is declared here
    class _LIBCPP_TEMPLATE_VIS basic_string;
                               ^
/Users/buildslave/jenkins/workspace/lldb-cmake-matrix/llvm-project/lldb/test/API/tools/lldb-server/main.cpp:195:12: error: implicit instantiation of undefined template 'std::__1::basic_string<char, std::__1::char_traits<char>, std::__1::allocator<char> >'
  str = str.substr(front.size());
           ^
/Users/buildslave/jenkins/workspace/lldb-cmake-matrix/clang_502_build/include/c++/v1/iosfwd:193:32: note: template is declared here
    class _LIBCPP_TEMPLATE_VIS basic_string;
                               ^
/Users/buildslave/jenkins/workspace/lldb-cmake-matrix/llvm-project/lldb/test/API/tools/lldb-server/main.cpp:235:17: error: implicit instantiation of undefined template 'std::__1::basic_string<char, std::__1::char_traits<char>, std::__1::allocator<char> >'
    std::string arg = argv[i];
                ^
/Users/buildslave/jenkins/workspace/lldb-cmake-matrix/clang_502_build/include/c++/v1/iosfwd:193:32: note: template is declared here
    class _LIBCPP_TEMPLATE_VIS basic_string;
                               ^
3 errors generated.
make: *** [main.o] Error 1

Test Directory:
/Users/buildslave/jenkins/workspace/lldb-cmake-matrix/llvm-project/lldb/test/API/tools/lldb-server
----------------------------------------------------------------------
Ran 10 tests in 4.506s

RESULT: FAILED (0 passes, 0 failures, 5 errors, 5 skipped, 0 expected failures, 0 unexpected successes)

--